##TITLE=1H_Pr Am-3-d
 CDCl3, 8 sc, 
 29.10.2020
##JCAMPDX= 6.0         $$ Bruker NMR JCAMP-DX V2.0
##DATA TYPE= NMR FID
##DATA CLASS= NTUPLES
##ORIGIN= UXNMR, Bruker Analytische Messtechnik GmbH
##OWNER= root
$$ XWIN-NMR		Version 3.5
$$ Thu Oct 29 12:51:27 2020 Russian Standard Time (UT+4h)  she@DPX200
##.OBSERVE FREQUENCY= 200.1315066352
##.OBSERVE NUCLEUS= ^1H
##.DELAY= (6, 6)
##.ACQUISITION MODE= SIMULTANEOUS
##.ACQUISITION SCHEME= undefined
##.AVERAGES= 8
##.DIGITISER RES= 18
##SPECTROMETER/DATA SYSTEM= spect
##.PULSE SEQUENCE= zg30
##.SOLVENT NAME= CDCl3
##.SHIFT REFERENCE= (INTERNAL, CDCl3, 0, 15.7039)
##AUDIT TRAIL= $$ (NUMBER, WHEN, WHO, WHERE, WHAT)
$$ ##TITLE= Audit trail, XWIN-NMR		Version 3.5
$$ ##JCAMPDX= 5.01
$$ ##ORIGIN= Bruker BioSpin GmbH
$$ ##OWNER= she
$$ F:/spectra/data/she/nmr/H-F/1/audita.txt
$$ ##AUDIT TRAIL=  $$ (NUMBER, WHEN, WHO, WHERE, WHAT)
(   1,<2020-10-29 12:50:20.59 +0400>,<she>,<DPX200>,
      <created by zg, POWCHK disabled, PULCHK disabled
       configuration hash MD5:
       00 E9 B6 7A A2 85 ED C7 34 08 36 98 17 FE 4E 26
       data hash MD5: 16K
       75 DD C9 CD 51 AF DF AC 6A D2 DF 23 04 58 6B 4A>)
$$ ##END=
$$ 
$$ hash MD5
$$ 38 C1 B9 28 19 49 1C 3D E7 C4 88 B1 E9 90 D5 04
##$RELAX= 
##$RELAX= 
##$RELAX= 
##$RELAX= 
##$RELAX= 
##$RELAX= 
$$ Bruker specific parameters
$$ --------------------------
##$DU= <F:/spectra>
##$EXPNO= 1
##$NAME= <H-F>
##$PROCNO= 1
##$TYPE= <nmr>
##$USER= <she>
##$AMP= (0..31)
100 100 100 100 100 100 100 100 100 100 100 100 100 100 100 100 100 100 
100 100 100 100 100 100 100 100 100 100 100 100 100 100 
##$AQSEQ= 0
##$AQ_mod= 1
##$AUNM= <au_zg>
##$AUTOPOS= <>
##$BF1= 200.13
##$BF2= 200.13
##$BF3= 200.13
##$BF4= 200.13
##$BF5= 200.13
##$BF6= 200.13
##$BF7= 200.13
##$BF8= 200.13
##$BYTORDA= 1
##$CFDGTYP= 0
##$CFRGTYP= 5
##$CHEMSTR= <none>
##$CNST= (0..31)
1 1 145 1 1 1 1 1 1 1 1 1 1 1 1 1 1 1 1 1 1 1 1 1 1 1 1 1 1 1 1 1 
##$CPDPRG= <>
##$CPDPRG1= <>
##$CPDPRG2= <>
##$CPDPRG3= <>
##$CPDPRG4= <mlev>
##$CPDPRG5= <mlev>
##$CPDPRG6= <mlev>
##$CPDPRG7= <mlev>
##$CPDPRG8= <mlev>
##$CPDPRGB= <>
##$CPDPRGT= <>
##$D= (0..31)
0 1.2 0 0 0 0 0 0 0 0.06 0 0.03 0 0 0 0 0.0002 0 0 0 0 0 0 0 0 0 0 0 0 
0 0 0 
##$DATE= 1603961419
##$DBL= (0..7)
120 120 120 120 120 120 120 120 
##$DBP= (0..7)
150 150 150 150 150 150 150 150 
##$DBP07= 0
##$DBPNAM0= <>
##$DBPNAM1= <>
##$DBPNAM2= <>
##$DBPNAM3= <>
##$DBPNAM4= <>
##$DBPNAM5= <>
##$DBPNAM6= <>
##$DBPNAM7= <>
##$DBPOAL= (0..7)
0.5 0.5 0.5 0.5 0.5 0.5 0.5 0.5 
##$DBPOFFS= (0..7)
0 0 0 0 0 0 0 0 
##$DE= 6
##$DECBNUC= <off>
##$DECIM= 32
##$DECNUC= <off>
##$DECSTAT= 4
##$DIGMOD= 1
##$DIGTYP= 9
##$DL= (0..7)
0 120 120 120 120 120 120 120 
##$DP= (0..7)
150 150 150 150 150 150 150 150 
##$DP07= 0
##$DPNAME0= <>
##$DPNAME1= <>
##$DPNAME2= <>
##$DPNAME3= <>
##$DPNAME4= <>
##$DPNAME5= <>
##$DPNAME6= <>
##$DPNAME7= <>
##$DPOAL= (0..7)
0.5 0.5 0.5 0.5 0.5 0.5 0.5 0.5 
##$DPOFFS= (0..7)
0 0 0 0 0 0 0 0 
##$DQDMODE= 0
##$DR= 18
##$DS= 0
##$DSLIST= <SSSSSSSSSSSSSSS>
$$ [...]
##$SUBNAM2= <"">
##$SUBNAM3= <"">
##$SUBNAM4= <"">
##$SUBNAM5= <"">
##$SUBNAM6= <"">
##$SUBNAM7= <"">
##$SUBNAM8= <"">
##$SUBNAM9= <"">
##$SW= 16.880792210976
##$SWIBOX= (0..15)
0 0 2 0 0 0 0 0 0 0 0 0 0 0 0 0 
##$SW_h= 3378.37837837838
##$TD= 16384
##$TD0= 1
##$TE= 0
##$TE2= 300
##$TE3= 300
##$TEG= 300
##$TL= (0..7)
0 120 120 120 120 120 120 120 
##$TP= (0..7)
150 150 150 150 150 150 150 150 
##$TP07= 0
##$TPNAME0= <>
##$TPNAME1= <>
##$TPNAME2= <>
##$TPNAME3= <>
##$TPNAME4= <>
##$TPNAME5= <>
##$TPNAME6= <>
##$TPNAME7= <>
##$TPOAL= (0..7)
0.5 0.5 0.5 0.5 0.5 0.5 0.5 0.5 
##$TPOFFS= (0..7)
0 0 0 0 0 0 0 0 
##$TUNHIN= 0
##$TUNHOUT= 0
##$TUNXOUT= 0
##$USERA1= <user>
##$USERA2= <user>
##$USERA3= <user>
##$USERA4= <user>
##$USERA5= <user>
##$V9= 5
##$VALIST= <valist>
##$VCLIST= <CCCCCCCCCCCCCCC>
##$VD= 0
##$VDLIST= <DDDDDDDDDDDDDDD>
##$VPLIST= <PPPPPPPPPPPPPPP>
##$VTLIST= <TTTTTTTTTTTTTTT>
##$WBST= 1024
##$WBSW= 4
##$XGAIN= (0..3)
0 0 0 0 
##$XL= 0
##$YL= 0
##$YMAX_a= 478934
##$YMIN_a= -532823
##$ZGOPTNS= <>
##$ZL1= 120
##$ZL2= 120
##$ZL3= 120
##$ZL4= 120
##$ABSF1= 10
##$ABSF2= 0
##$ABSG= 5
##$ABSL= 3
##$ALPHA= 0
##$AQORDER= 0
##$ASSFAC= 0
##$ASSFACI= 0
##$ASSFACX= 0
##$ASSWID= 0
##$AUNMP= <proc_1d>
##$AZFE= 0.1
##$AZFW= 0.1
##$BCFW= 1
##$BC_mod= 2
##$BYTORDP= 1
##$COROFFS= 0
##$CY= 11.3945322036743
##$DATMOD= 1
##$DC= 2
##$DFILT= <>
##$DTYPP= 0
##$F1P= 15.9154993809931
##$F2P= -4.1035820241983
##$FCOR= 0.5
##$FTSIZE= 0
##$FT_mod= 4
##$GAMMA= 1
##$GB= 0.15
##$INTBC= 1
##$INTSCL= 1
##$ISEN= 128
##$LB= 0.24
##$LEV0= 0
##$LPBIN= 0
##$MAXI= 10000
##$MC2= 0
##$MEAN= 0
##$ME_mod= 0
##$MI= 1.114404
##$NCOEF= 0
##$NC_proc= 0
##$NLEV= 6
##$NOISF1= 3.799351
##$NOISF2= 2.8
##$NSP= 1
##$NTH_PI= 0
##$NZP= 0
##$OFFSET= 15.70392
##$PC= 1
##$PHC0= -10690.71
##$PHC1= 13.80088
##$PH_mod= 1
##$PKNL= yes
##$PPARMOD= 0
##$PSCAL= 0
##$PSIGN= 0
##$REVERSE= no
##$SF= 200.130013532006
##$SI= 16384
##$SIGF1= 3
##$SIGF2= 2
##$SINO= 400
##$SIOLD= 16384
##$SREGLST= <1H.CDCl3>
##$SSB= 0
##$STSI= 0
##$STSR= 0
##$SW_p= 3612.71676300578
##$SYMM= 0
##$S_DEV= 0
##$TDeff= 0
##$TDoff= 0
##$TI= <>
##$TILT= no
##$TM1= 0
##$TM2= 0
##$TOPLEV= 0
##$USERP1= <user>
##$USERP2= <user>
##$USERP3= <user>
##$USERP4= <user>
##$USERP5= <user>
##$WDW= 1
##$XDIM= 8192
##$YMAX_p= 0
##$YMIN_p= 0
$$ End of Bruker specific parameters
$$ ---------------------------------
##NTUPLES= NMR FID
##VAR_NAME=  TIME,          FID/REAL,        FID/IMAG
##SYMBOL=    X,             R,               I
##VAR_TYPE=  INDEPENDENT,   DEPENDENT,       DEPENDENT
##VAR_FORM=  AFFN,          ASDF,            ASDF
##VAR_DIM=   8192,          8192,            8192
##UNITS=     SECONDS,       ARBITRARY UNITS, ARBITRARY UNITS
##FACTOR=    0.000296,      1,               1
##FIRST=     0,             0,               0
##LAST=      2.424536,      0,               0
##MIN=       0,             -532823,         0
##MAX=       2.424536,      478934,          0
$$ Real data points
##PAGE= N=1
##DATA TABLE= (X++(R..R)), XYDATA
$$ [...]
2097A008k414J522R63k792K672r84j069K761k666P31J598k691K479q42j302K837
2113A811k813J272Q40k702K739r06j432L316l051O86K258l647K956q96j504K996
2129A923k583O76J345k428K145p57j690L586l348P06K046l386K690m61k015L371
2145A820k531K12K503l771K410l15k184L603l020P80J934l373L006n98k590L735
2161A621k377k71K764m014K960J74k979L789k798M24K480l595K469m3k788M202
2177B018k895k21L024m037L171J15l360L746j913m13K729m125K625Q91l251L423
2193A527j865k09K954m294K531M80l003M084k530p27L067l586K045R95l958M294
2209A805k268n08L423m560K877N69l010L638k589j017M422m475J676J279l555
$$ y = [1008, -1406, 116, 1079, -1713, 959, -25, -1094, 1667, -999, -268, 1330, -1361, 1118, 276, -1026, 1811, -1002, 270, 1110, -1592, 1147, 241, -1191, 2125, -926, -240, 2018, -1629, 1327, 431, -1073, 1923, -660, 16, 1361, -1067, 1078, 321, -1369, 2217, -1131, -425, 1621, -1765, 925, 464, -1551, 1820, -711, -499, 2004, -1767, 643, 328, -1856, 1747, -1273, -493, 1441, -1932, 1074, 476, -2114, 1621, -756, -1027, 1737, -2277, 683, 857, -2122, 1667, -1131, -707, 1773, -1822, 647, 604, -2184, 2018, -877, -1098, 1926, -2111, 1060, 1175, -2185, 1561, -352, -765, 1964, -2161, 464, 1355, -1896, 1527, -338, -547, 2407, -1887, 644, 1124, -1879, 2205, -325, -1052, 2015, -1571, 474, 1469, -2489, 1805, -463, -971, 2452, -2108, 769, 1338, -1672, 1966, -623, -1640, 2782, -1693, -17, 1262, -2293]
2224b293M148k009j385L784l825J758J244l823L718j582j077L652m525K210J422
2239A417l654L716k088j328M295l783P91J978l774M015j439j904L746l562J834
2254B60J218l966M022j241j842M087m124J263K395m262L684j206k269M330l227
2269h78Q48J425l408L706q75k338L598l139J244J987m723L763l54k327M024l814
2285a261N53K633l589K777n63k407M118l145M72K034l922L581p63k643L883k662
2301i04J07L010m349K521K33k463L794l268K04L202m056K655k87k224L871k904
2317h58k30K715m148L140J87l182L895k376k1K988l831J992N58k325L402k585
2333f79m39K891l212K116M53k972L873k236q22L004l421K114O67k990L134j543
$$ y = [-2293, 1855, -154, -1539, 2245, -1580, 178, 1422, -2401, 1317, -265, -1342, 2310, -2215, -5, 1417, -2237, 1479, -609, -1937, 2358, -1425, -634, 1344, -2430, 1585, 146, -1758, 1988, -1574, 260, 1478, -2488, 1534, 293, -1549, 2538, -1586, -323, 2072, -2190, 1494, 288, -1981, 2349, -878, -30, 1395, -2013, 1693, 818, -1520, 2078, -1061, 183, 2170, -2553, 1210, 856, -1471, 2553, -1261, -708, 1925, -1664, 1113, 550, -1857, 2261, -884, -412, 1622, -2300, 1281, 518, -2125, 1758, -904, -797, 2213, -2136, 385, 618, -1845, 1949, -1319, -1115, 2087, -1969, 686, 399, -1825, 2046, -858, -1088, 1627, -2521, 619, 806, -2376, 1519, -857, -878, 2110, -1721, 271, 829, -1496, 1906, -679, -1118, 1773, -1439, 677, 1130, -1842, 2031, -205, -1027, 1977, -1444, 670, 1337, -1653, 1481, -62]
2349f2q14K890l312J818L99k627L582k114p06K934l390J903R25l303L245j322
2365D6q80K636k967J507O96k411K518j540n87K676k892J194J039k953L179j339
2381g8j277K790k400O26J472k763K256o43j381K706k566J303Q93k712K680q63
2397D3j139K629k281N08J465k709J979k45j468K415k188R14J096k005J981j146
2413a51o72K052j893M88J406k446J874n4j633K409j639O7J147j626J014P6r57
2430e38J670j463L81R97j920J762q35r78K207j756k1J407j668J346q4j016J219
2447G10j107J03J174j750J401o93o56J191q57K62O63j484J562m99j209J867j193
2464e15K19P80j343R95j43p69J212j083L01P45j286J125k0j046J436q11k8M74
$$ y = [-62, -876, 2014, -1298, 520, 919, -1708, 1874, -240, -946, 1988, -1402, 501, 1426, -1877, 1368, 46, -834, 1802, -1165, 342, 1038, -1373, 1145, -395, -982, 1694, -1198, -4, 1035, -1918, 1261, -78, -1355, 1435, -965, -339, 1133, -1630, 626, -17, -1398, 1308, -1258, 45, 938, -1774, 906, 43, -1096, 1533, -748, -240, 1225, -1484, 495, 250, -1218, 1197, -991, -77, 1019, -986, 995, -151, -823, 1229, -664, -176, 1230, -1216, 658, 604, -1029, 1380, -259, -192, 955, -671, 343, 419, -538, 1132, -331, 50, 1047, -873, 889, 54, -924, 1283, -473, -494, 913, -755, 591, 507, -509, 710, -397, -294, 880, -870, 531, -162, -818, 373, -484, -222, 441, -1043, 519, 20, -1189, 678, -515, -296, 484, -859, 136, -7, -776, 436, -647, -346, 399, -887, 238, 218, -828, 608, -203, -231, 243]
2482B43r22P27K88j014J200n31p7R59j420P50rn48J257j024J12Q28j200Q51j47
2501C23m72O30m58j06P67p35M58N8n00L31l97J50M16p57L40N8n91Q16n62R3O25
2522D87o01J96j64k58K92j01k12M51k94N0o2j5M12l89j53M06l28R1J01j16J10
2543i7J92n95K59J63P1p8K8J86l75L91k32L7k8J75L2p4J36m22J06L90m17J36R4
2566G8j98L91J11m48L70P6n53K90R8k68L18l78K34K30l34L94n52L87J50n23M75
2587C48m04k43Q93n62m08Q29p00L48R6m83P54n72l6L95q51P14L8o56Q28m72O0
2608h4O63j159O09O2p26R83o79l4O83q26O56k80n06J034p72J29P49j102J029k13
2628B16n88J083j011j96J083r63L09M32q50J048n28m90J235j398R45l7q02J419
$$ y = [243, -679, 48, 336, -678, 522, -9, -86, 873, -547, 203, 194, -354, 903, -121, -9, 819, -381, 470, 323, -149, 481, 23, -83, 684, -51, 407, 465, -35, 296, -101, 49, 465, -292, 48, 106, -485, 331, -231, -138, 487, -114, 82, -82, -340, -48, -149, -361, 90, -204, -154, -216, -231, 181, -208, -361, 45, -283, -192, -91, -207, -97, 95, -500, -241, -78, -7, -85, -57, 129, -246, 145, -87, -50, -78, 97, 129, 55, 191, -231, -125, 265, -152, -16, 78, -120, 271, 382, -66, 304, 380, -173, 117, 215, -53, 265, -113, 121, 351, 17, 411, -141, 246, 396, -127, 348, -56, -299, 594, 32, -376, 453, -247, 101, 197, -286, 468, -104, -140, 255, -596, 118, 156, -500, 328, -144, -84, 579, -580, 29, 91, -635, 348, -331, -365, 318, -508, 148, -132, -638, 396, -376, -247, 502, -600, 429, 216, -372, 711, -300, -496, 587, -376, -67, 365, -485, 563, 35, -455, 780, -618, 327, 290, -512, 907]
2646I07j225Q1J218j359O72K86j380J466o82j81Q92j154O26M71j337J463o35m38
2664c09J009j409Q00M03j496J739p85o44J487j214M80L25j278J315n91l22J093
2681F03j507R37O51j750J599n56o73J519j574O74N92j630J544l12j075J804j498
2698f52N68N78j565J729q76o57J836j683O12R69j992J684m00r22K037j859O16
2715B3Q59j581J621p26r29K051j826M02J174k066J869o68j013K038j905N36J122
2732I81k087J599l6j284K153j815N10J110k022J688m54j111J709j300m9J271k185
2749a322J878k6j597J921j512R9J398j898J300j69j193J930j347n1J553k150J619
2766D33j60j610K491j534j61J475k146J363O60j876J885j365K23J380k170J350
$$ y = [907, -318, -237, 981, -378, 294, 580, -800, 666, -16, -197, 695, -459, 167, 638, -699, 764, 129, -309, 700, -709, 91, 494, -1002, 737, -48, -692, 795, -419, 61, 386, -892, 423, -168, -490, 603, -904, 33, 684, -1066, 533, -23, -696, 823, -751, -77, 515, -1115, 429, 117, -958, 846, -652, -84, 494, -1071, 658, -218, -875, 961, -722, -110, 859, -1133, 551, 151, -771, 1266, -593, 23, 882, -699, 922, 196, -733, 1318, -508, -106, 1068, -998, 871, 203, -810, 1228, -677, -141, 981, -1106, 493, 457, -827, 1326, -489, 21, 1131, -891, 797, 343, -768, 941, -359, -408, 863, -1322, 556, 530, -1067, 854, -658, -559, 839, -1059, 241, 72, -1121, 809, -538, -589, 964, -1186, 433, 273, -1337, 1154, -380, -541, 934, -1212, 151, 811, -1065, 820, -545, -322, 1058, -1112, 238]
2782B38K08j589K317j323n27J689k058J557K48k014K239j022p19J929k007R20
2798H6O94j790K092j483l13K111k287J430K54j737K051r14j000J856j995J252
2814C07N62k088J990o58p82J778k255R74Q58j762J973j217o37J995j778O29O61
2831E50k145K332o98q63J738j504N98P47j960J842o34q81J713j505K54J020j819
2848a215J777n73q16J824j512N87N96j733J652o62q02J635j606R21P42j493J424
2865G46o44n39J421j306K79Q14j467J290m22q50J831j364K42Q28j763J918p32
2882B82j038J805j362K70J056j860J495k00j060J668j543K33R38j253R29m26m47
2899e13J291r84k03J172j658J310m86q49J811j305J5J087j221P80p1j033J561
$$ y = [238, 446, -1143, 1174, -149, -676, 1013, -1045, 512, 760, -1254, 985, -37, -756, 1173, -834, 86, 780, -1010, 1082, -401, -714, 1397, -890, 540, 794, -943, 1108, 194, -806, 1050, -945, 307, 869, -1219, 771, 113, -669, 1109, -1146, -172, 686, -1076, 897, -320, -957, 1038, -740, -111, 550, -1595, 737, 39, -824, 914, -590, 8, 755, -1205, 637, 3, -878, 835, -670, -416, 604, -1215, 562, -11, -827, 997, -515, 72, 668, -1065, 587, -75, -877, 758, -848, 73, 815, -678, 746, 102, -437, 984, -322, -43, 771, -696, 594, 172, -678, 1153, -211, 31, 859, -904, 1014, 282, -756, 1049, -313, -43, 1013, -847, 648, 448, -612, 1056, -487, -254, 684, -569, 360, -66, -513, 778, -206, -409, 763, -895, 415, -71, -920, 891, -414, -399, 688, -533, 247, 176, -857, 704]
2916G04j178k22J577j627J205j31j093J626j098j38R04j299J049J70j307J366
2932E08p27j58R93j239J083j45q69R86m76m7Q52j136P24o3j103J642j084r3J099
2951G47j312N84K46p04J094p78k2R50j127N17M09j251J582j140K0O59j211O82
2969e5M98r35J122p53l18J076j159O32L23r12P06l62m65J086j291O01O71j215
2987g50J222m31m14O58q61O34M99j211Q31j13k65N42p04K05L39o58Q10k88l31
3006b86Q08r85N17L97q81Q81k21m31O87l97k43P05q95M10J49l15L84n07M21K38
3026D36o18K95J4n72Q77m96N9K68o94O97J90o90N56n31O3K93k14L7J57l51L92
3047A68k26k69P94q07N22Km05O19p08P7K68q2K07k44q4K10k8k35K06k58J07J90
$$ y = [704, -474, -696, 881, -746, 459, 328, -765, 861, -237, -375, 529, -770, 279, 449, -858, 508, -219, -377, 616, -623, 460, 315, -554, 432, -44, -91, 761, -375, 349, 286, -817, 825, -259, -352, 747, -565, 19, 265, -439, 655, -123, -145, 805, -322, 195, 604, -647, 935, -205, -185, 474, -737, -55, 443, -492, 630, -123, -441, 635, -524, 108, 431, -481, 225, -137, -602, 484, -807, -206, 465, -750, 472, 41, -373, 285, -576, 58, 557, -654, 177, 64, -201, 341, -363, -158, 181, -477, 333, 45, -286, 522, -463, 54, 451, -430, 451, 230, -201, 486, 89, -154, 551, -344, 66, 215, -100, 284, -223, 198, 436, -182, 113, 127, -445, 432, -64, -5, 263, -431, 266, 456, -234, 322, -209, -146, 147, -67, -30, 127, -224, 168, -58, -327, 467, -340, 182, 184, -221, 398, -310, -233, 35, -47, 160, -84, -168, 42, 14, -221, -15, -273, -166, 24]
3069B4m31L11K85m07M81n86M44k47L45P4n22J18K63j77K5j22J19J24N6m28M27
3090A76k34L8P4k2n9J34j88J31O9j45L0J40j28K3o0L6M0Rq6K31p4K21l13j28L90
3115C05l64K10m2q6M4K99n22oJ60j78Q5M0nM6J9N1k32lL54m96L16K94p70M06L7
3140c8k53K17n59N34n2L5K12j25j68K10m62J93N52o29N33l47l49Q15m99K2K48
3161I0kK26l65j04M53j55J39K07q81M76j68m1N09m91J87L41n20K75J79m31M72
3182C96l84j12L78o26N80j72l49O04n58J41N72r09P68j51m58O68o37K15J69l56
3202b21L80j92j31N26n92k04P24n80N04l83m0M28m08j1M99p21L29K49o23P62n69
3223b74p6O92q98N62%j03K50m18o7M37m28N96%p73R14n90LO12o76M74j45o70Q83
$$ y = [24, -407, -96, 189, -218, 263, -323, 121, -126, 219, 293, -229, -111, 152, -25, 0, -122, -3, 121, 177, -251, 176, -58, -20, 54, 32, -27, 107, -81, 50, 119, -26, 4, 144, 16, 39, -21, 15, 55, 64, -22, 209, 135, 356, 43, -85, 305, -59, 151, 109, 23, 67, 366, -156, -162, -2, -180, -95, -55, -60, -14, 5, 56, -176, -179, 175, -321, -5, 289, -481, -75, -38, -291, -74, -633, -99, -151, -116, 96, -29, -197, 13, -449, -256, 296, -333, 200, -147, -496, 319, -180, -158, 90, 88, 314, -51, -155, 298, 143, 282, 489, -392, 84, -84, -125, 384, -107, 80, 421, -99, 176, 355, -76, 396, 12, -100, 278, -348, 232, 60, -289, 315, -243, -102, 470, -439, 329, 178, -280, 388, -249, -34, 135, -221, 159, -33, -164, 362, -230, -434, 290, -290, 214, -169, -209, 219, -189, -200, 299, -422, -93, 156, -467, 295, -274, -350, 342, -556, 6, 6, -97, 153, -265, -332, 105, -323, 273, 273, -500, 414, -176, -173, 439, -237, 237, 92, -578, 305]
3246C05j86k02N81p93K99J98o88P78j43l6M37p35n5M30n29O19m09j80P36q46O87
3267B68J49q55N03j79j97M86o49N32L16q60J002p82j91Q76q74L75J85o05P16k52
3287c6k92P31p55L82J63n17P80n37l99Q41o97M17K60q17P50j22n38P39o79J33
3307a93O60q94P37k89j58N72p81L02L73r34Q86l49n35J405j064L38M55q93P65
3326D03m28j86R48r65M05N29j380J217m63m43J013j040M45M54r40O62k19m77R64
3345D99p33K71O54j013O71l70k92P77q93M09J77q76P80J8n83P84o91J68N18n94
3365c19M01k57k34R66r09L74K93q12O75j26o07J088q04K33M76r22O61n8n40Q50
3385D29l81K38M4p61Q16k70l74J047r75OO49q23Q28m2j001R06n46K88K22o63N50
$$ y = [305, 119, -83, 498, -295, 4, 202, -486, 292, 149, 113, 550, -185, -240, 190, -339, 280, -129, -309, 427, -419, 268, 417, -438, 65, -114, -311, 175, -474, 58, 374, -486, 516, -266, -457, 419, -455, -80, 105, -500, 216, -36, -328, 403, -352, 30, 193, -324, 456, -81, -480, 361, -336, 81, 341, -476, 274, 152, -386, 353, -326, -193, 467, -427, 310, 21, -137, 435, -346, -44, 329, -605, 281, -68, -603, 802, -262, 76, 531, -362, 403, -25, -211, 737, -228, 177, 706, -674, 543, 80, -363, 650, -390, 55, 509, -431, 231, 12, -465, 499, -234, 37, 691, -322, 349, -21, -313, 464, -429, -20, 157, -719, 61, 79, -504, 280, -411, -243, 275, -319, 82, -175, -409, 557, -352, 22, 315, -497, 178, 52, -555, 533, -271, -38, 438, -484, 177, 119, -421, 429, 48, 286, 330, -431, 385, 115, -259, 788, -187, -181, 468, -355, 473, 431, -570, 336, -210, 78, 300, -363, 187]
3406A87J95o13N92m70n7P52j164Q29J35q74Q12l40k25P67p24L04J62p23N62k35
3426a28m0N11q11M26L28p13Q93p21RP95q28K54L35q30N94k26k10O17o92M33R0
3447H6m08M58l57j68P06o41M51Ml11L94q7m92P41n92J28J65m52O71l76l95P38
3468B63n40L38L80q26P05j88m13O83o08L50L30p58M96j83j19N66o14M4O6k14M16
3489A74r6k72L86m53K86J13m25P11l34k33L15j25k71L36l82O19l04k85N72p05
3509c73L17M48o49N22k61m64N81k11J20K65n06K56Jk10M74q62M60K53o72L00L80
3530A69j39K25k79j86N98p78M60J88m19M99n24j25O87l89J14j04j09L15k08j33
3550a38N29o08L53j25J4J60k5j24M84o50KK73k97L51l57M50l7j83k41J98LK18
$$ y = [187, 382, -231, 361, -109, -166, 586, -578, 251, 386, -488, 324, -16, -241, 526, -198, 106, 268, -455, 107, -128, -168, 343, -468, -42, 286, -427, 466, -255, -246, 549, -279, -25, 310, -520, 74, -152, -362, 255, -437, -4, 86, -322, 136, -221, -389, 317, -324, 127, 131, -180, 214, 127, -365, 376, -216, -88, 77, -375, 296, -80, -475, 263, -277, 61, 441, -385, 320, 132, -281, 402, -206, 144, 474, -284, 212, 29, -90, 476, -138, -94, -28, -242, 174, 78, -194, 192, -261, 25, 138, -287, 424, 90, -143, 172, 47, -224, 112, -270, 349, 45, -240, 332, -373, -56, 392, -257, 265, 4, -460, 121, -90, 30, 295, -211, 45, 46, -164, 310, -552, -92, 161, -511, -211, 169, 30, 255, -24, -210, 388, -390, 70, 258, -161, 338, -186, -311, 376, -13, 101, -3, -112, 203, -5, -138, 391, -217, 136, 11, 25, 185, 160, 36, 520, -130, -128, 145, -152, 199, -158, 292, 255, 72, -169, 29, 32, 250]
3572B50j99k79M11m35M28j65k8J71j77r8J42O1o7j98L11j20k68J89J66m74M39
3593F0l6j59J36j79J1J83j77J84j09q3J40J0n1J63n2K83j14k60j6L56k71j52J42
3616IO0J94m72J35J01J39J3j49nJ40j07r0J99j80M24k02k0j50l6L17l91K30L1
3639A90j21pn0kj88J38k59J53J4OL16k60O6n2P2k24L27l14j02J3K98j00k8j25
3663b39Mj66J43K77j00q7K4j00K94K8j47J53m09K54Jm0J1J90k38L05l17K35M7
3686A23j67J51rj48P0l4K16k08N3J62k72p7K3N9q8K69j47K81j22k98L81qJ3j34
3710H9o7q2l8N3M22m12J51o3j98L36o0l87L96m70K58K42l79L08k43%L43k93j48
3733b42L34j12P4k06m6J74L46l65J43k54P8Ol12P19j99k97J23j44K29K77o76O69
$$ y = [250, 51, -228, 183, -252, 176, 11, -17, 154, -23, -121, 21, 82, 15, -183, 128, 8, -260, -71, 95, -379, 60, 24, -135, 1, -178, -167, 16, -161, 23, -86, -169, -29, -19, -70, 93, 41, 324, 210, -50, -66, 290, 19, -133, 9, 69, 263, -209, -74, 27, 166, 179, 30, 25, 165, 58, -32, 167, -13, 411, 209, 189, 39, 3, 320, -71, 159, 190, 69, 62, 12, 10, -178, -40, -299, -146, -132, -126, 190, -70, -4, -56, 16, -208, 119, -195, -297, -284, 14, -86, -114, -239, -235, -401, -258, 19, -81, -168, -144, -244, 50, 78, -69, 84, -325, -71, -70, -110, -99, 91, -147, 158, -159, 76, 123, -44, 107, 98, -50, 20, -14, 202, -6, 47, 209, -63, -140, -117, -58, -146, 123, -24, 257, 135, -163, 218, 210, 223, 89, 22, -60, -98, -45, 377, -35, 116, 53, -145, 191, 131, -256, 140, -330, -72, 170, -209, 99, -144, -144, 199, -94, -242, 92, -20, 54, -152, -198, -24, 322, -43, 100, -154, -76, -70, -382, 337, 138, -159, -36, -180, 49, 326, -350, 319]
3755C19l42j39K69k52K45o3p5pR0j61O08o41K12J79n41O11k00j45N3j0Q4Q3l38
3778a61J52j17m6M51l18K21n6m15N55l08J5L27m85L80j61j06M73l15j68K95k12
3799AJ39j18j53J64J70l85L76l81n5J98l32M84l68J10J90k66J54J32k91N07k54
3820B2l05N14l60k70O73n87M92k27j49M28m39J36K24n71L42j85l3M87j11r1L60
3841C50o52M13J80m94O06m36k66N30m69L06j68K0K52j75P9K52m77N71j99l73O82
3862E32m55l37Q12q07N54k24l42N25j91j10L62o86N36K2l38L24l20J00Q9m88P03
3883B61l14k70M47j73nL04p88O34K6m98N18k27k13M89k37J36j26k97K87j2k52
3904c10M61n66K23K84n23O90o43K72M23n28K64J31n8j10j78L37J23m91K60J3l63
$$ y = [319, -23, -162, 107, -145, 100, 37, -38, -45, 45, -116, 492, -149, 63, 242, -299, 312, 112, -33, 20, 10, 94, 177, -161, -9, -126, -172, 279, -39, 182, 126, -289, 266, -42, -27, 300, -185, 195, 34, -72, 401, 86, -82, 213, 1, 140, 22, -131, 33, 203, -182, 194, -187, -242, -44, -376, 108, -260, -150, 40, -226, -72, 60, -231, 276, 22, -283, 231, -129, -399, 274, -313, 179, -48, -197, 231, -208, -72, 152, -419, -77, -262, -295, 192, 81, -10, 350, -302, 111, 291, -203, 403, -33, -299, 231, -238, 68, -100, -80, 172, -3, 76, 328, -149, 422, 223, -150, 532, 77, -260, 552, -255, 299, 75, -267, 258, 67, -43, 319, -367, 169, 191, -147, 177, -143, -43, 46, -442, 261, -53, -323, 124, -49, -54, 250, -538, 96, 122, -376, 142, -85, -298, 191, -46, 90, -36, -333, -46, -58, -310, 151, -415, -192, 92, -431, 259, -384, -112, 311, -217, 47, 178, 120, 10, -168, 169, 292, -199, 61, 74, -289]
3925b89N49m20K22M19l68p6M28m92L57k08j25M87n21J21l1k25M99l05k11N02m49
3946a36K23l8l14L97k00j29N77m58j98J62k38N65k29m2J49j70j21K1k38M79k93
3967b31K8N36m56L5K44m39L32Mk11M66m82j15M20l50M91j26k14L78l03J52j14
3988D5l17M10j38K5Q6l63M11j07j78L01j43J50J0m92K35N4PL74l87k39P99o03
4010f0J14K25m19J61Q3j54L65n23Q8J79l62N22k69m3M19m48J09K86l49J46j07
4031c7j17N07n08J03K78m86M65k3l58K52k96K81J67l47M63m05k5K99k56K6J18
4052A01j20J84k54j98L08l91L08k3j61J23K55l14J85j05J95N5k63M23j2m39J45
4073Bj32Q8L12m67L45k02M0L74o75L64J63k28J33M4k37L55l02j0K06k71J54J49
$$ y = [-289, 260, -160, 62, 481, 113, 37, 465, -27, 330, 122, -3, 484, -37, 84, 53, -172, 327, 22, -189, 313, -136, 87, 49, -265, 132, -68, -197, 380, -78, -276, -114, -352, 213, -16, -58, 91, -79, -200, -179, -417, 62, -231, -203, 333, -123, -88, 156, -283, 49, 53, -158, 308, -174, -289, 131, -219, 272, 146, -68, 310, 7, 159, 45, -272, 138, 0, 25, 111, -252, 159, 52, -126, 175, 32, 182, 192, -300, -65, -11, -4, 370, -17, -256, 543, -60, 54, 279, -140, 21, 104, -50, 315, -208, -120, 59, -303, 219, -50, -93, 326, -122, -13, 273, -76, 70, -37, -154, 353, -155, -52, 226, -260, 205, 182, -176, 76, -220, 61, 228, -119, 344, -61, -86, 213, -43, -17, 101, -19, 165, -89, -287, 21, -370, -62, -85, -246, -123, 132, -182, 3, -102, 93, 148, -115, 308, 296, -143, 2, -130, -42, 270, -197, 148, -54, -14, 360, -315, 49, 212, -16, 117, 161, -76, 279, -23, -33, 173, -98, 56, 205]
4095B05k15P4j6j09K21m04K07N1l2O5M0k12Q5J02j92P2j79L23p0j64K91k80J54
4118A7J03m33N15k38j50L63k34N6j79n1L59j76J88R9m12L32n2k47K27k94J99K35
4140B27m39L88j52j20K82P4k13J45k07K30k81K20o8p5n0J71K4j93K97k96J08k41
4162a69K82o5p6l1L1R4J55k73Q9jk65K39J38r8j59L7R8rq2j46K03J42l03R3k06
4187b82J77J01p5j06J60j08J04o8J21j88K3J25o2J22Q1j43j1J58k52L17j95j08
4209a09J97j90L11m14K22r0n4R8K0j45K00q9J73k26K45l29L99J2l45J25J81o7
4231A25j06j3j28L61j96N7q0K5O0k74M68l05j1K09j6l81J41m5M7O4k65K29J42
4254A08j65p4J9J91j96K7J05M1k26L04m9j75P6j76K48k18N4J01n3j97P08m22j27
$$ y = [205, -10, 64, 48, -61, 160, -244, -37, 14, -18, 47, 87, -125, -40, 62, -130, -58, -237, 86, 16, -148, 143, -137, 17, 120, -313, 202, -36, -186, 177, -57, -1, -180, -231, 128, -48, 140, 239, -173, 159, 107, -140, 87, -207, -8, 227, -212, 176, 24, -96, 186, 260, 47, 192, -15, 215, -66, 154, 86, 11, -39, 132, 156, -37, 260, -36, 72, -169, 113, 48, -28, -59, -28, 66, 221, -52, 37, 36, -229, 10, 148, 50, -109, -72, 26, 17, -65, -211, -8, 134, -169, -76, -282, -105, -4, -79, -185, -25, -133, -29, -97, 24, -164, -141, -16, -78, 44, 125, -18, -29, 129, -123, 194, -1, -109, 88, -102, 209, -205, 17, -73, -127, -29, -9, -154, 46, -43, 130, -96, 149, -180, 219, 231, -114, 11, 192, 125, 19, 6, -122, 239, 43, 100, 20, 45, 105, -169, 299, -6, -17, 192, 176, -205, -64, -109, -62, 2, -263, -34, 108, -57, -131, -112, 79, -117, -90, 15, 56, -170, 134, 85, -90, -14, -190, 58, -160, -106, -5, -58, -255, 453, 31, -96]
4277i6L16l95M08j03k35J18q6N4j5j79K19j79q7L97k02K23j99rK21l33P9q6K42
4300G3K92k32K9j48K26j24R9k9k79J71l31K39o2J65j05J39k98L70j04m4r8o0L
4323a08J04k2K23j23j01o0k11L21k58L22J07k74L82m23q5K86l04L80N9l23K91
4344A83k43k35L41j33J96j63k00K23o9J15J66j3l13M89n95K73M2J15r1j11K55
4365B32j43k71L87j61o9J34n4j11K55k57J54R2k99L23m55J32M22k76M1r7J6K88
4387B83l26n6L00l34L67j75k03O31l83j22Q0r4J19J76n74N80k65l5j0j00j9J75
4409A5l72L69j54O8J55j96K63m0l88L15k07L10J08o21M25j01l51N23o9j16L49
4430B85k37KJ00n47N09o4l99M96l39K40J66n07M89k32q1M72m07K27j00l2L29k29
$$ y = [-96, 220, -175, 233, 130, -105, 13, -73, -19, -34, -213, 6, -173, -260, 137, -65, 158, -41, -50, 171, -162, -83, -169, 73, 365, 133, 162, 14, 240, 116, 215, 186, -93, 78, -253, -14, -76, 89, -16, 123, -175, 195, 91, 47, -51, -111, -108, -4, -26, 197, 74, -27, -87, -298, 23, -235, 87, 194, -80, 302, -121, -206, 80, -224, 156, 215, -108, 183, -60, -295, 46, -87, 109, -54, -254, -31, -100, 15, 181, 168, -145, 344, -251, 22, 64, 179, 88, -23, 232, 89, -182, 205, 44, -25, 109, 55, -56, 199, -58, 96, 188, -111, 212, -243, -111, 311, 35, 76, -21, -5, 283, -43, -99, 201, -133, 234, 59, -144, 487, 104, -18, 62, -32, 87, 263, -311, 269, 4, -31, -41, -141, -160, 15, -357, 12, -142, -74, 81, -115, 148, 108, -280, 35, -172, 138, 246, -375, 50, -51, -402, 121, 52, -64, 285, 48, 50, 150, -397, 112, 48, -351, 145, -194, 46, 212, -295, 194, -38, -119, 353, -54, 173, 73, 41, 370, 141]
4452A41q4P2j74J61K7m25L86M5r6K08l17j39M72m60K37N1j45K31m54L88n7r6K53
4475B25k50l40O73k84J01O4k93K53j63Q4K13k61j70L51m53L05l27J11N16o14K9
4496b30M01l47K31j94j96K64MRL20o53N47m6k84N35n62J36M02m64M60k49j86K63
4518A61k44R8K49m77N39q8k81N44n32R6J91l21R7L0k87L57j15R3J78o11M03N8
4540A38k93L72n90M05J74l64K97J08m28N26p0k54K24l81L28j55l31K88j09M2Q7
4561A4j91L44j98R6K38n25L48J58m42J3O6K9L2j89J16Q3j59K13j53j1M78l00j44
4584h4L75k81L0P6l27L73l13QL92k98J01J27l59L32j15Q2J03k73K00N5j66K79
4606C17n00K32O6J00j11l6j60J37l65L79J70j69P8k78Q8J09M3k14M28n62K65l1
$$ y = [141, 57, 129, -45, 116, 143, -282, 104, 149, 53, 261, -56, -195, 277, -183, 54, 105, -40, 191, -263, 125, 68, -28, 225, -25, -365, 308, 24, 125, 189, -104, 149, -14, 70, 283, 22, -148, 203, -250, 55, -272, -161, 355, -259, -230, 171, -176, 55, -139, -335, -71, -67, -58, 262, -391, 156, 110, -174, 361, -201, -65, 337, -127, 333, 84, -102, 161, -83, 15, 264, -213, 326, 238, -43, 501, -31, 65, 256, -65, 32, 62, -225, 132, 17, 110, 288, -323, 80, 138, -155, 217, -373, 32, 206, -158, 139, 247, -181, 345, 275, 21, 245, -136, 192, 37, -294, -6, -115, -73, 14, -177, 167, -31, 65, 303, -222, 126, 284, -158, -145, -79, -50, -18, -207, -91, -8, -167, 46, -107, -118, 360, 60, -84, 291, 10, 40, 116, -211, 162, -151, -143, 249, -49, 52, 179, -180, 152, 37, 119, 222, -51, 149, 204, 38, 317, -183, 49, 115, 215, 104, 68, -92, 45, -320, 59, 229, 60, 138, -140, -52, 57, 100, -114, 314, -248, 17, -14]
4628a4j17M1mo7Q1K47N6n4l73M93m42O3J72j31l2R0l0K44j8k38J71m34N05o02
4652c93M09J21J26l24K94n61K93M5P5P1l22M6K97l62J28K88j97k3k5j91K39j65
4674a31O0J37j96R8P8Q2p9J09k40M68m17J97r7n3R7J23J56k39L0l07M01j37j22
4697A8J21p6nj68j8J57m2O5k79O4K36k30J74r4r1M32k37J63k69N7m3o8L28L0j36
4722H9n1qj54K55R0k22P5r0q5L06m30K0J77o1J66k40M67l27K1k98M64j28k7J29
4746A38l06Q9K44n1k26J32k03K59O6p1l1M9k16J94j90N2k19K99r9P7K9J00%J11
4770B27j75N1j95J91r7K36l63j22K42j15K05j14QJ02J7Rj13R4J28j54k23P9k13
4793b95pK02K35lm7k07K8R6j66K2P1j70K21K14l23L6k1K53l19J95l63M22k40J23
$$ y = [-14, -131, -90, -94, -161, -80, 167, 223, 169, -204, 289, -153, -90, 82, -49, -81, 9, -21, 223, 205, -33, 138, -296, 209, -393, 16, 137, 263, -61, 233, -328, -35, 10, 85, 156, -166, -120, 177, -185, -57, 231, 34, 11, -14, -205, 34, -131, -71, 66, -130, -32, 46, 128, 49, 158, -82, 386, -31, 166, 69, 16, 113, 236, 392, 153, 183, -124, 277, 140, 18, 139, 63, 58, -110, -128, 29, -13, 52, -227, -163, 73, -157, 17, -77, -168, 264, 27, 190, -79, -22, -65, -133, 195, 225, 89, 38, 30, -124, 131, 221, -1, 74, -16, -101, 205, -225, -205, -28, -89, 77, -163, 304, -23, -2, -300, 164, 36, 9, 138, -168, -79, 165, 114, -112, 20, -183, 76, 142, 71, 40, 89, -127, 67, -123, -71, -290, 9, -90, -13, 16, 116, 116, 227, 52, 103, -92, 99, 2, 238, -125, -247, -5, -120, 85, -29, -21, 81, 98, 107, -6, 88, 216, 62, -161, -82, -295, -302, -100, 135, 132, 85, -122, -94, 2, -164, -142, -71, -241, -20, 194, -129, -93, -114, 139, -180, 15, -348, 74, -166, -43]
4817d3J59m7j40J55J2k75K46Q9r9j30n7J57j16L82n4l37j31K97qj64P1J58N3l16
4841a38Q1J51j62q8K70k78J98J2j02J86l60J54J44r9j2R0M7p2j32p1J09J2K49
4864A89k74l6J78j78K77k13j35J5J26o9K31m07K91N5j07K18j65J82J16k20l8R8
4886A34l07J02P7L3J51l45L27J34l61K12k32ql9N3K34L8j46L7j78O2K83k41J06
4909A26k59mK13q3p6J92j12K47j59l32L91k95J46L7j73J35L3m08P33l49j55J42
4931a0j49L05j22j87K35k05K50P5k13j40J92l48K89j03j3J05k95L71J2k26L64
4952A87l32l3L71n47M61k05j25K77j33q3O26l80j17J22j98M2j36K5K35l81N00
4973A76r4j52J97l02J05J40k58J79K4j73K92l41J62K57k51J11M06n61M53n43R5
$$ y = [-43, 116, 69, -71, 84, 96, -179, 67, 156, 57, -73, -130, 27, -89, 293, 239, -98, -229, 68, 60, -104, -33, 125, 178, -138, -57, 94, -68, -156, 114, -164, 34, 46, -56, 130, -230, -76, 68, -31, -43, 47, 94, 22, -110, -181, -72, -60, 189, -85, -121, 57, -121, 156, -57, -192, -177, -51, -120, 111, -296, -5, 50, -57, 161, -4, 178, 294, 74, 36, 134, -173, -71, 6, 39, 190, -155, 172, 306, -55, 157, -75, -83, -122, -69, 165, 203, 57, 94, -84, -22, 261, 20, 126, -133, -137, 76, -7, -83, 109, -3, 244, 85, -247, 144, -151, -5, 32, -141, -6, 27, -381, 352, 3, -152, -10, -159, 146, 24, -163, 72, -133, 117, 192, -21, -161, 31, -317, -28, -131, -144, -39, -334, 37, 49, -177, 187, -145, -178, 193, -354, 107, -98, -223, 54, -79, -162, 464, 84, -33, 89, -109, -67, -203, -178, 57, -324, 176, 82, -70, 127, -175, -70, 70, -188, -9, 15, -158, 134, -207, -45, 212, -39, 72, 478, -83, 370, -173, -78]
4994g8L10k84k17O8J7L70K12o75M11k44P1N5k85L46Rr6J33k34J42K01n06j19N27
5017A34j95L98n02K05K73p59M52j11o7L48m00M25J2l87L09q5q0J83m05K01K45
5038A94j36J7Lk96M07k45ok4j63M22l03k73M78k07M3J76k12L16o1j85K78l35R7
5061a5J34k06K76o1o4K71l52O9O7k80n7K24m9K45k97k90L83j45J26N6j24K59k43
5084g3qK77l79M21l45q0J85J66K0j72k74J64J32j28K07k7l75K51j35J16n2j50
5106b59M77m11O5M40l22k01K24m4L30j83o1j32j16J40J56l21L84k19J84j7n6M48
5128E06n97J02j41k2L13L3l32J47J54k69L53l06P1R1j40K77k28J2J84j23l09M02
5150A78l70J74K37m87K76q0q9L19j07M2J43j54M46o07k19L73m33K33K06m51O63
$$ y = [-78, 232, -52, -269, -201, -184, 186, 398, -277, 134, -110, -39, 16, -269, 77, 86, -10, 123, -111, 31, 232, -274, -393, 134, -61, 337, -165, 40, 313, -446, 6, -105, -172, 176, -224, 201, 213, -174, 135, 50, -30, 153, -252, -51, 194, 58, 75, 78, -218, 189, -56, -62, -86, -249, 173, -130, -403, 75, -132, -89, 87, -125, 191, 130, -55, 223, -112, -15, 119, -87, 189, 128, 64, 335, -17, 52, 119, -161, -218, 6, -43, 202, -95, -385, -2, -147, -21, 35, -89, 170, -73, -81, 196, -183, 238, -107, -187, -2, 164, 184, 12, -262, -98, 34, -94, 113, 86, -289, -38, -173, -57, -109, -259, 218, -193, -128, 312, -10, -211, 13, -31, 299, 116, 55, -77, -193, -53, 103, -218, 166, -53, 131, 114, 58, 506, -91, 11, -130, -152, 161, 194, -138, 9, 163, -106, 247, -59, 12, 103, -37, 240, 12, 24, 208, 85, -224, 178, -192, -18, 219, -268, 8, -72, -161, 158, 51, 93, 236, 82, 528, -79, -298, 75, -358, -125, 81, -370, 293]
5171B93m52o3L49m09L16j57J81L4j08k21K07J87k90J35K8j0k7l9J14l71N53p4
5193A76j85O7j22k48L00k27J61jR8o6J29p7R5k50J36j72Q4K14J4j08n9j07Q7k
5217f3l31K44J43m7J93l70K07k40K26J30J07n5j87j81J14L21j59m3J48k95Q1j42
5239a99K40p0j93L07k48J11j4Q8K81k22k12j04J73J88j61j1k01M78m39K68J26
5260A86j86N6j7rn5k66J58J26J14L6j82j89K30J9M9j7j75Q6J99l72J72K25l15
5283a27Q1Q7Q8r0j0j84J03j10N3J65Pj69J45j96m5K96n8P7p7j03J73Qk80J29J37
5308A00Qj87LL14l65K80k34K15o5q0k70J75P7Nj8O6K12k23j11K00Q6j93Qj06R6
5333gj01J06p7K56r1j61M0J87j83K61k89K14j19J0j51J19J10k43K74n6j16M0j57
$$ y = [293, -159, -222, 127, -282, 34, -123, 58, 92, -16, -237, -30, 157, -133, 2, 30, 20, -7, -46, 68, -303, 250, 176, -9, 58, -64, -312, -12, -239, -78, -79, 19, -47, 82, 5, 100, -150, -14, -186, -102, 112, 126, 18, -41, -148, -61, -63, -394, -150, -7, -54, 139, -231, -24, -264, -38, 92, 199, 144, -43, -224, -110, 211, 52, 9, 157, -138, -57, -199, 41, -29, -222, 85, -163, -52, -66, 22, 303, 81, -131, -235, -62, 126, -35, -46, -247, 231, -208, 60, 186, 0, 56, 39, 30, -25, -291, -133, -7, 107, 143, -39, -228, 2, 21, 70, 53, -122, -36, 163, -209, -37, 188, -127, -46, 41, 129, 39, 29, -155, -52, -162, -109, 56, 63, -106, 39, -157, -202, 94, 36, 113, 36, -67, 106, 114, -166, -37, 100, 108, -79, -76, 238, -127, 153, -81, 134, 69, -11, -281, -106, -29, -24, -42, 24, 236, 13, -98, 102, 188, -5, 3, -103, -7, -108, -2, -79, 177, 86, -75, -35, 152, -31, 230, -59, 155, 36, 46, -105, 14, 124, -119, 155, 99, -17, 23, -134]
5356a34K10J8j67M9j45L20j3j51k54K00K17J29k59M9L3m6N2j92KK89j6k39K22
5379A74m18J89R0j09J32n0P7l4kJ81j66p9K86k97O5NP9P4j97K8J20j22Q1j99k9
5404a21L28j50k7K83j29r9J34k35K14k39L8J22r6r1mJ05R9r7p9K00l76K38J72
5427A90j12r2J71r9j13J7J39K20m09J31j14K58k8j76J9L33m63L20q5j51J75K5
5449A56L9n3l77L52J82k61L1j49k1K45l44L11J36m00K32j89J03N3r8J00j15J38
5471G1k79J69P9K65l23J33j51J7NR8j23R2J51p5k63n0M25l22K39j06q7J83M1m41
5495b52L77m04J02L97m86K59J31l02K62l33K4L53k4J6J70k40J67l59Q5K20j65
5516bl3M9k88N50k41j61K11m61N42l4k19J46r5j9K28l57L18p3l24L40n0M4l9j83
$$ y = [-134, 76, 94, -73, -24, -169, 151, 138, -13, -267, -67, 150, 279, 20, 69, 102, 56, 108, -84, -82, 207, 191, -48, 174, -244, -55, 35, -74, 58, 8, 85, 51, 49, 230, 64, -15, 271, -26, 39, 44, 123, 197, 0, 28, 148, 26, 107, -92, -121, 207, 57, 30, 313, 184, 85, 219, -16, 198, -41, -3, 119, 23, -68, -72, 33, 132, 35, -44, 156, -220, 18, 190, 78, -14, 157, 58, -55, -38, 101, 321, -88, 43, -71, 187, 159, -17, 2, 335, -128, 192, 107, -44, 131, 156, 195, 142, -235, 117, 299, 38, 69, -80, -101, 144, -200, 111, 247, -153, 79, -110, -7, 46, -52, 48, -67, 71, -208, -39, 40, 305, -18, 115, -36, -19, -14, 84, -39, 53, 204, 129, -134, -184, 241, -81, 158, 52, -35, 148, 189, -252, 125, -279, -177, 220, -266, -7, 124, -178, 84, -249, -225, 128, 104, 120, 290, 50, 217, -142, -57, 163, -2, -35, 14, -274, 276, 35, -126, 85, -376, 166, 132, -87, 59, -36, -55, 173, -184, 134, 61, -263, 77, 27, 71, 32, -151]
5540a51P0N9j72L34j60o2L59l43L24l44Q5J32l59J46L65m21L92l14k1K27j56N4
5562D4J10m99K62K48j77J33kk46N27p26L32Mk01L84k59k8K1p6J47O7k85M9R3j9
5586i7L42l77K8L18k78L33j84l65M25k47K64L9k77L97m38l2M29k18L5M9k99J66
5608A3j71K02oj2n9OmQ7n58M70K71k79N4l8j32M71l16o5J65K1J8Ln7Q1l04L0L50
5635B41k73J30O9k69j06j04K01K59j85q8K18l1m3j63M9K43m2P1j66M2J44k06k56
5658b65M58j58M2J50m77O83l66k21K97j50Kkj76J21K16p8K71l71OJ15p9K42l27
5681f7j65M05k97J01K91m85K40J50k9j88Q4j20K85k39p3n4q1K54q2k51M05k50
5703a66L01l76rK89K7k39Q4PJ42l3L2K11l93r5M39n10L77r3j23K46k10J68j1j04
$$ y = [-151, -81, -22, -194, 140, -20, -82, 277, -66, 258, -86, -1, 131, -228, -82, 283, -138, 254, -60, -81, 146, -10, 44, 154, -345, -83, 165, -12, 121, 119, -127, 400, -326, 6, 10, -191, 193, -66, -94, -73, -149, -2, 65, -220, -171, -78, -97, 245, -132, -104, 214, -64, 269, 85, -280, 145, -102, 162, 201, -76, 321, -117, -149, 280, 62, 97, 146, -153, 13, -158, 44, 38, 26, -33, -27, -31, 56, -502, -32, 239, -40, 14, -24, -156, 315, -1, -66, 99, 120, 138, 141, 84, 165, -139, -109, 241, -32, 98, 167, -102, -208, -312, -111, 148, -37, -125, 93, 62, 19, -144, -95, 148, 106, 177, 11, 53, 197, -9, -265, 193, 35, 77, 227, -250, 433, 67, -154, 143, -7, -5, -7, -183, -62, 154, 76, 347, -24, -18, 97, 18, 260, -67, -232, 173, -124, -23, 268, -217, 23, 173, 144, -44, 40, -80, 205, -34, -107, -161, -242, 12, -70, -321, 84, -166, 135, -241, -250, 39, 66, -173, -89, -82, 60, 27, 59, 270, -123, -218, 221, -289, 88, -5, -128, 118, -92, 76, 65, -39]
5727c9PK8j28K11j87L04J14m20N3j22L9L39k51N6Q6k39j12L33n5K33p0j78R0m79
5751c87L21Q2p8j42Q1k17K17n9J34p0M4J93j91J15Q3j97oO6N5j44J6J06p1p2J93
5776G2k15J04J86j32R0k30l1K21J75l81Q3j47M86l48o4j67J70J31k8O2q3R9n9
5799fo0J44NJ33q2jO2l0r8N8j30KL7J5k2L9j24J51j13r1K00q2m4k03L65J31l11
5826e5O1j83J75J42l5j87p0J95J35k60J75N5k27J94j46P0%K47n50M01j19r6K03
5849A25k63j5J60R9j2k28J37P1j97O6R0j57J31q2J18N1j41r6L01j40P8j12j8J00
5873F6R7k04j23K47J1l89L38J69l11K67k33J54J9l9L0k7j88O1O1J4j09Q3K07j69
5897C2p6N7p4L3j04mL45l34l9q4M7K11L8M0k92K04Q4k6j06n7K7K26j03j72J44
$$ y = [-39, -32, -4, -132, 79, -108, 196, 310, -110, -57, -179, -140, 199, -52, 4, 90, -149, -261, 72, 17, 250, 180, 2, 92, -387, -66, 16, -62, -204, -123, -340, -123, -182, -48, -118, -74, 119, -72, 43, 126, -71, -77, -11, 44, -100, -84, 22, -49, -121, 72, -143, -39, 147, 15, 105, -125, -156, 65, 240, -141, -58, -205, 281, -67, -131, -298, -128, 3, -25, 37, -46, 53, -6, -66, 78, 83, 216, 134, 133, 195, 165, 67, 125, -5, -3, 34, 49, 27, 66, -58, 93, -20, -111, 89, 7, -37, -240, 125, 256, -55, 6, -177, -2, 140, 105, -82, -152, 43, 178, -82, 93, 148, -79, 115, -31, 39, 39, 286, -264, 137, 18, -78, 125, -138, -153, 7, 106, 94, -134, 3, 74, -123, -57, 33, -124, 7, -75, 43, 94, -47, -143, 158, 18, 96, -16, -34, 66, 163, -41, -164, 83, 94, -295, 43, 212, -99, 168, -65, 89, 108, 69, 99, 72, -116, -55, 6, 20, -89, -6, 201, 32, -44, 13, -61, -28, -132, -136, 209, -125, -164, -248, -201, 10, 48, 88, -204, 0, 84, 58, -48, -105, -78, 148, 45, -127, 17]
5922A7Q1k07Q8n4M2j06K00j31k15J79l6K2L93k19k72Q5RJ97om20J25O2lK78k50
5947a41%J55K4K21q9n8pl28J98K93l65K18j72nL62k50j21K42j50l7J03k62J56
5970a3k7k16L94p4l37J95k05K80L48n33J84j1RKl18M17m3j02K11l00K98L1m80
5993b90O4L75k51K35k60J16J50l19K71r1j74K22K44k83P5j64L3n0R0j9k8Q1J74
6016B01j97O6k88K54l8K2k35J12l0J43l9J36l7m5qJ6jrJ51n45M63Q1J44j12j57
6041D8J16j85L7M4j90J54k8J14j1l57J27J61n0O8J65k89j68L15j66J33J20k29
6063g1L15l70J77ll69M95l17N4K10m01K42J23n2J43q7j59J42k57L13j05o7L9J69
6086A64p0j92j16Q4J43l67P85l30L3k22oO2O6k21L66j93J83J8k48J64q5R3Q5M5
$$ y = [17, 98, -109, -21, -75, -33, -139, 61, -70, -285, -106, -142, -120, 273, 54, -218, -133, -124, 73, 67, -353, -228, -166, -169, 109, -141, -141, 14, 38, 259, 170, 112, 105, -223, -25, 268, -97, 121, -51, -56, 306, 56, -65, 177, 27, -10, 93, -169, -13, -40, -256, 138, 64, -273, -78, -283, -3, 345, -188, -4, -15, -6, -4, -322, 95, 52, -50, 161, -139, 159, 190, -290, -226, 149, -102, 133, -127, -11, 139, -180, 91, 0, -174, 48, 292, 9, 84, -80, -47, -97, -7, -26, -54, 27, 201, 4, 70, -218, 36, -2, 20, -215, -103, -133, 10, -29, 107, 70, 25, 17, 33, 32, 23, 174, -371, 92, 173, 317, 205, 48, 164, -21, 16, 60, -130, 24, -4, 110, 99, -258, -131, 30, -20, 48, 213, -76, -244, 71, -95, 38, 158, -71, 244, -126, 51, 48, -321, 174, -143, -89, 121, -280, -38, 85, 33, 176, 89, -70, 72, -185, 128, 23, -44, -5, 164, 94, -98, -214, -130, 13, -354, 431, 101, 134, -88, -94, -32, 34, -187, 179, -14, 169, 187, -61, 103, 18, 111, 196, 241]
6110B41l06J03k38K04p7R8L7J13j57K08n0j44M7r7J84j09l0K39m17J89K22m82
6132b22J96j13k4L89l05J73k45j45L50k74L4K2K11kJ00r6L0J82o05M05k84m4M03
6155A36l98K00R2K4j53J81q4O9k10K90J19m71J60J4On3j26Q9j8J5L49m0o8j91
6179f8Ql3J74l0J53l44L29K09n29N46l77j71M55l69J3J52l66K79J12l84L08r4
6201b7m6l4j35J99J61k01K24k25n6N85n06P1J9j00L5J8m5R8j87K07N2l99M99q4
6225A23r3R6k77M5R7l6L04k61j75L10j07J66l57K74K07l52j21L9J43M2j66J68
6247F9Q7l16m6J83k53K91k60P5L19k30J33K6j20N00l46k92K14J9j74K45j45Nj30
6270a46K39J14k92K84j62K30k23P9l29K58n4j28K86N9k84K36l90J23J48l37N75
$$ y = [241, -65, 38, -200, 4, -73, 25, 62, 175, 18, 226, 176, 32, 79, -18, 166, 57, 27, 266, -151, 38, 260, -222, -26, -139, -163, 226, -79, 94, -151, -296, 54, -220, -186, -164, 47, 45, 145, 49, 79, 261, -344, 61, -223, -267, 136, -262, -62, 30, 54, -99, 82, -2, 67, -143, 147, 266, -205, -45, -31, -25, -78, -204, -115, -133, -118, 231, 191, 123, -68, -60, -93, 81, 51, 204, -140, 189, 398, -131, 415, 38, -133, 322, -47, -34, 118, -248, 31, 143, -241, 67, -27, -73, -107, -242, -43, 118, -83, 141, -84, -140, 445, -61, 10, 29, -71, -36, -18, -63, 35, -152, 55, 107, -292, 207, 123, 30, 126, -151, -106, -9, -45, 259, -2, -177, 133, 26, 192, -165, 109, 316, -36, -157, -118, 25, 67, -99, 69, 156, -160, -206, -23, -276, 15, -245, -170, 149, -81, 52, 78, -42, 458, 112, -180, 34, 53, -121, 124, -21, -16, -146, 93, 207, -85, 199, 37, 267, 44, 123, -206, 52, -2, -130, 156, 215, -69, 167, -223, -100, 48, -289, 286]
6291B86m11K00K4j22j2l1k26L21j99MJ92j2j26J17J44k41p0l2J96mQm9Q0N2j83
6316i4J73O4n4j58K63l66L44l9j21J06J54k66K6N7ok41m8O5J95J1J54l37L21k8
6340A75m76L90l4K64k79R3k28n3L62k66p0J18m8k5l5P7l49M42k83J22l8p1K9K17
6364C4q4kK56l6P0j31j20j35J67j21R9k09J39J0r2J72R1o9j71K88P3m33O3K50
6388A09n0k81J91p9K00l07L58P4J04o2j28J3k91L06j73Q3k41J02J57o1Q9o8o7
6411b2M5J02j40k8N0M7JQ6j15PJN1p8J64j01nj98Q4J39Q6j26n4K34n16L24m8j20
6438a30L18j67j24p9J05k64K73J95j67jJ47K5k42J11n5L1j31J98j07J33l24M03
6460A48k19P1J90k86J19N7J7r0j8j66M26kl01k0r9K23m5k41L82j86OK46q0l48
$$ y = [286, -125, 75, 99, -23, -35, -66, -292, 29, -170, -166, 26, 14, -112, 5, 149, -92, -162, -194, 2, -2, 6, -43, 37, 89, -94, 79, 143, 89, -69, 194, -172, 172, 133, 12, 118, 272, 6, 32, 89, 83, -158, -206, -141, 54, 65, 219, -118, 203, 175, -301, 89, 55, 319, 40, 133, -95, -148, 214, -52, -122, -4, -52, -77, -112, -35, -384, 58, -225, -103, -141, -212, -183, 34, -50, -52, 204, 168, 238, 107, -13, -148, 19, -102, -3, -212, -73, -63, -155, 17, 108, 39, -132, 156, 229, -204, -141, 109, 59, -222, -31, -110, 90, -217, 141, 215, 319, 257, 129, 142, -149, 157, -16, 67, -174, -72, 85, 24, 113, 45, -22, 23, 125, -15, -43, 7, 54, 55, 141, 26, 33, 34, 85, 7, 171, 70, 65, -133, -49, 90, 176, 50, -4, 230, -286, 38, -10, -130, 188, 21, -103, -182, -77, -341, -68, 127, -40, -41, 106, 131, -111, 0, -55, -24, -155, 43, -64, 69, -255, 148, -71, 0, 190, -96, 23, 80, 97, 7, -11, -177, 249, 247, -54, -74, -173, 50, 5, -236, 146, -40, -34, 212, 132, -216]
6484b16J93k84M32j18j14r1J31J96l90K42J47j66P6%l6j3j76J77R9O7r4M7k58
6507a49M14m0l44J00k32K37J52j82j36J02l8J65p9q3K85j96Q6J5l15K69j39j62
6529b70L94j54j03l8k2L50o7k44J00o5O3J24j39K9n0N1R7l3j03M60n18K63L17
6552D42k82j13p3O3L7j30n5L6P5JK2p2K22k52nK23l96K37n4q1J03J80J49Pn63
6577b79N57j95j40n0Q6K9p9j51L26j31q9J67j68K27l5k76K75k3RN7j98lK39l79
6601b24J17J90j60oO7L1n2r6K44j03j5J74k49q4L10m50M28j34j61J75J42o7k8
6624D9K54k69j00j6P8l3M6L11l97J83m8k41K40j75k4J63p3L4J32l59J33J05j98
6647b05K74k78M12l07J85j3j06k9M62n64M20k01p5K00k70K63J05k30k65K20kK02
$$ y = [-216, -23, -307, 125, 7, -107, -198, -67, 129, -261, -19, 128, -38, 38, 38, 2, -11, -187, -10, 89, 156, 62, 109, -149, 265, 225, -119, -19, -251, -14, 138, -44, -180, -78, -116, 49, -30, -113, 172, -24, 62, 77, -238, 31, -108, -270, 124, -30, -133, -171, -193, 157, 90, -154, -54, -119, -56, 68, -71, -42, -92, -41, 56, 23, -80, 380, -138, 125, 442, 160, 47, -26, 37, 74, -56, -111, -75, 0, 1, 23, -49, 173, -79, -84, 139, -257, -20, -74, -155, -52, 128, 277, 284, -279, 278, 83, -57, -107, -21, 8, -71, -222, 104, -27, -116, 51, -117, 110, 75, -201, 74, 51, 60, 117, -81, -84, 155, -224, -107, 83, -77, -83, -16, 15, -37, -133, 111, 8, -7, 167, -82, -166, 144, -306, 122, -12, -173, 2, 144, 77, 49, 303, 34, -66, -82, -4, -37, 9, 320, -77, 106, 58, -183, 57, -118, -142, 21, -52, -18, 114, -245, -112, -7, -205, 69, -209, 203, -104, 81, 68, -38, -67, 395, -169, 251, 50, -25, 175, -95, 168, 273, 43, -222, -2, -4, 198]
6669A98m81K00L3o3J33K11n21K36L21l21J88k21M9J88l63K03l10K43J96j86M6
6690b1J63j90K3N7k23K83k23K08J85l81K32J1k57L01k37J06K86m40K11kl19L74
6712A47l67J79j0qK59k69J67j6l5L0p4j03J56Qj22L30l39M66n33J1J54j32n2L62
6736B09k71P7Q7n2P8o8N6N9l97L00K86n03J06m0M2Q2k35J74J26O3n3r3L9J47l32
6761a13J48j20N7R6R6n4J17k78J50q5J11J10l40q1M18m79J20M22k62J6L7k08J24
6784BL7k7K08l25R6J31r5J92l39N8K52k76K63j64l41N14l16N3J93l65K96%k12
6807a65K74p1o5J92j53P1J41k51J58o4j44K73k14R5P0k97L63j62k34K0j5K78j12
6830a2k89M94m39K70K14k69k9J7M9J63l12K91j18J34Oj91K2M0Q1j93R5J79j63
$$ y = [198, -283, -83, -50, -113, 20, 231, -290, -54, 267, -54, 134, -87, -38, 150, -213, -10, -320, -77, 119, -67, -21, 142, -48, -25, 32, -191, 92, -131, 77, 262, -119, 113, 124, -133, 168, -69, 37, 323, -117, 94, 92, -227, 147, -220, -41, -51, -59, 200, -69, 98, 82, 47, 77, 3, -100, 56, 64, -58, 272, -67, 399, -134, -123, 31, -101, -153, 209, -62, 15, 102, 50, 128, 60, 116, 175, -222, 78, 364, -139, -33, -73, -31, 51, -184, -10, 116, 179, 126, 33, 72, 219, -113, 35, -85, -28, 68, 164, 110, 227, -51, 99, 14, 125, 235, -105, -186, 232, -247, -127, 295, 33, 49, 86, -122, 2, 39, 12, 220, -105, -9, 122, 27, 219, -120, -62, 190, -86, 177, 13, -328, 186, -130, -77, 116, -249, 47, 47, -165, 109, 38, -27, 165, 12, 83, 224, -27, 131, 67, -77, 196, -18, 77, 147, -150, 213, 51, -183, -163, -178, 100, -12, -301, 193, -246, 24, 238, -31, -60, -43, 6, 169, -143, 148, 30, 164, 170, -21, 1, 41, 122, -71, 24, 203, 40]
6853D0N2j92J61j31q6L12m38L44o6k5R8M0r8J68L0p8n2MMQl35K62k08J41J27j95
6879a13J38O8P6j23j45j18L56q7J3j39J85j97m2J13k26K28P9k6j06K15J23k40
6901C2J10j77J87J1k87p8jk4J45J49j44J79k28J85Pj45J09j33j7J26Q4k87O1J55
6925A9M7k17J26qK8K2q9K58j64M8k36L22k94K27p3m8J0P2p4K24j76q2N0j22j8
6950a48L07j22M1o4J38k14p4l9K67k56J27J36k07O4L5l18K53K23p0L9J12j97j00
6973f7p2O7p7QJ24j34Q0o5r2L27j42J03j69j25J85J60j88q2K42k41K19j14J71
6996A18o4J32J68l30m7K26k54n3J89K8n1j36J54J15j31k97K69K69j97j64P6j54
7018a34r6L00p1k35L79j13j44P3Q4j37J90j76L23l25M0j08n3L99j41on7J63k64
$$ y = [40, 92, -100, 61, -70, -156, 156, -282, 62, -4, -29, 69, 109, 11, 179, 209, 131, 79, 83, 87, 95, -240, 22, -186, -45, 82, -113, 25, 93, 169, 46, -99, -217, 139, 52, 65, -74, 111, -86, -128, -15, -241, -13, 66, 40, -66, 149, 272, 32, 142, -35, 152, 163, -124, -202, -203, -227, -82, 67, -77, 102, -126, 59, 66, -79, 30, -103, -120, 6, 90, -197, -136, 19, 66, -151, -25, -33, -5, 17, -72, 186, 22, 70, -166, 156, -138, 89, 16, -32, -22, 50, -24, 200, 24, -58, -8, -130, -148, 159, 37, 78, 14, 152, -62, -136, -175, 92, -164, -37, 99, -108, -44, -9, -327, -74, 149, 79, 118, 230, 33, -67, -139, -72, -149, -141, -17, -151, -71, -136, -228, 99, -43, 60, -109, -234, -49, 111, -77, -159, 83, -158, 61, -53, 118, 54, 186, 354, 24, -23, 203, -51, -104, 85, 113, 62, -74, 80, 195, 64, -233, 36, 305, 108, -56, 20, -134, -230, 70, -1, -236, 143, 30, -114, -41, 43, -94, 96, -80, 243, -82, -42, -150, -203, 196, 55, 49, -8, 155, -109]
7041a09L68l79R8R2j39K08k82M23j96l02K89j22J20k46K36j37J73k01K4r9K06
7062B5Jj22j80K85q4R7Q4j84Jj06K76K24l04N8L34n92K29j35J69N2k58K62n5r1
7086a4M9J37l03K89l32J51P7K17r1j72Q8M8r7M0o7j81M00j53K8j72r7P6K04k13
7110h8p2L34k95N6J4k5o1k14L44L12l59K09j52j26M6l7R4k5mO1k80Q3M31m82L51
7135A15j8q3NJ8J09j37RnL99m41L0J46j18P3l65L04J39l81L86k26m13O93l39K43
7159A43j88K1J26L3k73O8j98L54R7k46M1r0Q0J5k73M52ol11L13j49J22qp8k33
7183a88J82J11k41J22J61j41j15J43J24l59K75l31L86N0m58L62Lk49K49P6k60
7204i8N99o49Q9J38k62K51j68k6L08k55j75L02j18L6r8q2L57k18J60j9L2R3m26
$$ y = [-109, 259, -120, -22, 70, -69, 139, -143, 280, 84, -218, 71, -51, 69, -177, 59, -78, 95, -106, -82, -181, 25, 26, -96, -276, 9, -75, 22, 106, -78, -77, -183, 93, 317, 13, 71, 405, -187, 42, -93, 76, 128, -130, 132, 77, -14, 35, 172, -131, 158, -174, -23, 54, 271, 180, 8, 96, 144, 47, 87, 20, -161, 239, 86, 114, -58, -155, -79, 125, -88, -160, 174, -121, -65, -51, -76, -137, -351, -7, 305, -54, 155, 3, -123, -77, -114, -20, -45, -49, 12, -268, -185, 246, -236, 115, 97, 14, 19, 37, 146, 9, 18, 13, 412, -29, 1, 147, 29, 102, -263, 41, 180, -201, 185, -41, -454, 239, -100, 143, -45, -24, 102, 135, -138, -70, -268, 86, 183, -63, -22, -112, -32, -17, -290, 162, 156, -155, 158, 9, 131, 123, 45, -188, -6, 105, -136, -14, 147, 6, -109, 34, 158, -201, 74, -257, 129, 179, -279, 83, 86, -163, 86, 162, -98, 501, -148, -59, 79, -183, 68, -100, -126, 182, -73, -248, 54, -64, -28, -126, -208, 149, -69, 91, 72, 104, 197, -229]
7227b29J68J49j1j24J61k96K31O9j50K58p9j09K06l07j6j31q8M13j96l5j17K6
7249b07K98J61j37N5k38J24J88m52M15k56k1M0p2J11M3j85J61j99N0J66R5k69
7271a29J40J15l74M43m61L98k12J56k46J12m1j41K43J86k50j37M32l75N2J26k04
7292a67J51J7j91K62j35J91n5o2K17l86j8K23k61L79j09k03M33m92k6M44l98L43
7314A57n0l04J47n9J10p3l6j21K89j49j50K08l2J88o7m9J30k39J08m0k64L06j88
7337a78L42j52m8m4N1%j11J88j68L41l29L14k0k81J71oj42J24j47R4j68O0K43
7360A34L2j0j67K62j85l0k74M62l88M92k94j81P9R1k45M85l45q3L23n0J94k58
7382D4K5j22K21o0k13L0j26K95l00L22k81K52k9K7J63k75j4N8k61J17N5J38mN7
$$ y = [-229, -61, 88, 77, -47, 114, -182, 49, 118, -32, 226, 147, 38, 244, -63, -79, -210, -298, 115, -81, -116, -233, -207, 91, 252, 115, 170, -68, 56, 244, -208, 207, -49, -70, -30, -102, 9, 52, -133, 28, -171, -121, 45, 140, -129, 11, 126, -248, 195, -266, 132, -80, 76, -170, -58, -99, -240, 3, 189, -61, -198, 234, -141, -89, 37, -167, -16, 1, -190, 72, -63, 128, 73, 11, 228, -158, -176, 47, -214, 165, 56, -147, 286, -206, -232, 212, -186, 157, 107, -197, -50, -109, 1, -72, -108, -229, 60, -89, -239, -31, -63, 125, 58, 9, 139, -100, 8, -32, -296, 10, -178, 164, 12, -36, -80, -29, -29, -140, 48, -120, 221, -108, 206, 186, -95, 76, 70, -72, 52, -95, -1, -169, -109, 134, 166, 156, -11, 251, 66, 36, -238, 224, -164, 328, 34, -147, -68, 23, -222, 263, -82, -165, 158, 108, 302, 44, 69, -53, 168, 108, -105, -75, -201, 94, -206, 116, -165, 87, 58, 85, 248, -27, -41, 17, -244, -127, -72, 66, 62, 119]
7406A19j05k1q3p4L94l91k0M00m47N2J15J54J01q8k18L79j78K3j01J19k63n1L26
7429A42p7k30LK32j29J40K8m4m8j09R2n6K9J59q2j85K53m9j9q7k9J66N3o1j73
7454h1J61p0pp4R7k49M83j69k56K73j30J9o4q7J10J35N6l30J42j7J81N7N3l82
7478a49K3K87j64J76k52J78j86j31J42k11L96j23k7j60L07m8j0J31k49kj4Q9l03
7501c00L28O3j12K0N8J0k39J06J07j94J01J54o9q7J29J12j77J46l18o0K11qL3
7524A4j97n4L75K2p7j74K14Q7rpj17k41K94J1j59k1n2K45q1j48j33J94l7j48L51
7549A52lPm8k29J94Nn1K44m77L14j75M6K02j07J1o6j69J2j78K39P6p0J90j45j88
7574b14J37j08K53J09k63j59M00k48o2J49q6L38k17r5J51L6r7n6l3J2m7qM96l20
$$ y = [119, 14, -7, -90, -164, 230, -161, -181, 219, -228, -176, -61, 93, 194, 106, -112, 267, 89, 112, 11, 130, -133, -184, 142, 65, -165, -162, 70, -59, 81, 109, 65, 17, -92, 0, -56, -27, 132, 50, -135, 118, 69, 50, -37, -66, 100, 153, 92, -81, 80, 10, 3, -71, 26, -223, 260, 91, -165, 108, -22, -3, -67, -154, -44, 91, 147, -183, -41, -58, 123, 180, 233, -149, -126, 161, -3, 173, -79, 99, -87, -218, -76, -287, 109, -14, -41, -201, 106, 58, 48, 179, -70, -72, -86, 3, -300, 28, 91, -21, -1, 57, 67, -172, -66, 41, -153, -52, 102, 33, -54, 75, 187, 10, 156, -162, -222, -11, -19, 14, -183, -237, 138, 160, 83, -91, 123, 210, 201, 194, 77, -164, 130, 141, -18, -39, -91, 154, 73, -75, -208, -14, -51, -199, 152, 149, 156, 108, -121, 73, 78, 27, 271, -206, 108, -67, -21, 181, 74, 85, 19, -150, -138, -316, -77, -1, -71, 119, -26, -214, -77, -185, 68, 177, -86, -245, 155, -93, -155, -6, -92, 246, 29, -66, 85, 121, 24, -32, -65, -53, -100, -108, 388, 68]
7598F8J5J89k8j55K2j21l3P8r4j6j2J34j34K45m69J39J80k32J41N1p4J12L01k33
7622G4j25L2k52K84j20J92Q6l53M03l34o0J77K5j88J23k08L59j73J0L5n7p2L43
7645B01k37L4j6j23J28K21j42p7L9J2K38m13J59n4O6KJ58k57p3QL16k96J03P2
7669F9j04OK19n27P99k10k05R1l09L78j62J2O3k11K22k95j9M8K49k75L80k79N2
7692hK0j2P0n7j32K46q2o8L87o84L92pl2j11j20k02N66k66K10P4l7J06l72J05
7716a4L52n06J48K29k78J06j14K48j35KJ34j76j24K98p1j59N1k6J40J31l46L05
7738A95k96r1L91k76J20J08K12k56j03p4J82k21k17K97j24L47k6k50N43n45NK87
7760B08k74K12N9k10m6p4K31K4l94K50oM9P8k44K56r3m7K3O1j59J35Ol2J92j23
$$ y = [68, 83, 272, 244, 89, 111, -10, -43, 35, -59, -75, -87, 47, -87, 158, -311, -172, 8, -224, -83, -32, -106, 6, 307, 74, -51, -19, -271, 13, -107, 85, 171, -182, 221, -113, -173, 4, 29, -159, -36, -244, 115, -58, -48, -13, -70, -142, 201, -36, -2, -18, -141, -13, 208, 66, -11, 28, 40, 278, -135, 24, -30, 36, 38, 196, -61, -134, -126, 190, -106, -3, 69, -35, -29, 190, -337, 462, 252, 47, 138, -171, 207, 45, 57, 120, -91, 131, -164, -183, -135, 114, -161, 219, -60, -8, 12, 0, 70, 13, -119, 127, 45, -23, 364, -320, 72, 65, 33, -78, -198, -400, 166, -100, 110, 184, 147, 253, -119, -14, 338, -168, -20, 209, -69, 37, -77, 171, 36, 38, 172, -4, -128, 170, 99, -60, -9, -35, 105, 236, -110, 195, -101, -192, 199, -77, 43, 151, 363, 107, 4, -70, 112, -109, -326, -29, -153, 194, 168, -82, 461, -84, -79, 208, -66, 146, 205, -5, -51, -125, 106, 130, -264, -14, -20, 29, 107, -137, 119, 26, -21, 2, 63, -96, 39, 45, 13, 205, 82]
7785H2J13l12n3J80J06j36N6k64J99N3M2J00j95j03K73Kj58L4j79M45m58K9J54
7808A0j32J02M2j13J80k89J12R6k9pK90m07K50j00J20K7k74L65k5j55N0m3p4k4
7832b8j33J40J52l06L33r0j72K78l72Q7K49k40K9q3J63p7J6O0K3j49M47m3l41
7855e7K52l61L49r3J03J06m14R7Q1j09K31k35q4LK43J7R4l50k7m5J43J26P2j83
7879d1J35k47K10j06Q1kq3L45m73J22j69L23j51k6J58j60M7L7j11MQ3Q8j46K52
7903A70k68K2J48K26m90K73J66l49R1Nj10K99o6q3j2j2j32m5N13k1m96J76J06
7926A11j68j14J11L7l8K2K59j56k69K61j21MO3M4o9K0q5lQ0l9j88J95k3M5J44
7951A23j05j02j70K77j71J39j45k4M03l63L65j73Q4j26m0j00P9K92j05Mj3l3j30
$$ y = [82, 195, -117, -170, 10, 116, -20, 36, -228, -29, 24, 66, 166, -29, -132, 141, 143, -15, 19, -160, 285, -173, -144, 10, -122, -20, 22, -91, 89, -200, -88, 8, -21, -28, 262, -145, 105, 5, 125, 152, -122, 243, 218, 63, 113, 70, -4, -28, -161, -21, 131, -175, 158, 68, -104, 174, -198, -111, 138, -102, -73, -156, 7, -70, -54, 6, 29, -120, 327, 284, -57, 195, -166, 183, 90, 193, 299, -115, -18, 63, -46, 185, -50, -134, -131, 112, 129, 223, -127, -154, -199, -56, 70, 142, -41, 94, -153, 57, -49, 32, 30, -53, 292, -181, -59, -228, 95, -56, -82, 76, -84, -37, 0, -111, -107, -24, 64, -82, 170, -98, -76, 72, 298, -192, 81, 247, -102, -11, -6, -116, 183, 117, 34, 22, 10, -122, -167, 346, 325, -171, 5, 111, -57, -171, -60, -23, -61, -39, 220, 64, -205, 56, -65, -61, 2, 46, -23, -3, -88, -91, -11, -50, -238, -43, -66, -21, 123, 18, -84, -254, 23, -148, -9, -154, -178, 225, -138, 227, 54, 138, 12, -28, -128, -49, 243, 138, 142, 129, 96, -34]
7974c4l4K52l87J12k6P4P2Nj53K84k43K6K46m00J78k1R7K22l79J63rq8P4m2K61
7999B50j52k8j61L03k93J63p9p0nP0L05l85K7Q3K2K41l48P1P0k89K57o3Oo5K49
8024A79j53K7J04j77J2P7j08o2K3K2j00J80k20M5M9L19k07j41M2P9j18l00M06
8047b2K5pO6j7M6l07L59k68L5K60j16j16m9J21q0N2J65l5m5l64M26P9o96L10M72
8072B94k05J76l83K12r3Rj77N14l35P9j3q1L8M9n6K8j76K3J29J39N4p7j44J1K72
8097B87m98J18M8J4p1J76j16j16Q2j99L27j87M1J22L2j48J6Q7N5j62pnk3M75k88
8122F0l9J52J17l07P7J61k25Pq2L20j09J40l76M5L02k28k03J47J05j95L00l66
8144a97J89J51l46J00J98k43J97r5j22K30k11J72m8J01r9Q0o0J79k45qK62q1k20
$$ y = [-34, -68, 184, -203, -91, -117, -43, 29, 34, -119, 165, -78, -52, 194, -206, -28, -49, 48, 270, -109, 54, 45, -43, 31, -11, 250, 98, 70, -91, 212, -81, 82, 3, -67, -72, -2, 303, -82, -55, 28, 50, 291, -57, 14, 84, -205, 52, -11, -5, -70, 179, 26, 53, 157, -20, -8, 69, -39, -101, -78, -56, -156, 24, -196, -151, -102, 217, 10, -131, -89, -10, -128, -428, -22, 3, -4, 62, 45, 91, -216, 143, -125, -90, 170, 54, -62, -111, 10, -70, -18, 147, 112, 67, -297, 129, 208, -488, -178, 294, 89, 265, -118, 94, 1, 10, -167, 347, 12, 91, 78, -3, 35, 84, 28, 56, -120, -97, 32, 171, 225, 148, 4, 15, 287, -211, -93, -45, -31, -102, 74, -42, -158, -76, -275, 52, -135, -94, 28, 60, -88, -72, 15, 70, -92, -99, -104, -127, 348, 60, 21, 173, 290, -17, 60, 221, -4, 3, -79, 241, 132, 272, -104, -59, 243, 15, -188, -41, 64, -131, 169, -197, -8, 143, -203, -103, 95, -148, 49, -46, -168, 62, -149, 23, -25, 76, -23, 57, -3, 176, -69, -77, 185, 104, -116]
8167a16k6J36O5r7L60m36K44j01l39J14K07K28m56L87k85J66k7j1k98L93j88K36
8189A56r0j4
$$ y = [-116, -142, -6, 59, -38, 322, -114, 130, 29, -310, -196, 11, 239, -217, 170, -115, 51, 24, 13, -285, 108, -80, 156, 66, 52]
8191E2
$$ Imaginary data points
##PAGE= N=2
##DATA TABLE= (X++(I..I)), XYDATA
0@%%%%%%%Qj6J6j6J6k4L2m0N6p2Q8j04J20j44J76k08K44k87L39l94M53n23O01
30C21o85P81q90J006j136J279j435J609j801K011k238K487k758L053l377L731
46A958m117M539n003N510o069O687p369Q130q980R936j1023J2270j3714J5414
60H169j7448J9924k3024K7031l2429M0119n1987P2781j19153L89002j06261p39547
72e32823P46594n5083l42853J73644M0018p017j5220p1751J83059q8468j06523
83g6423P0315R4338q4994j66859K48621K7802l36891L20630O4746l38808K05287
94B7764N1709r0640L8573j89984K31937P0607l42758K17996Q8650j66144J08781
105D6491r1485M5750R4254k17369J21717Q6821j82154P7647O1251l5455m7949
$$ y = [0, 0, 0, 0, 0, 0, 0, 0, 8, -8, 8, -8, 8, -16, 16, -24, 32, -40, 48, -56, 64, -80, 96, -112, 132, -155, 184, -210, 243, -280, 321, -364, 417, -473, 533, -603, 676, -759, 850, -951, 1060, -1178, 1309, -1449, 1604, -1773, 1958, -2159, 2380, -2623, 2887, -3182, 3505, -3864, 4266, -4714, 5222, -5801, 6469, -7245, 8169, -9279, 10645, -12379, 14652, -17777, 22342, -29645, 43136, -76017, 312985, 206724, -532823, 213771, 158688, -184165, -10521, 29497, 22480, 7260, -64491, 118568, 30100, -76423, -6108, 88230, 3236, -163623, 84998, 112800, -224091, 96539, 161285, -177523, 27764, 79473, -11167, 27406, -162578, 69359, 139966, -202792, 15204, 103854, -62290, 46491, -44994, 756, 95010, -122359, -642, 86179, -95975, -18328, 42923, 7468, -40481]
116d0481M4534P8036j72066Q3355J30653k63459J16850J27681j96385J24316n0978
127a7944l1967K07170k44677P537K36814k22095J4272J18555j28839O9509K6909
138C5244o0824K2086J8616M1670j03231K1050J15810j46548K6111P6863q3091
149c6244Q1177o5752k6878J70345j66632p524J47513j56787O1984N1526j30304
160g7576R8302J4834n3359K9512l8840P0869k0283q8588R8200k8253k3801K8986
172A0003m7839P8908l1660o1144J00507n4580n022L7756r4786J07165q624j21335
184i0651J28299k2326m6890O6988p0059L9847L3172q2911N3981j2539j7668N2253
196C1496o8133K8351L8641m1600J5331k6828M3655J1750j00289Q5513J9228r1353
$$ y = [-40481, 4053, 82089, -89977, -6622, 124031, -139428, -22578, 105103, -91282, 33034, -17944, -49911, 157259, -87418, -79881, 156933, -65162, -50890, 67665, -61174, 8335, 35244, -25580, -3494, 15122, 56792, -46439, -25389, 90421, -56127, -30016, 46847, -36244, 44933, -20819, -47697, 122648, -43984, -51508, 96005, -60782, 1202, 52728, -77576, 20726, 35560, -17799, 11713, -27127, 43742, 23459, -65129, 33071, 4818, -18983, 10003, -37836, 41072, 9412, -51732, 48775, -5805, -10827, 26929, -67857, 39308, 30684, -90651, 37648, 15322, -31568, 35420, -34639, 5208, 38380, -44531, 9450, -3089, -20757, 31496, -36637, -8286, 30355, -11245, 4086, -22742, 20913, 32663, -67626, 17887, 37115, -54238]
208e4238Q0844k9415k2135P8974q0026J3047M6471m9823L2835l2578o899P3993
220E1050p0902o834N8744k7306O901l1102K2141L8433p5999L4067K2249m8303
232b6861N2126k6842k1185O1016m7303Q381J4212l8945N8923l9769l2830P3467
244C4390l5481j3257K3084k2192L9847k3437l6326N4058j8272r215K36j3607M7275
257B7103l1054k2694M5931k1978L100L068k9854M7718k1149k9960M7073k9637
269a2333J1618J8877m8687L6823J7432m1261J1201K831J2773k360l7406L9111
281H619P794k7274J2705q782K0471l110l4939L3022K049k2172K0234j9695J3738
294B660K1926m2283J6885J6349j5228M620j6454J2158J7851k8104L078J4120k790
$$ y = [-54238, 26606, -2809, -24944, 54030, -25996, -12949, 33522, -16301, 16534, -16044, -22943, 51050, -19852, -26686, 32058, 4752, 11653, -19449, 2692, 41125, -34874, -807, 21442, -26861, 25265, -1577, -22762, 38254, -9049, -668, 13544, -25401, 33522, -6247, -39077, 34390, -1091, -14348, 8736, -13456, 26391, 2954, -33372, 20686, 2414, -6801, -6565, -20172, 27103, -3951, -26645, 19286, -2692, 408, 3476, -26378, 21340, 191, -29769, 17304, -12333, -715, 18162, -30525, 6298, 23730, -17531, -6330, -3499, 9274, 6914, -30492, 8619, 16413, -10861, 1844, -6938, 13533, 10423, -24516, 8506, 10555, -11617, 8617, -11078, 2660, 24586, -17697, -812, 15537, 309, 4929, -11525, 633, 18484, -9620, -6542, 7578, 4788]
307D788O495k2276R543K2679k5649l891P811P912K30k2999J1648K2598k0334m702
321f147M980K546J1855k4330r92K2193r261n687j019L315J2883j0627j4616J7173
335B266N604j2077q059R450J1082j0655n900L278J1324J339j7857j63J9939m081
349E490j9141O772J2877j261j2166J050J1803L198j3437n069J8763l941j1203
362f265K941K769P465k916j2264R015J0020p885n845l678J7058k001k0858J3509
376A065O521l402l082r556J6382P317k6094O605J2128k655k862j6297K0160Q551
390A4781k3344P184K268M340L984k6087J6555J7619l0710J1115M889o233J4603
403A0964k1569N264J6326j5800M171o022J247J9339k4718K637J4804j2893J8169
$$ y = [4788, 11283, -10993, -1450, 21229, -4420, -8311, -500, 7412, 7642, -15357, -3709, 18889, -1445, -6147, -1167, 1379, 13234, -11096, -12088, 10105, 844, -4843, -5862, -2547, 10336, -291, -14907, 2266, 7870, -4207, -12266, -2816, 8266, -2389, -8289, -5011, 6313, 7652, -10205, -10368, 9571, 5490, -13651, -6879, 5998, 4737, -7429, -6379, 5424, 8622, -4815, -9884, 8879, 4938, -6265, -3324, -555, 6910, 3994, -8270, 745, 10765, 2880, -2965, -6643, 10415, 8414, -12444, 1065, 7586, 4184, 1102, -8454, 7928, 15245, -10849, -4244, 7884, 5229, 2367, -13930, 6230, 14781, -8563, -1379, 889, 5229, 9213, -16874, -319, 17300, -13410, -2295, 2594, -3639, 10964, -10605, -5341, 10985, -4815, -644, -6666, -5419, 13920, -10798, -8161, 6643, -6250, 11919]
416A1919k2928m577M2237l5036j1643L1560j2109J863j0591j148L4400l2655o668
429a5376K8313j5843Q505j3948q83L0395l4088P724K3128l7074K8668M546l5165
442b1098L2482p147n364M889j9773L7135j4335l2224M2620j0124j0138Q023k2995
455a8049M2112j5572m1363N6095j8490j7403K8777k9154J8084Q503k8724K4241
467I057j2314K906J3873l8696L8447r30l7013M1545k2665l69K8686n0374K9567
480A720K1295m8228L2762r077j0500L2949l8213J3138J3446j9748K4828l2029
492a7657R746L8707n9424K3841K7420m4296L3049j8898l800M2942n6968J4367
504a0971L6754l9343J5880p231O51K6269m4674K9530R354m7972N8756k1059l5125
$$ y = [11919, -11009, -15586, 26651, -8385, -20028, 11532, -577, 1286, -9305, -10453, 23947, -8708, -15376, 12937, -2906, 5599, -8349, -9232, 21163, -12925, -5201, 17927, -19147, 9521, 14067, -21098, 11384, 4237, -1127, 3762, -16011, 21124, 6789, -25435, 17185, 7061, -3077, 4946, -18049, 24063, 8491, -32872, 23223, 4733, -12670, 16107, -13047, 5037, 13540, -15184, 9057, -3257, -351, 13522, -25174, 13273, 12343, -24670, 16875, -5790, -6159, 22527, -27847, 1720, 23015, -25213, 7549, -1528, -12028, 20921, -17292, -4154, 9292, -10456, 14372, -17657, -7911, 30796, -28628, -4787, 22633, -21663, 11386, -7512, -11312, 31630, -25338, -10971, 25783, -13560, 2320, -4911, -4260, 22009, -22665, 6865, 16219, -31753, 27003, 5944, -29181]
517b9181N2021k6576L439R488l2908N1077k1073l9311O0801k2557j7015J3403
529A608o190L3312m7037m096O7048n9725k16M1582m5455K9721k740k6863M0573
542B1522l6689J4448K6532n6135L5740J1745l1410K1639k1117K3408O241n4344
554c8420O0340p539n0255N5786k1581n830K0493l8768M0042k395l9955M3315k1629
567f396M72K4030m2842L2241k054k0726L8594m5744J2770M4013o0650K3258J8527
580A5493l3572L4295k5513K055L0328m7410L1070Q859l5125L3188k1336M329K5888
593B2549m5522L0834K582l0787N0452m0723j1610N4126l9229M670N685j6218M0457
606B7266l6448o651M3399m4216J9180J2196l3598L6030k4563o13L4252m8145K3212
$$ y = [-29181, 22840, -3736, -297, 9191, -23717, 27360, 6287, -33024, 27777, 5220, -11795, 1608, -4582, 28730, -18307, -22403, 44645, -15080, -15296, 26286, -19169, 10552, 7812, -19051, 21522, -15167, -719, 25813, -30322, 5418, 17163, -14247, 7392, -13725, 9683, 15924, -38420, 21920, 14381, -35874, 19912, -1669, -7499, 12994, -25774, 14268, 11873, -28082, 15233, -6396, -5924, 18106, -24736, 7505, 5451, -15275, 23319, -22425, -9655, 34358, -26292, -3034, 15493, -18079, 16216, -9297, -7242, 23086, -24324, 6746, 15605, -19520, 13668, -7668, -3339, 22549, -22973, 7861, 10443, -20344, 30108, -10615, -22225, 31901, -7328, -2658, 3027, -13191, 27266, -9182, -15833, 27566, -16650, 2530, 14726, -18872, 17158, -7405, -8018, 26234, -21911, 1301]
619A301J4802l7591L9760j8876j8067L6156k7547J7918m880l0853N3250k2368
631C005k2874L3388k7671K2530L001m1449M7485j5155k1271L9656l4526J0949
643b932J4096k9292L3300j8198j3763L5234l1664J5636R796l8043M0061j0590
655C641j4857K6800l7801K7989J7672n0390L3339M19j7068K8738l4189J4509J9153
668A7955l6876L2320j1105j6870L4323l0598J0116J7516l5720K8972n141j5303
680a0411L0271l5919J3695K5154l9326K2495m782j0442L1063l4401N496K4602
692A7495l1705K4945r112j9518L9691k9736m96K3824k9672K1118m171j6697L1161
705A7127k6081M86K2926k7988K0727q121j5652L7023k8943j344K2210k6705K3880
$$ y = [1301, 16103, -21488, 18272, -604, -18671, 17485, -10062, 7856, 2976, -27877, 25373, 3005, -19869, 13519, -14152, 8378, 11379, -30070, 17415, 2260, -19011, 20645, -13881, -2932, 11164, -18128, 15172, -3026, -16789, 18445, -13219, 2417, 12213, -25830, 14231, 3641, -11216, 15584, -22217, 5772, 23444, -26946, 6393, 6812, -10256, 18482, -15707, -1198, 17955, -18921, 13399, 2294, -14576, 19747, -10851, -735, 16781, -18939, 10033, 4892, -10411, 19860, -16059, -2364, 22790, -16536, 5959, 1177, -9265, 21798, -12603, -7107, 17495, -14210, 10735, 1623, -17895, 21796, -7940, -8436, 15388, -14284, 6834, 2663, -14034, 17127, -8954, -8468, 14458, -13530, 7197, -924, -16576, 20447, -8496, -9840, 12370, -14335, 9545]
718I545o046k4565L7734j9324p134K1693k6791K1571n89k2710K8681j5592j520
731e047J5273k4597K2222r71k4832L1752j4829n849J8197k4308K1279K51k4822
744a6281K7677j1296m845J7118k5214J7421O217k3612K2813j2457p85J7821k8405
757a3828J6812Q885k3447J8913p886l799J7439k5112J3927Q330k0696J8240j1346
770c568n6J7175k6176J2335J0066k0109J7327j0061m532K1822k4136O594J1230
783G911j6756J4794r382l751J7833j8000M273P893j3283J5987j1524n476K1709
796A2228j9295L628Q908j3726J5366q148q677J8989j2164j98O709j1084J5355
809G891q452q261J8003j1641J259M815j0627J4588n543j0819J7207r020p19O574
$$ y = [9545, 3499, -21066, 16668, -2656, -9790, 11903, -14888, 6683, 6094, -16616, 12065, -3527, -5047, 10226, -14371, 7851, 6880, -17952, 13800, -1029, -6878, 11319, -12989, 8290, 8541, -16281, 11396, 100, -4745, 12373, -12841, 4580, 10797, -12815, 9998, -2459, -3244, 14577, -13828, 2984, 11869, -11578, 7335, -551, -4350, 13089, -12023, 1904, 10234, -10462, 7778, -3568, -3624, 13551, -12625, -290, 9776, -10333, 6994, -3067, -7599, 14223, -9913, -3319, 7911, -8845, 5949, -3433, -7184, 10649, -7351, -3078, 4815, -8468, 7519, -4005, -9481, 12228, -7067, -3439, 5469, -8257, 7109, -1039, -9716, 9273, -2891, -3089, 3620, -7464, 7891, -561, -8822, 9181, -2460, -1201, 3614, -7013, 7575, 2032, -8787, 8420, -600, -1319, 5255]
823E255j1888J2712l167q587J0700o372L733K133j2085J2885l45j1361J0970n711
837a128K018M731j3396J0815K405r852N271j464K151K268j0415P964K336p357
851c653N545n471M239L862j0932O519L205p366N011k185j717O718o965M67L276
866E53r89J607o107L850M767o331K33K205n25L550o334o94R738o291l319M917
882H30Q65j899j453J093K044m34k164K73J911J258l583L68L093j452l3p53q81
899i17K331K581o149j05P661m173l730L772J344j587j251j671N272j213m620K736
915B81Q61J678m530p73O656m484j425L899n141M199K570r990P183K060o061L187
931A70j995K664L5m858M584n17j293K294o416P378J551j1752J0738k169m426Q767
$$ y = [5255, -6633, 6079, 2912, -5675, 5025, -1347, 2386, 4519, -7566, 5319, 4974, -6387, 4583, -1128, 890, 5621, -7775, 3040, 5445, -4407, 864, -600, 1551, 3819, -6596, 1368, 3704, -3653, 1892, -3579, 660, 4522, -6410, 109, 3314, -4052, 959, -1226, -2943, 3775, -3190, -2723, 553, -436, 1171, -4936, -1086, 3681, -2650, -2417, -212, -737, 2813, -3521, -4215, 5523, -768, -4087, 830, 1695, -204, -1657, -564, 1480, 1046, -1118, -845, 1066, 2324, -1259, -891, 2202, 750, 717, -36, -917, 1414, 3995, -2154, -2259, 5402, 1229, -2501, 1271, 2615, 1028, -223, -1894, 3378, 2165, -2455, 281, 1142, 2820, -1710, -2483, 4173, -311, -1736, 2163, -2978, 1221, 3791, -6199, 984, 3044, -3017, 170, -1825, 839, 874, -3984, 600, 83, -1210, 1084, -5332, 2046, 3597, -8155, 2583, 414, -4012, 4755]
947D755j0065K285R934j1348J518M762k681K867o991N491M109j0206P489j850
961F9j863P062j0778N120P999j4273Q825Q78q495J2398q172j715P415o167N585
976C888n220l307J4252j1772k073J1245j0115O372k812n919J5622j3091k218J3171
990H023j0445K960J015n201J0067r489J629P118j3405J2860k363j2524J7028q214
1004i41k931R443j3362J0616K044j5934J6219l115p513Q333p765Q778l489r177
1018h794J5841r515j299J0374j5474J1048K876j5057J6377q743k263J3406j7489
1031h712R297O236j4994J1893l799k027Q934j6003J2350L964j6870J5954o996
1044g73k372J2469j7164Q936N702j4057J4653q482m469J6584j7326O585O063j3477
$$ y = [4755, -5310, -3025, 6909, -4439, -2921, 1841, -840, 2027, -4964, 527, 4636, -5570, 1919, 69, -1794, 5268, -5510, -390, 7609, -6664, 2161, 3039, -5456, 6942, -1230, -2945, 4470, -1697, 3888, -1332, -4639, 9613, -2159, -4232, 7013, -3102, 3270, 458, -5461, 10161, -2930, -5148, 8023, -2422, 538, 1553, -3648, 6419, -3070, -1441, 5677, -7728, 5132, 2769, -9755, 7273, -941, -3872, 5571, -7791, 2825, 4869, -11065, 5154, 2039, -5474, 2859, -4906, 3872, 383, -8794, 7047, -2468, -3767, 6607, -8867, 2181, 5057, -10000, 6377, -2366, -4629, 8777, -8712, 585, 6821, -8173, 3720, -79, -2106, 6828, -9175, 3175, 7139, -9731, 6223, -773, -3145, 9324, -7840, 1096, 6798, -7259, 7394, -1088, -5557, 11027, -6299, 286, 6349, -7128]
1058g128J4747j0320j614J6696k0737O806J1474j7313J2394n828m984J7093j8058
1071f772N119P864j4072J4943p730o736J6003j4762P054M392j6922K0885r840
1084e74r456K1508j8310L652J0003j5721J5444p385r667K1664j5398P56Q449j4452
1098i487J7298p812r269J8091j5151O796P577k0910J8622j960j2571J8291j6131
1111f616N048J1113k0635J7639l548j3026J9760j2589J447Q775j8543J8891k644
1124E072j5850J9734j3084L378J1545k1560J4467Q76j0930J6483j6347L268J5050
1137A2102k1580J3559m23j2707K0160j6030J895J3908k2642J5660L202j7327J7768
1150G545j1274J48J4910k1821J1528K945j1623J7591j6041L19J6441j8526J0158
$$ y = [-7128, 7619, -2701, -4315, 12381, -8356, -1550, 9924, -7389, 5005, -823, -5807, 11286, -6772, -1653, 6211, -7861, 7082, -648, -7384, 8619, -6143, 911, 5303, -11619, 9266, -574, -10030, 11478, -6832, -3180, 6823, -8898, 6546, -839, -10506, 11158, -4240, -3484, 4965, -9487, 7811, -1, -9270, 8821, -6330, 466, 8043, -12867, 5755, 3795, -8776, 9515, -6616, -1568, 9545, -11090, 6549, 3001, -10025, 9735, -2854, -1407, 7368, -11175, 7716, 5072, -10778, 8956, -4128, -750, 10795, -10765, 3702, 4578, -6352, 10131, -6216, -2948, 12102, -9478, 4081, 3658, -9049, 11111, -4919, -3024, 10884, -11758, 3902, 7104, -10223, 7545, -3729, -3581, 11329, -10492, 1036, 3981, -7642, 9949, -6092, -5773, 10668, -7858, 2300]
1163B300p9j3656K2643j4249n197J8135j9142J1318L269j5615J7710j0251l159
1176e973J6460j8689P944M844j3504J9001j3374m553J8319j7070Q909J884j5838
1189a1640K1137q242q301J5198j5471J0926L426j8055J9176q423n299J6434j8317
1202g451Q156O184j6314J8235q018q907J7823j4977P025M856j7256J7926n052
1215B230p476J2577j4836R408O531j8694J5567m684o626J6508j8293O369R363
1228G944j7206J4194l853q764J5631j3210M071Q012j6719J4046l205p253J4345
1241H033j5691O168R772j7078J1983k770p514J6473j5058J670J1572j5130J1423
1254C853l299p834J5411j2722K507Q895j4494J1490j806r464J5990j2584Q54J1352
$$ y = [2300, 2221, -11435, 11208, -3041, -8238, 9897, -9245, 2073, 5342, -10273, 7437, -2814, -5973, 10487, -8202, -258, 4586, -8918, 10083, -3291, -7844, 10475, -6595, 2314, 4198, -11640, 9497, 1255, -7046, 8152, -7319, 3607, 7033, -11022, 8154, -269, -5568, 10866, -7451, 705, 6889, -9425, 8810, 792, -8115, 9708, -5269, 1756, 6612, -10644, 7282, 2230, -5246, 7331, -7505, 1903, 8434, -10260, 5307, 623, -6003, 10505, -7788, -1419, 7944, -9262, 4932, 1079, -7685, 7946, -5264, -1193, 6819, -9900, 4146, 941, -6312, 8033, -7658, -1490, 8282, -8796, 3187, 417, -7097, 9376, -5682, -4012, 7560, -7570, 3853, 554, -7280, 8131, -4591, -2084, 6811, -7683, 3807, 2001, -7463, 8527, -4057, -3203, 8149]
1268H149j4448R748j796q071J4836j0386j420R713j1946R797j816r749J5695j0619
1282b313j71R373j3353J0339j63j0805J3699p664k106R693j1982P978O29r931
1296f777J2862p648j147P719j1214R065P10j1183J2674n833k781R396j2431P847
1310A259K708j0432J0084m996j377P581j0571O488K854r887J0210n485j884R169
1324E721j1816O225L839r661Q196l410k041Q059r335L766M157p995P254m369q66
1339b276P880r874M495L522p779P590l594l145Q927q092J530M495o576O062l672
1354e07j680O928o689K156K340n331O891m481k913Q710p282J537L125n850N647
1369B601k185l470O172m129N21K172m543N786k929k948N978m894K078J281n149
$$ y = [8149, -6299, 3449, 1653, -6418, 8418, -1968, -3388, 6325, -5621, 4176, 2360, -7389, 8306, -2313, -2484, 6889, -6464, 3875, 3712, -7093, 6606, -1058, -3164, 6529, -5453, 2525, 3154, -6777, 6085, -1563, -2710, 5009, -6205, 2860, 3570, -7613, 5061, -772, -3553, 5843, -6588, 1259, 3967, -6465, 3619, -1377, -2754, 4827, -5744, 744, 3598, -6289, 3921, -1564, -3448, 5721, -6095, 130, 3969, -5692, 2504, -906, -2947, 5112, -4223, -457, 3700, -4295, 2959, -1410, -2276, 5604, -4270, 225, 3747, -4032, 3558, -36, -3181, 5746, -2346, -816, 3679, -2897, 3165, -507, -2187, 4741, -1948, 208, 2548, -2783, 4108, -373, -3286, 5424, -1858, -321, 2804, -3046, 2601, 416, -3054, 3118, -1011, -490, 1682, -2861, 2925, -4, -2952, 3026, -1868, 210, 1491, -3658]
1384c658N661j535l864N140k516j76K098l942L973j115k156L176k710J771N07
1399F54l911M407m02l264M016k830P80K851m987K947J042k389J154r36J525L08
1415I65k392K297l54j182K402k785J433J576l535K371M19j873J879j167k42J994
1431A806j666q08J294L34J89k560K014P87j572L73l58M06O30j474J89J679j780
1448e17o3P71K58o06j74K44o57J257m92j320J307Q51j207j051R89R39q90p91R38
1467b14j67N11r39n21K444j815p58K448j341j09N85j286J336L89j475P37o32J862
1485A055o37k268L268j427l66J175k322K809j23l541L792n74k289K970k180J341
1501F83P08k674K761q85j041K427l524K509J458m298L366j608j24L462n545K366
$$ y = [-3658, 2003, 468, -3396, 1744, -772, -948, 1150, -2792, 1181, 66, -2090, 1086, -1624, 147, 654, -3257, 1150, 748, -2516, 1500, -1330, -550, 2301, -2686, 261, 1303, -1086, 68, -868, 657, 965, -1427, 870, 516, -666, 1736, -1049, 384, 1960, -1575, 796, 1215, -658, 1221, 54, -188, 1806, 140, -668, 626, 960, 1149, -1411, 603, 1390, -182, 191, -167, 239, 869, -605, -416, 1263, -517, -580, 191, 449, -157, -331, -87, -744, 513, 21, -1299, 8, 859, -348, -1399, -410, 529, -361, -1152, -214, -381, 130, -809, -1330, 1114, -701, -1459, 989, -352, -461, 124, -1162, 174, 563, -912, -175, -807, 1055, 418, -1850, 1418, -9, -375, 800, -1522, 1287, 1164, -2377, 1415, 841, -1448, 1522, -658, 683, 1391, -1283, 1478, 593, -448, 1979, -1545, 964, 2422, -1876, 1490, -118, -242, 3220, -2325, 41]
1517D1K601m843L553p15j527K935m078K443J858n353M783j822j864M877n507K138
1533d80K651n079M094j351k798O136n205N08L309m550M661k715j607N523n858
1548b761J395M093o259N148j277l984P697o173M85M548o308M966r32m016O530
1563C152m181Q8L511n857N882j498m963Q197n626K20M777p316O121o32n784P902
1579C993m606r46N409p387N908l54n665P844n628P84M705q126N986Q46o900P870
1595C733m682o93O013q878N938J228p259P812m404o31N708q158N064J317o951
1610d843Q596n310j340P589r270M683K404p090P805m181j709P233q928M099K999
1625B737o954P614n339n98P969j0006M655K643p504Q632m465l497R071q173L365
$$ y = [41, 2642, -2201, 1352, 637, -890, 2045, -2033, 410, 2268, -3085, 1698, -124, -1988, 2889, -2618, -480, 2171, -2908, 1186, -165, -2963, 3173, -2032, -1524, 1785, -2765, 1896, -819, -2426, 3097, -2761, -1366, 2727, -3532, 1616, 339, -3645, 4052, -2121, -1636, 2912, -3396, 1570, 638, -3378, 3152, -1029, -941, 2570, -3287, 2595, 1097, -3866, 4331, -1295, -1075, 3702, -3614, 2507, 1875, -3909, 3993, -613, -1559, 3850, -3537, 2371, 2017, -3648, 4196, -1432, -648, 4057, -4069, 1917, 2763, -4137, 3733, -949, -1642, 4371, -4507, 1431, 2659, -4600, 3212, -1192, -1823, 3885, -4273, 791, 2108, -4843, 3753, -1557, -2897, 4692, -4578, 105, 2509, -4581, 3224, -957, -2666, 4567, -4361, -262, 2737, -4217, 3397, -1942, -2540, 5429, -4577, 78, 2721, -4783, 3849, -616, -4113, 4958, -3215, 150]
1640A50K894p619Q346l923k891P750p641L179L220p797Q587m601l413R839q634
1655b554K156L728p958Q743l380m646Q532o913K553L371q766Q693k814l921Q384
1670E208q923L608M330r232Q412k612n522R858p401J143M442q612Q539k315n351
1685d428Q126o902L154L859r764P940q86n063Q703q566J865O482r506P017j392
1700F39n242R004o724P00N267q766P589o11o523Q514o459J777N992j0440O367
1715A084Q25n608Q133o533l29P537q645N324o45n461R583o859PN969q632O940
1731B690M2o943Q722n908k98P367r664M956J135n668Q386o276q31O768p415M560
1747A623J07o350R445n508j787O666q468O031Q66p412P909l967j415O323p645
$$ y = [150, 3044, -4575, 3771, -152, -3043, 4707, -2934, 245, 3465, -4332, 4255, -346, -3759, 6080, -2554, -398, 3330, -4628, 4115, 735, -3911, 4621, -2292, 261, 3632, -5134, 3559, 745, -3176, 5208, -3715, -107, 4223, -5009, 3403, 791, -4731, 5127, -2274, -1131, 3311, -5301, 3238, 923, -4428, 3698, -3204, -50, 3809, -5955, 1985, 1099, -3964, 4739, -3827, -1962, 4520, -4986, 2031, 639, -4603, 4401, -2323, -1623, 3644, -5122, 2467, 1856, -4667, 3847, -2612, -835, 5157, -5283, 1084, 1909, -3699, 4434, -2099, -2428, 5109, -3536, 1788, 1143, -4318, 5265, -1594, -1587, 4382, -4250, 2690, 2732, -4211, 4511, -1397, -1695, 5672, -3992, 964, 2099, -3569, 4817, -1459, -2290, 4478, -2937, 1623, 1730, -4620, 4825, -683, -2470, 4196, -4272, 1759, 2625, -4787, 3122, -845, -2260, 4063, -3582]
1762c582L873J872o389P799n026j780O906p119M371R81p257Q460l150l118O536
1777C377p042M161K406p223O908l081j848O220p177L763K048o520P313l354k854
1792b903P215o974L102K702p021O824k216k705N629o297L107K890o548N745k674
1807a24j981O454o883K350L204o154N930k213l304O446n708J338L852o555N605
1822B257j944k816N989o102K194K995n887N126j573l494O811n625O35M175n931
1837c190N102j477l433N643m610J174K545m935M711j353k991N989n178R99L761
1852B757o077M881p91l892N600l608%L266m849M108k72l833N558m010O53K824
1868B315m995M365l53l945N238l061o79L726m984L237Q15l803M545k796r8K469
$$ y = [-3582, 291, 2163, -4226, 3573, -1453, -3233, 3673, -3446, 925, 1906, -5351, 3109, -41, -3159, 3377, -3665, 496, 2902, -4321, 2587, -494, -2342, 3878, -3299, 464, 2512, -4008, 3305, -49, -2903, 4312, -2662, 440, 3142, -3879, 2945, 729, -1976, 3653, -2644, 463, 3353, -3195, 2550, -124, -2105, 4349, -2534, -184, 3020, -3134, 2796, 583, -2721, 3725, -1983, -645, 3207, -3348, 2257, 313, -2503, 3486, -2616, -422, 2573, -3314, 1812, 239, -3255, 3556, -2069, -1434, 2741, -3190, 1912, 435, -2998, 2645, -1965, -791, 1754, -3181, 1530, 177, -2814, 3175, -2003, -1004, 2757, -3320, 1561, 770, -3122, 2478, -1130, -1130, 2136, -2713, 1395, 1123, -2710, 2848, -1162, -509, 2315, -2680, 1685, 1332, -2613, 2625, -436, -1115, 2611, -2373, 864, 1679, -2124, 2421, -375, -473, 1996]
1884A996l631K773J17l085M223k611l93L591n306K836J059l742L832k211l29K875
1900A994l554J618J239l084L110k202j67K938l912K280P82l195L394j889q16L229
1916A765l331R60J528k522K388j408l71K295k610J266M31j953K663j255j247K925
1932A524k794R24J294k382K106p12j234K304j303J06P42j273J778q09j300K099
1948A070j429R07M93k149K239l32j465J436p90j02R05r03M95j28n21Q94o89L74
1966C05K37j454J601Mj269Q89m85lR42j505O17P55r73J51J17j30r0J45L08j24
1986C8l05J05j82p8M50n15qL13L7l32K99l78N58M74j339Q56K99o41k4K34R3o1
2008a07j01k27N66m32M32k76j30O76q61P54J06q35J083n53r89K002j164l18J102
$$ y = [1996, -1635, 1138, 1255, -1830, 2393, -218, -611, 2980, -2326, 510, 1569, -2173, 1659, -552, -881, 1994, -1560, 58, 1297, -1787, 1323, -879, -1046, 1892, -2020, 260, 1042, -2153, 1241, -648, -1464, 1765, -1566, -606, 922, -1600, 788, -620, -991, 1304, -1306, -40, 391, -1562, 1101, -154, -1401, 1524, -1270, -346, 948, -1434, 672, -40, -1274, 1030, -273, -167, 575, -698, 1080, 271, -1029, 1070, -359, 548, 1041, -1108, 1131, 799, -666, 770, -20, -122, 783, -120, 375, 247, -274, 620, -69, 305, 542, -912, 689, 693, -576, 313, -172, -175, 767, -738, -121, 634, -339, -188, -71, -201, -291, -146, 162, 38, -267, -162, -344, -422, 28, -487, -495, -182, -145, -477, -178, -556, 2, 476, -863, -7, 292, -349, -373, -139, -46, -107, -208, -435, 131, -301, 131, -145, -275, 401, -460, 294, 400, -435, 648, 95, -894, 1108, -56, -374, 728]
2027G28q83P68n46j72J062j052J38P78j088P43oj181J798j360N8J285j630J078
2045E18Jj440J392k59q37J199j306Q89l64r65K208j495k12J561j818J111L71j995
2063a441K069o19r96J948k005P94J033k014J722j008m6J451k223J520O51k347
2079a511K227p05j048K522k895J534Q19k145K142j010o91J994k115R97J010k179
2095a054K194j233p13K758k936J027J165k635K582q58j269K877k669O15J814k639
2111i74K073j154q19K601k608J194J163k693K425r33j687L477l010O45J636l278
2127a942L233j023j709K999k622O14J434k657K740j070k068L981l078M32K372
2142A636l730L067p71k215L403k452oK534l534L048o78k337L475k721Q15J881
$$ y = [728, -155, 613, 67, -105, 957, -95, 43, 821, -267, 476, 470, -711, 1087, -273, -215, 1070, -560, 518, 519, -921, 471, 212, -625, 574, -732, 157, -207, -1172, 1036, -459, -671, 890, -928, 183, 554, -1441, 628, 9, -987, 961, -1044, -250, 783, -1231, 491, -517, -563, 888, -1335, 185, 836, -1511, 716, 11, -1037, 1485, -1410, 124, 943, -1202, 940, -70, -761, 1233, -882, 115, 1125, -1054, 1140, -93, -806, 1952, -984, 43, 1208, -1427, 1155, 297, -972, 1905, -764, -149, 1665, -974, 1099, -55, -874, 1727, -881, 313, 1476, -1217, 1208, 275, -1412, 2065, -945, -300, 1336, -1942, 1291, 268, -1441, 1558, -1064, -450, 984, -1673, 1067, -3, -2071, 1910, -1168, -736, 1636, -2094, 973, 202, -2013, 1390, -1062, -1068, 1466, -2068, 980, 302, -2035, 1440, -1281, -466, 1415]
2158A415l939L556l86k760M039k809lL005m017K899j48k535L737k933M32K227
2174A780l342K687q4k962M157l082K17K880m209K794M24l162L895k873J00L328
2190B548m129J951P66k922M131l017l16L251m169K791L11l540M356k309q23L405
2206B285m283K272R53l545M095k593p44L720m338K403N60l003M055k171j711M103
2222B058l924K021J127l883L999j384j356L363l719J701J507l600L717k253j221
2237a847M439m107J766J360m150M549j480k186L596l021J396J466l972L653j060
2252D02j520L423m057K021J596l908M004j530k307M745l851N76K066m131M212
2267A741r60k336L706l552J573J797m276L342m33k095L849m051Q77L080m386L171
$$ y = [1415, -2524, 1032, 646, -2114, 1925, -884, -887, 2118, -1899, 1000, 852, -1683, 2054, -879, -447, 1780, -1562, 1125, 1041, -1921, 2236, -846, -629, 2251, -1958, 836, 1260, -1902, 1993, -880, -780, 2548, -1581, 370, 1136, -1786, 2345, -672, -988, 2263, -1906, 885, 1196, -2344, 2012, -297, -1120, 2285, -1998, 274, 1227, -2318, 1777, -816, -1560, 2160, -2178, 225, 785, -2218, 1837, -334, -2045, 2058, -1866, 155, 1282, -2601, 1398, 14, -1342, 2021, -1698, 3, 1510, -2090, 1627, -626, -1847, 2592, -1515, 251, 1611, -2539, 2010, 530, -1656, 1940, -1081, 315, 1781, -2191, 1462, 402, -1118, 2305, -1752, 269, 1865, -2043, 1961, 431, -1876, 2869, -982, -406, 1660, -2471, 1741, 781, -1555, 2151, -1401, 172, 1969, -2307, 1035, 602, -1493, 2356, -1695, -818, 2262, -2124, 1047]
2283A047r28k063M190l320L82K329l702K932l50k411L738l359R26K376m384L263
2299F66p0k379L862l306J86L349m290K744j97k655M021k688J38K066l248L042
2315A241j61l039M134k920j66L087l927K300N98k883L825k588n51K826l236K218
2331G58l0k638M052k243p26K514l427K660M58l310L517j949k45K774l352J510
2347C23R05k886L198j887q01K675l198K299J80k778L472j818r57L035l592J813
2363a7J467l412L053j539o53K558k856J339Q30k454K587j427o79K560k933J608
2379C2J249l322K963p98j390K884k905J078J386k345K198j112q83K481k375R91
2395A32J192k698K601r44j352K750k557O22J691k923K243k86j217K202k022N01
$$ y = [1047, 119, -1944, 2246, -1074, -692, 1637, -2065, 867, 517, -1894, 1844, -1515, -589, 1787, -2597, 666, 596, -1783, 2079, -1227, -1041, 2308, -1982, 762, 565, -2090, 1931, -757, -619, 1447, -1801, 1241, 1080, -1959, 2175, -745, -911, 2176, -1751, 549, 1147, -1736, 2089, -499, -1050, 1776, -1460, 758, 728, -1910, 2142, -101, -827, 1687, -1740, 920, 1378, -1932, 1585, -364, -609, 2165, -1187, 323, 1228, -1658, 1540, -347, -1148, 1527, -1671, 628, 808, -1970, 1502, -316, -1273, 1762, -1830, -17, 1450, -1962, 1091, -448, -1101, 1457, -1399, -60, 770, -1684, 903, -524, -1203, 1357, -1576, 32, 1281, -2041, 922, 124, -1266, 1618, -1287, -209, 1177, -1168, 1030, -82, -965, 1516, -859, 132, 1324, -1374, 1227, 283, -1069, 1681, -876, -254, 1437, -1486, 757, 471, -746, 1456, -566, -65]
2411f5J044j727J512m66j502K553k110M11J354k379K174m38j508K151j406L5J180
2428H13j678J497k35j262J783j403M24N95j806J874l06j416J928j354J25J202
2444G81j850J212j62q35J214q12P0R73j512J269m80q18J556j075K75J062j908
2461a040J206K91j202J480r75j01R57j096O26J24r65J459j047L41J039j684R36
2478C49r7m63R40q28n2J370j479M46L19p23J089j283L89N26q82P78m22n99J220
2497E98q81j7R60j018L59L45p35Q83n06j04J80m71M62k10k61O41l98j07M65o01
2517d16L60K39j012J043n69J46L33j11j27J7j7r4p0O4L18k89L47k34l59L71J17
2538E7n9n0P7j45M77l03J89P3r3j72J4j3j75K67o2J5K51k57NJ34p3J23l03J07
$$ y = [-65, 979, -748, 764, 298, -1204, 1349, -761, -350, 1004, -1375, 799, 361, -1147, 1004, -402, -367, 813, -865, 632, 397, -865, 918, -485, -61, 534, -1272, 602, 296, -1120, 808, -546, -421, 781, -1069, 143, -19, -854, 360, -452, -382, 591, -921, 348, -132, -950, 606, -469, -194, 868, -1040, 166, 457, -745, 735, -240, -341, 616, -480, 146, 270, -695, 764, -283, 58, 1097, -587, 349, 252, -211, 729, -99, -151, 1219, -260, 186, 505, -218, 871, -412, -23, 503, -379, 399, -23, -622, 598, -283, -300, 660, -358, 1, 346, -389, 494, -12, -116, 64, -407, 55, -155, -416, 225, -173, -280, 185, -416, -56, 183, -829, 214, -355, -209, 124, 13, -114, -97, -114, -208, -278, -214, 104, -185, 162, -72, -431, -60, 57, -2, -52, 25, -120, 357, 54, 243, 316, 223, 51, 65, 52, -123, 144, 82, 97, 348, 91, 96, 230, 157, 280, -23, 84]
2562H4K48k04K8p7k03K90l61K70K27m55K27k4o7J5J0K6J40m04K51m1l49N13o91
2585e47M85L10n74M43k01l35O58l33l96N93p33O96k13l97O19n60L23L71m28M14
2605A95j16q84J204q26Q7R03j240Q39j01o01J123p37m0P14q81P55Q7j150J322
2624F53r68K75P46j085Q31O8j118J208n81k76Q37j081R45l6p89R09n31RO17j170
2644e37J042m0j148J333p13l36J266j616J118J2j180J294o64j90R41j222N16M06
2662B82j390J641r83q7J391j714O60O38j521J642j013m26J396j121M77P96j597
2679i29J373o41q14J938j757O64P23j529J444n36q92J932j448L74R71k050K075
2696H98p03o88J554j488N64N97j710J919q43q11K180j929L09J103j845J919p85
$$ y = [84, 332, 128, 156, 79, -124, 166, -195, 75, 302, -153, 74, 50, -17, -2, 8, 34, 174, -230, 21, -20, -369, 144, -547, -62, 248, -326, 117, -84, -419, 239, -94, -490, 103, -630, 66, -147, -544, 75, -485, -162, 209, -219, 195, 79, -805, 399, -427, -340, 563, -677, 162, 61, -540, 583, -154, -194, 520, -361, 394, 481, -669, 653, -315, -40, 706, -379, 452, 520, -598, 610, 29, -247, 590, -491, 454, 418, -371, 538, 7, 16, 633, -537, 505, 465, -683, 650, -63, -399, 867, -749, 369, 381, -799, 495, -169, -359, 582, -640, -124, 282, -1108, 533, -450, -537, 854, -860, -200, 438, -1083, 559, -454, -880, 516, -605, -128, 668, -929, 444, -197, -1011, 927, -830, -166, 557, -972, 472, -64, -956, 976, -472, -98, 873, -1177, 898, 195, -493, 1061, -427, 137, 734, -976, 943, 100, -711, 1469, -460, -151, 952, -893, 1026, 241]
2713B41p58J663j440M70O74j682J478l59j067J940k113J143N30j631J560n51j090
2730i92K030j825O32J034k069J452l67r19J703j498K85J526k327K047n03j429
2746a220K060j679M16J507k428J806l65j056K090j779J95J375j793J364j33j581
2762a221J886j352J33J572k063J407J70j395J864j308m74K030k260J338K91j652
2778a034K562j899j50J572j937J260J08j352J747p99m10J627k350J218P73j755
2794h19J803j343m56J935j692P70m4j265K124j172n99J587j894J362L47j894K164
2811I14j052o59J646j826Q34O89j639J705p88p88K022j979R15L96j674J988p07
2828cp08J677j858R18Q95k170J907r07n51J689j656P80O86j417J479r47o60J996
$$ y = [241, -517, 1146, -294, 176, 850, -832, 646, 287, -780, 1160, -953, 190, 720, -911, 649, 98, -992, 1038, -787, -155, 879, -1190, 262, -105, -1024, 679, -819, -534, 992, -1335, 712, 209, -1220, 840, -839, -423, 1084, -1344, 462, 97, -959, 1131, -648, -453, 922, -871, 493, 360, -1221, 665, -687, -554, 1018, -1045, 362, 532, -863, 1001, -307, -781, 1249, -1011, 327, 618, -1034, 1528, -371, -521, 1051, -886, 374, 482, -870, 877, 78, -332, 1295, -1055, 163, 936, -819, 984, -359, -815, 1120, -572, 198, 154, -1111, 1013, -159, -758, 829, -1065, 297, 644, -1250, 914, -138, -797, 849, -977, -143, 546, -1093, 612, -176, -964, 1058, -921, -6, 390, -1284, 704, -3, -711, 966, -892, 26, 921, -1249, 658, -249, -800, 889, -767, 13, 699, -718, 761, -186, -846, 1150]
2846A150j961Q03R63j864J943r49p43J592j439O17J096k061J456m11p82J595j678
2863f73M30J121j784J725q03n67J590j543L13R38j469J655o47j084J613j479K62
2880d02J068j607J576l78q63J445j665L18J327j910J455l16r42J601j164Q9P77
2897D09j027P62J2j040J414j167L99J076j864J602m49p50J396j331M27R40j406
2914e97J171l79r72J549q85n6R34j583J244N9j135J301j010L59P61j256Q49L71
2932G25j558J536p10m64J187j359R77J15j064J175p19n8R14j375J178R4j143J170
2950F21r19%J132j286N63L24j068J193j211J75J200j326P24J96r91R81o17m3Q33
2969D81j202M03N34q16P52l32m45R49r71P85lr09J330m72m25P93j083O04N38r33
$$ y = [1150, -811, -8, 955, -909, 1034, 85, -658, 934, -505, 112, 1208, -853, 603, 192, -590, 1005, -673, -243, 878, -906, 819, 16, -551, 1039, -504, -191, 747, -722, 933, 286, -798, 815, -664, -402, 666, -941, 635, 257, -606, 839, -826, -508, 819, -1091, 364, 48, -894, 707, -457, -368, 409, -618, 144, 156, -884, 530, -637, -238, 838, -1026, 576, 127, -623, 773, -558, -131, 809, -597, 574, 195, -777, 772, -113, -169, 765, -818, 426, 485, -650, 651, -359, 0, 761, -495, 354, 725, -833, 703, -7, -471, 716, -643, 334, 449, -615, 560, -159, -217, 697, -678, 500, 594, -549, 621, -298, -298, 834, -452, 111, 435, -633, 560, -651, -476, 724, -602, 122, 318, -673, 308, -309, -352, 481, -721, -318, 216, -600, 152, -180, -625, 324, -647, 138, 135, -774, 556, 84, -341, 452, -631, -27, 511, -422]
2989d22Q21k46m19J132j133L43J17o56Q57l38m50R58o60J17K16o65R20o65MP33
3009E64j000N86M68r32O56k08l34N71l61J89K46r28R53m26k81P20p01K94J04l97
3029b17L56k7n64O24o00L14L78p06N42m08L63j2k26q0N54o45L56J27m40N22k34
3050b3n3K62m70K46K7q9J59k41O1Q3O1P6l41R2L84k63j11N21l65J02J92n19O2
3073a47J28q4Q8j23K51n2l6J80j57J53K27n40L61p9k50J67L4l35L88J07j80J13
3095B14k45k22M34j52N6L5j15J05p6j27L2J51j80J76l87L16j33O9N3k29r9J76
3117a48N5k40M32j84m9J50j13k89K77qL03m52K84kl44K58l7l5M17l27J59K11m61
3140a43M89k58J88k95j51K37J71m52L50k5p0K54m06O6L94n90P21k25l67L29j69
$$ y = [-422, 399, 153, -266, 866, -267, 76, 193, -463, 394, 56, -394, 564, -96, 21, 237, -428, 492, -173, -169, 564, -436, 150, 618, -314, 342, 134, -200, 371, 10, 199, 445, -483, 470, 44, -237, 483, -218, 76, 180, -217, 139, 112, -452, 172, -428, -114, 264, -442, 100, -308, 55, 43, -183, -263, 291, -354, 2, 129, -311, 211, -23, -76, 186, -284, -38, -11, -100, 59, -182, -121, -38, 23, 99, -242, -150, 234, -29, -140, 381, 16, 118, 310, -209, -147, -19, -103, -15, -138, 113, 61, 25, 205, 48, 201, 428, -112, 249, 170, -80, 87, 121, -214, 174, 281, 101, 214, -31, -253, 181, 29, 85, 120, 5, 110, 34, -93, -61, 90, -90, 86, -301, 15, -118, -49, 4, -225, -324, -148, -93, -333, 99, -85, -134, 16, -97, -386, -109, -117, 186, -266, 18, 16, -328, -70, -107, -142, 275, -52, 107, 318, -143, 346, 88, 276, -19, -170, 67, 238, -214, 136, 111, 41, 295, -111, -45, 349, -241, 480, 255, -112, 217, 48]
3161D8M6R3l11L12l0l71P04p84N15j08l50M23j82l47O33k36oL29n18K63j75k43
3183b95K37j31J37L00m29L25k30l67O44n05K98J85p20N97n1o07O05m9l05O87o19
3204b93L30j45m87P92l04K0J96l20L86j00m72P41o34R9N92n54K80M53p91O96p74
3225b89L22K49m77P35m20n08R01n05J53K95o28N52J3o81P69n84j17Q49p72K33
3245I0J46m15N00l16l15P93q05N17m8n25Q41o65nN03n74n2M97n80P90o57j8P58
3267D60j010O62j1q28R88m11k46Q45j138P17J43n31N94k47k71N10r14P73J94p75
3287d96Q69l42n89J089r93O80J70q99N98j25j75R03q20K34K26o12P14k59n70J030
3307F33q44L72N39j117Q40m99O0O14r65K12Q13r60R04o46l26Q75q13M69K08o02
$$ y = [48, 94, 187, -124, 188, 158, -213, 491, -293, 222, 114, -236, 187, 5, -342, 291, 55, 49, 378, -140, 123, -52, -295, -58, -189, -52, 248, -181, 144, -86, -453, 191, -314, -16, 169, -551, 46, -5, -612, -7, -56, -361, 326, -293, 37, -108, -595, 197, -107, -87, 109, -211, 175, 75, -397, 344, -290, -191, 401, -153, 127, 580, -211, 485, -289, 33, 282, -195, 540, 120, -388, 513, 8, 161, 456, -172, 380, 393, -288, 481, -103, -220, 629, -143, 90, 236, -179, 321, 5, -310, 483, -322, 195, 147, -378, 463, -202, -207, 296, -278, -330, 167, -413, 377, -280, -298, 460, -550, 112, 101, -727, 261, -150, -396, 449, -689, 28, 171, -360, 234, -13, -284, 226, -688, 85, 279, -496, 373, 31, -558, 531, -462, 218, 388, -511, 87, -38, -213, 690, -130, 104, 330, -282, 432, 173, -397, 633, -211, 161, 700, -417, 423, -76, -16, 598, -367, -155, 658, -302, 602, -44, -370, 505, -308, 161, 369, -233]
3327b33M72k70k34O93p05K85J73n16N34j92m35J064q71J62J97n00Q20k21q77J020
3347C66m70k65Q41j053O91j40m02P95p15N20J23q79Q55k66o05J341j109L91L75
3366C94r29Q88m61m68Q88o61L60L95r68Q70l5n42Q80n94j03P30q97M14j36m05
3386c80J172n78n4M78j178P48p9n18P64n10J35N55j195Q23J97p26Q06n34j79O83
3406D30n23L73p5m94P55o11q9O04q52N11J07p49J112n01n35J193j018L64R7n25
3426d26O86m94j41M26n56L77K65p10J137n67k63O15m91Q6J21m64P32n92k33Q37
3446C45o53L08M75q19O66j73j40K50n50M26J63n54P94j47p19P88n72J63K77r90
3466f62Q83q8j63M60l34k61M87p44O64p5m41P09n64l1K40m20N56j50k48L53l67
$$ y = [-233, 239, -31, -265, 428, -277, 8, 181, -335, 199, 7, -428, 636, -235, -73, 124, -376, 444, 223, -654, 366, -104, -369, 472, -581, 110, -30, -432, 363, -352, 168, 291, -588, 267, 1, -604, 737, -372, 19, 394, -535, 353, -108, -576, 312, -349, 11, 406, -562, 308, 273, -269, 611, 17, -86, 644, -253, 161, 25, -380, 792, 214, 160, 638, -540, 208, 129, -389, 375, -135, 0, 555, -640, 183, 380, -346, 460, -74, -253, 430, -93, 280, 205, -289, 466, -145, -234, 370, -482, 29, 136, -613, 499, -2, -537, 656, -362, 2, 99, -426, 260, -234, -375, 51, -505, -128, 137, -573, 564, -3, -266, 349, -142, -56, 65, -399, 333, -259, -492, 345, -308, 0, 475, -344, 322, 149, 9, 259, -291, 135, 298, -256, 538, 391, -328, 460, -112, 51, 328, -662, 221, 133, -30, 430, 96, -165, 322, -422, 242, 167, -274, 435, -129, -160, 80, -340, 216, 66, -182, 171, -196]
3487a96J92P6n65J95K96l80Q89n92K60k5k78J8J61m64P33m62n4M77q14N10J33
3508A10l32L43l96L09K08m50L75j69k73N89m56L3N01q08N59k32k13O44l88J70
3528A24J92n99M29k35k67P08l54k8K88m13L96q6k14K18Qk89L91m59J39K76k98
3549g3Q5k45K92K0j77J05K18m76L11k31j41K30j85K79r9j7M16m16j97L93k71J94
3571A5j35K4R5r0M7J48l24K01j14K9J50J15l00J72j33q9K40k76M26j55l05M13
3593A54k36P8K48m38J49J71k12K21l48K58J82n64M52n5k47L53k05J95j33j04L6
3614d5M9j87M22j38J2q9q3K3R0K63m17J95j33J76q7j14J81J06j27j92p4M8K61
3637A40j80Q6k44K43K36k66k4k99K64m1m3J31j32Kj50L59p1k84K25r7K37l00J60
$$ y = [-196, -4, 72, -493, -298, -2, -382, 507, -85, 175, 150, -128, -110, 51, -413, 320, -142, -196, 281, -533, -23, 110, -222, 121, -275, 34, 242, -208, 167, -2, -275, 314, -142, -109, 392, -416, 143, -89, -302, 342, -46, 124, 316, -283, 146, -89, -356, 352, -2, -30, 258, -155, 241, 155, -59, 159, 167, -122, 269, -190, -51, 225, -73, 12, -233, 59, 79, -98, 7, 225, -251, 60, -171, -312, -82, -267, 12, -87, -104, 312, -104, -301, 92, -179, 15, -120, -96, -1, -91, -44, 104, -220, -19, -133, -104, 46, 161, -139, 33, -100, -189, 51, -225, 201, 46, -259, 154, -82, -4, 244, -194, -45, 126, -86, 135, -213, 45, 227, -337, 115, 60, -187, 166, -39, 156, 23, -81, -45, 4, -183, 239, 101, 113, 24, -59, -36, 54, 317, -100, 95, -38, 138, 51, -63, 118, 224, 97, -95, -169, -121, 140, -40, 46, -198, 45, 281, 15, -9, -308, -44, -85, -128, 3, -129, -127, -277, 82, 11, -273, -48, -145, 92, -208, -48]
3660d8Pj33J62j7j2n4O4J2O5n4J44lk03J50k2P6j60P6P5p1l17N03Ll60K53j18
3686A8K2K37j72J36k49j77M19j66r9j45M9J57m6P4OM1j44j08K10j16K12k18J5
3709d4Q1K8o8n6o1K21k42J57j08K3l0K1K25k35j37J34N6l2M38q38N65k91m0J66
3733f7P5m5N6k48L62k26j15M33k72J46K47m89J57Nr2n0k5K60P5k62L12k85k89
3756c37N43l18J1L16l04K31j95r9L21o2j81K90k34J73q6j02J56j47j36J68j32
3777a24L02j62j21L91m40P7K48n24K68J85m15N98m14o9K52k20J09J30m32M68Q8
3798A95k29L33n34R1K53m41M24j36k88O61n10K08L06k56J96n19j77O80n97L41
3818AJ95m86M62j16j54L77m24J14K10n76O27k44j34j9q4K30J80l58N98j58l02
$$ y = [-48, -41, -174, -12, -29, -41, -95, -31, -19, 46, -8, 136, 133, -70, 80, 58, 134, -26, 50, 125, 54, -263, 240, 243, -117, 136, 18, 40, 277, 105, 241, -8, -185, 234, 68, -31, -176, -127, 30, -16, 58, 64, 105, -39, -147, 63, -53, 159, -59, -44, 37, 65, -3, -59, -120, 101, -141, 16, -92, -69, -99, -78, 147, -88, -225, -91, -35, -67, 371, -467, 98, -193, -233, -67, 8, -37, 19, -229, 133, -93, -208, 225, -47, 99, 346, -143, 14, 19, -73, -123, -148, 112, 187, -75, 237, -48, -337, 206, -112, -101, 215, -89, 142, -53, -152, 169, 107, -74, 216, -18, 155, 69, -33, 123, -24, -160, 8, -124, 178, 16, -105, 286, -154, -77, 171, -353, -85, 100, -315, 283, -131, -200, 52, -168, -59, 71, -361, 107, 195, -34, 299, -235, -144, 109, -332, 92, -44, -332, 329, -181, 27, 333, 77, 273, -246, -423, 257, -340, 1, 196, -290, 172, 56, -98, 279, -145, -31, 179, -397, 230, -14, -148, -167, -251, -21, 159, -199, 399, 241, -61]
3839f1N30o21oM05k91L05k22j60N57p39Q0K65j33M54j60l67M30k02k46L75n31
3860c38M63k03j71M52l65PK96n46O47j74l83L00l95K80J98k45K36j06l77O72n43
3881b95J8M95n02L79q3l63N69n22K03M23o20L84o8m74P21n09J37K35k51L24o8
3902A33k96N61m76j72M32j52q3L19l35K19k7k33K60m83L43J5j48L68p8n10O67
3923C24o25K74K8j00M52m19J62J06m12J50K09n26N75j44k23L32n36K45N12o97
3943c13M33r7l86P32m19J4L84n14K20j03l8L28j96j77K06n25N21o3n08P27l58
3964a32L3R0k76L70R4l87L07k04K58J66m69J97j8j49M88m33J74K7k53L70j16m87
3986c50N64l78J5O03n96J93P7j07M03n05j03M89o21L41R7n19L70k29J58O7k98
$$ y = [-61, 469, -152, -158, 247, -44, 261, 39, -121, 436, -303, -223, 42, -91, 363, 203, -164, 266, 64, -182, 193, -338, 125, -78, -249, 203, -162, -155, 141, -405, 242, 68, -315, -15, -410, -130, 68, -177, 59, -47, -424, 248, -295, -277, 218, -284, 95, 12, -351, 218, -304, -101, 322, -298, 86, 18, -456, 265, -244, -107, 128, -123, 201, 133, -163, 398, -78, -250, 182, 30, -53, 266, -69, 150, 123, -110, 150, -333, 10, 25, -123, 245, 167, -343, 324, -301, -27, 1, -99, 353, -66, 96, 202, -210, -60, 149, -377, 198, 54, -169, 163, -373, -128, 384, -313, 120, 23, -363, 369, -50, -36, 348, -166, 54, -49, -87, 241, 45, -132, 74, -451, 70, 7, -501, 226, -132, -99, -9, -285, 85, 179, -208, 99, -105, 153, 319, -150, 47, 29, -120, 368, -65, 109, 136, -117, 253, 137, -350, 214, -164, -149, 454, -142, 51, 128, 21, 424, -81, -184, 305, -316, 25, 122, -397, -27, -256, -98, -31, -329]
4007c29M65p0j34L18l85J16J38l22K69J70l27K37m02J37J79l43N63l51l02L66
4027gn5J10K1m38M37j7k63J43j71J60K7k35K68o0l4K77k14J30o2l55M10j33k22
4050b83N81o05K75Q6k10J47p2r7M98k63lJ79k34q9J89r0K12j81p3L58m55R4J17
4073H1l48M19k4k50L84k95N9j01K27R0q9k40J51k14K28k13J13J73k61K9J34j6
4095C7j02J48l34K78p9l57O61m83K11J46l86K09L7j71L07j79K4q2J07K7o5J09
4117F3K67m83j0m9L4K10J16j85K33k12n2L24m39L39l91K48P0j19K60j82P7J74
4139B93l31O7K24k57p4K80j37L6J24k34J37j98j77K2M07j36j71o3M00m53K95K31
4161B85l86J38j05j32K13q9J09k00m0J82q2J99N8k41Q5l18L12L8k4l42M48N8j62
$$ y = [-329, 136, 66, -68, 250, -135, -19, 119, -203, 66, 236, -91, 146, -256, -119, 60, -283, 280, -71, -373, -7, -62, 48, 69, -369, 68, 51, -212, -69, -240, -80, -53, -288, -20, -80, -114, 163, -51, 79, 17, -338, 72, -61, -283, 298, -307, -32, 54, -156, -9, -81, -178, 320, 57, 54, 233, -1, -90, 99, 9, 221, 40, -33, 325, -130, -36, 81, -267, 152, 128, -122, 262, -33, 26, -75, 152, 242, 153, -87, 64, -150, 78, -135, -22, 151, -110, -81, 53, 37, -65, 83, -251, 27, -52, -409, 252, -231, -20, 126, -260, -51, -14, -185, 122, -57, -33, -115, -8, 19, -46, 63, 330, -153, -163, -212, -178, 32, 148, -37, 196, -16, -68, 256, -183, 156, -235, 13, 83, -36, 224, 42, 119, 293, -38, 29, 253, -4, -78, 202, 65, 101, 225, -9, 128, -70, -247, -225, 182, 46, -125, -188, 212, -241, 54, 285, -101, 37, -68, -200, 13, -76, 33, -167, -207, -25, -107, 92, 150, -91, -6, -324, -12, 26, 2, -340, 108, 166, 4]
4184Dr9M4P1q9K14r0J1OJ36k3k63K96k50j93M3L66k30j02Q4J0m3J0m6J67l7L28
4210C25k26K3m7oJ08Nj99NR5q7J74q8L5P4r6J67l28J98j09j46K37J15m16K62j55
4235h0J42l7k23L02k65P6J18q3M0n6j53nL37m6l8J1j33K58k61J39j1j35J87r4
4259a0k10K11k48J15l9N6J67L4m7mp2O3K6j15K36p0m27O37m54R5J59k3K17m16
4283a19K17R6l52K72L8l55K33o7J09J73m02K96m5l42O41n19L9K90j44O6n0k36
4305a61L54j20k48N26m18L3R6k99L10k90J45K93l22j96M71l82K54O4j41j85K85
4326F9l45N97l73L59m49k3J73r8J9J05l27K82J28m13P40p39M75k64j73N88l81
4347e0o5M39m68R3J23j66K55J11m68J13K91m4P2m72M53p1k48K70k47K2R1k98K70
$$ y = [4, -95, -51, 20, -69, 145, 55, 66, 72, 208, 185, -78, 218, -32, -225, -182, 184, -46, -148, -64, -54, -97, -87, -133, 34, -3, 325, 99, 122, 75, 69, 177, 182, -17, -12, 83, -4, 170, 82, 117, 191, 95, 262, -66, 132, 23, -123, 114, 229, -187, 75, -80, 62, 25, -198, 104, -161, -85, 33, -50, -10, -66, -219, -224, 113, 67, 29, 40, -93, 165, -96, 43, 32, -103, 84, -10, -220, -9, -257, -142, -181, -125, 42, 76, 29, 25, -47, 16, 42, -73, 163, 93, -334, 303, -151, -56, 103, 80, 297, -119, 98, 194, -158, 114, 152, -203, 30, -37, 72, 245, -157, 139, 94, -248, 393, -126, -87, 203, 59, 125, 75, -161, 193, 73, -175, 351, -67, -34, 62, -237, 73, -217, -72, 221, -101, -297, 174, -208, 46, 110, -31, -216, 69, -276, 321, -52, 307, -142, -165, 8, -90, -71, 34, -293, -11, 117, -296, 444, -295, 180, -84, -257, 331, -50, -115, 324, -144, -51, 72, -94, 161, 272, -196, -83, 208, 164, 236, -236, 217, 146, -102, 168, -79, -57, 34, -264, 6]
4370FO8k48M79m54R7J00k37L97k9o4o4k74K32L6k64M06k81j84N55m27N7J84l13
4393b22K43n9k37L92j99kK23k54K80K3l33K20k41j35K87l62L75j32k60L95p0j84
4415b52N15n05J93K37j76K62l83Q0P2j45K17k29o4N78l71J5K18m23J09K02k50
4436a00J49j67j36M45m00K76K52m15K85k74k0K53j9M8j62j57M43q2l66L23k29
4457e3J18o7o4K88k89k60Q34o62N8K78k99J81j38R4K55l54J8K84m17K95j16j07
4479a23k8j12L07P7l60K60k54K18L8l21M18j8l41M13j27j40K65k52R9K32j90M8
4501A09R5l43K35j41J16J53m58N43m55O8K77k96J05J28l32N73k45k15K86k72K45
4522A76q4j27J01n7k31L93k75O9K47m56M17k99q6N35n03L74k39K3J27l0j80M10
$$ y = [6, 74, -174, 305, -149, -52, 48, -189, 208, 179, 115, 51, -223, 9, 45, -219, 187, -94, -278, 277, -150, -93, 91, -222, 21, -38, -275, 117, -82, -84, 139, -115, 165, 188, -145, 75, -166, -301, -14, -376, -1, -133, -393, 2, -68, -252, 263, -242, -49, 188, 12, 274, -109, -29, 43, -102, 115, -114, -178, 400, 29, 44, 262, -161, -52, 150, -100, 49, -118, -254, 191, -209, 67, 319, -96, 189, -85, -105, 148, 129, 177, 15, -142, 301, 219, -147, 176, -53, 65, -2, -66, 222, -67, -327, 507, -155, -97, 181, -118, 63, -75, 19, 274, -80, -62, 222, -195, 100, -16, -123, -151, -263, 44, 121, -239, 21, -233, -15, 23, -298, 120, 102, -239, 174, 47, -93, 172, -80, 19, 251, 61, 109, 204, -139, 96, -45, 71, 224, -234, 309, -146, -78, 199, -97, 8, 136, -196, 377, 132, -83, 203, -69, 176, 92, -35, 66, 9, -222, 171, -104, -35, 212, -244, 173, -126, -212, 323, -180, 194, -45, -22, 105, 75, -105, 305]
4544C05l37j27K96k19Q8N1j79J65M9j1P3j65R8J47m27J99l28M96r1k51K69J49
4566B50n06M40l51J93L66o54L56r0j50L35k20p5M85p10O16j96l24P82n30J09K1
4587A47l7j40K48k55P7k39Q2O55o17q9K01k68L14j24n5K78j75L3J53l61L59m21
4609b34K11J05j48J87j19l30M91k88J61p9l9K29n1k4k15K98k03J45m62K33j11
4630b43K52K49k62j72J87O6j05J19k5l02K88q4J98j85p0J04j61J84j71K84j0k75
4652a34k6L79l71K93l73K10J79j29k8L8k44M73l63J17oj28M6J21j13J1K3Q6j42
4675h1J7n9K1J92L23k76pJ89k19j25Q5p0l6j0J43j4j47J55j70J37k59j4K88o7
4699do4P9J06k06K63l42M5O5K02mj44j00K63L9k92K88n96M22jn6J72j14O2p3J02
$$ y = [305, -32, -159, 137, -82, 6, 57, -122, 43, 92, 81, 154, -11, 87, 234, -193, 6, -322, 174, 83, -168, 101, 250, -256, 184, -167, 26, 392, -262, 94, 4, -146, 189, -31, -106, 379, -331, 285, 89, -235, 547, 17, 126, 147, 110, -30, 218, -37, 40, -199, -117, 538, -79, -168, 33, -235, 79, -45, -100, 178, 3, 36, 189, -172, 187, -234, -23, 82, -66, 121, 2, -328, 163, -125, 36, -43, -82, 147, 96, 72, -143, 155, -48, 97, -365, -132, -243, 9, 258, -4, -176, 11, 77, -28, 91, 66, -236, 52, -32, 166, -19, -89, 15, -146, 38, -133, 151, 141, -134, -160, 219, -152, 141, -232, -22, 157, 28, 0, 38, -206, 267, -96, 21, 15, -113, -67, 54, -59, -48, -25, 61, -81, -64, -123, -102, 90, 413, 137, 130, 319, 100, -25, 60, -10, -46, -56, 87, 73, -74, 81, -89, 48, -211, -225, 63, -4, -68, 11, 117, -89, 174, -168, -123, -58, 144, 140, -4, -104, 159, 198, -94, 194, -402, 20, 19, -37, 135, 21, 83, 10, 112]
4724A12k11J54p8J06O2j17R9l1K51k52o6q8p3J54r8K55j25Kj38Q6k55K82O4k91
4748a96J28K21k45J06r4m6K04j79J33j09n6PM0J37j08J04j65J07k5O1j70Q6J34
4771G5l16J90j34J26j80K95j49J46o2J43k95L37k05K4P1j53J76L7O2k1k53K07
4793A21l18J92L59n11J37L9J7j08N8K86k94J59j22K74l23q5P1j09K36J56k42k04
4815b11K18n1L06k68J46j28K2J07O3m29K70L9L3Ok02J08Mj57L35l74R8K49j15
4838F9j45j2J6K41j90j44L05j20r7q1j59M70l88K88q5p4K15k57J18K39l49K16
4860G6j7j37L09r6l80L67l48K70J46k53o0m7J19L71k83j98L55p0l0j72M6J73r4
4883D7j90L88j33j0J69m58L26k75K27q2m45O12j83K41m9k20M3L23l59k7L5L2p5
$$ y = [112, -99, 55, -23, 83, 145, 28, 127, 96, 347, 95, 29, -59, -132, 22, -76, 179, 54, 56, -82, 4, -251, 31, 95, -196, -68, 153, -92, 14, -80, -126, 78, -101, 32, -77, -133, -126, -86, 51, -57, 47, -118, -11, -36, 25, -145, -59, 75, -241, -51, -185, -59, -239, 56, -93, 53, -9, 134, -161, 176, -29, -5, 66, -87, 89, 126, 188, 167, -86, 121, -197, -5, 354, -157, -20, 19, 36, -72, -14, 272, -22, 137, 15, 289, -34, -119, -48, -157, 79, 235, -7, -211, 7, -44, 262, -6, 140, 12, 34, 141, 204, -225, 45, 84, 117, 123, -79, 29, 33, -124, 211, -163, -65, 184, 69, -76, -88, -72, 169, -21, -165, 140, 20, -77, -158, -317, 153, -235, 53, -32, -106, 109, -148, -30, 209, -140, 76, 59, -78, 231, 135, -245, 122, -226, 44, 190, -63, -123, -170, -51, 320, 37, -161, 194, 124, 94, -78, -32, 141, 47, -143, 245, 112, 102, 271, -187, 139, -136, 91, 9, -436, 176, -7, 234, 185, -35, 8, 331, -28, -55, -20, 12, -63]
4906f3K35k28J81l20J35j33J67p1Qn3Q9j26J18K01k55K73P8l80L04j61o1j7k63
4929c42M46j55L4K6k2J47k20j46J21J16m9K42l46J89Q2j24L38j92k85K78j37K11
4951B12j83j89K73k03M7P5m6O0q7k52M98k80OK77n26K55J33l87L91l41K10l4M2
4974d9Q9R2l73L37m1j80K70n56L26N24m40L8j13k12N30Ok04lm26L23p0n5L98l59
4998a48J96k86J98j45R4l31P31l56L5K10l30J69j06l4l1kJ57J02m23N77l3k81
5020c7R4%J61k33n9K33j08j34J7j15k2N59m30K03Ml53L31j74q7K73j57%o9K47
5044A44o6o2k2J29m13J93l2r1K24j75J40K56m29K49r9L8K33m52L5N35m66Q3k2
5067g0q7K54j73j02J80l10K40J05m91O51l68L79k8n33K64J18j31J38k60K5M65
$$ y = [-63, 172, -56, 125, -195, -60, -193, -26, -97, -89, -142, -53, -179, -61, 140, -115, 158, 236, -144, 160, -1, -62, -79, -342, 104, -51, -17, 9, -13, 134, -86, -232, -111, 5, -44, 198, -148, 41, 123, -1, 337, 145, -140, 138, 1, 212, 29, -160, 113, -90, -43, 32, -14, 46, -41, -293, 205, -75, -69, 208, -318, -63, 70, -317, 74, -267, -57, -91, -49, 40, 132, -241, 96, 55, -125, 145, -411, -85, 439, -1, 37, -76, -288, 242, 248, 44, 41, -385, -62, -132, -187, 211, -148, 48, -238, -40, -185, -91, -422, 309, -47, -12, 198, -132, 37, -69, -103, -134, -136, 21, 123, -300, 277, 244, -37, 57, 57, 218, -15, -74, 159, 51, -83, -66, -181, -203, 356, -74, 129, 133, -220, 111, -63, -150, 123, -34, -34, -103, 144, 78, 16, -6, 123, -290, -97, -129, -220, 4, -171, -31, 225, -204, 45, -54, -16, 217, -235, -200, 335, -131, -48, -70, -157, 97, -76, -178, 2, -308, -68, 37, -454, 197, -171, 208, 180, -353, -89, 29, -102, 36, -224, -199, 266]
$$ [...]
8191D6
##END NTUPLES=NMR FID
##END=
