##TITLE=1H_Pr Am-3-HCl
 CD3OD, 8 sc, 
 20.11.2020
##JCAMPDX= 6.0         $$ Bruker NMR JCAMP-DX V2.0
##DATA TYPE= NMR FID
##DATA CLASS= NTUPLES
##ORIGIN= UXNMR, Bruker Analytische Messtechnik GmbH
##OWNER= root
$$ XWIN-NMR		Version 3.5
$$ Fri Nov 20 12:41:22 2020 Russian Standard Time (UT+4h)  she@DPX200
##.OBSERVE FREQUENCY= 200.1315066352
##.OBSERVE NUCLEUS= ^1H
##.DELAY= (6, 6)
##.ACQUISITION MODE= SIMULTANEOUS
##.ACQUISITION SCHEME= undefined
##.AVERAGES= 8
##.DIGITISER RES= 18
##SPECTROMETER/DATA SYSTEM= spect
##.PULSE SEQUENCE= zg30
##.SOLVENT NAME= MeOD
##.SHIFT REFERENCE= (INTERNAL, MeOD, 0, 15.7039)
##AUDIT TRAIL= $$ (NUMBER, WHEN, WHO, WHERE, WHAT)
$$ ##TITLE= Audit trail, XWIN-NMR		Version 3.5
$$ ##JCAMPDX= 5.01
$$ ##ORIGIN= Bruker BioSpin GmbH
$$ ##OWNER= she
$$ F:/spectra/data/she/nmr/H-F/1/audita.txt
$$ ##AUDIT TRAIL=  $$ (NUMBER, WHEN, WHO, WHERE, WHAT)
(   1,<2020-11-20 12:40:14.14 +0400>,<she>,<DPX200>,
      <created by zg, POWCHK disabled, PULCHK disabled
       configuration hash MD5:
       00 E9 B6 7A A2 85 ED C7 34 08 36 98 17 FE 4E 26
       data hash MD5: 16K
       23 FE 17 E0 40 BD 66 FB 22 28 A1 32 8B DB 9C FC>)
$$ ##END=
$$ 
$$ hash MD5
$$ 3F 88 4F 52 7F 63 62 B2 4A 48 80 5E 74 E8 13 94
##$RELAX= 
##$RELAX= 
##$RELAX= 
##$RELAX= 
##$RELAX= 
##$RELAX= 
$$ Bruker specific parameters
$$ --------------------------
##$DU= <F:/spectra>
##$EXPNO= 1
##$NAME= <H-F>
##$PROCNO= 1
##$TYPE= <nmr>
##$USER= <she>
##$AMP= (0..31)
100 100 100 100 100 100 100 100 100 100 100 100 100 100 100 100 100 100 
100 100 100 100 100 100 100 100 100 100 100 100 100 100 
##$AQSEQ= 0
##$AQ_mod= 1
##$AUNM= <au_zg>
##$AUTOPOS= <>
##$BF1= 200.13
##$BF2= 200.13
##$BF3= 200.13
##$BF4= 200.13
##$BF5= 200.13
##$BF6= 200.13
##$BF7= 200.13
##$BF8= 200.13
##$BYTORDA= 1
##$CFDGTYP= 0
##$CFRGTYP= 5
##$CHEMSTR= <none>
##$CNST= (0..31)
1 1 145 1 1 1 1 1 1 1 1 1 1 1 1 1 1 1 1 1 1 1 1 1 1 1 1 1 1 1 1 1 
##$CPDPRG= <>
##$CPDPRG1= <>
##$CPDPRG2= <>
##$CPDPRG3= <>
##$CPDPRG4= <mlev>
##$CPDPRG5= <mlev>
##$CPDPRG6= <mlev>
##$CPDPRG7= <mlev>
##$CPDPRG8= <mlev>
##$CPDPRGB= <>
##$CPDPRGT= <>
##$D= (0..31)
0 1.2 0 0 0 0 0 0 0 0.06 0 0.03 0 0 0 0 0.0002 0 0 0 0 0 0 0 0 0 0 0 0 
0 0 0 
##$DATE= 1605861613
##$DBL= (0..7)
120 120 120 120 120 120 120 120 
##$DBP= (0..7)
150 150 150 150 150 150 150 150 
##$DBP07= 0
##$DBPNAM0= <>
##$DBPNAM1= <>
##$DBPNAM2= <>
##$DBPNAM3= <>
##$DBPNAM4= <>
##$DBPNAM5= <>
##$DBPNAM6= <>
##$DBPNAM7= <>
##$DBPOAL= (0..7)
0.5 0.5 0.5 0.5 0.5 0.5 0.5 0.5 
##$DBPOFFS= (0..7)
0 0 0 0 0 0 0 0 
##$DE= 6
##$DECBNUC= <off>
##$DECIM= 32
##$DECNUC= <off>
##$DECSTAT= 4
##$DIGMOD= 1
##$DIGTYP= 9
##$DL= (0..7)
0 120 120 120 120 120 120 120 
##$DP= (0..7)
150 150 150 150 150 150 150 150 
##$DP07= 0
##$DPNAME0= <>
##$DPNAME1= <>
##$DPNAME2= <>
##$DPNAME3= <>
##$DPNAME4= <>
##$DPNAME5= <>
##$DPNAME6= <>
##$DPNAME7= <>
##$DPOAL= (0..7)
0.5 0.5 0.5 0.5 0.5 0.5 0.5 0.5 
##$DPOFFS= (0..7)
0 0 0 0 0 0 0 0 
##$DQDMODE= 0
##$DR= 18
##$DS= 0
##$DSLIST= <SSSSSSSSSSSSSSS>
$$ [...]
##$SUBNAM2= <"">
##$SUBNAM3= <"">
##$SUBNAM4= <"">
##$SUBNAM5= <"">
##$SUBNAM6= <"">
##$SUBNAM7= <"">
##$SUBNAM8= <"">
##$SUBNAM9= <"">
##$SW= 16.9725356469052
##$SWIBOX= (0..15)
0 0 2 0 0 0 0 0 0 0 0 0 0 0 0 0 
##$SW_h= 3396.73913043478
##$TD= 16384
##$TD0= 1
##$TE= 0
##$TE2= 300
##$TE3= 300
##$TEG= 300
##$TL= (0..7)
0 120 120 120 120 120 120 120 
##$TP= (0..7)
150 150 150 150 150 150 150 150 
##$TP07= 0
##$TPNAME0= <>
##$TPNAME1= <>
##$TPNAME2= <>
##$TPNAME3= <>
##$TPNAME4= <>
##$TPNAME5= <>
##$TPNAME6= <>
##$TPNAME7= <>
##$TPOAL= (0..7)
0.5 0.5 0.5 0.5 0.5 0.5 0.5 0.5 
##$TPOFFS= (0..7)
0 0 0 0 0 0 0 0 
##$TUNHIN= 0
##$TUNHOUT= 0
##$TUNXOUT= 0
##$USERA1= <user>
##$USERA2= <user>
##$USERA3= <user>
##$USERA4= <user>
##$USERA5= <user>
##$V9= 5
##$VALIST= <valist>
##$VCLIST= <CCCCCCCCCCCCCCC>
##$VD= 0
##$VDLIST= <DDDDDDDDDDDDDDD>
##$VPLIST= <PPPPPPPPPPPPPPP>
##$VTLIST= <TTTTTTTTTTTTTTT>
##$WBST= 1024
##$WBSW= 4
##$XGAIN= (0..3)
0 0 0 0 
##$XL= 0
##$YL= 0
##$YMAX_a= 150558
##$YMIN_a= -125223
##$ZGOPTNS= <>
##$ZL1= 120
##$ZL2= 120
##$ZL3= 120
##$ZL4= 120
##$ABSF1= 10
##$ABSF2= 0
##$ABSG= 5
##$ABSL= 3
##$ALPHA= 0
##$AQORDER= 0
##$ASSFAC= 0
##$ASSFACI= 0
##$ASSFACX= 0
##$ASSWID= 0
##$AUNMP= <proc_1d>
##$AZFE= 0.1
##$AZFW= 0.1
##$BCFW= 1
##$BC_mod= 2
##$BYTORDP= 1
##$COROFFS= 0
##$CY= 11.3945322036743
##$DATMOD= 1
##$DC= 2
##$DFILT= <>
##$DTYPP= 0
##$F1P= 15.9154993809931
##$F2P= -4.1035820241983
##$FCOR= 0.5
##$FTSIZE= 0
##$FT_mod= 4
##$GAMMA= 1
##$GB= 0.15
##$INTBC= 1
##$INTSCL= 1
##$ISEN= 128
##$LB= 0.24
##$LEV0= 0
##$LPBIN= 0
##$MAXI= 10000
##$MC2= 0
##$MEAN= 0
##$ME_mod= 0
##$MI= 1.114404
##$NCOEF= 0
##$NC_proc= 0
##$NLEV= 6
##$NOISF1= 3.799351
##$NOISF2= 2.8
##$NSP= 1
##$NTH_PI= 0
##$NZP= 0
##$OFFSET= 15.70392
##$PC= 1
##$PHC0= -11054.85
##$PHC1= 16.40089
##$PH_mod= 1
##$PKNL= yes
##$PPARMOD= 0
##$PSCAL= 0
##$PSIGN= 0
##$REVERSE= no
##$SF= 200.130013532006
##$SI= 16384
##$SIGF1= 3
##$SIGF2= 2
##$SINO= 400
##$SIOLD= 16384
##$SREGLST= <1H.CDCl3>
##$SSB= 0
##$STSI= 0
##$STSR= 0
##$SW_p= 3612.71676300578
##$SYMM= 0
##$S_DEV= 0
##$TDeff= 0
##$TDoff= 0
##$TI= <>
##$TILT= no
##$TM1= 0
##$TM2= 0
##$TOPLEV= 0
##$USERP1= <user>
##$USERP2= <user>
##$USERP3= <user>
##$USERP4= <user>
##$USERP5= <user>
##$WDW= 1
##$XDIM= 8192
##$YMAX_p= 0
##$YMIN_p= 0
$$ End of Bruker specific parameters
$$ ---------------------------------
##NTUPLES= NMR FID
##VAR_NAME=  TIME,          FID/REAL,        FID/IMAG
##SYMBOL=    X,             R,               I
##VAR_TYPE=  INDEPENDENT,   DEPENDENT,       DEPENDENT
##VAR_FORM=  AFFN,          ASDF,            ASDF
##VAR_DIM=   8192,          8192,            8192
##UNITS=     SECONDS,       ARBITRARY UNITS, ARBITRARY UNITS
##FACTOR=    0.0002944,     1,               1
##FIRST=     0,             0,               0
##LAST=      2.4114304,     0,               0
##MIN=       0,             -125223,         0
##MAX=       2.4114304,     150558,          0
$$ Real data points
##PAGE= N=1
##DATA TABLE= (X++(R..R)), XYDATA
$$ plain form
0 0 0 0 0 0 0 0 0 0 0 0 0 0 0 0 0 -8 8 -8 8 -8 16 -16 16 -24 24 -32 33 -40 48 -53 61 -69 81 -89 101 -114 129
37 129 -144 163 -181 202 -223 249 -276 306 -338 373 -411 454 -501 551 -606 670 -736 814 -900
56 -900 997 -1107 1234 -1381 1558 -1768 2030 -2357 2792 -3389 4265 -5689 8479 -28544 142937
71 142937 124706 -68956 -32721 -2818 -25728 -24240 13307 56094 65787 -41544 -99495 -11912
83 -11912 48385 28005 40770 3729 -60604 -32275 11799 6874 29007 44072 6028 -52966
95 -52966 -72193 -2892 89011 57058 -30566 -45568 -38678 -11088 48117 29014 -4409 23118
107 23118 -21590 -86446 -8397 82890 48895 -11874 -46659 -51760 15501 43242 -15060 10855
119 10855 58337 -30965 -91943 -15838 63015 72523 8061 -73062 -47509 27596 14955 -1758
$$ packed form
0@%%%%%%%%%%%%%%%qJ6j6J6j6K4l2L2m0M8n6O5p3Q8j01J14j30J50j70J90k15K43
37A29k73L07l44L83m25M72n25N82o44P11p84Q65r55J052j157J276j406J550j714
56i00J897k104K341k615K939l326L798m387N149o181P654r954J4168l7023J71481
71A42937j8231j93662L6235K9903k2910J488L7547M2787R693j07331n7951Q7583
83a1912O0297k0380J2765l7041o4333K8329M4074m925K2133J5065l8044n8994
95e2966j9227O9301R1903l1953q7624j5002O890K7590N9205j9103l3423K7527
107B3118m4708o4856P8049R1287l3995o0769l4785n101O7261K7741n8302K5915
119A0855M7482q9302o0978P6105P8853R508o4462q1123K5553P5105j2641j6713
$$ plain form
131 -1758 44187 26640 -52256 -60433 -354 49196 46821 3266 -29594 -38124 -24765 23011 48645
144 48645 6354 -17786 4696 -19804 -50566 9254 70570 42393 -31640 -72967 -23437 47780
156 47780 29928 -3904 14057 -760 -49638 -33732 24148 49865 37487 -18735 -70416 -27350
168 -27350 44494 34154 -892 -1930 -2107 -19083 -31964 -8619 48375 54776 -16980 -60976 -27577
181 -27577 18094 34685 22213 -1763 -11290 -20391 -30037 -3115 43033 44976 -4489 -49935 -44019
194 -44019 10834 49361 23745 -13433 -14736 -12826 -16216 -3865 16986 36097 23795 -35152 -60827
207 -60827 -3877 49860 33587 -7653 -19937 -11843 -12591 -15792 13301 51753 25833 -44643 -59306
220 -59306 -3332 45131 39310 -1580 -28886 -18954 -3375 -4142 9476 32332 21331 -20115 -47142
$$ packed form
131a758M5945j7547p8896q177O0079M9550k375m3555l2860q530J3359M7776K5634
144D8645m2291k4140K2482k4500l0762N9820O1316k8177p4033m1327M9530P1217
156D7780j7852l3832J7961j4817m8878J5906N7880K5717j2378n6222n1681M3066
168b7350P1844j0340l5046j038j77j6976j2881K3345N6994O401p1756m3996L3399
181b7577M5671J6591j2472k3976r527r101r646K6922M6148J943m9465m5446N916
194d4019N4853L8527k5616l7178j303J910l390J2351K0851J9111j2302n8947k5675
207f0827N6950N3737j6273m1240j2284Q094p48l201K9093L8452k5920p0476j4663
220e9306N5974M8463n821m0890k7306R932J5579p67J3618K2856j1001m1446k7027
$$ plain form
233 -47142 -22156 33036 45295 3992 -23811 -17458 -8843 -5772 7706 27436 26916 -9347 -48644
246 -48644 -34230 25405 52684 18432 -26304 -34724 -9380 11408 8699 12032 22845 342 -38905
259 -38905 -35730 12906 48566 27044 -23104 -35715 -6769 9567 2667 9293 25515 9678 -34395
272 -34395 -45070 2075 51358 36989 -18250 -39430 -15987 6538 14160 15297 13795 1980 -23025
285 -23025 -34916 -3329 37801 36462 -4768 -36395 -25311 8137 19888 8034 5999 9797 -9532
298 -9532 -35060 -19646 28100 47319 10478 -38550 -37985 4012 25968 14476 4589 3529 -8973
311 -8973 -28121 -20764 22002 47011 12964 -36542 -37471 2175 25533 14540 163 1588 -1994
324 -1994 -21010 -24438 9964 41859 23757 -23072 -40922 -13289 22312 25478 6161 -3340 -6858
$$ packed form
233d7142K4986N5192J2259m1303k7803O353Q615L071J3478J9730n20l6263l9297
246d8644J4414N9635K7279l4252m4736q420K5344K0788k709L333J0813k2503l9247
259c8905L175M8636L5660k1522n0148j2611K8946J6336o900O626J6222j5837m4073
272c4395j0675M7145M9283j4369n5239k1180K3443K2525P622J137j502j1815k5005
285b3025j1891L1587M1130j339m1230l1627J1084L3448J1751j1854k035L798j9329
298i532k5528J5414M7746J9219l6841m9028N65M1997K1956j1492r887j060j2502
311h973j9148P357M2766K5009l4047m9506r29L9646K3358j0993j4377J425l582
324a994j9016l428L4402L1895j8102m6829j7850K7633L5601L166j9317r501l518
$$ plain form
337 -6858 -18181 -18999 6359 34821 27629 -15319 -42743 -19376 22696 30733 5956 -10800 -7133
350 -7133 -6594 -14034 -6476 23268 34436 -629 -40653 -30693 14191 34347 13926 -10401 -10876 -7103
364 -7103 -14244 -7325 22918 34980 2604 -39721 -34875 11527 37459 17403 -12305 -15713 -5371
377 -5371 -6073 -5446 12536 27421 10197 -26165 -34895 -1556 31222 24466 -3852 -17462 -11138 -5127
391 -5127 -3587 8451 25456 16059 -20260 -38860 -11064 30665 34195 79 -24893 -17304 1431
404 1431 4574 3473 14567 17486 -8425 -34624 -19631 22854 37512 5525 -24981 -17412 1438
417 1438 2326 -57 14431 22144 -4885 -36017 -23919 19250 38265 12881 -21400 -24843 -4696
430 -4696 8434 8175 9426 12047 -1674 -24020 -22628 7743 32754 20518 -14894 -28713 -8292
$$ packed form
337f858j1323q18K5358K8462p192m2948k7424K3367M2072Q037k4777j6756L667
350g133N39p440P558K9744J1168l5065m0024R960M4884K0156k0421k4327m75L773
364g103p141O919L0243J2062l2376m2325M846M6402K5932k0056k9708l408J0342
377e371p02O27J7982J4885j7224l6362q730L3339L2778o756k8318j3610O324O011
391e127J540J2038J7005r397l6319j8600K7796M1729L530l4116k4972P589J8735
404A431L143j101J1094K919k5911k6199J4993M2485J4658l1987l0506P569J8850
417A438Q88k383J4488P713k7029l1132J2098M3169J9015k5384l4281l443K0147
430d696J3130k59J251K621j3721k2346J392L0371K5011j2236l5412j3819K0421
$$ plain form
443 -8292 10814 8363 4597 10273 4528 -17455 -27201 -2950 31468 30682 -7733 -34709 -17071 12739
457 12739 15650 4411 4211 4010 -12018 -25081 -7261 27894 31797 -4969 -33171 -17732 11808
470 11808 14711 3486 3574 5377 -8679 -22289 -10889 19132 31495 6319 -26634 -26246 1467
483 1467 19250 13794 2250 -3531 -8207 -13434 -10660 9472 29950 15208 -24125 -32835 -599
496 -599 24198 14904 -3985 -5103 -886 -9392 -15330 2733 28387 21018 -17084 -33843 -8350 19795
510 19795 19831 3217 -6646 -6760 -8256 -10937 1534 23767 22576 -11752 -34013 -13681 18698 23377
524 23377 4158 -10668 -8371 -3744 -6310 -2029 15351 21144 -898 -26974 -21724 9034 26680
537 26680 12852 -9786 -14230 -4455 -1737 -3979 9843 23750 5639 -27291 -27843 7334 30443
$$ packed form
443h292J9106k451l766N676n745k1983r746K4251L4418p86l8415k6976J7638K9810
457A2739K911j1239k00k01j6028j3063J7820L5155L903l6766k8202J5439K9540
470A1808K903j1225Q8J803j4056j3610J1400L0021J2363k5176l2953L88K7713
483A467J7783n456j1544n781m676n227K774K0132K0478j4742l9333q710L2236
496e99K4797r294j8889j118M217q506n938J8063K5654p369l8102j6759K5493K8145
510A9795L6j6614r863j14j496k681J2471K2233j191l4328k2261K0332L2379M679
524B3377j9219j4826K297M627k566M281J7380N793k2042k6076N250L0758J7646
537B6680j3828k2638m444R775K718k242J3822J3907j8111l2930n52L5177K3109
$$ plain form
550 30443 14962 -11516 -16463 -3873 1229 -2809 5424 19052 8130 -19324 -25867 -1315 24185
563 24185 20214 -4414 -17559 -8837 1156 599 4666 15173 10803 -12650 -27253 -9283 22476
576 22476 27642 -135 -22886 -13994 4081 6738 2370 7433 10793 -5457 -24524 -13490 16858
589 16858 27167 5065 -19659 -16727 1646 7650 2454 5627 11143 -1235 -21584 -18440 10516
602 10516 29709 12729 -18185 -23243 -1678 11046 6604 3745 5821 -202 -15116 -17559 3894
615 3894 25648 16631 -12493 -23845 -6609 11361 9869 1625 2824 4002 -9350 -19840 -3586
628 -3586 23667 22762 -6891 -26309 -12891 10570 14558 3349 -368 815 -6863 -15261 -5014 17884
642 17884 23233 -1555 -24723 -16049 8723 15611 4996 -2947 -669 -2611 -12047 -8674 11256 23910
$$ packed form
550C0443j5481k6478m947J2590N102m038Q233J3628j0922k7454o543K4552K5500
563B4185l971k4628j3145Q722R993n57M067J0507m370k3453j4603J7970L1759
576B2476N166k7777k2751Q892J8075K657m368N063L360j6250j9067J1034L0348
589A6858J0309k2102k4724K932J8373O004n196L173N516j2378k0349L144K8956
602A0516J9193j6980l0914n058K1565J2724m442k859K076o023j4914k443K1453
615C894K1754r017k9124j1352J7236J7970j492q244J199J178j3352j0490J6254
628c586K7253r05k9653j9418J3418K3461L988j1209l717J183p678q398J0247K2898
642A7884N349k4788k3168Q674K4772O888j0615p943K278j942r436L373J9930J2654
$$ plain form
656 23910 6375 -21538 -20756 2363 18111 11516 -3353 -5424 -2467 -7970 -9372 7177 22692
669 22692 10389 -18260 -24859 -816 19857 13231 -4251 -7240 -1708 -4493 -8531 1929 18032
682 18032 14583 -10307 -25262 -8695 16146 18275 1159 -9337 -5651 -2956 -5606 -369 15062
695 15062 15964 -6026 -24442 -13322 13771 21577 4285 -12414 -8888 58 -1493 -2530 8847
708 8847 15784 646 -20018 -17792 7139 22607 9537 -10629 -11692 -2159 -102 -1166 6055 14598
722 14598 4883 -17713 -21083 3134 23619 14483 -9768 -15599 -3362 3950 869 2856 10596 6129
736 6129 -11796 -19754 -3488 18466 17712 -3834 -16451 -7606 3757 3552 1837 7486 7956 -6134
750 -6134 -19146 -8496 17110 21964 596 -18564 -12232 3720 7372 2547 3345 5900 -2405 -15691
$$ packed form
656B3910j7535k7913P82K3119J5748o595j4869k071K957n503j402J6549J5515
669B2692j2303k8649o599K4043K0673o626j7482k989N532k785m038J0460J6103
682A8032l449k4890j4955J6567K4841K129j7116j0496L686K695k650N237J5431
695A5062R02k1990j8416J1120K7093P806j7292j6699L526Q946j551j037J1377
708H847O937j5138k0664K226K4931J5468j3070k0166j063R533K057j064P221Q543
722A4598r715k2596l370K4217K0485r136k4251n831J2237P312l081J987P740m467
736F129j7925p958J6266K1954p54k1546j2617Q845J1363k05j715N649M70j4090
750f134j3012J0650K5606M854k1368j9160O332J5952L652m825P98K555q305j3286
$$ plain form
764 -15691 -11647 10923 21920 5511 -15808 -15455 1278 8710 3815 1539 5236 1028 -12988 -14663
778 -14663 5377 22458 11658 -13474 -19525 -2791 11180 7676 414 1225 864 -8711 -13260 1257
792 1257 19080 14525 -9095 -19968 -6153 10433 10011 581 -1433 1263 -4658 -12422 -3927 15293
806 15293 18398 -2853 -20985 -12011 8526 13936 3213 -3461 -1220 -2803 -9535 -5062 10955 17175
820 17175 1390 -18815 -14999 5833 15323 5890 -4769 -3704 -548 -5793 -7253 5490 17610
833 17610 7192 -14852 -19318 370 16646 10420 -3819 -6661 -1979 -3258 -6209 2857 15461
846 15461 9673 -11555 -19906 -3401 15746 13483 -2937 -8998 -2524 -205 -4282 -443 11377 11701
860 11701 -6136 -19029 -8526 12091 16441 1351 -9772 -5952 23 -1666 -710 8642 11720 -2077
$$ packed form
764a5691M044K2570J0997j6409k1319L53J6733P432m895k276L697m208j4016j675
778a4663K0040J7081j0800k5132o051J6734J3971l504p262Q11l61r575m549J4517
792A257J7823m555k3620j0873J3815J6586m22r430k014K696n921p764Q495J9220
806A5293L105k1251j8132Q974K0537N410j0723o674K241j583o732M473J6017O220
820A7175j5785k0205L816K0832R490r433j0659J065L156n245j460J2743J2120
833A7610j0418k2044m466J9688J6276o226j4239k842M682j279k951R066J2604
846A5461n788k1228q351J6505J9147k263j6420o061O474K319m077L839J1820L24
860A1701j7837j2893J0503K0617M350j5090j1123L820N975j689R56R352L078j3797
$$ plain form
874 -2077 -17649 -12246 9142 18650 5179 -10922 -9754 599 2455 -889 3578 10137 3027 -13919
888 -13919 -15479 4083 18851 9430 -9585 -12111 -617 3362 -639 2228 9530 4579 -11368 -16992
902 -16992 588 18203 13005 -7016 -14214 -3654 4856 2966 1394 5024 4866 -6360 -14584 -4153
916 -4153 14212 15134 -2526 -14546 -7518 4530 4996 1030 2874 5212 -3206 -13494 -8183 10630
930 10630 18299 2137 -15560 -11827 3734 9106 2340 -160 2889 4 -10162 -9908 6715 18302
944 18302 6052 -13640 -13673 1453 9410 3538 -947 2060 1212 -8191 -10768 2762 16683 10003
958 10003 -9916 -16241 -2991 9760 8211 -193 -1512 146 -4356 -8875 -825 13505 12063 -5822
972 -5822 -16753 -6721 9346 10034 221 -3616 -424 -1266 -7404 -4335 9777 14508 -826 -16622
$$ packed form
874b077j5572N403K1388R508j3471j6101J168J0353J856l344M467O559p110j6946
888a3919j560J9562J4768r421j9015k526J1494L979m001K867P302m951j5947n624
902a6992J7580J7615n198k0021p198J0560Q510j890j572L630j58j1226q224J0431
916d153J8365R22j7660j2020P028J2048M66l966J844K338q418j0288N311J8813
930A0630P669j6162j7697L733J5561N372o766k500L049k885j0166K54J6623J1587
944A8302j2250j9692l3J5126P957n872m485L007q48r403k577J3530J3921o680
958A0003j9919o325J3250J2751j549q404j319J658m502m519Q050J4330j442j7885
972e822j0931J0032J6067O88r813l837L192q42o138L069J4112M731j5334j5796
$$ plain form
986 -16622 -11282 6762 12881 3346 -4987 -3157 -288 -4826 -4799 7231 14129 2588 -14631 -13513
1000 -13513 4446 13899 5526 -5428 -4658 123 -2155 -4724 2882 12275 6173 -10562 -15106 -791
1014 -791 13342 9871 -3566 -7201 -1773 -87 -2789 803 10068 7883 -7417 -15562 -4230 12336
1028 12336 12589 -1983 -9532 -3346 1698 -813 -1331 6403 8868 -2629 -14755 -8423 8960 14510
1042 14510 1796 -9596 -6581 1561 1114 -1110 4328 8493 152 -12644 -11166 6057 15900 5511
1056 5511 -9549 -9534 569 3614 179 1504 6581 2653 -9213 -12007 1744 14351 8572 -6774
1070 -6774 -11133 -1939 4699 1829 469 4650 4192 -6349 -12258 -1889 13180 12236 -3972 -13097
1084 -13097 -4945 5548 4658 67 1373 3618 -2558 -10589 -5177 9921 13576 -562 -12697 -7362
$$ packed form
986a6622N340J8044O119r535q333J830K869m538K7J2030O898j1541j7219J118
1000a3513J7959R453q373j0954P70M781k278k569P606R393o102j6735m544J4315
1014g91J4133l471j3437l635N428J686k702L592R265k185j5300q145J1332J6566
1028A2336K53j4572p549O186N044k511n18P734K465j1497j2126O332J7383N550
1042A4510j2714j1392L015Q142m47k224N438M165q341j2796J478J7223R843j0389
1056E511j5060J5J0103L045l435J325N077l928j1866k794J3751J2607n779j5346
1070f774m359R194O638k870j360M181m58j0541n909J0369J5069r44j6208r125
1084a3097Q152J0493q90m591J306K245o176q031N412J5098L655j4138j2135N335
$$ plain form
1098 -7362 4539 6306 446 -274 3085 -196 -9221 -7230 6812 14485 3313 -11591 -10883 2309
1112 2309 8935 2835 -1602 886 890 -5643 -7266 3266 13155 6692 -9449 -12759 -396 8984 4963
1127 4963 -1851 -1177 1071 -3227 -7820 0 11670 9602 -5959 -13976 -4454 8770 8483 -550 -3794
1142 -3794 -97 -1361 -5796 -2008 9124 10443 -2610 -13638 -7108 7528 9858 337 -4979 -1481
1156 -1481 178 -3959 -3971 5594 11218 1328 -12104 -10155 4658 11721 3771 -5187 -4046 111 -1651
1171 -1651 -3592 3011 10022 3626 -10290 -12055 1586 11915 6242 -5206 -6195 312 614 -3038
1185 -3038 319 8105 6034 -6647 -12530 -2113 11134 9212 -2874 -7632 -2137 1770 -881 -486
1199 -486 5688 6740 -3670 -12332 -4828 9251 11025 -476 -8882 -4416 2731 1617 -1213 2952
$$ packed form
1098g362J1901J767n860p20L359l281r025J991J4042P673j1172j4904P08J3192
1112B309O626o100m437K488Mo533j623J0532R889o463j6141l310J2363R380m021
1127D963o814O74K248m298m593P820J1670k068j5561q017R522J3224k87r033l244
1142c794L697j264m435L788J1132J319j3053j1028O530J4636K330r521n316L498
1156a481J659m137j2R565N624r890j3432J949J4813P063p950q958J141M157j762
1171a651j941O603P011o396j3916j765J3641J0329n673j1448r89O507L02l652
1185c038L357P786k071j2681n883J0417J3247j922j2086m758N495L907k651L95
1199d86O174J052j0410q662P504J4079J774j1501q406M466P147j114k830M165
$$ plain form
1213 2952 6719 -271 -10397 -7894 5850 12616 2806 -8247 -6774 1750 3286 -193 1321 5462
1227 5462 1781 -8506 -9558 3459 12713 5691 -7439 -9046 177 4906 1196 -727 3303 3048
1241 3048 -5574 -9693 -132 11283 8272 -4781 -10183 -2279 5016 3082 -127 1767 3208 -2998
1255 -2998 -9094 -2845 9169 10683 -2001 -11401 -5171 5055 5562 107 -467 2083 -438 -6861 -4987
1270 -4987 6389 11255 1209 -10359 -7510 3515 7053 1392 -1771 1050 1033 -5372 -6169 3587 11403
1285 11403 4060 -9132 -10137 1324 8127 3241 -2356 -1082 962 -2984 -5721 1038 9710 6238
1299 6238 -6248 -10821 -1508 8062 5682 -1963 -2725 581 -735 -4959 -1340 7561 8141 -3315 -11410
1314 -11410 -4773 7040 8110 -362 -4642 -984 728 -2823 -2601 5463 8519 -852 -10762 -7008 5691
$$ packed form
1213B952L767o990j0126K503J3744O766r810j1053J473Q524J536l479J514M141
1227E462l681j0287j052J3017R254p022j3130j607R223M729l710j923M030k55
1241C048q622m119R561J1415l011j3053n402P904P295j934l209J894J441o206
1255b998o096O249J2014J514j2684r400O230J0226N07n455n74K550k521o423J874
1270d987J1376M866j0046j1568K849J1025L538n661l163K821j7o405p97R756P816
1285A1403p343j3192j005J1461O803m886n597J274K044l946k737O759Q672l472
1299F238j2486m573R313R570k380p645p62L306j316m224L619Q901N80j1456q095
1314a1410O637J1813J070q472m280L658J712l551K22Q064L056r371r910L754J2699
$$ plain form
1329 5691 10014 1405 -5631 -2526 1062 -1146 -2975 2705 8386 2466 -9027 -8881 2732 10198 4172
1344 4172 -4888 -4707 196 447 -2208 1061 6586 3760 -6892 -9679 -226 9733 6476 -3835 -6417
1359 -6417 -776 2101 -833 -893 4473 5194 -3392 -9925 -3276 8327 8705 -2031 -7685 -2773 2596
1374 2596 1121 -1104 3008 5539 -1179 -9426 -5487 6661 9942 387 -8049 -4889 2500 2893 -791
1389 -791 819 4665 730 -7253 -7071 3986 10530 3443 -7023 -6859 1084 4043 649 -517 2924
1404 2924 2063 -5561 -7571 1425 10359 5967 -5708 -8484 -765 5149 2275 -1148 871 2520 -2683
1419 -2683 -7202 -1344 8279 8009 -3299 -9399 -3213 5040 4011 -865 -820 2011 -699 -6595 -3260
1434 -3260 6512 9389 -701 -9336 -5474 4319 6101 122 -2280 952 809 -4297 -4486 4172 9129
$$ packed form
1329E691M323q609p036L105L588k208j829N680N681n920j1493J46J1613P466o026
1344D172r060J81M903K51k655L269N525k826j0652k787R453R959l257j0311k582
1359f417N641K877k934o0N366P21q586o533O649J1603L78j0736n654M912N369
1374B596j475k225M112K531o718q247L939J2148L281r555q436L160P389L93l684
1389g91J610L846l935p983J82J1057O544p087j0466J64P943K959l394j166L441
1404B924q61p624k010Q996Q934m392j1675k776P719N914k874l423K019J649n203
1419b683m519N858R623k70j1308o100O186Q253j029m876M5K831k710n896L335
1434c260R772K877j0090q635L862R793J782n979k402L232j43n106j89Q658M957
$$ plain form
1449 9129 1848 -8395 -7169 2542 7109 1768 -2864 -404 1024 -2918 -4943 1727 8426 3953 -6580
1464 -6580 -8913 255 7827 4327 -2813 -2697 954 -626 -4057 -484 6624 5726 -4149 -9500 -2464
1479 -2464 6938 5861 -2016 -3956 -48 913 -2942 -1922 5053 6943 -1590 -9319 -4758 5987 7644
1494 7644 -212 -5035 -1768 1315 -1130 -2173 2893 6525 639 -8352 -6519 4119 8576 1606 -5229
1509 -5229 -3329 1350 550 -1961 828 5984 2730 -6086 -7621 1269 8831 4345 -4279 -5422 138
1524 138 1951 -850 -352 4138 3810 -3924 -8444 -1021 8387 6203 -3385 -6669 -1292 3166 277 -1425
1540 -1425 2457 4563 -2083 -7788 -3063 6649 7594 -898 -6933 -2979 2859 2109 -1004 905 3923
1555 3923 219 -6563 -4775 4753 8803 1010 -6872 -4751 2165 3669 -95 -1049 2572 1454 -4689
$$ packed form
1449I129p281j0243J226R711M567n341m632K460J428l942k025O670O699m473j0533
1464f580k333R168P572l500p140J16L651j580l431L573P108q98r875n351P036
1479b464R402j077p877j940L908R61l855J020O975J890q533p729M561J0745J657
1494G644p856m823L267L083k445j043N066L632n886q991J833J0638M457o970o835
1509e229J900M679q00k511K789N156l254q816j535Q890P562m486q624j143N560
1524A38J813k801M98M490l28p734m520P423R408k184r588l284N377M458k889j702
1540a425L882K106o646n705M725R712R45q492o035L954N838p50l113J909L018
1555C923l704o782J788R528M050p793p882K121O916J504l764r54L621j118o143
$$ plain form
1570 -4689 -5583 2139 8510 3629 -5477 -6554 383 4606 1494 -1532 1014 2025 -2648 -6107 38
1585 38 7749 5562 -4247 -7976 -1088 5247 2898 -1781 -747 1627 -890 -5113 -1904 5845 6499 -1970
1601 -1970 -8134 -3088 4576 4443 -662 -1902 1020 315 -3717 -3139 3974 7385 667 -7434 -5582 3342
1617 3342 5927 681 -2841 -537 936 -2116 -3658 2206 7064 2315 -6818 -6955 1546 6689 2265
1632 2265 -3048 -1908 1043 -805 -3549 154 6082 4245 -4654 -7672 -701 6503 4281 -2289 -3369
1647 -3369 193 739 -2398 -1058 4250 5030 -2478 -7849 -2514 5705 5941 -1285 -4406 -818 1606 -892
1663 -892 -2069 2393 5435 -271 -7357 -4880 4304 7281 747 -4774 -2221 1623 458 -1872 1215
1678 1215 5076 1427 -6000 -5915 2985 7476 2295 -4770 -3772 1268 1815 -1039 -458 3777 2710 -4137
$$ packed form
1570d689q94P722O371m881r106j077O937M223l112l026K546J011m673l459O145
1585C8P711k187r809l729O888O335k349m679J034K374k517m223L209P749O54q469
1601a970o164N046P664j33n105j240K922p05m032N78P113L411o718q101J852Q924
1617C342K585n246l522K304J473l052j542N864M858m749r133j37Q501N143m424
1632B265n313J140K951j848k744L703N928j837q899l018O971P204k222o570j080
1647c369L562N46l137J340N308P80p508n371N335Q219K36p226l121L588K424k498
1663h92j177M462L042n706p086K477R184K977o534n521K553L844j165k330L087
1678A215L861l649p427Q5Q900M491n181p065R98N040N47k854N81M235j067o847
$$ plain form
1694 -4137 -6618 22 7193 4464 -3404 -5132 -366 2596 263 -1195 1855 3154 -2178 -6242 -2125
1709 -2125 5976 6111 -2150 -6612 -1366 3513 1678 -1592 406 3616 -313 -5981 -3987 4686 7302
1724 7302 -157 -6448 -3408 2951 2905 -920 -615 2705 741 -4661 -4374 3180 7271 1719 -5873 -4945
1740 -4945 1668 3804 545 -1397 1030 1561 -2636 -4635 528 6295 3652 -4062 -6304 -257 4715
1755 4715 2339 -1647 -456 1941 -853 -4310 -1626 5453 5699 -2564 -7405 -2216 5184 3748 -1785
1770 -1785 -1894 1440 505 -3623 -2758 4129 6007 -1180 -7250 -3509 4163 4059 -841 -2473 658 1006
1786 1006 -2567 -2886 2516 5913 1129 -5694 -4878 2251 5457 1568 -2592 -1741 900 -683 -2383 327
1802 327 4724 3130 -4262 -6329 150 5945 3154 -2952 -3022 1050 721 -2183 -970 4084 4393 -2914
$$ packed form
1694d137k481O640P171k729p868j728M766K962k333j458L050J299n332m064M117
1709b125Q101J35q261m462N246M879j835l270J998L210l929n668J994Q673K616
1724G302p459o291L040O359m6l825L05L320j964n402K87P554M091n552p592R28
1740d945O613K136l259j942K427N31m197j999N163N767k643p714k242O047M972
1755D715k376l986J191K397k794l457K684P079K46q263m841N189P400j436n533
1770a785j09L334r35m128Q65O887J878p187o070L741P672j04m900j632L131L48
1786A006l573l19N402L397m784o823Q16P129L206l889m160Q51K641j583j700K710
1802C27M397j594p392k067O479N795k791o106p0M072l29k904J213N054L09p307
$$ plain form
1818 -2914 -7182 -1456 5795 4612 -2458 -4005 67 1711 -1371 -1592 2980 4721 -1544 -6474 -2461
1833 -2461 4841 5304 -827 -3959 -1108 1519 -250 -1511 1413 3845 313 -5318 -4098 2859 6434
1848 6434 1607 -4108 -3271 1274 1907 -757 -426 2561 2187 -3532 -5355 955 6486 3422 -4055 -4986
1864 -4986 976 2976 -517 -1432 2236 2928 -2394 -6112 -579 6273 4545 -3353 -5445 -86 3023
1879 3023 601 -1363 908 2595 -1383 -4933 -1542 4811 5221 -1180 -5265 -2185 2562 1876 -664
1894 -664 -383 1724 251 -3245 -2923 2424 5948 1102 -5052 -4099 1743 3679 -2 -1742 735 1638
1910 1638 -2399 -4592 802 6116 2609 -4767 -5553 1150 4902 891 -2534 -221 2038 -1079 -4245
1925 -4245 33 5612 3359 -3590 -5408 104 4139 2232 -1693 -770 1340 -207 -3248 -1116 3872
$$ packed form
1818b914m268N726P251j183p070j547M072J644l082k21M572J741o265m930M013
1833b461P302M63o131l132K851K627j769j261K924K432l532n631J220O957L575
1848F434m827n715Q37M545O33k664L31K987l74n719j823O310N531l064p477r31
1864d986N962K000l493r15L668O92n322l718N533O852j728p898k092N359L109
1879C023k422j964K271J687l978l550L391O353M10o401m085L080M747o86k540
1894f64K81K107j473l496L22N347L524m846o154R53N842J936l681j740K477R03
1910A638m037k193N394N314l507p376p86O703L752m011l425K313K259l117l166
1925d245M278N579k253o949j818N512M035j907l925R23K110j547l041K132M988
$$ plain form
1940 3872 4258 -1549 -5637 -2373 3466 3748 -618 -2402 -21 1205 -1481 -1961 1887 4753 535 -5369
1956 -5369 -4227 2693 5319 373 -3650 -924 2057 -412 -2871 728 5131 1806 -4936 -5377 1588
1971 1588 5674 1349 -3598 -1533 1485 11 -2412 97 4040 2704 -3559 -5224 63 4759 2868
1986 2868 -2187 -2645 225 952 -997 -810 2307 3108 -1472 -5164 -1909 4228 4701 -858 -4376 -1004
2002 -1004 2144 567 -1671 583 3345 648 -4931 -3862 3359 5809 362 -4838 -1914 2434 1354
2017 1354 -1949 -380 3414 1419 -4384 -4316 2188 5696 1082 -4172 -2876 1645 1816 -646 -552 2324
2033 2324 1715 -2534 -4162 830 4919 2747 -2805 -4126 -422 2499 864 -1287 191 2138 -606
2048 -606 -3914 -1754 4109 4802 -1351 -5436 -1783 3300 2292 -1740 -880 2125 648 -3724 -2802 3083
$$ packed form
1940C872L86n807m088L264N839K82m366j784K381J226k686m80L848K866m218n904
1956e369J142O920K626m946m023K726K981k469k459L599M403l325o742m41O965
1971A588M086m325m947K065L018j474k423K509L943j336o263j665N287M696j891
1986B868n055m58K870P27j949J87L117Q01m580l692L255O137M73n559l518L372
2002a004L148j577k238K254K762k697n579J069P221K450n447n200K924M348j080
2017A354l303J569L794j995n803O8O504L508m614n254J296M521J71k462R4K876
2033B324o09m249j628M992M089k172n552j321L704K921j635k151J478J947k744
2048f06l308K160N863O93o153m085L653N083j008m032Q60L005j477m372R22N885
$$ plain form
2064 3083 5902 -703 -5587 -2444 2948 2671 -1314 -1333 1829 1293 -3195 -3097 2244 5076 515 -4749
2080 -4749 -3417 1610 3156 278 -1484 -68 974 -1220 -2662 302 4195 2457 -2893 -4599 85
2095 85 4172 1969 -2063 -1660 1112 556 -2660 -1646 3457 4017 -1880 -5685 -1528 4578 3071 -2209
2111 -2209 -2699 1172 1138 -2415 -2093 2885 4490 -888 -5418 -2264 3314 3776 -1106 -2634 58 1201
2127 1201 -1227 -1622 1425 3615 645 -4107 -3073 2037 3955 1089 -2671 -1784 879 442 -1319 -310
2143 -310 2816 2099 -2654 -4576 366 4848 2753 -2924 -3180 776 1944 -1200 -1506 2568 3000 -1945
2159 -1945 -5253 -786 4678 3718 -2526 -3553 687 2184 -743 -1639 1542 3304 -979 -4590 -1617
2174 -1617 3859 3579 -1086 -3367 -967 1852 582 -868 412 2147 93 -3126 -2711 1794 4216
$$ packed form
2064C083K819o605m884L143N392k77l985j9L162n36m488R8N341K832m561n264
2080d749J332N027J546k878j762J416J042k194j442K964L893j738n350j706M684
2095H5M087k203m032M03K772n56l216J014N103N60n897l805M157O106j507n280
2111b209m90L871l4l553L22M978J605n378m530L154N578M62m882j528K692J143
2127A201k428l95L047K190k970m752J034N110J918k866l760Q87K663m37j761J009
2143c10L126p17m753j922M942M482k095n677k56L956J168l144l06M074M32m945
2159a945l308M467N464r60o244j027M240J497k927q96L181J762m283l611K973
2174a617N476k80m665k281K400K819j270j450J280J735k054l219M15M505K422
$$ plain form
2189 4216 1095 -3292 -2692 1249 2171 -330 -1329 1200 1851 -1906 -4361 92 4864 2636 -3435 -4013
2205 -4013 1173 3008 -168 -2068 1132 2422 -1496 -4098 -437 5078 3092 -3061 -4273 404 3055
2220 3055 721 -1519 114 2014 -621 -3346 -1341 3619 3510 -1309 -4046 -1366 2476 2141 -1000
2235 -1000 -1156 964 518 -1566 -2054 1469 4028 753 -3851 -3242 1829 3653 281 -2380 121 1922
2251 1922 -687 -3005 349 4494 2217 -3883 -4320 1605 3977 767 -2638 -464 1778 -367 -3076
2266 -3076 -264 3823 2469 -2791 -4266 239 3915 1686 -1857 -1434 822 482 -1765 -916 2390 3092
2282 3092 -1109 -4024 -1622 2969 3228 -688 -2567 -425 1438 -282 -1886 849 3315 710 -4013
2297 -4013 -3115 2236 4433 193 -3448 -1214 2157 514 -2192 -68 3245 1869 -3394 -3922 1581
$$ packed form
2189D216l121m387O00L941R22k501r99K529O51l757k455M453M772k228o071n78
2205d013N186J835l176j900L200J290l918k602L661N515j986o153j212M677K651
2220C055k334k240J633J900k635k725K005M960j09m819k737K680L842l35l141
2235a000j56K120m46k084m88L523K559l275m604O09N071J824l372k661K501J801
2251A922k609k318L354M145k277o100m37N925K372l210l405K174K242k145k709
2266c076K812M087j354n260j475M505L676k229l543M23K256l40k247Q49L306P02
2282C092m201k915K402M591K59l916j879K142J863j720j604K735K466k605m723
2297d013Q98N351K197m240l641K234L371j643k706K124L313j376n263n28N503
$$ plain form
2312 1581 4375 745 -3014 -1504 1520 829 -1649 -498 2633 1947 -2343 -3719 385 3731 2039
2327 2039 -2061 -2487 32 1397 -332 -926 974 2142 -976 -3353 -1394 3385 3444 -900 -3561 -932
2343 -932 2173 808 -1336 -406 2317 820 -3402 -2668 2314 4441 -117 -4182 -1807 2544 1626 -1444
2359 -1444 -878 1924 1275 -2565 -3382 1419 4520 825 -3595 -2460 1727 2089 -358 -970 978 1599
2375 1599 -1692 -3040 208 3690 2061 -2502 -3213 280 2534 901 -1433 -345 1675 -189 -2523
2390 -2523 -1295 2956 3155 -1045 -3867 -916 3061 1950 -1569 -1380 1241 1077 -2279 -2243 2166 3935
2406 3935 -716 -4123 -1762 2639 2569 -1133 -1792 815 1295 -1429 -2280 1297 3523 828 -3826 -2769
2422 -2769 1319 3017 276 -1985 -290 1401 -215 -2179 -288 2950 1846 -2520 -3459 485 3380
$$ packed form
2312A581K794l630l759J510L024o91k478J151L131o86m290j376M104L346j692
2327B039m100m26K519J365j729n94J900J168l118k377J959M779N9m344k661K629
2343i32L105j365k144R30K723j497m222P34M982K127m558m065K375M351r18l070
2359a444N66K802o49l840q17M801L101l695m420J135M187L62k447o12J948O21
2375A599l291j348L248L482j629m563p11L493K254j633k334J088K020j864k334
2390b523J228M251J99m200k822K951L977j111l519J89K621j64l356L6M409J769
2406C935m651l407K361M401p0l702o59K607M80k724q51L577K226k695m654J057
2422b769M088J698k741k261J695J691j616j964J891L238j104m366r39L944K895
$$ plain form
2437 3380 1614 -2017 -1544 1252 994 -1255 -1244 2535 2389 -1369 -3933 -912 3326 2576 -1685 -2064 835
2454 835 1382 -1034 -1614 1537 2864 -407 -3820 -1591 2968 3244 -546 -2558 -148 1436 -34 -1316
2470 -1316 594 2671 784 -2900 -2442 1753 3688 462 -2614 -1332 1130 1064 -1375 -727 1920 1281
2486 1281 -1591 -3347 30 3841 1776 -2356 -2552 687 2288 -781 -1237 1084 2014 -962 -3544 -539
2502 -539 3363 2535 -1901 -2733 64 1669 -174 -1204 813 1904 90 -2807 -956 2791 2751 -1565
2518 -1565 -2816 -816 2246 883 -1038 -76 2164 725 -2520 -2245 1702 3704 813 -3085 -2257 508
2534 508 2534 -747 -1819 434 1616 -1469 -2551 743 3534 1307 -2655 -2896 1005 2603 -196
2549 -196 -1919 155 1439 -528 -2599 -438 3032 2257 -1802 -3141 283 2806 912 -1449 -688 1445
$$ packed form
2437C380j766l631M73K796k58k249J1L779j46l758k564L021M238p50m261l79K899
2454H35N47k416n80L151J327l271l413K229M559K76l790k012K410J584j470j282
2470a316J910K077j887l684M58M195J935l226l076J282K462o6k439O48K647o39
2486A281k872j756L377L811k065m132j96L239J601l069m56K321R30k976k582L005
2502e39L902q28m436q32K797J605j843j030K017J091j814k897J851L747m0m316
2518a565j251K000L062j363j921R62K240j439l245K75L947K002k891l898Q28K765
2534E08K026l281j072K253J182l085j082L294K791k227l962k41L901J598k799
2549a96j723K074J284j967k071K161L470p75m059j339L424K523j894k361P61K133
$$ plain form
2565 1445 261 -2048 -1381 2374 2781 -825 -3554 -878 2581 1720 -1044 -1594 551 1277 -1380 -1818
2581 -1818 1141 3036 -86 -3449 -2215 1914 2690 -803 -2283 333 1614 -468 -1955 60 2902
2596 2902 1143 -2902 -2759 1291 3096 554 -2316 -942 1512 220 -1728 -606 2531 1944 -1924
2611 -1924 -3290 145 3081 1392 -1710 -1574 903 986 -1172 -1115 1596 2134 -669 -3326 -935 2696
2627 2696 2353 -1130 -2421 173 1721 -317 -1595 370 2167 143 -3174 -2012 2005 3248 -313
2642 -313 -2682 -696 1576 495 -1520 -206 2369 1115 -2517 -2439 1262 3376 660 -2497 -1664 1387
2658 1387 1125 -842 -967 1601 1521 -1316 -3180 114 3394 1670 -2163 -2360 669 1821 -242 -1258
2674 -1258 604 1852 -582 -2668 -975 2584 2512 -1510 -2777 -453 2095 791 -1509 -396 1607
$$ packed form
2565A445j184k309O67L755M07l606k729K676L459q61k764n50K145P26k657m38
2581a818K959J895l122l363J234M129P76l493j480K616J281k082j487K015K842
2596B902j759m045J43M050J805k542k870J374K454j292j948J122L137n87l868
2611a924j366L435K936j689l102J36K477Q3k158N7K711N38k803k657K391L631
2627B696l43l483j291K594J548k038j278J965J797k024l317J162M017J243l561
2642c13k369J986K272j081k015J314K575j254l632P8L701K114k716l157Q33L051
2658A387k62j967j25K568q0k837j864L294L280j724l833j97L029J152k063j016
2674a258J862J248k434k086J693L559p2m022j267K324K548j304k300J113K003
$$ plain form
2689 1607 521 -2266 -1653 1883 2844 -403 -3061 -993 1999 1275 -1058 -1031 1076 1092 -1571 -2152 1095
2706 1095 3107 546 -2857 -1956 1370 2057 -229 -1536 359 1524 -862 -2046 328 2815 1532
2721 1532 -2140 -2631 526 2457 392 -1616 -264 1195 298 -1749 -629 2352 2270 -1163 -3022 -339
2737 -339 2624 1239 -1551 -1507 1103 698 -1381 -1375 1398 2680 -336 -3165 -1451 2179 2209 -810 -1577
2754 -1577 454 1426 -785 -1468 718 2316 243 -2800 -2255 1472 2690 -196 -2041 -393 1181 197
2770 197 -1400 -344 2145 1282 -1852 -2650 602 3002 616 -2244 -1521 1258 919 -1062 -900 1763
2786 1763 1811 -1176 -2777 -254 2781 1705 -1586 -2055 716 1145 -502 -951 626 2079 -266 -2830
2802 -2830 -1023 2322 2204 -919 -2376 45 1665 335 -1541 -88 1905 468 -2340 -1988 1580
$$ packed form
2689A607j086k787O13L536R61l247k658K068K992p24k333K7K107J6k663n81L247
2706A095K012k561l403R01L326O87k286j307J895J165k386j184K374K487j283
2721A532l672m91L157J931k065k008J352J459q97k047J120K981q2l433j859K683
2737c39K963j385k790M4K610m05k079OK773J282l016k829J714L630L0l019p67
2754a577K031R72k211o83K186J598k073l043N45L727J218k886j845J648J574r84
2770A97j597J056K489q63l134p98L252K400k386k860P23K779l39j981J62K663
2786A763M8k987j601K523L035j076l291m69K771M29j647m49J577J453k345k564
2802b830J807L345j18l123j457K421J620j330j876J453J993j437k808L52L568
$$ plain form
2817 1580 2976 32 -2525 -1066 1558 1015 -1225 -736 1351 972 -1540 -2325 729 3004 885 -2183
2833 -2183 -1761 985 1590 -363 -1113 430 1276 -713 -2279 -279 2668 1329 -1987 -2262 499 2034
2849 2034 267 -1479 107 1491 130 -2289 -892 2326 2459 -966 -2947 -284 2243 939 -1455
2864 -1455 -1035 1320 656 -1650 -1487 1566 2676 -21 -2905 -1350 1710 1678 -756 -1179 615 1051 -687
2881 -687 -1783 453 2860 806 -2454 -2074 842 2301 -124 -1800 -165 1375 -141 -1654 -628
2896 -628 2318 1425 -1912 -2799 200 2420 643 -1537 -771 1089 628 -1472 -908 1748 2163 -857 -2771
2913 -2771 -527 2421 1528 -1393 -1367 481 906 -853 -1304 1102 2367 81 -2809 -1486 2161 2271
2929 2271 -611 -1720 71 1216 -56 -1450 141 2034 773 -1879 -1871 1116 2472 78 -2171 -774
$$ packed form
2817A580J396k944k557J459K624n43k240M89K087l79k512p85L054K275k119l068
2833b183M22K746O05j953p50J543Q46j989j566K000K947j339l316k75K761J535
2849B034j767j746J586J384j361k419J397L218J33l425j981K663K527j304k394
2864a455M20K355o64k306J63L053J110k697k884J555L060l2k434m23J794M36j738
2881f87j096K236K407k054l260L80K916J459k425j676J635J540j516j513J026
2896f28K946q93l337q87K999K220j777k180P66J860m61k100N64K656M15l020j914
2913b771K244K948q93k921K6J848M25j759m51K406J265k286k890J323L647J10
2929B271k882j109J791J145j272j394J591J893j261k652QK987J356k394k249J397
$$ plain form
2945 -774 1450 430 -1134 -410 1542 1465 -1390 -2153 281 2438 1072 -1816 -1645 884 1134 -480 -975
2962 -975 946 1728 -658 -2305 -608 2411 1649 -1215 -2056 113 1574 261 -1332 77 1845 -70
2978 -70 -2118 -1296 1812 2322 -880 -2390 -587 1458 658 -923 -487 1265 668 -1439 -1664 1124 2372
2995 2372 297 -2299 -1536 1425 1417 -894 -841 815 1339 -934 -2003 349 2540 1049 -1879 -1733 857
3012 857 1614 -129 -1261 -63 1627 -175 -2112 -515 2026 1731 -1286 -2227 195 1959 782 -1336
3028 -1336 -619 1115 582 -1485 -1296 1429 2265 -725 -2820 -1285 1888 1142 -1074 -1281 961 874 -965
3045 -965 -1582 843 2658 511 -2523 -1306 1431 1883 -514 -1577 59 1181 -288 -1706 -189 2104
3061 2104 908 -1869 -2189 809 2222 154 -1595 -717 1356 245 -1204 -866 1657 1632 -1022 -2552
$$ packed form
2945g74K224j020j564P24J952p7k855p63K434K157j366k888J71K529K50j614m95
2962i75J921P82k386j647J697L019p62k864q41K169J461j313j593J409J768j915
2978g0k048Q22L108N10l202j510J803K045q00j581M36J752n97k107k25K788J248
2995B372k075k596P63K961qk311N3J656N24k273j069K352K191j491k928J46K590
3012H57P57j743j132J198J690j802j937J597K541k95l017r41K422J764j177k118
3028a336P17J734n33k067J89K725Q36k990k095J535L173p46k216k07K242q7j839
3045i65o17K425J815k147l034J217K737M52k397j063J636J122j469j418J517K293
3061B104j196k777l20K998J413k068j749Q78K073j111j449L38K523k5k654j530
$$ plain form
3077 -2552 -115 1988 1254 -1335 -1650 733 1061 -867 -864 1184 2205 -362 -2385 -666 2090 1580 -950
3094 -950 -1605 180 1302 -227 -1382 384 2021 241 -2052 -1038 1283 2201 -520 -1916 -714 1149
3110 1149 571 -1203 -336 1634 1041 -1467 -1840 824 2134 610 -1845 -1232 869 1135 -537 -1123 1297
3127 1297 1427 -1327 -2241 -303 2094 1422 -1655 -2011 645 1405 -16 -953 168 1655 -350 -2082
3143 -2082 -697 1840 1769 -943 -2076 -323 1668 276 -967 -384 1384 392 -1698 -1237 1204 2100
3159 2100 -26 -1946 -948 1371 939 -591 -942 1005 985 -1058 -1686 623 2321 582 -1946 -1634 1218
3176 1218 1600 -205 -1246 342 1097 -504 -2024 -382 2144 1178 -1406 -1738 363 1978 401 -1265
3192 -1265 -338 1098 41 -1677 -640 1404 1602 -964 -2111 -280 1789 594 -1188 -917 885 934
$$ packed form
3077b552K437K103p34k589l15K383L28j928LK048J021k567k023J719K756n10k530
3094i50o55J785J122j529j155J766J637j780k293J014K321R18k721j396J202J863
3110A149n78j774Q67J970n93k508l73K664J310j524k455O13K101K66j672n86K420
3127A297J30k754r14J938K397o72l077l56K656P60j421r37J121J487k005j732
3143b082J385K537p1k712j133J753J991j392j243N83J768r92k090M61K441Q96
3159B100k126j920R98K319m32j530l51J947k0k043o28K309J698j739k528L12K852
3176A218L82j805j041J588P55j601j520J642K526r66k584l32K101J615j577j666
3192a265R27J436j057j718J037K044J98k566j147J831K069j195j782K71J802M9
$$ plain form
3208 934 -978 -1238 1055 1851 -191 -1958 -722 1433 1518 -746 -1176 159 916 -400 -1427 145 1624
3225 1624 602 -1753 -1405 1121 2244 -126 -1305 -144 1117 294 -1226 -266 1599 1161 -1216 -2094
3241 -2094 429 2031 494 -1663 -732 1001 699 -935 -880 1066 1631 -958 -2194 -440 1882 1354
3257 1354 -1286 -1405 315 1131 -351 -1225 316 1693 -262 -1859 -1045 1646 1590 -648 -1560 -79 1314
3274 1314 66 -1223 -117 1649 434 -1430 -1391 1001 2241 15 -1333 -672 1209 580 -974 -547
3290 -547 953 1164 -897 -1710 277 1887 795 -1468 -1330 891 1287 -331 -1087 726 1218 -762 -1570
3307 -1570 -490 1822 1323 -1186 -1553 152 1432 186 -1238 -79 1462 308 -1629 -761 1246 1651
3323 1651 -559 -1807 -425 1423 947 -929 -676 974 756 -969 -1572 823 2138 159 -1732 -1047
$$ packed form
3208I34j912k60K293P96k042j767J236K155Q5k264m30J335P57j316j027J572J479
3225A624j022k355L48K526J123k370j179J161J261q23j520R60J865m38k377q78
3241b094K523J602j537k157R31J733l02j634N5J946N65k589j236J754K322n28
3257A354k640j19J720Q16j482q74J541J377j955j597Q14K691n6k238r12J481J393
3274A314j248j289J106J766j215j864L9K392J240k226j348O61J881o29j554M27
3290e47J500K11k061q13J987J610j092k263J38K221L96j618p56J813M92j980q08
3307a570J080K312m99k509l67J705J280j246j424J159J541j154j937Q68K007M05
3323A651k210j248J382J848m76j876K53J650k18j725o03K395J315j979j891O85
$$ plain form
3339 -1047 1193 1067 -539 -974 302 1415 -387 -1388 120 1856 840 -1372 -1475 514 1561 -96
3355 -96 -1097 -232 1163 162 -1312 -601 1287 1416 -1037 -1971 190 2021 410 -1147 -216 656 523
3372 523 -1062 -866 1001 1424 -299 -1788 -690 1399 1057 -886 -1208 626 871 -604 -1220 497 1640
3389 1640 398 -1701 -1222 1056 1567 -642 -1442 -244 1183 116 -937 -286 1347 733 -1431 -1623
3405 -1623 940 2074 299 -1508 -648 1068 606 -885 -548 1003 1254 -768 -1799 -60 1852 1047
3421 1047 -1004 -1018 587 1091 -589 -997 473 1452 -198 -1667 -575 1584 1341 -752 -1544 260 1251
3438 1251 53 -1067 -130 1393 569 -1450 -1115 947 1646 -291 -1629 -247 1251 619 -1046 -654
3454 -654 1228 762 -1107 -1401 593 1957 410 -1554 -958 775 744 -556 -1040 787 1062 -482 -1716
$$ packed form
3339a047K240j26j606m35J276J113j802j001J508J736j016k212j03J989J047j657
3355i6j001Q65J395j001j474P11J888J29k453r34K161J831j611j557R31Q72j33
3372E23j585J96J867M23j723j489J098K089l42j943l22J834K45j475o16J717J143
3389A640j242k099M79K278N11k209q00J198J427j067j053O51J633o14k164j92
3405a623K563J134j775j807Q60J716m62j491L37J551K51k022j031J739J912q05
3421A047k051j4J605N04j680m08J470R79j650j469J092K159k43k093p92J804R91
3438A251j198j120R37J523q24k019L35K062O99j937j338J382J498o32j665L92
3454f54J882m66j869k94J994J364j547j964N96J733l1j300m84J827K75j544j234
$$ plain form
3471 -1716 -130 1724 890 -1270 -1353 326 1305 -102 -860 172 1183 -112 -1513 -481 1462 1206
3487 1206 -602 -1654 13 1377 434 -1027 -474 828 805 -1040 -1071 844 1642 -119 -1477 -526 1105
3504 1105 1137 -679 -949 444 921 -619 -1541 291 1742 377 -1477 -1171 903 1317 -261 -1057 -45
3521 -45 1153 131 -1212 -161 1435 947 -1245 -1579 313 1302 279 -1173 -288 1002 580 -956 -649
3538 -649 934 1156 -617 -1876 -292 1178 617 -776 -879 608 851 -704 -1184 726 1271 20 -1536
3555 -1536 -576 1227 1364 -507 -1442 404 1009 93 -1035 -219 1484 392 -1214 -1343 790 1547 -181
3572 -181 -1217 -250 878 307 -1084 -327 1195 1018 -656 -1547 294 1514 451 -1206 -908 469 837
3589 837 -602 -812 730 1041 -576 -1548 -267 1391 1221 -766 -1292 -30 1137 -335 -955 119 1210
$$ packed form
3471a716J586J854q34k160q3J679R79j407p58J032J011j295j401J032J943k56
3487A206j808j052J667J364r43j461N53J302k3j845l1J915P98j761j358R51J631
3504A105L2j816k70J393M77j540r22J832J451j365j854L06K074M14j578p96J012
3521d5J198j022j343J051J596m88k192l34J892R89j023j452Q85J290m22j536L07
3538f49J583K22j773j259J584J470n61j393j03J487K43j555m80J910N45j251j556
3555a536R60J803J37j871r35J846O05r16j128Q16J703j092j606j29K133P57j728
3572a81j036R67J128n71j391P57J522j77j674q91J841J220j063j657K98J377L68
3589H37j439k10J542L11j617r72J281J658j70j987n26J262J167j472o20J074J091
$$ plain form
3606 1210 118 -1418 -964 1012 1396 -427 -1399 -263 1252 271 -871 -278 1154 805 -1178 -1285 797
3623 797 1756 -130 -1381 -342 935 707 -831 -991 576 1051 -471 -1296 254 1636 444 -1346
3639 -1346 -1035 800 1052 -451 -973 297 1081 -31 -1149 -161 1667 1167 -854 -1480 310 1153 381
3656 381 -1053 -389 760 491 -834 -553 898 1313 -247 -1313 -512 1379 786 -681 -501 756 678
3673 678 -824 -1270 602 1381 75 -1347 -674 1090 917 -516 -984 366 1356 -290 -1140 10 1161
3690 1161 447 -1176 -1120 513 1259 0 -1011 27 1002 416 -798 -489 1038 1068 -728 -1503 -59
3707 -59 1292 442 -1122 -608 690 1074 -1048 -498 896 1190 -59 -927 -156 1523 869 -809 -869 368
3725 368 920 -470 -822 258 1380 347 -1256 -927 1144 1284 -201 -971 -145 769 85 -817 -517 1013
$$ packed form
3606A210j092j536M54J976L84j823r72J136J515r81j142N93J432l49j983j07K082
3623G97R59j886j251J039J277k28j538j60J567M75j522q25J550J382j192j790
3639a346L11J835K52j503n22J270P84j112j118R88J828n00k021o26J790Q43p72
3656C81j434O64J149k69j325K81J451M15j560j066Q01J891n93j467J80J257p8
3673F78j502m46J872P79j306j422O73J764j73j433m68J350R90j646q50J150J151
3690A161p14j623N6J633P46j259j011J038R75n86j214L09J527L0j796p75J444
3707e9J351q50j564N14J298L84k122N50J394K94j249q68P71J679o54j678o0J237
3725C68N52j390l52J080J122j033j603L29K071J40j485p70Q26R14o84r02L00J530
$$ plain form
3743 1013 458 -1203 -1244 673 1477 -83 -1248 -155 863 934 -600 -415 637 1043 -526 -1361 -152
3760 -152 1307 789 -1030 -876 532 1189 -540 -1046 235 1109 -156 -1249 -312 1454 976 -694 -1527
3777 -1527 269 1349 60 -740 -210 1052 225 -1099 -693 758 1200 -252 -1259 -379 987 411 -1013
3794 -1013 -564 869 672 -688 -1314 496 1361 507 -1481 -989 766 808 -333 -975 230 836 -136 -1208
3812 -1208 -3 1541 602 -1177 -1060 542 1230 -23 -877 -104 573 16 -1022 -631 920 1024 -570
3829 -570 -1143 55 1440 365 -773 -601 915 740 -626 -875 540 1276 157 -1381 -462 1072 855
3846 855 -595 -935 506 717 -122 -987 151 1060 550 -1210 -1050 927 1217 -12 -1189 24 864
3863 864 211 -1039 -170 1367 658 -1217 -1386 633 1420 46 -983 -349 763 509 -724 -654 916
$$ packed form
3743A013n55j661m1J917Q04j560j165J093J018P1j534J85J052M06j569q35J209
3760a52J459n18j819J54J408O57j729n06J281Q74j265j093R37J766m78j670q33
3777a527J796J080j289q00N30J262q27j324M06J451M42j452j007Q80J366n76j424
3794a013M49J433j97j360o26J810Q65q54j988M92J755M2j141o42J205O06r72j072
3812a208J205J544r39j779J17J602O88j253q54P73O77n57j038L91J551J04j594
3829e70n73J198J385j075j138J72J516j75j366k49J415P36j119j538R19J534k17
3846H55j450l40J441K11q39q65J138R09n10j760J60J977K90j229j177J213Q40
3863H64o53j250Q69J537p09j875j69K019P87j374j029O34J112k54j233P0J570
$$ plain form
3880 916 913 -486 -1194 -207 958 671 -851 -933 306 818 -178 -774 472 1248 -23 -1137 -636 931
3898 931 1126 -456 -1333 -55 914 338 -630 -215 1031 601 -1021 -810 883 1381 -317 -1369 -255
3915 -255 1144 292 -1041 -439 812 592 -966 -1058 419 1222 512 -1067 -656 776 690 -447 -709 616
3933 616 680 -158 -1020 -1 1180 771 -559 -997 288 796 -145 -672 -248 1049 283 -875 -481 761
3951 761 1126 -667 -1336 -275 828 493 -770 -498 1126 737 -829 -855 757 1038 -216 -1217 -268
3968 -268 1044 464 -637 -631 681 891 -473 -936 98 1066 118 -1073 -585 544 784 -476 -1065 76
3986 76 842 76 -705 -356 1073 479 -1140 -1296 -197 1600 860 -1255 -98 874 216 -270 -561 930
4004 930 1197 -363 -1284 -118 1268 598 -857 -513 533 689 -716 -885 443 998 338 -1113 -552
$$ packed form
3880I16lj399p08R87J165k87j522q2J239N12r96n96J246P76j271j114N01J567
3898I31J95j582q77J278R69n76r68M15J246m30j622K11J693M98j698j052J114
3915b55J399q52j333O02J251k20j558r2J477Q03p10j579M11J432q6j137k62J325
3933F16O4q38q62J019J181m09j330m38J285N08r41n27M24J297p66j158L94J242
3951G61L65j793o69J061J103l35j263K72J624l89j566k6J612K81j254j001R49
3968b68J312n80j101OJ312K10j364m63J034R68r48j191M88J129K40j260n89J141
3986G6P66p66p81L49J429n94j619j56J099J797p40k115J157R72o58m86k91J491
4004I30K67j560r21J166J386o70j455L44J046J56j405j69J328N55o60j451N61
$$ plain form
4021 -552 966 562 -366 -660 315 525 -129 -587 198 1172 294 -897 -772 314 896 209 -762 -35 680
4040 680 294 -542 -535 601 478 -426 -1181 -162 1216 625 -1193 -643 641 647 -777 -815 267 1072 -332
4059 -332 -1193 -398 1310 846 -870 -801 451 997 -440 -881 289 1458 -78 -830 -261 1124 86
4076 86 -700 -898 -107 954 87 -565 -52 533 527 -724 -792 215 1106 254 -857 -405 440 785 -411 -685
4096 -685 186 938 -453 -1138 187 1097 419 -979 -890 425 1086 -250 -981 246 932 -24 -1143 -441
4114 -441 1190 791 -1002 -628 721 865 -282 -705 82 644 447 -886 -720 627 899 -206 -1074 -80
4132 -80 675 519 -368 -628 274 722 -552 -712 -111 1196 456 -849 -755 758 1094 -592 -829 89 1008
4151 1008 -276 -1175 -191 1093 388 -880 -1072 426 1020 31 -821 98 985 154 -886 -358 823 462
$$ packed form
4021e52J518m04r28k94R75K10o54m58P85R74q78j191J25J086N82o87r71P27P15
4040F80l86q36PJ136j23r04p55J019J378n91j818N50J284Oj424l8J082Q05j404
4059c32q61P95J708m64j716O9J252N46j437m41J170J169j536p52N69J385j038
4076H6p86j98P91J061q67o52N13N85oj251o8J007Q91q52j111M52Q45L45j196k74
4096f85Q71P52j391o85J325R10o78j398Q9J315O61j336p31J227O86r56j119P02
4114d41J631l99j793L74J349J44j147m23P87N62j97j333J66J347K72j105q68R94
4132h0P55j56q87k60R02M48j274j60O01J307p40j305R4J513L36j686k37R18R19
4151A008j284q99R84J284p05j268j92J498N94r89q52R19Q87q31j040N28J181l61
$$ plain form
4169 462 -614 -1119 -37 887 176 -640 -630 683 477 -473 -707 575 942 -136 -982 -535 636 710 -316
4188 -316 -907 321 695 -103 -769 -58 987 350 -994 -824 780 1244 -560 -946 247 854 234 -783
4206 -783 -271 885 400 -685 -952 456 1290 183 -992 -243 410 448 -532 -598 588 698 -296 -1064 -21
4225 -21 1064 356 -768 -745 530 651 -123 -561 -85 744 272 -933 -508 790 609 -198 -1097 -138 797
4244 797 49 -996 -357 943 534 -935 -901 689 1124 -238 -1144 -299 1063 104 -757 -707 494 383
4262 383 -618 -803 398 1280 -18 -776 -337 542 633 -336 -579 223 842 -321 -851 -119 595 261 -646
4281 -646 -837 473 872 88 -630 -374 811 267 -544 -756 557 747 -213 -1061 24 977 259 -631 -581
4300 -581 618 428 -613 -946 481 1139 -235 -1112 -301 935 508 -730 -584 365 629 -256 -836 147
$$ packed form
4169D62j076n05J082R24p11q16J0J313k06r50k34J282L67j078q46M47J171P4j026
4188c16n91J228L74p98o66P11J045o37j344J70J604M64j804l86J193O07o20j017
4206g83N12J156m85j085k67J408Q34j107j175P49O53L8r80o6J186J10r94p68J043
4225b1J085p08j124K3J275J21p74m38M76Q29m72j205M25J298j81q07q99R59R35
4244G97p48j045O39J300m09j469L4J590M35j362r06Q45J362r59q61N0J201j11
4262C83j001j85J201Q82j298p58M39Q79R1r69k43Q02O19j163n30P32P14l34r07
4281f46j91J310L99p84p18K56J185n44q11k12J313J90r60q48J085R53p18q90N0
4300e81J199j90j041l33J427O58j374q77Q11J236m27j238J46R49K64q85n80R83
$$ plain form
4318 147 919 345 -745 -692 444 726 -47 -601 13 676 265 -629 -356 909 428 -530 -1018 262 975
4337 975 289 -824 -379 606 550 -534 -925 480 1075 -151 -935 -73 880 521 -1127 -299 769 589
4355 589 -919 -783 227 933 703 -904 -299 789 663 -182 -767 208 659 -36 -345 -183 726 112 -929
4374 -929 -572 83 844 -43 -685 -248 679 382 -457 -476 709 731 -658 -936 104 854 390 -828 -507
4393 -507 683 610 -382 -610 598 835 -107 -1178 -157 1014 666 -449 -769 583 805 -103 -548 68
4411 68 549 -65 -655 -393 636 582 -502 -898 -14 643 336 -552 -413 348 434 -654 -688 -34 776 -6
4431 -6 -658 -406 561 648 -333 -605 204 771 -5 -1098 -356 798 668 -775 -860 350 870 14 -669 -22
4451 -22 838 96 -952 -359 701 418 -715 -1071 -87 606 113 -695 -235 644 273 -536 -497 336 805 -283
$$ packed form
4318A47P72n74j090N3J136K82p73n54O14O63m11q94K73J265m81r58m88J280P13
4337I75o86j113M45R85n6j084l91J405N95j226p84Q62R53l59j648Q28J068j80
4355E89j508J36J010P06k30j607O05J088j26q45n85R75M51o95l09J62R09o14j041
4374i29L57O55P61q87o42M37R27k97q39j9J185K2j389k78J040P50m64j218L21
4393e07J190p3r92k28J208K37r42j071J021J171l48j115l20J352K22r08m45O16
4411F8M81o14n90K62J029n4j084l96Q84O57l07q88J39P61Q6j088l4O54Q10p82
4431fo52K52R67Q7r81k72Q09N67p76j093P42J154j30j443q5J210N20q56o83O47
4451b2Q60p42j048N93J060k83j133l56R84O93m93q08M60Q79l71q09L9Q33M69j088
$$ plain form
4471 -283 -857 -241 607 471 -343 -519 404 564 -172 -688 67 782 90 -721 -608 825 627 -208 -583 145
4491 145 893 204 -860 -290 711 511 -856 -781 568 805 -1 -611 -277 562 72 -691 -210 752 777
4510 777 -327 -598 96 906 370 -529 -594 368 404 -227 -710 120 502 -479 -801 -156 810 420 -329 -818
4530 -818 28 913 -192 -623 110 701 416 -716 -491 378 592 -364 -857 -86 704 41 -708 -407 501
4549 501 644 -681 -778 224 852 1 -853 -509 554 242 -570 -485 499 627 37 -917 30 776 113 -582
4569 -582 -445 470 831 -156 -414 8 874 288 -379 -505 452 594 -366 -736 102 700 324 -664 -268 777
4589 777 71 -455 -345 369 826 -230 -865 -367 826 543 -705 -300 455 677 -455 -714 200 885 106
4608 106 -930 -509 568 567 -220 -804 204 626 -24 -921 -235 810 568 -857 -537 324 698 361 -743
$$ packed form
4471b83n74O16Q48j36q14j76R23J60p36n16P55P15o92q11J13J433j98q35l75P28
4491A45P48o89j064N70J001k00j367P5J349K37q06o10L34Q39m90p63M81R62K5
4510G77j104k71O94Q10n36q99o5R62L6o31m83Q30L82r81l22O45R66l90p49m89
4530h18Q46Q85j105m31P33N91k85j132K25Q69K14r56m93P71P90o63p49L01R08
4549E01J43j325r7J002O28q51q54L44J063l12q12Q5R84J28n90r54R47P46o63o95
4569e82J37R15L61r87k58M22Q66n86o67j26R57J42r60l70Q38N98l76r88L96J045
4589G77p06n26J10P14M57j056o35M98J193k83j248M05P55K22j132k59R14O85p79
4608A06j036M21J077jp87n84J008M22o50q97O86J045k42j425L20Q61L74l37j104
$$ plain form
4627 -743 -272 512 409 -521 -468 587 467 -318 -756 -63 515 235 -655 -429 308 761 -433 -386 423 905
4647 905 -21 -984 -271 920 805 -336 -639 493 457 -387 -532 40 898 374 -616 -561 613 617 -80 -852
4667 -852 -113 504 1 -718 -276 437 431 -468 -677 326 664 350 -853 -528 625 478 -370 -440 710 818
4687 818 -229 -765 -314 736 473 -400 -359 515 375 -163 -817 138 745 -24 -643 -540 774 517 -120
4706 -120 -612 -19 842 -182 -579 -20 568 170 -630 -462 245 718 -41 -752 -279 639 540 -464 -423 677
4726 677 349 -242 -703 185 1027 -60 -431 -542 265 304 -406 -547 167 505 -181 -797 -57 678 567 -269
4746 -269 -501 234 786 -157 -425 -118 735 303 -579 -414 619 817 -234 -621 14 598 415 -350 -351 590
4766 590 375 -206 -495 91 775 57 -537 -363 799 881 -481 -639 337 569 -274 -839 46 603 489 -460
$$ packed form
4627g43M71P84j03r30N3J055j20p85m38O93N78k80q90K26P37M53j194M7Q09M82
4647I05r26r63P13J191j15j141l03J132l6q44j45N72Q58n24r90N5J174Mo97p72
4667h52P39O17n03p19M42P13oq99k09J003L38l14j203L25J153j47q48p0J150J08
4687H18j047n36M51J050k63q73M1Q74j40n38o54R55O07p69o19J03J314k57o37
4706a20m92N93Q61j024l97N59N88l98q00J68P07M73p59p11M73R18r9j004M1J100
4726F77l28n91m61Q88Q42j087l71j11Q07L9p10j41P14L38o86o16P40P35j11q36
4746b69k32P35N52r43k68L07Q53m32q82J65J033J98j051l87O35N84j83p65jR41
4766E90k15n81k89N86O84p18n94J74J162Q2j362j58R76K32q43n65Q85N57j14r49
$$ plain form
4786 -460 -300 303 711 24 -638 81 392 137 -709 -366 253 407 -454 -431 128 753 145 -720 -318 287
4806 287 454 -466 -331 488 648 -354 -652 -205 624 517 -386 -525 395 434 -360 -644 -89 651 72 -827
4826 -827 -485 579 698 -281 -770 -15 512 -96 -590 -92 663 557 -517 -574 366 585 148 -686 -256 544
4846 544 245 -630 -355 464 667 -261 -454 -131 648 139 -677 -424 296 630 -237 -443 67 658 -18 -788
4866 -788 -201 774 642 -153 -486 131 527 190 -669 -118 735 304 -537 -769 473 594 193 -792 -100 399
4886 399 62 -417 -453 292 350 -272 -400 255 855 -17 -598 -210 306 509 -437 -693 315 380 157 -837 190
4907 190 544 204 -343 -550 118 565 23 -417 17 716 178 -457 -252 521 640 -74 -625 96 684 301
4927 301 -545 -269 438 185 -424 -579 269 593 -339 -828 -221 531 485 -456 -652 346 402 -272 -556 91 717
$$ packed form
4786d60J60O03M08o87o62P19L11k55q46L43O19J54q61K3N59O25o08q65M02O05
4806B87J67r20J35Q19J60j002k98M47Q29j07r03j39R20L9p94k84N55P40n79q99
4826h27L42J064J19r79m89P55N27o08m94M98P55j06j074n7R40K19m37q34M30Q00
4846E44k99q75K75Q19K03r28j93L23P79n09q16K53P20L34q67k06N10N91o76p70
4866g88N87R75j32p95l33O17L96l37q59N51Q53m31q41k32J242J21m01r85O92M99
4886C99l37m79l6P45N8o22j28O55O00q72n81L88N16K03r46k56J008O5k23r94J027
4907A90L54l40n47k07O68M47n42m40M34O99n38o35K05P73J19p14n51P21N88l83
4927C01q46K76P07k53o09j55Q48L24r32m89O07P52m6r41j96R98N6o74k84O47O26
$$ plain form
4948 717 110 -376 -766 489 569 -319 -445 182 417 -13 -663 -219 501 577 -279 -567 272 687 -27 -548
4968 -548 29 589 369 -600 -479 288 427 -230 -525 -65 497 445 -675 -596 342 548 -395 -531 175 654
4988 654 172 -706 -431 644 504 -218 -603 39 509 -157 -481 -166 425 148 -417 -486 216 643 -95 -509
5008 -509 -198 411 289 -429 -514 412 492 -400 -556 99 556 248 -616 -227 501 329 -285 -511 113 605 -161
5029 -161 -521 -250 527 425 -233 -561 135 686 -221 -718 -6 757 404 -602 -421 394 732 -267 -580 285
5049 285 800 147 -269 -219 262 279 -509 -584 264 624 -56 -455 -164 330 324 -259 -718 -26 392 -293 -520 -119
5071 -119 657 439 -316 -385 378 481 -20 -306 60 677 236 -722 -337 609 452 -232 -702 235 537 236
5091 236 -782 -256 608 476 -427 -511 428 799 -206 -818 -253 860 225 -551 -443 203 271 -208 -387 198
$$ packed form
4948G17o07m86l90J255Q0q88j26O27K35m30o50M44P20P6q56k88Q39M15p14n21
4968e48N77N60k20r69J21P67J39o57k95M60N62n2j120P9R38K06r43j36P06M79
4988F54m82q78K75J075j40p22l85O42M70o66l24L15N91k77n65o9P02M27p38m14
5008e09L11O09j22p18q5R26Q0q92j56O55M57l08q64L89P28j72o14k26O24M92p66
5029a61l60K71P77j02o58l28O96N51r07m97P12P63l53j006J81Q15L38r99l13Q65
5049B85N15o53m16N0M81J7p88p5Q48L60o80l99K91M94on83m59O92M18o85k27M01
5071a19P76k18p55o9P63J03n01k86L66O17m41r58L85R46j57o84m70R37L02l01
5091B36j018N26Q64j32r03q4R39L71j005o12N65J113o35p76J08O46O8m79j79N85
$$ plain form
5111 198 492 126 -694 -288 562 458 -182 -495 159 497 -26 -592 59 709 588 -274 -310 167 486 57
5131 57 -606 30 608 172 -413 -137 407 625 -347 -580 -162 787 239 -464 -150 526 648 -537 -566 189
5151 189 645 -78 -625 -231 775 314 -465 -559 122 613 -120 -751 -18 364 72 -394 -175 384 496 -271
5171 -271 -182 239 711 97 -444 -264 636 211 -300 -240 160 653 138 -326 -233 541 457 -336 -468 249 376
5192 376 86 -726 -48 551 405 -476 -417 333 536 -321 -317 279 536 378 -529 -134 339 352 -111 -540 -159
5213 -159 719 -17 -415 -111 494 335 -468 -644 306 275 -17 -490 10 604 222 -518 -393 109 360 -238
5233 -238 -621 58 608 122 -253 -443 380 267 -234 -551 -126 533 -27 -541 -295 597 218 -205 -548 359
5253 359 528 41 -321 -104 351 167 -277 -261 311 658 -276 -739 141 742 332 -307 -148 395 226 -371
$$ packed form
5111A98K94l66q20M06Q50j04o40l13O54L38n23n66O51O50j21q62l6M77L19m29
5131E7o63O36N78m36n85K76N44K18r72k33M18R49n48p03L14O76J22j185k9P55
5151A89M56p23n47L94J006m61p79r4O81M91p33o31P33L82k92m66K19N59J12p67
5171b71Q9M21M72o14n41J80R00m25n11O0M00M93n15m64R3P74q4p93j32P17J27
5192C76k90q12O78N99j46q81N9P50K03q57MN96K57j58r07L95M73J3m63m29L81
5213a59Q78p36l98L04O05j59q03j76R50l1k92m73N00N94l82p40J25N02K51n98
5233b38l83O79N50m86l75j90Q23j13n01l17M25O59n60n14K46Q92l79m23l43R07
5253C59J69m87l62K17M55j84m44J6N72L47r34m63Q80O01m10o39J59N43j69n97
$$ plain form
5273 -371 -247 113 468 -284 -673 -312 390 480 -390 -471 169 180 -295 -657 31 657 243 -524 -462 317 463
5294 463 -115 -539 62 411 343 -292 -261 567 186 -307 -343 -9 667 45 -490 -388 345 184 -151 -277 327
5315 327 501 -124 -613 -56 496 346 -574 -396 304 504 -28 -469 93 366 -86 -387 -461 464 470 -446 -501
5336 -501 52 433 -85 -613 -127 269 112 -434 -470 326 553 -130 -482 -27 468 447 -414 -283 232 448 -303
5357 -303 -577 -71 565 41 -326 -301 373 291 -80 -400 74 260 -83 -492 -41 719 375 -231 -440 165 373
5378 373 81 -205 -138 497 85 -595 -425 304 275 -293 -596 -150 306 99 -291 -350 341 388 -277 -438 92
5399 92 513 -58 -358 -172 366 322 -444 -673 31 411 34 -454 -67 219 384 -326 -456 284 390 -154 -418
5420 -418 58 329 -71 -280 -211 449 284 -122 -372 -75 503 15 -460 -86 396 375 -356 -296 226 689 5
$$ packed form
5273c71J24L60L55p52l89L61P02R0q70q1O40J1m75l62O88O26m14p67O2P79J46
5294D63n78m24O01L49o8o35L1Q28l81m93l6L34O76o22n35J02P33j61l35j26O04
5315C27J74o25m89N57N52j50r20J78P00K00n32m41N62K73m52l01p4R25Or16n5
5336e01N53L81n18n28M86L96j57n46l6P96K27o83l52M55M95k1q61J31N15K16p51
5357c03k74N06O36n24l67K5O74q2l71l20M74J86l43m09M51P60l44o06k09O05K08
5378C73k92k86O7O35m12o80J70P29k9n68l03M46M56k07l90n9O91M7o65j61N30
5399I2M21n71l00J86N38m4p66k29P04L80l77m88L87K86J65p10j30P40J06n44k64
5420d18M76K71m00k09O9O60j65m06k50K97N78m88m75L74M82k1p31O0N22M63o84
$$ plain form
5441 5 -609 -239 352 350 -247 -267 222 289 120 -498 110 640 126 -376 -245 192 330 -399 -502 111 423 67
5463 67 -313 -208 369 373 -376 -718 113 542 13 -265 -87 390 14 -398 -412 381 496 -394 -441 167 592 42
5485 42 -229 -163 63 290 -232 -251 95 376 -82 -515 27 661 173 -399 -135 86 493 -72 -424 -113 442
5506 442 -11 -356 -374 380 444 -5 -474 -199 530 133 -460 -194 370 561 -387 -459 -50 560 174 -549 -311
5527 -311 358 129 -121 -135 375 627 -210 -519 -50 493 186 -320 -289 261 423 72 -444 -122 352 146 -339
5548 -339 -135 220 312 -144 -343 -113 464 398 -405 -261 424 145 -351 -496 231 531 -177 -523 -128 316 327
5569 327 -236 -235 204 329 -117 -526 -109 437 6 -429 -390 131 439 -42 -495 -220 546 83 -210 -165 449
5590 449 267 -314 -707 451 683 21 -289 -91 219 247 -274 -348 111 295 -269 -467 140 484 174 -412
$$ packed form
5441Eo14L70N91kn97k0M89O7j69o18O08N30n14n02J31M37J38p29j03O13L12l56
5463F7l80J05N77Mp49l42Q31M29n29k78J78M77l76m12j4P93J15q90m7O08M25n50
5485D2k71O6K26K27n22j9L46K81m58m33N42O34m88n72K64K21M07n65l52L11N55
5506D42m53l45j8P54O4m49m69K75P29l97n93K66N64J91r48p2M09O10l86p23K38
5527c11O69k29k50j4N10K52q37l09M69N43l07n06L1N50J62l51n16L22M74k06m85
5548c39K04L55R2m56j99K30N77o6q03J44O85k79m96j45P27L00p08l46L95M44J1
5569C27n63JM39J25m46m09M17N46m31m35L9N21L08m81m53K75P66m63k93M5O14
5590D49j82n81l93J158K32o62l10J98L10K8n21p4M59J84n64j98O07L44l10n86
$$ plain form
5610 -412 -405 370 160 -597 -137 134 474 -136 -350 -241 177 365 -186 -485 132 228 59 -286 40 618 220
5631 220 -340 -592 -34 357 -185 -356 -233 517 301 -433 -392 285 379 -326 -393 38 513 173 -610 -169 275
5652 275 204 -360 -132 -41 359 -62 -255 -41 426 722 -71 -377 224 216 -339 -528 75 307 -85 -236 -209 463
5674 463 462 -26 -442 110 143 165 -259 -38 219 319 -432 -466 207 163 47 -204 84 350 68 -314 -121 61
5696 61 320 -207 -391 171 447 260 -447 -335 227 386 -43 -296 39 209 -67 -500 -79 549 364 -216
5716 -216 -513 214 167 151 -400 -90 534 240 -317 -384 249 533 121 -430 31 267 76 -226 -379 304 308 -383
5738 -383 -300 -11 432 19 -224 -132 448 291 -42 -522 16 601 -24 -309 -51 340 295 -212 -354 394 516
5759 516 -201 -436 173 280 -51 -479 -220 412 316 -328 -418 -156 225 13 -348 -76 354 373 -165 -30 207
$$ packed form
5610d12PP75k10p57M60K71L40o10k14J09M18J88n51k99O17R6j69l45L26N78l98
5631B20n60k52N58L91n42j71J23P50k16p34M1O77R4p05o7M31M75l40p83M41M44
5652B75p1n64K28R1M00m21j93K14M67K96p93l06O01qn55j89O03K32l92j51K7O72
5674D63jm88m16N52L3K2m24K21K57J00p51l4O73m4j16k51K88K66k82l82J93J82
5696F1K59n27j84N62K76j87p07J12N62J59m29k53L35J70k76m33M21O28j85n80
5716b16k97P27m7j6n51L10O24k94n57o7O33K84m12n51M61K36j91l02j53O83Mo91
5738c83Q3K89M43m13k43R2N80j57l33m80N38N85o25k85K58L91m5n07j42P48J22
5759E16p17k35O09J07l31m28K59O32r6o44r0K62L81k12l61K72M30J9n38J35K37
$$ plain form
5780 207 464 -233 -370 -178 59 317 -41 -199 219 367 -104 -638 41 426 165 -268 -268 257 316 -370 -364 46
5802 46 496 -163 -245 -175 199 360 -211 -514 82 508 92 -490 -142 225 -18 -74 -288 373 425 -179 -465 -71
5824 -71 329 314 -104 -353 182 358 -372 -453 51 514 -171 -481 -157 458 331 -298 -221 121 90 -85 -209 -323
5846 -323 366 236 -307 -89 220 270 -67 -655 -70 338 365 -520 -287 120 572 -141 -484 191 480 49 -353
5867 -353 -203 308 175 -126 -303 92 223 -199 -342 -137 327 235 -136 -390 -35 367 49 -633 1 313
5887 313 -29 -359 -147 222 217 76 -509 109 347 -103 -599 -412 230 174 -79 -249 108 339 -2 -616 -91
5908 -91 504 221 -349 -83 252 307 111 -451 40 479 148 -155 -257 186 104 251 37 -76 110 33 -192
5929 -192 -92 62 534 63 -149 32 487 -5 -235 -471 163 384 -293 -29 410 363 -201 -188 -31 178 132
$$ packed form
5780B07K57o97j37J92K37K58l58j58M18J48m71n34O79L85k61m33%N25N9o86OM10
5802D6M50o59q2P0L74J61n71l03N96M26m16n82L48L67k43n6k14O61N2o04k86L94
5824g1M00j5m18k49N35J76p30q1N04M63o85l10L24O15j27o29P7L42l1j75j24j14
5846c23O89j30n43K18L09N0l37n88N85M08K7q85K33M07M52p13l43O75K89m31m02
5867c53J50N11j33l01j77L95J31m22j43K05M64r2l71k54L55M02l18o82O34L12
5887C13l42l30K12L69nj41n85O18K38m50m96J87O42n6k53j70L57K31l41o14N25
5908i1N95k83n70K66L35N5j96n62M91M39l31l03j02M43q2J47k14j13J86p7k25
5929a92J00J54M72m71k12J81M55m92k30k36O34K21o77K64M39m7n64J3J57K09m6
$$ plain form
5950 132 -157 -342 70 235 -359 -176 -22 104 -42 -524 -107 261 335 -281 -343 -122 187 -67 -378 220 454
5971 454 296 -144 -148 142 283 -18 -540 -136 117 -252 -291 -162 231 333 -265 -248 297 317 -41 -388 -89 139
5993 139 255 -349 -363 58 311 -2 -396 -41 89 195 -271 -138 179 243 34 -276 85 446 34 -415 -371
6014 -371 357 261 -216 -460 98 269 109 -226 -13 342 201 -58 -242 67 381 -31 -377 58 33 198 -159
6035 -159 -257 -60 218 -22 -254 -14 76 293 -309 -385 287 277 13 -291 -88 88 216 -55 68 260 10
6056 10 -548 -148 35 314 -104 -327 -58 167 50 -421 -355 296 315 -206 -414 -29 314 188 -303 -204 122
6077 122 198 -362 -418 20 166 -18 -472 -124 66 315 -65 -478 97 285 65 -309 -23 587 289 -370 -146
6098 -146 135 242 -17 -462 295 312 249 -186 -47 17 129 -139 -271 137 397 -6 -450 -60 264 203 -155
$$ packed form
5950A32k89j85M12J65n94J83J54J26j46m82M17L68P4o16o2K21L09k54l11N98K34
5971D54j58m40mK90J41l01n22M04K53l69l9J29L93J02n98J7N45K0l58l47K99K28
5993A39J16o04j4M21K53l13l94L55J30J06m66J33L17O4k09l10L61L61m12m49M4
6014c71P28r6m77k44N58J71j60l35K13L55j41k59j84L09L14m12l46M35k5J65l57
6035a59r8J97K78k40k32K40R0K17o02p6O72j0k64l04K03J76J28k71J23J92k50
6056A0n58M00J83K79m18k23K69K25j17m71O6O51J9n21k08L85L43j26m91R9L26
6077A22P6n60n6M38J46j84m54L48J90K49l80m13N75J88k20l74K86O10k98o59K24
6098a46K81J07k59m45P57J7o3m35J39O4J12k68j32M08K60m03m44L90L24o1l58
$$ plain form
6119 -155 -132 136 341 -195 73 -9 495 225 -320 52 -226 291 55 -191 100 4 22 -250 -188 144 144 66 -291
6142 -291 -88 209 -30 -350 -252 163 297 -262 -381 148 385 -88 -432 121 434 130 -124 -185 401 360 -206
6163 -206 -213 191 414 13 -267 -176 162 303 79 -104 23 112 -226 -264 -352 -370 425 224 -412 -300 1490 -332
6185 -332 283 376 88 448 -129 -120 69 246 -46 -164 6 360 61 -261 -446 263 508 -145 -302 106 375
6206 375 -54 -216 -67 295 28 -33 -110 310 363 14 -283 -80 77 -81 119 -85 496 193 313 -266 -183
6227 -183 475 1 -448 -77 202 593 -51 -539 -113 165 215 -378 -607 81 72 24 -252 -73 419 -265 -368
6248 -368 86 424 298 -394 17 79 240 -46 -277 68 458 24 -223 -4 339 203 -97 -379 -273 265
6268 265 153 -118 171 -179 172 -50 -310 176 16 -5 -386 -12 123 257 -109 -6 94 187 -115 -106 145
$$ packed form
6119a55K3K68K05n36K68q2N04k70n45L72k78N17k36k46K91r6J8k72O2L32%p8l57
6142b91K03K97k39l20R8M15J34n59j19N29K37m73l44N53L13l04k54o1N86m1n66
6163b06pM04K23m01k80R1L38J41k24j83J27Q9l38l8q8j8P95k01o36J12J790j822
6185c32O15R3k88L60n77RJ89J77k92j18J70L54k99l22j85P09K45o53j57M08K69
6206C75m29j62J49L62k67o1p7M20N3l49k97K03J57j58K00k04N81l03J20n79Q3
6227a83O58m74m49L71K79L91o44m88M26K78N0n93k29O88rm8k76J79M92o84j03
6248c68M54L38j26o92M11O2J61k86k31L45L90m34k47K19L43j36l00k82J06N38
6268B65j12k71K89l50L51k22k60M86j60k1l81L74J35J34l66J03J00R3l02RK51
$$ plain form
6289 145 165 159 -324 -264 51 152 -22 -361 160 353 56 -100 44 261 153 -296 -52 106 334 -54 -374
6310 -374 -175 308 253 -369 5 195 322 -74 -206 245 247 81 63 -263 229 369 -164 -418 17 295 99
6331 99 -333 -111 16 99 -161 -354 95 196 160 -221 -280 373 143 -238 -233 208 381 27 -334 -86 298 64
6353 64 -461 -326 373 338 -108 -232 53 185 -42 -329 84 32 -18 -222 -371 126 438 93 -64 -160 316 176
6375 176 -80 -101 266 -19 -14 -160 -71 169 113 -236 -384 117 292 -29 -392 -65 241 203 -426 -204 47 99
6397 99 -193 37 55 469 -188 -316 -136 215 58 -166 -404 337 98 -60 -220 -105 244 88 -239 -252 74
6418 74 93 55 -200 66 155 56 -267 30 6 392 -53 -262 -21 67 119 -228 -115 211 139 -170 -372 -168 163
6441 163 -216 -407 22 520 135 -292 -316 172 152 -283 -295 119 39 -25 -270 -246 394 214 -130 -177 -19 289
$$ packed form
6289A45K0om83O0L15J01j74l39N21J93k97j56J44K17j08m49K44J58K28l88l20
6310c74J99M83n5o22L74J90J27l96j32M51Kj66j8l26M92J40n33k54M35K78j96
6331I9m32K22J27Q3k60j93M49J01l6l81n9O53k30l81NM41J73l54l61K48L84k34
6353F4n25J35O99l5m46j24K85J32k27k87M13n2n0k04j49M97L12l45j57r6M76j40
6375A76k56k1L67k85Nj46Q9K40n6l49j48N01J75l21l63L27L06l8o29K22K51N2
6397I9k92K30J8M14o57j28J80L51j57k24k38P41k39j58j60J15L49j56l27j3L26
6418G4J9l8k55K66Q9r9l23K97k4L86m45k09K41Q8N2l47J13L26p2l09k02K04L31
6441A63l79j91M29M98l85m27k4M88k0m35j2M14q0o4k45K4O40j80l44m7J58L08
$$ plain form
6463 289 -132 -148 -152 94 40 -119 -278 13 259 125 -49 -176 186 48 -43 -341 -88 247 -105 -376 69 283
6485 283 66 -333 -140 194 124 -141 -344 142 334 15 -394 -153 218 306 -379 -54 191 -6 41 -175 -73
6506 -73 479 170 -156 -285 111 134 -135 -348 -27 437 319 -510 -106 6 78 188 -159 25 458 47 -370
6527 -370 -116 254 60 -296 -100 101 254 -108 -268 127 305 210 -218 -37 271 312 88 -84 -52 385 -74
6548 -74 -247 -356 74 97 -118 -328 125 93 -48 -173 109 78 -1 -242 -121 177 471 -15 -83 6 137 -35
6570 -35 -391 -58 -16 410 -147 -327 45 231 179 -358 -177 201 368 -76 -272 178 338 239 -367 -29 329
6591 329 142 -87 -2 117 86 32 -234 -235 136 160 -189 -173 43 237 16 -137 -186 243 -101 -330 -340 139 204
6614 204 -151 -346 238 249 11 -458 134 22 -103 -21 -340 -6 160 29 -340 -91 430 -199 -212 -202 152
$$ packed form
6463B89m21j6mK46n4j59j59K91K46j34j74j27L62j38r1k98K53L35l52k71M45K14
6485B83k17l99J93L34p0k65k03M86J92l19m09K41L71Q8o85L25K45j97M7k16J02
6506g3N52l09l26j29L96K3k69k13L21M64j18q29M04J12P2J10l47J84M33m11m17
6527c70K54L70j94l56J96K01J53l62j60L95J78r5m28J81L08M1k24j72L2M37m59
6548g4j73j09M30K3k15k10M53l2j41j25K82l1p9k41J21K98K94m86o8Q9J31j72
6570c5l56L33M2M26n57j80L72J86n2n37J81L78J67m44j96M50J60r9o06L38L58
6591C29j87k29Q5J19l1n4k66jL71K4l49J6K16J94k21j53m9M29l44k29j0M79O5
6614B04l55j95N84J1k38m69N92j12j25Q2l19L34J66j31l69K49N21o29j3J0L54
$$ plain form
6635 152 304 37 -191 52 454 -103 -199 38 17 342 -358 -127 132 249 -182 -71 -88 5 -250 -231 -172 14
6657 14 105 11 -252 -205 426 37 -43 -43 11 258 -138 -267 132 66 88 -290 -168 56 -52 -6 -131 159 185 114
6681 114 -86 46 207 131 90 -72 68 386 12 -238 -294 86 323 -185 -41 70 200 -83 -134 144 163 193
6703 193 -294 -192 69 112 -91 10 225 187 174 -377 154 -83 57 5 -195 -61 99 -27 -456 159 162 -61
6725 -61 -220 -199 57 -13 212 -281 -78 285 195 -188 -129 51 215 -65 -96 -49 212 -175 -228 -66 160 331 -321
6748 -321 -220 86 181 -30 -243 -74 95 -113 -292 -65 154 241 -31 -152 -29 193 196 -312 74 102 -2 -12
6770 -12 -191 15 194 -20 -259 5 244 60 -73 -321 -2 70 -135 -559 -15 239 343 -405 -176 385 -33
6791 -33 104 -325 114 343 -54 -306 -154 228 173 -54 -76 236 251 76 -217 -128 185 -51 -324 -85 166 91
$$ packed form
6635A52J52k67k28K43M02n57r6K37k1L25p00K31K59J17m31J11j7R3k55J9N9J86
6657A4R1r4k63M7O31l89q0%N4K47l96j29L99o6K2l78J22K24j08M6j25K90K6p1
6681A14k00J32J61p6m1j62J40L18l74k50n6L80K37n08J44J11J30k83n1K78J9L0
6703A93m87J02K61M3k03J01K15l8j3n51N31k37J40n2k00J34J60j26m29O15Lk23
6725f1j59K1K56p0K25m93K03L63r0l83N9J80J64k80l1M7K61l87n3J62K26J71o52
6748c21J01L06R5k11k13J69J69k08j79K27K19Q7k72j21J23K22Ln08L86K8j04j0
6770a2j79K06J79k14k39K64K39j84j33k48L19P2k05m24N44K54J04p48K29N61m18
6791c3J37m29M39K29l97k52J52L82n5k27k2L12J5j75k93Q9L13k36k73K39K51p5
$$ plain form
6813 91 -61 -253 -274 218 191 -289 -185 280 121 -67 -247 101 354 380 -81 -63 96 -142 18 -185 209 139
6835 139 -112 -302 -24 267 -311 33 -252 -38 94 -113 -121 -100 260 150 -149 -260 51 357 218 -59 203
6856 203 304 195 -29 -189 138 271 81 -18 237 466 165 -164 141 -51 109 -36 -57 194 244 -19 -268
6877 -268 40 28 125 11 -74 -86 216 44 -55 -8 90 125 -74 -303 280 188 -435 -265 29 104 -189 -188 -146 106
6901 106 -125 -37 -65 -171 385 -54 -95 -5 98 27 -256 -106 145 404 16 -258 67 5 -148 -95 -27 99 345
6924 345 40 -203 223 112 80 -271 -28 -192 84 -94 -203 367 130 -8 -131 -54 148 102 -101 -66 124
6945 124 363 -115 -332 -110 21 -94 -57 2 274 73 -109 -277 184 243 -36 -227 8 -79 318 59 -248
6966 -248 -4 55 -52 -161 -74 414 255 122 -205 149 207 -40 -67 92 110 239 -341 17 92 113 -253 -328 74
$$ packed form
6813I1j52j92k1M92k7m80J04M65j59j88j80L48K53K6m61J8J59k38J60k03L94p0
6835A39k51j90K78K91n78L44k85K14J32k07qK1L60j10k99j11L11L06j39k77K62
6856B03J01j09k24j60L27J33j90r9K55K29l01l29L05j92J60j45k1K51N0k63k49
6877b68L08j2R7j14q5j2L02j72r9M7R8L5j99k29N83r2o23J70K94P5k93JM2K52
6901A06k31Q8k8j06N56m39m1R0J03p1k83J50K51K59l88k74L25o2j53N3O8J26K46
6924C45l05k43M26j11l2l51K43j64K76j78j09N70k37j38j23P7K02m6k03L5J90
6945A24K39m78k17K22J31j15L7N9K72k01j82j68M61N9k79j91K35q7L97k59l07
6966b48K44N9j07j09Q7M88j59j33l27L54N8k47k7J59J8J29n80L58P5K1l66p5M02
$$ plain form
6989 74 481 139 -69 7 377 -60 -80 238 146 196 -177 -170 23 218 112 -239 -273 -49 168 -101 52 116 181
7012 181 128 -365 2 114 72 146 -222 -35 0 77 -70 -189 256 33 128 -353 29 287 131 -123 126 51
7034 51 83 -217 -151 -49 162 154 -151 113 -22 182 187 45 233 160 -31 67 -20 253 164 36 -120 260 177 -167
7058 -167 -70 18 88 -30 -48 -192 -5 122 -4 -274 210 158 14 -329 186 160 -154 -121 -153 140 17 -255 166
7081 166 118 108 55 -305 85 221 152 -11 -144 315 27 -7 -49 -167 235 81 1 -63 0 189 18 -53 -73 322
7105 322 245 -61 -200 36 77 2 -57 -42 409 12 -27 -189 67 95 -29 -332 91 -10 -14 -305 31 92 -74
7128 -74 145 -52 188 -40 -67 -430 -74 59 312 -8 -171 127 139 252 65 -101 261 58 15 -14 227 239
7150 239 129 -160 78 100 14 -250 10 199 99 51 -75 101 -126 -80 91 -168 65 140 -37 44 -140 36
$$ packed form
6989G4M07l42k08P6L70m37k0L18r2N0l73PJ93J95j06l51l4K24K17k69J53O4O5
7012A81n3m93L67J12m2P4l68J87L5P7j47j19M45k23R5m81L82K58j56k54K49p5
7034E1L2l00O6J02K11ql05K64j35K04Nj42J88p3j91R8q7K73q9j28j56L80q3l44
7058a67R7Q8P0j18j8j44J87J27j26k70M84n2j44l43N15k6l14L3l2K93j23k72M21
7081A66m8j0n3l60L90J36o9j63j33M59k88l4m2j18M02j54q0o4O3J89j71p1k0L95
7105C22p7l06j39K36M1p5n9J5M51l97l9j62K56K8j24l03M23j01mk91L36O1j66
7128g4K19j97K40k28k7l63L56J33K53l20j63K98J2J13j87j66L62k03m3k9K41J2
7150B39j10k89K38K2q6k64K60J89j00m8j26J76k27M6J71k59K33P5j77Q1j84J76
$$ plain form
7172 36 -187 -122 91 182 -17 -220 -163 -117 77 -222 -122 106 34 8 -382 139 153 178 -247 -200 -115 300 91 -49
7196 -49 -42 82 267 -46 -168 94 5 80 -324 -157 107 163 -54 6 218 183 -97 -205 -92 -145 -127 -189 -20 123
7220 123 201 -298 -317 115 126 -120 -110 84 86 78 -101 -288 5 119 -331 5 21 75 73 -63 26 125 3 -137 -272
7245 -272 -80 97 -83 -231 34 52 37 86 -19 41 154 -7 -372 -60 233 182 -281 -471 171 290 14 -96
7267 -96 173 4 108 21 -24 -29 65 -3 -186 -92 168 -110 -121 -181 9 118 -193 -133 61 5 -85 -138 -225 161 103
7292 103 -188 -429 103 130 -56 -25 106 255 35 -252 -126 12 339 -161 -225 68 129 -118 70 -70 -195
7313 -195 407 -255 293 85 92 41 -347 -7 226 43 6 -354 -31 -16 -179 -256 -206 320 -133 -92 -127 57 61 -143
7337 -143 -42 -109 -116 2 -149 115 152 158 104 -419 31 206 29 15 -136 332 384 24 -213 -159 157 -179 -148 20
$$ packed form
7172C6k23O5K13R1j99k03N7M6J94k99J00K28p2k6l90N21J4K5m25M7Q5M15k09j40
7196d9PJ24J85l13j22K62q9P5m04J67K64N6k17O0K12l5k80j08J13n3J8o2J69J43
7220A23P8m99j9M32J1k46J0J94Kqj79j87K93J14m50L36J6N4kj36Q9R9j22j40j35
7245b72J92J77j80j48K65J8j5M9j05O0J13j61l65L12K93n1m63j90O42J19k76j10
7267i6K69j69J04q7m5nR4o8j83R4K60k78j1o0J90J09l11O0J94n6r0n3q7L86n8
7292A03k91k41N32K7j86L1J31J49k20k87J26J38L27n00o4K93O1k47J88j40j25
7313a95O02o62N48k08Pn1l88L40K33j83l7l60L23J5j63p7N0N26m53M1l5J84Mk04
7337a43J01o7pJ18j51K64L7On4n23M50J75j77j4j51M68N2l60k37N4L16l36L1J68
$$ plain form
7361 20 2 -123 54 215 -72 -123 -287 201 79 61 70 87 -23 -137 -81 15 -144 386 50 -99 -199 90 291
7384 291 59 90 -114 -129 33 -44 -280 -4 74 152 -221 -340 -24 -155 112 -43 -8 255 9 -73 -8 340 -9
7407 -9 -90 25 180 99 -261 -236 -296 -122 -18 33 -39 -42 145 -128 -340 190 95 57 -192 11 355 96 43 55 1
7432 1 55 69 -329 30 51 -119 -129 -404 214 -71 132 -169 -125 91 100 -370 32 -126 148 -31 -216 212 201
7455 201 15 6 -15 12 266 73 95 257 85 24 -251 -89 78 138 -635 -379 218 -206 138 358 77 -31
7477 -31 156 -162 -99 120 398 -261 -138 86 140 33 -112 -226 -4 20 33 -133 157 106 -16 27 -13 196 192
7500 192 -246 -37 -180 190 -4 -157 -6 298 43 -52 -12 122 15 -45 -54 -198 -12 64 19 135 -125 43
7522 43 -119 -300 122 99 0 66 105 36 -70 266 -125 53 354 -86 14 42 198 94 -108 -62 -31 104 68
$$ packed form
7361B0j8j25J77J61k87n1j64M88j22j8RJ7j10j14N6R6j59N30l36j49j00K89K01
7384B91k32L1k04j5J62p7k36K76P8P8l73j19L16j31K67j55L5K63k46q2O5L48l49
7407iq1J15J55q1l60K5o0J74J04N1p2lJ87k73k12N30r5l8k49K03L44k59n3J2n4
7432AN4J4l98L59K1j70j0k75O18k85K03l01M4K16Rm70M02j58K74j79j85M28j1
7455B01j86rk1K7K54j93K2J62j72o1k75J62J67O0p73K56N97m24L44K20k81j08
7477c1J87l18O3K19K78o59J23K24N4j07j45j14K22K4J3j66K90n1j22M3m0K09m
7500A92m38K09j43L70j94j53J51L04k55r5M0J34j07o0rj44J86P6m5J16k60J68
7522D3j62j81M22k3r9O6L9o9j06L36l91J78L01m40J00K8J56j04k02M6L1J35l6
$$ plain form
7545 68 -30 300 -32 91 -80 -159 -39 168 -124 -110 100 -118 302 256 62 -66 -42 66 -99 -310 146 88
7567 88 47 -59 140 -74 5 -154 14 67 17 0 -89 100 7 -82 -75 -33 -5 116 25 -29 -32 73 -28 -17 25 160
7593 160 -142 -346 129 171 -57 -13 -32 359 229 13 -159 316 93 38 -134 14 115 57 -100 -93 72 188
7615 188 4 -185 175 132 58 -74 -43 151 -152 32 -169 109 -167 79 -176 127 102 235 9 23 255 87
7637 87 86 -267 177 169 114 -108 90 193 -108 -53 -175 -172 367 -73 95 -53 111 158 -198 -241 233 -156 138 -198
7661 -198 89 -117 69 -144 -265 -47 107 40 -201 9 78 44 -307 167 86 32 -181 -206 197 -56 143 43
7683 43 -12 -153 52 -137 -212 113 96 -85 3 -42 284 -44 -258 -3 -14 -319 -70 -124 57 -86 191 32 -27
7706 -27 81 -28 -294 12 -30 116 58 -111 49 10 -97 15 -221 -107 176 -38 -44 154 28 226 24 -155
$$ packed form
7545F8r8L30l32J23j71p9J20K07k92J4K10k18M20m6j94j28K4J08j65k11M56n8
7567H8m1j06J99k14P9j59J68N3n0j7q9J89r3q9PM2K8J21r1n4lJ05j01J1M2J35
7593A60l02k04M75M2k28M4j9L91j30k16j72M75k23n5j72J48J01n8j57PJ65J16
7615A88j84j89L60m3p4j32L1J94l03J84k01K78k76K46k55L03k5J33k26J4K32j68
7637H7jl53M44qn5k22J98J03l01N5j22LN39m40J68j48J64M7l56m3M74l89K94l36
7661a98K87k06J86k13j21K18J54o7k41K10O9l4l51M74q1n4k13k5M03k53J99j00
7683D3n5j41K05j89p5L25j7j81Q8m5L26l28k14K55j1l05K49n4J81j43K77j59n9
7706b7J08j09k66L06m2J46n8j69J60l9j07J12k36J14K83k14oJ98j26J98k02j79
$$ plain form
7728 -155 -1 63 102 -172 -64 13 77 -206 -127 46 -78 -83 -59 215 2 -38 57 -78 101 109 -32 84 -281 80
7752 80 -313 115 203 144 83 -150 -99 -18 -196 -156 -153 212 196 -28 73 -140 35 153 288 -11 31 96 4 -48 163
7777 163 78 230 -163 -151 46 77 202 -82 -77 55 335 -98 -239 214 39 -203 -378 265 104 26 239 8
7799 8 191 276 119 -206 -84 152 141 162 145 196 -44 -55 77 89 141 25 -168 -180 162 166 -132 -105 64 149 -214
7824 -214 -173 -485 -94 -54 -92 188 119 90 143 8 -47 16 289 -48 14 9 39 -241 -62 110 -11 288 -268 -122
7848 -122 -208 26 -150 -166 15 71 -241 -175 3 139 -1 67 -165 91 -191 -236 12 -98 132 -121 -3 89
7870 89 133 -277 -152 69 115 363 -110 -322 -204 -66 243 183 113 -292 114 -54 -161 -141 -110 28 -128 14
7892 14 -63 236 91 -109 85 -34 22 163 -194 254 191 -45 -5 -38 200 259 102 -127 -34 -248 -68 -59 116
$$ packed form
7728a55J54O4L9k74J08P7O4k83P9J73j24nK4K74k13m0R5j35J79Qj41J16l65L61
7752H0l93M28Q8n9o1k33N1Q1j78M0LL65j6k24J01k13J75J18J35k99M2O5r2n2K11
7777A63q5J52l93J2J97L1J25k84NJ32K80m33j41M53j75k42j75O43j61p8K13k31
7799HJ83Q5j57l25J22K36j1K1j7N1k40j1J32J2N2j16j93j2L42Mk98K7J69Q5l63
7824b14M1l12L91M0l8K80o9k9N3j35n5O3K73l37O2nL0k80J79J72j21K99n56J46
7848a22q6K34j76j6J81N6l12O6J78J36j40O8k32K56k82m5K48j10K30k53J18R2
7870H9M4m10J25K21M6K48m73k12J18J38L09o0p0m05M06j68j07K0L1J38j56J42
7892A4p7K99j45k00J94j19N6J41l57M48o3k36M0l3K38N9j57k29R3k14J80RJ75
$$ plain form
7915 116 96 -48 -326 265 37 73 -49 211 297 88 -49 -118 302 154 55 -128 -113 34 35 30 -80 56 182
7938 182 -25 -52 -266 37 -72 -141 98 -72 -62 124 41 218 -19 23 -98 -114 33 -45 -143 -226 -116 38 265
7961 265 -339 -70 311 230 -47 94 -121 -25 252 -115 267 269 -4 -88 -29 -14 28 -182 -30 94 67 -179 -154
7984 -154 9 147 85 7 223 32 -37 -88 -129 -205 77 -81 60 -260 -48 -54 -157 13 107 192 137 -191 -11 -77
8008 -77 162 48 -117 77 -26 -13 -44 -59 -91 42 -7 -22 -36 67 -166 -154 134 108 220 83 -19 232 94
8031 94 189 -131 -114 -111 276 -30 -355 17 85 25 -279 199 127 71 -229 -116 -140 63 -301 -197 -40 -223 131
8054 131 -117 -57 -173 -127 -48 69 -128 -39 -47 -82 149 236 106 -17 5 17 321 -124 -151 154 211 31 -106 123
8078 123 -147 -61 170 34 158 64 -107 -135 -2 -9 59 -297 74 56 34 43 11 71 -19 210 -87 -121 -9 180 -183
$$ packed form
7915A16k0j44k78N91k28L6j22K60Q6k09j37o9M20j48r9j83J5J47Jnj10J36J26
7938A82k07k7k14L03j09o9K39j70J0J86q3J77k37M2j21j6J47p8r8q3J10J54K27
7961B65o04K69L81q1k77J41k15R6K77l67L82Kk73q4N9J5M2k10J52J24k7k46K5
7984a54J63J38o2p8K16j91o9n1m1p6K82j58J41l20K12oj03J70R4Q5n5l28J80o6
8008g7K39j14j65J94j03J3l1j5l2J33m9j5j4J03k33J2K88k6J12j37j02K51j38
8031I4R5l20J7LL87l06l25L72O8o0l04M78p2n6l00J13k4K03l64J04J57j83L54
8054A31k48O0j16M6P9J17j97Q9ql5K31Q7j30j23K2J2L04m45k7L05N7j80j37K29
8078A23k70Q6K31j36J24r4j71k8J33pO8l56L71j8k2Rl2O0r0K29k97l4J12J89l63
$$ plain form
8103 -183 -61 67 -67 46 -164 -89 212 181 -109 41 -31 78 -211 -1 -93 116 245 -60 135 87 89 105 -9
8126 -9 89 190 171 96 -166 -201 -173 134 -101 -279 8 132 -80 31 108 -89 -85 -168 -267 342 -176 -216 222 -328
8150 -328 38 -109 153 -48 178 9 -23 344 -26 200 123 17 -82 -248 54 26 39 -98 -18 -46 -66 90 210
8173 210 105 -210 -263 -118 -47 -227 158 234 214 -66 -164 -117 -89 135 -93 145 123 32
$$ packed form
8103a83J22J28j34J13k10P5L01l1k90J50p2J09k89K10r2K09J29l05J95m8KJ6j14
8126iR8J01j9p5k62l5K8L07k35j78K87J24k12J11P7j97Mq3r9O09n18m0M38n50
8150c28L66j47K62k01K26j69l2L67l70K26p7j06r9j66L02k8J3j37Q0k8k0J56J20
8173B10j05l15n3J45P1j80L85P6k0k80r8M7K8K24k28K38k2r1
8191C2
$$ Imaginary data points
##PAGE= N=2
##DATA TABLE= (X++(I..I)), XYDATA
$$ plain form
0 0 0 0 0 0 0 0 0 0 0 0 0 0 -8 8 -8 8 -8 16 -16 18 -24 31 -32 40 -48 56 -64 73 -84 97 -111 126 -143 162
34 162 -182 205 -231 258 -288 320 -359 397 -442 489 -541 597 -658 726 -799 881 -970 1069
52 1069 -1179 1300 -1438 1594 -1771 1973 -2209 2489 -2828 3243 -3771 4463 -5419 6822 -9089
67 -9089 13374 -24241 112430 150558 -125223 -73386 15376 2118 -6990 34506 41033 27881
79 27881 -58849 -90990 12105 85641 25469 485 -16958 -60843 -23886 42226 25767 16477
91 16477 18807 -19891 -58313 -39734 29877 91383 34991 -66851 -61098 -8172 17013 52331
103 52331 28545 -28923 -9853 -14961 -59303 11998 94991 31815 -51912 -54513 -26554 31347
115 31347 57544 -8117 -16926 33331 -29656 -80609 14379 86441 48604 -28107 -81190 -35722
$$ packed form
0@%%%%%%%%%%%%qJ6j6J6j6K4l2L4m2N5o3P2q8J04j20J37j57J81k08K37k69L05
34A62l44L87m36M89n46O08o79P56q39R31j030J138j255J384j525J680j851K039
52A069k248K479k738L032l365L744m182M698n317O071p014Q234r882J2241j5911
67i089K2463l7615J36671L8128k75781N1837Q8762j3258r108M1496O527j3152
79B7881q6730l2141J03095P3536o0172k4984j7443m3885L6957O6112j6459r290
91A6477K330l8698l8422J8579O9611O1506n6392j01842N753N2926K5185L5318
103E2331k3786n7468J9070n108m4342P1301Q2993o3176q3727k601K7959N7901
115C1347K6197o5661q809N0257o2987n0953R4988P2062l7837p6711n3083M5468
$$ plain form
127 -35722 52412 39287 -8269 16847 9239 -57167 -46269 30495 61891 29435 -24958 -46712
139 -46712 -26480 2820 36137 43966 -6125 -38480 -7713 -4809 -26456 22133 67446 14655
151 14655 -57199 -64205 1597 66260 34594 -23969 -11061 -5134 -37851 -14525 44838 46822 5833
164 5833 -39700 -60555 -5576 63966 37829 -20414 -20138 -7076 -13628 -13310 11135 45682 33152
177 33152 -37351 -64694 -6885 43326 37706 6809 -20508 -23406 -13838 -9113 13802 43336 25520
190 25520 -28541 -54258 -23148 33453 53655 10827 -33953 -24995 -4344 -1447 9663 22730
202 22730 21391 293 -41842 -46212 18037 61573 23155 -29514 -31779 -8041 2254 2314 19156
215 19156 36747 3209 -54862 -46816 22876 58846 26705 -23895 -39859 -14363 12055 11661 11792
$$ packed form
127c5722Q8134j3125m7556K5116p608o6406J0898P6764L1396l2456n4393k1754
139d6712K0232K9300L3317P829n0091l2355L0767K904k1647M8589M5313n2791
151A4655p1854p006O5802O4663l1666n8563J2908N927l2717K3326N9363J984m0989
164E833m5533k0855N4979O9542k6137n8243K76J3062o552L18K4445L4547j2530
177C3152p0503k7343N7809N0211n620l0897k7317k898R568M725K2915K9534j7816
190B5520n4061k5717L1110N6601K0202m2828m4780Q958K0651K897J1110J3067
202B2730j339k1098m2135m370O4249M3536l8418n2669k265K3738J0295O0J6842
215A9156J7591l3538n8071Q046O9692L5970l2141n0600j5964K5496K6418l94J31
$$ plain form
228 11792 20711 3342 -31835 -37746 181 45468 39180 -14769 -39148 -15992 5609 8765 13620
241 13620 20010 7878 -23789 -42463 -12739 42330 49299 -2790 -43920 -32525 6322 26376
253 26376 14614 3530 5882 -10893 -35733 -18001 30980 47516 8694 -39232 -37501 5831
265 5831 24952 9781 3766 11523 -5119 -35337 -28178 22390 54090 19561 -38392 -43969 -1937
278 -1937 24787 20496 9002 -963 -11371 -23152 -19065 13301 41784 22152 -24010 -41594 -13620
291 -13620 23524 27054 4256 -6900 -2727 -12354 -24335 -2187 36888 36576 -10478 -48036 -28616
304 -28616 22131 36473 9596 -9685 -8938 -11548 -17410 -3309 30011 37493 -5917 -46978 -29346
317 -29346 20031 35540 10663 -11885 -9204 -5602 -13544 -9616 20010 37287 6139 -36983 -36621
$$ packed form
228A1792Q919j7369l5177n911L7927M5287o288n3949k4379K3156K1601L156M855
241A3620O390j2132l1667j8674K9724N5069O969n2089m1130J1395L8847K0054
253B6376j1762j1084K352j6775k4840J7732M8981J6536l8822m7926J731M3332
265E831J9121j5171o015P757j6642l0218P159N0568L1700l4529n7953n577M2032
278a937K6724m291j1494r965j0408j1781M087L2366K8483j9632m6162j7584K7974
291a3620L7144L530k2798j1156M173r627j1981K2148L9075l12m7054l7558J9420
304b8616N0747J4342k6877j9281P47k610n862J4101L3320P482m3410m1061J7632
317b9346M9377J5509k4877k2548K681L602p942L928K9626J7277l1148m3122L62
$$ plain form
330 -36621 4376 35776 24371 -6422 -16987 -11319 -10268 -4481 16622 30440 10497 -29344 -39668
343 -39668 -2700 36264 29426 -6427 -23411 -10992 -631 -2795 3971 22542 20611 -15425 -42263
356 -42263 -16616 30104 37036 2353 -24028 -16942 -1697 -1376 3476 22555 22398 -13793 -41886
369 -41886 -20644 27802 40539 5108 -26327 -20698 383 5737 3705 13301 17303 -3757 -30677
382 -30677 -25131 14263 37423 15540 -18355 -24592 -7280 5761 6660 10543 16005 1444 -27267
395 -27267 -30236 6479 38850 25879 -15804 -33794 -12115 12994 13689 5011 6492 5079 -15808
408 -15808 -28656 -4537 32564 32067 -8633 -34560 -15176 11975 12215 3094 8294 9619 -13749
421 -13749 -32207 -9227 31078 34976 -2742 -32850 -22736 6874 19123 10544 2657 454 -9338
$$ packed form
330c6621M0997L1400j1405l0793j0565N668J051N787K1103J3818j9943l9841j0324
343c9668L6968L8964o838l5853j6984J2419J0361k164O766J8571j931l6036k6838
356d2263K5647M6720O932l4683k6381P086J5245L21M852J9079j57l6191k8093
369d1886K1242M8446J2737l5431l1435N629K1081N354k032R596M002k1060k6920
382c0677N546L9394K3160k1883l3895o237J7312J3041Q99L883N462j4561k8711
395b7267k969L6715L2371j2971m1683j7990K1679K5109O95q678J481j413k0887
408a5808j2848K4119L7101m97m0700k5927J9384K7151K40r121N200J325k3368
421a3749j8458K2980M0305L898l7718l0108J0114K9610J2249q579p887k203r792
$$ plain form
434 -9338 -21145 -10277 19499 31393 6861 -26434 -28407 2044 21945 11737 -951 118 -3438
447 -3438 -17174 -16500 9961 33306 17972 -21812 -36491 -7027 25410 20046 -1665 -6215 -3624
460 -3624 -11609 -15078 5094 30093 20803 -18181 -36012 -8328 23925 19485 -1849 -5788 -1957
473 -1957 -9517 -14977 975 24341 23285 -7841 -32921 -18888 14794 26481 9233 -8594 -11637
486 -11637 -8622 -5994 656 15126 22306 1362 -30369 -26653 12522 31927 10672 -13595 -12355
499 -12355 -1535 -3688 -5372 9225 24052 8755 -26097 -30652 4336 29616 17322 -7186 -15467
512 -15467 -8116 -2360 -924 8183 19766 10140 -20664 -31035 -945 29308 21745 -6653 -19124
525 -19124 -9444 1485 1943 3624 13219 11841 -10720 -27155 -11340 20173 27304 3422 -19630
$$ packed form
434i338j1807J0868K9776J1894k4532l3295j973L0451J9901j0208j2688J069l556
447c438j3736O74K6461K3345j5334l9784j4679K9464L2437n364k1711m550K591
460c624p985l469K0172K4999r290l8984j7831K7684L2253m440k1334l939L831
473a957p560n460J5952K3366j056l1126k5080J4033L3682J1687j7248j7827l043
486a1637L015K628O650J4470P180k0944l1731L716L9175J9405k1255k4267J240
499a2355J0820k153j684J4597J4827j5297l4852m555L4988K5280j2294k4508q281
512a5467P351N756J436R107J1583r626l0804j0371L0090L0253p563k8398j2471
525a9124R680J0929M58J681R595j378k2561j6435J5815L1513P131k3882k3052
$$ plain form
538 -19630 -16541 468 6886 3336 8620 13983 -4662 -28655 -17745 19108 32361 5298 -22644
551 -22644 -18804 1776 9549 3333 4521 11548 -658 -22417 -18250 10829 28242 12749 -15372
564 -15372 -22146 -4898 9397 7252 4334 7933 1477 -17138 -20600 3364 28261 20653 -12026
577 -12026 -28036 -9654 13465 12544 1908 1166 2594 -9400 -19337 -2597 23703 22356 -6465
590 -6465 -25965 -13634 10234 14064 3299 380 2803 -6153 -18491 -7657 18992 26440 1174
603 1174 -26383 -20575 7632 19330 6905 -2385 -1563 -4839 -12583 -8416 11931 24325 6704 -21441
617 -21441 -22963 2217 19127 11102 -3550 -4320 -1487 -8271 -11524 5444 24570 14141 -17636
630 -17636 -27311 -4280 19676 16838 -2011 -8061 -3920 -5739 -8227 2797 19032 15227 -11036
$$ packed form
538a9630L089J7009O418l550N284N363j8645k3993J0910L6853J3253k7063k7942
551b2644L840K0580P773o216J188P027j2206k1759M167K9079J7413j5493k8121
564a5372o774J7248J4295k145k918L599o456j8615l462K3964K4897p608l2679
577a2026j6010J8382K3119r21j0636p42J428j1994r937J6740K6300j347k8821
590f465j9500J2331K3868L830j0765k919K423q956j2338J0834K6649P448k5266
603A174k7557N808K8207J1698j2425r290Q22l276p744M167K0347J2394j7621k8145
617b1441j522K5180J6910q025j4652p70K833o784l253J6968J9126j0429l1777
630a7636r675K3031K3956k838j8849o050M141j819k488J1024J6235l805k6263
$$ plain form
643 -11036 -26989 -8757 18129 18828 266 -9942 -4811 -1855 -6008 -732 14292 17146 -3397
656 -3397 -24750 -14775 12165 22380 6854 -10540 -10933 -1981 -1345 -2034 9980 17869 372 -23002
670 -23002 -19523 9098 24913 9382 -12053 -12414 -1097 640 -1793 5790 14623 5660 -16481 -21966
684 -21966 878 22878 15706 -7287 -15573 -5681 2177 1194 3819 12063 7582 -12900 -22587 -3553
698 -3553 21161 19923 -3956 -18916 -8887 4858 4599 932 6610 8762 -6072 -20164 -9860
711 -9860 15648 22997 2244 -17890 -12717 2936 6484 2729 5030 7850 -2837 -18413 -13496 12013
725 12013 24916 6737 -18087 -17337 1784 10480 4402 1239 5060 494 -13053 -13729 6366 21189
739 21189 11744 -12077 -19261 -3585 10172 7377 1060 2642 1491 -9541 -14970 -343 20606
$$ packed form
643a1036j5953J8232K6886O99j8562j0208N131K956m153N276J5024K854k0543
656c397k1353R975K6940J0215j5526j7394l93Q952O36o89J2014P889j7497k3374
670b3002L479K8621J5815j5531k1435l61J1317J737k433P583Q833q963k2141n485
684b1966K2844K2000p172k2993q286R892P858r83K625Q244m481k0482r687J9034
698c553K4714j238k3879j4960J0029J3745k59l667N678K152j4834j4092J0304
711i860K5508P349k0753k0134N173J5653L548l755K301K820j0687j5576M917K5509
725A2013J2903j8179k4824P50J9121Q696o078l163L821m566j3547o76K0095J4823
739B1189r445k3821p184J5676J3757k795o317J582j151j1032n429J4627K0949
$$ plain form
752 20606 16974 -8454 -22274 -8313 11315 11985 1300 -1514 -152 -5093 -11971 -3774 15557 18563
766 18563 -2966 -20926 -12625 8254 13917 2925 -2816 185 -2309 -10554 -7105 11408 20515 2869
780 2869 -19817 -17875 4895 17004 7354 -4449 -4172 -2049 -6318 -6571 6742 18184 6811 -16291
794 -16291 -19374 1011 16395 10205 -3912 -6315 -1479 -3120 -6994 2029 15809 11706 -10758 -21893
808 -21893 -5416 15842 15144 -1313 -9498 -4037 -1435 -4255 194 12694 11684 -6603 -20372 -9448
822 -9448 13222 17321 1686 -10594 -6615 692 -1334 -2035 7663 13298 -115 -18085 -14503 8095
836 8095 19789 6589 -10332 -9944 -742 1566 -841 4960 11958 2248 -15494 -16298 4699 20017
850 20017 9792 -9347 -12724 -1637 4086 152 1659 9031 5396 -10536 -16980 -1164 17205
$$ packed form
752B0606l632k5428j3820J3961J9628O70j0685k814J362m941o878Q197J9331L006
766A8563k1529j7960Q301K0879N663j0992n741L001k494q245L449J8513R107j7646
780B869k2686J942K2770J2109r650j1803K77K123m269k53J3313J1442j1373k3102
794a6291l083K0385J5384o190j4117k403M836j641l874R023J3780m103k2464j1135
808b1893J6477K1258o98j6457q185N461K602k820M449J2500j010j8287j3769J0924
822i448K2670M099j5635j2280L979P307k026p01R698N635j3413j7970L582K2598
836H095J1694j3200j6921L88R202K308k407N801O998r710j7742q04K0997J5318
850B0017j0225j9139l377J1087N723l934J507P372l635j5932o444J5816J8369
$$ plain form
863 17205 14141 -5305 -14866 -5283 4060 3114 1550 6330 5603 -7040 -16327 -4972 15183 17453
877 17453 -1796 -16269 -9438 5136 6911 871 1751 5406 -1778 -13823 -9224 10342 18923 3491
891 3491 -15365 -12544 3710 8160 1787 788 4774 -329 -12098 -10791 7101 18982 6800 -13423
905 -13423 -15424 522 10027 4893 -183 1171 322 -7235 -10242 2166 16031 10721 -8998 -16903
919 -16903 -3850 9908 7926 -427 -998 950 -4483 -10064 -1716 14030 14290 -4757 -18995 -8864
933 -8864 9682 12505 820 -4405 -898 -1215 -7360 -4325 9814 15316 -675 -17566 -11165 7708
947 7708 13033 2574 -4690 -1634 -602 -6215 -5488 6770 15116 3405 -14934 -14703 3322 14355
961 14355 6879 -4537 -5686 -1429 -2034 -3934 3236 12643 6663 -11005 -15901 -820 13975 9895
$$ packed form
863A7205l064j9446r561R583R343r46j564M780p27j2643r287J1355K0155K270
877A7453j9249j4473O831J4574J775o040Q80L655p184j2045M599J9566Q581j5432
891C491j8856K821J6254M450o373r99L986n103j1769J307J7892J1881j2182k0223
905a3423k001J5946R505n134n076J354q49p557l007J2408J3865n310j9719p905
919a6903J3053J3758j982q353n71J948n433n581Q348J5746K60j9047j4238J0131
933h864J8546K823j1685n225L507l17o145L035J4139N502j5991j6891O401J8873
947G708N325j0459p264L056J032n613P27J2258Q346j1711j8339K31J8025J1033
961A4355p476j1416j149M257o05j900P170R407n980j7668m896J5081J4795m080
$$ plain form
975 9895 -3737 -7585 -1653 233 -3456 -233 10124 9527 -6434 -17240 -5541 12689 13554 -1018
989 -1018 -9473 -4758 1190 -940 -1022 7513 9899 -3231 -15852 -8543 10121 15444 1753 -10177
1003 -10177 -6223 1550 1539 -1502 3937 9286 685 -13169 -11608 5458 15730 6392 -8468 -9923
1017 -9923 -291 3213 514 2236 6862 2774 -10244 -12778 1918 15555 9685 -7395 -12285 -2010
1031 -2010 5346 2319 -99 4305 4726 -6149 -12579 -2626 12890 12844 -3299 -13417 -5921 5251
1045 5251 4601 45 2297 4205 -3072 -11897 -5235 10830 14827 -530 -13686 -8577 4759 7219
1059 7219 1189 -65 3046 -739 -9034 -7666 6477 14906 3890 -11731 -11447 1667 8475 3097
1073 3097 -1317 1160 721 -6653 -8336 3283 14181 7651 -9728 -14035 -1371 9904 6166 -1722
$$ packed form
975I895j3632l848N932J886l689L223J0357n97j5961j0806J1699J8230Q65j4572
989a018q455M715N948k130q2Q535K386j3130j2621P309J8664N323j3691j1930
1003a0177L954P773j1l041N439N349q601j3854J561J7066J0272r338j4860j455
1017i923R632L504k699J722M626m088j3018k534J4696J3637n870j7080m890J0275
1031b010P356l027k418M404M21j0875o430R953J5516m6j6143j0118P496J1172
1045E251o50m556K252J908p277q825O662J6065L997j5357j3156N109J3336K460
1059G219o030j254L111l785q295J368J4143Q429j1016j5621K84J3114O808n378
1073C097m414K477m39p374j683J1619J0898o530j7379m307J2664J1275l738p888
$$ plain form
1087 -1722 -1905 578 -3231 -7338 -673 11384 10172 -5945 -14557 -4705 8782 8296 -752 -3461 377
1102 377 -859 -6713 -2759 9110 11833 -2340 -14511 -8118 7248 10932 1704 -4920 -1959 67
1116 67 -3794 -3377 5679 11330 1663 -12301 -10604 4712 11979 4005 -5087 -3762 60 -1603 -3864
1131 -3864 2473 10631 4827 -10119 -13085 500 12562 7395 -4205 -6453 -823 448 -2373 718
1145 718 8412 6135 -6878 -13133 -2460 11580 9737 -3119 -8261 -2010 1997 -898 -1205 5436
1159 5436 7736 -3148 -12929 -6423 9172 12504 439 -8836 -5182 1767 1504 -975 3165 7159
1173 7159 -568 -11228 -8430 6481 13048 3192 -9065 -7432 1804 3416 -656 984 5863 1971
1187 1971 -8566 -9964 2538 13044 6508 -7176 -9510 -618 4511 1452 167 3722 3254 -5793
$$ packed form
1087a722j83K483l809m107O665J2057j212j6117q612R852J3487m86r048k709L838
1102C77j236n854L954J1869K723j4173j2171O393J5366L684r228o624K961K026
1116F7l861M17R056N651r667j3964J697J5316P267p974r092J325L822j663k261
1131c864O337Q158n804j4946k966J3585J2062n167j1600k248N630J271k821L091
1145G18P694k277j3013o255J0673J4040j843j2856n142O251M007k895l07O641
1159E436K300j0884r781O506J5595L332j2065r275L654O949k63k479M140L994
1173G159p727j0660K798J4911O567r856j2257J633R236J612m072J640M879l892
1187A971j0537j398J2502J0506o536j3684k334Q892N129l059j285L555m68r047
$$ plain form
1201 -5793 -10435 -119 11945 9092 -5112 -10988 -3150 5524 3840 -843 1090 3368 -2554 -9639
1215 -9639 -3697 9454 11199 -1799 -11371 -5979 4852 5640 -77 -315 2658 -787 -8149 -5489 6876
1230 6876 12083 1540 -10741 -8314 3662 7240 1763 -2040 997 1067 -5018 -6428 3758 11452
1244 11452 4442 -8732 -10265 649 8158 3653 -2140 -920 1047 -3415 -6274 866 10230 7355
1258 7355 -6425 -12123 -2316 8510 6553 -1424 -3710 101 -834 -4617 -1528 7749 8582 -3145 -11762
1273 -11762 -5191 7273 8028 -561 -4474 -768 573 -3531 -3146 5675 9351 -184 -11197 -7943 5306
1288 5306 10233 1951 -5415 -3078 737 -1466 -2705 3132 8490 2217 -8957 -9112 2627 10449 4588
1303 4588 -4907 -4825 426 502 -2194 615 6866 4693 -6363 -10623 -918 10230 7328 -3558 -7056
$$ packed form
1201e793m642J0316J2064k853j4204n876P838Q674j684m683J933K278n922p085
1215i639N942J3151J745j2998r572N392J0831P88n717k38K973l445p362K660J2365
1230F876N207j0543j2281K427J1976L578n477l803L037P0o085j410J0186P694
1244A1452p010j3174j533J0914P509m505n793J220J967m462k859P140R364k875
1258G355j3780n698R807J0826j957p977k286L811r35l783L089R277Q33j1727q617
1273a1762O571J2464P55q589l913L706J341m104L85Q821L676r535j1013L254J3249
1288E306M927q282p366K337L815k203j239N837N358o273j1174j55J1739P822n861
1303D588r495Q2N251P6k696K809O251k173j1056m260R705J1148k902j0886l498
$$ plain form
1318 -7056 -1297 1907 -723 -607 4832 5594 -3884 -10673 -3221 8929 9221 -2012 -8064 -2527 2803
1333 2803 786 -1542 2604 5670 -1137 -9689 -5807 6336 10426 1125 -8043 -5480 2086 2662 -512
1348 -512 1159 4340 854 -7809 -7340 3758 10846 3682 -7271 -7442 890 4528 851 -539 3069
1363 3069 2301 -4916 -7738 561 10094 6729 -5142 -9180 -1133 5084 2687 -1159 1007 2483 -3107
1378 -3107 -7735 -1753 8830 8480 -3386 -9868 -3345 5077 4485 -762 -836 2352 -634 -6447 -3830
1393 -3830 6587 9424 -374 -9585 -5762 4166 6086 791 -1863 881 486 -4706 -4730 4026 9881
1408 9881 2525 -8559 -8059 2289 7550 2415 -3012 -1263 1203 -2570 -4804 1060 8777 4877 -6578
1423 -6578 -9441 -290 7741 4381 -2509 -2646 1140 -629 -4417 -771 7226 6428 -4267 -10240 -2868
$$ packed form
1318g056N759L204k630J16N439P62r478o789P452J2150K92j1233o052N537N330
1333B803k017k328M146L066o807q552L882J2143M090r301r168K563P566N76l174
1348e12J671L181l486q663M69J1098P088p164j0953j71Q332L638l677j390L608
1363C069p68p217k822Q299R533l365j1871m038Q047O217k397l846K166J476n590
1378c107m628N982J0583l50j1866o482O523Q422n92n247p4L188k986n813K617
1393c830J0417K837r798r211L823R928J920n295k654K744l95n192k4Q756N855
1408I881p356j1084N00J0348N261n135n427J749K466l773k234N864P717l900j1455
1423f578k863R151Q031l360o890j37L786j769l788L646P997p98j0695n973P372
$$ plain form
1438 -2868 7277 6583 -1459 -4491 -273 571 -3069 -2105 5087 7111 -1513 -9480 -5365 5861 7987
1453 7987 156 -4971 -1675 1394 -1454 -2456 2738 6990 1418 -8675 -7224 3616 9211 2605
1467 2605 -5082 -3911 1085 783 -1880 677 5618 2813 -6424 -8258 1184 9139 4860 -4360 -5404
1482 -5404 56 2106 -1360 -898 4353 4167 -4137 -8998 -1834 8314 7155 -2770 -7004 -1402 2732
1497 2732 558 -1128 2569 4489 -1836 -8245 -3633 6761 8451 -785 -7310 -3468 2713 2223 -847
1512 -847 1012 3769 355 -6883 -5492 4558 8984 1715 -6959 -5646 1754 3814 245 -875 2534
1527 2534 1433 -4824 -6052 1988 8942 4265 -5935 -7072 608 4929 1653 -1795 1115 2473 -2668
1542 -2668 -6376 -187 8025 5760 -4085 -8045 -1799 4884 3477 -1290 -479 2040 -1172 -5598 -2061
$$ packed form
1438b868J0145o94q042l032M218Q44l640R64P192K024q624p967M115J1226K126
1453G987p831n127L296L069k848j002N194M252n572j0093J451J0840N595o606
1467B605p687J171M996l02k663K557M941k805r237j834R442P955m279r220j044
1482e404N460K050l466M62N251j86q304m861P164J0148j159r925m234N602M134
1497B732k174j686L697J920o325o409M612J0394J690r236o525L842O181m90l070
1512h47J859K757l414p238J391J0050M426p269q674J313P400K060l569j120L409
1527B534j101o257j228Q040O954m677j0200j137P680M321l276l448K910J358n141
1542b668l708O189Q212k265r845l960O246O683j407m767Q11K519l212m426L537
$$ plain form
1557 -2061 6314 7310 -2040 -8595 -3774 4655 5067 -240 -2011 1088 434 -4026 -3410 4075 7543 673
1573 673 -7546 -5756 3075 6068 943 -2725 -366 894 -2523 -4009 2115 7745 2810 -6713 -7545
1588 -7545 1382 7399 2940 -3073 -2235 1149 -557 -3471 -73 6166 4457 -4319 -8060 -614 6555
1603 6555 4572 -2395 -3720 207 518 -2416 -1463 4651 5385 -2253 -8611 -3357 6137 6830 -821 -4774
1619 -4774 -1172 1401 -976 -1883 2828 5734 -224 -7103 -4998 4257 7406 860 -4980 -2477 1517
1634 1517 440 -2117 1081 5083 1784 -6010 -6395 1963 7818 3058 -4652 -4479 926 1994 -836
1649 -836 -122 3742 2831 -4191 -6939 101 7260 4710 -3589 -5573 -416 2891 539 -1306 1879 3609
1665 3609 -2072 -6851 -2148 6567 6654 -1961 -6511 -2129 3163 2066 -1270 870 3362 -522 -5866
$$ packed form
1557b061Q375R96r350o555M821Q429M12n307j771L099o54m460O16P485L468o870
1573F73q219J790Q831K993n125l668K359J260l417j486O124N630m935r523q32
1588g545Q927O017m459o013Q38L384j706k914L398O239j709q776l741P446P169
1603F555j983o967j325L927L11k934R53O114P34p638o358N254R494O93p651l953
1619d774L602K573k377r07M711K906n958o879K105R255L149o546n840K503L994
1634A517j077k557L198M002l299p794l85Q358N855m760p710J73N405J068k830
1649h36P14L864r11p022k748P040P159k550q299j984N157L307k352j845L185J730
1665C609n681m779M703Q715Q7q615m550M382N292j097l336K140K492l884n344
$$ plain form
1680 -5866 -3564 4818 7510 -112 -6527 -3347 2875 2930 -688 -685 2629 987 -4542 -4699 2754 7296
$$ packed form
1680e866K302Q382K692p622o415L180O222N5l618LL314j642n529j57P453M542
$$ [...]
8191g
##END NTUPLES=NMR FID
##END=
