##TITLE=1H_Pr Am-3-2
 CDCl3, 8 sc, 
 14.12.2020
##JCAMPDX= 6.0         $$ Bruker NMR JCAMP-DX V2.0
##DATA TYPE= NMR FID
##DATA CLASS= NTUPLES
##ORIGIN= UXNMR, Bruker Analytische Messtechnik GmbH
##OWNER= root
$$ XWIN-NMR		Version 3.5
$$ Mon Dec 14 12:07:41 2020 Russian Standard Time (UT+4h)  she@DPX200
##.OBSERVE FREQUENCY= 200.1315066352
##.OBSERVE NUCLEUS= ^1H
##.DELAY= (6, 6)
##.ACQUISITION MODE= SIMULTANEOUS
##.ACQUISITION SCHEME= undefined
##.AVERAGES= 8
##.DIGITISER RES= 18
##SPECTROMETER/DATA SYSTEM= spect
##.PULSE SEQUENCE= zg30
##.SOLVENT NAME= CDCl3
##.SHIFT REFERENCE= (INTERNAL, CDCl3, 0, 15.7039)
##AUDIT TRAIL= $$ (NUMBER, WHEN, WHO, WHERE, WHAT)
$$ ##TITLE= Audit trail, XWIN-NMR		Version 3.5
$$ ##JCAMPDX= 5.01
$$ ##ORIGIN= Bruker BioSpin GmbH
$$ ##OWNER= she
$$ F:/spectra/data/she/nmr/H-F/1/audita.txt
$$ ##AUDIT TRAIL=  $$ (NUMBER, WHEN, WHO, WHERE, WHAT)
(   1,<2020-12-14 12:06:37.23 +0400>,<she>,<DPX200>,
      <created by zg, POWCHK disabled, PULCHK disabled
       configuration hash MD5:
       00 E9 B6 7A A2 85 ED C7 34 08 36 98 17 FE 4E 26
       data hash MD5: 16K
       1B 70 19 8F EE CC 3A E1 59 33 CB DD C3 16 46 87>)
$$ ##END=
$$ 
$$ hash MD5
$$ AA 8D 79 5A 17 F7 4D E9 EC D9 B3 9E BD F7 B6 F4
##$RELAX= 
##$RELAX= 
##$RELAX= 
##$RELAX= 
##$RELAX= 
##$RELAX= 
$$ Bruker specific parameters
$$ --------------------------
##$DU= <F:/spectra>
##$EXPNO= 1
##$NAME= <H-F>
##$PROCNO= 1
##$TYPE= <nmr>
##$USER= <she>
##$AMP= (0..31)
100 100 100 100 100 100 100 100 100 100 100 100 100 100 100 100 100 100 
100 100 100 100 100 100 100 100 100 100 100 100 100 100 
##$AQSEQ= 0
##$AQ_mod= 1
##$AUNM= <au_zg>
##$AUTOPOS= <>
##$BF1= 200.13
##$BF2= 200.13
##$BF3= 200.13
##$BF4= 200.13
##$BF5= 200.13
##$BF6= 200.13
##$BF7= 200.13
##$BF8= 200.13
##$BYTORDA= 1
##$CFDGTYP= 0
##$CFRGTYP= 5
##$CHEMSTR= <none>
##$CNST= (0..31)
1 1 145 1 1 1 1 1 1 1 1 1 1 1 1 1 1 1 1 1 1 1 1 1 1 1 1 1 1 1 1 1 
##$CPDPRG= <>
##$CPDPRG1= <>
##$CPDPRG2= <>
##$CPDPRG3= <>
##$CPDPRG4= <mlev>
##$CPDPRG5= <mlev>
##$CPDPRG6= <mlev>
##$CPDPRG7= <mlev>
##$CPDPRG8= <mlev>
##$CPDPRGB= <>
##$CPDPRGT= <>
##$D= (0..31)
0 1.2 0 0 0 0 0 0 0 0.06 0 0.03 0 0 0 0 0.0002 0 0 0 0 0 0 0 0 0 0 0 0 
0 0 0 
##$DATE= 1607933196
##$DBL= (0..7)
120 120 120 120 120 120 120 120 
##$DBP= (0..7)
150 150 150 150 150 150 150 150 
##$DBP07= 0
##$DBPNAM0= <>
##$DBPNAM1= <>
##$DBPNAM2= <>
##$DBPNAM3= <>
##$DBPNAM4= <>
##$DBPNAM5= <>
##$DBPNAM6= <>
##$DBPNAM7= <>
##$DBPOAL= (0..7)
0.5 0.5 0.5 0.5 0.5 0.5 0.5 0.5 
##$DBPOFFS= (0..7)
0 0 0 0 0 0 0 0 
##$DE= 6
##$DECBNUC= <off>
##$DECIM= 32
##$DECNUC= <off>
##$DECSTAT= 4
##$DIGMOD= 1
##$DIGTYP= 9
##$DL= (0..7)
0 120 120 120 120 120 120 120 
##$DP= (0..7)
150 150 150 150 150 150 150 150 
##$DP07= 0
##$DPNAME0= <>
##$DPNAME1= <>
##$DPNAME2= <>
##$DPNAME3= <>
##$DPNAME4= <>
##$DPNAME5= <>
##$DPNAME6= <>
##$DPNAME7= <>
##$DPOAL= (0..7)
0.5 0.5 0.5 0.5 0.5 0.5 0.5 0.5 
##$DPOFFS= (0..7)
0 0 0 0 0 0 0 0 
##$DQDMODE= 0
##$DR= 18
##$DS= 0
##$DSLIST= <SSSSSSSSSSSSSSS>
$$ [...]
##$SUBNAM2= <"">
##$SUBNAM3= <"">
##$SUBNAM4= <"">
##$SUBNAM5= <"">
##$SUBNAM6= <"">
##$SUBNAM7= <"">
##$SUBNAM8= <"">
##$SUBNAM9= <"">
##$SW= 16.9725356469052
##$SWIBOX= (0..15)
0 0 2 0 0 0 0 0 0 0 0 0 0 0 0 0 
##$SW_h= 3396.73913043478
##$TD= 16384
##$TD0= 1
##$TE= 0
##$TE2= 300
##$TE3= 300
##$TEG= 300
##$TL= (0..7)
0 120 120 120 120 120 120 120 
##$TP= (0..7)
150 150 150 150 150 150 150 150 
##$TP07= 0
##$TPNAME0= <>
##$TPNAME1= <>
##$TPNAME2= <>
##$TPNAME3= <>
##$TPNAME4= <>
##$TPNAME5= <>
##$TPNAME6= <>
##$TPNAME7= <>
##$TPOAL= (0..7)
0.5 0.5 0.5 0.5 0.5 0.5 0.5 0.5 
##$TPOFFS= (0..7)
0 0 0 0 0 0 0 0 
##$TUNHIN= 0
##$TUNHOUT= 0
##$TUNXOUT= 0
##$USERA1= <user>
##$USERA2= <user>
##$USERA3= <user>
##$USERA4= <user>
##$USERA5= <user>
##$V9= 5
##$VALIST= <valist>
##$VCLIST= <CCCCCCCCCCCCCCC>
##$VD= 0
##$VDLIST= <DDDDDDDDDDDDDDD>
##$VPLIST= <PPPPPPPPPPPPPPP>
##$VTLIST= <TTTTTTTTTTTTTTT>
##$WBST= 1024
##$WBSW= 4
##$XGAIN= (0..3)
0 0 0 0 
##$XL= 0
##$YL= 0
##$YMAX_a= 42275
##$YMIN_a= -52497
##$ZGOPTNS= <>
##$ZL1= 120
##$ZL2= 120
##$ZL3= 120
##$ZL4= 120
##$ABSF1= 10
##$ABSF2= 0
##$ABSG= 5
##$ABSL= 3
##$ALPHA= 0
##$AQORDER= 0
##$ASSFAC= 0
##$ASSFACI= 0
##$ASSFACX= 0
##$ASSWID= 0
##$AUNMP= <proc_1d>
##$AZFE= 0.1
##$AZFW= 0.1
##$BCFW= 1
##$BC_mod= 2
##$BYTORDP= 1
##$COROFFS= 0
##$CY= 11.3945322036743
##$DATMOD= 1
##$DC= 2
##$DFILT= <>
##$DTYPP= 0
##$F1P= 15.9154993809931
##$F2P= -4.1035820241983
##$FCOR= 0.5
##$FTSIZE= 0
##$FT_mod= 4
##$GAMMA= 1
##$GB= 0.15
##$INTBC= 1
##$INTSCL= 1
##$ISEN= 128
##$LB= 0.24
##$LEV0= 0
##$LPBIN= 0
##$MAXI= 10000
##$MC2= 0
##$MEAN= 0
##$ME_mod= 0
##$MI= 1.114404
##$NCOEF= 0
##$NC_proc= 0
##$NLEV= 6
##$NOISF1= 3.799351
##$NOISF2= 2.8
##$NSP= 1
##$NTH_PI= 0
##$NZP= 0
##$OFFSET= 15.70392
##$PC= 1
##$PHC0= -10762.63
##$PHC1= 15.40089
##$PH_mod= 1
##$PKNL= yes
##$PPARMOD= 0
##$PSCAL= 0
##$PSIGN= 0
##$REVERSE= no
##$SF= 200.130013532006
##$SI= 16384
##$SIGF1= 3
##$SIGF2= 2
##$SINO= 400
##$SIOLD= 16384
##$SREGLST= <1H.CDCl3>
##$SSB= 0
##$STSI= 0
##$STSR= 0
##$SW_p= 3612.71676300578
##$SYMM= 0
##$S_DEV= 0
##$TDeff= 0
##$TDoff= 0
##$TI= <>
##$TILT= no
##$TM1= 0
##$TM2= 0
##$TOPLEV= 0
##$USERP1= <user>
##$USERP2= <user>
##$USERP3= <user>
##$USERP4= <user>
##$USERP5= <user>
##$WDW= 1
##$XDIM= 8192
##$YMAX_p= 0
##$YMIN_p= 0
$$ End of Bruker specific parameters
$$ ---------------------------------
##NTUPLES= NMR FID
##VAR_NAME=  TIME,          FID/REAL,        FID/IMAG
##SYMBOL=    X,             R,               I
##VAR_TYPE=  INDEPENDENT,   DEPENDENT,       DEPENDENT
##VAR_FORM=  AFFN,          ASDF,            ASDF
##VAR_DIM=   8192,          8192,            8192
##UNITS=     SECONDS,       ARBITRARY UNITS, ARBITRARY UNITS
##FACTOR=    0.0002944,     1,               1
##FIRST=     0,             0,               0
##LAST=      2.4114304,     0,               0
##MIN=       0,             -52497,          0
##MAX=       2.4114304,     42275,           0
$$ Real data points
##PAGE= N=1
##DATA TABLE= (X++(R..R)), XYDATA
$$ [...]
$$ plain form
2300 564 -1059 775 -1239 734 -768 -26 -52 -645 507 -1000 1143 -873 766 -409 -147 375 -434
2317 -434 782 -933 919 -604 972 -105 110 853 -714 1070 -858 1338 -407 610 217 142
2333 142 686 -771 1172 -590 1243 -509 634 357 -210 833 -853 1144 -934 513 -489 429
2349 429 116 -410 784 -1194 1102 -822 516 -339 -8 268 -976 472 -990 986 -1116 273
2365 273 -305 -415 239 -1150 789 -1305 818 -701 97 -389 -473 618 -882 1043 -943 967 -778
2382 -778 -183 207 -394 774 -1003 1119 -521 291 -473 420 383 -472 936 -917 1349 -747 764
2399 764 58 428 737 -475 520 -587 753 -441 451 646 358 724 -355 1373 -490 619 -89
2416 -89 347 -40 88 611 -1231 615 -956 928 -305 609 -75 -807 1211 -652 490 -1012 144
$$ packed form
2300E64j623J834k014J973j502P42k6n93J152j507K143k016J639j175K62N22q09
2317d34J216j715J852j523J576j077K15P43j567J784j928K196j745J017l93p5
2333A42N44j457J943j762J833j752J143k77n67J043j686J997k078J447j002R18
2349D29l13n26J194j978K296j924J338q55L31K76j244J448j462J976k102J389
2365B73n78j10O54j389J939k094K123j519P98m86q4J091j500J925j986J910j745
2382g78N95L90o01J168j777K122j640Q12p64Q93l7q55J408j853K266k096J511
2399G64p06L70L09j212R95j107J340j194Q92J95k88L66j079J728j863J109p08
2416h9M36l87J28N23j842J846j571J884j233R14o84p32K018j863J142j502J156
$$ plain form
2433 144 -274 12 613 -1128 836 -1675 814 -955 336 -8 -451 -233 -1200 676 -1591 854 -982
2450 -982 84 -92 -834 708 -1739 544 -756 252 -1009 266 429 -101 637 -452 1420 -1053
2466 -1053 163 -10 -73 836 -484 808 -265 1565 -661 340 531 -914 927 -138 1085 -1598
2482 -1598 1447 -367 -179 63 500 515 -1180 340 -587 1553 -333 287 68 -878 196 -175 164 -45
2500 -45 -102 -253 179 287 -369 601 -798 690 -575 565 -165 -386 201 -357 796 -982 692 -1233
2518 -1233 291 -137 -427 390 -620 971 -1237 974 -204 -496 -513 -1032 677 -1181 118 -717 296
2535 296 -483 108 251 -737 752 -378 477 -819 720 -181 -280 17 363 1352 -672 1288 -280 537
2553 537 160 72 768 -369 958 -654 868 -481 406 318 -385 911 -798 978 -589 653 -372
$$ packed form
2433A44m18K86O01j741J964k511K489j769J291l44m43K18r67J876k267K445j836
2450i82J066j76p42J542k447K283j300J008j261J275J63n30P38j089J872k473
2466a053J216j73o3R09j320J292j073J830k226J001J91j445J841j065J223k683
2482a598L045j814J88K42M37J5j695J520r27K140j886O20k19r46J074l71L39k09
2500d5n7j51M32J08o56R70j399J488j265J140p30k21N87n58J153j778J674j925
2518a233J524m28k90Q17j010J591k208K211j178k92j7n19J709j858J299q35J013
2535B96p79N91J43r88J489j130Q55j296J539r01r9K97L46R89k024J960j568Q17
2553E37l77q8O96j137J327j612J522j349Q87q8p03J296j709J776j567J242j025
$$ plain form
2570 -372 -59 249 -555 933 -838 561 -719 390 -220 -248 333 -784 441 -740 436 -784 481
2587 481 -272 -394 552 -787 246 -910 399 -391 14 -200 -521 488 -923 520 -549 178 -647
2604 -647 -90 278 -579 641 -947 670 -609 635 -204 135 237 -339 737 -696 974 -410 723
2621 723 49 43 693 -374 806 -539 737 -468 541 274 -240 785 -610 746 -789 557 -479
2638 -479 314 72 -517 761 -861 933 -819 490 -244 98 385 -270 731 -890 805 -646 362
2655 362 -287 -388 390 -526 435 -839 399 -687 209 -480 -491 445 -882 499 -1115 535 -695 -36
2673 -36 -437 -434 442 -682 683 -813 566 -568 218 90 -247 759 -764 688 -509 544 121 285
2691 285 375 -376 753 -683 1088 -478 226 -131 -514 607 -503 717 -579 817 -268 251 232
$$ packed form
2570c72L13L08q04J488j771J399j280J109o10k8N81j117J225j181J176j220J265
2587D81p53j22R46j339J033j156J309p90M05k14l21J009j411J443j069P27q25
2604f47N57L68q57J220j588J617j279J244q39L39J02n76J076j433J670j384J133
2621G23o74oO50j067J180j345J276j205J009k67n14J025j395J356j535J346j036
2638d79P93k42n89J278j622J794j752J309p34L42K87o55J001j621J695j451J008
2655C62o49j01P78r16R61j274J238j086Q96o89j1R36j327J381j614J650j230O59
2673c6m01LQ76j124J365j496J379j134P86j28l37J006j523J452j197J053m23J64
2691B85R0p51J129j436J771j566P04l57l83J121j110J220j296J396j085N19j9
$$ plain form
2708 232 -139 711 -872 882 -704 676 137 237 378 -285 761 -675 990 -624 395 -206 -39
2725 -39 232 -632 837 -794 359 -514 303 -376 -261 69 -459 603 -890 575 -598 -89 -29 -359
2743 -359 352 -589 990 -833 349 -385 59 192 -701 608 -450 315 -598 446 -346 317 -41 -296
2761 -296 781 -352 1087 -660 439 -123 -392 197 -470 758 -399 812 -461 412 136 -17 569
2778 569 -476 1003 -610 883 -102 224 92 -413 774 -260 878 -878 759 -120 340 471 -560
2795 -560 815 -635 776 -254 321 -47 -81 97 -343 576 -960 754 -825 119 -194 -354 295 -864
2813 -864 575 -1030 454 -644 -86 -241 -251 535 -772 528 -1181 461 -480 -343 57 -620 445
2830 445 -714 457 -588 478 -249 20 271 -631 838 -723 681 -187 492 7 77 629 -434 698
$$ packed form
2708B32l71Q50j583J754j586J380n39J00J41o63J046j436J665j614J019o01J67
2725c9K71q64J469j631J153q73Q17o79J15L30n28J062j493J465j173N09O0l30
2743c59P11r41J579j823J182p34M44J33q93J309j058P65r13J044p92O63l58k55
2761b96J077j133J439j747J099n62k69N89o67J228j157J211j273Q73k76j53N86
2778E69j045J479j613J493r85L26j32n05J187j034J138j756J637q79M60J31j031
2795e60J375j450J411j030N75l68l4J78m40R19j536J714j579R44l13j60O49j159
2813h64J439j605J484j098N58j55j0P86j307J300j709J642r41J37M00o77J065
2830D45j159J171j045J066p27K69K51r02J469j561J404q68O79m85P0N52j063J132
$$ plain form
2848 698 -649 991 -203 266 290 -181 882 -470 1125 -459 730 326 396 217 -206 903 -458
2865 -458 989 -407 318 -191 -2 434 -552 516 -687 529 -576 650 -184 -401 333 -903 534
2882 534 -887 369 -514 254 -340 -635 88 -813 579 -1177 472 -673 191 208 -630 619 -991 696
2900 696 -712 123 -277 344 -361 -695 581 -676 911 -303 675 -552 -260 433 -637 962 -1221
2917 -1221 800 -662 19 289 18 972 -1480 735 -129 333 140 -259 -166 338 655 -759 1040 -399
2935 -399 422 -132 782 331 -97 -245 -810 1162 -610 586 -207 -77 155 -483 497 -973 639 -739
2953 -739 86 -46 -430 519 -506 680 -928 549 -706 190 -23 -502 368 -898 621 -672 360
2970 360 -364 -14 -1 -514 570 -782 501 -717 337 -227 -62 188 -624 304 -985 940 -455 381
$$ packed form
2848F98j347J640j194M69K4m71J063j352J595j584J189m04P0j79m23J109j361
2865d58J447j396P25n09J89M36r86J068j203J216j105J226q34k17P34j236J437
2882E34j421J256q83P68n94k95P23r01J392j756J649j145Q64J7q38J249j610J687
2900F96j408Q35m00O21p05l34J276j257J587j214R78j227K92O93j070J599k183
2917a221K021j462O81K70k71R54k452K215q64M62j93l99R3N04L17j414J799j439
2935c99Q21n54R14m51m28j48n65J972j772J196p93J30K32o38R80j470J612j378
2953g39Q25j32l84R49j025J186j608J477j255Q96k13m79Q70j266J519j293J032
2970C60p24L50J3n13J084j352J283j218J054n64J65K50q12R28j289J925j395Q36
$$ plain form
2988 381 -224 7 662 -545 707 -704 608 -221 259 182 -217 428 -318 795 -500 673 -212 208
3006 208 201 -285 709 -436 786 -598 381 -209 65 321 -413 699 -783 611 -428 591 3 -63
3024 -63 -94 -386 498 -815 765 -432 39 -57 -438 416 -738 637 -887 404 -245 -31 -441 -661 513
3043 513 -1015 724 -1087 667 -274 -109 158 -723 467 -776 639 -655 221 -71 -250 70 -629
3060 -629 574 -572 576 -372 204 -83 38 523 -327 648 -557 693 -294 200 287 -42 567 -311 498
3079 498 -526 416 103 318 165 -219 724 -425 828 -557 359 -312 -197 257 -486 562 -630 399
3097 399 -694 459 -133 -327 345 -623 526 -682 442 -475 97 51 -467 432 -568 732 -762 270
3115 270 -399 6 54 -395 558 -806 797 -678 422 -218 -238 -99 -609 504 -817 573 -458 90
$$ packed form
2988C81o05K31O55j207J252j411J312q29M80p7l99O45p46J113j295J173q85M20
3006B08pm86R94j145J222j384R79n90K74K56p34J112j482J394j039J019n88o6
3024f3l1k92Q84j313J580j197M71r6l81Q54j154J375j524J291o49K14m10k20J174
3043E13j528J739j811J754r41J65K67q81J190j243J415j294Q76k92j79L20o99
3060f29J203j146J148r48N76k87J21M85q50R75j205J250r87M94Q7l29O09q78Q09
3079D98j024R42l13K15j53l84R43j149J253j385R16o71J15M54p43J048j192J029
3097C99j093J153n92j94O72r68J149j208J124r17N72m6n18Q99j000J300j494J032
3115B70o69M05M8m49R53j364J603j475J100o40k0J39n10J113j321J390j031N48
$$ plain form
3133 90 1 -152 622 -568 619 -537 685 -284 301 26 -247 629 -353 629 -676 471 -141 294 169
3152 169 -457 593 -513 744 -453 698 30 162 371 -306 849 -850 802 -384 665 -222 -66
3169 -66 439 -427 641 -529 530 -532 281 -241 -379 536 -750 688 -937 580 -407 34 11 -671
3187 -671 266 -828 723 -489 335 -579 23 88 -885 424 -769 423 -483 206 -156 -7 104 -648
3205 -648 459 -905 533 -655 331 -153 -181 238 -466 715 -420 744 -442 440 -102 178 542 -509
3223 -509 825 -334 591 -174 246 162 -66 730 -446 699 -231 435 -145 188 624 -409 670 -346
3241 -346 773 -187 105 -36 -92 320 -334 612 -517 676 -499 380 121 -217 355 -587 476 -752
3259 -752 258 -521 95 40 -634 294 -748 363 -763 167 -407 -125 14 -336 622 -529 633 -392
$$ packed form
3133I0q9j53P74j190J187j156J222r69N85k75k73Q76r82R82j305J147o12M35j25
3152A69o26J050j106J257j197J151o68J32K09o77J155j699J652j186J049q87J56
3169f6N05q66J068j170J059j062Q13n22j38R15j286J438j625J517r87M41k3o82
3187f71R37j094J551j212Q24r14O02O5r73J309j193J192r06O89l62J49J11p52
3205f48J107j364J438j188R86m84k8M19p04J181j135J164j186Q82n42K80L64j051
3223e09J334j159R25p65M20q4k28P96j176J145r30O66n80L33M36j033J079j016
3241c46J119r60K92j41n6M12o54R46j129J193j175Q79k59l38N72r42J063j228
3259g52J010p79O16n5o74R28j042J111j126R30n74K82J39l50R58j151J162j025
$$ plain form
3277 -392 410 29 -344 182 -534 586 -740 679 -186 429 46 -91 675 -540 790 -306 494 -126
3295 -126 45 306 -145 574 -400 630 -548 492 -347 181 349 -230 744 -677 887 -417 321 -73
3313 -73 89 297 -190 292 -524 494 -435 232 -146 -156 505 -722 638 -584 406 -536 136 47 -301 361
3333 361 -664 532 -615 254 -201 3 -164 -577 338 -645 476 -448 329 -283 -93 39 -597 507
3351 507 -560 312 -505 344 -431 216 231 -526 525 -447 566 -292 62 139 -143 428 -520 541 -434
3370 -434 385 -420 -68 204 -124 709 -376 812 -227 450 112 3 112 39 820 -433 778 -452
3388 -452 320 -57 17 242 -410 760 -488 499 -117 19 -336 -28 184 -676 400 -750 505 -391 -90
3407 -90 137 -522 455 -644 426 -547 57 -455 -33 16 -447 308 -881 560 -329 279 -166 -238 442 -408
$$ packed form
3277c92Q02l81l73N26p16J120j326J419q65O15l83j37P66j215J330j096Q00o20
3295a26J71K61m51P19r74J030j178J040q39N28J68n79R74j421J564j304P38l94
3313g3J62K08m87M82q16J018r29O67l78j0O61j227J360j222R90r42O72q9l48O62
3333C61j025J196j147Q69m55K04j67m13R15r83J121r24P77o12J90J32o36J104
3351E07j067Q72q17Q49p75O47J5p57J051r72J013q58L54P7k82N71r48J061r75
3370d34Q19q05L52K72l28Q33j085J188j039O77l38j09J09p3P81j253J211j230
3388d52P72l77P4K25o52J170j248R87o16J36l55L08K12q60J076j150J255q96L01
3407i0K27o59R77j099J070r73O04n12M22M9m63P55j189J441q89O08m45p2O80q50
$$ plain form
3427 -408 374 -563 516 -678 263 -18 -458 463 -744 425 -464 462 -369 250 8 -340 598 -573
3445 -573 660 -622 602 -109 -25 383 -159 532 -601 669 -528 286 137 186 230 -614 555 -561
3463 -561 443 -168 134 47 -255 295 -345 561 -612 590 -432 107 -219 -340 194 -598 377 -475 205
3482 205 -291 246 -117 -245 302 -999 532 -541 -164 -12 -122 -67 -589 459 -863 464 -594 212
3500 212 -237 -145 314 -839 562 -192 360 -568 -72 281 -334 279 -835 525 -317 948 -174 29
3518 29 428 -212 -339 -806 1201 71 259 -86 265 166 -152 680 -315 580 -248 442 261 -137 418 -109
3538 -109 755 -550 630 -297 441 -57 -199 421 -363 633 -516 257 -336 302 -193 -156 158 -481 423
3557 423 -766 274 -195 8 197 -232 117 -469 309 -440 173 -558 -33 -35 -644 391 -500 305 -718
$$ packed form
3427d08P82r37J079j194R41k81m40R21j207J169q89R26q31O19k42l48R38j171
3445e73J233j282J224p11Q4M08n42O91j133J270j197Q14j49M9M4q44J169j116
3463e61J004o11L02q7l02N50o40R06j173J202j022N39l26j21N34p92R75q52O80
3482B05m96N37l63j28N47j301J531j073L77J52j10N5n22J048j322J327j058Q06
3500B12m49R2M59j153J401p54N52r28M96L53o15O13j114J360q42J265j122K03
3518B9L99o40j27m67K007j130J88l45L51r9l18Q32r95Q95q28O90j81l98N55n27
3538a09Q64j305J180r27P38m98j42O20p84R96j149P73n93O38m95L7L14o39R04
3557D23j189J040m69K03J89m29L49n86P78p49O13p31N25ko09J035q91Q05j023
$$ plain form
3576 -718 -52 -171 -40 309 -334 319 -561 476 -131 143 87 -144 360 -484 500 -189 445 -177 294 368
3596 368 -396 471 -346 402 -372 487 -223 192 342 -374 699 -381 305 -255 265 -18 84 553 -301
3615 -301 548 -322 436 -205 197 -124 -267 294 -437 512 -804 89 -454 171 206 -307 298 -551 531 -737
3635 -737 213 -407 -42 168 -375 300 -664 128 -620 98 -90 -273 62 -599 611 -510 69 -461 23
3654 23 -12 -168 157 -359 419 -681 377 -230 -88 53 -152 586 -538 762 -314 421 91 -119 241
3673 241 -59 810 -344 521 -633 340 155 149 429 -364 421 -310 719 -204 158 66 -55 359 -194 662
3693 662 -112 523 -396 -145 83 -10 359 -296 463 -662 303 -148 -135 -164 -521 480 -499 481 -508 -143
3713 -143 -29 -268 67 -556 344 -579 337 -540 -4 138 -344 51 -289 282 -497 353 -127 168 184 8
$$ packed form
3576g18O66j19J31L49o43O53q80J037o07K74n6k31N04q44R84o89O34o22M71P4
3596C68p64Q67q17P48p74Q59p10M15J50p16J073j080O86n60N20k83J02M69q54
3615c01Q49q70P58o41M02l21j43N61p31R49j316Q93n43O25L5n13O05q49J082j268
3635g37R50o20L65K10n43O75r64P92p48P18j88j83L35o61J210j121N79n30M84
3654B3l5j56L25n16P78j100J058o07J42J41k05P38j124J300j076P35l30k10L60
3673B41l00Q69j154Q65j154R73j85oK80p93P85p31J029r23L62r2j21M14n53Q56
3693F62p74O35r19K51K28r3L69o55P59j125R65m51J3k9l57J001r79R80r89L65
3713a43J14k39L35o23R00r23R16q77N36J42m82L95l40N71p79Q50m80K95J6j76
$$ plain form
3733 8 282 -460 572 -461 339 70 85 268 -280 311 -164 576 -397 367 -141 -42 348 -298 566 -307 758
3754 758 -500 214 -59 213 303 -389 400 -248 622 -146 207 97 -271 203 -302 685 -645 546 -510
3773 -510 134 206 -439 271 -463 276 -385 64 -340 -159 -106 -268 253 -517 338 -531 313 -485 -134 132 -474
3794 -474 461 -588 341 -458 233 -179 -295 4 -586 446 -670 318 -242 -20 59 -187 526 -368 691
3813 691 -493 445 -328 172 83 -27 889 -336 498 -204 345 17 -81 527 -362 354 -443 561 -344 243
3833 243 188 -106 429 -227 464 -87 469 -237 139 43 -135 573 -192 476 -255 379 -223 -112 67 35 35 -495
3855 -495 344 -658 183 -272 -286 154 -455 412 -407 507 -337 -21 -261 61 208 -565 286 -558 482 -624
3875 -624 130 178 -156 234 -270 312 -448 406 -209 -17 -100 -469 433 -471 603 -301 -16 -56 157 331 -319
$$ packed form
3733HK74p42J032j033Q00k69J5J83n48N91m75P40r73P64n08R9L90o46Q64q73J065
3754G58j258P14k73K72R0o92P89o48Q70p68L53j10l68M74n05R87j330J191j056
3773e10O44P2o45P10p34P39o61M49m04J81N3j62N21p70Q55q69Q44p98L51K66o06
3794d74R35j049R29p99O91m12j16K99n90J032j116R88n60K22P9k46P13q94J059
3813F91j184R38p73N00q9j10R16j225Q34p02N49l28r8O08q89P16p97J004r05N87
3833B43n5k94N35o56O91n51N56p06L76r6j78P08p65O68p31O34o02J11J79l2%n30
3855d95Q39j002Q41m55j4M40o09Q67q19R14q44L16k40L22J47p73Q51q44J040j106
3875f24P54M8l34L90n04N82p60Q54o15J92q3l69R02r04J074r04K85m0K13J74o50
$$ plain form
3896 -319 323 -270 552 -481 477 -80 -45 377 -277 646 -307 391 2 180 5 200 423 -215 537 -269
3916 -269 446 -165 84 300 -305 206 -300 357 -390 420 -455 215 -44 -315 325 -681 311 -506 220 0
3936 0 -157 7 -416 285 -440 282 -445 87 -154 -293 144 -486 372 -308 325 -361 -50 -232 -183 228 -658
3957 -658 314 -395 224 -65 -8 291 -27 515 -271 414 -570 495 67 105 284 -451 396 -405 471 -196
3977 -196 252 148 200 303 -570 536 -328 337 -105 264 204 11 504 -448 357 -140 418 -304 -3 -9 -309
3998 -309 422 -379 556 -448 121 66 30 209 -614 539 -282 679 -346 221 -283 -273 299 -753 221 -453
4018 -453 265 -474 107 -226 -352 96 -420 399 -630 479 -278 222 -135 -346 330 -309 433 -479 436
4037 436 -195 112 149 -364 453 -441 304 -325 240 124 34 389 -327 350 -452 413 98 162 272 -8 299
$$ packed form
3896c19O42n93Q22j033R58n57L5M22o54R23r53O98l89J78j75J95K23o38P52q06
3916b69P15o11K49K16o05N11n06O57p47Q10q75O70k59k71O40j006R92q17P26k20
3936@j57J64m23P01p25P22p27N32k41j39M37o30Q58o80O33o86L11j82M9M11q86
3957f58R72p09O19k89N7K99l18N42p86O85r84J065m28L8J79p35Q47q01Q76o67
3977a96M48j04N2J03q73J106q64O65m42L69o0j93M93r52Q05m97N58p22L01ol00
3998c09P31q01R35j004N69n5l6J79q23J153q21R61j025N67n04J0N72j052R74o74
4018d53P18p39N81l33j26M48n16Q19j029J109p57N00l57k11O76o39P42r12R15
4037D36o31L07L7n13Q17q94P45o29N65j16r0L55p16O77q02Q65l15O4J10k80L07
$$ plain form
4058 299 -290 670 -295 365 127 163 118 -349 264 26 134 -133 -118 -204 218 -209 71 156 -13 22 -49 187
4080 187 -623 461 226 -1074 247 -707 111 -342 22 60 -263 192 -619 391 -404 243 -467 130 -105
4099 -105 -384 227 -235 415 -343 386 -26 97 -40 -11 323 -378 492 -377 361 -292 56 209 -150 418
4119 418 -570 463 -170 329 65 75 342 -439 668 -369 399 -48 302 205 -49 449 -391 711 -345
4138 -345 457 -54 -159 304 233 634 -409 831 -210 -273 398 389 -78 -682 567 -390 -174 -734 86 143
4158 143 57 333 -267 359 -733 193 -312 228 -145 -299 -87 -643 414 -566 230 -141 59 -1 -379 260
4178 260 -408 365 -307 261 -102 -156 131 -373 303 -238 448 -335 221 -169 18 225 -301 438 -167 627
4198 627 -104 535 17 -11 282 -123 668 -363 373 -336 205 402 -98 539 -349 428 -244 545 -1 362
$$ packed form
4058B99n89R60r65O60k38L6m5m67O13k38J08k67J5q6M22m27K80Q5j69L5p1K36
4080A87q10J084k35j300J321r54Q18m53L64L8l23M55q11J010p95O47p10N97k35
4099a05k79O11m62O50p58P29m12J23j37K9L34p01Q70q69P38o53L48J53l59N68
4119D18r88J033o33M99k64J0K67p81J107j037P68m47L50r7k54M98q40J102j056
4138c45Q02n11j05M63p1M01j043J240j041o3O71rm67o04J249r57K16n60Q20N7
4158A43q6K76o00O26j092R26n05N40l73j54K12n56J057r80P96l71K00o0l78O39
4178B60o68P73o72N68l63n4K87n04O76n41O86p83N56l90J87K07n26P39o05P94
4198F27p31O39n18k8K93m05P91j031P36p09N41J97n00O37q88P77o72P89n46L63
$$ plain form
4218 362 249 -286 393 -372 602 -353 215 -136 36 63 -416 436 -701 341 -254 -28 -123 -115 259 -637 456
4239 456 -518 175 -243 86 80 -141 131 -436 137 -552 639 -444 -107 -173 -259 96 -549 407 -396 82 -392
4260 -392 144 380 -271 387 -241 438 -213 196 -36 -78 154 -195 437 -488 409 -103 141 71 -121 402 -279
4281 -279 304 -417 319 -262 326 183 64 365 -307 545 -284 371 -120 -109 -100 -274 557 -277 253 -150 59
4302 59 -43 -90 187 -353 419 -282 458 -164 61 184 -143 202 -271 381 -476 196 -125 -282 9 -287 115
4323 115 -198 500 -478 300 -95 174 11 -476 409 -367 423 -267 231 14 -116 10 -180 438 -308 378
4343 378 -296 -7 -48 -37 172 -253 410 -122 410 -246 210 69 -88 564 -264 388 -161 758 -151 164 297
4364 297 -131 671 -329 426 -479 555 6 59 339 -303 384 -515 561 -73 164 -122 -231 125 -350
$$ packed form
4218C62j13n35O79p65R74r55N68l51J72K7m79Q52j137J042n95K26r5QL74q96J093
4239D56r74O93m18L29ok21K72n67N73o89J191j083L37o6q6L55o45R56q03M78m74
4260c92N36K36o51O58o28O79o51M09k32m2K32l49O32r25Q97n12K44p0j92N23o81
4281b79N83p21P36n81N88j43j19L01o72Q52q29O55m91J1Rj74Q31q34N30m03K09
4302E9j02m7K77n40P72p01P40o22K25J23l27L45m73O52q57O72l21j57K91k96M02
4323A15l13O98r78P78l95K69j63m87Q85p76P90o90M98k17j30J26j90O18p46O86
4343C78o74K89m1J1K09m25O63n32N32o56M56j41j57O52q28O52n49R19r09L15J33
4364B97m28Q02j000P55r05J034n49N3K80o42O87q99J076o34K37k86j09L56m75
$$ plain form
4383 -350 526 -446 236 -214 100 -53 -226 357 -473 243 -428 78 -230 19 -319 -549 324 -555 68 -270
4403 -270 78 -321 -204 229 -341 91 -755 485 -278 318 211 -83 282 -395 475 -211 395 -299 51 97
4423 97 2 278 -417 200 -262 322 83 -65 287 -84 134 -155 528 -195 418 -104 -111 407 39 438 -612
4444 -612 462 -337 140 -19 -61 245 -490 227 -377 227 -337 99 121 -108 259 -358 361 -227 87 -328
4464 -328 57 188 -435 255 -375 361 -380 139 97 -44 82 -287 126 -245 222 -243 208 -195 -222 258 -184
4485 -184 388 -345 466 -7 144 106 -107 -27 -383 378 -69 209 -54 284 212 -316 310 -269 389 -237 419
4506 419 -191 -212 288 -31 383 -158 431 -274 76 -3 -21 315 -96 492 -277 636 -337 145 -50 20 72 -531
4528 -531 356 -310 260 -308 -20 90 -293 289 -446 351 -576 359 -116 -235 25 -210 -70 -211 328 -348
$$ packed form
4383c50Q76r72O82m50L14j53j73N83q30P16o71N06l08K49l38k30Q73q79O23l38
4403b70L48l99J17M33n70M32q46J240p63N96j07k94L65o77Q70o86O06o94L50M6
4423I7r5K76o95O17m62N84k39j48L52l71K18k89O83p23O13n22pN18l68L99j050
4444f12J074p99M77j59m2L06p35P17o04O04n64M36K2k29L67o17P19n88L14m15
4464c28L85J31o23O90o30P36p41N19m2j41J26l69M13l71M67m65M51m03k7M80m42
4485a84N72p33Q11m73J51l8k13Q0l56P61m47K78k63L38p2n28O26n79O58o26O56
4506D19o10k1N00l19M14n41N89p05L50p9j8L36m11N88p69R13r73M82j95P0N2o03
4528e31Q87o66N70n68K88J10l83N82p35P97r27R35m75j19K60k35J40j41N39o76
$$ plain form
4548 -348 137 -346 -130 26 -396 332 -387 472 -183 -100 71 -17 192 -85 283 -103 398 -221 202 -7 68
4569 68 178 -324 198 -40 213 -16 -48 170 -260 526 -499 597 -201 323 103 -92 188 -197 201 -172
4589 -172 524 -105 276 -82 141 236 -72 352 -327 190 -16 -73 79 -116 214 -401 341 -530 448 -328 43
4610 43 32 45 308 -662 256 -434 251 -161 -270 -93 -84 53 -350 403 -560 -81 71 212 68 -85 216 -398
4632 -398 318 -446 268 40 -3 108 -357 440 -269 213 -207 21 60 -105 244 -342 470 -168 479 -220 2
4653 2 247 -150 654 -260 360 -97 23 -70 220 137 -92 272 -166 279 -96 206 32 -191 16 -302 87
4674 87 -396 96 -236 127 162 -359 230 -124 230 -369 64 -231 4 66 -404 151 -640 22 -421 134 1
4695 1 -48 190 -253 258 -358 144 62 180 -93 22 256 -206 285 -259 308 -445 173 77 16 401 -485 154
$$ packed form
4548c48M85m83K16J56m22P28p19Q59o55Q3J71q8K09k77L68l86N01o19M23k09P5
4569F8J10n02N22k38K53k29l2K18m30P86j025J096p98N24k20j95K80l85L98l73
4589a72O96o29L81l58K23R5l08M24o79N17k06n7J52j95L30o15P42q71R78p76L71
4610D3j1J3K63r70R18o90O85m12j09J77RJ37m03P53r63M79J52J41j44j53L01o14
4632c98P16p64P14k28m3J11m65P97p09M82m20K28L9j65L49n86Q12o38O47o99K22
4653BK45l97Q04r14O20m57J20r3K90q3k29L64m38M45l75L02j74k23K07l18L89
4674H7m83M92l32L63L5n21N89l54L54n99M33k95K35O2m70N55p91O62m43N55j33
4695Am9K38m43N11o16N02q2J18k73J15K34m62M91n44N67p53O18r6o1L85q86O39
$$ plain form
4717 154 -293 285 91 42 195 17 377 -329 41 -273 154 -131 39 114 -150 377 -420 316 -148 286 -46
4738 -46 15 283 -210 300 -187 191 -144 73 59 -298 104 -143 251 -272 155 -193 230 -19 -4 424 -104
4759 -104 305 -173 -59 -216 -4 156 -398 237 -364 149 -157 -14 -198 -234 36 -387 259 -388 -120 -310
4779 -310 -49 -229 -63 89 -99 470 -362 165 -251 106 -185 -150 178 -388 439 -198 445 25 174 48
4799 48 -397 292 -420 333 -167 216 16 -127 449 -48 331 -79 504 -63 604 61 243 366 -420 285
4819 285 -404 466 -87 -24 102 -30 402 -284 577 -265 274 -195 36 84 54 119 -288 295 -552 68 -376
4840 -376 -119 296 -318 3 -273 256 -301 -37 21 -198 263 -330 -31 -362 282 -507 116 176 -48 294 -156
4861 -156 267 -558 281 -83 192 274 -112 36 -38 300 -264 242 -415 6 227 -54 474 -338 507 80 312
$$ packed form
4717A54m47N78j94m9J53j78L60p06L70l14M27k85J70P5k64N27p97P36m64M34l32
4738d6O1K68m93N10m87L78l35K17j4l57M02k47L94n23M27l48M23k49J5M28n28
4759a04M09m78J14j57K12J60n54O35o01N13l06J43j84l6K70m23O46o47K68j90
4779c10K61j80J66J52j88N69q32N27m16L57k91L5L28n66Q27o37O43m20J49j26
4799D8m45O89p12P53n00L83k00j43N76m97L79m10N83n67O67n43J82J23p86P05
4819B85o89Q70n53O3J26j32M32o86Q61q42N39m69K31M8l0O5m07N83q47O20m44
4840c76K57M15o14L21k76N29n57K64N8k19M61n93K99l31O44p89O23O0k24L42m50
4861a56M23q25Q39l64K75Q2l86J48p4L38n64N06o57M21K21k81N28q12Q45m27K32
$$ plain form
4882 312 123 134 250 -228 615 -166 138 -216 170 84 -260 291 -246 204 -527 238 -181 248 -200 -128 191
4903 191 -363 260 -289 199 106 -192 -20 -45 242 -224 174 -168 -105 -271 -287 -108 -428 319 -549 319 -420
4924 -420 175 -57 -251 77 -200 440 -188 86 -198 33 -170 -235 81 -329 383 -122 340 65 100 -16 -230
4945 -230 246 -367 467 -369 130 -211 105 187 -251 292 -412 400 -188 591 86 -42 217 -94 415 -299
4965 -299 467 -12 24 59 88 450 -450 68 -321 366 -135 42 -16 -139 70 -129 473 -199 195 -157 -176 17
4987 17 -29 7 -518 325 -402 -15 -141 -98 -32 -113 290 -272 262 -357 16 -105 -6 89 170 392 -262 355 -295
5010 -295 105 255 45 503 -319 243 -73 285 66 91 159 -158 329 -291 305 -202 177 53 10 137 -169
5031 -169 76 -147 173 -180 -15 121 209 422 -140 379 -292 259 -380 40 173 -267 98 -312 302 -201
$$ packed form
4882C12j89J1J16m78Q43p81L04l54L86q6l44N51n37M50p31P65m19M29m48P2L19
4903A91n54O23n49M88r3k98J72k5K87m66L98l42O3j66j6J79l20P47q68Q68p39
4924d20N95k32j94L28k77O40o28K74k84K31k03o5L16m10P12n05M62k75L5j16k14
4945b30M76o13Q34q36M99l41L16Q2m38N43p04Q12n88P79n05j28K59l11N09p14
4965b99P66m79L6L5K9L62r00N18l89O87n01J77n8j23K09j99O02o72L94l52j9J93
4987A7m6L6n25Q43p27L87j26M3O6q1M03n62N34o19L73j21R9R5Q1K22o54O17o50
5010b95M00J50k10M58q22N62l16L58k19K5O8l17M87o20N96n07L79j24m3J27l06
5031a69K45k23L20l53J65J36Q8K13n62N19o71N51o39M20J33m40L65m10O14n03
$$ plain form
5051 -201 40 -47 -30 227 -294 108 -911 319 -87 -129 -52 -47 119 -332 106 -271 -52 -407 -132 -296 223
5072 223 -475 -372 505 -603 316 -114 -190 28 -162 211 -750 373 283 -164 148 -278 -14 -617 1107 -331
5092 -331 -45 -21 288 178 577 440 -297 1447 -561 76 -315 315 -23 98 796 -670 449 -174 -6
5111 -6 -237 422 -81 -90 6 -663 586 -4 251 -94 314 39 -327 473 -213 533 -293 193 -136 -99 1 -236
5133 -236 239 -276 60 -436 152 -218 -96 -70 -84 232 -254 283 -142 -36 114 43 36 -399 100 -260 308 -96
5155 -96 69 304 -3 167 -179 233 -165 96 -132 91 354 -208 47 -113 63 297 255 453 156 -304 -49
5176 -49 53 -553 969 -263 -438 315 -71 20 337 609 -134 315 -236 236 72 55 315 -355 266 -9
5196 -9 149 -45 414 211 -257 364 -71 -207 50 38 -5 194 -222 -704 -333 -272 670 206 -776 505 -503
$$ packed form
5051b01K41q7J7K57n21M02j019J230m06m2P7NJ66m51M38l77K19l55K75j64N19
5072B23o98J03Q77j108R19m30p6K18j90L73r61J123r0m47L12m26K64o03J724j438
5092c31K86K4L09j10L99j37p37J744k008O37l91O30l38J21O98j466J119o23J68
5111fk31O59n03rR6o69J249n90K55l45M08k75l66Q00o86P46q26M86l29L7J00k37
5133b36M75n15L36m96N88l70J22K6j4L16m86N37m25J06J50p1pm35M99l60N68m04
5155i6J65K35l07J70l46M12l98K61k28K23K63n62K55j60J76K34m2J98k97m60K55
5176d9J02o06J522j232j75P53l86R1L17K72p43M49n51M72j64j7K60o70O21k75
5196iJ58j94M59k03m68O21m35j36K57j2m3J99m16m82L71O1R42m64r82J281j008
$$ plain form
5217 -503 -255 60 -175 -69 -35 -192 -246 -117 15 221 -289 153 -386 137 -395 -137 91 -274 248 -326 198
5238 198 -179 9 -89 -10 201 -69 450 -366 301 -251 210 60 -58 192 -14 228 -204 147 -3 23 74
5259 74 -8 100 -225 421 -181 480 145 -94 87 32 161 -109 276 -267 95 9 28 -191 -327 317 -225 258
5281 258 -479 100 -32 -350 10 -97 186 -138 125 -398 -136 -33 -165 134 -201 195 -444 53 -145 -153 -88
5302 -88 -118 206 -572 248 -352 162 -79 -139 -29 -332 252 -82 330 -132 112 133 -101 384 -1 156 73 324
5324 324 -101 293 2 -75 357 -172 358 -186 288 40 -55 -275 -86 419 -91 445 -184 387 -129 -117 -24
5345 -24 56 300 -429 155 -235 272 59 -84 -31 -71 448 -373 278 -212 77 36 -284 320 -286 200 -228 41
5367 41 -330 138 -117 -94 249 -236 291 -130 256 -328 56 79 -191 142 -253 58 -400 134 -41 -74 54
$$ packed form
5217e03K48L15k35J06L4j57n4J29J32K06n10M42n39N23n32K58K28l65N22n74N24
5238A98l77J88r8P9K11k70N19q16O67n52M61j50j18K50k06K42m32L51j50K6N1
5259G4q2J08l25O46o02O61l35k39J81n5J29k70L85n43L62q6J9k19j36O44n42M83
5281B58p37N79j32l18L60j07K83l24K63n23K62J03j32K99l35L96o39M97j98qO5
5302h8l0L24p78Q20o00N14k41o0J10l03N84l34M12m62K44K1k34M85l85J57q3K51
5324C24m25L94k91p7M32n29N30n44M74k48r5k20J89N05n10N36o29N71n16J2R3
5345b4Q0K44p29N84l90N07k13j43N3m0N19q21O51m90K89m1l20O04o06M86m28K69
5367D1l71M68k55K3L43m85N27m21L86n84L84K3k70L33l95L11m58N34j75l3J28
$$ plain form
5388 54 -82 127 -251 236 25 122 -6 240 121 -262 169 -181 391 -221 12 190 149 181 -155 201 -161
5409 -161 416 -151 206 -50 1 218 -185 382 -189 249 -129 -256 -20 -118 368 -74 225 -126 140 -135 150
5430 150 -14 -331 281 -412 221 -69 66 -27 -57 133 -220 89 -156 157 -125 128 -225 -551 -8 -445 203
5451 203 -227 90 -142 -50 35 -182 475 -221 189 -132 15 -8 -291 -7 -277 149 -157 33 -202 210 6
5472 6 -52 46 -81 191 -188 176 -247 268 -34 -262 146 -82 40 -110 275 -178 196 15 -123 293 -239
5493 -239 378 -42 215 -3 -91 88 -226 191 20 328 -229 -72 102 -106 106 -257 74 -59 15 -291 -132
5514 -132 29 -362 78 -305 30 -201 138 28 144 63 -220 71 -383 399 -401 248 -65 -35 -5 -429 136
5535 136 -169 58 -136 336 -29 -33 118 -91 105 -114 266 -164 -30 -46 -227 452 -274 232 -169 52 -155
$$ packed form
5388E4j36K09l78M87k11R7j28K46j19l83M31l50N72o12K33J78m1L2l36L56l62
5409a61N77n67L57k56N1K17m03N67n71M38l78j27K36r8M86m42K99l51K66k75K85
5430A50j64l17O12o93O33k90J35r3l0J90l53L09k45L13k82K53l53l26N43m37O48
5451B03m30L17k32R2Q5k17O57o96M10l21J47k3k83K84k70M26l06J90k35M12k04
5472Fn8R8j27K72l79L64m23N15l02k28M08k28J22j50L85m53L74j81j38M16n32
5493b39O17m20K57k18q8J79l14M17j71L08n57J57J74k08K12l63L31j33P4l06J59
5514a32J61l91M40l83L35k31L39j10J16q1k83K91m54P82q00O49l13L0L0m24N65
5535A36l05K27j94M72l65mJ51k09J96k19L80m30J34j6j81O79p26N06m01K21k07
$$ plain form
5556 -155 4 174 72 319 -300 355 -82 217 104 167 266 50 269 -37 303 -29 15 -36 8 -17 -162 399
5578 399 -169 157 -45 179 290 -74 24 -163 112 -143 265 -320 3 131 -295 58 -457 -19 -164 177
5598 177 -275 17 -146 -49 145 -338 237 -75 279 10 73 -172 -169 -10 -127 261 -258 166 223 183 297 -163
5620 -163 302 -214 239 101 25 156 -132 52 -245 118 -181 325 -423 108 80 -186 322 -22 352 -46 -114
5641 -114 24 61 286 -509 8 -154 46 -3 -10 149 33 129 -240 246 -190 118 -187 56 117 -278 -3 -276
5663 -276 185 -153 158 -48 -294 -16 -50 -171 -236 209 -301 67 -27 -243 128 -129 53 -50 138 -96 70
5684 70 -189 -52 231 -117 350 -222 65 -327 26 5 -121 -137 -80 314 -268 69 -30 64 16 54 205 -109 227
5707 227 -168 459 -258 223 174 -26 168 33 246 -287 258 18 136 130 -91 297 -279 173 -49 161 196
$$ packed form
5556a55J59J70j02K47o19O55m37K99j13O3R9k16K19l06L40l32M4n1M4k5j45N61
5578C99n68L26k02K24J11l64R8j87K75k55M08n85L23J28m26L53n15M38j45L41
5598A77m52K92j63R7J94m83N75l12L54k69O3k45LJ59j17L88n19M24N7m0J14m60
5620a63M65n16M53j38p6J31k88J84k97L63k99N06p48N31k8k66N08l44L74l98o8
5641a14J38L7K25p95N17j62K00m9pJ59j16R6l69M86m36L08l05K43O1l95K75k73
5663b76M61l38L11k06k46K78l4j21o5M45n10L68r4k16L71k57J82j03J88k34J66
5684G0k59J37K83l48M67n72K87l92L53k1j26j6N7L94n82L37r9R4m8L8J51l14L36
5707B27l95O27p17M81m9k00J94j35K13n33N45k40J18ok21L88n76M52k22K10L5
$$ plain form
5728 196 -318 50 -95 47 -155 255 -100 107 34 -107 73 42 161 -98 137 -123 -89 10 -103 275 -6
5749 -6 232 -128 -92 37 -23 -25 -204 184 -105 -33 -262 120 -92 182 76 -23 173 -98 119 -2 165 219 -219
5772 -219 54 -167 237 -231 276 -19 123 12 -24 13 -14 31 -1 473 59 30 180 -27 205 -73 245 190
5794 190 -95 -27 8 -3 -103 42 56 171 -157 -31 66 -24 112 96 153 -284 -20 -35 101 34 -180 -80 -259
5817 -259 167 -166 126 -105 -232 156 -278 135 -175 58 -221 207 -216 -336 172 -8 358 -132 154 -310
5837 -310 22 -14 -2 142 29 46 -299 67 -175 -28 142 -187 -48 -92 216 52 52 56 -12 -13 -82 122 -146 161
5861 161 24 151 -147 91 337 -293 347 -345 294 -50 299 29 -126 172 8 197 38 22 -75 67 91
5882 91 -155 276 -268 -52 274 64 -193 133 16 -129 126 -235 65 -242 -73 -22 161 25 -70 222 -331
$$ packed form
5728A96n14L68j45J42k02M10l55K07p3j41J80l1J19k59K35k60L4R9j13L78k81
5749fK38l60L6J29o0kj79L88k89P2k29L82k12K74j06r9J96k71K17j21J67N4m38
5772b19K73k21M04m68N07k95J42j11l6L7k7M5l2M74m14k9J50k07K32k78L18n5
5794A90k85O8L5j1j00J45J4J15l28J26R7r0J36j6N7m37K64j5J36o7k14J00j79
5817b59M26l33K92k31j27L88m34M13l10K33k79M28m23j20N08j80L66m90K86m64
5837c10L32l6J2J44j13J7l45L66k42J47J70l29J39m4L08j64%Mo8jo9K04k68L07
5861A61j37J27k98K38K46o30O40o92O39l44L49k70j55K98j64J89j59j6r7J42K4
5882I1k46M31n44K16L26k10k57L26j17j45K55l61L00l07J69N1J83j36r5K92n53
$$ plain form
5903 -331 137 -205 -64 -284 -18 -79 -180 308 -97 141 -1 191 -11 -1 122 -443 171 -381 250 40 197
5924 197 -64 56 157 -340 -17 -192 482 2 -87 116 -73 265 -85 266 -206 155 201 -328 186 -62 186
5945 186 1 238 -411 -117 171 -65 82 -52 -97 -264 100 -111 268 -137 -167 -60 -116 151 -308 188 81
5966 81 108 -38 180 198 -208 133 60 37 -106 321 -37 -269 101 -117 4 -118 -219 -147 -63 -65 -134 107 -469
5989 -469 132 37 -125 89 -142 259 4 108 -207 93 -175 -238 37 7 270 -85 194 0 204 -140 146
6010 146 194 -155 446 21 135 -93 185 103 -214 -81 -224 308 -217 182 -71 -29 201 -168 283 -249 281
6031 281 -223 91 -28 -63 265 -53 113 -88 39 -257 242 14 -195 281 7 30 -282 136 -379 -81 -12
6052 -12 -31 78 -57 202 -213 244 -234 11 -3 -236 357 -179 216 -56 111 86 351 54 -25 227 -221 101
$$ packed form
5903c31M68l42J41k20K66o1j01M88m05K38j42J92k02J0J23n65O14n52O31k10J57
5924A97k61J20J01m97L23j75O74m80q9K03j89L38l50L51m72L61M6n29N14k48K48
5945A86j85K37o49K94K88k36J47j34m5j67L64k11L79m05l0J07n6K67m59M96j07
5966H1K7j46K18J8m06L41p3k3j43M27l58k32L70k18J21j22j01P2Q4ko9K41n76
5989d69O01r5j62K14k31M01k55J04l15L00k68o3K75l0K63l55K79j94K04l44K86
6010A46M8l49O01m25J14k28K78q2l17J33j43N32n25L99k53M2K30l69M51n32N30
6031B81n04L14j19l5L28l18J66k01J27k96M99k28k09M76k74K3l12M18n15K98O9
6052a2j9J09j35K59m15M57m78K45j4k33N93n36L95k72J67k5K65k97p9K52m48L22
$$ plain form
6074 101 9 -41 25 56 98 -61 243 -257 213 -301 263 -18 -263 139 -198 89 -124 451 -38 161 22 130
6096 130 2 -185 144 -228 74 -44 -41 89 -125 226 -303 -12 -321 127 -261 108 216 146 225 -14 276
6117 276 -107 62 -95 -2 159 -230 136 -454 359 -279 -52 27 -240 145 -97 339 -65 97 7 -70 42
6138 42 -284 116 -265 160 -295 -58 146 50 197 134 166 -334 71 -79 197 -229 145 -39 -323 174 -82
6159 -82 178 -251 168 52 -265 156 -34 321 -237 219 -119 -93 216 -109 419 -104 240 -289 182 -5 -65
6180 -65 -12 -74 53 -440 269 -183 266 -299 -152 -14 -75 150 -212 80 -225 120 -153 -226 -249 -193 209 -134
6202 -134 28 -92 -147 202 -267 -188 80 185 -179 86 -306 -231 58 -103 169 -128 172 -72 107 -48 -9
6223 -9 115 -57 69 -165 8 -179 214 -157 125 237 -79 291 -218 255 -207 340 38 -125 244 -131 292
$$ packed form
6074A01r2n0O6L1M2j59L04n00M70n14N64k81k45M02l37K87k13N75m89J99j39J08
6096A30j28j87L29l72L02j18LJ30k14L51n29K91l09M48l88L69J08p0P9k39K90
6117B76l83J69j57R3J61l89L66n90Q13o38K27P9k67L85k42M36m04J62r0p7J12
6138D2l26M00l81M25m55K37K04r6J47o3L2n00M05j50K76m26L74j84k84M97k56
6159h2K60m29M19j16l17M21j90L55n58M56l38K6L09l25N28n23L44n29M71j87o0
6180f5N3o2J27m93P09m52M49n65J47J38o1K25l62K92l05L45k73p3k3N6M02l43
6202a34J62j20n5L49m69P9K68J05l64K65l92P5K89j61K72k97L00k44J79j55L9
6223iJ24j72J26k34J73j87L93l71K82J12l16L70n09M73m62N47l02j63L69l75M23
$$ plain form
6244 292 -48 169 30 -160 98 152 -47 -243 196 -299 327 115 -39 80 -153 54 -90 82 -446 123
6264 123 4 -59 30 -171 169 -273 39 -562 132 40 -67 -13 24 395 -134 -150 46 114 -173 -206 158 1 166
6287 166 -429 372 -66 -152 -31 -108 284 -416 171 -26 124 -124 -52 126 -219 -41 33 131 -216 47 47 83 238
6310 238 255 512 -153 -99 -317 189 -100 -1 25 -82 294 4 103 -158 40 -163 39 300 -20 91 -191 -207
6332 -207 161 -153 -140 -197 174 -325 282 -295 -292 41 -172 90 17 175 -144 83 -79 -59 -9 -316 -134 -181 -46
6355 -46 -99 108 256 182 -127 -46 -23 -263 174 -267 71 -42 148 58 15 205 -40 162 -360 108 24 154 101
6378 101 -255 -2 -182 198 -88 118 80 -51 34 -94 321 -204 251 -22 -105 -128 -118 51 -252 -81 34 -71
6400 -71 213 13 242 -180 173 -61 124 -1 6 -209 -128 -26 -87 282 -98 174 -400 -154 61 -38 108 -29
$$ packed form
6244B92l40K17j39j90K58N4j99j96M39m95O26k12j54J19k33K07j44J72n28N69
6264A23j19o3Q9k01L40m42L12o01O94r2j07N4L7L71n29j6J96O8k87l3L64j57J65
6287A66n95Q01m38q6J21p7L92p00N87j97J50k48P2J78l45J78P4R8l47K63%L6J55
6310B38J7K57o65N4k18N06k89R9K6j07L76k90R9k61J98k03K02K61l20J11k82j6
6332b07L68l14J3n7L71m99O07n77LL33k13K62p3J58l19K27j62K0N0l07J82m7J35
6355d6n3K07J48p4l09Q1K3k40M37m41L38j13J90r0m3J90k45K02n22M68q4J30n3
6378A01l56K53j80L80k86K06l8j31Q5j28M15n25M55k73q3k3J0J69l03J71J15j05
6400g1K84k00K29m22L53k34J85j25Pk15Q1J02o1L69l80K72n74K46K15r9J46j37
$$ plain form
6422 -29 -105 -89 271 -15 -232 72 -144 69 -161 -55 -180 150 -160 34 27 -140 85 -62 152 -171 310 51
6444 51 -87 -17 -54 346 -66 23 -468 161 -27 93 114 57 392 -87 243 -249 72 -74 -72 243 40 129 -314
6467 -314 133 -121 151 7 -110 382 -24 177 -146 160 38 41 417 127 83 -241 -126 49 9 -183 -89 218
6489 218 -74 111 -242 81 68 33 52 -154 135 -184 -41 -72 132 260 121 -123 -127 169 -206 20 -4 97
6511 97 99 -91 -45 -57 -38 -149 77 -67 -42 -18 169 -50 -33 31 -67 -82 -429 249 84 -52 212 -228 64 -237
6535 -237 96 14 0 -16 -97 -262 -203 260 -74 310 -125 -59 204 191 367 -132 102 -106 71 349 82 28 -230
6558 -230 200 -13 -36 -107 90 110 106 191 -371 -37 -160 217 3 -197 89 -28 85 -21 338 -173 -108 -237
6580 -237 -93 -25 -22 37 130 140 -168 212 165 12 59 -312 -3 16 120 -27 264 408 231 -67 2 262 63
$$ packed form
6422b9p6J6L60k86k17L04k16K13k30J06j25L30l10J94pj67K25j47K14l23M81k59
6444E1j38P0l7M00m12Q9m91O29j88J20K1n7L35m79L30m92L21j46KL15k03Q9m43
6467c14M47k54K72j44j17M92m06K01l23L06j22LL76k90m4l24J15J75m0j92R4L07
6489B18k92J85l53L23j3l5J9k06K89l19J43l1K04J28j39k44mK96l75K26k4J01
6511I7Kj90M6j2J9j11K26j44K5K4J87k19J7O4r8j5l47O78j65j36K64m40K92l01
6535b37L33q2j4j6q1j65N9M63l34L84m35O6K63j3J76m99K34k08J77K78k67n4k58
6558b30M30k13k3p1J97K0mQ5n62L34j23L77k14k00K86j17J13j06L59n11O5j29
6580b37J44O8LN9R3J0l08L80m7j53M7l71L09J9J04j47K91J44j77k98O9K60j99
$$ plain form
6603 63 226 74 -153 24 -126 80 119 33 -40 241 -84 -200 -104 -8 -110 -42 192 2 -114 -34 123 -85 84
6626 84 171 192 185 -85 107 -38 4 -232 50 -82 -46 -102 -288 227 -120 103 216 65 232 -56 79 53 172
6649 172 -50 -97 164 -304 -23 16 98 -161 -176 81 -285 228 -503 -168 -183 38 -97 -154 -67 -235 338 57
6671 57 311 -408 196 -45 -214 -31 224 129 -39 97 11 248 119 -157 -20 -172 -9 165 -2 -60 -138 129
6693 129 0 47 -123 285 -53 -78 -189 -31 -86 -152 290 -187 286 -7 281 -301 -283 92 -111 165 -237 72
6715 72 -136 189 14 -105 203 -189 286 -27 35 -47 5 -208 -46 -18 -129 363 -120 102 -272 -125 11 -30
6737 -30 50 53 126 46 216 -179 -30 82 -7 224 -199 47 -270 -172 67 51 63 -236 207 118 477 -17 -11 81 -104
6762 -104 373 -44 41 -77 285 140 25 -26 54 317 -118 121 -57 -13 -244 231 10 44 214 -253 82 -94
$$ packed form
6603F3J63j52k27J77j50K06L9q6p3K81l25j16R6R6j02O8K34j90j16Q0J57k08J69
6626H4Q7K1pk70J92j45M2k36K82j32L6n6j86N15l47K23J13j51J67k88J35k6J19
6649A72k22m7K61m68K81L9Q2k59j5K57l66N13p31L35j5K21j35n7Q7j68N73k81
6671E7K54p19O04k41j69J83K55r5j68J36q6K37j29k76J37j52J63J74j67n8p8K67
6693A29j29M7j70M08l38k5j11J58n5o6M42m77M73k93K88n82J8L75k03K76m02L09
6715G2k08L25j75j19L08l92M75l13O2q2N2k13J62K8j11M92m83K22l74J47J36m1
6737c0Q0LP3q0J70l95J49J12q9K31m23K46l17R8K39j6J2k99M43q9L59m94OR2j85
6762a04M77m17Q5j18L62j45j15n1Q0K63m35K39j78M4k31M75k21L4J70m67L35j76
$$ plain form
6784 -94 23 104 -216 288 -127 229 -352 52 -269 121 -304 -250 390 -109 319 -237 93 -116 58 33 225
6805 225 -177 478 -309 34 -188 210 -221 -403 89 336 228 -66 -692 -104 128 -250 44 -323 471 -353
6825 -353 -447 90 83 299 -899 442 652 147 -234 809 -353 -321 -784 -211 -207 -211 44 -65 -518 403 -716
6846 -716 454 -556 -392 238 -218 299 599 125 166 -275 -145 -21 -632 327 -132 97 -855 -195 -438 -232
6866 -232 62 -164 -345 -403 -83 -79 -215 125 8 569 -39 156 -296 -384 -97 -97 185 -373 -225 -11 123 -35
6888 -35 -57 -77 -19 200 67 142 -127 119 314 84 -335 -410 123 42 -643 483 249 165 385 -127 699 304
6910 304 -165 113 81 -199 -205 -232 -98 106 58 229 341 -1 -41 84 -202 147 -91 9 -75 -136 467 107 -21
6933 -21 -103 65 -138 -139 -81 160 607 129 335 -44 524 -265 -87 192 -191 108 718 604 -621 396 -13
$$ packed form
6784i4J17Q1l20N04m15L56n81M04l21L90m25N4O40m99M28n56L30k09J74k5J92
6805B25m02O55p87L43k22L98m31j82M92K47j08k94o26N88K32l78K94l67P94q24
6825c53r4N37pK16j198J341K10n05l81J043j162L2m63N73MmK55j09m53R21j119
6846g16J170j010J64O30m56N17L00m74M1m41J30J24o11R59m59K29r52O60k43K06
6866b32K94k26j81n8L20Mj36L40j17N61o08J95m52q8K87%K82n58J48K14J34j58
6888c5k2k0N8K19j33P5k69K46J95k30m19p5N33q1o85J126k34q4K20n12Q26l95
6910C04m69K78l2k80ok7J34K04m8J71J12l42m0J25k86L49k38J00q4o1O03l60j28
6933b1q2J68k03jN8K41M47m78K06l79N68p89J78K79l83K99O10j14j225J017m09
$$ plain form
6954 -13 198 25 399 -120 -404 2 154 38 -124 -3 17 -179 216 -58 277 -165 96 -130 -128 188 -14
6975 -14 11 -128 120 -376 258 228 52 70 139 170 75 97 152 159 5 -62 -141 -49 260 -154 50 101 304 191 -72
7000 -72 -91 -65 -5 -150 40 -419 -167 -36 -325 -75 -168 176 -216 168 -87 -24 204 -144 -200 -263 14 -222 33
7023 33 -92 -34 -8 -178 386 -57 199 4 -63 108 39 23 -122 19 -56 169 -260 74 171 -24 59 280 171
7046 171 92 105 -59 -18 -120 -189 91 -166 260 75 252 63 158 2 34 244 5 116 -350 -49 102 142
7068 142 26 33 113 -224 237 164 114 211 -141 219 47 129 34 189 -67 -104 -33 142 102 -453 143 -638 -64 -693
7092 -693 -552 142 -218 201 44 17 -251 117 141 170 -72 -336 271 -178 307 214 120 -14 -73 184 205 209 -129
7115 -129 207 -99 -258 96 42 58 48 179 -161 339 -38 108 245 -34 439 140 284 38 141 158 219 25
$$ packed form
6954a3K11j73L74n19k84M06J52j16j62J21K0j96L95k74L35m42K61k26KL16k02
6975a4K5j39K48m96O34l0j76J8O9L1r5K2N5Pj54o7p9R2L09m14K04N1K03j13k63
7000g2j9K6O0j45J90m59K52J31k89K50r3L44l92L84k55O3K28l48n6o3K77k36K55
7023C3j25N8K6j70N64m43K56j95o7J71o9j6j45J41p5K25m29L34R7j95Q3K21j09
7046A71p9J3j64M1j02o9K80k57M26j85J77j89R5j56L2K10k39J11m66L01J51M0
7068A42j16PQ0l37M61p3n0R7l52L60j72Q2r5J55k56l7P1J75m0n55N96p81N74o29
7092f93J41O94l60M19j57k7k68L68K4K9k42k64O07m49M85r3r4j34n9K57K1Ml38
7115a29L36l06j59L54n4J6j0J31l40N00l77J46J37k79M73k99J44k46J03J7O1j94
$$ plain form
7137 25 180 -62 165 143 -103 -136 -75 147 68 -132 -236 -233 -59 -139 599 148 97 137 120 100 -27 -19 -313 -138 -16
7162 -16 -79 306 34 263 -428 -33 -112 -104 -101 -150 24 16 117 -62 129 -257 191 72 -168 296 -81 -186 33
7185 33 -101 -204 75 -195 -77 -14 -31 120 180 -168 -138 126 314 19 92 -82 -28 32 -48 152 -105 -33 -100 -102
7209 -102 -86 154 6 -8 78 177 -32 -20 35 -99 30 277 55 233 111 -138 66 196 5 46 -13 43 133
7232 133 -150 51 28 -288 62 40 -50 104 468 -241 58 -280 15 161 -215 -56 -87 147 -136 137 -20
7253 -20 215 254 85 200 -180 154 -19 333 32 -309 -26 170 37 -28 113 -37 280 -121 111 46 -74
7274 -74 66 -337 83 98 100 -171 59 77 -34 -9 -2 229 -43 450 12 -60 29 -40 141 -168 -270 -99 -19 -264
7298 -264 133 -67 96 348 -65 210 53 4 287 185 161 -11 171 -56 142 -234 112 289 -260 -435 61
$$ packed form
7137B5J55k42K27k2k46l3O1K22p9k00j04LJ74q0P38m51n1M0j7k0j27Qk94J75J22
7162a6o3L85k72K29o91L95p9QLm9J74qJ01j79J91l86M48j19k40M64l77j05K19
7185C3j34j03K79k70J18O3j7J51O0l48L0K64J88k95P3j74N4O0q0K00k57P2o7k
7209a02J6K40j48j4Q6R9k09J2N5j34J29K47k22J78j22k49K04J30j91M1n9N6R0
7232A33k83K01k3l16L50k2r0J54L64p09K99l38K95J46l76J59l1K34k83K73j57
7253b0K35L9j69J15l80L34j73L52l01l41K83J96j33o5J41j50L17m01K32o5j20
7274g4J40m03M20J5Kk71K30J8j11K5PK31k72M93m38p2Q9o9J81l09j02J71Q0k45
7298b64L97k00J63K52m13K75j57m9K83j02k4j72J82k27J98l76L46J77n49j75M96
$$ plain form
7319 61 266 112 126 -529 -166 469 275 421 -625 -43 -823 -10 -434 -661 33 -182 -321 573 -95 79
7339 79 156 44 52 298 77 263 190 91 216 -152 233 -130 553 -183 -127 24 29 -94 2 60 -13 221 -209 261
7363 261 12 -19 -158 75 -190 163 222 -2 -25 -211 228 -93 -22 -144 -427 349 -102 -117 -75 -172 -153 -317 -8
7386 -8 63 111 -300 -11 107 -163 48 -35 -87 -96 152 -159 94 -172 -110 279 -29 -56 -157 26 72 -104 -145 -124
7410 -124 -113 -91 190 -146 47 -43 -6 157 -296 130 -28 96 -272 69 -161 63 230 -194 274 178 106 -208
7432 -208 98 -46 100 170 -131 300 -63 -45 -156 -46 -9 -243 84 4 194 -32 17 -165 34 -50 -75 265
7454 265 -143 -60 -94 -48 33 -96 45 38 6 36 -33 29 25 -29 -137 183 -267 108 27 -104 -159 77 247 -9 102
7479 102 1 204 -73 36 37 325 134 74 2 52 436 25 165 -256 -112 -27 -204 -129 -10 -174 173 -348
$$ packed form
7319F1K05j54J4o55L63O35j94J46j046N82p80Q13m24k27O94k15j39Q94o68J74
7339G9P7j12QK46k21J86p3r9J25l68L85l63O83p36N6J51Nj23R6N8p3K34m30M70
7363B61k49l1j39K33k65L53N9k24k3j86M39l21P1j22k83P76m51j5M2r7J9j64L09
7386hP1M8m11K89J18k70K11q3n2rK48l11K53k66O2L89l08k7j01J83M6j76m1K1
7410a24J1K2K81l36J93r0L7J63m53M26j58J24l68L41k30K24J67m24M68r6p2l14
7432b08L06j44J46P0l01M31l63J8j11J10L7k34L27q0J90k26M9j82J99q4k5L40
7454B65m08Q3l4M6Q1j29J41pl2L0o9O2mn4j08L20m50L75q1j31n5K36J70k56J11
7479A02j01K03k77J09JK88j91o0p2N0L84m11J40m21J44Q5j77P5J19j64L47n21
$$ plain form
7501 -348 -145 -114 303 -182 -444 -492 5 -445 1 204 -831 258 -293 115 34 -142 550 534 -21 275 97
7522 97 382 140 452 -332 -344 243 -60 59 -261 -63 539 -567 -693 255 -58 -315 14 244 -659 78
7542 78 67 -415 -193 -141 64 -58 -59 -162 21 -20 203 223 -97 289 -167 -226 -291 -392 -672 481 439 -561 -884
7565 -884 90 18 -269 -93 -319 88 87 -3 154 115 -123 -189 -73 -134 2 -172 -267 236 174 222 32 10 7 -174
7589 -174 312 91 246 -24 163 27 143 44 -99 33 -64 203 -111 16 -81 148 -11 -130 147 -119 -62
7610 -62 98 -153 -248 113 -85 -146 -8 -71 21 -43 6 28 38 53 -53 126 94 171 -105 -217 -44 -8 -49 -225 27
7635 27 -70 -43 -30 -88 46 213 214 -219 -200 -112 -55 -166 173 -22 -249 82 -171 156 -3 41 -8 -208 4 -132
7659 -132 196 -128 132 -103 222 130 141 5 -64 -51 36 80 -107 127 -133 85 194 -251 115 -40 204 59
$$ packed form
7501c48K03L1M17m85k62m8M97m50M46K03j035J089n51M08q1j76O92j6n55K96j78
7522I7K85k42L12p84j2N87l03J19l20J98O02j106j26R48l13k57L29K30r03P37
7542G8j1m82K22N2K05j22jj03J83m1K23K0l20L86m56n9o5j01k80J153m2j000l23
7565h84R74p2k87J76k26M07jr0J57l9k38o6J16o1J36j74r5N03o2M8j90k2lj81
7589a74M86k21J55k70J87j36J16r9j43J32r7K67l14J27r7K29j59j19K77k66N7
7610f2J60k51r5L61j98o1J38o3R2o4M9K2J0J5j06J79l2P7k76j12J73L6m1j76K52
7635B7r7K7J3n8J34J67Jm33J9Q8N7j11L39j95k27L31k53L27j59M4m9k00K12j36
7659a32L28l24K60k35L25r2J1j36o9J3Q7M4j87K34k60K18J09m45L66j55K44j45
$$ plain form
7681 59 -10 123 112 6 -130 214 -150 297 -70 -311 76 -149 -27 -291 107 -226 -75 46 -59 -105 70
7702 70 107 -110 90 83 15 -10 -138 151 -168 5 60 73 -55 -88 137 -86 142 -96 105 -64 -226 37 11
7725 11 2 52 196 -4 -25 51 7 96 121 11 100 172 -236 -89 -172 27 -40 26 -5 -225 57 -63 -126 -112 108 23
7751 23 -13 -67 143 -215 -29 56 16 -121 46 135 121 135 -32 -119 -177 -181 72 -287 -146 52 -149 -13 -199 -147
7775 -147 50 -70 -132 22 -213 -166 154 -17 116 -14 -10 121 -131 -79 13 130 11 78 111 -122 344 73 -20
7798 -20 13 -45 -20 224 -188 -47 172 15 136 68 20 65 -208 20 -87 93 -66 2 -24 28 -89 -224 69
7821 69 -44 28 -87 -84 -201 -243 54 40 240 -98 119 -130 -21 98 -24 174 -73 100 -273 152 -32 156
7843 156 27 -21 -120 -238 7 -141 239 126 163 94 13 -86 -121 417 -117 97 -36 14 187 -7 174 -61 51
$$ packed form
7681E9o9J33j1j06j36L44l64M47l67k41L87k25J22k64L98l33J51J21j05m6J75
7702G0L7k17K00po8k5j28K89l19J73N5J3j28l3K25k23K28k38K01j69j62K63k6
7725A1rN0J44k00k1P6m4Q9K5j10Q9P2m08J47q3J99o7O6l1k20K82j20o3J4K20q5
7751B3l6n4K10l58J86Q5m0j37J67Q9j4J4j67q7n8mK53l59J41J98k01J36j86N2
7775a47J97j20o2J54k35M7L20j71J33j30MJ31k52N2R2J17j19O7L3k33M66k71r3
7798b0L3n8K5K44m12J41K19j57J21o8m8M5k73K28j07J80j59O8k6N2j17j35K93
7821F9j13P2j15Lj17m2K97j4K00l38K17k49J09J19j22J98k47J73l73M25j84J88
7843A56j29m8r9j18K45j48L80j13L7o9q1r9l5N38n34K14j33N0J73j94J81k35J12
$$ plain form
7866 51 -64 38 22 -81 188 -310 321 69 -212 28 -63 -92 119 -23 -61 25 57 149 48 60 139 36 149
7889 149 -21 174 -234 220 81 205 118 -74 -71 -229 246 -136 92 -118 27 -89 15 151 -95 87 -268
7910 -268 69 -63 104 64 -23 112 -73 73 132 1 -65 232 -19 147 -192 25 -69 -219 -143 -102 -70 39 -214
7933 -214 210 -240 -58 125 -276 106 -331 -49 -55 37 -54 247 -132 -103 344 37 160 -200 308 48 300 117
7955 117 -82 103 147 270 -113 176 -49 -113 -143 -58 -19 -7 44 -74 27 151 -74 -27 104 6 51 80 -95 96
7979 96 -138 -271 -34 -105 222 -53 63 -204 4 87 130 -9 90 196 -196 67 -17 -107 -16 -219 68 -7 150
8002 150 -57 221 -112 45 -62 -28 41 -75 62 58 44 -145 -15 -243 54 85 92 59 282 189 -176 -171 -130 138
8026 138 -11 -148 273 12 -56 96 12 -112 70 112 -90 219 315 -13 16 -199 19 -18 -71 -121 -168 33 -46
$$ packed form
7866E1j15J02j6j03K69m98O31k52k81K40r1k9K11j42l8Q6L2R2j01J2P9j03J13
7889A49j70J95m08M54j39J24q7j92Lj58M75l82K28k10J45j16J04J36k46J82l55
7910b68L37j32J67m0q7J35j85J46N9j31o6K97k51J66l39K17r4j50P6M1L2J09k53
7933b14M24m50J82J83m01L82m37K82oR2r1L01l79K9M47l07J23l60N08k60K52j83
7955A17j99J85M4J23l83K89k25o4l0Q5L9J2N1j18J01J24k25M7J31r8M5K9j75J91
7979I6k34j33K37p1L27k75J16k67K08Q3M3j39R9J06l92K63q4r0R1k03K87p5J57
8002A50k07K78l33J57j07L4O9j16J37mj4j89J30k28K97L1Pl3K23r3l65NM1K68
8026A38j49j37M21k61o8J52q4j24J82M2k02L09R6l28K9k15K18l7n3n0m7K01p9
$$ plain form
8049 -46 91 -22 -130 -24 -2 -289 54 71 175 -101 -119 177 -211 11 75 75 166 -21 45 -120 181 -59 -106
8072 -106 -56 -135 -131 -54 145 -312 26 256 203 123 -92 66 2 144 -199 268 -53 257 -45 97 -22 -366 -131
8095 -131 -183 3 -151 -71 84 177 61 24 228 151 93 90 -201 134 -47 23 69 -256 -282 93 131 -25 -15 58 53
8120 53 -25 170 38 -195 -105 42 -235 -69 -71 -27 -2 -74 166 148 -106 -124 60 -151 -236 227 209 -37 38 -129
8144 -129 120 183 87 40 120 87 -118 67 126 192 50 26 -145 75 -192 135 92 -107 -115 41 60 165 53 -131
8168 -131 -11 41 21 202 9 -109 -77 76 78 88 79 -246 93 -86 309 54 -88 75 -129 50 -166 -72 -166
$$ packed form
8049d6J37j13j08J06K2k87L43J7J04k76j8K96l88K22O4%R1j87O6j65L01k40m7
8072a06N0p9MP7J99m57L38K30n3q0k15J58o4J42l43M67l21L10l02J42j19l44K35
8095a31n2J86j54Q0J55R3j16l7K04p7n8lk91L35j81P0M6l25k6L75L8j56J0P3n
8120E3p8J95j32k33R0J47k77J66kM4K5p2K40j8k54j8J84k11q5M63j8k46P5j67
8144a29K49O3r6m7Q0l3k05J85N9O6j42k4j71K20k67L27m3j99qJ56J9J05j12j84
8168a31J20N2k0J81j93j18L2J53KJ0rl25L39j79L95k55j42J63k04J79k16R4r4
8191a66
$$ Imaginary data points
##PAGE= N=2
##DATA TABLE= (X++(I..I)), XYDATA
$$ plain form
0 0 0 0 0 0 0 0 0 0 0 0 0 0 0 0 0 0 -8 8 -8 8 -8 16 -16 16 -24 24 -32 32 -40 48 -56 61 -72 80 -89 101 -113
37 -113 129 -145 161 -177 201 -222 246 -274 302 -334 367 -407 447 -493 543 -598 657 -724 801
56 801 -884 981 -1092 1219 -1366 1544 -1761 2032 -2383 2861 -3553 4687 -7037 27016 -44577
71 -44577 -5474 39486 -2579 -18500 9592 8667 -13193 14080 -25981 27792 -10696 -11078 9768
84 9768 9963 -15332 -11443 33934 -33294 -749 9583 -3773 -12463 -2391 8516 -11925 10730
97 10730 -28530 20254 -950 -21210 3209 1233 -162 -18427 12918 -12684 10848 -11665 -4281
110 -4281 15304 -16701 2946 -4925 10486 -20179 12039 2209 -13140 13096 -1924 4229 -10633
123 -10633 18480 -10426 6644 -275 -7940 21184 -13468 3349 2710 13792 -12941 10610 7013
$$ packed form
0@%%%%%%%%%%%%%%%%qJ6j6J6j6K4l2L2m0M8n6O4p2Q8j04J17j33J52j69J90k14
37a13K42k74L06l38L78m23M68n20N76o36P01p74Q54r40J036j141J255j381J525
56H01j685J865k073K311k585K910l305L793m415N244o414Q240j1724L4053p1593
71d4577L9103M4960m2065j5921K8092r25k1860K7273m0061N3773l8488l82K0846
84I768J95k5295L889M5377o7228L2545J0332j3356q690J0072J0907k0441K2655
97A0730l9260M8784k1204k0260K4419j976j395j8265L1345k5602K3532k2513P384
110d281J9585l2005J9647p871J5411l0665L2218r830j5349K6236j5020O153j4862
123a0633K9113k8906J7070o919p665K9124l4652J6817o39J1082k6733K3551l597
$$ plain form
136 7013 -10445 18050 -9337 6662 -2937 13317 -7841 1408 12428 -7381 11053 -8270 11332
149 11332 -4952 5667 -6326 1688 8654 -14585 13534 -8945 5377 -2722 3568 -4737 -1531
162 -1531 7899 -14645 8465 -11085 6925 -7902 -2232 1663 -5790 5660 -13353 9240 -9938
175 -9938 2949 -6747 -2419 1723 -7234 4578 -14281 13225 -9265 -1030 -327 -1294 2043 -8740
189 -8740 7924 -10494 9637 -7702 3053 929 -2956 8347 -7897 8701 -6875 10036 -6503
202 -6503 1331 5628 -2751 5834 -6201 12993 -7086 8802 -1415 1003 7141 -3888 7162
215 7162 -6961 11415 -5269 5784 -1288 2425 6986 -7892 10014 -5875 8092 -7144 4442
228 4442 992 -3556 5357 -7349 8249 -7591 7307 -6750 1559 697 -5379 4905 -10703 7396
$$ packed form
136G013j7458K8495k7387J5999r599J6254k1158R249J1020j9809J8434j9323J9602
149A1332j6284J0619j1993Q014O966k3239K8119k2479J4322q099O290q305L206
162a531R430k2544K3110j9550J8010j4827N670L895p453J1450j9013K2593j9178
175i938J2887r696M328M142q957J1812j8859K7506k2490Q235P03r67L337j0783
189h740J6664j8418K0131j7339J0755k124l885J1303j6244J6598j5576J6911j6539
202f503P834M297q379Q585j2035J9194k0079J5888j0217K418O138j1029J1050
215G162j4123J8376j6684J1053p072L713M561j4878J7906j5889J3967j5236J1586
228D442l450m548Q913j2706J5598j5840J4898j4057Q309q62o076J0284j5608J8099
$$ plain form
242 7396 -8389 3095 -5921 668 1080 -7522 5145 -9568 7287 -9349 1407 -3905 -958 1493
256 1493 -9088 6893 -7928 5910 -7479 2743 -1007 -2597 3481 -7920 8014 -7863 6498
269 6498 -4688 2197 2091 -1966 4673 -6782 10181 -6550 5046 -2771 3339 3264 -3966 8057
283 8057 -4921 10144 -5494 6098 289 1229 3869 -4037 8308 -5805 8839 -5348 5400
296 5400 1498 -619 4686 -4966 8475 -6828 6217 -5068 3320 1125 -3500 4097 -5874 8220
310 8220 -8193 4362 -3994 1013 86 -6324 4589 -7283 5103 -8613 3806 -3154 -1504 497
324 497 -6640 5156 -8308 4441 -7805 2302 -1830 -3041 1732 -6081 6274 -7480 4595
337 4595 -5581 2782 -720 -3754 4112 -5760 7000 -6728 4795 -2551 2509 768 -3441 6582
$$ packed form
242G396j5785J1484r016O589M12q602J2667j4713J6855j6636J0756n312K947K451
256A493j0581J5981j4821J3838j3389J0222l750j590O078j1401J5934j5877J4361
269F498j1186O885j06m057O639j1455J6963j6731J1596p817O110p5p230J2023
283H057j2978J5065j5638J1592n809R40K640p906J2345j4113J4644j4187J0748
296E400l902k117N305r652J3441j5303J3045j1285Q388k195m625P597r971J4094
310H220j6413J2555q356N007r27o410J0913j1872J2386j3716J2419o960J650K001
324D97p137J1796j3464J2749j2246J0107m132j211M773p813J2355j3754J2075
337D595j0176Q363l502l034P866r872J2760j3728J1523p346N060j741m209J0023
$$ plain form
351 6582 -4965 7148 -6114 6169 -549 1012 2861 -2717 7926 -4896 7175 -4017 5497
364 5497 -329 138 4184 -2811 7962 -5831 6423 -2611 3951 870 -1644 4765 -3931 6074
378 6074 -6351 5102 -2972 1947 -126 -3526 5138 -6023 4670 -6222 4224 -3025 -1273 -29
392 -29 -4094 4385 -7333 4003 -6122 3435 -2754 -2920 2066 -5197 3962 -7673 3823 -5026 1845
407 1845 -2064 -2203 2996 -5621 4646 -6842 4319 -3671 1159 -91 -2995 4848 -4717 5047 -5590
422 -5590 6378 -1961 214 1656 -1552 5841 -6347 6512 -2575 5073 -1670 1191 4476 -2280
436 -2280 5240 -3911 7202 -4280 3825 553 -1194 4314 -2036 5641 -4576 6415 -1818 2554
450 2554 -125 -1017 5096 -5416 5464 -3884 5506 -3289 -283 2460 -2145 2707 -5813 5435 -5713
$$ packed form
351F582j1547J2113j3262J2283o718J561J849n578J0643j2822J2071j1192R514
364E497n826M67M046o995J0773j3793J2254r034O562l081k514O409q696J0005
378F074j2425J1453q074M919k073l400Q664j1161J0693j0892J0446p249J752J244
392b9m065Q479j1718J1336j0125R557o189j66M986p263R159j1635J1496q849O871
407A845l909j39N199q617J0267j1488J1161p990M830j250k904P843r565R764j0637
422e590J1968q339K175J442l208P393j2188J2859r087P648o743K861L285o756
436b280P520r151J1113j1482Q105l272j747N508o350P677j0217J0991q233M372
450B554k679q92O113j0512J0880r348R390q795L006K743m605M852q520J1248j1148
$$ plain form
465 -5713 2497 -3386 -1313 928 -4333 3307 -7263 4440 -5051 982 -2248 -1983 1412 -5085 3269
480 3269 -6631 5018 -4545 -73 -131 -2357 2499 -5528 4561 -5294 4153 -3100 509 351 -1359
495 -1359 3961 -5510 6431 -3688 3324 -1428 605 2963 -2038 3646 -4173 7022 -3338 2549
509 2549 391 1723 3140 -3580 7124 -3518 5017 -1612 2949 207 348 3885 -3485 5504 -4175
524 -4175 5601 -2870 807 1576 -807 2653 -6270 6248 -3297 1214 -2721 2315 -4 -4283 3880
539 3880 -5170 4405 -4396 961 -1431 -1595 408 -3518 2759 -6057 3315 -4256 746 -2047 -1432 2172
555 2172 -6822 3763 -4083 2024 -4205 1459 18 -2816 1652 -4070 5336 -5796 3191 -2061 385
570 385 1258 -1024 5141 -4114 4781 -2987 2989 -2093 1590 3239 -3969 5243 -3462 4918 -3365 3406
$$ packed form
465e713Q210n883K073K241n261P640j0570J1703r491O033l230K65L395o497Q354
480C269r900J1649r563M472n8k226M856q027J0089r855R447p253L609j58j710
495a359N320r471J1941j0119P012m752K033K358n001N684p819J1195j0360N887
509B549k158J332J417o720J0704j0642Q535o629M561k742J41L537p370Q989r679
524d175R776q471L677P69k383L460q923J2518r545M511l935N036k319m279Q163
539C880r050R575q801N357k392j64K003l926O277q816R372p571N002k793O15L604
555B172q994J0585p846O107o229N664j441k834M468n722R406j1132Q987n252K446
570C85Q73k282O165r255Q895p768N976n082L683J649p208R212q705Q380q283O771
$$ plain form
586 3406 1253 -73 3053 -1591 5843 -3799 4798 -2026 3107 419 -1194 4707 -4007 4818 -2934
601 -2934 2587 -2106 1851 986 -2796 3204 -3837 4676 -5357 2516 -1193 -1466 114 -3695 3589
616 3589 -4795 2460 -4276 1919 -2757 -1546 1220 -4473 3234 -5430 2567 -3758 384 -817 -3109
631 -3109 92 -3466 4197 -5586 2696 -3051 1233 115 -3975 3729 -3443 3211 -3884 3536 -1533
646 -1533 489 1231 -1389 4313 -4298 4865 -3078 2907 165 -182 2697 -1925 5064 -2624 4347 -2266
662 -2266 4136 226 -667 4242 -2715 5212 -3154 4107 -867 1670 385 -749 3327 -3300 4320
677 4320 -4314 3730 -1587 182 761 -2878 3663 -4184 2850 -3346 2387 -2148 -679 565 -3113
692 -3113 3619 -5619 3056 -3409 852 -1148 -2187 1130 -3250 2513 -5109 3079 -3604 712 -1033
$$ packed form
586C406k153j326L126m644P434r642Q597o824N133k688j613N901q714Q825p752
601b934N521m693L957q65l782O000p041Q513j0033P873l709k73J580l809P284
616C589q384P255o736O195m676J211K766n693P707q664P997o325M142j201k292
631c109L201l558P663r783Q282n747M284j118m090P704p172O654p095P420n069
646a533K022P42k620N702q611R163p943N985k742l47K879m622O989p688O971o613
662b266O402l910q93M909o957P927q366P261m974K537j285j134M076o627P620
677D320q634Q044n317J769N79l639O541p847P034o196N733m535J469J244l678
692c113O732r238Q675o465M261k000j039L317m380N763p622Q188o683M316j745
$$ plain form
707 -1033 -2356 2923 -4340 3153 -4090 2500 -1641 -68 -279 -1533 2892 -4115 3827 -3725 3128
722 3128 -1108 -266 2450 -2339 3447 -3274 4022 -2084 2969 -794 -271 3200 -2227 4627 -3385 4489
738 4489 -1200 1612 794 -292 3163 -2287 4011 -2848 4400 -1854 891 1496 -1610 3797 -3826 3663
754 3663 -2335 2975 -1707 54 1065 -2322 3000 -4369 3854 -3353 1297 -1534 -1454 1639 -3770 2156
770 2156 -4184 2665 -3615 366 -1272 -1724 2036 -4923 2928 -4102 2299 -2746 -282 63 -1696 1750
786 1750 -4110 3313 -3593 2477 -2357 83 1684 -2440 3114 -3494 3787 -2547 1984 -714 697
801 697 2237 -2417 3646 -3106 4329 -2021 1876 781 -2 3020 -2363 4140 -2196 4062 -1972 1741
817 1741 1558 -888 3132 -3012 4405 -2495 2736 -1351 1044 1636 -1721 2678 -3220 4101 -3354 2040
$$ packed form
707a033j323N279p263P493p243O590m141J573k11j254M425p007P942p552O853
722C128m236Q42K716m789N786o721P296o106N053l763N23L471n427O854q012P874
738D489n689K812q18j086L455n450O298o859P248o254K745O05l106N407p623P489
754C663n998N310m682J761J011l387N322p369Q223p207M650k831Q0L093n409N926
770B156o340O849o280L981j638m52L760o959P851p030O401n045K464L45j759L446
786A750n860P423o906O070m834K440J601m124N554o608P281o334M531k698J411
801F97J540m654O063o752P435o350L897j095p83L022n383O503o336O258o034L713
817A741j83k446M020o144P417o900N231m087K395N92l357M399n898P321p455N394
$$ plain form
833 2040 -1021 -97 1482 -3263 2725 -3642 2923 -3284 681 -1174 -1371 1139 -3851 2788 -4122 2251
849 2251 -3466 258 -142 -2157 1527 -3838 2983 -3689 1462 -2619 41 298 -2899 2295 -3281 2982
865 2982 -3683 2031 -1240 -224 1445 -2291 3202 -2736 3612 -2248 2180 102 -328 2174 -2340
880 -2340 4046 -2476 3627 -1909 2055 1209 -701 2813 -2187 4332 -2650 3041 -1144 1470 1473 -1531
896 -1531 2951 -2227 4015 -2993 2463 -557 337 1261 -2003 2958 -3059 3174 -2944 1691 -583 -866
912 -866 1152 -2836 3026 -3529 2433 -3024 679 -621 -1758 1228 -3367 2657 -4272 1991 -2544
927 -2544 14 -232 -2284 1886 -3347 2453 -3878 2073 -1739 -551 245 -2301 2923 -3618 2799 -2897
943 -2897 1781 -590 -448 1511 -1848 3203 -3092 3464 -2111 1819 341 -387 2079 -1669 3651 -2590
$$ packed form
833B040l061R24J579m745N988o367O565o207L965j855j97K510m990O639o910O373
849B251n717L724m00k015L684n365O821o672N151m081K660K57l197N194n576O263
865B982o665N714l271J016J669l736N493n938O348n860M428k078m30K502m514
880b340O386o522O103n536L964q46j910L514n000O519o982N691m185K614Ll004
896a531M482n178O242p008N456l020Q94R24l264M961o017O233o118M635k274k83
912h66K018l988N862o555N962n457L703j300j137K986m595O024o929O263m535
927b544K558k46k052M170n233N800o331N951l812J188P96k546N224o541O417n696
943b897M678k371J42J959l359N051o295O556n575L930j478p28K466l748N320o241
$$ plain form
959 -2590 3487 -542 1423 697 -1207 2764 -1411 3132 -1755 2468 -502 -2 1329 -1486 3088 -2002
975 -2002 3407 -2955 2469 -558 411 2340 -2697 3100 -3003 2397 -2436 1261 -550 -1445 1106 -2267
991 -2267 2658 -4238 2393 -2170 105 -791 -1897 2028 -3718 2292 -3217 1803 -2270 -7 -315 -1903
1007 -1903 2020 -3899 2479 -3113 1421 -873 -533 669 -1897 2610 -3465 2376 -2012 1645 -1028
1022 -1028 -610 1901 -2291 3096 -2579 3051 -1217 1386 431 -317 2477 -2157 3662 -2594 3091 -506
1038 -506 840 1223 -1044 3034 -2094 2955 -1697 2669 -856 665 1522 -1571 3087 -2927 3158 -1763
1054 -1763 1271 -604 -541 1494 -2068 2534 -2802 2530 -2561 976 -573 -1518 1870 -3271 2012 -3038
1070 -3038 1955 -2365 -372 -277 -1835 1558 -3695 2157 -3196 1418 -1946 -791 655 -2481 1785
$$ packed form
959b590O077m029J965p26j904L971m175M543m887M223k970N00J331k815M574n090
975b002N409o362N424l027R69J929n037N797o103N400m833L697j811q95K551l373
991b267M925o896O631m563K275q96j106L925n746O010n509N020m073K263l08j588
1007a903L923n919O378n592M534k294L40J202k566M507o075N841m388L657k673
1022a028M18K511m192N387n675N630m268K603r55p48K794m634N819o256N685l597
1038e06J346L83k267M078n128N049m652M366l525J521Q57l093M658o014O085m921
1054a763L034j875O3K035l562M602n336N332n091L537j549r45L388n141N283n050
1070c038M993m320J993R5j558L393n253N852n353M614l364J155J446l136M266
$$ plain form
1085 1785 -2850 1810 -2657 1785 -1554 -671 1473 -2456 2618 -3140 2647 -1582 858 -258 -129
1100 -129 1896 -2329 2877 -2407 3245 -1566 1029 1122 -913 2880 -2168 3135 -1601 2002 -525 1060
1116 1060 1151 -701 2846 -2541 3425 -1948 1614 -255 282 1907 -1743 2118 -1908 2922 -2054 987
1132 987 -407 -702 1383 -2850 2367 -2604 1600 -1757 134 -170 -1215 1105 -2761 2039 -3107 1626
1148 1626 -2330 -362 282 -2181 1483 -2782 1850 -2779 848 -1574 86 274 -2189 2001 -2932
1163 -2932 2474 -2526 783 -127 -639 1465 -2195 1919 -2088 2380 -1941 1277 275 -550 2114 -2079
1179 -2079 2924 -1832 2193 -839 852 865 -723 2349 -1907 3152 -2025 2069 -488 480 1661 -1382
1195 -1382 2706 -1580 2613 -1789 1860 -493 10 1230 -1832 2966 -2569 2160 -1549 781 208
$$ packed form
1085A785m635M660m467M442l339Q83K144l929N074n758N787m229K440j116J29
1100a29K025m225N206n284N652m811K595R3k035L793n048N303m736L603k527J585
1116A060R1j852L547n387N966n373L562j869N37J625l650L861m026M830m976L041
1132I87j394k95K085m233N217m971M204l357J891l04j045K320l866M800n146M733
1148A626l956J968O44k463L664m265M632m629L627k422J660J88k463M190m933
1163b932N406n000L309r10n12K104l660M114m007M468m321L218j002q25K664m193
1179b079N003m756M025l032J691J3j588L072m256N059n177M094k557R68J181l043
1195a382M088m286M193m402L649k353N03J220l062M798n535M729l709K330n73
$$ plain form
1210 208 -1447 1117 -1962 1760 -2471 1680 -2031 431 -357 -2092 1594 -2834 1832 -2680 663
1225 663 -1395 -53 -7 -1877 1659 -2925 2017 -2808 911 -415 -892 761 -2043 1730 -2513 1713
1241 1713 -2050 936 -370 -803 1389 -2088 2821 -2358 1811 -768 807 684 -557 1894 -1409
1256 -1409 2562 -2289 2446 -789 482 1250 -1006 2704 -1624 2497 -1182 1864 -284 296 976 -1023
1272 -1023 2846 -2225 2392 -1695 1240 3 -658 1635 -1556 2058 -2232 1764 -1659 883 -360
1287 -360 -971 1537 -2394 1977 -2667 919 -1289 -210 -273 -1616 1153 -2623 1538 -2774 1372 -1400
1303 -1400 -628 337 -1987 1542 -2503 1334 -1989 939 -836 -613 949 -1856 1902 -2481 1927 -1444
1319 -1444 708 177 -816 1889 -1548 1835 -1435 2232 -924 1115 431 -701 2306 -1734 2566 -1064
$$ packed form
1210B08j655K564l079L722m231M151l711K462p88j735L686m428M666m512L343
1225F63k058J342M6j870L536m584M942m825L719j326m77J653k804L773m243M226
1241A713l763K986j306m33K192l477M909n179M169k579J575j23j241K451l303
1256a409L971m851M735l235J271P68k256L710m328M121l679L046k148N80O80j999
1272a023L869n071M617m087K935j237o61K293l191L614m290L996l423K542j243
1287c60o11K508l931M371m644L586k208J079o3j343K769l776M161m312M146k772
1303a400P72R65k324L529m045L837l323K928j775K23J562k805L758m383M408l371
1319a444K152n31r93K705l437L383l270L667l156K039o84j132L007m040M300l630
$$ plain form
1335 -1064 1988 -102 779 830 -687 2224 -1750 2575 -1219 1815 -98 -93 1768 -1017 1944 -1804
1351 -1804 1806 -1234 873 -385 -374 1494 -1774 1862 -2157 1755 -1336 117 -75 -977 1066 -2339
1367 -2339 1477 -2379 1174 -1410 -260 200 -1577 1250 -2389 1466 -2061 911 -1115 -418 568 -1767
1383 -1767 1413 -2298 1617 -1688 333 -480 -650 1173 -1625 1586 -1935 1816 -1177 415 372 -358
1399 -358 1510 -1852 2059 -1354 1598 -655 520 1044 -630 1895 -1605 2567 -1118 1555 -104
1414 -104 162 1246 -690 2076 -1482 2355 -1050 1112 243 78 1370 -1363 1808 -1646 1840 -1169
1430 -1169 599 360 -686 876 -2014 1866 -2080 1137 -1180 -59 -2 -1377 1201 -2021 1689 -1882
1446 -1882 680 -1261 -97 261 -1691 1128 -2431 1421 -1876 629 -492 -529 447 -1729 1465 -2261
$$ packed form
1335a064L052k090Q81N1j517K911l974M325l794L034j913NJ861k785K961l748
1351a804L610l040K107j258J1J868l268L636m019L912l091J453j92r02K043l405
1367b339L816l856L553k584J150M60j777K827l639L855l527K972k026O97R86k335
1383a767L180l711L915l305K021q13j70J823k798L211l521L751k993J592m3p30
1399c58J868l362L911l413K952k253J175N24j674K525l500M172l685K673j659
1414a04K66J084j936K766l558L837l405K162q69j65J292k733L171l454L486l009
1430a169J768k39j046J562k890L880l946L217k317J121N7j375K578l222L710l571
1446a882K562j941J164L58j952K819l559L852l297K505j121l7R76k176L194l726
$$ plain form
1462 -2261 1080 -1537 639 -188 -575 883 -1829 1689 -1573 1480 -744 460 498 -883 1363 -1360
1478 -1360 2244 -1541 1338 -231 529 522 -938 2083 -1293 2058 -1164 1176 228 15 1249 -623
1494 -623 1839 -1457 1612 -887 599 -90 -417 1360 -1441 1992 -1804 1495 -791 158 241 -920
1510 -920 971 -1375 1518 -1715 993 -724 -81 4 -1322 1116 -2135 1335 -2119 543 -469 -420
1526 -420 221 -1734 1455 -1687 1046 -1659 661 -339 -965 682 -1484 1360 -1959 1040 -1267 590
1542 590 -290 -616 1567 -1470 1542 -1864 1635 -829 526 1132 -718 1490 -1061 1783 -1342 1582
1558 1582 -27 448 1011 -961 2049 -1706 1422 -902 1202 34 804 1206 -821 1949 -1185 1917
1574 1917 -1090 618 196 -709 1336 -1233 1764 -1461 1065 -1107 438 -205 -1034 1098 -2176 1381
$$ packed form
1462b261L341k617K176q27l87J458k712L518l262L053k224J204L8j381K246k723
1478a360L604l785K879j569P60pj460L021l376L351l222K340r48k13J234j872
1494f23K462l296L069k499J486o89l27J777k801L433l796L299k286R49Q3j161
1510i20J891k346K893l233K708j717O43Q5j326K438l251L470l454K662j012M9
1526d20O41j955L189l142K733k705K320j000o26J647k166K844l319K999k307J857
1542E90q80l26K183l037L012l406L499k464J355O06j850K208k551K844l125K924
1558A582j609M75N63j972L010l755L128k324K104j168P70M02k027K770l134L102
1574A917l007J708m22r05K045k569K997l225K526k172J545o43q29K132l274L557
$$ plain form
1590 1381 -1916 517 -629 -877 -45 -1173 923 -2162 1147 -1898 415 -730 -819 274 -1645 1302
1606 1302 -2085 1287 -1342 165 -307 -684 887 -1287 1321 -2004 1337 -1250 215 111 -680 1355
1622 1355 -1374 1346 -925 1309 -364 505 616 -639 1902 -1220 1894 -949 1168 138 -188 1167
1638 1167 -673 1658 -1317 1466 -862 1029 124 59 1504 -1262 1532 -1311 1437 -644 370 180
1654 180 -412 819 -1437 1389 -1655 898 -854 -179 490 -1222 952 -1710 1082 -1206 658 -954
1670 -954 -209 293 -1541 1042 -1945 1131 -1230 43 -462 -795 461 -1357 854 -1407 1162 -1411
1686 -1411 454 -118 -815 1015 -1431 1259 -1230 689 -779 407 24 -641 1236 -1427 1761 -1098
1702 -1098 1295 -202 -152 1128 -887 1557 -1021 1497 -642 1101 -119 311 1268 -968 1909 -1341
$$ packed form
1590A381l297K433j146k48Q32j128K096l085L309l045K313j145q9J093j919K947
1606A302l387L372k629J507m72l77J571k174K608l325L341k587J465j04p91K035
1622A355k729K720k271K234j673Q69J11j255K541l122L114k843K117j030l26J355
1638A167j840K331k975K783k328J891r05o5J445k766K794k843K748k081J014j90
1654A80n92J231k256K826l044K553j752O75O69j712K174k662K792k288J864j612
1670i54P45N02j834K583k987L076k361J273n05l33J256j818K211k261K569k573
1686a411J865n72o97J830k446K690k489J919j468J186l83o65J877k663L188k859
1702a098K393j497N0J280k015K444k578K518k139J743j220M30R57k236K877l250
$$ plain form
1718 -1341 1552 -777 458 186 -186 959 -1000 1436 -1229 1412 -1092 224 555 -611 1336 -1414
1734 -1414 1294 -912 663 -782 257 -151 -1368 992 -1856 1278 -1614 370 -482 -502 207 -1659
1750 -1659 985 -1636 883 -1473 417 -319 -850 704 -1774 1316 -1489 733 -715 224 141 -979
1766 -979 1168 -1168 1337 -1200 1262 -559 209 694 -1021 1442 -1085 1403 -592 1148 -233 379
1782 379 711 -988 1856 -1291 1788 -789 804 181 -175 1074 -705 1540 -1107 1519 -770 921
1798 921 413 -628 1172 -1261 1556 -971 973 -206 245 130 -1138 1127 -1398 1334 -1684 941
1814 941 -645 -249 608 -1346 1195 -1499 764 -1345 474 -556 -345 233 -1784 1255 -2024 848
1830 848 -1055 0 0 -946 719 -1131 1079 -1723 1015 -1090 92 239 -888 1182 -1473 1083
$$ packed form
1718a341K893k329J235k72l72J145j959K436k665K641k504J316L31j166J947k750
1734a414K708k206J575j445J039m08j217K360k848L134k892J984q52k0P09j866
1750a659K644k621K519k356J890p36n31J554k478L090k805K222j448R39q3j120
1766i79K147k336K505k537K462j821P68M85j715K463k527K488j995J740j381O12
1782C79L32j699K844l147L079k577J593o23l56J249j779K245k647K626k289J691
1798I21n08j041J800k433K817k527J944j179M51j15j268K265k525K732l018K625
1814I41j586L96Q57j954K541k694K263k109J819j030K11N78k017L039l279K872
1830H48j903J055%r46J665j850K210k802K738k105J182J47j127K070k655K556
$$ plain form
1846 1083 -1240 1102 -322 42 628 -747 1745 -1226 1661 -1083 1144 36 3 1158 -872 1082
1862 1082 -824 1621 -577 837 79 -314 942 -925 1634 -1272 1463 -409 515 260 -333 1214
1878 1214 -749 1258 -1344 1027 -706 131 570 -850 873 -1394 818 -989 441 -706 -393 306
1894 306 -1316 1157 -1653 1080 -1239 -53 -142 -741 614 -1399 822 -1561 783 -1265 374 -499
1910 -499 -603 960 -1547 1418 -1209 1188 -164 -237 176 -627 1251 -1179 930 -1097 1415 -260
1926 -260 348 521 -328 1773 -994 1345 -271 1023 81 645 1271 -272 1685 -839 1627 -316 743
1943 743 75 -467 1358 -1061 1363 -1140 1034 -595 227 346 -637 1045 -933 1091 -982 864
1959 864 -604 -229 333 -929 1120 -1434 1116 -1395 503 -531 -297 434 -1356 803 -1558 817
$$ packed form
1846A083k323K342j424L64N86j375K492k971K887k744K227j108l3J155k030J954
1862A082j906K445k198J414p58l93J256j867K559k906K735j872R24k55n93J547
1878A214j963K007k602K371j733Q37M39j420J723k267K212j807J430j147L13O99
1894C06j622K473k810K733k319J186q9n99J355k013K221k383K344k048J639q73
1910d99j04J563k507K965k627K397j352p3M13q03J878k430K109k027K512j675
1926b60O08J73q49K101k767K339j616J294r42N64O26j543J957k524K466j943J059
1943G43o68n42J825k419K424k503K174j629Q22J19r83J682j978K024k073J846
1959H64j468L75N62j262K049k554K550k511J898j034K34P31j790K159k361K375
$$ plain form
1975 817 -1113 143 -289 -834 683 -1316 957 -1365 840 -970 19 -145 -761 834 -1477 1279
1991 1279 -1476 777 -472 1 710 -758 1329 -1143 1151 -959 795 -240 168 860 -726 1466
2007 1466 -1093 1232 -720 746 143 5 896 -822 1369 -1241 1454 -526 532 213 -91 1046
2023 1046 -921 1382 -880 821 -551 368 379 -672 953 -1248 1143 -1311 424 -511 -295 264
2039 264 -991 871 -1448 1045 -1132 463 -308 -738 399 -1260 871 -1395 818 -1108 167 -285
2055 -285 -576 787 -1401 994 -1380 833 -929 216 -25 -877 847 -1035 1283 -1102 812 -484
2071 -484 372 662 -858 1146 -1437 1167 -928 519 104 -156 724 -569 1584 -868 1617 -440
2087 -440 762 330 -384 1250 -815 1484 -605 1165 -501 363 524 -322 1241 -1244 1270 -964
$$ packed form
1975H17j930J256m32n45J517j999K273k322K205j810R89j64o16J595k311K756
1991A279k755K253j249M73P09j468K087k472K294k110J754j035M08O92j586K192
2007A466k559K325j952J466o03j38Q91j718K191k610K695j980J058l19l04J137
2023A046j967K303k262J701j372R19J1j051J625k201K391k454J735r35K16N59
2039B64j255J862k319K493k177J595p71m30J137j659K131k266K213j926J275m52
2055b85k91J363k188K395k374K213j762J145k41q52J724j882K318k385J914j296
2071d84Q56K90j520K004k583K604k095J447m15k60Q80j293K153k452K485k057
2087d40J202m32p14J634k065K299k089J770j666Q64J61q46J563k485K514k234
$$ plain form
2103 -964 754 -224 0 255 -939 1163 -1092 1145 -1216 624 -344 -261 377 -1097 951 -1309 922
2120 922 -995 373 -348 -436 295 -1297 929 -1555 701 -994 247 -62 -744 642 -1220 884 -1298
2137 -1298 566 -744 197 208 -777 1037 -1385 1151 -864 745 -86 -57 439 -798 956 -1151 1440
2154 1440 -781 807 55 -71 815 -885 1427 -965 1205 -495 697 383 -149 946 -775 1385
2170 1385 -787 1269 -296 378 490 -481 975 -824 1002 -908 672 -620 -127 289 -642 1075
2186 1075 -1317 856 -974 307 -246 -473 234 -888 848 -1504 1103 -1043 153 -174 -656 798
2202 798 -1208 803 -1076 724 -904 31 -7 -320 660 -1110 1074 -1026 613 -549 -90 432 -724
2219 -724 884 -972 1236 -804 889 -200 -205 717 -697 1438 -1056 1392 -509 655 -54 -60 633
$$ packed form
2103i64J718r78K24K55j194K102k255K237k361J840r68Q3O38j474K048k260K231
2120I22j917J368p21q8P31j592K226k484K256j695J241l09o82J386j862K104k182
2137a298J864j310R41J1r85J814k422K536k015J609q31K9M96j237J754k107K591
2154A440k221J588p52j26Q86j700K312k392K170j700J192l14n32J095j721K160
2170A385k172K056j565O74J12r71J456j799J826j910J580j292M93M16r31J717
2186A075k392K173j830J281n53k27P07j122J736k352K607k146J196l27m82J454
2202G98k006K011j879J800j628R35l8l13R80j770K184k100J639j162M59N22j156
2219g24J608j856K208k040J693j089nR22j414K135k494K448j901J164p09oO93
$$ plain form
2236 633 -705 1327 -885 1571 -504 211 260 -449 1181 -985 1497 -693 814 -556 400 495 -449
2253 -449 851 -1238 1307 -801 528 -212 -284 286 -802 510 -875 829 -1037 404 -358 -333 601
2270 601 -1192 889 -1197 571 -976 -3 -177 -495 364 -1226 927 -1399 511 -827 -39 146 -758
2287 -758 835 -996 847 -1021 785 -493 -74 208 -864 929 -1182 1127 -724 485 -135 2
2303 2 526 -580 1174 -708 1145 -414 667 -71 -251 1033 -802 1368 -901 957 -407 441 395
2320 395 -281 894 -911 1223 -620 833 -313 -167 466 -754 908 -845 803 -905 543 -564
2336 -564 -328 381 -1159 953 -1295 887 -984 267 -108 -641 424 -1014 600 -1124 692 -831
2352 -831 273 -238 -993 558 -1231 790 -1147 505 -465 -15 118 -662 647 -902 1071 -1086 586
$$ packed form
2236F33j338K032k212K456k075P15M9p09J630k166K482k190J507j370R56R5r44
2253d49J300k089K545k108J329p40p2N70j088J312j385J704j866J441p62K5R34
2270F01j793K081k086J768j547R73j74l18Q59j590K153k326J910j338P88J85r04
2287g58J593j831J843j868J806j278M19K82j072J793k111K309j851J209o20J37
2303BN24j106J754j882J853j559J081p38j80J284j835K170k269J858j364Q48m6
2320C95o76J175j805K134j843J453j146J46O33j220J662j753J648j708J448j107
2336e64K36P09j540K112k248K182j871J251l75n33J065j438J614j724J816j523
2352h31J104n11p55J551j789K021j937J652r70M50J33p80J309j549J973k157J672
$$ plain form
2369 586 -227 112 495 -802 687 -746 1347 -370 443 173 -48 908 -696 1006 -240 1214 -1
2386 -1 200 57 84 1011 -870 797 -1047 902 -453 120 512 -80 1146 -692 1062 -809 587 -706
2404 -706 247 567 -1128 840 -1218 998 -935 1000 -425 -618 435 -370 895 -1190 901 -932
2420 -932 223 -266 -629 779 -1258 1090 -1496 455 -1095 187 -164 -653 686 -685 535 -1408
2436 -1408 38 -623 -294 280 -649 896 -914 609 -322 310 -785 -1080 915 -145 602 -548 1402
2453 1402 -7 -150 486 -772 1155 -263 888 -429 1049 -338 485 -272 -1327 835 -1067 1004
2469 1004 -614 659 -385 -33 -610 -524 1161 -1090 918 -545 608 -665 -234 1208 -795 1296
2485 1296 -977 774 -1130 100 -71 -432 -184 -1171 1058 -1053 382 -1636 147 458 -641 85
$$ packed form
2369E86q13L39L83j297J489j433K093j717Q13k70k21R56j604J702j246J454j215
2386aK01j43K7R27j881J667j844J949j355N73L92n92J226j838J754j871J396j293
2404g06R53L20j695J968k058K216j933J935j425j93J053q05J265k085K091j833
2420i32J155m89l63J408k037K348k586J951j550J282l51m89J339j371J220j943
2436a408J446o61L29N74r29J545j810J523r31O32j095k95J995j060P47j150J950
2453A402j409j43O36j258J927j418J151j317J478j387Q23p57j055K162j902K071
2469A004j618J273j044L52n77Q6J685k251K008j463J153j273M31J442k003K091
2485A296k273J751j904J230j71l61K48r87K229k111J435k018J783L11j099P26
$$ plain form
2501 85 -1030 -90 -670 528 -581 57 -388 -501 969 -1230 441 -1177 625 16 -342 173 -376 609
2519 609 -1352 725 -650 798 -332 -210 1224 -708 1225 -600 1120 -174 370 133 -564 532
2535 532 -797 758 -723 1166 -198 771 299 -766 954 -973 905 59 777 -271 323 705 -683
2552 -683 552 -700 457 -547 512 -133 -104 305 -868 910 -1021 687 -605 76 -28 -450 434
2569 434 -902 506 -1123 456 -650 -68 -150 -643 397 -959 836 -838 321 -425 92 141 -729
2586 -729 839 -728 734 -715 135 -258 -60 600 -331 789 -766 673 -579 509 111 -80 476
2603 476 -538 597 -480 1066 -47 254 199 -93 663 -460 921 -739 708 -203 194 431 -518
2620 -518 962 -497 746 -691 627 -277 -109 452 -349 850 -838 913 -528 292 -41 -506 218
$$ packed form
2501H5j115R40n80J198j109O38m45j13J470k199J671j618J802o09l58N15n49R85
2519F09j961K077j375J448j130J22J434j932J933j825J720j294N44k37o97J096
2535E32j329J555j481J889j364R69m72j065J720j927J878q46P18j048N94L82j388
2552f83J235j252J157j004J059o45K9M09j173J778j931J708j292O81j04m22Q84
2569D34j336J408j629J579j106N82q2m93J040j356J795j674J159p46N17M9q70
2586g29J568j567J462j449Q50l93J98O60r31J120j555J439j252J088l98j91N56
2603D76j014J135j077J546j113L01n5k92P56j123J381j660J447r11L97K37r49
2620e18J480j459J243j437J318r04J68N61q01J199j688J751j441Q20l33m65P24
$$ plain form
2637 218 -744 491 -1084 512 -789 73 -12 -523 410 -909 420 -928 425 -560 -209 -248 -671 564
2655 564 -1101 475 -952 294 -295 -194 -57 -666 758 -931 964 -681 565 -107 -92 732 -710
2672 -710 928 -677 652 -458 290 129 -459 772 -413 1083 -497 651 -162 381 364 -276 631
2689 631 -668 994 -459 889 -148 330 322 -466 1065 -559 833 -645 531 -30 -133 157 -407
2706 -407 798 -818 663 -779 374 59 -527 432 -712 684 -790 484 -715 147 -201 -409 459
2723 459 -933 908 -805 347 -281 -126 162 -549 619 -841 535 -840 252 -447 -77 52 -749
2740 -749 640 -624 690 -390 -72 -184 -85 470 -492 743 -654 803 -189 -33 1112 -469 1009
2757 1009 -655 864 -959 1127 303 -77 131 -461 1090 -985 832 -626 677 154 -89 82 -97
$$ packed form
2637B18r62J235j575J596j301Q62q5n11R33j319J329j348J353r85L51l9m23J235
2655E64j665J576j427J246n89J01J37o09J424j689J895j645J246o72J5Q24j442
2672g10J638j605J329j110P48j61n88J231j185J496j580J148q13N43j7o40R07
2689F31j299J662j453J348j037M78qp88J531j624J392j478J176n61j03K90n64
2706d07J205j616J481j442J153l15n86R59j144J396j474J274j199Q62l48k08Q68
2723D59j392J841j713J152o28J55K88p11J168j460J376j375J092o99L70J29q01
2740g49J389j264J314j080L18j12R9N55r62J235j397J457r92J56J145j581J478
2757A009j664J519j823K086q24l80K08n92J551k075J817j458J303n23k43J71j79
$$ plain form
2774 -97 762 -669 577 -437 486 -277 -115 339 -532 967 -904 460 -510 57 -182 -352 492 -751
2792 -751 641 -962 406 -537 -255 55 -754 337 -768 269 -932 167 -461 -211 -2 -555 231
2809 231 -840 500 -716 228 -256 -116 327 -678 761 -880 769 -344 506 151 -292 655 -628
2826 -628 822 -461 580 -101 415 255 -239 755 -528 981 -414 930 -165 -128 381 -245 560 -466
2844 -466 887 -499 822 56 107 305 -469 869 -723 589 -312 362 -188 -275 356 -513 785 -717
2862 -717 532 -446 -153 84 -464 491 -710 423 -712 275 -542 160 74 -596 351 -852 735 -815
2880 -815 451 -314 14 -15 -717 677 -714 560 -824 320 -21 -551 797 -605 491 -364 302
2897 302 -884 193 -170 328 795 -286 1167 -163 297 162 56 480 -480 1209 -425 783 -562
$$ packed form
2774i7Q59j431J246j014R23p63J62M54q71J499j871J364r70N67k39j70Q44j243
2792g51J392j603J368r43K82L10q09J091j105J037j201J099o28K50K09n53P86
2809B31j071J340j216R44m84J40M43j005J439j641J649j113Q50l55m43R47j283
2826f28J450j283J041o81N16j60m94R94j283J509j395J344j095L7N09o26Q05j026
2844d66J353j386J321p66N1J98p74J338j592J312r01O74n50q7O31q69J298j502
2862g17J249r78K93K37n48R55j201J133j135R87q17P02q6o70R47j203J587j550
2880h15J266p65L28k9p02J394j391J274j384J144l41n30J348j402J096q55O66
2897C02j186J077l63M98M67j081J453j330M60j35j06M24r60J689j634J208j345
$$ plain form
2914 -562 288 41 -257 711 -604 850 -505 1259 106 566 -386 -304 602 36 573 74 921 -1029
2932 -1029 -98 126 -387 690 -772 1549 -1058 426 120 12 136 -390 315 -860 525 -1181 560
2949 560 -456 -279 40 -648 346 -1010 519 -637 460 -446 -135 276 -605 636 -609 539 -470
2966 -470 288 -223 -121 222 -517 807 -641 774 -391 259 203 -232 804 -427 1024 -312 547 -3
2984 -3 -32 444 -111 923 -348 832 -644 647 -10 -97 393 -676 866 -554 978 -388 250 -79
3002 -79 -47 477 -696 938 -710 581 -533 83 108 -432 233 -843 702 -973 406 -381 -27 -30 -525
3021 -525 524 -1030 490 -807 184 -352 -412 -82 -803 448 -1020 761 -570 123 -165 -292 556 -644
3039 -644 485 -760 451 -621 261 92 -253 555 -890 658 -822 651 -75 264 107 -97 452
$$ packed form
2914e62Q50k47k98R68j315J454j355J764j153M60r52Q2R06n66N37m99Q47j950
2932a029R31K24n13J077j462K321k607J484l06j08J24n26P05j175J385j706J741
2949E60j016J77L19o88R94j356J529j156J097r06L11M11q81J241j245J148j009
2966d70P58n11J02L43p39J324j448J415j165O50n6m35J036j231J451j336Q59n50
2984ck9M76n55J034j271J180j476J291o57q7M90j069J542j420J532j366O38l29
3002g9L2N24j173J634j648J291j114O16K5n40O65j076J545j675J379p87L54lm95
3021e25J049j554J520j297R91n36o0L30p21J251j468J781j331O93k88j27Q48j200
3039f44J129j245J211j072Q82j69l45Q08j445J548j480J473p26L39j57k04N49
$$ plain form
3056 452 -694 906 -468 693 -90 41 391 -217 726 -527 744 -431 345 19 -56 701 -383 625
3074 625 -587 952 -433 336 79 -154 506 -1005 660 -490 723 -526 -37 193 -675 374 -918
3091 -918 277 -648 228 -412 -29 135 -603 228 -1023 528 -769 197 -119 -175 461 -722 407 -773
3109 -773 385 -745 509 -256 -215 273 -578 684 -727 587 -270 320 254 -227 611 -520 777 -352
3127 -352 452 -264 -21 268 -210 836 -417 926 -156 640 -73 59 463 -301 854 -547 931 -504
3145 -504 640 95 -109 505 -450 566 -359 577 -584 248 -45 -611 594 -659 344 -658 493
3162 493 -353 -83 84 -681 234 -914 603 -590 324 14 -426 80 -501 316 -579 479 -634 228
3180 228 -58 -148 177 -704 841 -934 667 -550 31 -191 -217 413 -786 777 -744 653 -409 82
$$ packed form
3056D52j146J600j374J161p83J31L50o08R43j253J271j175P76l26p5P57j084J008
3074F25j212J539j385P69k57k33O60j511J665j150J213j249M89K30q68J049j292
3091i18J195r25Q76o40L83J64p38Q31j251J551j297R66l16n6O36j183J129j180
3109g73J158j130J254p65M1M88q51J262j411J314q57N90o6m81Q38j131J297j129
3127c52Q04p16K43K89m78J046j253J343j082P96p13J32M04p64J155j401J478j435
3145e04J144n45k04O14r55J016r25R36j161Q32k93n66J205j253J003j002J151
3162D93q46K70J67p65R15j148J517j193R14l10m40N06n81Q17q95J058j113Q62
3180B28k86r0L25q81J545j775J601j217N81k22k6O30j199J563j521J397j062M91
$$ plain form
3198 82 98 -343 585 -554 588 -453 693 -94 82 474 -399 749 -606 996 -518 389 -34 -34 611
3217 611 -581 513 -519 626 -196 251 -165 -160 310 -491 542 -567 671 -279 143 141 -191 301 -881
3236 -881 359 -475 356 -344 -135 -80 -527 424 -658 371 -814 234 -190 -225 360 -778 374 -682
3254 -682 274 -412 68 -11 -308 314 -755 596 -821 477 -457 -8 -20 -439 458 -519 620 -345 456
3273 456 -219 196 141 -155 645 -538 813 -646 635 -165 37 315 -271 773 -676 727 -245 679
3291 679 206 -187 639 -381 784 -473 671 -239 199 -75 -146 247 -604 692 -631 471 -219 48
3309 48 83 -366 413 -588 438 -679 474 -111 -265 286 -588 652 -784 435 -538 24 -120 -308
3327 -308 103 -364 431 -935 539 -475 244 -86 -304 410 -763 428 -394 497 -180 203 169 -128 490
$$ packed form
3198H2J6m41R28j139J142j041J146p87J76L92q73J148j355J602j514R07m23%O45
3217F11j192J094j032J145q22M47m16NM70q01J033j109J238r50M22kl32M92j182
3236h81J240q34Q31p00K09N5m47R51j082J029j185J048m24l5N85j138J152j056
3254f82R56o86M80p9k97O22j069J351j417J298r34M49j2m19Q97r77J139r65Q01
3273D56o75M15n5k96Q00j183J351j459J281q00K02K78n86J044j449J403r72R24
3291F79m73l93Q26j020J165j257J144r10M38k74p1L93q51J296j323J102o90K67
3309D8L5m49P79j001J026j117J153n85j54N51q74J240j436J219r73N62j44j88
3327c08M11m67P95j366J474j014P19l30k18P14j173J191q22Q91o77L83l4k97O18
$$ plain form
3346 490 -668 633 -737 387 -105 -173 524 -135 672 -622 671 -205 505 -99 173 354 -186 618
3364 618 -677 471 -323 403 193 122 465 -376 725 -495 596 -416 153 0 -90 443 -752 391
3382 391 -594 -6 -117 29 -142 -283 654 -885 343 -578 182 -319 -280 122 -512 532 -616 525 -476
3401 -476 68 -311 -170 200 -705 217 -355 337 -409 69 -125 -137 141 -504 563 -632 645 -650 -33
3420 -33 187 -177 786 -312 306 -612 487 -267 129 310 -242 688 -275 645 -358 185 121 46 331 -262
3440 -262 599 -188 649 -157 337 273 -83 466 -426 793 -317 518 -250 63 117 -373 296 -627 588 -563
3460 -563 284 -355 77 -5 -526 232 -543 484 -500 246 -336 -78 187 -609 522 -777 711 -494 -31
3479 -31 -306 -453 250 -687 396 -636 341 -376 212 65 -241 573 -653 390 -603 590 -192 10 312
$$ packed form
3346D90j158J301j370J124m92o8O97o59Q07j294J293q76P10o04K72J81n40Q04
3364F18j295J148p94P26k10p1L43q41J101j220J091j012N69j53r0N33j195J143
3382C91r85N88j11J46j71j41R37j539J228r21P60n01L9M02o34J044j148J141j001
3401d76N44l79J41L70r05R22n72O92p46M78j94j2K78o45J067j195J277j295O17
3420c3K20l64R63j098O18r18J099p54L96J81n52R30r63R20j003N43o4p5K85n93
3440b62Q61p87Q37q06M94o4l56N49q92J219j110Q35p68L13N4m90O69r23J215j151
3460e63Q47o39M32q2n21P58p75J027r84P46n82K58K65p96J131j299J488j205M63
3479c1k75j47P03r37J083j032R77p17N88j47l06Q14j226J043r93J193p82K02L02
$$ plain form
3498 312 -255 562 -594 716 -630 717 -18 -179 355 24 610 -514 277 -435 693 155 -352 536
3516 536 -112 546 138 -104 -570 -29 304 150 258 -198 1000 -538 248 -155 -89 220 -377 499 -520
3535 -520 540 -618 6 -246 -8 311 -245 365 -815 442 -381 139 -308 -312 46 -549 571 -511 218
3554 218 -631 36 -102 -538 450 -552 499 -386 398 -185 40 60 -234 268 -441 479 -324 149 -300 135
3574 135 275 -385 631 -118 504 -132 322 268 -64 425 -225 694 -302 453 -190 269 349 -128 348 -316
3594 -316 620 -336 590 -337 284 98 -361 572 -797 303 -513 4 -149 -180 170 -404 464 -573 464
3613 464 -520 7 -275 -293 -5 -347 260 -559 223 -478 197 -232 -367 26 -585 426 -549 287 -317 -217
3633 -217 3 -216 405 -456 314 -536 439 -61 71 71 -211 521 -496 593 -364 412 -140 83 299 -586
$$ packed form
3498C12n67Q17j156J310j346J347p35j61N34l31N86j124P91p12J128n38n07Q88
3516E36o48O58m08k42m66N41L33j54J08m56J198j538P86m03O6L09n97Q76j019
3535e20J060j158O24k52K38L19n56O10j180J257q23N20m47mL58n95J120j082P29
3554B18q49O67j38m36R88j002J051q85P84n83K25K0k94N02p09R20q03M73m49M35
3574A35J40o60J016p49O22o36M54n4l32M89o50R19r96P55o43M59Q0m77M76o64
3594c16R36r56R26r27O21j86m59R33j369J100q16N17j53l1L50n74Q68j037J037
3613D64r84N27k82j8K88l42O07q19P82p01O75m29j35L93o11J011r75Q36o04J00
3633b17K20k19O21q61P70q50R75n00J32%k82P32j017J089r57P76n52K23K16q85
$$ plain form
3653 -586 366 -447 585 -145 78 201 -144 380 -364 413 -287 540 -218 205 -8 -205 464 -517 585
3672 585 -217 185 -269 143 201 -49 444 -260 618 -255 194 -201 42 28 -352 261 -634 315 -502 26 -282
3693 -282 -366 89 -622 254 -369 170 -513 78 -7 -102 253 -315 674 -712 435 -375 -23 -174 -224 298 -656
3714 -656 494 -437 304 -124 -3 342 -140 384 -667 590 -199 440 -119 125 210 -334 338 -265 762
3733 762 -220 319 173 76 467 -272 488 -279 644 166 221 252 -119 359 -627 714 -231 463 -239 -24 303
3754 303 -246 204 -457 653 -595 174 -207 -43 90 -326 583 -598 384 -508 329 -48 -190 118 -390
3773 -390 469 -573 190 -440 143 -18 -415 453 -453 362 -759 303 -607 -310 311 -521 453 -451 472
3792 472 -331 333 -163 23 337 -232 577 -371 432 -189 271 39 0 568 -371 471 -402 184 -367 425
$$ packed form
3653e86R52q13J032p30K23J23l45N24p44P77p00Q27p58M23k13j97O69r81J102
3672E85q02M02m54M12N8k50M93p04Q78q73M49l95K43j4l80O13q95R49q17N28l08
3693b82q4M55p11Q76o23N39o83N91q5r5L55n68R89j386J147q10L52j51n0N22r54
3714f56J150r31P41m28J21L45m82N24j051J257p89O39n59K44Q5n44O72o03J027
3733G62r82N39j46r7L91p39P60p67R23m78N5L1l71M78r86J341r45O94p02K15L27
3754C03n49M50o61J110j248P69l81J64J33m16R09j181R82q92Q37l77j42L08n08
3773c90Q59j042P63o30N83j61l97Q68r06Q15j121J062r10K97O21q32R74r04R23
3792D72q03O64m96J86L14n69Q09r48Q03o21M60k32l9N68r39Q42q73N86n51P92
$$ plain form
3812 425 245 -49 445 -351 295 -211 380 52 -61 236 -138 349 -195 344 -547 480 -193 39 81 -275
3832 -275 189 -908 449 -473 120 -359 -238 252 -202 -1 -630 324 -693 -61 -21 -363 246 -347 310
3851 310 -396 96 -451 22 -41 54 186 -739 349 -459 75 -172 -457 155 -223 387 -549 702 -252 459
3871 459 86 15 533 -220 647 -594 375 -176 144 107 278 623 66 304 -309 361 -484 113 231 -262
3891 -262 378 -274 481 -440 464 -89 502 454 -315 202 -609 608 -393 269 -2 -151 299 -314 439 -485
3911 -485 181 -449 109 -400 -327 144 -243 383 -396 289 -118 210 -44 -191 310 -408 273 -400 220 -370
3931 -370 102 3 -388 284 -484 406 -349 159 -231 161 354 -182 490 -601 323 -160 587 157 -232 365
3951 365 -46 692 -379 601 -299 150 216 -177 571 -224 554 -257 359 -68 352 289 -88 102 -316 636
$$ packed form
3812D25j80k94M94p96O46n06N91l28j13K97l74M87n44N39q91J027o73K32M2l56
3832b75M64j097J357r22N93m79J21M90m54K01o29R54j017O32M0l42O09n93O57
3851C10p06M92n47M73o3R5J32r25J088q08N34k47k85O12l78O10r36J251r54P11
3871D59l73p1N18p53Q67j241R69n51L20l7J71L45n57K38o13O70q45N97J18m93
3891b62O40o52P55r21R04n53N91m8p69N17q11J217j001O62k71j49M50o13P53r24
3911d85O66o30N58n09P3M71l87O26p79O85m07L28k54j47N01p18O81o73O20n90
3931c70M72r9l91O72p68Q90p55N08l90L92J93n36O72j091R24m83P47m30l89N97
3951C65m11P38j071R80r00M49O6l93P48p95P78q11O16m27M20o3l77J90m18R52
$$ plain form
3971 636 -493 506 88 43 252 -276 237 -636 344 -529 389 -212 -67 123 -356 391 -463 332 -438 38
3991 38 -67 -203 140 -407 245 -547 240 -470 -49 159 -332 278 -380 547 -558 147 -275 150 -117 -486
4011 -486 560 -675 476 -316 229 -154 153 25 -121 343 -412 677 -502 324 -189 -97 276 -492 541
4030 541 -245 813 -247 102 233 66 187 -48 648 -463 517 -138 189 333 -165 384 -363 425 -81
4049 -81 338 -175 -10 236 -353 391 -478 689 -521 70 -44 -105 192 -198 503 -798 19 -413 91 -104
4069 -104 -293 426 -507 361 -956 163 -486 -52 375 -415 -368 -486 913 -666 -550 -327 -275 -27 -368
4088 -368 316 -580 493 -420 99 -342 -45 409 -130 303 -285 394 -24 -21 226 -121 281 -384 403 -275
4108 -275 513 -34 220 241 94 385 -504 374 -391 285 -136 253 229 -169 516 -536 496 -320 147 -59
$$ packed form
3971F36j129R99m18m5K09n28N13q73R80q73R18o01J45J90m79P47q54P95p70M76
3991C8j05j36L43n47O52p92P87p10M21K08m91O10o58R27j105P05m22M25k67l69
4011d86J046j235J151p92N45l83L07j28j46M64p55J089j179Q26n13R2L73p68J033
4030E41p86J058j060L49J31j67J21k35O96j111R80o55L27J44m98N49p47P88n06
4049h1M19n13J65K46n89P44q69J167j210N91j14o1K97l90P01j301Q17m32N04j95
4069a04j89P19r33Q68j317J119o49M34M27p90M7j18J399j579J16K23N2K48l41
4088c68O84q96J073r13N19m41K97M54n39M33n88O79m18LK47l47M02o65P87o78
4108b75P88n47K54K1j47K91q89Q78p65O76m21L89k4l98O85j052J032q16M67k06
$$ plain form
4128 -59 -23 344 -424 543 -587 403 67 342 -39 8 305 -773 -70 -672 188 -409 137 260 -199 206
4148 206 -683 -60 -798 599 -576 -187 184 -268 90 -320 227 -594 51 -245 -79 319 -134 461 -694
4167 -694 478 -443 391 -33 -153 98 -237 417 -465 505 -297 168 225 -192 491 -333 442 -313 564 -87
4187 -87 -33 340 -221 384 -342 535 -273 189 -170 -51 420 -322 678 -340 615 -335 295 19 66 172
4207 172 -292 372 -517 327 -355 194 72 -112 182 -387 405 -402 105 -168 144 -128 -332 559 -443 146
4227 146 -98 210 -361 -121 104 -529 408 -256 161 -346 145 -237 -40 196 -53 253 -601 494 -379 161
4247 161 39 124 268 -86 419 -340 698 -336 94 96 -77 343 -313 209 -246 683 -64 192 285 -131 309
4268 309 -518 429 -527 57 144 -43 195 -269 292 -566 207 -230 177 -123 -79 165 -407 495 -488 47 -566
$$ packed form
4128e9L6L67p68R67j130R90l36K75l81M7K97j078P03o02Q60n97N46J23m59M05
4148B06q89O23p38J397j175L89L71m52L58m10N47q21O45k96J66L98m53N95j155
4167f94J172r21Q34m24j20K51l35O54q82R70q02M65N7m17O83q24P75p55Q77o51
4187h7N4L73n61O05p26Q77q08M62l59J19M71p42J000j018R55r50O30k76M7J06
4207A72m64O64q89Q44o82N49j22j84K94n69P92q07N07k73L12k72k04Q91j002N89
4227A46k44L08n71K40K25o33R37o64M17n07M91l82J97K36k49L06q54J095q73N40
4247A61j22Q5J44l54N05p59J038j034M30Kj73M20o56N22m55R29p47K56R3m16M40
4268C09q27R47r56N84Q7j87K38m64N61q58P73m37M07l00M4K44n72R02r83N35o13
$$ plain form
4289 -566 219 216 -31 277 -483 110 -222 409 -106 12 -146 -210 294 -278 232 -294 37 -247 -81 312 -324
4310 -324 283 -358 129 -329 31 -293 -233 81 -321 311 -455 294 -139 139 60 -249 233 -182 536 -221 341
4331 341 87 139 401 -179 402 -498 293 -473 241 -64 -16 215 18 374 -503 446 -307 57 -32 -17 150
4352 150 -305 491 -571 431 -312 -142 -98 -206 270 -538 549 -286 160 -375 73 -40 -216 256 -408
4371 -408 254 -331 118 -78 -69 369 -572 356 -479 195 -635 453 -12 -151 130 -442 285 -445 468 -182
4391 -182 62 48 -219 185 -118 420 -348 325 -17 396 -4 -421 154 -409 513 -401 438 110 39 214 91
4412 91 398 -568 566 -239 132 87 -8 181 -236 705 -474 234 -380 -41 284 -9 314 -321 493 -303
4432 -303 166 -201 -70 84 -196 155 -264 504 -411 124 -330 47 337 -190 -58 -290 519 -616 150 -294
$$ packed form
4289e66P85lk47L08p60N93l32O31n15J18j58o4N04n72N10n26L31k84J66L93o36
4310c24O07o41M87m58L60l24O0L14m02O32p66P49m33K78p9l09M82m15P18p57N62
4331C41k54N2K62n80N81r00P91p66P14l05M8K31j97L56q77R49p53L64q9J5J67
4352A50m55P96j062J002p43J70M4j08M76q08J087q35M46n35M48j13j76M72o64
4371d08O62n85M49j96RM38r41R28q35O74q30J088m65j39K81n72P27p30R13o50
4391a82K44j4k67M04l03N38p68O73l42M13m00m17N75n63R22r14Q39l28p1J75j23
4412I1L07r66J134q05L71m5r5J89m17R41j179P08o14L39L25k93L23o35Q14p96
4432c03M69l67J31J54k80L51m19P68r15N35m54L77K90n27J32k32Q09j135P66m44
$$ plain form
4452 -294 -29 75 -536 316 -456 346 -192 68 -211 -212 207 -251 296 -193 75 -250 64 113 -210 349 -291
4473 -291 392 -370 155 -241 106 151 -173 441 -118 353 -320 362 -71 84 301 -45 543 -103 527 -217
4493 -217 290 270 -56 186 -263 379 -359 378 -446 388 -40 -260 27 -239 309 -415 338 -136 -81 -4 -180
4514 -180 227 -327 157 -50 194 -161 -208 66 -165 359 -512 456 -287 23 -188 -36 88 -336 214 -143
4534 -143 126 -129 76 27 -170 167 -365 138 -338 -87 -206 15 -127 -362 138 -388 155 -362 218 44
4554 44 152 138 -125 463 -336 463 -144 408 59 -98 192 -152 551 -424 465 -385 282 169 283 132 -298
4575 -298 296 -254 338 53 -193 107 -42 214 -329 229 -126 228 -134 57 -64 -379 -27 -466 480 -225
4595 -225 171 -419 -146 281 -449 203 -391 301 -422 70 -153 -92 336 -448 207 -324 132 -238 149 -156
$$ packed form
4452b94K65J04o11Q52p72Q02n38K60k79jM19m58N47m89K68l25L14M9l23N59o40
4473b91O83p62N25l96L47M5l24O14n59M71o73O82m33J55K17l46N88o46O30p44
4493b17N07k0l26K42m49O42p38P37q24Q34m28k20K87k66N48p24P53m74N5P7j76
4514a80M07n54M84k07K44l55m7K74k31N24q71R68p43L10k11J52J24m24N50l57
4534a43K69k55K05m9j97L37n32N03m76K51j19K21j42k35N00n26N43n17N80j74
4554D4J08j4k63N88p99P99o07N52l49j57K90l44P03r75Q89q50O67j13J14j51m30
4575b98N94n50N92k85k46L00j49K56n43N58l55L54l62J91j21l15L52m39R46p05
4595b25L96n90K73M27p30O52n94O92p23M92k23O1M28p84O55n31M56l70L87l05
$$ plain form
4615 -156 31 207 -315 221 -413 225 -279 239 50 -414 497 -63 207 -228 263 -238 308 59 -257 92
4635 92 -136 415 -366 384 95 36 98 -275 586 -92 350 -152 286 -86 9 365 -305 662 -184 474 -148
4656 -148 44 154 31 329 -200 195 -75 434 -70 92 4 -246 357 -443 71 -220 188 -152 30 181
4676 181 -411 404 -429 -13 -126 28 72 -120 43 -245 266 -392 304 -267 -19 213 -39 370 -433 362
4696 362 -318 215 -177 125 231 1 180 -280 268 -183 370 -176 71 384 -118 213 -123 348 -375 204
4716 204 -78 -90 487 -319 445 -529 104 -135 -100 161 -316 293 -449 258 -244 264 -192 30 14 -275 359
4737 359 -350 207 -398 39 -69 -38 40 -384 249 -473 145 -408 122 -26 -184 123 -350 157 -425 159 -204
4758 -204 -96 123 47 123 -435 215 -409 410 -118 76 243 -519 434 -238 234 -145 137 44 -31 250 -200
$$ packed form
4615a56J87J76n22N36o34O38n04N18j89m64R11n60K70m35M91n01N46k49l16L49
4635I2k28N51p81P50k89n9O2l73Q61o78M42n02M38l72R5L56o70R67q46O58o22
4656a48J92J10j23K98n29L95k70N09n04J62q8k50O03q00N14k91M08l40J82J51
4676A81n92Q15q33M16j13J54M4j92J63k88N11o58O96n71K48K32k52M09q03P95
4696C62o80N33l92L02J06k30J79m60N48m51N53n46K47L13n02L31l36M71p23N79
4716B04k82j2N77q06P64r74O33k39L5K61m77O09p42P07n02N08m56K22j6k89O34
4737C59p09N57o05M37j08L1P8m24O33p22O18n53N30j48j58L07m73N07n82N84l63
4758b04J08K19p6P6n58O50o24Q19n28J94J67p62R53o72M72l79K82r3p5K81m50
$$ plain form
4779 -200 387 -313 110 -61 193 -59 152 427 -269 330 -237 25 -20 125 -86 199 63 -167 129 -81
4799 -81 352 136 170 240 -311 107 -205 307 11 285 -27 -45 374 -253 132 -414 -49 12 216 -96 -96 38
4821 38 -342 287 -365 231 -380 -222 -54 -260 1 -83 406 -307 168 -138 25 54 -348 196 -201 291 -205
4842 -205 159 -345 -210 62 -360 272 -474 10 -334 105 -37 -106 71 -241 275 -335 552 -199 76 126 -54
4863 -54 33 -337 222 -224 521 94 27 26 42 409 -235 197 -160 246 -67 49 23 -182 157 -265 459 -116
4885 -116 167 -145 -287 364 -292 131 -294 108 -298 80 -11 -315 -98 -181 62 -344 180 -394 -207 260 -255
4906 -255 -162 -446 455 -346 344 -131 -48 59 -212 198 -137 242 -105 110 -114 -252 238 -128 329 -222 182
4927 182 -214 172 31 -59 212 -135 527 -271 424 21 122 -133 83 268 -170 562 -281 134 60 16 266
$$ packed form
4779b00N87p00M23j71K54k52K11K75o96N99n67K62m5J45k11K85j36k30K96k10
4799h1M33k16L4P0n51M18l12N12k96K74l12j8M19o27L85n46L65O1K04l12%J34
4821C8l80O29o52N96o11J58J68k06K61q4M89p13M75l06J63K9m02N44l97M92m96
4842b05L64n04J35K72m22O32p46M84l44M39j42o9J77l12N16o10Q87p51K75N0j80
4863e4Q7l70N59m46P45m27o7jJ6L67o44M32l57M06l13J16k6k05L39m22P24n75
4885a16K83l12j42O51o56M23m25M02m06L78r1l04K17q3K43m06N24n74J87M67n15
4906b55R3k84R01q01O90m75Q3J07k71M10l35L79l47K15k24j38M90l66M57n51M04
4927A82l96L86j41r0K71l47O62p98O95m03J01k55K16J85m38P32q43M15p4m4K50
$$ plain form
4948 266 96 333 -198 159 -55 99 13 14 -1 -6 271 -355 296 -334 103 168 152 138 -253 141 -231 256 -349
4971 -349 -100 -14 -128 66 -211 230 -333 421 -225 -333 158 -338 90 -57 116 114 269 30 -2 61 -285 364
4993 364 -343 485 -217 203 94 -363 246 -79 137 -36 220 -256 334 28 -22 28 -224 337 -199 317 -284
5014 -284 373 146 220 189 -119 365 -365 408 -74 22 10 -306 229 -656 283 -49 311 6 -40 -5 -300 556
5036 556 -210 304 -265 89 -217 -241 124 -206 223 -506 120 -371 109 -193 -152 -228 -702 82 15 222 -295
5057 -295 -211 -252 -304 255 -406 286 -115 -168 269 102 130 -18 17 -530 -28 -248 231 6 263 688 -262 246
5079 246 -383 266 -78 -397 138 468 226 -473 651 153 300 62 313 -121 107 106 439 1142 53 -171
5099 -171 454 110 -370 -74 -136 335 303 -663 78 127 6 434 -330 71 -807 27 -102 310 -234 -15 53
$$ packed form
4948B66j70K37n31L57k14J54q6Jj5nK77o26O51o30M37O5j6j4l91L94l72M87o05
4971c49K49Q6j14J94k77M41n63P54o46j08M91m96M28j47J73kJ55k39l2O3l46O49
4993C64p07Q28p02M20j09m57O09l25K16j73K56m76N90l06n0N0k52N61n36N16o01
5014b84O57k27P4l1l08M84p30P73m82R6j2l16N35q85R39l32L60l05m6L5k95Q56
5036E56p66N14n69L54l06k4L65l30M29p29O26m91M80l02M1p6m74P84o7K07n17
5057b95Q4m1n2N59o61O92m01n3M37j67K8j48L5n47N02k20M79k25K57M25r50N08
5079B46o29O49l44l19N35L30k42o99J124m98J47k38K51m34K28jL33P03j089k24
5099a71O25l44m80K96o2M71l2r66P41M9j21M28p64M01q78Q34j29M12n44K19O8
$$ plain form
5120 53 -243 401 -331 -66 -157 23 -416 -179 339 -465 373 -423 188 -362 38 158 -407 250 -192 296 -342
$$ packed form
5120E3k96O44p32K65r1J80m39K37N18q04Q38p96O11n50M00J20n65O57m42M88o38
$$ [...]
8191A75
##END NTUPLES=NMR FID
##END=
