##TITLE=1H_Pr Am-29
 CDCl3, 8 sc, 
 29.9.2020
##JCAMPDX= 6.0         $$ Bruker NMR JCAMP-DX V2.0
##DATA TYPE= NMR FID
##DATA CLASS= NTUPLES
##ORIGIN= UXNMR, Bruker Analytische Messtechnik GmbH
##OWNER= root
$$ XWIN-NMR		Version 3.5
$$ Tue Sep 29 12:36:46 2020 Russian Standard Time (UT+4h)  she@DPX200
##.OBSERVE FREQUENCY= 200.1315066352
##.OBSERVE NUCLEUS= ^1H
##.DELAY= (6, 6)
##.ACQUISITION MODE= SIMULTANEOUS
##.ACQUISITION SCHEME= undefined
##.AVERAGES= 8
##.DIGITISER RES= 18
##SPECTROMETER/DATA SYSTEM= spect
##.PULSE SEQUENCE= zg30
##.SOLVENT NAME= CDCl3
##.SHIFT REFERENCE= (INTERNAL, CDCl3, 0, 15.7039)
##AUDIT TRAIL= $$ (NUMBER, WHEN, WHO, WHERE, WHAT)
$$ ##TITLE= Audit trail, XWIN-NMR		Version 3.5
$$ ##JCAMPDX= 5.01
$$ ##ORIGIN= Bruker BioSpin GmbH
$$ ##OWNER= she
$$ F:/spectra/data/she/nmr/H-F/1/audita.txt
$$ ##AUDIT TRAIL=  $$ (NUMBER, WHEN, WHO, WHERE, WHAT)
(   1,<2020-09-29 12:35:43.32 +0400>,<she>,<DPX200>,
      <created by zg, POWCHK disabled, PULCHK disabled
       configuration hash MD5:
       00 E9 B6 7A A2 85 ED C7 34 08 36 98 17 FE 4E 26
       data hash MD5: 16K
       7C AD 63 37 DB 9E F3 B4 1C 7A 60 11 CF F1 DC B0>)
$$ ##END=
$$ 
$$ hash MD5
$$ BF 69 C1 8A 32 27 D3 C2 3C 0B 23 21 08 96 AF D1
##$RELAX= 
##$RELAX= 
##$RELAX= 
##$RELAX= 
##$RELAX= 
##$RELAX= 
$$ Bruker specific parameters
$$ --------------------------
##$DU= <F:/spectra>
##$EXPNO= 1
##$NAME= <H-F>
##$PROCNO= 1
##$TYPE= <nmr>
##$USER= <she>
##$AMP= (0..31)
100 100 100 100 100 100 100 100 100 100 100 100 100 100 100 100 100 100 
100 100 100 100 100 100 100 100 100 100 100 100 100 100 
##$AQSEQ= 0
##$AQ_mod= 1
##$AUNM= <au_zg>
##$AUTOPOS= <>
##$BF1= 200.13
##$BF2= 200.13
##$BF3= 200.13
##$BF4= 200.13
##$BF5= 200.13
##$BF6= 200.13
##$BF7= 200.13
##$BF8= 200.13
##$BYTORDA= 1
##$CFDGTYP= 0
##$CFRGTYP= 5
##$CHEMSTR= <none>
##$CNST= (0..31)
1 1 145 1 1 1 1 1 1 1 1 1 1 1 1 1 1 1 1 1 1 1 1 1 1 1 1 1 1 1 1 1 
##$CPDPRG= <>
##$CPDPRG1= <>
##$CPDPRG2= <>
##$CPDPRG3= <>
##$CPDPRG4= <mlev>
##$CPDPRG5= <mlev>
##$CPDPRG6= <mlev>
##$CPDPRG7= <mlev>
##$CPDPRG8= <mlev>
##$CPDPRGB= <>
##$CPDPRGT= <>
##$D= (0..31)
0 1.2 0 0 0 0 0 0 0 0.06 0 0.03 0 0 0 0 0.0002 0 0 0 0 0 0 0 0 0 0 0 0 
0 0 0 
##$DATE= 1601368542
##$DBL= (0..7)
120 120 120 120 120 120 120 120 
##$DBP= (0..7)
150 150 150 150 150 150 150 150 
##$DBP07= 0
##$DBPNAM0= <>
##$DBPNAM1= <>
##$DBPNAM2= <>
##$DBPNAM3= <>
##$DBPNAM4= <>
##$DBPNAM5= <>
##$DBPNAM6= <>
##$DBPNAM7= <>
##$DBPOAL= (0..7)
0.5 0.5 0.5 0.5 0.5 0.5 0.5 0.5 
##$DBPOFFS= (0..7)
0 0 0 0 0 0 0 0 
##$DE= 6
##$DECBNUC= <off>
##$DECIM= 32
##$DECNUC= <off>
##$DECSTAT= 4
##$DIGMOD= 1
##$DIGTYP= 9
##$DL= (0..7)
0 120 120 120 120 120 120 120 
##$DP= (0..7)
150 150 150 150 150 150 150 150 
##$DP07= 0
##$DPNAME0= <>
##$DPNAME1= <>
##$DPNAME2= <>
##$DPNAME3= <>
##$DPNAME4= <>
##$DPNAME5= <>
##$DPNAME6= <>
##$DPNAME7= <>
##$DPOAL= (0..7)
0.5 0.5 0.5 0.5 0.5 0.5 0.5 0.5 
##$DPOFFS= (0..7)
0 0 0 0 0 0 0 0 
##$DQDMODE= 0
##$DR= 18
##$DS= 0
##$DSLIST= <SSSSSSSSSSSSSSS>
$$ [...]
##$SUBNAM2= <"">
##$SUBNAM3= <"">
##$SUBNAM4= <"">
##$SUBNAM5= <"">
##$SUBNAM6= <"">
##$SUBNAM7= <"">
##$SUBNAM8= <"">
##$SUBNAM9= <"">
##$SW= 16.880792210976
##$SWIBOX= (0..15)
0 0 2 0 0 0 0 0 0 0 0 0 0 0 0 0 
##$SW_h= 3378.37837837838
##$TD= 16384
##$TD0= 1
##$TE= 0
##$TE2= 300
##$TE3= 300
##$TEG= 300
##$TL= (0..7)
0 120 120 120 120 120 120 120 
##$TP= (0..7)
150 150 150 150 150 150 150 150 
##$TP07= 0
##$TPNAME0= <>
##$TPNAME1= <>
##$TPNAME2= <>
##$TPNAME3= <>
##$TPNAME4= <>
##$TPNAME5= <>
##$TPNAME6= <>
##$TPNAME7= <>
##$TPOAL= (0..7)
0.5 0.5 0.5 0.5 0.5 0.5 0.5 0.5 
##$TPOFFS= (0..7)
0 0 0 0 0 0 0 0 
##$TUNHIN= 0
##$TUNHOUT= 0
##$TUNXOUT= 0
##$USERA1= <user>
##$USERA2= <user>
##$USERA3= <user>
##$USERA4= <user>
##$USERA5= <user>
##$V9= 5
##$VALIST= <valist>
##$VCLIST= <CCCCCCCCCCCCCCC>
##$VD= 0
##$VDLIST= <DDDDDDDDDDDDDDD>
##$VPLIST= <PPPPPPPPPPPPPPP>
##$VTLIST= <TTTTTTTTTTTTTTT>
##$WBST= 1024
##$WBSW= 4
##$XGAIN= (0..3)
0 0 0 0 
##$XL= 0
##$YL= 0
##$YMAX_a= 269292
##$YMIN_a= -302297
##$ZGOPTNS= <>
##$ZL1= 120
##$ZL2= 120
##$ZL3= 120
##$ZL4= 120
##$ABSF1= 10
##$ABSF2= 0
##$ABSG= 5
##$ABSL= 3
##$ALPHA= 0
##$AQORDER= 0
##$ASSFAC= 0
##$ASSFACI= 0
##$ASSFACX= 0
##$ASSWID= 0
##$AUNMP= <proc_1d>
##$AZFE= 0.1
##$AZFW= 0.1
##$BCFW= 1
##$BC_mod= 2
##$BYTORDP= 1
##$COROFFS= 0
##$CY= 11.3945322036743
##$DATMOD= 1
##$DC= 2
##$DFILT= <>
##$DTYPP= 0
##$F1P= 16.9975609425685
##$F2P= -3.02152046262296
##$FCOR= 0.5
##$FTSIZE= 0
##$FT_mod= 4
##$GAMMA= 1
##$GB= 0.15
##$INTBC= 1
##$INTSCL= 1
##$ISEN= 128
##$LB= 0.24
##$LEV0= 0
##$LPBIN= 0
##$MAXI= 10000
##$MC2= 0
##$MEAN= 0
##$ME_mod= 0
##$MI= 1.114404
##$NCOEF= 0
##$NC_proc= 0
##$NLEV= 6
##$NOISF1= 3.799351
##$NOISF2= 2.8
##$NSP= 1
##$NTH_PI= 0
##$NZP= 0
##$OFFSET= 15.70392
##$PC= 1
##$PHC0= -9970.878
##$PHC1= 14.20089
##$PH_mod= 1
##$PKNL= yes
##$PPARMOD= 0
##$PSCAL= 0
##$PSIGN= 0
##$REVERSE= no
##$SF= 200.130013532006
##$SI= 16384
##$SIGF1= 3
##$SIGF2= 2
##$SINO= 400
##$SIOLD= 16384
##$SREGLST= <1H.CDCl3>
##$SSB= 0
##$STSI= 0
##$STSR= 0
##$SW_p= 3612.71676300578
##$SYMM= 0
##$S_DEV= 0
##$TDeff= 0
##$TDoff= 0
##$TI= <>
##$TILT= no
##$TM1= 0
##$TM2= 0
##$TOPLEV= 0
##$USERP1= <user>
##$USERP2= <user>
##$USERP3= <user>
##$USERP4= <user>
##$USERP5= <user>
##$WDW= 1
##$XDIM= 8192
##$YMAX_p= 0
##$YMIN_p= 0
$$ End of Bruker specific parameters
$$ ---------------------------------
##NTUPLES= NMR FID
##VAR_NAME=  TIME,          FID/REAL,        FID/IMAG
##SYMBOL=    X,             R,               I
##VAR_TYPE=  INDEPENDENT,   DEPENDENT,       DEPENDENT
##VAR_FORM=  AFFN,          ASDF,            ASDF
##VAR_DIM=   8192,          8192,            8192
##UNITS=     SECONDS,       ARBITRARY UNITS, ARBITRARY UNITS
##FACTOR=    0.000296,      1,               1
##FIRST=     0,             0,               0
##LAST=      2.424536,      0,               0
##MIN=       0,             -302297,         0
##MAX=       2.424536,      269292,          0
$$ Real data points
##PAGE= N=1
##DATA TABLE= (X++(R..R)), XYDATA
$$ [...]
1811g5J75K38m04K92o3j36J69K63l36k20P93q44rN30J42q97P90j84p59R25Ml87
$$ -75 100 338 -66 226 163 27 196 459 123 -97 696 -148 -157 373 515 -382 408 224 -535 390 394 7
1833GN7M98j067O49K25p80M19K50p35r4J007q49J91K07j78j14P0R7l71N23l96
$$ 7 64 562 -505 144 369 -411 8 258 -477 -571 436 -413 -222 -15 -193 -307 -237 -140 -511 12 -384
1854c84J87k3n6Q9M3J86n54M37kk43K91j78J55l49P84l75j48L47j3K3j11O37j017
$$ -384 -197 -220 -276 -187 -144 42 -512 -75 -77 -320 -29 -207 -52 -401 383 8 -140 207 194 217 106 743 -274
1877b74M81L26n03mP12n75k79R86j177M44O00n69l76R29m43n98J201p49j36L18
$$ -274 207 533 30 26 738 163 -116 870 -307 137 737 168 -208 721 278 -320 881 132 -4 314
1897C14J37p19M81K85q78P02j57l79J57N12o47K24J88o95P16m18rJ92J0m95K18
$$ 314 451 -268 213 498 -380 322 165 -214 -57 455 -192 32 220 -475 241 -177 -186 6 16 -479 -261
1918b61K95n70N59j82j70k48L66j1oJ44k50K87o25P66l84j04K55K19l43j53O69
$$ -261 34 -536 23 -159 -329 -577 -211 -222 -228 -84 -334 -47 -672 94 -290 -394 -139 80 -263 -416 253
1939B53q62Q01l28l32K60O01q31J48J077j271N77K06l16q1P21p68k46R40o40K08
$$ 253 -609 192 -136 -468 -208 393 -438 -290 787 -484 93 299 -17 -98 623 -145 -391 549 -91 117
1959A17L71k44RK42m09k83O32l98Q7L46l24j8L64l30n3N07p67L26k53p9L18p2
$$ 117 488 244 253 495 86 -197 435 37 124 470 146 128 492 162 109 616 -151 175 -78 -157 161 89
1981H9j07L3L11n93K39R6m18N21k01k52N35n3q21Q32m35k07L06K07q09P43K56
$$ 89 -18 15 326 -267 -28 68 -350 171 -30 -282 253 200 -621 211 -224 -431 -125 82 -727 16 272
2002B72j483J357j58m27N57J29j090O16P90j567J186L5p53L91L74m59L05L96j079
$$ 272 -1211 146 -12 -439 118 247 -843 -227 563 -1004 182 217 -536 -145 229 -230 75 471 -608
2021f08Q74L9n89M01L01m94J0L71o83J015l81n37O81j0j11J23L5r17J254p63j53
$$ -608 266 305 -284 117 418 -76 -66 305 -378 637 256 -281 400 390 279 402 437 -480 774 11 -142
2042a42N79k55j69L11q6j96O09o60q4N05n36k20R12n56k06Q74r81lR96r42m25
$$ -142 437 182 13 324 238 42 651 -9 -93 412 -124 -344 568 12 -194 680 -301 -304 692 -250 -675
2063f75J215o94l38Q87p00l53J088q45k33Q85j74n98Q07r07k1R27p64K09L71Q0
$$ -675 540 -154 -492 395 -305 -658 430 -415 -648 237 63 -535 272 -635 -656 271 -493 -284 87 167
2083A67n68N71n70K45L01n68J83M31k77j40N86o50K83L68n59J99L78m53r4N90
$$ 167 -401 170 -400 -155 146 -422 -239 192 -85 -225 361 -289 -6 362 -197 2 380 -73 -167 423
2103D23o23O00q4l54K81L17m84l8N33r36Q25o8m88K57N04q10J63Q96j320K94K36
$$ 423 -200 400 316 -38 243 560 76 38 571 -365 460 392 -96 161 665 -145 18 914 -406 -112 124
2124A24l05J06L72j89j81O04q93Q36k96m98N43j41k24K10J41n71M29j69l64P69
$$ 124 -181 -75 297 108 -73 531 -362 474 178 -320 223 82 -142 68 209 -362 67 -102 -466 303
2144C03n71j94L63J62p50R17n22l58Q51l55k67J60M03p95N83k02l00R08m82N2
$$ 303 -268 -462 -99 63 -687 230 -292 -650 201 -154 -421 -261 142 -653 -70 -272 -572 336 -146 -94
2164i4J62j32o11J171m43o86J098l38m15O21j40m74Q23j78o92R11o26J2L86L14
$$ -94 68 -64 -675 496 53 -633 465 127 -288 333 193 -281 542 364 -328 583 -43 -31 355 669
2184F69q82N77j59j95M74m06J93l37K12l17N44k91J16K1m77M44j72o8R1M74q49
$$ 669 -213 364 205 10 484 78 271 -66 146 -171 373 82 198 219 -258 186 14 -54 37 511 -338
2205c38N7Q48q98K56J5j22j23O84p45L05O36j293O22j7j73J52L63n35r4O30r61
$$ -338 -281 567 -331 -75 -60 -182 -305 379 -366 -61 575 -718 -96 -113 -286 -134 229 -306 -400 230 -731
2226g31N13L97p34K57N79r05M19N06o69L69J82n01k2N61o11J88L61l46J89J75
$$ -731 -218 179 -555 -298 281 -624 -205 301 -368 1 183 -318 -340 221 -390 -202 159 -187 2 177
2246A77k52k8K47j47j8L01j16L49n41K12K03k01p2K03k17j65P74l78j77K25j20
$$ 177 -75 -103 144 -3 -21 280 164 513 -28 184 387 186 114 317 100 -65 709 331 154 379 259
2267B59n19O07O3n41M68k75OK74R0p55O08k43m44Q64n75r9K84l5l62M94p5k43
$$ 259 -260 347 410 -131 337 62 68 342 432 -323 285 42 -402 462 -113 -212 72 37 -325 169 94 -149
2289a49J38%L1r9K5m16M29j93j52K33m0L3k15N34m25m3K77l15L09k58M16j66k3
$$ -149 -11 -11 20 -79 -54 -470 -41 -234 -386 -153 -193 -160 -375 159 -266 -309 -32 -347 -38 -296 120 -46 -69
2312f9K79k42o7K13J7l19M52k51l44K35N69m97pM26n45L09K16l31L9K16j23j06
$$ -69 210 -32 -99 114 131 -188 264 13 -331 -96 473 -24 -31 395 -150 159 375 44 83 299 176 70
2334G0K68l63J77q2m2K16J57l60J0M23n39L40j56j58l6L10j25j92N32o02R3J98
$$ 70 338 -25 152 70 28 244 401 41 51 474 -65 275 119 -39 -75 235 110 -82 450 -152 -59 139
2356A39q7M7k94K15k84K07p9J96j17j2O3m6j9q4J98l18J08j28K25j50j04Q5Q6
$$ 139 52 99 -195 20 -264 -57 -136 60 -57 -69 -6 -52 -71 -155 43 -275 -167 -295 -70 -220 -324 -239 -153
2379a53l8L8J39l81K6L80l06L69k33J09j02N2RO4J33j55K44l38J49R4K95j63O3
$$ -153 -191 -153 -14 -395 -369 11 -295 74 -159 -50 -152 -100 -91 -27 106 -49 195 -143 6 100 395 232 295
2402B95j73r9L38k96K41m61M91j73j1K4m0P8q5K7j38L93m67rL93l65K55j30O7
$$ 295 122 23 361 65 306 -155 336 163 152 176 136 214 129 156 18 411 -56 -65 328 -37 218 88 155
2425A55j40L02j41j68J37p7n9r0K21l09M25l37j82K27Q5J85l87J33m73K36K03
$$ 155 15 317 176 8 145 68 9 -81 140 -169 256 -81 -263 -36 49 234 -153 -20 -493 -257 -54
2446e4j85P4O1J73m39L33j42j13K27k6j76K45J52n37M67k05R5l2J15o6M7J85k62
$$ -54 -239 -165 -104 69 -370 -37 -179 -292 -65 -91 -267 -22 130 -407 60 -145 -50 -82 33 -33 14 199 -63
2469f3J7Jk31J69L23k14R1K95l59k00N05p4j69P8l18L40n9P2MR8j16j41Q7J58
$$ -63 -46 -45 -276 -107 216 2 93 388 29 -171 334 260 91 169 -149 191 132 204 208 306 190 49 136 294
2493B94l61K4K41j10l52O81k30l97J47L55m59J16L62n19K6M59k36j85K97m67K6
$$ 294 -67 -43 198 88 -264 417 187 -210 -63 292 -167 -51 311 -208 -182 277 41 -144 153 -314 -288
2514b88O39o96j2K90k09K04K20m14n7L76k02k60L04M1q6Q4J55m05N16k01k29K35
$$ -288 351 -345 -357 -67 -276 -72 148 -266 -323 53 -149 -409 -105 -64 -150 -66 89 -316 200 -1 -230 5
2536EJ42k81Q9J44k22J99P5o9j19J06l4r7K13J36j06j02J21k74P5K10r1J73j25
$$ 5 147 -134 -45 99 -123 76 151 82 -37 69 35 -62 151 287 181 79 200 -74 1 211 120 293 168
2559A68j36k13M19j07k70L59J03m40Q7L22m73L34J71k65q3L74n66K81%k04j11
$$ 168 32 -181 238 131 -139 220 323 -117 -30 292 -181 153 324 59 -24 350 -216 65 65 -139 -250
2580b50L88l74L8M34m89J99L25l22K5j32r4J05K16j78J16R8m87M38m40K62M7P2
$$ -250 138 -236 -198 236 -253 -54 271 -51 -26 -158 -252 -147 69 -109 7 105 -382 56 -384 -122 -75 -3
2602cj05n9K24l40J86oR7q2J26l7j50K32o2M62p92L57J77o8Q8l4j89k29O77k21
$$ -3 -108 -167 57 -283 -97 -103 -6 -88 38 1 -149 83 21 483 -309 48 225 157 245 211 22 -207 470 249
2626B49k16P5j50r9N10n7l03K34j58l0K59k99J37M8J94o93P42l55r0J31J27k32
$$ 249 33 108 -42 -141 369 312 9 243 85 55 314 15 152 200 394 -299 443 88 -2 129 256 24
2648B4l31M94m75O70k85j81k5P8l8j19L52m49K72K24k77q5J04l8l1J29J52j44
$$ 24 -307 187 -288 382 97 -84 -109 -31 -69 -188 164 -285 -13 211 -66 -151 -47 -85 -116 13 165 21
2670B1l70M82k19k04K56k03J6J82o6k03N08j63j56O7O0q4k29R05r14J83K87j76
$$ 21 -349 133 -86 -290 -34 -237 -221 -39 -105 -308 200 37 -119 -52 8 -76 -305 600 -314 -131 156 -20
2692b0J26P0k36K9L44l07j9N87l50p5p8J88m17L99k23j51K06J54j6l24K73l48
$$ -20 106 176 -60 -31 313 6 -13 574 224 149 71 259 -158 241 18 -133 73 227 211 -113 160 -188
2714a88M03J4l23R1J22l3j35K00j88J14j47L7j50K93m02J35K84k99l2K99j35J60
$$ -188 215 229 -94 -3 119 86 -49 151 -37 77 -70 -33 -183 110 -292 -157 127 -172 -204 95 -40 120
2736A20k93K5J53k89N21l06m02M86N1m31M35j82k3P0P7l22N09q5m86L79k79j81
$$ 120 -173 -148 5 -284 237 -69 -471 15 66 -365 70 -112 -135 -65 12 -310 199 114 -372 7 -272 -453
2758d53L65K42l88K35J97m28J3K82L2j76L87k98j53K39N7m9L33q7m80M93k20r4
$$ -453 -88 154 -234 1 198 -230 -217 65 97 -79 308 10 -143 96 153 104 437 350 -130 363 143 49
2780D9K22j76q0K1J66k18J38J61m13L66K87n43k14N00l01J7mO1M6J38q7j92K83
$$ 49 271 95 15 36 202 -16 122 283 -130 236 523 -20 -234 266 -35 -18 -22 39 85 223 136 -56 227
2803B27j92j08q4K66J8n24N03l14m7M08k38j13K54N8k62L25l08j76K23Q5k60M77
$$ 227 35 -73 -157 109 127 -397 106 -208 -255 153 -85 -198 56 114 -148 177 -131 -307 -84 1 -259 218
2825B18l62j38M04j62j61K20L14p06N99m6k63J64J41o3l85M74j72J3K8n4p3rJ97
$$ 218 -144 -282 122 -40 -201 19 333 -373 226 180 -83 81 222 159 -226 248 76 89 117 63 -10 -19 178
2848A78j96J0p2K25j38M8k3q8l1j21L09j94L41k69M10j53m42J75O7R7k34L44j86
$$ 178 -18 -8 -80 145 7 55 32 -56 -87 -208 101 -93 248 -21 389 236 -206 -31 36 133 -101 243 57
2871E7J26k19J64p2l06L65k38k5K05o8J8RJ11k42k9J37j93J81o1O1J59l04J35
$$ 57 183 -36 128 56 -250 115 -123 -148 57 -11 7 16 127 -115 -144 -7 -200 -19 -80 -19 140 -164 -29
2894b9N8j88K17N1p6j19L1j21l8J69l41M77j2J25j55j39J0J63q7l7J11j06R8J62
$$ -29 29 -159 58 109 33 -86 -55 -176 -214 -45 -386 91 79 204 49 -90 -80 83 -4 -41 70 -36 62 224
2918B24j22J5l2qj65L59n12J87K11Qj68KL53l85J54J43j74N7K21j64r9pJ01n8
$$ 224 102 117 85 77 -88 271 -241 -54 157 165 -3 -1 352 -33 121 264 90 147 368 204 105 98 199 141
2942A41j35J93j6j65Q4j92M4oo1J10j71J36K9k2q5N21o97M34j37l97J99j12J37
$$ 141 6 199 183 18 102 -90 -46 -52 -113 -3 -174 -38 -9 -31 -116 405 -292 142 5 -392 -193 -305 -168
2965a68L51k46m0K4K12j25Q0k84j7J14J34j88J43j06j07K29r6j15M2L27j37K14
$$ -168 183 -63 -103 -79 133 8 88 -196 -213 -99 35 -153 -10 -116 -223 6 -90 -205 -163 164 27 241
2987B41k77j24J18K30k99J65n7l27L44J61j84J63r1k5m2q5K7K93n1j96K69l58
$$ 241 -36 -160 -42 188 -111 54 -3 -330 14 175 -9 154 63 38 -4 -89 -62 231 180 -16 253 -105
3009a05J18J03L12j48p4J13j34j89p4J13m1L66l68O3o0P5J34k84K14k33J96m27
$$ -105 13 116 428 280 206 319 185 -4 -78 35 -6 360 -8 55 -5 70 204 -80 134 -99 97 -330
3031c30K76j95J53J12r0N8Q3q7m90N61r5k18K68l35J28J78k9j02L56m52L30J37
$$ -330 -54 -249 -96 16 -74 -16 67 -20 -510 51 -44 -262 6 -329 -201 -23 -52 -154 202 -250 80 217
3053B17m47R5O3R7j6N4k7j72J11Q2q3J89k42q5K42j35O6K00k23L14k49J1o1L73
$$ 217 -230 -135 -72 25 9 63 36 -136 -25 57 -26 163 -79 -164 78 -57 9 209 -14 300 51 62 1 374
3077C74l81L56k84k34K33J8J29k35J84k26J12J23l36O30l96l6J20r4m78L78J34
$$ 374 -7 349 65 -169 64 82 211 -24 160 -66 46 169 -167 463 67 31 151 57 -421 -43 91
3098I1n49N88P8k25K00j50k38J93J29l44K02K4m2j29J65m91J41L57k56J00K3J87
$$ 91 -458 130 208 -17 183 33 -205 -12 117 -227 -25 -1 -43 -172 -7 -498 -357 0 -256 -156 -133 54
3120E4k3J34m34K85L4k07K94l24l21P45m31J3K89j78j72K34k95J81K07J1j98N5
$$ 54 31 165 -269 16 50 -157 137 -187 -508 237 -194 -181 108 -70 -242 -8 -303 -122 85 96 -102 -47
3142d7J57k1M45m07K01k23j94P7O6Q0k22K90j69n2K35l45M2L03k54m4M58l87q1
$$ -47 110 89 534 127 328 105 -89 -12 54 134 -88 202 33 -19 216 -129 -87 216 -38 -82 376 -11 -92
3165i2L64l15l1M87k49l10K52l27J24K31j64Q9J3m2p6J68l34R1J75J04k13J27
$$ -92 272 -43 -74 413 164 -146 106 -221 -97 134 -30 59 72 30 -46 122 -212 -121 54 158 -55 72
3187G2L19o76L07j00K9P9lJ17n36K91j00o0j25J03J48m7J83j01n7K45k3l22M61
$$ 72 391 -285 22 -78 -49 30 27 144 -392 -101 -201 -261 -386 -283 -135 -182 1 -100 -157 88 65 -257 204
3210B04N3k63J25J44l20Q5j0k92M85j12j51K61K35o98J73N39n45J04L92l15L9
$$ 204 257 -6 119 263 -57 28 18 -274 211 99 -52 209 444 -254 -81 458 -87 17 409 94 133
3231A33J89m80J6M32k72K5J5l2j74L66l6k79J04j62M4q3J28J7N3J44m20L35L4
$$ 133 322 -158 -142 290 18 43 58 26 -148 218 182 -97 7 -155 -111 -194 -66 -49 4 148 -272 63 97
3254I7k75j79M67Q3l26J82l78L43k52L78j47j30K79k01J69k60J03j69K56l04K19
$$ 97 -178 -357 110 193 -133 49 -329 14 -238 140 -7 -137 142 -59 110 -150 -47 -216 40 -264 -45
3275d5Q3o6p4K51j26j17K21k47pK66k3p2N4k97R8L43j63j8k2QJ15k12J88l44L38
$$ -45 38 -28 -102 149 23 -94 127 -120 -127 139 116 44 98 -199 -101 242 79 61 39 47 162 -50 138 -206 132
3300A32j38K6K05j65k29K54K07k46Q7n0J89m69J53J73k23K54k68L8N6Q1Lk26L08
$$ 132 -6 20 225 60 -169 85 292 46 133 83 272 -197 -44 129 -94 160 -108 -70 -14 67 70 -156 152
3323A52k32K86l07L01j77K97l51o0K00j92J53l24M46k89J4m3oP8J07k2l30L49
$$ 152 -80 206 -101 200 23 320 -31 -91 109 -83 70 -254 192 -97 -83 -126 -132 -54 53 31 -299 50
3345E0k60l1L62j86P6j97J81n3N4k4k53K84R7n5j20K37l10J28L9l5L8l3j7j52
$$ 50 -210 -241 121 -65 11 -186 -5 -58 -4 -28 -281 3 100 45 -75 162 -148 -20 19 -16 22 -11 -28 -180
3369a80K77j43J96M6j75N0O4j61L3P7p6q5J9j35L14l55O53n67J86l5o6J20J43
$$ -180 97 -46 150 196 21 71 135 -26 7 84 8 -77 -58 -193 121 -234 419 -148 38 3 -63 57 200
3392B00j13j65J94l31K09N5j81O9l7k8pJ50K3rl41L36o7N7j03l59M93k34O2L41
$$ 200 87 -78 116 -215 -6 49 -132 -63 -100 -128 -135 15 38 29 -312 24 -43 14 -89 -448 45 -189 -127 214
3416B14l50j28J31K30k53R6R2m8q6K0J19k57M03j44Qj9O9m62M80k17M8K44jk46
$$ 214 -136 -264 -133 97 -156 -60 32 -16 -102 -82 37 -220 183 39 47 28 97 -365 115 -102 -54 190 189 -57
3440e7L24j88j43K23n4J81l15J19P3J51j25l9R3k26k24L94k03k02K9L21k08J47
$$ -57 267 79 -64 159 105 286 -29 90 163 314 189 150 243 17 -207 187 -16 -218 -189 132 -76 71
3462G1M2jo5K44n24M4K48P3j22N3p3N0k17P8J41j47R3L2kp3M8j41K16m9j5j67
$$ 71 113 112 47 291 -233 -189 59 132 10 63 -10 40 -177 -99 42 -105 -12 20 18 -55 -7 -148 68 19 4 -163
3488a63J6Q6J02k40PJ97l60J64o0J76M7l0m2N9j44K78k77K08Q2j51j06K33l4K56
$$ -163 -147 -61 41 -199 -192 5 -355 -191 -251 -75 -28 -58 -100 -41 -185 93 -184 24 106 -45 -151 82 48 304
3512C04m08Q2R6L91l31j09M86m57k83L49j79QK19k88K01O5k40P1N6Q2k66K06j54
$$ 304 -104 -22 74 465 134 25 511 54 -229 120 -59 -51 168 -120 81 146 -94 -23 33 115 -151 55 -99
3535i9J34K6l0K5N7j81j78N78l00Q9q8J0l21K90J04l62L77q1O2J18m62Q3%J6k1
$$ -99 35 61 31 56 113 -68 -246 332 32 121 33 43 -278 12 116 -246 131 50 112 230 -232 -149 -149 -133 -154
3560a54K8J88O7k20j01J3J99j39J03K65n49QL75j75J33L6k19J04M8n3J59j1p7
$$ -154 -126 62 129 -91 -192 -179 20 -119 -16 249 -300 -292 83 -92 41 77 -142 -38 10 -43 116 105 28
3583B8M2l7m5o9J39j56L23Nl22N5K97q4j88K92l41J07L76n47q7M87l43m3P4j9
$$ 28 70 33 -12 -81 58 -98 225 230 -92 -37 260 176 -12 280 -61 46 422 -125 -212 275 -68 -111 -37 -56
3607e6K19n3m17N54k46O7R2m27L98Q5k46q0L65k23P7O2k49jK51q9l11J39KJ54
$$ -56 163 110 -307 247 1 68 160 -267 131 216 -30 -110 255 32 109 171 -78 -79 172 83 -228 -89 -87 67
3631F7j2J4j80K23m02L39L7l27K51r8Q4r8K30n7k97K80m1j76J11K54m54OL13j68
$$ 67 55 69 -111 112 -290 49 86 -241 10 -88 -4 -102 128 71 -226 54 13 -163 -52 202 -252 -246 67 -101
3655a01P0k71K85j44K15J62j18j47J85q3j93J46j66L34q2m8J39j8J98l63J03j64
$$ -101 -31 -302 -17 -161 54 216 98 -49 136 53 -140 6 -160 174 92 44 183 165 363 0 103 -61
3677f1o0K95Rm25M60K8l23j27M56k06j29J38J96l25O9l1K96j18n7j29j72L21l49
$$ -61 -121 174 183 -242 218 246 -77 -204 252 46 -83 55 251 -74 -5 -36 260 142 85 -44 -216 105 -244
3700b44K30J90l61P0J39k36J75J52j53N1n7J6j97K43l39M97m09J65n9M8K04j91
$$ -244 -14 176 -185 -115 24 -212 -37 115 -38 13 -44 -28 -225 18 -321 176 -233 -68 -127 -79 125 -66
3722f6j5j42L60k79L7J1Q5Oj69N4J96r4K4L7Q3l93K11J66q5M5K14k40J39j37J17
$$ -66 -81 -223 137 -142 -105 -94 -9 -3 -172 -118 78 -16 8 45 128 -265 -54 112 27 72 286 46 185 48 165
3747A65j23L06k69l29N96m83L59j30l49L06J53k08J08K3j44oL37j49o6j92L68
$$ 165 42 348 79 -250 346 -137 222 92 -257 49 202 -6 102 125 -19 -25 312 163 97 -95 273
3768B73l30J34j00J06o0j53K14p3p1J83K8J2j43k57K54L16n09L4J34j10J97j72
$$ 273 -57 77 -23 83 23 -130 84 11 -60 123 151 163 20 -237 17 333 -176 -142 -8 -118 79 -93
3790i3K86j33P3j62k62J29Q2L48m09nK20j75J58j80Or5R6L65l9l31J61j46J80
$$ -93 193 60 133 -29 -291 -162 -80 268 -141 -146 74 -101 57 -123 -117 -212 -116 249 210 -121 40 -106 74
3813G4KP3R1j51kk39M84m25N6O1N9l7K70j40k7j05J39k64J78j19N5k34J85K29
$$ 74 76 149 240 89 87 -152 332 -93 -37 24 83 46 316 176 149 44 183 -81 97 -22 33 -201 -16 213
3837B13j55q1O5M8j16M21m03R4k38P2q7M34l21J93o6k42K29j85R2j32M1n5K93
$$ 213 58 -23 42 90 -26 395 -8 86 -152 -80 -167 267 -54 139 73 -169 60 -125 -33 -165 -124 -179 114
3860A14j77q9M6j01J52q5J68j71K3J35q2J21R3j57r5K42J55k44j37J18j17J84
$$ 114 -63 -152 -106 -207 -55 -140 28 -143 -120 15 -67 54 147 -10 -105 137 292 48 -89 29 -88 96
3882I6k3j11K66M0k02JL0RN7k73K24j2p1Q6L7pJ03k53l9p4L9L25Q8m80L23j8j95
$$ 96 73 -38 228 268 66 67 97 106 163 -110 114 102 31 117 154 147 250 -3 -42 -116 -77 248 336 -144 179 161 -34
3909c4M83m38P0J40jq2k7k32J25R8J11j83j43J05K23m27N32p25L53N8j25pj0K00
$$ -34 449 11 81 221 220 138 111 -121 4 102 213 30 -113 -8 215 -212 320 -405 -52 6 -119 -126 -136 64
3933F4k57K78j56Q0r2j20K24k4O4j93J33j03Lo1J17J19n0m5m4K1J6K21l87K90
$$ 64 -193 85 -71 9 -83 -203 21 -3 61 -132 1 -102 -99 -160 -43 76 26 -19 -63 -42 -26 195 -192 98
3957I8q0q5L17q9k69J30M0j08j62K37K89l61L92k16j55L71k67l7j27J75O7n8N0
$$ 98 18 -67 250 161 -108 22 62 -46 -208 29 318 -43 349 133 -22 349 82 45 -82 93 160 102 152
3980A52nR9l24J66l17N28j26j52P6p1J21k91RJ17k11K36j88J76j05M8J9j58K31
$$ 152 147 246 -78 88 -229 299 173 21 97 26 147 -144 -135 -18 -229 7 -181 -5 -110 -62 -43 -201 30
4003C0k21K41p5n1q3L69k04L5J2j19j70J99K4J55l3l66J26k4K66j54k41K24K13
$$ 30 -191 50 -25 -76 -159 210 6 41 53 -66 -236 -37 -13 142 109 -257 -131 -155 111 -43 -284 -60 153
4026A53p6J29k30k77L10k11j39L84j35J91M5j47K03j53J37m19L36m5j03J83q2
$$ 153 77 206 -24 -301 9 -202 -341 43 -92 99 144 -3 200 47 184 -235 101 56 -47 136 54
4047E4j32J04j11L0L85k22j1m7P4j3p0N3J72m48K42o5K22Q7j59L5j7k65J28j33
$$ 54 -78 26 -85 -55 330 108 97 50 124 111 41 94 266 -182 60 -5 217 304 145 180 163 -102 26 -107
4071a07Q9j07L72r6k08K58l06R5Q7N3o3L4k53K47J01q8Q7l20J07k92Q2N3J10p9
$$ -107 -18 -125 247 151 -57 201 -105 -10 77 130 67 101 -152 95 196 108 195 -125 -18 -310 -228 -175 -65 -144
4095a44p0K79k26J70qQ1q2m5K61m4k64J55J97r3l47J13J30j11J2J39k15jJ09m7
$$ -144 -214 65 -161 9 1 82 0 -45 216 172 -92 63 260 167 -180 -67 63 -48 -36 103 -112 -113 -4 -51
4119e1L08k23N9l46K23j28J93J72m2j53n1l7K81J16m92L11J60m28K63k07m8J53
$$ -51 257 34 93 -253 -30 -158 35 207 165 12 -39 -76 205 321 -171 140 300 -128 135 -72 -120 33
4141C3p3J43j88L11Q5k22j71M53l32m7j30K08k44K28k60J67J83p7k60n8L77J07
$$ 33 -40 103 -85 226 311 89 -82 371 39 -8 -138 70 -174 54 -206 -39 144 67 -193 -251 126 233
4163B33n70K56r3L47k97j8k1J28K38j52r0M0m8j71M51p7o9p5O7M4j62O0M1J92
$$ 233 -337 -81 -174 173 -124 -142 -163 -35 203 51 -39 1 -47 -218 233 156 87 12 79 123 -39 21 62 254
4187B54n1j41K6P6k57M03l29J27J71k04p6J63j85M6J6K83k13k85J15K24r6J9j99
$$ 254 203 62 88 164 -93 310 -19 108 279 75 -1 162 -23 23 39 322 109 -176 -61 163 67 86 -113
4210a13J17L1o2N9j62J72J16j65J42j81J29j30o3R8J09J51m06O0J12J03k79J13
$$ -113 4 35 -27 32 -130 42 158 -7 135 -46 83 -47 -110 -12 97 248 -158 -98 14 117 -162 -49
4232d9o1P7j54K58K2l20L10j12M8J00Q9k49J3r3j6K40n7N0k16J29PO6l31M45k9
$$ -49 -110 -33 -187 71 93 -227 83 -29 19 119 208 -41 -28 -121 -137 103 46 96 -120 9 16 82 -249 196 167
4257A67l94K44O3q7J03k81K94K23l42m3r2K59l7K18l68j82L56n2j10J10j60J90
$$ 167 -227 17 80 -7 96 -185 109 332 -10 -53 -145 114 77 295 -73 -255 101 49 -61 49 -111 79
4279G9J2Q3k39j79K14L9N5j45J34J35j83m2j87K98l09L59j57O6J35J5k39J11j81
$$ 79 91 174 -65 -244 -30 9 64 -81 53 188 5 -37 -224 74 -235 124 -33 33 168 183 -56 55 -126
4302a26J03j40K64r7l44L63j3k83K09M5P4N3k60q0K73n1k44Q4O4r1J28J14j92
$$ -126 -23 -163 101 4 -340 23 10 -273 -64 -19 55 108 -152 -232 41 -10 -254 -170 -106 -197 -69 45 -147
4325a47J1O0KK72k41J15j33M53n61K61NM1j92o4L60l61K45L4K2ll05q0k1K06J72
$$ -147 -136 -76 -74 198 -43 72 -61 392 -169 92 97 138 -54 -118 242 -119 126 160 182 179 -126 -206 -227 -21 151
4350A51Q0j11k8j44J65p3j64L05o9J20l29J34r6J53l5r1J21k19K76r3J35k77l7
$$ 151 231 120 92 -52 113 40 -124 181 112 232 -97 37 -59 94 59 -32 89 -130 146 53 188 -89 -126
4373a26k2J10R9O9l27K29J64k47O4Qp1p3J31L4j48J76k4M7k24J04J73k36J87j87
$$ -126 -148 -38 61 130 -197 32 196 -51 13 21 -50 -123 8 42 -106 70 46 93 -131 -27 146 -90 97 -90
4397i0J62j21L7J52l46N45n20Q9j44K4L25p4Q2j43m8J38J9R9Q4m86L52J3m09M83
$$ -90 72 -49 -12 140 -206 339 -181 -92 -236 -212 113 39 121 -22 -70 68 87 186 270 -216 136 149 -260 223
4421B23k44J15k16p3K75r5J79M3l1m77M80k35N4m6n2K08j00j42J26J02k08K28
$$ 223 -21 94 -122 -195 80 -15 164 207 176 -301 179 -56 -2 -48 -100 108 8 -134 -8 94 -114 114
4443A14j33r2L19j63l0j28Qk38K86J51N7j13k48M49k82K3l12L51p7J18k69J77
$$ 114 -19 -111 208 45 15 -113 -105 -343 -57 94 151 38 -210 239 -43 -20 -332 19 -58 60 -209 -32
4465c2j07J54j52K84l44J44M3Q3k70K55j71N6J56j17J11k42J53l61M11r4N1K19
$$ -32 -139 15 -137 147 -197 -53 -10 73 -197 58 -113 -57 99 -18 93 -149 4 -357 54 -40 11 230
4487B30l47J06nLJ32j26j99K79p4K1k9P6N9j2l2j12j8K38j19M2j5l22K79Q2rj68
$$ 230 -117 -11 -16 -13 119 -7 -206 73 -1 20 -9 67 126 114 82 -30 -48 190 71 113 98 -224 55 137 128 -40
4513d0K24j25k03J24K39l37K20l37K95O5j49j33J34J65q2l0j86J04j12J26l7j8
$$ -40 184 59 -144 -20 219 -118 102 -235 60 125 -24 -157 -23 142 60 30 -156 -52 -164 -38 -75 -93
4535i3R5k5q0J8J3N9R7j03K61m01k4J16K4K12j93J96j17K08q1j28j0j11J51J27
$$ -93 2 -23 -103 -85 -72 -13 84 -19 242 -159 -183 -67 -43 169 -24 172 55 263 182 54 44 -67 84 211
4559B11k04J8k92K21j6O5ml3k13K20J9k6J25j74J50K8J3nj57J68jk32Q5mK89j42
$$ 211 7 25 -267 -46 -62 3 -1 -34 -247 -27 -8 -34 91 -83 67 95 108 103 -54 114 113 -119 -34 -38 251 109
4585A09N0o0j67K85q2j52q3J84j80N4J84j16j25J30P0j72O3%O2j20K0J54n2k05
$$ 109 159 99 -68 217 135 -17 -100 84 -96 -42 142 26 -99 31 101 -71 -8 -8 54 -66 -46 108 56 -149
4609a49K43r0P1j35J50k45P7J26j97K83k81J03ok07J52J6KJ38M8nk46J73N1j07
$$ -149 94 4 75 -60 90 -155 -78 48 -149 134 -147 -44 -50 -257 -105 -89 -87 51 99 94 -152 21 72 -35
4633c5J06K1r4q8n7K82j73L1K7p4J60l50L60K3j89r9M29k22o2n7J1J23q2K7J8
$$ -35 71 92 -2 -90 -147 135 -38 -7 20 -54 106 -244 116 139 -50 -149 280 58 -4 -61 -50 73 -9 18 36
4658C6O6k1O0l2m1n4N5k27N0k8J01J34l06R3P8J08K1j58N4M68l48N1l2J58l82
$$ 36 102 81 141 109 68 14 69 -158 -108 -136 -35 99 -207 -114 -36 72 93 -65 -11 457 109 160 128 286 -96
4683i6J33j02K4p1J90j81K66n4m06Q2M96n58PK57O6p6n1m9L00k11j54K47K05l32
$$ -96 37 -65 -41 -112 78 -103 163 109 -297 -215 281 -277 -270 -13 53 -23 -74 -123 177 -34 -188 59 264 -68
4707f8J34n7j3J14l21J31L13l59J53J26J17l68R4l22J04K49Ok2J15r5M8J23j98
$$ -68 66 9 -4 110 -211 -80 233 -126 27 153 270 -98 -4 -326 -222 27 33 11 126 31 79 202 4
4730DQ6j67rK03j9p4j34L0j69L13k28J11J60LK6j27j84R6J2o4Q9K26l23J0O3P4
$$ 4 90 -77 -86 117 98 24 -110 -80 -249 64 -164 -53 107 110 136 9 -175 -79 -67 -131 -42 184 -139 -129 -66 8
4756HPL4rLk22J69j74J45J13k43J25P1j09j07J85J15p0J05M3k11oK69m67K91j60
$$ 8 15 49 40 43 -179 -10 -184 -39 74 -169 -44 27 -82 -189 -4 111 41 146 189 -22 -28 241 -226 65 -95
4781i5J18J78m45N8J50P9r2m3j14K23J49j94k2P3j28op0J79J54m5J75k6m83L91
$$ -95 23 201 -244 -186 -36 43 -49 -92 -206 17 166 -28 -50 23 -105 -111 -181 -2 152 107 282 256 -227 164
4805A64n3k26P3j64K61J07j36k55Q1K26n9J9K17m46Q6K90l27R7Q1J45j84oP5m2
$$ 164 111 -115 -42 -206 55 162 26 -229 -148 78 19 38 255 -191 -105 185 -142 -45 36 181 -3 -9 66 24
4829B4L2o3L7r2J9rNK2ML20l03q0K55j31L2k49O3K09n19L46J59k91K00l7o2K30
$$ 24 56 -7 30 -62 -43 -52 -47 -25 -21 299 -4 -84 171 40 72 -177 -114 95 -424 -78 81 -210 -10 -47 -109 121
4855A21k71K47n1k04K55n1j84l2J40L0K5J0J19m1L5k24O6J51j87K67j15k09j23
$$ 121 -150 97 46 -158 97 46 -138 -170 -30 0 25 35 154 113 148 -76 -10 141 -46 221 106 -103 -226
4878b26J17N4J52j42r5J27J06l70K27M0l9J34j57Ok4p4lK0J30O0j7K7m44L65k57
$$ -226 -109 -55 97 -45 -140 -13 93 -277 -50 -10 -49 85 -72 -66 -90 -164 -167 -147 -17 43 26 53 -391 -26 -283
4903b83J10R8K76r0k07J2j17J42J42n6k28nL02k61J54K62k90J59j54j77L74p0
$$ -283 -173 -75 201 111 -96 -84 -201 -59 83 27 -201 -206 96 -165 -11 251 -39 120 -34 -211 163 93
4925I3k45J82j60M4Q3N9j01p3nJ34j3J60j87k3j54J79p8J66jl2j0l7j14n3J60
$$ 93 -152 30 -130 -86 -3 56 -45 -118 -123 11 -2 158 -29 -52 -206 -27 -105 61 60 28 18 -19 -133 -186 -26
4950b6Ln7J29j31k0L77k28oj08k64M70p5J55k34J2P3k0l5J74k88Q5K9j53J12j72
$$ -26 -23 -80 49 -82 -102 275 47 41 -67 -331 139 64 219 -15 -3 70 50 15 189 -99 -14 15 -138 -26 -198
4975a98K60j66J19q5P5O4l20L36j38J06l56J35K42p4l3J37q1j36M83l84R6j93
$$ -198 62 -104 15 -70 5 69 -251 85 -53 53 -303 -168 74 0 -33 104 23 -113 370 -14 82 -111
4997a11J48J6j92K23j0jj99K94k64MM4L18l18J84l80K82J47p3l84J78q8K60j37
$$ -111 37 53 -139 84 74 73 -126 168 -96 -92 -48 270 -48 136 -244 38 185 112 -272 -94 -182 78 -59
5020e9k1J58J9p7q2J22l09L49j16N7J05j38M5j02R4m6j38j9J25m8O4N5k05L49
$$ -59 -80 78 97 20 -62 60 -249 100 -16 41 146 8 53 -49 45 -1 -139 -158 -33 -81 -17 38 -167 182
5044A82j70o6Q4j40L03j63J37M8K2m34L26j72LN8J16k33Q4j11j2J77l5o6J12j85
$$ 182 12 -54 30 -110 193 30 167 215 237 -197 129 -43 -40 18 134 -99 -15 -126 -138 39 4 -62 50 -135
5068a35J48Q6m5j96J55j40K53j84o6J44j70K90j62J25j22O3o1j20J48R5J8r2j10
$$ -135 13 99 54 -142 13 -127 126 -58 -124 20 -150 140 -22 103 -19 44 -17 -137 11 106 124 32 -78
5091g8l3K11j96J79k18k2K77k82J38K3j7K49r6l9Q8l9r8M8j1j70J90k68J53L00
$$ -78 -111 100 -96 83 -135 -157 120 -162 -24 -1 -18 231 135 96 184 145 47 95 84 -86 104 -164 -11 289
5115B89n05J23K17j55K41m59J96K03j33K7n9Q2j47K62j22j0Q0j45r4J52k95L88
$$ 289 -216 -93 124 -31 210 -249 -53 150 17 44 -15 67 -80 182 60 50 130 -15 -109 43 -252 136
5137A36o1lk46K64j96r2J65j00o8J10J63j96M6Q0J3J83j4r1l27N24k86j8J94n7
$$ 136 75 72 -174 90 -106 -198 -33 -133 -201 -91 72 -124 -78 2 15 198 184 93 -234 290 4 -14 180 123
5161A23j35M4R3o7j10O8K31l80J89j5j19R2M8p2j97M54k45o4Q7N6k52K38O8l18
$$ 123 -12 32 125 58 -52 16 247 -133 56 41 -78 14 62 -10 -207 247 2 -62 25 81 -171 67 135 -183
5185a83J7m0Q5K80j35J61Jo6k51J72j32K8J1r5K15j66R4Qo3K6L08j37j97M2j26
$$ -183 -166 -206 -121 159 24 185 186 120 -131 41 -91 -63 -52 -147 68 -98 -4 4 -59 -33 275 138 -59 -17 -143
5210a43K2j31K11l7J37k42J60J9j80K70j91J02J23m5k65J76P4J08j62j25kK72
$$ -143 -121 -252 -41 -78 59 -183 -23 -4 -184 86 -105 -3 120 75 -190 -14 60 168 6 -119 -121 151
5232A51j42J91k35oj53J05Q8N5j70J23M6P3k17J42k4J17k21K5Q0k10J57J57j19
$$ 151 9 200 -35 -41 -194 -89 -1 54 -116 7 53 126 -91 51 27 144 -77 -52 28 -182 -25 132 13
5255A3J08m19J54L11r3O6k65P8j1J98l10J20J74P8j27M6k02j13mL66l84j4K77
$$ 13 121 -298 -144 167 74 140 -125 -47 -58 140 -170 -50 124 202 75 121 -81 -194 -198 168 -216 -230 47
5278D7M3l9n1J23j34l9r5kK05j30P4j42K0K13j6J74m17J5L35K2k81K55qj78L46
$$ 47 90 51 0 123 -11 -50 -145 -147 58 -72 2 -140 -120 93 77 251 -166 -151 184 206 -75 180 172 -6 340
5303C40j52j14j5J1K6k19O7R4P6O2k66J56oO7j65k8K49q0R8k10M0q3m0j3J62k04
$$ 340 188 74 59 70 96 -123 -56 38 114 176 -90 66 60 127 -38 -66 183 103 201 -9 31 -52 -92 -105 57 -147
5329a47p9K76J02N5m92K38J96j58j61L59m27J45R8J35j66O0j64K30K0n0m1J41
$$ -147 -226 50 152 207 -285 -47 149 -9 -170 189 -238 -93 5 140 -26 34 -130 100 120 70 29 170
5351A70m4j9K0j13o4j05J49p1K96k02j06OJ60j53J89p0J74k22J35K2j40r6K21
$$ 170 126 107 127 14 -50 -155 -6 -77 219 17 -89 -83 77 -76 113 43 217 -5 130 152 12 -84 137
5374A37j82J44LP6l37rJ48j62j49L06L09l05J99k85Q8L12k87J22l0L7n6o6L11
$$ 137 -45 99 102 178 -159 -168 -20 -182 -331 -25 284 -21 178 -107 -19 293 6 128 98 135 79 13 324
5397C24m18J33j94J64j97K97q2j63K07j6J52O4k50n7K0m9q5q1L73q2j21Q6k75
$$ 324 -94 39 -155 9 -188 109 27 -136 71 55 207 271 21 -36 -16 -65 -150 -231 142 60 -61 25 -250
5420b50R3J19K24k57L1J60o7N4k24j57J05j39J09R6J61P5j44J63l08J01j40M3
$$ -250 -157 -38 186 -71 -40 120 53 107 -117 -274 -169 -308 -199 -103 58 133 -11 152 -156 -55 -195 -152
5442a52J96O8K1r5m6p3N0J18L4r6J60q9J5j49ln3K14j00J8P3k19k5M6K67j97k54
$$ -152 44 112 133 38 -8 -81 -31 87 121 25 185 96 111 -38 -41 -94 120 20 38 111 -108 -133 -87 180 -17 -271
5468b71L16N5j38l4J46%m0j69J45p7K59J01j77m3r4R4M5j01O3M5k55j26J55M8
$$ -271 45 100 -38 -72 74 74 34 -135 10 -67 192 293 116 73 -21 73 118 17 80 125 -130 -256 -101 -53
5492e3L7L6rP0j93L67l38K66m82L94j78j37K27N4j12q5R0R2j85K86j13Rj05J00
$$ -53 -16 20 11 81 -112 255 -83 183 -299 95 -83 -220 7 61 -51 -136 -46 46 -139 147 34 43 -62 38
5516C8n0j85K02J22k9N2j77m4L21k49o2j3J32o5J64k07J25J34l18J88j02l7P1
$$ 38 -12 -197 5 127 98 150 -27 -71 250 1 -61 -74 58 -7 157 -50 75 209 -109 79 -23 -60 11
5539A1J34o1o3mm7J1j13J60k21q4N21k10j42j36K49J44j28J5M6j40J0P6K5k27
$$ 11 145 84 21 17 -30 -19 -132 28 -193 -277 244 34 -108 -244 5 149 21 36 82 -58 -48 28 53 -174
5563a74K74j80J30o3P9j52L15k48j62K36mn6P7Rk49K16j85L6PK70k45PJ87l31
$$ -174 100 -80 50 -13 66 -86 229 -19 -181 55 51 -5 72 81 -168 48 -137 -101 -94 176 -69 -62 125 -206
5587b06p0M77k80l8J50j70mn1K99Ok7p4R4j88J80j1M0k65K23l00K44N0q0K64m62
$$ -206 -276 201 -79 -117 33 -137 -141 -192 107 113 86 12 106 -82 98 87 127 -138 85 -215 29 79 -1 263 -199
5612a99L72m43oL19j6k4l4J74n0j9J4j25K34k54N8j2l9o8J13K0n5n4J29k35K56
$$ -199 173 -270 -276 43 27 3 -31 143 93 74 88 -37 197 -57 1 -11 -50 -118 -5 15 -40 -94 35 -200 56
5637E6j11Mj13k8K04j5n2M9R4j34K18M5m6m8l3j80J2J4l4K9L6m0K36j86RL38o25
$$ 56 -55 -51 -164 -192 12 -3 -55 -6 88 -46 172 217 171 123 90 -90 -78 -64 -98 -69 -33 -73 163 -23 -14 324 -301
5664c01J81J11j43N0K76o8k32J86Q4j65J31m9o5J50k91J24lJ12N5l51K07k4K27
$$ -301 -120 -9 -152 -102 174 106 -126 60 144 -21 110 61 -4 146 -145 -21 -24 88 143 -208 -1 -25 202
5687B02l09J06j61K17r0m1J65P3p8r8j54J33K05k19J09n2j78J61o8NJ92k12j0
$$ 202 -107 -1 -162 55 -35 -76 89 162 84 -14 -168 -35 170 -49 60 8 -170 -9 -77 -72 120 -92 -102
5710a02%l0RRK54j57J13j81J91l6q2J60kq6m7j86L05j40M2k53N44m02Pp1K60q6
$$ -102 -102 -132 -123 -114 140 -17 96 -85 106 70 -12 148 146 60 13 -173 132 -8 34 -219 325 -77 -70 -141 119 33
5736C3j7p3N7L31l17k21P2J41m21L27J81P5k02j45L69k42q0M16k99l3P2n4J38
$$ 33 16 -57 0 331 14 -207 -135 6 -415 -88 93 168 -34 -179 190 -52 -132 284 -15 -48 24 -30 108
5759A08o2R7O5J10j32k31O1J82p1p9jO2M7nj23p5m0q1J45P8Nq7m5n5J20J65k13
$$ 108 46 143 208 318 186 -45 16 198 127 48 47 109 156 151 28 -47 -87 -168 -23 55 60 -27 -72 -127 -7 158 -55
5786e5J89j58J92j86K2J3j47J30J57l06L64j9k59L35l72J93P3m01K09J26j79p0
$$ -55 134 -24 168 -18 4 17 -130 0 157 -149 215 196 -63 272 -100 93 166 -235 -26 100 -79 -149
5808a49R6J94k46K67m95K55J10p5m5L79k61J3m00M08j34j62M19k69J16j08J71
$$ -149 -53 141 -105 162 -333 -78 32 -43 -88 291 30 43 -357 51 -83 -245 174 -95 21 -87 84
5829H4J65k61J5m9Q3O1j57j22K38R7L4m46K30K7N9J34m34K19j81R9K02j00k15
$$ 84 249 -12 3 -46 37 98 -59 -181 57 154 188 -258 -28 -1 58 192 -242 -23 -204 -105 97 -3 -218
5852b18J29K78j47Mq4L5k06L75j53J28k78K09o1M1p7r9L08j79k32P2J27J36K37
$$ -218 -89 189 42 46 -38 -3 -209 166 13 141 -137 72 11 52 -25 -124 184 5 -227 -155 -28 108 345
5875C45l20K9R7k91J38j4o5O8J59j43K25m22K26J22j37l34j14M44K4k9q9J02r2
$$ 345 25 54 151 -140 -2 -16 -81 -13 146 3 228 -194 32 154 17 -317 -431 13 37 8 -81 21 -71
5898g1j65K28J2K17l79K69j07l9J03p2Q3q1L0jl0kJ31j19r9K0K72j4p6j93o3K19
$$ -71 -236 -8 4 221 -158 111 4 -35 68 -4 79 -2 28 27 -3 -5 126 7 -92 -72 200 186 110 -83 -146 73
5924G3r9M1m3j01k7M12j21n5q8k06P3j35k43M88K28k90j93M28k85m2K9Q8J01R9
$$ 73 -26 15 -28 -129 -156 256 135 80 -8 -214 -141 -276 -519 -31 197 -93 -286 142 -143 -185 -156 -68 33 132
5948A32j20o7J9J19J56m40K36J5n6K59k88N9m1L2J75j71Q2j33m0r8M83l85j09
$$ 132 12 -55 -36 83 239 -201 35 50 -6 253 -35 24 -17 15 190 19 101 -32 -72 -170 313 -72 -181
5971a81J23L1L32k45K5j79N6j17J73K6J04k85J79l7J20n7j17J85l50J90R6K7k37
$$ -181 -58 -27 305 60 85 -94 -38 -155 18 44 148 -137 42 5 125 68 -49 136 -214 -24 72 99 -138
5994a38lL9j95J01J33K11j72j1J46k20J40K13k04J20j55k27Q2J60R1p7l5J72Q7
$$ -138 -141 -102 -297 -196 -63 148 -24 -35 111 -109 31 244 40 160 5 -222 -140 20 111 34 -1 171 258
6017B58l79r5K28K72l18J79l46J79K03l64K70m03L16k6Q2n5k20L52j57K30l03
$$ 258 -121 -216 12 284 -34 145 -201 -22 181 -183 87 -316 0 -26 56 1 -219 133 -24 206 -97
6038i7qqK1K57r0J25j64r2N1L2o9j48m4M61j36p5J08k38J99j89k8L63l35K11K6
$$ -97 -105 -113 -92 165 75 200 36 -56 -5 27 -42 -190 -234 227 91 16 124 -114 85 -104 -132 231 -104 107 133
6063A33K3k15J87K5n7n1l4j21k25N32j65k5j01K02j73J73P8j48L9r7J36k25J08
$$ 133 156 -59 128 153 96 45 11 -110 -335 197 32 7 -94 108 -65 108 186 38 77 -20 116 -109 -1
6086ar2N4j60L1L8L02n4K33k37k0j37J30j9j42J19K4j3J85lk98J15j33J45l08
$$ -1 -93 -39 -199 -168 -130 172 118 351 114 94 -43 87 68 -74 45 69 56 241 238 -60 55 -78 67 -241
6110b41K88k0R3j28p5J98l6N1j29L3j27K14k49QK51Jl11K21j08Q6K18l99L33m27
$$ -241 47 27 120 -8 -83 115 79 130 1 34 -93 121 -128 -120 131 132 -179 42 -66 20 238 -161 172 -255
6134b55J56J22l1R1j73K30k30j75L84n0p5J36K33l25Q1k69K08r3L1RMr2j1L8J03
$$ -255 -99 23 -8 83 -90 140 -90 -265 119 69 -6 130 363 38 119 -150 58 -35 -4 5 9 -83 -94 -56 47
6159D7M4r4Q0j05J22o4j38M08l12N3J21o0j3j16j5q2R9o9N9j70J47K04j98K6q7
$$ 47 91 -3 77 -28 94 30 -108 300 -12 41 162 102 89 -27 -42 -124 -25 -94 -35 -205 -58 146 -52 -26 -113
6184a13J68o2j40o8K46J51Qk66M45m40L7J7K14j25K1j11j92L16j41n8K0K08q3
$$ -113 55 -7 -147 -215 31 182 190 -76 369 -71 -34 -17 197 72 93 -18 -210 106 -35 -93 -73 135 52
6207E2J06l16L93o3r1l35L09j38J45j57k15L20K5J37l05J39j9J60l4K1j22j10
$$ 52 158 -158 235 172 81 -254 55 -83 62 -95 -310 10 35 172 -133 6 -13 147 113 134 12 -98
6229i8k0J30Q0m2q3J03R6k20P0m7k9k9O4Q4M3j60NRKo4L6J24q9P5n4j15J43m4
$$ -98 -118 12 92 50 -33 70 166 -54 16 -31 -60 -89 -25 59 102 -58 -53 -44 -42 -106 -70 54 -35 40 -14 -129 14 -30
6257c0K03j93Q3j30O2n4n5J43j22o1K30k98n9J25J26pL64l33j51K42j95Q6q5K69
$$ -30 173 -20 63 -67 -5 -59 -114 29 -93 -154 76 -222 -281 -156 -30 -37 327 -6 -157 85 -110 -24 -109 160
6281A60k26J63j58J24o5j33J66k11L55l52K41l75L77q5j45L25J52j82j20J7j92
$$ 160 -66 97 -61 63 -2 -135 31 -180 175 -177 64 -311 66 -19 -164 161 313 131 11 28 -164
6302a64J30R5j85J00L3k6J39k4j59j7K22j24r3l0K33l20j74N97j53j6L7m5j59
$$ -164 -34 61 -124 -24 9 -17 122 98 -61 -78 144 20 -73 -103 130 -190 -364 233 80 64 101 56 -103
6325a03R4m9L20m71J12n9J97r9K73n6j14j26R3j34p6K67j02r9mO8m9R6o4NJ06
$$ -103 -9 -58 262 -209 -97 -156 41 -58 215 159 45 -81 12 -122 -198 69 -33 -132 -136 -68 -117 -21 -85 -80 26
6350B6L5j65Q9l19M72J6k46K36k17o7K73k31J15k10j0L93mm80J49K31k24j20L26
$$ 26 61 -104 -15 -334 138 154 -92 144 -73 -140 133 -98 17 -193 -203 190 186 -294 -145 86 -138 -258 68
6373F8M2k32J09P2l10L46l2J18m0j49O1l01K66J5J25p6q6j93L15m3j54M5J93m4
$$ 68 110 -122 -13 59 -251 95 63 181 141 -8 53 -248 18 33 158 82 -4 -197 118 75 -79 -34 159 115
6397A15p6q4J84k36Q8J65j74pj19K1J88p5pJ59k86p8L14l12K44N0J02k30N0J23
$$ 115 39 -45 139 -97 -9 156 -18 -25 -144 -123 65 -10 -17 142 -144 -222 92 -220 24 74 176 -54 -4 119
6421A19j88q9R5K09j55L0N4j84R8r0M5Q3J8p6j35K42j37J19m3m0jJ11l28K51M3
$$ 119 -69 -158 -63 146 -9 21 75 -109 -11 -101 -56 27 45 -31 -166 76 -61 58 15 -25 -26 85 -243 8 51
6446E1m8o1J55p3j79Q8J13n7M6J01J07k25j6L6q5J75j60N8J06o2j42O0J10O5j1
$$ 51 3 -58 97 24 -155 -67 46 -11 35 136 243 18 2 38 -47 128 -32 26 132 70 -72 -12 98 163 152
6471A52K8n4J08k03K09m58L95j86J13k36N7p3J46k17J96J4k33M37k37K49j26k63
$$ 152 180 126 234 31 240 -218 177 -9 104 -132 -75 -148 -2 -219 -23 -9 -242 195 -42 207 81 -182
6493a82K74k9j92K0J91k18K38k35p4K48q6N0M8J05k9k31J49j55L8J97j49l5%L4
$$ -182 92 63 -129 -109 82 -136 102 -133 -207 41 -45 5 53 158 129 -102 47 -108 -70 127 -22 -57 -57 -23
6517b3J29n5m21N69j26j50QN6k3Q1M0m9q5M1l6R0rj16j08J52r8K63k33k9J83K3
$$ -23 106 51 -370 199 73 -77 -69 -13 -36 45 85 36 -49 -8 -44 46 37 -79 -187 -35 -133 130 -103 -132 51 74
6543G4j05Q9l1o2N4j3N1J76m97K52J37j72k3J23Oj51J88K1q0mN8q7J69l03M9M30
$$ 74 -31 58 27 -35 19 6 57 233 -264 -12 125 -47 -70 53 59 -92 96 117 37 33 91 4 173 -130 -81 349
6569C49k94L1j77p5kM61k68J08j87k3jJ96k77R4J30k29Q7J07KN3Q3k23l7J19j52
$$ 349 55 86 -91 -166 -168 293 25 133 -54 -77 -78 118 -159 -65 65 -164 -77 30 32 85 168 -55 -92 27 -125
6594a25k6K96p5l9K30l08L1J69j2K8Rk09L7j73Q9k6M0J28J2k5r2K64k73j39K40
$$ -125 -151 145 70 31 261 -47 -16 153 141 169 178 -31 6 -167 -78 -104 -64 64 76 51 -41 223 -50 -189 51
6619E1K10m15L71k71J67k75p9K57J07j16lk5l6n7q7K92J11l04L6m7J33p7l7L42
$$ 51 261 -154 217 -54 113 -162 -241 16 123 7 4 -21 -57 -114 -201 91 202 -102 -66 -113 20 -57 -94 248
6643B48l76K35j01m3j91R7K35j87K9J86q5j17qK72m98N00j85Ok9J09j86Q8K2k64
$$ 248 -128 107 6 -37 -228 -131 104 -83 -54 132 47 -70 -78 194 -304 196 11 17 -12 97 -89 -1 21 -243
6667b43K92j57K33j01j3o3j12K33J0j26K57p0k99j01J49K8K46l64J14J61k9J77
$$ -243 49 -108 125 24 11 -52 -164 69 79 -47 210 140 -159 -260 -111 -83 163 -201 -87 74 45 222
6689B22l30o0R0K64l68K02J12K80m55J05k28P3k63K86K82k11L2N9k18Q1o9J26
$$ 222 -108 -168 -78 186 -182 20 132 412 -43 62 -166 -93 -356 -70 212 1 33 92 -126 -45 -114 12
6711A2o0J68J0j34l7N5K6M1p6K17l18J53k6K1j23P2j31J16K1j80K53K21k88J03
$$ 12 -48 120 130 -4 -41 14 40 81 5 222 -96 57 31 52 -71 1 -130 -14 7 -173 80 301 13 116
6735A16Ol23M1P6J65j3j0j36O4m7J66l83J79j13K33J21m81K34JR5k33K81k0J70
$$ 116 122 -201 -160 -84 81 68 58 -78 -14 -61 105 -278 -99 -212 21 142 -339 -105 -104 -9 -242 39 19 189
6759A89j99J19NK54o09K57m7K9J35k01J53q3j37J17J15q6KKJ18o9J8R1j04m7O2
$$ 189 -10 109 114 368 -241 16 -31 -2 133 -68 85 2 -135 -18 97 11 13 15 133 64 82 173 69 22 84
6784H4k16P2K54k54L84m93J23J61n8K57k91K8m5r7kJ1l6J45J57k81K4J90O3j31
$$ 84 -132 -60 194 -60 324 -169 -46 115 57 314 23 51 6 -91 -93 -82 -118 27 184 -97 -73 117 180 49
6808D9j79q0K33j26L27l99K17j19j57L10j20R1j57J5n3J58k85L47O1j30q3K5m3
$$ 49 -130 -210 23 -103 224 -175 42 -77 -234 76 -44 47 -110 -95 -148 10 -275 72 133 3 -80 -55 -98
6831i8K33j11nmP0k12R3O2p8L03l45O5J42j64K47j32J27j43j02j65J13K42k81
$$ -98 135 24 19 15 85 -127 -34 28 -50 253 -92 -27 115 -49 198 66 193 50 -52 -217 -104 138 -143
6854a43Q4J04P9o2m8P7k11j07J19j81K60J99j0j30l3k84R9L69j29J14l47L23p3
$$ -143 -59 45 124 62 14 91 -120 -227 -108 -289 -29 170 160 30 -3 -287 -188 181 52 166 -181 142 69
6877F9J4m7M7M2j30j76m2L97l88M82l86K74j86O1k70K45n6K68l30K4J16rr3J7
$$ 69 83 36 83 125 -5 -181 -223 174 -214 268 -118 156 -30 31 -239 6 -50 218 -112 -88 28 19 -74 -57
6901e7J61r4l1M4j35J18J47j35K17j85m0k00K69L7r5K20j61j21J31j79L84j32
$$ -57 104 10 -21 23 -112 6 153 18 235 50 10 -190 79 116 21 241 80 -41 90 -89 295 163
6923A63j6k71J48j8L0J0N9j07k3K5m6J36l8r1K09k34J34l6j34K10m1k15J54j7
$$ 163 147 -124 24 6 36 46 105 -2 -25 0 -46 90 52 -39 170 -64 70 34 -100 110 69 -146 8 -9
6947ik54R6J01N0J2K6j35l1K82k02k1L00l33k41J69N7J6N4mj11M68j36k19J29
$$ -9 -263 -167 -66 -16 -4 22 -113 -144 138 -64 -85 215 -118 -359 -190 -133 -117 -63 -67 -178 290 154 -65 64
6971F4k28M07l98J65J96k35O6M4K5J05j67K6L07n21J40J5kJ63k04K7k86l6M04
$$ 64 -164 243 -155 10 206 -29 37 81 106 211 44 70 377 -144 -4 11 9 172 -32 -5 -291 -327 77
6994G7j81r3O2m1L02k0J09l16K84k8j51j06N2J5O6P2k49J81m5m8j53K93k99K19
$$ 77 -104 -197 -135 -176 126 106 215 -101 183 155 4 -102 -50 -35 31 103 -146 35 -10 -58 -211 82 -217 2
7018Bj2K20k36R3j89K36r6L5k49J71P1k3Q0k28n1J19K1L8q4k46K38K29n0o1Q5
$$ 2 -10 210 -26 67 -122 114 18 53 -196 -25 46 23 103 -125 -176 -57 -36 2 -82 -328 -90 139 89 28 113
7043A13j41j7K8J08j76K43k7j1j22o2o6K20O6j28k25L27J0l07J31p8J44O0Q4K0
$$ 113 -28 -45 -17 91 -85 158 131 120 -2 -64 -130 90 156 28 -197 130 140 -167 -36 -114 30 90 174 194
7067A94j76j17J05J99j49J24q9j05K6J96j96j65L85j47j29K0j59L39l0R6l87Q2
$$ 194 18 -99 6 205 56 180 91 -14 12 208 12 -153 232 85 -44 -24 -183 156 126 222 -165 -83
7089h3Q1J3J66j50N6K4p6j32L11j81j95J96j27K02j65m1m0O4J65m2j36K55j69
$$ -83 -2 11 177 27 83 107 31 -101 210 29 -166 30 -97 105 -60 -101 -141 -77 88 46 -90 165 -4
7112dqn2q1o0J96n4M8N8j73O1K7k36L70q2j23N1O3J08j37p2N3k2J73lJ94k87k13
$$ -4 -12 -64 -145 -205 -9 -63 -15 43 -130 -69 -42 -278 92 10 -113 -62 1 109 -28 -100 -47 -69 104 101 295 8 -205
7139b05J41J23q4j4j4J04j87J90Q8j56K40j44n2m25K16PK01k22J59Q6O8r4j10
$$ -205 -64 59 -25 -39 -53 51 -136 54 142 -14 226 82 30 -395 -179 -172 29 -193 -34 52 120 26 -84
7162h4K74j67j00J28L0j39J11l41M86l94J25J70j17P5QJ22j30k91J55K09J64J
$$ -84 190 23 -77 51 81 -58 53 -288 198 -196 -71 99 -18 57 65 187 57 -234 -79 130 294 295
7184B95k54j52J86k82K15P4k20J18j17j0J88j08J42j39j8J57j73r2K07k29L77
$$ 295 41 -111 75 -207 8 82 -138 -20 -137 -147 41 -67 75 -64 -82 75 -98 -190 17 -212 165
7205A65k48l0R8J4K8n6J51j25K7R3j45M6k32L21n0j6l4K20m0k27R0J9k0k90L28
$$ 165 -83 -113 -15 -1 27 -29 122 -3 24 117 -28 18 -214 107 57 41 7 227 187 -40 50 69 49 -241 87
7230H7j96l4K22j0j79P8N0k4rm1J47k75P6j19L84j9j1r6j03p1L50j57l19N17j88
$$ 87 -109 -143 79 69 -110 -32 18 -6 -15 -56 91 -184 -108 -227 157 138 127 31 -72 -143 207 50 -269 248 60
7255F0p2j94J13K78k00J46l89K02k9L0J07l23K69j16j65M91l01J67l3l7n0j93
$$ 60 -12 -206 -93 185 -15 131 -258 -56 -85 -55 52 -271 -2 -118 -283 208 -93 74 41 4 -46 -239
7277b39L97k56M2rK0j38K94pJ62k36j74J00J78m3j84O2J53j78l5K16l9O3j26P8
$$ -239 158 -98 -56 -65 -45 -183 111 104 266 30 -144 -44 134 91 -93 -31 122 -56 -91 125 86 149 23 101
7301A01o7k50R8K66j87J18j31K30j26J3P2j69Q4m1j26M2J6K61k32Q2n6k7L2L4
$$ 101 34 -216 -118 148 -39 79 -52 178 52 65 137 -32 52 11 -115 -73 -57 204 -28 54 -2 -29 3 37
7325C7j83K12J02j58j8j8K28k94k22K56j19J26J72j94L5J20J1l35M88j16j3j23
$$ 37 -146 66 168 10 -8 -26 202 -92 -314 -58 -177 -51 121 -73 -38 82 93 -242 246 130 117 -6
7347fO6j29l3J59r0K55k43R3k87L54k8j81k6L0N9k04J48K02j00k05J04R8k00J23
$$ -6 60 -69 -102 57 -33 222 -21 72 -215 139 111 -70 -96 -66 -7 -211 -63 139 39 -166 -62 36 -164 -41
7371d1j16K43N3j96nM25l58n9L48k20k1LL02m40K67k63J16k00O1J90k61K54J8
$$ -41 -157 86 139 -57 -62 363 5 -54 294 74 53 56 358 -82 185 -78 38 -162 -101 89 -172 82 100
7394A00P4l36K39l7l8r5J46k4nL2k54M76j67k14J04j0P9j00R6k39j45L53j14N5
$$ 100 174 -162 77 40 2 -93 53 29 24 56 -198 278 111 -103 1 -9 70 -30 66 -173 -318 35 -79 -24
7418b4jJ23j58J50J80l87j83M61k09P9P4k52J57k32M7Q9J73K9k96M25l83N43k38
$$ -24 -25 98 -60 90 270 -117 -300 161 -48 31 105 -147 10 -222 -175 -86 87 116 -180 245 -138 405 167
7441A67j66Q9k37J10M5j50J07m7Q8j60k5K17L8n5j01RK66k10J37O2k02j2L2J08
$$ 167 1 90 -147 -37 8 -142 -35 -82 6 -154 -179 38 76 21 -80 -71 195 -15 122 184 -18 -30 2 110
7465A10q4k81L54o6J22m9Jj04k38M06k62j07P0J53L3J56l07J55j70M7J22l11J31
$$ 110 26 -255 99 33 155 106 107 3 -235 171 -91 -198 -128 25 58 214 -93 62 -108 -61 61 -250 -119
7488a19N5p1M21k93j27Q1J03kj83K79j25k01K19J12K15m95Q0J44j16N8J40l73
$$ -119 -64 -135 286 -7 -134 -53 50 48 -135 144 19 -182 37 149 364 -131 -51 93 -23 35 175 -198
7510a98K80Jj28Q8o3R0r9j36J47o8M07k24o9j23K3K46r4kk09K43k44K92l2r6J29
$$ -198 82 83 -45 43 -20 70 -29 -165 -18 -86 321 97 28 -95 -72 174 80 78 -131 112 -132 160 128 32 161
7535A61j38k40R0j85M23j97k1J69j82J7k6J90m48L20j52J72j30J83k27J91o5Q2
$$ 161 23 -217 -127 -312 111 -86 -107 62 -120 -103 -129 61 -387 -67 -219 -47 -177 6 -221 -30 -95 -13
7557a3j13K83k63NK42Lj15J48j06l22K20N5j24J53j24J03p1k20K66j00J02P3l31
$$ -13 -126 157 -106 -101 141 144 29 177 71 -251 -31 24 -100 53 -71 32 -39 -259 7 -93 9 82 -249
7580b49J94L4n2q7J07J54j05J23O5j83j48K70k3j63P1L1j48N3J29p4j05J09j5
$$ -249 -55 -21 -73 -160 -53 101 -4 119 184 1 -147 123 100 -63 8 39 -109 -56 73 -1 -106 3 -12
7603a2rj72K14j92L26j99J41k97O6J9n0K26R3M0m1j66N3r1o0L1L29k68K6n4l2
$$ -12 -21 -193 21 -171 155 -44 97 -200 -134 -115 -165 61 154 194 153 -13 40 -51 -111 -80 249 -19 7 -47 -79
7628g9J97l03K39m3O1j64Q4q5K48K1k24R6Kl65L64J91k78M8O9k26K32m7J02r2
$$ -79 118 -185 54 11 72 -92 -8 -93 155 176 -48 48 50 -315 49 240 -38 10 79 -147 85 38 140 48
7652D8j97J23J40o4l15L13o7J87m4o1J43k37K47k84J26j38L6J16j14J65m3j6O
$$ 48 -149 -26 114 50 -265 48 -19 168 124 63 206 -31 216 -68 58 -80 -44 72 -42 123 80 64 70
7675G0j20J21p9j8Q6O5j75l5J00K32o0j59lK5K00k92P9Ko7j41J08J96l50N33o2
$$ 70 -50 71 -8 -26 60 125 -50 -85 15 247 187 28 25 50 250 -42 37 39 -28 -169 -61 135 -215 318 256
7700B56l91J19J40j93K38r2k49R8j19J66j01k1K51J06k82J2J69o6k19J36j01L9
$$ 256 -135 -16 124 -69 169 77 -172 -74 -193 -27 -128 -149 102 208 -74 -62 107 41 -178 -42 -143 -104
7722a04J18J01j71K58p5j76J75r6j24m8L40j45q7Rr3K9J89j67J75r1j7K0j50O7
$$ -104 14 115 -56 202 127 -49 126 30 -94 -142 198 53 -34 -25 -118 -89 100 -67 108 17 0 20 -130 -63
7746f3K49j34J78j74m3J1J08q6M3m9j29J39J9J44p3k39J07N8k25L6K53j32Q4k32
$$ -63 186 52 230 56 13 24 132 46 89 40 -89 50 69 213 140 -99 8 66 -159 -123 130 -2 82 -150
7770a50Q9N2K34j12k20o1P5J32j07M6l86M84j88J92k33J84P2R4q3k13k1j69K84
$$ -150 -61 -9 225 113 -107 -168 -93 39 -68 -22 -408 76 -112 80 -153 31 103 197 114 -99 -120 -289 -5
7793eL9j94O8J81m21J52J6K23k28K11Q3k15J92l07k1L34l4m2KlR8k06N9J50r6
$$ -5 34 -160 -92 89 -332 -180 -164 59 -169 42 125 -90 102 -205 -226 108 74 32 34 31 129 -77 -18 132 36
7818C6p7Q8m0J12k29K48k44Q8J77r1j30J76n4j48n5J27K01j87N5J88j67j07J71
$$ 36 -41 47 7 119 -110 138 -106 -18 159 68 -62 114 60 -88 -143 -16 185 -2 53 241 74 -33 138
7841A38j9l12O8K82Oq6k61j21j5P7L32p8k01J64r4J57q0p2j52K69q6j8K8J35l0
$$ 138 119 -193 -125 157 163 77 -184 -305 -320 -243 89 11 -190 -26 -120 37 -43 -115 -267 2 -84 -102 -74 61 31
7866C1j19K01j29mm00K46K05J20p0j78J94R3j13p1J0o7L60k81k31L39j76J93j71
$$ 31 -88 113 -16 -20 -420 -174 31 151 81 -97 97 190 77 6 16 -51 309 28 -203 136 -40 153 -18
7889a8J23j87K59l37K82j30J19n2j68K00N3j85R8kj71K61j42J07k79M74k76M9
$$ -18 105 -82 177 -160 122 -8 111 59 -109 91 144 -41 57 55 -116 145 3 110 -169 305 29 78
7911G8j84p8J92j37K51J23k70p1l4J93k46K02K2k5J28p5j94K71k3l47J92krQ9
$$ 78 -106 -184 8 -129 122 245 -25 -96 -130 63 -183 19 41 16 144 69 -125 146 123 -224 -32 -34 -43 46
7935D6Kj96J18L7o1J28k44J50J14K05k48p4J4rj00J21R9j77M40l68k8P0j26J05
$$ 46 48 -148 -30 7 -54 74 -170 -20 94 299 51 -23 -9 -18 -118 3 102 -75 365 -3 -31 39 -87 18
7959A8k20K91j62M1R0m4j4O9j98q4K62k49J40K99m9l22P4J25N1j26j79M7K56k95
$$ 18 -202 89 -73 -32 58 14 0 69 -129 -213 49 -200 -60 239 190 -132 -58 67 118 -8 -187 -140 116 -179
7983a79K79N5n6j7l59L60k25J45j1K28k0j61j62J25k60J64J81j80J04j93K13m3
$$ -179 100 155 99 82 -277 83 -142 3 -8 220 200 39 -123 2 -258 -94 87 -93 11 -182 31 -12
8005a2n0pJJ45m9k30K96q4j49Q3j24L6O8R5m2l1L4J13j61K69k20J05k17J90q0
$$ -12 -62 -69 -68 77 28 -202 94 10 -139 -56 -180 -144 -76 19 -23 -54 -20 93 -68 201 -19 86 -131 59 -21
8030b1k6J48r3j09K12k04R7l7J73k59K49j30nK01j80Mk4J77j96p8K28p4r7nj43
$$ -21 -47 101 8 -101 111 -93 4 -33 140 -119 130 0 -5 196 16 20 -4 173 -23 -101 127 53 -44 -49 -192
8055a92J65nj57L23j0j84J01O6oj33J43j68K2P5q8j8O0r6k4K27k38J06lL7N3l78
$$ -192 -27 -32 -189 134 124 -60 41 107 101 -32 111 -57 -35 40 -48 -66 -6 -102 -126 101 -137 -31 -34 3 56 -322
8081c22M37j15p6J2L19j08j81J93q2N1k09J34P6q4N1k0J3J55l15K04j00J96k81
$$ -322 115 0 -76 -64 255 147 -34 159 77 128 -81 53 129 45 96 76 89 244 -71 133 33 229 -52
8104e2J96j88KL07k43l0k4J13Rk88J47j59J44J17j02L4O3O7k39J11l5O3J65m51
$$ -52 144 -44 -42 265 22 -8 -32 81 90 -198 -51 -210 -66 51 -51 -17 46 113 -126 -15 -50 13 178 -273
8128b73J17K60J6j03j4j62J10N3NR7j83J58l0J18j17j68K8LR4jk2k11J97N1J6
$$ -273 -156 104 120 17 3 -159 -49 4 9 106 -77 81 51 169 52 -116 -88 -85 9 8 -14 -225 -28 23 39
8153C9n4J6N4K5j67J97J23o79J65K05qP9j00l0O4N2j63M6K00j71N2P4O6r1R7k83
$$ 39 -15 1 55 80 -87 110 233 -446 -281 -76 -84 -5 -105 -135 -71 -19 -182 -136 64 -107 -55 19 85 -6 91 -192
8179a92J23k3J90k36J62J02q0j65q9K39O8j58
$$ -192 -69 -92 98 -138 24 126 46 -119 -208 31 99 -59
8191e9
$$ Imaginary data points
##PAGE= N=2
##DATA TABLE= (X++(I..I)), XYDATA
0@%%%%%%%%%%qJ6j6J6k2L0l2M0n1N9p2Q8j04J23j47J76k03K30k67L07l50M02m57
$$ 0 0 0 0 0 0 0 0 0 0 0 -8 8 -8 8 -14 16 -16 24 -27 32 -40 48 -56 67 -80 96 -107 123 -144 163 -187 215 -242
33b42N16n81O54p38Q27r25J034j149J277j420J573j736J916k116K335k574K835
$$ -242 274 -307 347 -391 436 -489 545 -604 673 -747 826 -910 1006 -1110 1225 -1349 1486
50A486l123L440l791M183m619N112n672O312p054P926q970J0246j1841J3901j6678
$$ 1486 -1637 1803 -1988 2195 -2424 2688 -2984 3328 -3726 4200 -4770 5476 -6365 7536 -9142
65i142K0641k6782L7607o2030K09630l6586m35635L80321Q6527k90808J06801
$$ -9142 11499 -15283 22324 -39706 169924 133338 -302297 78024 164551 -126257 -19456
76a9456J38820j96166N0494Q2150k8205l3131o4096P1054J33822j78976q3481
$$ -19456 119364 -76802 -26308 55842 27637 -5494 -69590 1464 135286 -43690 -127171
87a27171K25896m1371j43615J12825n019o4609O9631l060m9314K9520m0537O3475
$$ -127171 98725 57354 -86261 26564 21545 -43064 26567 23507 -25807 3713 -36824 26651
99B6651M8820j67081L2914J76184j17265r5341J36303k3630n6449O5212k6426
$$ 26651 75471 -91610 -58696 117488 223 -95118 41185 17555 -38894 26318 -108
110a08k7342K1548Q936K9585m1840p2954J29081J9902j58005Q7853O1996j23634
$$ -108 -27450 -5902 3034 32619 -9221 -82175 46906 66808 -91197 -3344 58652 -64982
122f4982Q1909N0331j73023J03993J13480j93990M9064J26009j58380L2246J48466
$$ -64982 16927 67258 -105765 -1772 111708 -82282 -33218 92791 -65589 -33343 115123
133A15123j71640k5416J81283q3744q1500Q6657n578k3899K8357l4378J5971J3666
$$ 115123 -56517 -81933 99350 15606 -65894 20763 15185 -8714 19643 -14735 1236 14902
145A4902l9249N9629j3782q9675Q9617N2040j28604L4179P7158q2035K2949M4365
$$ 14902 -24347 35282 21500 -68175 21442 73482 -55122 -20943 56215 -25820 -2871 41494
157D1494p7154K2887O2158o4054Q71L1982l6960L1950J2062n6265K3690L3782
$$ 41494 -35660 -12773 49385 -14669 -13798 18184 -18776 13174 25236 -31029 -7339 26443
169B6443l4614J0443l561k0910M4663j3203l5359L4763r674j6032N0696m6882
$$ 26443 -8171 2272 -1289 -22199 22464 9261 -26098 8665 -1009 -17041 33655 -13227
181a3227l3478R1151l4787o2538Q3680j7536p3107R6371j271j07794P4891N3320
$$ -13227 -46705 44446 9659 -52879 30801 13265 -59842 36529 35258 -72536 2355 55675
193E5675q8593O365N4560l4485n946J9094n372m292j4648K6067K1010n9987J544
$$ 55675 -32918 -26553 28007 -6478 -12424 6670 1298 -2994 -17642 8425 29435 -30552 -29008
206b9008Q0773n0112m8899P5887j2905m7863N0316o70m7973M0707P824k9340J9040
$$ -29008 51765 1653 -47246 28641 15736 -32127 18189 17519 -30454 10253 18077 -11263 7777
219G777j1980m191L5716k5402l1241M9271k516l4389K3096K142j3876R971K666
$$ 7777 -4203 -8394 27322 1920 -29321 19950 17434 -16955 6141 8283 -5593 4378 7044
232G044o441N76j2377K4304Q550n1677K4069M2828m8665j2128N3315l3245j9466
$$ 7044 603 1179 -11198 13106 21656 -30021 -5952 36876 -11789 -23917 29398 -3847 -23313
245b3313M9146k4319k6703L4718L130k5079J2807l688j102J5102j8130j057J2422
$$ -23313 25833 1514 -25189 9529 12659 -12420 387 -3301 -4403 10699 -7431 -8488 3934
258C934n975j650Q240j6069P549J4170k0233Q812L415j4944J6314J0095l5982
$$ 3934 -2041 -3691 4549 -11520 -3971 10199 -10034 -1222 2193 -12751 3563 13658 -22324
271b2324J5970K9499l7063L560K5774k2435o161L0849j8249j6714K5206q42r615
$$ -22324 -6354 23145 -13918 -10358 15416 -7019 -13180 17669 -580 -17294 7912 7070 -2545
284b545k739O125M510l266p160J0449j546j3697K1907m872k0896J6824J2898k3083
$$ -2545 -5284 841 5351 2085 -5075 5374 3828 -9869 12038 7166 -13730 3094 15992 -7091
298g091M770J3707j8428J1510N154j6014N110J2670j2865L34R107j3730Q332N627
$$ -7091 -2321 11386 -7042 4468 9622 -6392 -1282 11388 -1477 -1143 7964 -5766 2566 8193
312H193j0142k773Q742k93l730q13l158R685o878k180P307o609l242J2839m511
$$ 8193 -1949 -4722 4020 3727 -3 -816 -3974 5711 -1167 -3347 3960 -2649 -5891 6948 2437
327B437j7087J9501O48j4633P868M719j0761N368Q330j4800M016O631k594l461
$$ 2437 -14650 4851 5499 -9134 -1266 3453 -7308 -1940 6390 -8410 -4394 2237 -357 -3818
341c818P78J935j07J013l627M268m034K563M222o631r42O242J87n936O589n342
$$ -3818 -3040 -1105 -1212 -199 -3826 442 -3592 -1029 3193 -3438 -4380 1862 2049 -3887 2702 -2640
357b640J407P208p422l409R447k76j0748J0743O57j0077N741Q386r024p654J4050
$$ -2640 -1233 5975 -1447 -4856 4591 4315 -6433 4310 4967 -5110 631 9017 -7 -7661 6389
372F389J811j1856j477J5211n404j2974J2810N145j5115R55J8048j2818j0636
$$ 6389 8200 -3656 -5133 10078 4674 -8300 4510 9655 -5460 -4505 13543 725 -9911
385i911J5360L689j3279m4J0049m371k602l17L281j31m795K088N137m430p767
$$ -9911 5449 9138 -4141 -4185 5864 1493 -1109 -1426 1855 1724 -3071 -983 4154 -276 -8043
400h043J1074K600j2077P2J2051l938j0031P645L234n140k331N979q64m626J439
$$ -8043 3031 5631 -6446 -6374 5677 1739 -8292 -647 2587 -2553 -4884 1095 231 -4395 -2956
415b956L751L21p140L086N717j919p780M832O382o470j717L356K853l260j525
$$ -2956 795 1116 -6024 -2938 2779 860 -6920 -2088 4294 -2176 -3893 -537 2316 -944 -2469
430b469J105O501n383q466J5034L056k1120N751K6502k2488j7318L3637Q95l3843
$$ -2469 -1364 5137 -246 -8712 6322 9378 -11742 -5991 20511 -1977 -19295 14342 15237 -18606
444a8606J5637K6707l0912p208K9757n387k3296J2056J5509j3359q308P448J1770
$$ -18606 -2969 23738 -7174 -14382 15375 9988 -13308 -1252 14257 898 -7410 38 11808
457A1808j0586j1933J5764Q532k1998j748K8441j5450k0683K3793J0407k8160
$$ 11808 1222 -10711 5053 13585 -8413 -10161 18280 2830 -17853 5940 16347 -11813
469a1813K433K4152j3940j1396J1355O280j0677j659O172K458n163o915J2744
$$ -11813 -9380 14772 832 -10564 791 7071 -3606 -5265 907 3365 -1798 -8713 4031
482D031J500j5097K827J8353j4206j1438K2367n100j5413J3388O081j9312J2233
$$ 4031 5531 -9566 -6739 11614 -2592 -14030 8337 3237 -12176 1212 7293 -12019 214
495B14Q528k1121J1221J2478k2148K704K6388k5107r868L4170j2833k4123K4767
$$ 214 8742 -12379 -1158 11320 -10828 -8124 18264 -6843 -16711 17459 4626 -19497 5270
508E270J0247k8916R643J5630j2512m662O248M364k521p242J114J7452j3995j4865
$$ 5270 15517 -13399 -3756 11874 -638 -5300 948 5312 2791 -4451 -3337 14115 120 -14745
522a4745K6085K124k8282J0812K5606k6640q134K6289m667j9752J0298J3814j4219
$$ -14745 11340 13464 -14818 -4006 21600 -5040 -13174 13115 8448 -11304 -1006 12808 -1411
535a411m584P590O196q225p047J0556N802j2797o372K1800o096k0457J6193J3990
$$ -1411 -5995 1595 7791 -434 -7481 3075 8877 -3920 -10292 11508 5412 -15045 1148 15138
549A5138k5048k495K8912j6791j5673K2924O60k1584J4626Q520k0974J1051Q077
$$ 15138 -9910 -12405 16507 -284 -15957 6967 7627 -13957 669 9189 -11785 -734 7343
562G343j5335M112J2103j5928J757J5216j4166k420J2292l704q131P550K85j857
$$ 7343 -7992 -3880 8223 -7705 -5948 9268 -4898 -7318 4974 1270 -6861 689 974 -883
576h83M93m319Q507j082j0575P708J0257j6393j207J9401j0778j1093J4063N030
$$ -883 -390 -4709 3798 2716 -7859 -151 10106 -6287 -7494 11907 1129 -9964 4099 9129
590I129j5003K883R785m367n261J406P957m672o263M889P956r084o165J3044J083
$$ 9129 -5874 -2991 6794 2427 -2834 -1428 6529 1857 -4406 483 8439 -645 -6810 6234 7317
605G317j3018J507J5675r441j2999J5870O190j9528K407K0063j5012j0158J8344
$$ 7317 -5701 -4194 11481 2040 -10959 4911 11101 -8427 -6020 14043 -969 -11127 7217
618G217L7j6652Q268R229j1703jN836j427l099Q25J512R08l078j128N866l480
$$ 7217 7254 -9398 -1130 8099 -3604 -3605 2231 804 -2295 -1470 42 950 -2128 -3256 2610 -870
634h70l001M434r9l113K076k59j392L217l685L46M404l483l040O931j644o442
$$ -870 -3871 563 464 -2649 -573 -832 -2224 993 -2692 -2346 2058 -1425 -4465 2466 822 -5620
650e620P155Q12o142K661M215m612kL595k045n98P85J298j780K14J555n72j385
$$ -5620 1535 2347 -3795 -1134 3081 -1531 -1533 2062 17 -581 204 1502 -278 -64 1491 919 -466
667d66J678R30l699L532L52l291J710L062m616M63N187n510k31M569k495l379
$$ -466 1212 2142 -1557 1975 2327 -964 746 3808 -808 -345 4842 -668 -899 3670 1175 -2204
683b204M810O7m733L301Q12j843j624L613j177k927J877K534l120k444O083k514
$$ -2204 2606 2673 -2060 1241 2053 210 -1414 2199 1022 -1905 -28 2506 -614 -3058 3025 511
699E11m204L848K263n238N63N434o036M05L744j707l020L736j80k863K811j125
$$ 511 -3693 155 2418 -2820 -2257 3177 -2859 -2454 1290 -417 -3437 299 119 -2744 67 -1058
715a058k04R7J374j697L05J501j281O6l63K224l052R88K813k698r51L328K04n011
$$ -1058 -1262 -1165 209 -1488 -1183 318 -963 -897 -1260 964 -2088 -1100 1713 -985 -1936 1392 1596 -3415
733c415M524R27l368N39K933j421k083L731j844j67k31J257k44j005J133p02J104
$$ -3415 1109 2036 -1332 -793 2140 719 -1364 2367 523 356 125 1382 1138 133 1266 564 1668
750A668j701J908j602P66J54j105J418p03l5j497L809l591m72L640k059k369K230
$$ 1668 -33 1875 273 1039 1193 88 1506 803 768 -729 3080 -511 -983 2657 598 -1771 459
767D59K496n744K893K115l234p78K921q2m049L264J73j021k399L547M03m301K450
$$ 459 2955 -2789 104 2219 -1015 -1793 1128 1046 -3003 261 434 -587 -2986 561 964 -3337 -887
784h87J959k533k127N756k962k516L707k87k293Q55K645l320J753k70n64R86p89
$$ -887 1072 -1461 -3588 2168 -794 -3310 397 110 -2183 -1328 1317 -2003 -250 -520 -1084 -98 -887
801h87L32K11J122k530K486m1j256M07J79J385j955L66J032R68l142J866K800
$$ -887 -555 -344 778 -1752 734 693 -563 -156 23 1408 -547 -181 851 1819 -1323 543 3343
818C343m527Q29K892j396k691L863q80j741J714q65O07k01m62k79K452k992k66
$$ 3343 -1184 -355 2537 1141 -1550 2313 1433 -308 1406 541 1148 947 485 206 2658 -334 -600
835f00L017k334n86J032P77j603N91j039K064n48l588M289L94m808J491N075n588
$$ -600 2417 83 -503 529 1306 -297 294 -745 1319 771 -2817 1472 1866 -2942 -1451 3624 -1964
852a964j325N514k035l209K369J951k992k3Q25J745k237j039L863k059k133K988
$$ -1964 -3289 2225 190 -3019 -650 1301 -1691 -1714 -889 856 -1381 -2420 1443 -616 -2749 239
868B39O79l319K635l9k820L852j653k509M539jo012N684J948p222M139L338n307
$$ 239 918 -2401 234 195 -2625 1227 -426 -2935 1604 1603 -4409 1275 3223 -3999 140 3478 -1829
885a829R99L692l803J734O04l015M022o26m716M698K932q575L898N368p227K64
$$ -1829 -830 2862 -941 793 1397 -1618 2404 1778 -2938 1760 4692 -3883 15 5383 -1844 -1580
901a580N173k106l263L321n28P02k081r82M548j840l955L423L406o562J98N421
$$ -1580 3593 1487 -1776 1545 1017 1719 -362 -1344 3204 1364 -2591 832 4238 -2324 -2126 3295
917C295j969m389K111N287n352l243O684J064r368M714O878r844N42Q008n410
$$ 3295 1326 -3063 -952 4335 -1017 -4260 2424 3488 -5880 -1166 5712 -4132 -3590 4418 -992
932i92l694P675m109j950N816n754J184N208o434j345J0069p970l598J1261n912
$$ -992 -4686 2989 -1120 -3070 2746 -3008 -1824 3384 -3050 -4395 5674 -2296 -5894 5367 -545
947e45m816Q703k241o196Q158k964m156Q271m900l432Q115k346p364R417p90p852
$$ -545 -5361 3342 1101 -5095 3063 99 -4057 4214 -686 -4118 3997 1651 -5713 3704 2914 -4938
963d938O991P73m623J571K627l288K535j097j405L829k580j585K569J465m568
$$ -4938 2053 2826 -1797 -226 2401 -887 1648 551 -854 2975 395 -1190 1379 2844 -1724
978a724J689K772j639k969J618N397p294j210Q294l169p851Q908K715j1981O996
$$ -1724 -35 2737 1098 -1871 -253 5144 -2150 -3360 4934 1765 -6086 2822 5537 -6444 552
993E52M107q107J975M670n739K031K792o622O308n66o989O817K625j0525O261
$$ 552 4659 -3448 -1473 3197 -2542 -511 2281 -4341 1967 1401 -5588 1229 3854 -6671 -410
1008d10O313j2218M959N952q603J368O499p166J155N963q018L696L397o674K246
$$ -410 5903 -6315 -1356 4596 -4007 -2639 3860 -3306 -2151 3812 -4206 -510 2887 -3787 -1541
1023a541N815p405J054O555p442J799M054m360K35L683l208j56L432l505J627
$$ -1541 4274 -3131 -2077 4478 -2964 -1165 2889 -1471 -1236 2447 -761 -917 2515 -990 637
1038F37L40j240J151n32n12K254j648k210O050m199k677O635k866m674O695n59
$$ 637 977 -263 888 356 -156 2098 450 -1760 4290 91 -2586 4049 1183 -3491 3204 2645
1054B645o505O720j006m202M291r18k518L626j719k841O261m290k462O753l782
$$ 2645 -3860 2860 1854 -2348 1943 1025 -1493 2133 414 -2427 3834 -456 -2918 3835 53
1069E3l646O614k587m804P449l026l843N972k193l591N790j797m655O926l094
$$ 53 -3593 3021 434 -4370 3079 53 -3790 2182 -11 -3602 2188 391 -4264 2662 -432
1084d32l452O438k434m138N807j391m108N538j823k708M070j833j489L377j959
$$ -432 -3884 2554 120 -4018 1789 398 -3710 1828 5 -2703 1367 -466 -1955 1422 -537
1099e37j152L847l767L00M053m354k5M805m181j243O180m857j030N308l564j189
$$ -537 -1689 2158 -1609 -1309 2744 -1610 -1635 3170 -1011 -2254 3926 -931 -1961 3347 -217 -1406
1115a406M173k666j327L918l430O16K674l471Q55K880l573O04L399m900J744K675
$$ -1406 2767 101 -1226 2692 -738 -122 2552 -919 -64 2816 -757 -153 3246 -1654 90 2765
1131B765m311J924K716m849J538L790o166K141L692n524J450L852m594JM356m761
$$ 2765 -1546 378 3094 -1755 -217 3573 -2593 -452 3240 -2284 -834 3018 -1576 -1575 2781 -1980
1147a980J289K464l616J355J556k841J111K403m797K945J209l738K587J063l587
$$ -1980 -691 1773 -1843 -488 1068 -1773 -662 1741 -3056 -111 1098 -2640 -53 1010 -2577
1162b577K036K238n001L695O45m014L043J395l965J958K703m850K548J413k903
$$ -2577 -541 1697 -3304 391 1036 -2978 65 1460 -2505 -547 2156 -2694 -146 1267 -1636
1177a636J649Q84k090J320J316l397L269n66k341L095p34j977K475K32l570M202
$$ -1636 13 897 -1193 127 1443 -1954 1315 749 -1592 1503 769 -1208 1267 1499 -2071 2131
1193B131q91l101L759p22k667K922M94m020L999k86l034K679j3j658J158L91k298
$$ 2131 1240 -1861 1898 1176 -1491 1431 1925 -2095 1904 1618 -1416 1263 1250 -408 750 1141 -1157
1210a157K689j466j094K742j982o62K555j619j886M011k220k127L799j831j420
$$ -1157 1532 66 -1028 1714 -268 -930 1625 6 -1880 2131 -89 -2216 1583 -248 -1668
1225a668K660q14k680L662j358k010L100j232j355K117j63k355K854j245j080
$$ -1668 992 178 -2502 1160 -198 -2208 892 -340 -1695 422 259 -2096 758 -487 -1567
1240a567K096j246l96J382m06j151K261j988n3K395k719O61J577j111r45K706
$$ -1567 529 -717 -1113 269 -137 -1288 973 -1015 -1068 1327 -1392 -731 846 -265 -1210 1496
1256A496j692n09K409k076J09R36k03q08J407j009J36J158j872J490j32j179P87
$$ 1496 -196 -705 1704 -372 -263 673 470 -338 1069 60 196 1354 -518 972 840 -339 448
1273D48J143k139O96J569k764J885O16k086P24J981k837N48J995k647N54J658
$$ 448 1591 -548 148 1717 -1047 838 1454 -632 92 2073 -764 -216 1779 -868 -314 1344
1289A344j347r51J875q51q59J636j180N7L04l41k1M02p20J82O76j210P50Q6l63
$$ 1344 -3 -954 921 70 -789 847 -333 -276 28 -313 -334 68 -652 -470 206 -1004 -254 -168 -531
1308e31q6M06l77K44J79j190J152J2o66M37O32r42K90P82j180N65j25J82L43m50
$$ -531 -617 -211 -588 -344 -165 -1355 -203 -191 -857 -420 212 -730 -440 342 -838 -273 -398 -216 127 -323
1328c23p8J027q00o64J932q37j177J590L28j724J152R74j962J141M19j434M04
$$ -323 -401 626 -174 -838 1094 257 -920 670 998 -726 426 1400 -562 579 998 -436 -32
1345c2J453j575K6J739j556k53J268k25j528J717j99j322N98R63j133l10J458
$$ -32 1421 -154 -128 1611 55 -198 1070 845 -683 1034 835 -487 111 1074 -59 -369 1089
1362A089j036k80M44O9o18K99K77o82R76r61l8O39n45n95R03M39j584J180J03
$$ 1089 53 -227 217 286 -332 -33 244 -438 538 -423 -461 178 -367 -962 -59 380 -1204 -24 79
1381G9q70j57J251q64m83J451j426N99L21j47m20J127r15q60K283j315q35J557
$$ 79 -791 -948 303 -561 -1044 407 -1019 -420 -99 -246 -666 461 -454 -1314 969 -346 -1181 376
1399C76M43k705K225R10k767J638J027j599k70K157k086J7K128j687k31J815q21
$$ 376 819 -1886 339 1249 -1518 120 1147 -452 -722 1435 -651 -634 1494 -193 -424 1391 570
1416E70j325J953m97j761K072k04j124R76P29j813J105J19j290J121J01q27N9
$$ 570 -755 1198 701 -1060 1012 808 -316 660 1389 -424 681 800 -490 631 732 -95 -36
1433c6J342j870P17O95j229J18J187p87j022J834j126m44R40Q1j018M68N37j753
$$ -36 1306 -564 153 848 -381 -263 924 137 -885 949 -177 -621 319 400 -618 -150 387 -1366
1451a366J334L20j169N05O25j302J36J857k084J8J592o80j186J646k2j885J791
$$ -1366 -32 288 -881 -376 249 -1053 -917 940 -1144 -1126 466 -214 -1400 246 224 -1661 130
1468A30j14j119Q44R47j666M69J149j557Q08P22r60n9J207j158R1J171j357N75
$$ 130 16 -1103 -259 688 -978 -509 640 -917 -109 613 -347 -406 801 -357 -266 905 -452 123
1486A23L00k40m04J174r83j21J246j366N59J66O9q21J266l13j111J478q41k28
$$ 123 423 183 -221 953 -30 -151 1095 -271 288 454 523 -298 968 655 -456 1022 181 -47
1504d7K76N47r00J60Q66q54L22O6j27q83J213k15o39O79k46o04LR14j038J79M77
$$ -47 229 776 -124 36 902 48 370 436 309 -574 639 424 -215 464 218 -386 -383 531 -507 -328 149
1525A49m41k75O36k45r85J633j010j27M04J26n80L40L81p86O14k57j46L48K50
$$ 149 -292 -567 69 -176 -1161 472 -538 -665 -261 -135 -715 -375 6 -780 -166 -423 -569 -221 29
1544B9n45O30k80o58J028m40j20N20P0o83O09L09q59M31L0r0r9Q76n44j32N03
$$ 29 -516 114 -166 -824 204 -236 -356 164 234 -449 160 469 -390 41 71 -19 -118 758 214 82 585
1565E85n38K97m1K34l66M33j68L5K27k74L2n33P43k96j81l8N10o16l54P63n67
$$ 585 47 344 303 537 171 604 436 471 698 424 456 -77 666 370 189 151 661 45 -309 454 -113
1586a13L31M27p14l00Q73m19n63P49m15k02O51k61m60N28j38p34J062n61j57l3
$$ -113 218 645 -69 -369 504 85 -478 271 -144 -346 305 44 -416 112 -26 -760 302 -259 -416 -449
1606d49K36n52O41l20j69Q14o69j9L79J8n82Q31k57n46P54l83J65n29Q05m43k4
$$ -449 -213 -765 -124 -444 -613 201 -468 -487 -108 -90 -672 159 -98 -644 110 -273 -108 -637 168 -275 -299
1627b99N60l55Kk14N60m58J12L18j49J10K2N35j052R47l32l42N48o0n47L10R73
$$ -299 261 -94 -92 -306 254 -204 -92 226 77 187 209 744 -308 639 307 -35 513 453 -94 216 1189
1648A189j149K81K61k43j7M13n24l71J001q78K60J62j85l53K49J45m92Q09o53
$$ 1189 40 321 582 339 322 735 211 -160 841 -37 223 385 200 -153 96 241 -251 558 -95
1667i5J01m8O1j17L8j70j89O88n76k1J12j60p3J81K53o20M58k08J13l23N16j11
$$ -95 6 -42 19 -98 -60 -230 -419 269 -307 -328 -216 -376 -449 -268 -15 -635 -177 -385 -272 -595 -79 -190
1689a90j33K58l48J79k78O99n76p1M41j91J75j6M47q84N43L43o05J47N35l97l58
$$ -190 -323 -65 -413 -234 -512 187 -389 -460 -19 -210 -35 -51 396 -488 55 398 -207 -60 475 78 -280
1710b80R10o20K6O27l16n59N83K51p94P35r9k20k7M71o56KO54p22L94q5n2k22
$$ -280 630 10 36 663 347 -212 371 622 -172 563 464 244 217 688 32 34 688 -34 360 275 223 1
1732AM86j52m39N72m46K59r4q7K06j20j91q1Q5j10J74k97K59m34K80Nk75K96R5
$$ 1 487 335 -104 468 22 281 187 100 306 186 -5 -86 -1 -111 63 -234 25 -409 -129 -124 -399 -103 -8
1755hl58j11N03k13l59M79Mp00M14P60j232O37L79o83J44N40o66P2J101r09j45
$$ -8 -366 -477 26 -187 -546 -67 -63 -763 -349 411 -821 -184 195 -488 -344 196 -470 -398 703 -206 -351
1776c51R60o26k12M89Q5r35J110l49l22L68K75o02L90K03o56O05q8j45j32O41
$$ -351 609 -17 -229 260 345 -590 520 171 -151 217 492 -110 280 483 -173 432 344 199 67 708
1796G08m94k2K28m38L27J09k38j37L1J80l73M37Qm46J9M45o82L46M62q90L02L59
$$ 708 214 192 420 -18 309 418 180 43 74 254 -119 318 326 -120 -101 344 -338 8 470 -420 -118 241
1818B41k31m28O95l85l62P47p0r04P24N36j499Q95L22j001K82Q55r76j37J033
$$ 241 10 -418 277 -108 -470 277 207 -697 27 563 -936 -41 281 -720 -438 417 -559 -696 337
1837C37r02R4N56m57r5N27k60k61Q02j56o95L58K54n22P98l23l93N71l29J49j84
$$ 337 -565 -471 85 -372 -467 60 -200 -461 341 185 -510 -152 102 -420 378 55 -338 233 -96 53 -131
1858a31M70k75J09L65m69K2j4K50k58J77Jo03P40k7j64n0N48q37J80L30m77J35
$$ -131 339 64 173 538 69 91 77 327 69 246 247 -356 384 357 193 143 691 -146 34 364 -113 22
1880B2L89l2o16R37p37l25P92k61p08J109l74r73R83j34o93K92O14n32k44Q42
$$ 22 411 379 -237 700 -37 -362 430 169 -539 570 196 -777 206 72 -621 -329 285 -247 -491 351
1900C51r23N7M63l10M7K35j71j48M41q44Q15j93j33J33J02k4j74N03p15N95m37
$$ 351 -572 -515 -52 -362 -315 -80 -251 -399 42 -802 13 -180 -313 -180 -78 -102 -276 227 -488 107 -330
1921c30O5M6m3M54l70L57j79J74l60L38M13o21N10m29J70l22O99r07K86Q77j078
$$ -330 -265 -219 -262 192 -178 179 0 174 -186 152 565 -56 454 25 195 -127 572 -335 -49 828 -250
1942b50N19J66m17o7Q41p33m68J147o74m58P75K10r58R26n45l21R42o46k98N17
$$ -250 269 435 18 -49 792 59 -409 738 64 -394 381 591 -367 559 14 -307 635 -11 -309 208
1962B08J28q63Q01r4l12J36k58K30Nr6l53P73p17j14P53m77l4K5m8r3M81l90p3
$$ 208 336 -527 274 180 -132 4 -254 -24 -19 -115 -468 305 -412 -526 227 -250 -284 -259 -307 -400 81 -309 -382
1985c82N12o85N44j15j54J01K34n23L61K67q32P62L5m34J12R52j206O06L03j043
$$ -382 130 -555 -11 -126 -280 -179 55 -468 -107 160 -672 90 125 -309 -197 755 -451 155 458 -585
2005e85O71K80p58J02J080j145K32Q44j053N19L44n22M5N87n32L1N70q38L17K51
$$ -585 86 366 -392 -290 790 -355 -123 721 -332 187 531 9 54 641 109 140 710 -128 189 440
2025D40l93J14M86p45L86qm48L48K33l02o5M06o10M23k62m12O37j11l62J74K3
$$ 440 47 161 647 -98 288 280 -168 180 413 111 46 452 -158 265 3 -409 228 117 -245 -71 -48
2046d8m81Q29p44K1Q51q01m5M15K2p56J171m02p53J258j044j20J059l30p17Q27
$$ -48 -529 300 -444 -423 428 -373 -418 -3 19 -737 434 32 -721 537 -507 -627 432 102 -615 212
2066B12l21p32J262o06k64P17o4p20R41q7p29R23l28m47L99Ll90P98o9q65J007
$$ 212 -109 -841 421 -185 -449 268 204 -516 425 338 -391 532 204 -243 156 159 -231 567 498 -367 640
2087F40n79J05L80l04l36M95k43j87P00p56L20M66n61n4M83p84J78N61p01L25
$$ 640 61 166 546 242 -94 401 158 -29 671 -85 235 701 140 86 569 -215 -37 524 -177 148
2107A48M61r04K51O93q04k7Q50j130O26L19j093L70O87j000K52R89j232L38K92
$$ 148 609 -295 -44 649 -155 -182 668 -462 164 483 -610 -240 447 -553 -301 688 -544 -206 86
2126H6k86m06J048q56K0P39o57M5K86l35P2K71j95m07M47m14P17n0l44L97Q1n70
$$ 86 -200 -606 442 -414 -394 345 -312 -267 19 -316 -244 27 -168 -575 -128 -542 175 125 -219 178 259 -311
2148c11L59K38o50P72k88l57K48M49o62K22N62q05O09l7m92M69R0l72K20N13j080
$$ -311 48 286 -364 408 120 -237 11 460 -202 20 582 -223 386 349 -143 326 416 44 264 777 -303
2169c03O56L9o64N02J7n08L91M72j127R93j82m93K05M02p89K72M56q87O18j36
$$ -303 353 392 -272 230 247 -261 130 602 -525 468 286 -207 -2 400 -389 -117 339 -548 70 -66
2189f6o8n0J23j49J09k0k86P31o42K94K43o61j52N28q8l49O57n43L43L82o50R
$$ -66 -134 -184 -61 -210 -101 -121 -407 324 -318 -24 219 -442 -594 -66 -154 -503 154 -389 -46 336 -314 -305
2211c05L31m88J30O29p38K53M28l11j37K84j87k95P98n63n0Q06o35k56Q87n76
$$ -305 26 -462 -332 297 -441 -188 240 -71 -208 76 -111 -406 392 -171 -221 585 -50 -306 581 5
2231Ej34Q87p20k56M53%k23L74m0m59O28m45K03j17J10j38k4M86n81J78l75N40
$$ 5 -129 758 38 -218 235 235 12 386 346 -113 515 70 273 156 266 128 104 590 9 187 -188 352
2253C52k69k09J64Oj63L27j43o34R18j55n78P41k49l47K25J47p91P76n7m47L81
$$ 352 83 -126 38 44 -119 208 65 -569 349 194 -384 357 108 -239 -14 133 -658 118 61 -386 -5
2274eJ51o64M78L14q80O47J83p12J69M46n90J63K83m89O20Jo93L09M13k06j65
$$ -5 146 -518 -40 274 -606 41 224 -488 -319 127 -463 -300 -17 -506 114 115 -578 -269 144 -62 -227
2295b27M07m35O23n26oj47L85K7j89K89k62O8k1J53K4moq2q9MN56n84J14J66k19
$$ -227 180 -255 368 -158 -164 -311 74 101 -88 201 -61 7 -14 139 163 159 153 71 -18 -14 542 -42 72 238 19
2320A9K41R0j29j12K58o32L66L09l28l24L50L3m11N43l25N4K91m82K0M1J38k39
$$ 19 260 350 221 109 367 -265 101 410 82 -242 108 141 -270 273 -52 2 293 -189 -169 -128 10 -229
2342b29M25l75j18K78k99J62J00l8l37L11J08k53J47j6J9k28L98k62J18j71k9
$$ -229 196 -179 -297 -19 -318 -156 -56 -94 -431 -120 -12 -265 -118 -134 -115 -343 55 -207 -89 -260 -289
2363b89R0J85J42l16R4j83M58m67L53p3n3J96k47K41q8M32l70J11k87j77L22m4
$$ -289 -199 -14 128 -188 -94 -277 181 -286 67 -6 -59 137 -110 131 43 475 105 216 -71 -248 74 30
2385C0L86m54L36l12j80J77J14J73m55M04k78L54l27O1M8n6L38m72M75j28l3l47
$$ 30 416 -38 298 -14 -194 -17 97 270 -185 219 -59 295 -32 29 77 21 359 -113 362 234 201 -146
2407a46L40o7m5p9k08L62j86K02n4k88o2J93L3k03M3O7N2oj35L39k64M5k53J90
$$ -146 194 127 82 3 -205 157 -29 173 119 -169 -231 -38 -5 -208 -165 -98 -46 -52 -187 152 -112 -67 -320 -130
2431a30j42L03l49K19L5k28L04j20K40n20M15n5j12J99l45K08Q6J20l66J01K22
$$ -130 -272 31 -318 -99 -64 -292 12 -108 132 -388 27 -28 -140 59 -286 -78 8 128 -238 -137 85
2452H5j32J40J28j17j01L03m00L61o6o4O7K03m51j4K77k70J38J02j38J00j33L97
$$ 85 -47 93 221 104 3 306 -94 267 201 137 204 407 -44 -58 219 -51 87 189 51 151 18 415
2474D15n66O58n35RL70j81k04j05j1J41k3j90K60p0J4k3l31N85l10J99j08j8j06
$$ 415 -151 507 -28 -19 351 170 -34 -139 -150 -9 -32 -222 38 -32 -18 -41 -372 213 -97 102 -6 -24 -130
2497a30k3L64o32K96k2j0k08M81k77j83K87k55K77K7j52k08M08j14k82K60N0j33
$$ -130 -153 211 -421 -125 -147 -157 -365 116 -161 -344 -57 -312 -35 -8 -160 -368 40 -74 -356 -96 -46 -179
2519a79J79nj82M17L9o91L91K01j01J07K94o68K26J91k93K34K51l20J34M8j91
$$ -179 0 -5 -187 230 269 -422 -31 170 69 176 470 -198 28 219 -74 160 411 91 225 273 82
2540H2No6K67j46N5K4k59L49k88L20k33l9J88m94N80k66m22N31k1m49K93M2l14
$$ 82 87 21 288 142 197 221 -38 311 23 343 110 71 259 -235 345 79 -343 188 167 -282 11 53 -261
2563b61L47L79l66k51K88l28J85K41o14J39K09p0k61O84o18m5O95l85p5MK0j79
$$ -261 86 465 99 -152 136 -192 -7 234 -380 -241 -32 -102 -363 321 -297 -342 353 -32 -107 -103 -83 -262
2585b62K42O9k98L47m33K13J59K14m36J99j12M9r6J74J77p6L0k32P3L95m44K0
$$ -262 -20 49 -249 98 -335 -122 37 251 -185 14 -98 -49 -145 29 206 130 160 -72 1 396 -48 -28
2607b8J70k8J7K39l47pJ45j35K70j88Q4j76l2Q4K24m38O40k68m24M74j44k63J72
$$ -28 142 114 131 370 23 16 161 26 296 108 192 16 -16 68 292 -146 494 226 -198 276 132 -131 41
2630D1L72n55K63J95n22L08o3j47JK60m87K85M77m63J2K57m67lJ69o9J07J94m33
$$ 41 413 -142 121 316 -206 102 39 -108 -107 153 -334 -49 428 -35 -23 234 -233 -236 -67 -136 -29 165 -268
2653b68J45K21M3n41K62M4m48O47l94K02k8L34m61K71j8l52K53N6L23m93K91K78
$$ -268 -123 98 141 -400 -138 -94 -542 105 -289 -87 -115 219 -242 29 11 -341 -88 -32 291 -202 89 367
2675C67l75j13J63K1k09L23k49RK01r2k4K52n02j8M17r3J59MJ55n72L46jj61L96
$$ 367 -8 -121 42 63 -146 177 -72 -63 138 46 22 274 -228 -246 171 78 237 241 396 -176 170 169 8 404
2699D04m43m5K69m4k3P4O6q06P29l30j68O8L61l26P0K3k46L13m2O5k75K11j37
$$ 404 -39 -84 185 141 118 192 258 -548 181 -149 -317 -249 112 -214 -144 -121 -367 -54 -96 -31 -306 -95 -232
2722b32j52L96k6M1q1P8n15N08j35m8p8J75J82n06M92O7j85l00M39k15K20k13
$$ -232 -384 12 -14 27 -54 24 -491 17 -118 -166 -244 -69 113 -393 99 166 -19 -319 120 -95 125 -88
2744h8j78L50J43j57j30N09m38O3R8k77K44M5k20K1K38k51J17L08l53J33J83l35
$$ -88 -266 84 227 70 -60 449 11 74 172 -105 139 184 -36 -15 223 -28 89 397 44 177 360 25
2766B5J0K21l90j35P17k23l29L20j2m99L75N8m22N51Rk44M0J98l26j42L38l22
$$ 25 35 256 -134 -269 448 225 -104 216 204 -295 80 138 -284 267 276 32 72 270 -56 -198 140 -182
2788a82R9p2K60n85L78q6M8J67mm32j15N88k71K91k16M3J5k92K62j97K91l25L16
$$ -182 -83 -155 105 -480 -102 -188 -140 27 23 -409 -524 64 -207 84 -132 -89 -74 -366 -104 -301 -10 -335 -19
2811a9J05j19l1J05j43O2J03k84L66k43K73nJ11jl61K88j54j0j76L62k93J37J30
$$ -19 86 -33 -64 41 -102 -40 63 -221 145 -98 175 170 281 280 -81 207 53 43 -133 229 -64 73 203
2834B03k63K76l02J06o2L45j29k09lN2j22Q3J28K6K18j94j40K41L7j95l8N5j64
$$ 203 -60 216 -86 20 -42 303 174 -35 -38 14 -108 -25 103 129 347 153 13 254 291 96 58 113 -51
2857e1J22q7M9K9j48J89r1j06p1j4P5k55L59j62oq7L84k74L3l0m23N09l35O02
$$ -51 71 -16 33 62 -86 103 12 -94 -165 -179 -104 -359 0 -162 -168 -255 129 -145 -112 -142 -565 -56 -391 211
2881B11j49j70J11j73j36J89K99l52M0J01J40j68J65j74J68Q3k76J57J16j78n5
$$ 211 62 -108 3 -170 -306 -117 182 -170 -130 -29 111 -57 108 -66 102 185 -91 66 182 4 -51
2902e1K04j11l4J66k42K89j54n8L6L9M5j77K18m6K22l22K87k90J62j65j52M06
$$ -51 153 42 8 174 -68 221 67 9 45 84 129 -48 170 124 346 24 311 21 183 18 -134 272
2924B72k82J29K1M6k35M06m82Q5L28j08k95o7L71l62J66n4k99M25j48J83o7l4
$$ 272 -10 119 140 186 -49 357 -125 -40 288 180 -115 -182 189 -173 -7 -61 -360 65 -83 100 33 -1
2946an56O14k01k02N27m34J57k1J05l66L54K0j08K63n54N70m24J36K45k19M0P9
$$ -1 -557 57 -144 -346 181 -253 -96 -117 -12 -378 -24 -4 -112 151 -403 167 -257 -121 124 -95 -55 24
2968B4m1J42J52j93j33m9J02j75J50L24o10L54J98l44M44l4k36j48M09l82Q6J27
$$ 24 -17 125 277 84 -49 -98 4 -171 -21 303 -307 47 245 -99 345 311 75 -73 336 -46 40 167
2990A67j3l28L98j93q3K07k65L73l5j87k4R3j60P7j46J18K4j46m8J46J61j14R7
$$ 167 154 -174 224 31 -52 155 -110 263 228 41 17 110 -50 27 -119 -1 23 -123 -171 -25 136 22 119
3013A19J57m26R7o5J14j47K0J26K3J1k43k3J06j15L15n1q8r8K95m64K64r2J25
$$ 119 276 -150 -53 -118 -4 -151 -131 -5 18 29 -214 -237 -131 -246 69 18 -70 -168 127 -337 -73 -165 -40
3036d0J37m8l75N71k54j97N37k29l94M57M1n68M84k76j18L08p9K12j87Q2L6K19
$$ -40 97 49 -326 245 -9 -206 331 102 -292 165 206 -362 122 -154 -272 36 -43 169 -18 64 100 319
3058C19l9j71K03j39k94M18k42p2J42J34m11L03j07J02k08P2k51L02l63J75J79
$$ 319 280 109 312 173 -121 297 55 -17 125 259 -152 151 44 146 -62 10 -241 61 -302 -127 52
3079E2j50K2K22j58m0j48J72q5J20O6j66j99j7J22K00q6j7M17p27N65n4l74K94
$$ 52 -98 -76 146 -12 -52 -200 -28 -113 7 73 -93 -292 -309 -187 13 -73 -90 327 -400 165 111 -263 31
3102C1j96k64K47L93k31nK5l58M1L37j46R8K63k53j9K51l84J59l8K8MK54k45L67
$$ 31 -165 -429 -182 211 -20 -25 0 -358 -317 20 -126 -28 235 -18 -37 214 -170 -11 -49 -21 -17 237 -8 359
3126C59k96j04Q1J28k44K34Qj95K68k41k4m6J60L0k10J78l0J84j60j72P0j62K24
$$ 359 63 -41 40 168 -76 158 166 -29 239 -2 -26 -72 88 118 -92 86 56 240 80 -92 -22 -184 40
3149D0J5j8k71L97r1j37L57k77J1j5k7k46L99j42k81L05j25j12M74j08l98L14
$$ 40 55 37 -234 163 72 -65 292 15 26 11 -16 -262 137 -5 -286 19 -106 -218 256 148 -250 64
3171F4L5l65K97p0j29J82j13k78K82L5j73L24j01j36N4K24l65J89p8J33o9J48
$$ 64 99 -266 31 -39 -168 14 -99 -377 -95 -60 -233 91 -10 -146 -92 132 -233 -44 -122 11 -58 90
3193I0J8PJ89l44q5K75k34M38m87J35rj44M26k35L2j87K98j57L22l24L7KL05m85
$$ 90 108 115 304 -40 -125 150 -84 354 -133 2 -7 -151 275 40 72 -115 183 26 348 24 61 63 368 -117
3217a17jK90l50K28QM9l09N32k72r0K41j57M7L06k68j67K07k71j80M04k69p4J31
$$ -117 -118 172 -178 50 58 107 -202 330 58 -32 209 52 99 405 137 -30 177 -94 -274 130 -139 -213 -82
3240h2K2l15K62o0R4N9q5J2j2J27j36J05R2j91J14j77L56l66J53L8k8K53j91j19
$$ -82 -60 -375 -113 -173 -79 -20 -105 -93 -105 22 -114 -9 83 -108 6 -171 185 -181 -28 10 -18 235 44 -75
3264g5K15J55m32J47J29n0k81M64m16n3L71l34J34J41K51m76M74j81n35O74j71
$$ -75 140 295 -137 10 139 89 -192 272 -144 -197 174 -160 -26 115 366 -110 364 183 -352 322 151
3285A51k3o2N7j46K01k17p3L26N8m07K84P4l37J57J63m49L32j59J13o2J11l33
$$ 151 128 66 123 -23 178 -39 -112 214 272 -135 149 223 -114 43 206 -243 89 -70 43 -19 92 -241
3307b41kL04p2k8M2O9k28L0J29k07L62k01j55J9J50J10k31m6L32j38j84K15n3
$$ -241 -243 61 -11 -39 3 72 -156 -126 3 -204 158 -43 -198 -179 -29 81 -150 -196 136 -2 -186 29 -24
3330b4J43j83J26j21J50k91J00L20k30P0N5j57J07o0k2O5K37n13K79k4J96l42
$$ -24 119 -64 62 -59 91 -200 -100 220 -10 60 115 -42 65 5 -17 48 285 -228 51 27 223 -119
3352a19K25Q9l39L92j93J39k83J53j75K51O3J58l46J4j2m6O2k51M89k97R0n7N5
$$ -119 106 195 -144 248 55 194 -89 64 -111 140 203 361 15 29 17 -29 33 -218 271 -26 64 7 62
3375F2j26RJ66j38j80J64%J74k20J59R6j00l5j52K66l28L76R9j93j68K0R8k01
$$ 62 -64 -55 111 -27 -207 -43 -43 131 -89 70 166 66 31 -121 145 -183 193 292 99 -69 -49 49 -152
3398a52J87k69K23J16j93J4j90J00l16M31k12R2M6MK47j90j41L51k39J03J53j76
$$ -152 35 -234 -11 105 -88 -74 -264 -164 -480 -49 -261 -169 -123 -119 128 -62 -203 148 -91 12 165 -11
3420a1O2J13J9k54K52J20l32O6p5J80j00J07k54J30Q1j26K21k66J71j20J75l23
$$ -11 51 164 183 -71 181 301 -31 35 -40 140 40 147 -107 23 104 -22 199 -67 104 -16 159 -164
3442a64l7J99j22J46P3j31j52L90l10J03K29j03j3j13k21P7O1j49LJ17J33j46
$$ -164 -201 -2 -124 22 95 -36 -188 202 -108 -5 224 121 108 -5 -226 -149 -88 -237 -234 -117 16 -130
3464a30J43j34l2K04k69J18R6Q4jk16M7R5K7q4J87k58j34K68m47M57P0p4J4J57
$$ -130 13 -121 -153 51 -218 -100 -4 80 79 -137 -90 5 32 -52 135 -123 -257 11 -436 21 91 17 31 188
3488A88k84O5J98k16j51J55L10j11k99N19m54L58r6j82J1K5NK58l02j92L80j22
$$ 188 -96 -31 167 -49 -200 -45 265 154 -145 374 -80 278 182 0 11 36 41 299 -3 -195 185 63
3510F3O9Rr3r4J86o6k59N24m42J85j70K67o0K7j11k08L66l0l79J91l36K05K25
$$ 63 132 141 48 -46 140 74 -185 339 -103 82 -88 179 119 146 35 -173 193 163 -216 -25 -361 -156 69
3533F9r1n6K75k88J87m2J1k55Q1r4K04m2k23Q2L8J28q6k14L57l50K09O0K55j23
$$ 69 -22 -78 197 -91 96 54 65 -190 -109 -203 1 -41 -264 -182 -144 -16 -102 -316 41 -309 -100 -40 215 92
3557I2k15J45n0k11J73K83k97J15K6k30K83J11l36NK42p7j66K01k74J63J14O5
$$ 92 -123 22 -28 -239 -66 217 -80 35 61 -169 114 225 -111 -106 136 59 -107 94 -180 -17 97 162
3579A62m5lq2J09j06k03K87k58K88l68K69K2j53j0K86p7j64L39j82L3j22j88L32
$$ 162 117 114 32 141 35 -168 119 -139 149 -219 50 72 -81 -91 195 118 -46 293 111 144 22 -166 166
3602A66k96j38L01k67J53K58m01N7J24k95J53J65k02J43j64j42L15J11l12LQ7
$$ 166 -130 -268 33 -234 -81 177 -224 -167 -43 -338 -185 -20 -222 -79 -243 -385 -70 41 -271 -268 -181
3623a81N7J12j29l38O73Rk11J35k36K18l03L61l98K54l8k3P6mj18J07O7M0o7j30
$$ -181 -124 -12 -141 -479 194 203 -8 127 -109 109 -194 167 -231 23 -15 -38 38 34 -84 23 90 130 63 -67
3647f7K4K5J49j69K00Q1J50k67k02K42Nl14J58J12n4p5JJ15M5k83Q5J30k34K24
$$ -67 -43 -18 131 -38 162 243 393 126 -76 166 171 -143 15 127 73 -2 -1 114 159 -124 -39 91 -143 81
3671H1J5J2O0j79q1L9j6Kj30l3K31j61n1K78l54K31J9j09p0L68k85k8RJ30r5P5
$$ 81 96 108 168 -11 -92 -53 -69 -67 -197 -230 1 -160 -211 67 -287 -56 -37 -146 -216 152 -133 -161 -152 -22 -117 -42
3697d2P0k14M63m84J70m7l9J94k2R3r7No4k11K77J11j86j6L52k09J7k84k7Q1L28
$$ -42 28 -186 277 -207 -37 -84 -123 71 49 142 45 50 -14 -225 52 163 -23 -39 313 104 121 -163 -190 -109 219
3722B19k0r6o1K66j55k74K61p2k26L65k1op8Nj18O0n4j52K77k6j19o9K22j27M1
$$ 219 199 103 42 308 153 -121 140 68 -158 207 186 180 102 107 -11 49 -5 -157 120 94 -25 -94 128 1 42
3747D2J36j57Q1J21k31j43O1P0l2m4J11l4M1j45o6J33J66m80M90k03J1n0j09K42
$$ 42 178 21 102 223 -8 -151 -90 -20 -52 -96 15 -19 22 -123 -189 -56 110 -370 120 -83 -72 -122 -231 11
3771A1q3k6m9KJ83L9N5M4j37P1k97J87Q1n5K73l96K79k00n6k7J72p5N1J83k6j94
$$ 11 -72 -98 -147 -145 38 77 132 176 39 110 -187 0 81 26 299 -97 182 -18 -74 -101 71 -4 47 230 204 10
3797A0o8q7j03M31n7p3j1J33K3k70Q2j40L7J28j46M22k68q4K40Q7k67O8K60m67
$$ 10 -58 -145 -248 183 126 53 42 175 198 -72 10 -130 -93 35 -111 311 43 -41 199 286 19 87 347 -120
3821a20Q8l4L5J35j6k44K41p1p6j5R3j24J69Q3j93O8k16J02m6j6r9P0j7L19j7
$$ -120 -32 -66 -31 104 88 -156 85 14 -62 -77 16 -108 61 144 -49 19 -197 -95 -141 -157 -256 -186 -203 116 99
3846I9q6j17O7m2p8J20L5PR8P4k55J92k08J79k95M0J80J78j95J2P8j31K48Rk20
$$ 99 13 -104 -37 -79 -157 -37 -2 5 103 177 -78 114 -94 85 -210 -170 10 188 -7 5 83 -48 200 209 -11
3871a1NJ97k03L66j11r7k16K24l50K40K2J0j11J41r5N4M6j50j40L68j55k11K37
$$ -11 -6 191 -12 354 243 146 -70 154 -196 44 66 76 -35 106 11 65 111 -39 -179 189 34 -177 60
3894F0r0j19N2P3n4J86l5O1k5l92k6L19M4l17J44J76l8j23j14J02j86L62j37%
$$ 60 -30 -149 -97 -24 -78 108 73 134 109 -283 -309 10 54 -263 -119 57 19 -104 -218 -116 -302 60 -77 -77
3918g7J50k4l6P3k86J55M2R1j81J21p4m0j4L43m93K10P9K6j22J99l07K93j26R5
$$ -77 73 49 13 86 -200 -45 -3 88 -93 28 -46 -86 -100 243 -250 -40 39 65 -57 142 -165 128 2 97
3942I7n2m2J28p5J12k20q3m1M50k01O5j04o0K29k65j41L51R1m9k0l20R3J37P3
$$ 97 45 3 131 56 168 -52 -135 -176 274 73 138 34 -26 203 -62 -203 148 239 190 170 -150 -57 80 153
3966A53j28j9l87M14p3K94k60K0O2m5m6j92K29q6k1l7l6K00k11K73l29K88j3j72
$$ 153 25 6 -381 33 -40 254 -6 14 76 31 -15 -207 22 -64 -85 -122 -158 42 -169 104 -225 63 50 -122
3990a22K16k20p4K8J60p1j03j87J86J14j09K46k98J87j32j72M61j45l9P5j44J05
$$ -122 94 -126 -200 -172 -12 -83 -186 -373 -187 -73 -182 64 -234 -47 -179 -351 110 -35 -74 1 -143 -38
4012c8n0O1J24Q1j11nop5K8j28K09M9j17lK10r5j22j3Q1n5J81n6j6l16J23J44
$$ -38 -88 -27 97 178 67 62 56 -19 9 -119 90 139 22 19 229 134 12 -1 80 25 206 150 134 -182 -59 85
4038H5j59N7l9K51m98K57J10p4J55l72K51m5p9J12j02o5n5Q8K17k1l70K15R5Q1
$$ 85 -74 -17 -56 195 -303 -46 64 -10 145 -227 24 -21 -100 12 -90 -155 -210 -122 95 74 -296 -81 14 95
4062I5l16rO5J06r7J99Ko8J41j50q9K68l31J58k04J35JN0j2J8Q4k92M67k50J79
$$ 95 -221 -230 -165 -59 -156 43 45 -23 118 -32 -121 147 -184 -26 -230 -95 -94 -44 -56 -38 46 -246 221 -29 150
4087A50o9n1l13K40O1k62K68J43m8o0L4j46K45k85J64j16P1K9n3L9n3R5R9j7n1
$$ 150 81 30 -283 -43 18 -244 24 167 119 59 93 -53 192 -93 71 -45 26 55 2 41 -12 83 182 165 114
4112A14j28O5M1Nj08J37o7q1j33K68j00k3r2j93q1L58K02l62j07P5K8L08j72k81
$$ 114 -14 51 92 97 -11 126 59 -22 -155 113 13 -10 -102 -295 -376 -18 184 -178 -285 -210 -182 126 -46 -327
4136c27J75m4j03K79o2K46j26j63P6R2q7Q3Ql7L14n18K17o6J38K6M9k13J26j28
$$ -327 -152 -196 -299 -20 -82 164 38 -125 -49 43 -44 39 47 10 324 -194 23 -43 95 121 170 -43 83 -45
4160d5Q4n9J72k17m6J98k54K12j27J27k34J14N4J50j51J90K9j40K7j07K42J09
$$ -45 39 -20 152 -65 -111 87 -167 45 -82 45 -189 -75 -21 129 -22 168 197 57 84 -23 219 328
4182C28m69Q7P5Q0j82K08j66M3j69K54q1K69j81K34l57K5j37K38k24K63o4k63
$$ 328 -141 -54 21 101 -81 127 -39 4 -165 89 8 277 96 330 -27 -2 -139 99 -125 138 74 -189
4204a89J14L9l5L8J1O3J5k89K65O5j4K6n3j94j73J89J23l8K33n22K80k1J41n3
$$ -189 -75 -36 -71 -33 -22 41 56 -233 32 97 83 109 56 -138 -311 -122 1 -37 196 -326 -46 -67 74 21
4228B1l1J79p8q6j6L0j19K5j04JK95J1l09J15J98l03J87K82j98k03J25R9L4L9
$$ 21 -10 169 91 5 -11 19 -100 -75 -179 -178 117 128 -181 -66 132 -171 16 298 100 -103 22 121 155 194
4252A94k13K2M2r1K2J00K2j06K10n3m9j44J36o1j42J26J04l35K39Q9k4k54K54
$$ 194 -19 3 45 -46 -24 76 98 -8 202 149 100 -44 92 31 -111 15 119 -216 23 112 88 -166 88
4275H8R6j60P0m2j80m3L01j81P1r0j2P6J75q4k70L13j7k42K65k19m2K0J03j22
$$ 88 184 24 94 52 -128 -171 130 -51 20 -70 -82 -6 169 85 -185 128 111 -131 134 -85 -127 -107 -4 -126
4299a26K7j03j9N9K74j81r8N6Q3J41P4j10l2j05j35J94p2K56j28j98K38j67j6
$$ -126 -99 -202 -221 -162 112 -69 -167 -111 -28 113 187 77 45 -60 -195 -1 -73 183 55 -143 95 -72 -88
4322h8J69j96J42J61j78J7n5K3J74P4j62j67J68l52L86j8P7p8j15J09k79M36j59
$$ -88 81 -115 27 188 10 27 -28 -5 169 243 81 -86 82 -270 116 98 175 97 -18 91 -188 248 89
4345H9k50J88j26n0J51J40k40j00J30L3l8q5l4J60Ol2k6k0P8m07L79N9j95O9k08
$$ 89 -161 27 -99 -149 2 142 -98 -198 -68 -35 -73 -158 -192 -32 -26 -58 -84 -104 -26 -433 -54 5 -190 -121 -329
4370c29K89Nl3m0J25j09j76R5J12J27l74K26K7n7PJ02J4K65j45r9J02k15J10o5
$$ -329 -40 -35 -68 -108 17 -92 -268 -173 -61 66 -308 -82 -55 -112 -105 -3 11 276 131 32 134 -81 29 -36
4394c6J02j8j56Q0r1L55j67j1J60k69P5J65j9k41N2J86n0l39K77o2o5P9M0j67
$$ -36 66 48 -108 -28 -119 236 69 58 218 -51 24 189 170 -71 -19 167 117 -222 55 -7 -72 7 47 -120
4418a20J50J82l09L07l13J78j46m3O1Jj59J21k8j0J87l27P3J42k58K14Q4o5j56
$$ -120 30 212 -97 210 -103 75 -71 -114 -53 -52 -211 -90 -118 -128 59 -268 -195 -53 -311 -97 -13 -78 -234
4441b34K97j3j62J15m3K4l2N6j92m1K83j13O1k6K42m54l9K83M5Kk17K25k11o5
$$ -234 63 50 -112 3 -40 -16 -48 8 -184 -225 58 -55 6 -20 222 -232 -271 12 57 59 -158 67 -144 -209
4465b09J48K06l01J28jO6K35l49K89P1j55j51J49j89J87j08j06J50L4j56J7L38
$$ -209 -61 145 -156 -28 -29 37 272 -77 212 283 128 -23 126 -63 124 16 -90 60 94 -62 -45 293
4487B93j99j12L8o6P6k7P9l7n3Q5J66m96L66j58L05j98p8q0J30j21K26R8l25K93
$$ 293 94 -18 20 -46 30 3 82 45 -8 77 243 -253 113 -45 260 62 -16 -96 34 -87 139 237 -88 205
4511B05k42o3K51r3l4k5O5j53P5k2P5j05K1O5K12k18p4J23j19J68m32L09J73j49
$$ 205 -37 -100 151 58 24 -1 64 -89 -14 -36 39 -66 -45 20 232 14 -60 63 -56 112 -320 -11 162 13
4535A3r8n2K67n7j15Q4K61k39o4J64l37l2J49K30j04j12J99j18mm8J17R4m4p6
$$ 13 -85 -137 130 73 -42 42 303 64 0 164 -173 -205 -56 174 70 -42 157 39 35 -13 104 198 154 78
4559G8j05p9M11p9k2k55o7K86m1l2j47K49k63k6l7KJ00K6O4j85R1j16n2r1N3K49
$$ 78 -27 -106 305 226 204 -51 -118 168 127 95 -52 197 -66 -92 -129 -127 -27 -1 63 -122 -31 -147 -199 -290 -237 12
4585A2j55L98m71j73M83r5n5J58m0j1J67l78n8M75k96j15L80l90J90q5k25J76
$$ 12 -143 255 -216 -389 94 -1 -56 102 62 51 218 -160 -218 257 -39 -154 226 -164 26 -59 -284 -108
4607a08P3J46k43J77J11j82p7Or4K28J62k42K14j48P8q1j06R7q0L00j67l17M69
$$ -108 -35 111 -132 45 156 -26 -103 -97 -191 37 199 -43 171 23 101 20 -86 11 -69 231 64 -253 216
4630B16n00K84oK24k32J53p4o6J27j32J02j28O7n0O2K0k1r3Nj24mK48k6j60L62
$$ 216 -284 0 -6 218 -14 139 65 -1 126 -6 96 -32 35 -15 47 67 46 -47 -42 -166 -170 78 52 -108 254
4655B54j3l09R1j07J33j88R2P3j48K0J91j68L2N8o6R3pJ91k90l4J11j17J62N1
$$ 254 241 -68 23 -84 49 -139 -47 26 -122 -102 89 -79 -47 11 -55 38 31 222 -68 -102 9 -108 54 105
4679A05j04K65m08j6K05k05M5J05K15j13j35p7J36j30J52l1Q5n9J02J5k06J12
$$ 105 1 266 -142 -158 47 -158 -113 -8 207 94 -41 -118 18 -112 40 9 94 35 137 152 -54 58
4701E8j38j48L77k63J81m9K01k20K2R9j86J46k2J0l41K41j13j17J67r6J19o7O2
$$ 58 -80 -228 149 -114 67 18 219 -1 21 120 -66 80 58 68 -273 -32 -145 -262 -95 -191 -72 -139 -77
4724g7j22K70j1m2J13M8j96p0j12R1L1m9J34N3J6k25L20j33q2J07J4L3k38K73
$$ -77 -199 71 60 18 131 179 -17 -87 -199 -108 -77 -126 8 61 77 -148 172 39 -43 64 78 111 -127 146
4748A46m7o6l1j13J65j56K7J1j36L34lk04J89l7k26p7K51j03J16j79o8K55p5r5
$$ 146 99 33 2 -111 54 -102 -75 -64 -200 134 131 -73 116 79 -147 -224 27 -76 40 -139 -207 48 -27 -122
4772a22P8j66N22k52k11J84n9M5q4L88k35j16J54K5qj69J7j62O2K9Mj48J07J59
$$ -122 -44 -210 312 60 -151 33 -26 19 -65 323 88 -28 126 151 143 -26 -9 -171 -109 -80 -76 -224 -117 42
4796D2k30J00j19K8L15k63j18K97j16M6N3l11K29L6N5j65RQ2k7q0J36j80K44P5
$$ 42 -188 -88 -207 -179 136 -127 -245 52 -64 -18 35 -276 -47 -11 44 -121 -112 -30 -57 -137 -1 -181 63 138
4820A38n0j94J26J10m36J51K59j44L5J82j20l86L37K03k08j2J70m16O37j64k40
$$ 138 88 -106 20 130 -306 -155 104 -40 -5 177 57 -329 8 211 3 -9 161 -255 382 218 -22
4841b2r6l4L19k53N1K9J09o1j16J17J53k62J98j21K93k54j02m1J15j4q6pP3mO1
$$ -22 -118 -152 167 -86 -35 -6 103 42 -74 43 196 -66 132 11 304 50 -52 -93 22 8 -78 -85 -12 -16 45
4866D5L5J11n7j78O9J32m4j44P5k96J6K3M07j13k84K37K6j41J31J6qk19O5J80
$$ 45 80 191 134 -44 25 157 113 -31 44 -252 -236 -213 194 81 -203 34 60 -81 50 66 58 -161 -96 84
4890H4j68l30N31l30N8K91k73m8L94k3m36L16k07l1K92l0P1K6j75Mj97J15Oj99
$$ 84 -84 -414 117 -213 -155 136 -137 -185 209 186 -250 66 -141 -172 120 90 161 187 12 16 -181 -66 -60 -259
4914b59K59o1J5P8N1k82J65pN0k57J49j4K09p6pNJ85k21Q6j18M07m53J67m5j47
$$ -259 0 -61 -46 32 83 -199 -34 -41 9 -248 -99 -113 96 20 13 18 203 -18 68 -50 357 -96 71 26 -121
4939a21LJ84J81l39P2J70l6n3j74L6J18P8j69J33n3k04J64J36o4m18L37MN2M2
$$ -121 -118 66 247 -92 -20 150 114 61 -113 -77 41 119 -50 83 30 -174 -10 126 62 -356 -19 -15 37 79
4963G9j19N1k12K71j05l6N5j12Q7j3J09j52pJ86k90l9R3R0n6N2O8M4r9J94L9j17
$$ 79 -40 11 -201 70 -35 -71 -16 -128 -41 -54 55 -97 -104 82 -208 -247 -154 -64 -120 -68 0 44 -55 139 178 61
4989F1l16M63j74r7J52j70j4M9J65j77l3P6J21N8j89J55j02K7k45O2J68j58J45
$$ 61 -255 208 34 -63 89 -81 -95 -46 119 -58 -91 -15 106 164 -25 130 28 55 -190 -128 40 -118 27
5012B7k83M52j79n1K23j33j42K2K8m5J39j70J81o3J71q2j20M3m4k13J93N3J91
$$ 27 -256 196 17 -34 189 56 -86 -64 -36 -81 58 -112 69 6 177 95 -25 18 -26 -239 -46 7 198
5035A98l42J54Nk02K80m80M13J62l60k17L48j30L06l20P7N7lK04j05P1r3J02k85
$$ 198 -144 10 15 -187 93 -387 26 188 -172 -389 -41 -171 135 -185 -108 -51 -54 150 45 116 23 125 -160
5058a60j89M65L0r7k92J13q4L28R5j12J22n17N20k22M2P4j83K3r2P7K18n3J75
$$ -160 -349 116 146 49 -243 -130 -214 114 209 97 219 -298 222 0 42 116 -67 -44 -136 -59 159 106 281
5081B81l30L9p5K2K54P2l09J55K0L8j90QK1K1J23k32L12l55LK21J29q1k3k17P5
$$ 281 -49 -10 -85 -63 191 263 -46 109 129 167 -23 -15 6 27 150 -82 230 -125 -122 99 228 147 124 -93 -18
5106a8J0J8k69L88j3j18q3R1p7k08K44K63l21r1K06k04Q0N8J4j37K05q7j3m8N4
$$ -18 -8 10 -259 129 116 -2 -85 6 -71 -279 -35 228 -93 -184 22 -182 -102 -44 -30 -167 38 -49 -62 -110 -56
5131e6O3Q8L7m7j30q0R7l9K47l46K32j28j9pK77N6j1l03j43n6K30j31J48J00K4
$$ -56 7 95 132 85 -45 -125 -28 -67 180 -166 66 -62 -81 -88 189 245 234 -69 -212 -268 -38 -169 -21 79 103
5156A03l58K39NP0Q7o0q0J08q8J18L0k24j7LK75j31j86J66Q1j88j3pJ92k12Q9
$$ 103 -255 -16 -11 59 146 86 6 114 26 144 174 -50 -67 -64 211 80 -106 60 141 -47 -60 -67 125 -87 2
5181Bj16L25j60p7j53R4jOK7K56O9l38j77J68Q1P3k29nN1L63n62K08mJ52J14k72
$$ 2 -114 211 51 -26 -179 -85 -86 -80 -53 203 272 -66 -243 -75 6 79 -150 -155 -104 259 -303 -95 -99 53 167 -105
5207a05L46k63J13j57J9M4J1J63j18j90J46L20p1l05L06m6j55k1m3K12k65q0P7
$$ -105 241 -22 91 -66 -47 -3 8 171 53 -137 9 329 258 -47 259 213 58 37 -6 206 -59 -139 -62
5230f2O1r5oJ41J59l9m9q5q9r8j2N2J48k1j95J57PN3J6p0k16J87j1K4n0k13M67
$$ -62 -1 -96 -102 39 198 159 110 25 -64 -162 -174 -122 26 5 -190 -33 -26 27 43 -27 -243 -56 -67 -43 -93 -306 161
5257A61m4kq9j48O0N2k0J67l26J82J42j59KR0l01K71J66m16J46Q6J01l33K32J3
$$ 161 117 115 26 -122 -62 -10 -30 137 -189 -7 135 -24 -22 68 -233 38 204 -212 -66 20 121 -212 20 33
5281C3q0O8j86K81k13K15k40J69n0L1J83l83L86o7j69J96j44o1Q1j23K79j55n0
$$ 33 -47 21 -165 116 -97 118 -122 47 -3 28 211 -172 214 147 -22 174 30 -31 50 -73 206 51 1
5304AN1J70l5j06k03J8j14K43J20k10J6J39j47p8J5J42K08l38QN9m5J6m5K08J5
$$ 1 52 222 187 81 -122 -104 -218 25 145 -65 -49 90 -57 -135 -120 22 230 -108 -100 -41 -86 -70 -115 93 108
5329A08q7j51K26j43M6j49K65k02j82K96j61J66k76K13l6N6J47q9J88n4j21j83
$$ 108 21 -130 96 -47 -1 -150 115 -87 -269 27 -134 32 -244 -31 -67 -11 136 47 235 181 60 -123
5351a23J02J53q9L5j19j04k0J13J27j63J41j46p4J03O6O1n4q2K26j37j53J19k5
$$ -123 -21 132 43 78 -41 -145 -165 -52 75 -88 53 -93 -167 -64 2 63 9 -73 153 16 -137 -18 -43
5374d3J49J01l5k50J16J0lK27l4k01O0j96L61m02Q0r9L5K85q4j28J14oNq7O7j48
$$ -43 106 207 172 -78 38 48 45 272 238 37 97 -99 262 -140 -60 -159 -124 161 77 -51 63 57 62 -25 42 -106
5400a06K08J04j60j56J31l1K4K24m66J45P5L0l74K40K4q2L3J37J7p0K12l13J93
$$ -106 102 206 46 -110 21 -10 14 238 -228 -83 -8 22 -352 -112 -88 -170 -137 0 17 -53 159 -154 39
5423C9Q9P0j12j4PN8k82P9R4j17m1n6J55Q9j77L44p0l69L51K8j97P3N4j41J50
$$ 39 128 198 86 72 79 137 -145 -66 28 -89 -130 -186 -31 58 -119 225 155 -214 137 165 -32 41 95 -46 104
5448A04m5nP5r6j31l7J72K0R6n0P4j10j53J42qJ53Q6m83k4M6K54M3j68K48m28
$$ 104 59 54 129 33 -98 -135 37 57 153 103 177 67 -86 56 48 201 287 -196 -220 -174 80 123 -45 203 -225
5473b25L27m6j32q4J61P3j11J13k80qKJ48K38j07k99K19O8k20k2J63k0Q3l1R9
$$ -225 102 56 -76 -160 1 74 -37 76 -204 -212 -210 -62 176 69 -230 -11 57 -163 -185 -22 -42 41 10 109
5497A09J9j00j1K15k05K50l51k9p1J40j12r3K18K28j98j17K70j45K5R1k39jK4
$$ 109 128 28 17 232 27 277 -74 -103 -174 -34 -146 -239 -21 207 9 -108 162 17 42 133 -106 -107 -83
5520h3l0L70j02j63l12M19j65P1j5j36N4L89l44m6O1J01kO8j03J25m84J41L21
$$ -83 -113 257 155 -8 -320 99 -66 5 -10 -146 -92 297 -47 -93 -32 69 67 135 32 157 -327 -186 135
5543A35Qn1J39k13j48K89p5k36R7K45Jj75L0r9J49l02L56k15JL85l09k07K89j75
$$ 135 143 92 231 18 -130 159 84 -152 -55 190 191 16 46 -53 96 -206 150 -65 -64 321 12 -195 94 -81
5567h1p2J98J41K00m74L8l7Qq1K89l63K36j59l1J16P3p2L3J30j65j1K55l71O4
$$ -81 -153 45 186 386 -88 -50 -87 -79 -160 129 -234 2 -157 -188 -72 1 -71 -38 92 -73 -84 171 -200 -136
5591a36J62n9O8N8O5j7k15J73j2KJ02l92L06j32K27l33R6J34l26J06J48j6NK40
$$ -136 26 -33 35 93 158 141 -74 99 87 89 191 -201 105 -27 200 -133 -37 97 -229 -123 25 9 14 254
5615B54k69K35k67R4k86L39k74J79K20R4j49k68L09k70l2K05j96L1OL92m20k36
$$ 254 -15 220 -47 47 -239 100 -174 5 225 319 170 -98 211 -59 -91 114 -82 -51 -45 347 -73 -309
5637c09L92j40J03j50J25p1L5j14r8J16J68j52kK10K03k51k19QK78r8Q8j24M6
$$ -309 83 -57 46 -104 21 -50 -15 -129 -227 -111 57 -95 -97 113 316 65 -154 -146 132 34 122 -2 44
5660D4p7J67j59N6j11J97J56l90J53L03m08J19Mj26J5M0o8j34L67p5K76m10J15
$$ 44 -33 134 -25 31 -80 117 273 -117 36 339 -69 50 54 -72 -57 -17 -85 -219 148 73 349 -61 54
5683E4m02K56J41q3k2j26J06J45l45K85J67j27Q8k10K76j79j54M7K10Nr2K27l39
$$ 54 -348 -92 49 -34 -56 -182 -76 69 -276 9 176 49 137 -73 203 24 -130 -83 127 132 40 267 -72
5706g2J28l7n3o7O4J10j90J88r5J37J1P4l8j53K2J3K3j37L50l46J46q6l37M12
$$ -72 56 19 -34 -101 -37 73 -117 71 -24 113 124 198 160 7 29 42 65 -72 278 -68 78 -8 -345 67
5730F7j75L91l07J12K8J58l3j87j17J49j4k19j6K00k5K09M5k16j24P2J0j21k4
$$ 67 -108 283 -24 88 116 274 241 54 -63 86 72 -147 -163 37 12 221 266 50 -74 -2 8 -113 -137
5753a37l6R9k3r6J12q4M6P5N8r3k0K19L2k26q7K50n1J24j96N4o7l1O1j22J76J50
$$ -137 -173 -74 -97 -193 -81 -165 -119 -44 14 -79 -99 120 152 -74 -161 89 38 162 -34 20 -47 -78 -17 -139 37 187
5779A87l20M38j54j67K78l59R2J36N7k36r9K21M2j1O1j36K7O1l14J49J52q2k29
$$ 187 -133 305 151 -16 262 -97 -5 131 188 -48 -147 74 116 105 166 30 57 118 -196 -47 105 23 -206
5802b06K0L72k98K70j29N5k49Q6R6o9N7J28j57J55l21K96j65Q6k01n7K97k94L38
$$ -206 -186 186 -112 158 29 84 -165 -79 17 -52 5 133 -24 131 -190 106 -59 27 -174 -231 66 -228 110
5825A10k90K93k79R0P9mJ17l76K77L6K70l07o5J96r8J0O6j0k38m2K17O2k40L37
$$ 110 -180 113 -166 -76 3 -1 116 -260 17 53 323 16 -49 147 49 59 125 115 -123 -165 52 114 -126 211
5849B11k16j27M5O4J39j46p6K34k34K7l3J04K36k51n8J58K8k58K65l6R1o0p4p6
$$ 211 -5 -132 -87 -23 116 -30 -106 128 -106 -79 -112 -8 228 -23 -81 77 105 -153 112 76 167 107 33 -43
$$ [...]
8191h6
##END NTUPLES=NMR FID
##END=
