##TITLE=1H_Pr Am-2764
 CDCl3, 8 sc, 
 23.08.2021
##JCAMPDX= 6.0         $$ Bruker NMR JCAMP-DX V2.0
##DATA TYPE= NMR FID
##DATA CLASS= NTUPLES
##ORIGIN= UXNMR, Bruker Analytische Messtechnik GmbH
##OWNER= root
$$ XWIN-NMR		Version 3.5
$$ Mon Aug 23 11:08:11 2021 Russian Standard Time (UT+4h)  she@DPX200
##.OBSERVE FREQUENCY= 200.131506
##.OBSERVE NUCLEUS= ^1H
##.DELAY= (6, 6)
##.ACQUISITION MODE= SIMULTANEOUS
##.ACQUISITION SCHEME= undefined
##.AVERAGES= 8
##.DIGITISER RES= 18
##SPECTROMETER/DATA SYSTEM= spect
##.PULSE SEQUENCE= zg30
##.SOLVENT NAME= CDCl3
##.SHIFT REFERENCE= (INTERNAL, CDCl3, 0, 15.7039)
##AUDIT TRAIL= $$ (NUMBER, WHEN, WHO, WHERE, WHAT)
$$ ##TITLE= Audit trail, XWIN-NMR		Version 3.5
$$ ##JCAMPDX= 5.01
$$ ##ORIGIN= Bruker BioSpin GmbH
$$ ##OWNER= she
$$ F:/spectra/data/she/nmr/H-F/1/audita.txt
$$ ##AUDIT TRAIL=  $$ (NUMBER, WHEN, WHO, WHERE, WHAT)
(   1,<2021-08-23 11:06:35.17 +0400>,<she>,<DPX200>,
      <created by zg, POWCHK disabled, PULCHK disabled
       configuration hash MD5:
       00 E9 B6 7A A2 85 ED C7 34 08 36 98 17 FE 4E 26
       data hash MD5: 16K
       5D 75 38 D9 CB B3 C0 C4 92 B2 2F 33 30 D9 3D E7>)
$$ ##END=
$$ 
$$ hash MD5
$$ EF AF E6 62 B8 61 91 03 86 96 75 C0 D2 7A 0A 87
##$RELAX= 
##$RELAX= 
##$RELAX= 
##$RELAX= 
##$RELAX= 
##$RELAX= 
$$ Bruker specific parameters
$$ --------------------------
##$DU= <F:/spectra>
##$EXPNO= 1
##$NAME= <H-F>
##$PROCNO= 1
##$TYPE= <nmr>
##$USER= <she>
##$AMP= (0..31)
100 100 100 100 100 100 100 100 100 100 100 100 100 100 100 100 100 100 
100 100 100 100 100 100 100 100 100 100 100 100 100 100 
##$AQSEQ= 0
##$AQ_mod= 1
##$AUNM= <au_zg>
##$AUTOPOS= <>
##$BF1= 200.13
##$BF2= 200.13
##$BF3= 200.13
##$BF4= 200.13
##$BF5= 200.13
##$BF6= 200.13
##$BF7= 200.13
##$BF8= 200.13
##$BYTORDA= 1
##$CFDGTYP= 0
##$CFRGTYP= 5
##$CHEMSTR= <none>
##$CNST= (0..31)
1 1 145 1 1 1 1 1 1 1 1 1 1 1 1 1 1 1 1 1 1 1 1 1 1 1 1 1 1 1 1 1 
##$CPDPRG= <>
##$CPDPRG1= <>
##$CPDPRG2= <>
##$CPDPRG3= <>
##$CPDPRG4= <mlev>
##$CPDPRG5= <mlev>
##$CPDPRG6= <mlev>
##$CPDPRG7= <mlev>
##$CPDPRG8= <mlev>
##$CPDPRGB= <>
##$CPDPRGT= <>
##$D= (0..31)
0 1.2 0 0 0 0 0 0 0 0.06 0 0.03 0 0 0 0 0.0002 0 0 0 0 0 0 0 0 0 0 0 0 
0 0 0 
##$DATE= 1629702394
##$DBL= (0..7)
120 120 120 120 120 120 120 120 
##$DBP= (0..7)
150 150 150 150 150 150 150 150 
##$DBP07= 0
##$DBPNAM0= <>
##$DBPNAM1= <>
##$DBPNAM2= <>
##$DBPNAM3= <>
##$DBPNAM4= <>
##$DBPNAM5= <>
##$DBPNAM6= <>
##$DBPNAM7= <>
##$DBPOAL= (0..7)
0.5 0.5 0.5 0.5 0.5 0.5 0.5 0.5 
##$DBPOFFS= (0..7)
0 0 0 0 0 0 0 0 
##$DE= 6
##$DECBNUC= <off>
##$DECIM= 32
##$DECNUC= <off>
##$DECSTAT= 4
##$DIGMOD= 1
##$DIGTYP= 9
##$DL= (0..7)
0 120 120 120 120 120 120 120 
##$DP= (0..7)
150 150 150 150 150 150 150 150 
##$DP07= 0
##$DPNAME0= <>
##$DPNAME1= <>
##$DPNAME2= <>
##$DPNAME3= <>
##$DPNAME4= <>
##$DPNAME5= <>
##$DPNAME6= <>
##$DPNAME7= <>
##$DPOAL= (0..7)
0.5 0.5 0.5 0.5 0.5 0.5 0.5 0.5 
##$DPOFFS= (0..7)
0 0 0 0 0 0 0 0 
##$DQDMODE= 0
##$DR= 18
##$DS= 0
##$DSLIST= <SSSSSSSSSSSSSSS>
$$ [...]
##$SUBNAM2= <"">
##$SUBNAM3= <"">
##$SUBNAM4= <"">
##$SUBNAM5= <"">
##$SUBNAM6= <"">
##$SUBNAM7= <"">
##$SUBNAM8= <"">
##$SUBNAM9= <"">
##$SW= 20.0188882624521
##$SWIBOX= (0..15)
0 0 2 0 0 0 0 0 0 0 0 0 0 0 0 0 
##$SW_h= 4006.41025641026
##$TD= 16384
##$TD0= 1
##$TE= 0
##$TE2= 300
##$TE3= 300
##$TEG= 300
##$TL= (0..7)
0 120 120 120 120 120 120 120 
##$TP= (0..7)
150 150 150 150 150 150 150 150 
##$TP07= 0
##$TPNAME0= <>
##$TPNAME1= <>
##$TPNAME2= <>
##$TPNAME3= <>
##$TPNAME4= <>
##$TPNAME5= <>
##$TPNAME6= <>
##$TPNAME7= <>
##$TPOAL= (0..7)
0.5 0.5 0.5 0.5 0.5 0.5 0.5 0.5 
##$TPOFFS= (0..7)
0 0 0 0 0 0 0 0 
##$TUNHIN= 0
##$TUNHOUT= 0
##$TUNXOUT= 0
##$USERA1= <user>
##$USERA2= <user>
##$USERA3= <user>
##$USERA4= <user>
##$USERA5= <user>
##$V9= 5
##$VALIST= <valist>
##$VCLIST= <CCCCCCCCCCCCCCC>
##$VD= 0
##$VDLIST= <DDDDDDDDDDDDDDD>
##$VPLIST= <PPPPPPPPPPPPPPP>
##$VTLIST= <TTTTTTTTTTTTTTT>
##$WBST= 1024
##$WBSW= 4
##$XGAIN= (0..3)
0 0 0 0 
##$XL= 0
##$YL= 0
##$YMAX_a= 299266
##$YMIN_a= -443250
##$ZGOPTNS= <>
##$ZL1= 120
##$ZL2= 120
##$ZL3= 120
##$ZL4= 120
##$ABSF1= 10
##$ABSF2= 0
##$ABSG= 5
##$ABSL= 3
##$ALPHA= 0
##$AQORDER= 0
##$ASSFAC= 0
##$ASSFACI= 0
##$ASSFACX= 0
##$ASSWID= 0
##$AUNMP= <proc_1d>
##$AZFE= 0.1
##$AZFW= 0.1
##$BCFW= 1
##$BC_mod= 2
##$BYTORDP= 1
##$COROFFS= 0
##$CY= 11.3945322036743
##$DATMOD= 1
##$DC= 2
##$DFILT= <>
##$DTYPP= 0
##$F1P= 2.36226072786647
##$F2P= -0.459571619588291
##$FCOR= 0.5
##$FTSIZE= 0
##$FT_mod= 4
##$GAMMA= 1
##$GB= 0.15
##$INTBC= 1
##$INTSCL= 1
##$ISEN= 128
##$LB= 0.24
##$LEV0= 0
##$LPBIN= 0
##$MAXI= 10000
##$MC2= 0
##$MEAN= 0
##$ME_mod= 0
##$MI= 1.114404
##$NCOEF= 0
##$NC_proc= 0
##$NLEV= 6
##$NOISF1= 3.799351
##$NOISF2= 2.8
##$NSP= 1
##$NTH_PI= 0
##$NZP= 0
##$OFFSET= 15.70392
##$PC= 1
##$PHC0= -13357.45
##$PHC1= 14.20099
##$PH_mod= 1
##$PKNL= yes
##$PPARMOD= 0
##$PSCAL= 0
##$PSIGN= 0
##$REVERSE= no
##$SF= 200.130013532006
##$SI= 16384
##$SIGF1= 3
##$SIGF2= 2
##$SINO= 400
##$SIOLD= 16384
##$SREGLST= <1H.CDCl3>
##$SSB= 0
##$STSI= 0
##$STSR= 0
##$SW_p= 3612.71676300578
##$SYMM= 0
##$S_DEV= 0
##$TDeff= 0
##$TDoff= 0
##$TI= <>
##$TILT= no
##$TM1= 0
##$TM2= 0
##$TOPLEV= 0
##$USERP1= <user>
##$USERP2= <user>
##$USERP3= <user>
##$USERP4= <user>
##$USERP5= <user>
##$WDW= 1
##$XDIM= 8192
##$YMAX_p= 0
##$YMIN_p= 0
$$ End of Bruker specific parameters
$$ ---------------------------------
##NTUPLES= NMR FID
##VAR_NAME=  TIME,          FID/REAL,        FID/IMAG
##SYMBOL=    X,             R,               I
##VAR_TYPE=  INDEPENDENT,   DEPENDENT,       DEPENDENT
##VAR_FORM=  AFFN,          ASDF,            ASDF
##VAR_DIM=   8192,          8192,            8192
##UNITS=     SECONDS,       ARBITRARY UNITS, ARBITRARY UNITS
##FACTOR=    0.0002496,     1,               1
##FIRST=     0,             0,               0
##LAST=      2.0444736,     0,               0
##MIN=       0,             -443250,         0
##MAX=       2.0444736,     299266,          0
$$ Real data points
##PAGE= N=1
##DATA TABLE= (X++(R..R)), XYDATA
$$ [...]
$$ plain form
2083 -152 -605 668 840 -744 -847 625 -191 -1673 -156 685 -533 -1315 569 921 -276 -261 1182
2100 1182 848 -1047 -2 875 -96 -1624 -470 217 -1177 -1411 -47 90 -1153 -666 1017 577 -662
2117 -662 65 946 37 -913 411 680 -601 -1103 188 -10 -1528 -755 777 -211 -1180 357 1327 57
2135 57 -820 1169 1138 -134 -364 1417 212 -1016 -149 991 36 -1451 272 1158 -633 -592 1081 1127
2153 1127 -353 -37 1861 981 -463 517 1584 -130 -1112 408 1350 -1146 -1039 706 425 -1091 -390
2170 -390 1397 415 -1024 328 1475 -335 -1040 666 1081 -874 -1085 855 570 -1847 -989 841 -148
2187 -148 -1566 -242 1204 -254 -1025 609 1162 -835 -955 1177 533 -1412 -620 1073 -203 -1950
2203 -1950 -353 1263 -961 -1437 651 1078 -1005 -596 1558 677 -1469 -316 1468 -43 -1270 134
$$ packed form
2083a52m53J273J72j584j03J472q16j482J517Q41j218p82J884L52j197J5J443
2100A182l34j895J045Q77r71j528J154O87j394k34J364J37j243M87J683m40j239
2117f62P27Q81r09r50J324K69j281n02J291j98j518P73J532r88r69J537R70j270
2135E7q77J989l1j272k30J781j205j228Q67J140r55j487J723Q86j791M1J673M6
2153A127j480L16J898q80j444R80J067j714r82J520R42k496J07J745k81j516P01
2170c90J787r82j439J352J147j810p05J706M15j955k11J940k85k417Q58J830r89
2187a48j418J324J446j458p71J634N53j997j20K132o44j945P92J693j276j747
2203a950J597J616k224m76K088M27k083M09K154q81k146J153J784j511j227J404
$$ plain form
2219 134 1243 -592 -1348 731 856 -990 -496 1250 799 -728 273 1833 397 -992 600 1596
2235 1596 -507 -988 944 1061 -768 -885 1410 376 -1278 309 1639 58 -907 693 1693 -419
2251 -419 -524 779 748 -971 -829 988 323 -1346 -237 1096 -281 -1231 401 1191 -292 -1075 900
2268 900 527 -892 -816 1167 -41 -945 -74 548 -444 -1492 135 813 -782 -893 475 426 -994 -346
2286 -346 1505 206 -892 82 846 -609 -1223 265 980 -987 -1000 301 80 -850 -385 689 217 -639
2304 -639 177 931 -454 -890 257 752 -433 -151 755 310 -398 66 870 -227 -505 639 602 -497
2322 -497 -287 795 338 -345 70 702 -40 -690 311 892 -146 -218 809 538 -433 -352 1106 155 -332
2341 -332 4 785 -90 -673 47 234 -641 -548 846 486 -671 -370 615 -493 -1008 545 518 -772 -669
$$ packed form
2219A34J109j835p56K079J25j846M94J746m51j527J001J560j436j389J592R96
2235A596k103m81J932J17j829j17K295j034j654J587J330j581r65J600J000k112
2251d19j05J303l1j719J42J817o65j669J109J333j377r50J632P90j483p83J975
2268I00l73j419P6J983j208r04Q71O22r92j048J627O78j595j11J368m9j420O48
2286c46J851j299j098R74P64j455o14J488P15j967j3J301k21r30M65J074m72q56
2304f39Q16P54j385m36J147M95j185K82R06m45p08M64Q04j097k78J144l7j099
2322d97K10J082m57o83M15O32p42o50J001N81j038p2J027k71r71Q1J458r51m87
2341c32L36P81q75n83P20J87q75R3J394l60j157L01R85j108n15J553k7j290J03
$$ plain form
2360 -669 57 83 -1296 -204 125 552 -742 -822 1439 -42 -1265 -102 794 -885 -1107 624 -96 -836
2378 -836 -341 761 -167 -723 -244 668 -84 -839 172 762 -352 -854 803 448 -994 -138 1052 50
2396 50 -940 369 1078 -294 -591 722 724 -681 -195 1211 523 -590 143 1610 310 -690 584 1180
2414 1180 -52 38 -472 -231 -1131 -975 502 442 -856 -46 1249 82 -562 687 723 -71 -355 795
2432 795 764 -583 -463 915 -144 -1136 -366 814 -627 -995 307 756 -560 -724 708 596 -722
2449 -722 -474 875 151 -1208 -411 681 -661 -1582 24 386 -524 -1040 335 344 -781 -424 798 323
2467 323 -565 81 788 -94 -710 132 546 -635 -895 315 409 -896 -273 600 491 -773 350 1400
2485 1400 -90 -319 957 934 -32 -377 755 687 -700 -214 760 279 -737 129 879 78 -386 826
$$ packed form
2360f69P26K6j379J092L29M27j294q0K261j481j223J163Q96j679k22J731p20p40
2378h36M95J102r28n56M79R12p52p55J011N90j114n02J657l55j442Q56J190j002
2396E0r90J309P09j372k97J313Kj405M86J406o88j113P33J467j300j000J274N96
2414A180j232R0n10K41r00J56J477o0j298Q10J295j167o44J249L6p94k84J150
2432G95l1j347J20J378j059r92P70J180j441l68J302M49j316j64J432j12j318
2449g22K48J349p24j359P97J092j342r21J606L62r10n16J375Rj125L57J222m75
2467C23q88O46P07q82o16Q42M14j181k60J210R4j305O23Q73j09j264J123J050
2485A400j490k29J276k3r66l45J132o8j387M86R74m81j016Q66P50q01m64J212
$$ plain form
2503 826 854 -225 -234 1009 510 -268 186 804 -267 -605 -26 394 -658 -730 229 542 -733 -201 601 331
2523 331 -283 89 1037 -136 -915 -177 216 -659 -824 -74 147 -1083 -791 255 -53 -740 0 527 236
2542 236 -354 226 205 -329 -230 389 -219 -916 -376 87 -286 -828 -426 423 -421 -513 294 613 -256 18 746
2563 746 379 -447 -134 351 -190 -495 79 179 -482 -346 331 238 -201 287 916 321 21 444 957 141
2583 141 -170 604 421 -362 54 295 58 -332 -51 509 99 -305 424 839 29 14 562 524 -353 -172 835
2604 835 240 -543 148 392 -61 -499 -34 415 -368 -282 540 368 -518 60 522 -31 -644 91 211 -640
2624 -640 -924 13 259 -983 -884 -23 39 -832 -244 641 -320 -567 293 643 -484 -457 652 341 -870 -582
2644 -582 37 -405 -1040 -413 529 -256 -610 446 435 -203 49 563 584 -309 -84 700 116 -645 132 444
$$ packed form
2503H26K8j079rJ243m99p78M54O18j071l38N79M20j052p2R59L13j275N32Q02k70
2523C31o14L72R48j173p79P38L93q75j65P50K21j230K92J046l08o87P40N27k91
2542B36n90N80k1n34R9O19o08o97N40M63l73n42M02Q49q44r2Q07L19q69K74P28
2563G46l67q26L13M85n41l05N74J00o61J36O77r3m39M88O29n95l00M23N13q16
2583A41l11P74j83p83M16K41k37l90K81N60m10m04P29M15q10j5N48l8q77J81J007
2604H35n95p83O91K44m53m38M65M49p83Q6Q22j72q86N78M62n53o13P35J20q51
2624f40k84R37K46j242R9Q61O2q71N88Q85r61k47Q60L50j127K7J109l11j211K88
2644e82O19m42o35O27R42p85l54J056j1o38K52N14K1q93K25P84n84p61P77L12
$$ plain form
2664 444 -275 -822 -115 615 -248 -479 936 493 -184 87 1211 614 -581 538 759 -2 -659 345
2682 345 450 -607 -455 353 389 -364 -197 720 218 -350 359 861 172 -587 548 581 -717 -457 418 25
2702 25 -1109 -409 198 -115 -589 162 565 -131 -407 361 634 -302 -368 427 96 -834 -451 185 -454 -1069
2722 -1069 -359 31 -519 -618 177 231 -261 -133 566 166 -293 -38 479 -122 -636 -40 -197 -589 -804 260
2742 260 202 -307 -187 531 282 -318 130 793 167 0 283 521 -194 -446 285 334 -344 -152 349 -115 -426
2763 -426 210 475 183 -157 595 730 298 -14 756 441 -304 -157 396 -44 -665 115 357 -38 -121 825
2783 825 43 21 1162 50 467 -1 483 413 -155 -494 170 5 -633 -636 14 323 -469 -300 432 147 -263
2804 -263 141 272 10 -465 202 46 -518 -576 29 -139 -824 -613 -99 -532 -804 -14 322 -194 -115 583 246
$$ packed form
2664D44p19n47P07P30q63k31J415m43o77K71J124n97j195J119K21p61o57J004
2682C45J05j057J52Q08L6p53J67R17n02n68P09N02o89p59J135L3j298K60Q75l93
2702B5j134P00O07l13m74P51M03o96k76P68K73r36o6P95l31r30L83O36o39o15
2722a069P10L90n50r9P95N4m92J28O99m00m59K55N17o01n14N96j57l92k15J064
2742B60n8n09J20P18k49o00M48O63o26j67K83K38p15k52P31M9o78J92N01m64l11
2763d26O36K65k92l40P52J35m32l12P70l15p45J47N53m40o21P80K42l95q3R46
2783H25p82k2J141j112M17m68M84p0n68l39O64j65o38lO50L09p92J69P32k85m10
2804b63M04J31k62m75O67j56n64n8O05j68o85K11N14m33k72P90L36n16P9O98l37
$$ plain form
2825 246 -95 47 279 -44 -646 -98 82 -312 -167 -174 111 -663 -307 427 42 -421 -83 449 390 84 509
2846 509 681 249 -42 242 63 -52 -43 112 197 -377 -165 439 257 -330 410 559 130 226 837 717 -275
2867 -275 142 210 53 -368 5 238 -315 -503 -204 243 -205 37 356 518 -236 -104 335 456 -378 211
2887 211 180 -568 -539 118 -32 -683 -410 35 -152 -432 -140 483 61 -304 10 469 36 -488 100 136 -496
2908 -496 -438 399 -260 -623 -491 390 -289 -552 0 485 -20 -196 310 526 -31 -315 87 138 -608 -73 362
2929 362 -224 -579 278 496 -120 -229 302 321 -222 -63 914 276 -96 12 548 -196 -197 278 432 -85 -277
2950 -277 643 306 170 21 489 251 -254 225 562 129 40 756 421 -477 -275 66 522 -285 48 378
2970 378 69 -138 -93 358 85 -529 206 241 173 -291 299 92 -154 -149 118 -5 -488 -244 357 -247 -521 214
$$ packed form
2825B46l41J42K32l23o02N48J80l94J45pK85p74L56P34l85m63L38N32n9l06M25
2846E09J72m32k91K84j79j15RJ55Q5n74K12O04j82n87P40J49m29R6O11j20r92
2867b75M17O8j57m21L73K33n53j88K99M47m48K42L19J62p54J32M39J21q34N89
2887B11l1p48K9O57j50o51K73M45j87k80K92O23m22l65L14M59m33n24N88L6o32
2908d96N8Q37o59l63J32Q81o79k63N52M85n05j76N06K16n57k84M02N1p46N35M35
2929C62n86l55Q57K18o16j09N31J9n43J59R77o38l72J08N36p44jM75J54n17j92
2950b77R20l37j36j49M68k38n05M79L37m33q9P16l35q98K02L41M56q07L33L30
2970C78l09k07M5M51k73o14P35L5o8m64N90k07k46NK67j23m83K44O01o04k74P35
$$ plain form
2992 214 190 -200 -65 314 20 -592 -27 -62 -350 -347 -104 189 -368 -758 -200 -52 -451 -114 257 257 -511 337
3014 337 257 23 -350 319 440 -288 -271 155 170 -435 -1 202 321 -292 30 252 241 -337 520 136 -70
3035 -70 291 429 -71 -303 -48 153 264 -266 95 26 125 -179 193 118 -221 -340 709 28 -350 250 279
3056 279 164 221 416 236 -203 -46 216 3 379 -232 362 -215 -277 -132 334 159 -97 -84 441 -265 285
3077 285 213 106 -558 -617 557 -365 -605 -81 188 -63 -514 -311 -174 -191 -204 818 -536 -48 386 151
3097 151 -86 276 -10 -158 149 -490 172 393 -971 -484 262 -322 119 560 462 -182 271 -232 622 313
3117 313 31 582 174 -472 -308 430 669 -166 195 665 252 -444 -56 -476 -541 144 822 -167 -837 82
3137 82 146 23 -404 -51 279 61 220 247 285 78 447 -69 -332 -123 -273 280 51 -391 403 -103 -223
$$ packed form
2992B14k4l90J35L79k94o12N65l5k88LK43K93n57l90N58J48l99L37L71%p68Q48
3014C37q0k34l73O69J21p28J7M26J5o05M34K03J19o13L22K22j1n78Q57l84k06
3035g0L61J38n00k32K55K01J11n30L61o9R9l04L72p5l39j19J049o81l78O00K9
3056B79j15N7J95j80m39J57K62k13L76o11N94n77o2J45M66j75k56J3N25p06N50
3077B85p2j07o64n9J174r22k40N24K69k51m51K03J37j7j3J022j354M88M34k35
3097A51k37L62k86j48L07o39O62K21j364M87P46n84M41M41r8o44M53n03Q54l09
3117C13k82N51m08o46J64P38K39q35L61M70m13o96L88m20o5O85O78r89o70R19
3137H2O4j23m27L53L30k18J59K7L8k07L69n16k63K09j50N53k29m42P94n06j20
$$ plain form
3158 -223 138 552 -386 -1307 -1593 696 237 65 64 -779 -83 -619 -28 258 -220 376 692 16 -109 655
3178 655 234 -547 -496 628 639 -509 -261 385 -461 94 -646 217 -1343 138 269 0 78 54 -415 884
3198 884 691 325 -452 -434 -8 -537 1603 -17 -465 -612 655 741 -1076 773 605 -420 -658 -206 370
3217 370 -81 -198 1047 -110 277 -155 1177 -665 -283 -508 -416 -91 93 743 677 -1054 -121 69 854
3236 854 102 163 88 -598 839 -603 579 -148 213 236 523 -845 501 458 757 -251 890 -217 -207
3255 -207 -201 376 359 283 -320 -279 44 -315 -696 -269 188 -496 561 -735 -220 -974 147 -507 -467 54 41
3276 41 -410 -605 -149 297 -392 -61 289 647 149 -501 -707 415 1 -133 2 -428 -118 -155 193 -126
3296 -126 449 -47 15 -239 229 -26 -95 -41 -168 26 108 -205 239 436 112 520 877 -24 -86 26 -201 92
$$ packed form
3158b23L61M14r38r21k86K289m59j72jq43O96n36N91K86m78N96L16o76j25P64
3178F55m21p81N1J124J1j148K48O46q46N55p40Q63j560J481J31k69P8k4m69J299
3198H84j93l66p77J8M26n29K140j620m48j47J267Q6j817J849j68j025k38M52N76
3217C70m51j17J245j157L87m32J332j842L82k25R2L25J84O50o6j731R33J90P85
3236H54p52O1p5o86J437j442J182p27L61K3K87j368J346m3K99j008J141j107J0
3255b07ON77j7p6o03M1L23l59l81M27M57o84J057j296N15p54J121o54M0N21j3
3276D1m51j95M56M46o89L31L50L58m98o50k06J122m14j34J35m30L10l7L48l19
3296a26N75m96O2k54M68k55o9N4j27J94Q2l13M44J97l24M08L57r01o2J12k27K93
$$ plain form
3318 92 -540 291 -60 184 -21 276 426 -451 -65 234 229 -138 -33 462 -270 -205 -219 -468 -136 89 806 163
3340 163 -35 -50 221 -324 -95 -326 -58 -242 -165 489 365 -164 -492 235 -93 -382 -115 131 143 -64 -227
3361 -227 469 222 -82 78 504 -115 -215 24 203 -468 -67 -662 -94 -150 316 -144 -176 -539 634 -29
3381 -29 170 -322 502 234 504 -136 -205 304 -331 83 633 -232 -219 -146 201 -8 -452 567 -320 -31 -29 470
3403 470 -478 -493 348 488 -253 -421 355 126 269 -70 427 -253 -978 -171 -6 363 -285 823 -174 207
3423 207 -166 -260 518 -3 690 253 -70 -866 -66 -187 -444 -560 496 -56 82 448 234 281 -427 19
3443 19 99 43 -194 176 -480 -62 321 264 229 144 -683 322 235 -382 -123 -238 -367 -434 98 438 -21 131
3465 131 -88 93 -464 -462 135 -55 -455 -259 559 446 121 420 357 324 -49 516 563 -16 -466 -242 318 -268
$$ packed form
3318I2o32Q31l51K44k05K97J50q77L86K99nl67J05M95p32O5j4k49L32K25P17o43
3340A63j98j5K71n45K29k31K68j84P7O54j24n29l28P27l28k89K67K46J2k07j63
3361b27O96k47l04J60M26o19j00K39J79o71M01n95N68n6M66m60l2l63J173o63
3381b9J99m92Q24k68K70o40o9N09o35M14N50q65J3P3L47k09m44J019q87K89KM99
3403D70r48j5Q41J40p41j68P76k29J43l39M97o80p25Q07J65L69o48J108r97L81
3423B07l73r4P78n21O93m37l23p96Q00j21k57j16J056n52J38L66k14M7p08M46
3443A9Q0n6k37L70o56M18L83n7l5q5q27J005q7o17K59j15j29o7N32L40m59J52
3465A31k19J81n57KN97j90m00J96Q18j13l25K99o3l3l73N65M7n79m50K24N60n86
$$ plain form
3487 -268 72 206 -193 217 -175 -349 -508 573 -347 70 41 -454 -135 343 126 -38 294 339 -642 -125
3507 -125 42 93 109 41 163 30 417 -74 37 297 261 169 132 -175 238 -90 -207 399 28 357 -58 -380
3529 -380 -82 359 -209 340 87 -181 -901 347 -443 58 -298 -243 83 -139 -352 -215 -194 -456 -265 529
3549 529 496 120 688 -654 -306 -398 129 -35 -419 -595 205 -386 128 -422 -1311 109 -687 -202 -580 -102
3569 -102 -43 49 -193 -288 -44 11 297 88 188 46 -410 -194 -194 -486 199 88 2 -103 32 -154 252 -89
3591 -89 -158 341 118 30 -87 121 -34 -131 -281 306 -143 -37 256 74 79 195 225 -80 -50 29 131 -238 -293
3614 -293 211 166 -215 66 371 142 -229 -350 83 16 -296 31 170 -86 -100 -114 76 -260 -250 -59 249 -169
3636 -169 -294 307 -133 -147 8 180 61 -260 38 234 28 -267 147 -56 12 13 315 -175 -6 134 215 -219
$$ packed form
3487b68L40J34l99M10l92j74j59J081r20M17k9m95L19M78k17j64L32M5r81N17
3507a25J67N1J6o8J22j33L87m91J11K60l6r2l7l07M13l28j17O06l71L29m15l22
3529c80K98M41n68N49k53k68p20J248p90N01l56N5L26k22k13J37K1k62J91P94
3549E29l3l76N68j342L48r2N27j64l84j76Q00n91N14n50q89J420p96M85l78M78
3569a02N9R2k42r5K44N5K86k09J00j42m56K16%k92O85j11q6j05J35j86M06l41
3591h9o9M99k23q8j17K08j55r7j50N87m49J06K93j82NJ16L0l05L0P9J02l69n5
3614b93N04m5l81K81L05k29l71j21M33o7l12L27J39k56j4j4J90l36J0J91L08m18
3636a69j25O01m40j4J55J72j19l21K98J96k06k95M14k03O8JL02m90J69J40Q1m34
$$ plain form
3658 -219 -98 285 73 11 137 73 -128 -23 -196 -62 611 170 -244 264 220 243 81 -133 184 -59 133
3679 133 26 160 9 306 83 -31 91 4 16 -20 98 -15 -72 -34 -157 -50 38 -63 -108 181 -171 -79 175
3702 175 -62 49 91 -251 -149 98 -248 131 -467 -176 -93 -324 -260 53 -70 14 -244 278 127 -379 -176
3723 -176 33 151 -285 -241 290 239 -235 -432 -225 181 -356 184 324 146 -174 -128 -56 -415 -158 356 -189
3744 -189 -68 1 282 -282 171 418 129 97 -193 390 680 212 -175 -729 476 640 -749 -145 177 -186
3764 -186 -153 150 -49 -83 -261 34 21 -120 456 -42 -176 -95 224 -205 -590 -137 97 -157 124 164 39 -361
3786 -361 205 -144 -76 -11 202 -51 -46 233 233 -141 -12 -69 31 -130 -291 76 143 30 -104 404 -77 18 -134
3809 -134 136 -233 -26 130 59 -92 -87 -109 17 -48 55 134 -399 -158 1 -63 171 -424 288 99 -463 -137
$$ packed form
3658b19J21L83k12o2J26o4k01J05j73J34O73m41m14N08m4K3j62k14L17k43J92
3679A33j07J34j51K97k23j14J22q7J2l6J18j13n7L8j23J07Q8j01m5K89l52R2K54
3702A75k37J11M2l42J02K47l46L79n98K91Q3k31O4L13j23Q4k58N22j51n06K03
3723a76K09J18m36M4N31n1m74j97K07M06n37N40J40j78l20M6P2l59K57N14n45
3744a89J21O9K81n64M53K47k89l2k90N83K90m68l87n54J205J64j389O04L22l63
3764a86L3L03j99l4j78K95j3j41N76m98j34Q1L19m29l85M53K34k54K81M0j25m00
3786c61N66l49O8O5K13k53NK79%l74J29n7J00j61j61L67O7j13j34N08m81R5j52
3809a34K70l69K07J56p1j51Nk2J26o5J03P9n33K41J59o4K34n95P12j89n62L26
$$ plain form
3831 -137 283 22 -157 -21 162 -51 -282 -7 -80 -182 -310 141 135 -124 -17 57 98 -287 244 362 192 -295
3853 -295 0 19 22 209 46 -145 92 235 262 228 -196 -25 497 24 -300 972 -356 305 -249 464 -586
3874 -586 313 -237 90 700 40 43 480 265 -244 119 127 -425 105 827 646 -86 169 252 -583 352 -229 174
3896 174 -286 -427 137 101 -508 422 -312 59 -42 -183 226 -406 -496 -281 552 -376 -595 1671 -519 171
3916 171 736 926 -92 508 280 -436 417 -350 -411 -396 -100 491 644 -210 -110 -528 -421 -417 1199 369 -353
3937 -353 1232 -61 447 977 20 -419 -123 428 269 -501 -642 719 -69 -583 371 32 823 1030 439
3956 439 -600 197 857 4 -42 -770 645 1169 -140 -296 -418 416 -158 509 -286 -563 474 326 188
3975 188 364 269 548 93 -122 -86 -19 345 -162 46 59 -70 3 117 -38 -223 186 174 105 219 -236 37
$$ packed form
3831a37M20k61j79J36J83k13k31K75p3j02j28M51ok59J07P4M1l85N31J18j70m87
3853b95K95J9LJ87j63j91K37J43K7l4m24J71N22m73l24J272j328O61n54P13j050
3874e86Q99n50L27O10o60LM37k15n09L63Qn52N30P22j81p32K55Q3q35R35n81M03
3896A74m60j41N64l6o09R30p34L71j01j41M09o32r0K15Q33r28k19K266k190O90
3916A71N65J90j018O00k28p16Q53p67o1J5K96N91J53q54J00m18J07MJ616q30p22
3937c53J585j293N08N30r57m39K96N51j59p70j41J361p88n14R54l39P91K07n91
3956D39j039P97O60q53m6p28J415N24j309j56j22Q34n74O67p95k77J037j48j38
3975A88J76r5K79m55k15L6O7L64n07K08J3j29P3J14j55j85M09j2o9J14m55K73
$$ plain form
3997 37 -139 -425 88 -121 -27 52 242 -258 36 9 194 187 -106 -132 153 -289 -7 40 -59 -67 -103 -91 8 51 106
4022 106 -153 13 9 189 -134 -62 -39 117 -45 -15 232 67 -22 -177 161 181 161 358 -37 -82 -191 31 -89
4045 -89 -328 -87 -121 80 7 -38 24 132 -24 -297 9 27 159 -13 126 13 -73 -49 125 -211 -11 -10 42 124
4069 124 183 214 -150 -165 156 -100 45 -201 17 -121 8 -52 75 55 -233 186 79 264 -96 6 -305 -254
4091 -254 -6 5 -23 -59 73 96 69 -347 -95 72 158 -98 -152 304 22 -318 145 -131 29 15 128 -50 -284
4114 -284 92 138 -31 -21 54 -16 -43 -25 105 36 -12 -147 -42 161 47 129 -6 -18 -102 106 219 -40 45 41 -154
4139 -154 -130 133 -88 -54 -204 -111 2 -18 -303 -58 162 -31 -49 -135 141 401 -24 52 136 -131 -32 77 -195
4162 -195 67 5 -252 -144 -9 77 113 -36 -107 -62 132 -20 -65 -34 27 -94 62 -72 -43 -100 -63 -14 -11 24 124
$$ packed form
3997C7j76k86N13k09R4P9J90n00K94k7J85pk93k6K85m42K82M7r9ql6J2R9M3N5
4022A06k59J66mJ80l23P2K3J56j62L0K47j65q9j55L38K0k0J97l95m5j09K22j20
4045h9k39K41l4K01p3m5O2J08j56k73L06J8J32j72J39j13q6K4J74l36K00JN2Q2
4069A24N9L1l64j5L21k56J45k46K18j38J29o0J27k0k88M19j07J85l60J02l11N1
4091b54K48J1k8l6J32K3k7m16K52J67Q6k56n4M56k82l40M63k76J60j4J13j78k34
4114b84L76M6j69J0P5p0k7J8J30o9m8j35J05K03j14Q2j35j2q4K08J13k59Q5mj95
4139a54K4K63k21L4j50R3J13k0k85K45K20j93j8q6K76K60m25P6Q4k67R9J09k72
4162a95K62o2k57J08J35Q6L6j49p1M5J94j52m5L1O1j21J56j34K9n7L7M9LL5J00
$$ plain form
4187 124 117 -113 126 -61 30 -335 -175 -12 -39 9 -99 -25 5 56 -185 -59 -214 92 21 20 42 134 179 -143 183
4212 183 -128 -28 54 -89 46 1 28 178 -183 -126 -26 -30 466 -147 74 245 8 -52 135 -10 84 -14 36
4235 36 146 -85 137 70 84 64 94 -88 -161 50 78 -78 -37 47 -199 258 46 -25 13 -31 -7 -75 -268 -185 -162
4260 -162 -170 -131 -292 -122 -158 69 40 79 52 -92 -158 -85 -34 65 44 21 -92 -325 -25 -112 110 -284 -71 -170 10
4285 10 -175 40 145 -156 -12 145 92 -35 -95 -46 137 -115 -202 36 -2 -97 -22 127 49 -87 361 -32 -126
4308 -126 65 -19 -61 137 77 185 -36 -139 162 -98 122 -227 37 93 -62 -246 -125 48 103 263 -3 -170
4330 -170 208 24 33 -99 -116 -20 115 65 114 28 54 -322 -146 180 -62 -144 -287 -179 -235 59 115 -101 -83 273
4354 273 -231 -219 -200 7 -72 -17 -227 -32 62 139 71 -95 152 -256 126 -75 -193 -424 -106 -93 83 70 -240
$$ packed form
4187A24pk30K39j87R1l65J60J63k7M8j08P4L0N1k41J26j55L06p1jK2R2M5l22L26
4212A83l11J00Q2j43J35m5K7J50l61N7J00mM96o13K21J71k37o0J87j45R4r8N0
4235C6J10k31K22o7J4k0L0j82p3K11K8j56M1Q4k46M57k12p1L8m4K4o8j93Q3K3
4260a62qL9j61J70l6K27k9L9k7j44o6P3N1R9k1k3j13k33L00q7K22l94K13r9J80
4285A0j85K15J05l01J44J57n3j27o0M9J83k52q7K38l8r5P5J49p8j36M48l93r4
4308a26J91q4m2J98o0J08k21j03L01k60K20l49K64N6j55j84J21J73N5J60k66j67
4330a70L78j84Rj32j7R6J35n0M9q6K6l76J76L26k42q2j43J08n6K94N6k16J8L56
4354B73n04J2J9K07p9N5k10J95R4P7o8j66K47m08L82k01j18k31L18J3J76j3l10
$$ plain form
4377 -240 -181 -1 39 34 136 16 191 77 -271 224 41 -2 31 -138 163 -24 -76 42 56 28 37 60 101 290
4401 290 -139 -42 6 154 -16 259 -207 135 -190 75 9 47 132 208 1 -55 44 26 -15 -79 -220 92 -45 155
4425 155 123 73 -13 -71 101 -2 -74 -61 138 -167 -157 -143 -24 61 -266 142 21 99 39 89 -282 -3 9 205
4449 205 -275 220 -210 -266 153 14 -56 -215 78 -96 -118 -56 267 82 -358 -21 -68 -35 -106 -18 -232 105 -133
4472 -133 -104 112 84 -51 -54 161 -144 241 28 -42 61 163 -151 47 169 -41 202 -62 77 1 -170 360
4494 360 94 79 293 -147 323 -58 -39 -89 90 176 -40 51 227 -2 51 257 -20 127 137 -70 -25 -11 -3 106
4518 106 4 54 26 193 -212 0 -11 -178 1 -23 -52 400 -36 100 173 154 42 -221 108 223 51 242
4540 242 -102 190 -58 105 -170 -206 -221 176 -26 -36 134 176 -43 -222 37 44 83 6 90 220 -21 50 32 -9
$$ packed form
4377b40N9J80M0nJ02j20J75j14l48M95j83m3L3j69L01j87n2J18J4k8RK3M1J89
4401B90m29R7M8J48j70K75m66L42l25K65o6L8Q5P6k07n6R9j8m1o4j41L12j37K00
4425A55l2n0q6n8J72j03p2J3J99l05J0J4J19Q5l27M08j21P8o0N0l71K79J2J96
4449B05m80M95m30n6M19j39p0j59K93j74k2O2L23j85m40L37m7L3p1Q8k14L37k38
4472a33K9K16k8j35lK15l05L85k13p0J03J02l14J98J22k10K43k64J39p6j71N30
4494C60k66j5K14m40M70l81J9n0J79Q6k16R1J76k29N3K06k77J47J0k07M5J4QJ09
4518A06j02N0k8J67m05K12j1j67J79k4k9M52m36J36P3j9j12k63L29J15j72J91
4540B42l44K92k48J63k75l6j5L97k02j0J70M2k19j79K59PL9p7Q4J30k41P1j8m1
$$ plain form
4564 -9 -102 125 228 -4 110 83 -5 23 -193 38 -69 106 -152 -43 -73 82 -246 55 120 -26 -173 40 271
4587 271 -32 65 -104 180 -84 27 -27 73 76 28 -54 -55 -160 240 196 92 132 -57 -95 -229 -106 50 -63 268
4611 268 -54 32 181 288 31 49 52 -121 -52 204 -139 -354 259 -265 20 -124 -183 -18 -71 164 -454 -360 -254
4634 -254 88 -47 -331 -14 264 225 -118 -84 -104 -34 25 7 99 -175 -145 271 -33 -195 -268 -85 47 35 48 -146
4658 -146 -71 62 -42 -48 19 37 -22 -39 20 -143 -21 -145 96 -256 -127 -106 -191 -145 110 60 56 177 -53 -160 -455
4683 -455 167 -4 21 171 116 20 119 76 71 96 91 54 42 138 -3 -131 95 8 -135 40 286 -45 -250 -48 90
4708 90 51 -13 -69 -73 -371 -86 -33 54 -35 61 -171 22 -42 -191 -165 -46 183 -31 -212 56 -62 15 97 74 -487
4733 -487 -7 5 30 207 210 61 235 -165 395 171 -113 367 -35 590 -79 -447 2 318 -572 141 364
$$ packed form
4564ir3K27J03k32J14k7q8K8k16K31j07J75k58J09l0J55l28L01O5j46j47K13K31
4587B71l03R7j69K84k64J11n4J00Lm8q2jj05M00m4j04M0j89l8j34J23J56j13L31
4611B68l22Q6J49J07k57J8Lj73O9K56l43k15O13n24K85j44n9J65n3K35o18R4J06
4634b54L42j35k84L17K78l9l43L4k0P0N9j8R2k74L0M16l04j62p3J83J32j2J3j94
4658a46P5J33j04oO7J8n9j7N9j63J22j24K41l52J29K1q5M6K55n0mJ21k30j07k95
4683d55O22j71K5J50n5r6R9m3nK5nl7j2R6j41j28K26q7j43J75K46l31k05K02J38
4708I0l9o4n6mk98K85N3Q7q9R6k32J93o4j49K6J19K29k14j81K68j18P7Q2k3n61
4733d87M80J2K5J77Lj49J74m00N60k24k84M80m02O25o69l68M49L16q90P13K23
$$ plain form
4754 364 -67 732 479 71 729 178 -378 271 8 -18 216 389 357 -819 159 437 754 -102 -217 565
4774 565 200 257 -85 14 28 -68 112 279 -443 -311 316 -136 48 2 41 28 25 -188 -200 175 23 2 -176 -183
4798 -183 -266 139 -81 11 144 -236 222 2 -38 -148 -22 -136 244 -80 41 -145 19 65 75 -16 -212 -41
4820 -41 -40 8 -117 -251 369 398 -83 117 45 280 -152 97 120 32 -236 436 32 123 -126 -172 -50 -82 143 61
4844 61 2 -171 244 226 -67 151 220 -162 -310 -19 43 75 126 148 179 -191 -80 48 243 -186 -73 148 -28
4867 -28 -15 7 -63 13 -41 -24 150 -35 -168 -69 -80 174 14 -137 15 170 -184 95 -111 -191 -3 117 127 -107
4891 -107 -132 -44 96 96 63 46 -30 169 48 49 -149 2 82 -20 123 -20 181 32 -83 -225 27 62 -16 -270
4915 -270 153 -183 -38 -188 -120 -69 -111 -153 -313 -135 -222 -97 29 -275 -51 -163 2 -64 69 -46 -75 -43 36
$$ packed form
4754C64m31P99k53m08O58n51n56O49k63k6K34J73l2j176R78K78L17q56j15P82
4774E65l65N7l42R9J4r6J80J67p22J32O27m52J84m6L9j3lk13j2L75j52k1j78p
4798a83q3M05k20R2J33l80M58k20m0j10J26j14L80l24J21j86J64M6J0r1j96J71
4820d1JM8j25j34O20K9m81K00p2K35m32K49K3q8k68O72m04R1k49m6J22l2K25q2
4844F1n9j73M15j8k93K18O9l82j48K91O2L2N1K2L1l70J11J28J95m29J13K21j76
4867b8J3K2p0P6n4J7J74j85j33R9j1K54j60j51J52J55l54K79k06q0J88J20J0k34
4891a07k5Q8J40%l3j7p6J99j21Jj98J51Q0j02J43j43K01j49j15j42K52L5p8k54
4915b70M23l36J45j50O8N1m2m2j60J78q7J25J26l04K24j12J65o6J33j15k9L2P9
$$ plain form
4938 36 20 -105 -63 -131 -7 -55 372 -68 35 -73 19 -98 -21 -201 -219 -63 -38 -160 187 176 -142 191 -44
4961 -44 -141 -87 398 -122 -22 48 -169 -189 167 75 -209 73 2 1 114 375 223 188 129 123 -6 174 20 282
4985 282 14 -17 -301 -172 107 28 69 230 -319 114 -160 193 46 119 -204 42 -158 -1 -89 -200 91 177
5007 177 71 -50 52 2 -285 43 -293 -99 77 -195 193 29 23 -93 -161 -52 -174 -93 110 -121 71 174
5029 174 -307 -207 -54 -18 -254 229 220 -115 -29 -134 -17 -49 30 -111 165 106 -135 311 -41 -25 19 -7 -250
5052 -250 147 -241 -269 305 149 127 228 -7 -113 11 129 25 123 -153 30 109 -70 -32 -147 165 145 -238
5074 -238 -13 -99 -112 -231 85 106 -74 -125 60 -148 -24 10 244 -43 -18 -16 -156 -238 -87 -146 -42 28 -226 -75
5098 -75 -144 88 263 230 -51 -142 -169 -4 -212 -102 26 -200 65 88 -125 -117 -30 206 90 173 235 -94 -211 -75
$$ packed form
4938C6j6j25M2o8J24m8M27m40J03j08R2j17P7j80j8J56K5j22L47j1l18L33k35
4961d4r7N4M85n20J00P0k17k0L56r2k84K82p1jJ13K61j52l5n9oj29J80j54K62
4985B82k68l1k84J29K79p9M1J61n49M33k74L53j47P3l23K46k00J57q8j11K91Q6
5007A77j06j21J02n0k87L28l36J94J76k72L88j64oj16o8J09j22Q1K03k31J92J03
5029A74m81J00J53L6k36M83rl35Q6j05J17l2P9j41K76n9k41M46l52J6M4k6k43
5052b50L97l88k8N74j56k2J01k35j06J24J18j04R8k76J83P9j79L8j15L12k0l83
5074b38K25q6j3j19L16K1j80n1J85k08J24L4K34k87K5Kj40q2J51n9J04P0k54J51
5098g5o9K32J75l3k81r1k7J65k08J10J28k26K65K3k13QQ7K36j16Q3O2l29j17J36
$$ plain form
5122 -75 116 -164 47 -184 -189 -263 162 -17 16 -106 269 71 75 63 -256 208 -49 160 -74 -178 -56 -124 127
5145 127 -186 233 -44 138 74 -41 -140 44 -36 104 157 27 -34 -130 251 -77 -15 202 31 -14 -126 59 -32
5168 -32 -276 52 2 103 104 -149 106 -106 18 307 10 -219 -10 16 -17 -27 204 189 17 157 -197 -179 132
5191 132 53 -12 -155 111 132 -54 238 1 27 -183 -221 -96 55 -159 -35 69 62 -18 -256 122 24 62 -263
5214 -263 126 71 -277 249 40 -202 -196 101 8 110 7 146 243 -96 -4 104 245 -78 44 -53 86 -295
5236 -295 141 -170 -52 192 609 284 -278 90 275 -244 184 161 74 -331 662 680 617 -804 193 -343 -682
5257 -682 -1048 415 145 -3 861 -147 41 -512 -306 26 333 88 -245 89 -174 132 52 -343 207 -161
5277 -161 -122 131 55 -262 32 -79 22 -128 -298 -57 -72 -215 32 -1 -92 -248 -261 31 104 -149 -158 81 145
$$ packed form
5122g5J91k80K11k31np4M25j79L3j22L75j98Mj2l19M64k57K09k34j04J22o8K51
5145A27l13M19k77J82o4j15r9J84q0J40N3j30o1r6L81l28O2K17j71m5j12J85r1
5168c2k44L28n0J01Jk53K55k12J24K89k97k29K09K6l3j0K31j5j72J40l54J8L11
5191A32p9o5j43K66K1j86K92k37K6k10l8J25J51k14J24J04pq0k38L78r8L8l25
5214b63L89n5l48N26k09k42OK97r3J02j03J39R7l39R2J08J41l23J22r7J39l81
5236b95M36l11J18K44M17l25n62L68J85n19M28k3q7m05R93J8o3j421R97n36l39
5257f82l66J463k70j48Q64j008J88n53K06L32L07k45l33L34k63L06q0l95N50l68
5277a61L9K53p6l17K94j11J01j50j70K41j5j43K47l3r1j56j3K92P3k53rK39O4
$$ plain form
5300 145 -18 -137 91 96 -233 206 41 198 -73 -107 105 -131 101 255 60 94 31 -128 -92 -66 203 400
5322 400 216 109 135 189 -147 42 65 153 -304 168 -26 127 66 -169 192 79 20 288 54 181 -199 10
5344 10 142 98 63 -220 147 125 -50 -108 -75 -163 258 -13 0 -127 96 -7 210 79 66 65 213 -32 -114 -151
5368 -151 20 -38 172 -173 -410 122 -140 -8 -209 104 5 -57 -84 159 -41 -275 -130 -200 -216 -285 -239 -41 29
5391 29 193 -94 -75 -114 -201 186 -272 382 -198 -79 -319 237 47 487 315 528 -571 126 -216 -488 110
5412 110 302 96 81 130 -57 115 107 345 402 -272 228 198 194 -73 74 212 -102 204 -100 -113 -145 -228 192 -48
5436 -48 140 -32 6 -2 -51 -36 229 105 -222 -67 -39 76 5 -127 12 -71 -6 -59 -43 -102 -200 -33 -164 1 -111
5461 -111 -29 72 -24 -23 -308 -210 -103 205 18 -38 207 46 9 -51 -90 74 -165 10 136 132 150 -2 86 -243
$$ packed form
5300A45j63j19K28Nl29M39j65J57k71l4K12k36K32J54j95L4o3j59L6K6K69J97
5322D00j84j07K6N4l36J89K3Q8m57M72j94J53o1k35L61j13n9K68k34J27l80K09
5344A0J32m4l5k83L67k2j75n8L3q8M21k71J3j27K23j03K17j31j3jJ48k45q2l7
5368a51J71n8K10l45k37N32k62J32k01L13r9o2k7K43k00k34J45p0j6o9M6J98P0
5391B9J64k87J9l9q7L87m58O54n80J19k40N56j90M40j72K13j099O97l42k72N98
5412A10J92k06j5M9j87J72qK38N7o74N00l0mk67J47J38l14L06l04j3l2q3M20k40
5436d8J88j72L8qm9J5K65j24l27J55K8J15p1j32J39q3O5n3J6n9r8J67j31J65j12
5461a11Q2J01r6Jk85R8J07L08j87n6K45j61l7o0l9J64k39J75J26mJ8j52Q8l29
$$ plain form
5485 -243 -8 76 39 -309 -444 205 553 -220 -390 289 -313 371 -23 395 1 -85 109 222 -122 652 193
5506 193 257 918 -464 -335 169 -61 -268 72 184 273 199 -122 146 26 63 136 345 82 151 44 -163 84
5528 84 -11 -64 -145 -163 194 11 137 -80 -94 6 -96 10 -50 1 -142 -11 70 -111 60 104 -64 -83 -34 186
5552 186 -42 116 -1 2 180 37 -69 51 -58 201 189 -284 162 -21 -395 -58 40 -104 63 82 -45 -37
5574 -37 79 61 53 -65 -258 21 -99 -209 139 -59 64 87 76 67 -34 153 232 94 -166 -221 -102 -157 -22 -50
5598 -50 -17 -87 318 -75 108 -14 87 155 -216 119 -234 102 -125 81 -45 -161 -118 72 4 48 -9 -72 -11
5621 -11 -66 203 46 207 -12 -1 -91 154 93 -48 -3 -213 -179 218 -149 102 75 107 166 -277 -54 -35 119 -122
5645 -122 -208 -313 107 -123 -190 77 76 79 -241 -19 115 -17 51 61 144 -90 -172 -187 66 62 177 83 92 -107 35
$$ packed form
5485b43K35Q4l7l48j35O49L48p73j70O79o02O84l94M18l94q6J94J13l44P74m59
5506A93O4O61j382J29N04k30k07L40J12Q9p4l21K68j20L7P3K09k63O9j07k07K47
5528H4r5n3q1j8L57j83J26k17j4J00j02J06o0N1j43J31Q1j81J71M4j68j9M9K20
5552A86k28J58j17LJ78j43j06J20j09K59j2m73M46j83l74L37R8j44J67J9j27Q
5574c7J16j8qj18j93K79j20j10L48j98J23K3j1rj01J87P9j38k60n5J19n5J35k8
5598e0L3p0M05l93J83j22J01O8l71L35l53L36k27K06j26j16M3J90o8M4n7o3O1
5621a1n5K69j57J61k19J1r0K45o1j41M5k10L4L97l67K51k7L2N9m43K23J9J54k41
5645a22q6j05M20k30o7K67jLl20K22J34j32O8J0Q3k34q2j5K53mJ15r4Rj99J42
$$ plain form
5670 35 212 -24 -283 -241 78 115 -45 272 150 -264 -65 -41 24 -58 46 -29 -87 230 103 1 -98 -70 52
5693 52 -23 104 79 6 14 65 -117 -37 111 28 -59 165 26 -140 97 -2 40 -275 385 -175 -53 178 9 28
5717 28 104 69 98 -99 101 -282 -195 51 -14 -81 -11 -73 238 -24 -58 63 79 94 -252 61 -140 63 -252 95
5741 95 -33 65 -48 -65 -178 -68 -166 63 82 -85 -29 63 -25 28 -44 312 54 66 31 -132 -246 -130 -55 -27 -172
5766 -172 151 166 -129 -197 140 -26 34 109 -71 -181 96 124 66 104 449 307 84 401 -162 297 52 12 57
5789 57 -79 -114 -46 -192 28 -278 -87 200 156 111 10 -118 199 108 -82 -22 -158 142 -129 153 -59 230
5811 230 169 29 175 19 -239 -159 -11 -73 107 36 61 -123 97 -7 -146 -6 102 -164 221 163 89 -147
5833 -147 -114 -115 -57 215 256 115 -65 128 -31 -172 17 131 -99 -46 52 -45 171 58 -25 69 -179 -167 71 -38
$$ packed form
5670C5J77k36k59M2L19L7j60L17j22m14J99K4O5q2J04p5n8L17j27j02r9K8J22
5693E2p5J27k5p3QN1j82Q0J48q3q7K24j39j66K37r9M2l15O60n60J22K31j69J9
5717B8P6l5K9j97K00l83Q7K46o5o7P0o2L11k62l4J21J6J5l46L13k01K03l15L47
5741I5j28R8j13j7j13J10r8K29J9j67N6R2q8N3p2L56k58J2l5j63j14J16P5K8j45
5766a72L23J5k95o8L37j66O0P5j80j10K77K8n8L8L45j42k23L17n63M59k45m0M5
5789E7j36l5O8j46K20l06J91K87m4m5j01j28L17r1j90O0j36L00k71K82k12K89
5811B30o1j40J46j56k58Q0J48o2J80p1K5j84K20j04j39J40J08k66L85n8p4k36
5833a47L3jN8K72M1j41j80J93j59j41J89J14k30N3R8r7K16j13q3R4k48J2K38j09
$$ plain form
5857 -38 -107 2 -41 78 -122 73 400 5 86 94 6 161 -173 -305 -198 119 -76 9 -93 27 43 9 169
5880 169 -45 -18 -78 -50 126 43 -176 68 6 -7 75 8 -80 -81 111 -1 -18 -131 258 33 -1 -276 96 -170
5904 -170 -134 184 -33 184 7 -108 -210 102 127 -227 -82 -90 27 -45 175 141 -27 70 -150 40 -62 -45 -33
5927 -33 52 86 -110 -141 1 17 67 19 48 104 97 84 -18 -44 66 325 -152 -100 -120 79 -10 -43 -205 -148 41 -232
5953 -232 225 -63 213 -179 71 -35 -4 -132 10 -79 6 206 142 136 -20 -36 -65 -57 6 38 167 1 3 117 -186
5978 -186 -70 -30 -142 2 -81 -30 10 -11 -91 50 -89 -136 -196 35 -16 191 -105 26 -422 -112 -77 20 223 -29
6002 -29 -222 -219 -226 140 47 -78 126 -58 219 -127 8 -162 78 -58 136 -145 79 70 -204 41 -9 -75 -93 -172
6026 -172 33 -74 156 224 -25 70 117 -127 -52 -149 -188 -46 344 -38 -6 186 -399 51 -34 36 157 -27 -99
$$ packed form
5857c8o9J09m3J19k00J95L27l95Q1Qq8J55l34j32J07L17j95Q5j02J20J6l4J60
5880A69k14K7o0K8J76q3k19K44o2j3Q2o7q8jJ92j12j7j13L89k25l4k75L72k66
5904a70L6L18k17K17j77j15j02L12K5l54J45qJ17p2K20l4j68R7k20J90j02J7J2
5927c3Q5L4j96l1J42J6N0m8K9N6pj3j02k6J10K59m77N2k0J99q9l3j62N7J89k73
5953b32M57k88K76l92K50j06L1j28J42q9Q5K00o4oj56j6k9QO3L2J29j66KJ14l03
5978a86J16M0j12J44q3N1M0k1q0J41j39m7o0K31n1K07k96J31m48L10L5R7K03k52
6002b9j93LpL66r3j25K04j84K77l46J35j70K40j36J94k81K24rk74K45n0o6j8p9
6026a72K05j07K30O8k49R5M7k44P5r7l9J42L90l82L2J92n85M50q5P0J21j84p2
$$ plain form
6049 -99 -178 71 -192 29 -31 160 208 -41 -42 57 210 -147 125 58 -42 178 235 28 93 -12 -91 32 212 0
6073 0 -93 27 -240 -66 -5 18 24 70 292 112 -100 -55 -80 -32 -42 148 -48 116 163 142 25 -82 -23 -167 -25
6098 -25 18 78 -1 76 -157 -150 -272 -68 8 -258 70 17 -49 -33 53 -119 -231 25 231 -86 -68 -9 103 78 -161
6123 -161 -83 -44 23 122 76 102 124 -68 -54 42 141 -47 -14 2 -115 223 27 116 -143 120 97 -115 152 148 6
6148 6 -51 78 186 52 118 -117 -155 -57 -134 -217 7 -43 52 -23 1 -412 -253 369 -170 160 -129 237 -56 -47 63
6173 63 -305 -75 20 242 -121 -77 -35 96 100 74 35 74 236 334 -387 135 20 -191 17 71 5 133 268 196
6197 196 47 1 44 -66 -263 79 -182 -45 230 111 -128 -10 147 67 72 -34 320 160 290 -6 140 200
6219 200 -214 86 60 -105 -117 93 -330 24 143 -24 -343 72 269 -159 16 64 92 -71 80 -201 -39
$$ packed form
6049i9p9K49k63K21o0J91M8k49jR9J53l57K72o7j00K20N7k07O5j05p9J23J80k12
6073@r3J20k67J74O1K3OM6K22j80k12M5k5M8j0J90j96J64M7k1j17j07N9j44J42
6098b5M3O0p9P7k33Pj22K04P6k66L28n3o6J6Q6j72j12K56K06l17J8N9J12k5k39
6123a61P8L9O7R9m6K6K2j92J4R6R9j88L3J6j17L38j96Q9k59K63k3k12K67mj42
6148Fn7J29J08j34O6k35l8R8p7q3K24n0R5p5K4m13J59O22n39L30k89L66k93RJ10
6173F3l68K30R5K22l63M4M2J31Mk6l9L9J62R8p21N22j15k11K08N4o6J28J35p2
6197A96j49m6M3j10j97L42k61J37K75j19k39J18J57q0Nj06L54j60J30k96J46O0
6219B00m14L00k6j65j2K10m23L54J19j67l19M15J97m28J75M8K8j63J51k81J62
$$ plain form
6240 -39 -235 -116 40 21 65 143 80 25 239 -7 -250 23 -16 3 -178 -158 107 119 -13 -239 79 20 124 -127
6264 -127 257 105 -16 -5 174 133 -284 43 158 28 -230 5 -26 74 66 162 -43 -96 137 -238 71 -80
6286 -80 88 -1 54 -369 154 -184 138 -39 78 -80 -134 -218 81 -5 63 -20 18 71 203 18 8 36 -211 31
6310 31 -201 78 73 23 28 65 23 -81 166 -37 61 -165 93 -148 -121 128 -104 -262 177 35 95 -77 343 -43
6334 -43 -12 317 -105 -131 -20 -58 -38 212 125 3 -127 69 -331 17 -130 -81 -117 -12 -154 -24 -156 -55 24
6357 24 61 59 -120 -106 -91 -40 -176 -309 -34 162 148 113 122 57 -254 95 68 301 -46 -114 -5 66 115 17 216 352
6383 352 -258 145 -26 95 145 -208 -58 172 8 -60 -11 -129 56 -162 -225 -26 -39 7 -126 -28 48 98 130
6406 130 -51 53 37 -284 443 -92 81 326 -66 -82 150 56 127 -176 191 -437 -142 297 -58 43 34 31 86
$$ packed form
6240c9j96J19J56j9M4P8o3n5K14k46k43K73l9J9j81K0K65J2j32k26L18n9J04k51
6264a27L84j52j21J1J79m1m17L27J15j30k58K35l1J00qR6k05n3K33l75L09j51
6286h0J68q9N5m23N23l38L22j77J17j58n4q4K99q6O8q3L8N3J32j85j0K8k47K42
6310C1k32K79nn0NL7m2j04K47k03R8k26K58k41K7K49k32j58M39j42O0j72M20l86
6334d3L1L29m22k6J11l8K0K50q7j22j30J96m00L48j47M9l6J05j42J30j32J01P9
6357B4L7kj79J4J5N1j36j33K75J96j4l5Ro5l11L49k7K33l47o8J09P1M9r8J99J36
6383C52o10M03j71J21N0l53J50K30j64o8M9j18J85k18o3J99j3M6j33R8P6N0L2
6406A30j81J04j6l21P27n35J73K45l92j6K32r4P1l03L67o28K95M39l55J01rlN5
$$ plain form
6429 86 -100 109 267 114 32 -17 56 -332 -156 -47 -138 134 223 -252 -53 104 -48 -54 252 -245 284 6 168
6452 168 133 81 -54 -130 -129 59 145 -220 -120 -37 -93 18 -172 -41 -288 137 306 46 -102 27 24 -97 -208
6475 -208 -41 70 -35 91 84 -32 79 5 -187 140 231 84 -213 62 -148 -3 -62 -259 79 71 -95 38
6497 38 -133 125 -178 30 73 80 59 16 -101 0 -22 -63 -77 102 -115 -32 58 -37 40 -45 106 120 21 -250 431
6522 431 -68 -140 -56 -45 -281 -90 0 -12 45 210 30 100 66 47 124 2 -336 -16 115 -120 -188 -48 -16 119
6546 119 -65 17 -130 25 102 82 -232 -176 -137 132 254 -9 80 -36 -86 -167 84 131 169 -64 147 135 259 -137
6570 -137 -193 74 44 14 -107 -106 -60 -22 -99 -26 213 -10 -79 198 -79 -81 195 88 -119 58 -86 136 -255 -45
6594 -45 -171 134 -68 79 -193 69 5 -131 -135 194 -160 -49 237 46 -140 -113 -9 -43 -24 99 -6 83 -184
$$ packed form
6429H6j86K09J58j53q2m9P3l88J76J09r1K72Q9m75J99J57j52oL06m97N29k78J62
6452A68l5n2j35p6JJ88Q6l65J00Q3n6J11j90J31k47M25J69k60j48J29lj21j11
6475b08J67J11j05J26pj16J11p4j92L27R1j47k97K75k10J45n9j97L38qj66J33
6497C8j71K58l03K08M3Pk1m3j17J01k2m1j4J79k17Q3R0r5P7q5J51J4r9k71O81
6522D31m99p2Q4J1k36J91R0j2N7J65j80P0l4j9P7j22l38L20J31k35o8J40L2J35
6546A19j84Q2j47J55P7k0l14N6L9K69J22k63Q9j16n0q1K51M7L8k33K11j2J24l96
6570a37n6K67l0l0j21JM6L8p7P3K39k23o9K77k77kK76j07k07J77j44K22l91K10
6594d5j26L05k02J47k72K62o4j36mL29l54J11K86j91j86K7J04l4J9J23j05Q9k67
$$ plain form
6617 -184 36 216 -135 -10 -37 -150 166 108 73 171 55 -233 7 -26 143 -96 100 172 -242 -73 19 -123
6639 -123 132 26 44 -71 -16 -30 -2 -92 -85 -201 197 -74 228 -149 223 -158 23 22 -334 -13 52 -108 207
6662 207 295 178 256 -113 6 131 152 -115 208 15 41 207 -76 -65 206 50 135 -121 210 71 -241 40
6684 40 -278 -57 -15 125 -97 77 160 -16 -248 7 -41 119 -128 31 -96 -96 104 -212 -187 -127 34 84 -4
6707 -4 -7 -16 -36 228 2 -92 102 -93 127 -19 -162 -36 -5 -138 12 -1 -20 -234 80 176 160 -202 89 -137
6731 -137 10 43 -175 -122 10 -147 2 116 898 367 -55 512 168 -103 16 -12 -118 -176 -42 -262 13
6752 13 -36 -131 95 -6 -268 -121 -39 166 241 -99 -135 30 -149 89 -114 162 -88 19 20 -392 -108 158 -75
6775 -75 104 104 97 -129 -61 -59 122 -33 40 279 88 213 110 14 -108 35 46 -217 -99 4 49 95 -43 -115 -253
$$ packed form
6617a84K20J80l51J25k7j13L16n8l5R8j16k88K40l3J69k39J96P2m14J69R2j42
6639a23K55j06J8j15N5j4K8r0Pj16L98k71L02l77L72l81J81jl56L21O5j60L15
6662B07Q8j17P8l69J19J25K1k67L23j93K6J66k83J1K71j56Q5k56L31j39l12K81
6684D0l18K21M2J40k22J74Q3j76k32K55m8J60k47J59j27%K00l16K5O0J61N0q8
6707dlrk0K64k26r4J94j95K20j46j43J26L1j33J50j3j9k14L14R6j6l62K91k26
6731a37J47L3k18N3J32j57J49J14P82n31m22N67l44k71J19k8j06n8J34k20K75
6752A3m9r5K26j01k62J47Q2K05P5l40l6J65j79K38k03K76k50J07Jm12K84K66k33
6775g5J79%pk26O8KJ81j55P3K39j91J25j03r6j22J43J1k63J18J03M5M6j38p2j38
$$ plain form
6800 -253 -130 124 152 -55 -127 -57 -169 -90 -30 195 111 70 -26 -167 205 -152 5 69 -244 145 17 77 -291
6823 -291 -193 -119 -130 -72 -37 144 0 -116 -58 65 -124 88 92 -96 -278 -92 51 -147 -65 -369 45 -413 189
6846 189 -8 30 65 -29 -455 -187 686 156 13 253 -165 -497 -121 -217 49 -229 306 -135 576 363 196
6867 196 -86 182 115 -87 354 622 -236 243 -231 -117 23 -510 31 12 166 -153 -143 11 243 105 77
6888 77 77 469 30 187 736 -163 -551 -403 254 4 142 -146 -321 153 -85 -85 33 132 91 -38 -205 28
6910 28 57 323 15 119 -106 -5 -42 -138 -258 -250 -375 -22 101 -322 251 116 45 59 -238 41 295 30 -27
6933 -27 -44 234 -254 6 87 91 -83 378 -197 -192 505 -16 199 94 -277 -123 157 -41 108 219 -12 63 37
6956 37 105 92 283 -35 124 78 162 50 -124 119 -185 -16 452 128 -22 -73 -33 -14 -411 23 94 -50 -6
$$ packed form
6800b53J23K54K8k07p2P0j12P9O0K25q4m1r6j41L72l57J57O4l13L89j28O0l68
6823b91R8P4j1N8L5J81j44j16N8J23j89K12Mj88j82J86J43j98Q2l04M14m58O02
6846A89j97L8L5r4m26K68Q73n30j43K40m18l32L76r6K66k78N35m41P11k13j67
6867A96k82K68o7k02M41K68q58M79m74J14J40n33N41j9J54l19J0J54K32j38k8
6888G7%L92m39J57N49q99l88J48O57k50J38k88j75M74k38%J18R9m1j29j67K33
6910B8K9K66l08J04k25J01l7r6j20Qj25L53J23m23N73j35p1J4k97K79K54k65n7
6933b7j7K78m88K60Q1Mj74M61n75NO97n21K15j05l71J54K80j98J49J11k31P5k6
6956C7O8j3J91l18J59m6Q4j12j74K43l04J69M68l24j50n1M0J9l97M34P1j44M4
$$ plain form
6979 -6 -124 186 -248 140 -87 -48 149 -102 -6 136 439 -81 20 126 -109 -250 122 405 -82 -258 34
7000 34 -152 -146 124 -153 2 16 -211 -147 -114 -4 92 -76 -144 22 -317 19 -61 -674 510 -272 74 -188 -321
7023 -321 -36 -192 -18 -69 554 -145 -737 263 -472 -195 -392 -724 450 -110 90 -69 577 380 223 156
7043 156 -288 -564 -376 -476 178 -145 -276 265 -812 -198 60 272 320 -282 -98 -33 -46 -360 164 -38 -194
7064 -194 387 -197 319 164 282 -564 170 192 140 4 72 158 46 205 -51 -211 7 21 -51 182 -634 675
7086 675 325 221 91 -226 141 151 -15 243 125 325 255 200 -475 32 -211 -200 74 135 11 -242 691 -149
7108 -149 134 31 119 210 -217 234 409 310 -225 -94 17 18 75 -57 -43 -143 102 -34 582 -144 137 -155
7130 -155 265 357 168 92 440 141 175 -296 -70 -82 -151 77 19 -167 -91 -102 -165 -292 60 -86 90 -139 318
$$ packed form
6979fj18L10m34L88k27L9J97k51R6J42L03n20J01J06k35j41L72K83m87j76K92
7000C4j86OK70k77J55J4k27O4L3J10R6j68o8J66l39L36q0o13J184p82L46k62j33
7023c21K85j56J74n1O23o99n92J000p35K77j97l32J174n60K00j59O46j97j57o7
7043A56m44k76J88j00O54l23j31N41j077O14K58K12M8o02J84O5j3l14N24k02j56
7064a94N81n84N16j55J18q46P34K2n2j36O8Q6j12J59k56j60K18J4p2K33q16J309
7086F75l50j04j30l17L67J0j66K58j18K00p0n5o75N07k43J1K74O1j24k53R33q40
7108a49K83j03Q8R1m27M51J75r9n35J31J11JN7j32J4j00K45j36O16p26K81k92
7130a55M20R2j89p6L48k99L4m71K26j2o9K28n8j86P6j1o3j27L52j46J76k29M57
$$ plain form
7153 318 262 -24 -54 -196 16 100 -380 -122 -359 -254 -144 234 -289 -291 -29 -158 -139 -397 -213 -231 -224 151 16
7176 16 -67 154 108 79 -221 -104 157 186 -280 125 -226 -133 -9 101 -93 -45 -7 181 33 215 142 -367 -110
7199 -110 -163 -221 -71 -189 58 127 67 -307 -170 511 -148 216 151 -126 -339 -166 164 330 -322 -120 -66 -275
7221 -275 -138 92 9 -286 -90 96 190 -93 -433 -33 -78 37 50 574 172 359 -64 -11 510 -251 181 431
7243 431 -54 537 314 -21 63 -326 262 -355 -201 -81 117 -160 -162 -12 -200 318 -43 99 38 -118 -213 -225
7265 -225 36 184 -250 -110 -36 79 -172 -377 -55 91 -69 -71 107 110 197 -59 441 -12 -171 -1 243 -293
7287 -293 -81 -117 -81 108 -71 -129 -61 32 -88 -44 -5 233 6 -47 -59 170 -153 158 98 116 53 139 -24 271
7311 271 -26 140 65 84 -99 1 246 190 -126 268 -144 1 64 104 53 -29 -232 -209 -76 -105 -70 55 162
$$ packed form
7153C18n6k86l0j42K12Q4m80K58k37J05J10L78n23kK62j29J9k58J84j8PL75j35
7176A6q3K21m6k9l00J17K61K9m66M05l51R3J24J10j94M8L8J88j48J82p3n09K57
7199a10n3n8J50j18K47O9o0l74J37O81o59L64o5k77k13J73L30J66o52K02N4k09
7221b75J37K30q3k95J96J86R4k83l40M00m5J15J3N24m02J87m23N3N21p61M32K50
7243D31m85N91k23l35Q4l89N88o17J54J20J98k77kJ50j88N18l61J42o1j56r5j2
7265b25K61J48m34J40P4J15k51k05L22J46j60kJ78LQ7k56N00m53j59J70K44n36
7287b93K12l6L6J89j79n8O8R3j20M4L9K38k27n3j2K29l23L11o0J8o3Q6j63K95
7311B71k97J66p5J9j83J00K45n6l16L94m12J45O3M0n1q2k03K3J33k9L5J25J07
$$ plain form
7334 162 48 142 -22 162 45 176 67 -265 -39 -23 -74 95 -189 -81 93 -77 -217 130 -59 -50 88 -129
7356 -129 260 -189 -105 -96 37 87 68 -221 -44 -90 -320 -75 74 -214 -132 -226 -39 70 339 -30 55 77 -126
7379 -126 -125 -8 172 175 -39 74 43 -37 156 -52 -147 -31 91 -81 238 253 128 -53 -61 -120 74 -106 -36 100
7403 100 -35 30 268 -219 38 186 76 -69 129 146 98 27 259 90 2 -115 -93 -225 -65 319 40 81
7425 81 -83 -68 -2 137 -70 71 119 42 196 283 -148 -87 -13 2 8 -84 -54 -72 -4 227 -187 -45 -72 -152 34 168
7451 168 235 899 181 123 -237 -14 365 -128 420 124 -94 249 -181 131 -63 -60 -162 91 -150 115 -52
7472 -52 152 167 -39 68 196 -34 37 -57 -201 -209 -241 -282 -88 -179 -265 -117 112 19 161 336 133 -72 6 -18
7496 -18 -138 -131 -29 29 -144 8 -330 111 -148 -269 49 -19 -91 -64 72 -31 -15 34 -125 143 66 -97 254
$$ packed form
7334A62j14R4j64J84j17J31j09l32K26J6n1J69k84J08J74j70j40L47j89RJ38k17
7356a29L89m49Q4RJ33N0j9k89J77m6k30K45J49k88Q2r4J87J09K69l69Q5K2k03
7379a26JJ17J80Lk14J13l1q0J93k08r5J16J22j72L19J5j25j81qn9J94j80P0J36
7403A00j35O5K38m87K57J48j10j45J98J7m8p1K32j69q8j17K2j32J60L84k79M1
7425H1j64J5O6J39k07J41M8p7J54Q7m31O1P4J5Or2L0j8O8K31m14J42k7q0J86J34
7451A68O7O64p18n8l60K23L79m93N48k96k18L43m30L12j94Lj02K53k41K65j67
7472e2K04J5k06J07J28k30P1r4j44ql2m1J94r1q6J48K29r3J42J75k03k05P8k4
7496a8j20PJ02N8j73J52l38M41k59j21L18o8p2K7J36j03J6M9j59K68p7j63L51
$$ plain form
7519 254 -493 253 -261 -103 278 14 -521 355 -127 -10 46 -55 -127 54 -147 -195 86 -213 411 -510 -94
7540 -94 176 -56 -148 -156 -83 98 -32 155 -85 15 -140 1 -82 68 -216 -181 -40 -372 -172 161 -83 -9 -43
7563 -43 41 61 66 -164 28 -132 -25 60 -123 -88 -151 157 -80 -22 -26 9 -119 167 -173 199 74 -216 137 -72
7587 -72 142 62 322 -62 -77 -88 269 40 93 68 187 78 255 -76 24 125 -84 -11 -56 -111 93 189 58
7610 58 140 11 -244 90 34 -49 -31 162 41 66 -16 -119 65 -7 -223 -6 -56 -55 86 -92 116 -151 -172 -117
7634 -117 -36 -4 -171 5 0 -120 198 -105 71 -110 -24 73 -26 240 -107 -54 -316 -77 -12 -103 -85 -19 -134 -58
7658 -58 -67 77 119 -68 267 97 190 -81 -109 213 109 46 -169 -201 79 -38 -130 253 38 8 -247 43 228
7681 228 -62 153 69 -58 -186 228 114 -95 34 62 -257 -32 19 -187 136 -146 -131 -195 133 -89 28 225
$$ packed form
7519B54p47P46n14J58L81k64n35Q76m82J17N6j01p2J81k01m8K81k99O24r21M16
7540i4K70k32r2qP3J81j30J87k40J00j55J41q3J50k84L5J41l32K00L33k44P4l4
7563d3Q4K0Nk30J92j60J07Q5j83L5o3L08k37N8mL5j28K86l40L72j25k90L53k09
7587g2K14q0K60l84j5j1L57k29N3k5J19j09J77l31J00J01k09P3m5n5K04R6j31
7610E8Q2j29k55L34n6q3J8J93j21K5q2j03J84p2k16K17n0JJ41j78K08k67k1N5
7634a17Q1L2j67J76nj20L18l03J76j81Q6R7r9K66l47N3k62K39O5r1J8O6j15P6
7658e8rJ44M2j87L35j70R3k71k8L22j04o3k15l2K80j17r2L83k15l0k55K90J85
7681B28k90K15q4j27j28M14j14k09J29K8l19K25N1k06L23k82J5o4L28k22J17J97
$$ plain form
7703 225 46 23 -30 167 -105 -77 167 -168 157 193 -277 193 -6 -307 125 -27 -124 290 -66 192 69 229
7725 229 165 82 -95 67 92 13 91 37 -56 -44 281 -206 175 108 252 321 27 32 188 -155 -29 -197 335 -227
7749 -227 265 -19 200 -249 9 139 -128 24 -7 552 466 414 37 -530 -79 -201 340 -255 294 224 -125
7770 -125 -87 -298 261 -607 57 204 -175 -199 23 252 207 -528 -249 -207 -236 -239 29 499 775 279 -199 -136 -344
7793 -344 -207 -89 699 -367 -243 106 -1057 342 376 -90 -262 -19 70 -145 158 825 -360 -264 -570 -176
7813 -176 -115 -496 -140 -174 857 -58 9 541 206 -329 437 255 -52 -149 -308 -209 160 -174 439 -190 -334
7834 -334 -4 -129 -285 -9 -1 -229 -604 -44 -119 -157 -15 195 -120 -63 202 193 57 342 39 50 -105 226 -26
7857 -26 -117 239 -52 -80 87 51 290 -33 -66 163 144 201 -122 -415 208 79 153 12 -82 211 275 -178 -13
$$ packed form
7703B25j79k3n3J97k72K8K44l35L25L6m70M70j99l01M32j52r7M14l56K58j23J60
7725B29o4q3j77J62K5p9P8n4r3J2L25m87L81o7J44O9k94NJ56l43J26j68N32n62
7749b27M92k84K19m49K58J30k67J52l1N59q6n2l77n67M51j22N41n95N49p0l49
7770a25L8k11N59q68O64J47l79k4K22K29m5p35K79M2k9lK68M70K76m96m78O3k08
7793c44J37J18P88j066J24L49j163J399L4m66j72K43Q9k15L03O67j185R6l06L94
7813a76O1l81L56l4J031r15O7N32l35n35P66j82l07r7j59R9L69l34O13o29j44
7834c34L30j25j56K76Qk28l75N60p5l8J42K10l15N7K65rj36K85l03J1j55L31k52
7857b6r1L56k91k8J67l6K39l23l3K29j9N7l23k93O23j29P4j41r4K93O4m53J65
$$ plain form
7880 -13 -204 -91 159 12 -22 -60 -174 26 25 -169 -20 62 -78 150 -146 -52 -4 13 113 127 88 -200 -123 6
7904 6 -99 181 157 137 -86 -19 -121 19 -11 88 107 55 37 157 -133 -118 78 11 69 -26 -120 24 -56 -129 53 31
7930 31 53 -201 149 25 36 -92 -128 15 299 371 -155 -145 63 45 -85 163 -126 20 28 176 -20 -201 84
7953 84 -102 -77 114 -115 -242 52 35 67 -79 220 57 171 -313 25 10 -113 -6 -265 6 150 -69 191
7975 191 -226 -268 137 -278 -31 -130 -299 -103 1 14 139 -145 -27 -306 5 -119 -311 175 55 39 185
7996 185 -158 119 112 -6 -89 -45 -120 -225 -103 -99 121 -205 175 -46 -80 45 -243 -5 -30 -35 93 19 -182 39
8020 39 -243 164 199 82 45 39 -85 -129 -47 -234 -278 0 84 93 167 -64 163 12 90 82 -121 209 -15 56 109 26
8046 26 94 197 -79 50 71 -87 23 -99 -236 26 -160 -48 50 -57 106 42 -130 103 111 -5 -18 -28 -89
$$ packed form
7880a3j91J13K50j47l4l8j14K00jj94J49Q2j40K28k96R4M8J7J00J4l9k88P7J29
7904Fj05K80k4k0k23O7j02J40l0R9J9n2j8J20k90J5J96o7N8r5r4J44q0p3J82k2
7930C1K2k54L50j24J1j28l6J43K84P2n26J0K08j8j30K48k89J46QJ48j96j81K85
7953H4j86K5J91k29j27K94j7L2j46K99j63J14m84L38j5j23J07k59K71J44k19K60
7975A91m17m2M05m15K47r9j69J96J04J3J25k84J18k79L11j24j92M86j20j6J46
7996A85l43K77pj18q3M4p5j05J22MK20l26L80k21l4J25k88K38k5nJ28p4k01K21
8020C9k82M07L5j17l7oj24m4Q2j87m4K78Q4RP4k31K27j51P8qk03L30k24P1N3q3
8046B6O8J03k76J29K1j58J10j22j37K62j86J12R8j07J63o4j72K33Qj16j3j0o1
$$ plain form
8069 -89 25 -196 -26 -30 -9 73 -24 -76 93 166 21 3 -105 -66 -180 -348 -9 -129 203 -99 -86 169 10 38
8093 38 317 40 -79 -46 -67 154 -21 -314 42 98 99 69 -155 -79 296 -109 284 -74 -141 50 -134 130 280
8116 280 -29 -113 -132 -125 154 13 -88 -143 11 113 322 124 -53 -68 236 -1 43 187 -73 204 -247 169
8138 169 149 -254 -67 44 -4 12 -62 166 -56 -16 121 -21 -78 173 27 -88 7 29 -109 249 -7 334 -48
8161 -48 165 -27 94 87 256 91 23 70 -38 -77 28 19 -192 60 -70 49 16 -139 -51 -148 -343 -110 -28 64
8185 64 -54 -58 -23 195 134 136
$$ packed form
8069h9J14k21J70mK1Q2r7n2J69P3j45j8j08L9j14j68L39j20L32l02J3K55j59K8
8093C8K79k77j19L3k1K21j75k93L56N6Jl0k24P6L75m05L93l58o7J91j84K64J50
8116B80l09q4j9PK79j41j01n5J54J02K09j98j77j5L04k37M4J44k60K77m51M16
8138A69k0m03J87J11m8J6p4K28k22M0J37j42n7K51j46j15R5K2j38L58k56L41l82
8161d8K13j92J21pJ69j65o8M7j08l9J05rk11K52j30J19l3j55Q8r7j95K33Q2R2
8185F4j18mL5K18o1K
8191A36
$$ Imaginary data points
##PAGE= N=2
##DATA TABLE= (X++(I..I)), XYDATA
$$ plain form
0 0 0 0 0 0 0 0 0 0 0 0 0 -8 8 -8 8 -8 16 -16 17 -24 29 -32 40 -48 56 -64 72 -85 96 -110 126 -142 161 -182
34 -182 205 -231 261 -289 325 -360 402 -444 492 -545 602 -664 733 -808 889 -979 1080 -1190
52 -1190 1313 -1450 1604 -1779 1978 -2210 2485 -2806 3202 -3696 4327 -5174 6365 -8168 11191
67 11191 -17183 33451 -168158 -443250 142489 299266 -154676 -217315 188717 154719 -144266
78 -144266 -78047 89515 -75413 -167691 8190 56592 -101453 -98791 1644 -63515 -144966
89 -144966 -28880 61841 -21915 -75784 21409 88004 12989 -83183 -49683 47162 32930 -76709
101 -76709 -73270 36643 25934 -81633 -61070 9359 -36587 -48949 62100 76418 -18513 16515
113 16515 103238 17343 -57680 56916 102945 -24206 -35684 86695 51816 -78296 -33837
$$ packed form
0@%%%%%%%%%%%qJ6j6J6j6K4l2L3m1N3o1P2q8J04j20J36j57J81k06K36k68L03l43
34a82L87m36M92n50O14o85P62q46R36j037J147j266J397j541J697j868K059k270
52a190K503k763L054l383L757m188M695n291O008o898Q023r501J1539j4533J9359
67A1191k8374N0634k01609k75092N85739J56777m53942o2639M06032l3998k98985
78a44266O6219J67562j64928r2278J75881M8402j58045K662J00435o5159q1451
89a44966J16086R0721q3756n3869R7193O6595p5015r6172L3500R6845j4232j09639
101g6709L439J09913j0709j07567K0563P0429m5946j2362J11049J4318r4931L5028
113A6515Q6723q5895p5023J14596M6029j27151j1478J22379l4879j30112M4459
$$ plain form
124 -33837 59990 -5217 -42224 68759 94438 -2629 12216 93806 33324 -34079 63547 112234
136 112234 -5763 -32677 78077 56232 -80295 -60836 60189 33403 -61462 -14688 71509
147 71509 26590 -37647 8617 53930 3596 -23469 38532 53927 -18320 -38441 10542 -4117
159 -4117 -69321 -49374 16274 -12480 -70807 -23130 36997 -16648 -72694 -11129 45841 -10966
171 -10966 -47616 17323 35555 -39827 -58551 -3218 -12119 -65648 -40017 9697 -21925 -52135
183 -52135 -10339 4386 -39802 -31464 31276 27324 -25487 -4998 43557 7903 -42399 -11065
195 -11065 21759 -17016 -34493 13431 22183 -28273 -27697 18909 16651 -8910 13641 40903 21003
208 21003 12730 40607 29984 -11967 2142 41541 18954 -18918 8068 36660 -2705 -24810
$$ packed form
124c3837R3827o5207l7007J10983K5679r7067J4845Q1590o0482o7403R7626M8687
136A12234j17997k6914J10754k1845j36527J9459J21025k6786r4865M6774Q6197
147G1509m4919o4237M6264M5313n0334k7065O2001J5395p2247k0121M8983j4659
159d117o5204J9947O5648k8754n8327M7677O0127n3645n6046O1565N6970n6807
171a0966l6650O4939J8232p5382j8724N5333q901n3529K5631M9714l1622l0210
183e2135M1796J4725m4188Q338O2740l952n2811K0489M8555l5654n0302L1334
195a1065L2824l8775j7477M7924Q752n0456N76M6606k258k5561K2551K7262j9900
208B1003q273K7877j0623m1951J4109L9399k2587l7872K6986K8592l9365k2105
$$ plain form
220 -24810 21579 34409 -12246 -6634 54523 50651 -7528 -1153 44242 24050 -15084 9243 32886
233 32886 -3899 -21285 18181 19185 -34846 -32577 24329 18034 -27133 -4403 39957 6441 -34919
246 -34919 7084 37775 -17799 -43633 16068 32123 -33792 -49072 6560 3329 -50119 -29173
258 -29173 22595 -6787 -45885 -339 33527 -21260 -46382 14480 27357 -34310 -32349 26938
270 26938 6691 -55835 -27579 27678 -11043 -55732 -4980 33601 -15677 -35711 18921 26908
282 26908 -27169 -18077 38667 18671 -33436 -4763 37582 -2206 -39531 5803 32040 -19073
294 -19073 -30515 30011 34112 -24293 -17661 41617 29802 -21318 2503 45544 11120 -22335
306 -22335 17841 37576 -13685 -27583 27660 31477 -23956 -16504 36369 18216 -26236 5862
$$ packed form
220b4810M6389J2830m6655N612O1157l872n8179O375M5395k0192l9134K4327K3643
233C2886l6785j7386L9466J004n4031K269N6906o295m5167K2730M4360l3516m1360
246c4919M2003L0691n5574k5834N9701J6055o5915j5280N5632l231n3448K0946
258b9173N1768k9382l9098M5546L3866n4787k5122O0862J2877o1667J961N9287
270B6938k0247o2526K8256N5257l8721m4689N0752L8581m9278k0034N4632P987
282B6908n4077R092N6744j9996n2107K8673M2345l9788l7325M5334K6237n1113
294a9073j1442O0526M101n8405O632N9278j1815n1120K3821M3041l4424l3455
306b2335M0176J9735n1261j3898N5243L817n5433P452N2873j8153m4452L2098
$$ plain form
318 5862 45590 3586 -28223 22261 44285 -12734 -28422 24141 26807 -25984 -19170 26776 4865
331 4865 -36611 -3111 33595 -5779 -34202 11360 32374 -15715 -25756 21805 17187 -29611
343 -29611 -15284 26697 806 -41836 -11878 24074 -11342 -37235 2236 19898 -18961 -24904
355 -24904 17657 13722 -29020 -15241 27135 5846 -30664 -5958 20788 -11183 -31345 5166
367 5166 15683 -23949 -23101 19891 14586 -24934 -13135 23153 6651 -20623 4805 25601 -5771
380 -5771 -19561 13758 18959 -18709 -18635 18082 12939 -17249 -3260 20687 818 -16859 9175
393 9175 23974 -3973 -11561 19311 21094 -8825 -7481 16013 5474 -15414 3138 21381 -2794
406 -2794 -16797 10097 18332 -9295 -12066 15467 13809 -8965 1621 21290 1620 -17511 3199
$$ packed form
318E862L9728m2004l1809N0484K2024n7019j5688N2563K666n2791O814M5946k1911
331D865m1476L3500L6706l9374k8423M5562K1014m8089j0041M7561m618m6798
343b9611J4327M1981k5891m2642K9958L5952l5416k5893L9471J7662l8859n943
355b4904M2561l935m2742J3779M2376k1289l6510K4706K6746l1971k0162L6511
367E166J0517l9632Q48M2992n305l9520J1799L6288j6502k7274K5428K0796l1372
380e771j3790L3319N201l7668P4L6717n143l0188J3989K3947j9869j7677K6034
393I175J4799k7947p588L0872J783k9919J344K3494j0539k0888J8552J8243k4175
406b794j4003K6894Q235k7627k771K7533j658k2774J0586J9669j9670j9131K0710
$$ plain form
419 3199 17922 -5670 -15444 9128 12390 -12294 -9394 12157 162 -19259 83 20717 -765
432 -765 -16457 5682 13482 -11006 -12894 10172 5224 -16042 -3797 16074 -2483 -22812 -2402
445 -2402 12675 -8251 -15221 9540 11561 -14421 -10482 15155 3072 -22261 -4836 18645 1185
458 1185 -16691 2725 11807 -12161 -15255 11118 8850 -16064 -6795 19092 5488 -20052 -3466
471 -3466 15839 -5257 -15409 11764 17164 -12273 -12398 16446 9405 -19054 -6353 19193 4123
484 4123 -14466 5865 17570 -10257 -19219 12406 17177 -14448 -12162 19830 12967 -17429 -6149
497 -6149 19281 600 -18420 7653 23150 -5529 -16806 10125 13248 -15169 -11668 16025 5823
510 5823 -16869 1171 21283 -4360 -23446 6665 22054 -8464 -14754 16924 14877 -16360 -9683
$$ packed form
419C199J4723k3592r774K4572L262k4684K900K1551j1995j9421J9342K0634k1482
432g65j5692K2139P800k4488j888K3066m948k1266J2245J9871j8557k0329K0410
445b402J5077k0926o970K4761K021k5982L939K5637j2083k5333J7425K3481j7460
458A185j7876J9416R082k3968l094K6373k268k4914R269K5887j3604k5540J6586
471c466J9305k1096j0152K7173N400k9437j25K8844p041k8459J2701K5546j5070
484D123j8589K0331J1705k7827q962L1625M771l1625K286L1992o863l0396J1280
497f149K5430j8681j9020K6073J5497k8679j1277K6931L123k8417L501K7693j0202
510E823k2692J8040K0112k5643j9086L0111J5389l0518o290L1678k047l1237O677
$$ plain form
523 -9683 17153 1852 -23112 -1112 21705 -2390 -20062 4557 15506 -11718 -15287 15678
535 15678 14261 -15870 -6259 23774 7298 -23307 -5569 19822 -1443 -19425 5767 16205
547 16205 -12746 -16906 11956 10024 -18692 -8168 22096 8376 -17206 2562 20820 -6600
559 -6600 -20183 11570 18977 -15834 -17151 16839 10611 -22381 -12799 15735 3145 -18186 2578
572 2578 21836 -1747 -17478 7885 18528 -9059 -15098 12499 12746 -14436 -9639 13046 -1093
585 -1093 -22489 -3224 16482 -2977 -16712 6720 16332 -7283 -10490 12286 9058 -12393 -2201
598 -2201 18725 1358 -19650 -930 12536 -9862 -17436 6880 10814 -11244 -8165 14397 7641
611 7641 -12767 -2650 16528 6867 -8067 2110 11719 -2636 -11021 3301 5836 -10322 -8255
$$ packed form
523i683K6836j5301k4964K2000K2817k4095j7672K4619J0949k7224l569L0965
535A5678j417l0131R611L0033j6476l0605J7738K5391k1265j7982K5192J0438
547A6205k8951m160K8862j932k8716J0524L0264j3720k5582J9768J8258k7420
559f600j3583L1753P407l4811j317L3990o228l2992R582K8534j2590k1331K0764
572B578J9258k3583j5731K5363J0643k7587o039K7597K47k7182M797K2685j4139
585a093k1396J9265J9706j9459j3735K3432R612k3615l207K2776l228k1451J0192
598b201K0926j7367k1008J8720J3466k2398p574K4316L934k2058L079K2562o756
611G641k0408J0117J9178r661j4934J0177R609j4355q385J4322K535j6158K067
$$ plain form
624 -8255 9531 5566 -10026 -2295 11378 925 -7289 8649 14644 -2998 -6183 12182 9903
637 9903 -12456 -7934 10556 140 -13659 2328 11518 -9113 -13245 11622 12029 -11417 -5240
650 -5240 17232 8891 -9022 301 11199 -2563 -11602 2407 6797 -8088 -10353 2551 2094 -8789
664 -8789 -5455 5064 183 -5524 4812 9647 -2938 -8181 4180 7805 -7264 -10472 4214 4037
678 4037 -11541 -9466 5438 -701 -15110 -3114 11996 -1003 -10177 6142 10448 -6379 -5466
691 -5466 10828 3124 -12705 -461 11355 -4454 -14334 1189 6186 -7572 -6443 8563 4548
704 4548 -7041 2633 13229 758 -6720 6297 11068 -3425 -4797 9425 4010 -10493 -3011
717 -3011 9845 1381 -11242 -179 13646 3141 -7228 4478 13514 499 -5525 9901 10874
$$ packed form
624h255J7786l965j5592P731J3673j0453q214J5938N995j7642l185J8365k279
637I903k2359M522J8490j0416j3799J5987R190k0631m132K4867M07k3446O177
650e240K2472q341j7913R323J0898j3762r039J4009M390j4885k265J2904m57j0883
664h789L334J0519m881n707J0336M835j2585n243J2361L625j5069l208J4686j77
678D037j5578K075J4904o139j4409J1996J5110j2999r174J6319M306j6827R13
691e466J6294p704j5829J2244J1816j5809r880J5523M997j3758J129J5006m015
704D548j1589R674J0596j2471p478J3017M771j4493j372J4222n415j4503P482
717c011J2856q464j2623J1063J3825j0505j0369J1706R036j3015o024J5426R73
$$ plain form
730 10874 -6721 -6929 10158 3995 -12572 -4304 9550 -2633 -12325 5111 11604 -7843 -8891
743 -8891 12293 10402 -10520 -4471 14665 3035 -14662 -271 11166 -8456 -16667 4444 8338
756 8338 -12448 -11933 8754 5107 -12492 -3639 12354 613 -12610 2026 12789 -5126 -15052
769 -15052 2970 7948 -10420 -12229 4880 2912 -12863 -5877 10228 881 -12386 1476 13420
782 13420 -930 -9425 6062 9966 -8042 -8122 9853 3874 -14638 -4685 12886 541 -14727
795 -14727 1924 14284 -2418 -8026 10918 13311 -6052 -4217 15017 8382 -10600 -2442 12762
808 12762 774 -11671 1886 10072 -4849 -9097 9327 9890 -6918 -3237 13261 8068 -6528
821 -6528 974 12095 832 -9259 2982 8610 -7082 -11728 4617 6718 -8364 -7348 7873
$$ packed form
730A0874j7595k08J7087o163j6567Q268J3854j2183r692J7436O493j9447j048
743h891K1184j891k0922O049J9136j1630j7697J4391J1437j9622q211K1111L894
756H338k0786N15K0687l647j7599Q853J5993j1741j3223J4636J0763j7915r926
769a5052J8022M978j8368j809J7109j968j5775O986J6105r347j3267J3862J1944
782A3420j4350q495J5487L904j8008q0J7975n979j8512R953J7571j2345j5268
795a4727J6651J2360j6702n608J8944K393j9363J835J9234o635j8982Q158J5204
808A2762j1988j2445J3557Q186j4921m248J8424N63j6808L681J6498n193j4596
821f528P502J1121j1263j0091J2241N628j5692m646J6345K101j5082J016J5221
$$ plain form
834 7873 4163 -9058 -285 11570 145 -9386 3868 10108 -5024 -10698 3502 3612 -10983 -8486
848 -8486 4909 -1038 -11734 -2693 7795 -2208 -9743 3883 9303 -3475 -5858 6003 4210
861 4210 -8330 -4648 5714 -2281 -11330 -2972 5118 -4005 -8963 2203 4833 -4305 -3227 8681
875 8681 5896 -4918 157 9443 2003 -6559 683 5492 -3103 -5915 3287 3341 -6676 -3799 7125
890 7125 4166 -4185 1515 9522 2701 -2028 5514 8060 -2791 -3696 6677 3307 -6316 -3305 4787
905 4787 -426 -6537 1009 5742 -2150 -3054 6298 6428 -2699 -1637 6997 3495 -4945 -175 4863 -3256
921 -3256 -8008 520 2719 -6785 -7396 3425 3149 -5431 -1979 6096 852 -4976 2061 7131 -2204
936 -2204 -6070 2949 3710 -6618 -6591 2082 -865 -8636 -2537 5273 -2031 -7617 2404 7283 -2362
$$ packed form
834G873l710j3221Q773J1855j1425r531J3254O240j5132n674J4200J10j4595K497
848h486J3395n947j0696R041J0488j0003p535J3626N420j2778k383J1861j793
861D210j2540L682J0362p995r049Q358Q090r123m958J1166K630r138J078J1908
875H681k785j0814N075R286p440q562P242M809q595k812R202N4j0017K877J0924
890G125k959q351N700Q007o821m729P542K546j0851r05J0373l370r623L011Q092
905D787n213o111P546M733p892r04R352J30r127J062Q634l502q440M770N038q119
921c256m752Q528K199r504o11J0821k76q580L452Q075n244n828P037N070r335
936b204l866R019P61j0328K7Q673k947p771O099P810p304n586J0021M879r645
$$ plain form
951 -2362 -4444 5702 5800 -4317 -2184 6495 207 -8766 -958 5831 -3010 -8513 1865 5818 -4462
966 -4462 -4463 7078 4850 -5210 250 10647 3070 -6606 1805 8377 -2166 -6880 3363 4989 -6391
981 -6391 -5257 6763 3342 -7829 -1473 9341 2314 -5892 3371 9285 -1802 -5571 6014 6246
995 6246 -6832 -5667 6541 2775 -8921 -3893 6477 -1114 -8241 2459 8084 -3382 -5982 6901
1009 6901 7146 -6137 -4880 7463 2759 -8429 -1975 6900 -2614 -10328 1188 6889 -5420 -8279
1023 -8279 5840 6250 -5794 -3998 7947 2954 -8067 -182 9054 -850 -8841 1956 7621 -4506
1037 -4506 -8297 4454 5117 -7091 -3261 8575 2681 -7957 -359 8771 167 -6132 3585 7526
1051 7526 -3805 -4900 5289 3670 -8156 -3132 7388 1869 -7363 -531 7463 -762 -6041 3678
$$ packed form
951b362k082J0146R8j0117K133Q679o288q973P808O789q841n503J0378L953j0280
966d462jJ1541k228j0060N460J0397p577r676Q411O572j0543m714J0243J626j1380
981f391J134J2020l421j1171O356J0814p027q206R263N914j1087l769J1585K32
995F246j3078J165J2208l766j1696N028J0370p591p127J0700N625j1466k600J2883
1009F901K45j3283J257J2343m704j1188O454Q875r514p714J1516N701j2309k859
1023h279J4119M10j2044J796J1945m993j1021P885R236r904p991J0797N665j2127
1037d506l791J2751O63j2208L830J1836n894j0638P598R130q604o299R717L941
1051G526j1331j095J0189j619j1826N024J0520n519r232O832P994q225n279R719
$$ plain form
1065 3678 7469 -4069 -4775 6026 5134 -6441 -4036 6416 1589 -7465 -885 6129 -1953 -6842
1079 -6842 2631 5459 -4256 -5340 4695 4271 -5108 -2482 5559 483 -6289 373 5420 -2908 -6428
1094 -6428 2892 4247 -4807 -4040 4020 1571 -5269 -496 5468 -383 -5138 1684 5312 -1831 -4852
1109 -4852 2346 3959 -3070 -2547 4354 1206 -4536 -142 4995 122 -4171 1780 4543 -1103 -2340
1124 -2340 3302 2425 -3339 -286 4554 659 -4184 1209 4720 -1708 -3119 3305 3098 -3467 -1247
1139 -1247 5192 1369 -4712 80 4779 -728 -3666 1755 3512 -2124 -2602 3469 2416 -4080 -2186
1154 -2186 3992 924 -3972 -624 2997 -1725 -3326 1972 1858 -3760 -2591 3363 1240 -4651 -1849
1169 -1849 3220 -556 -4114 1165 3431 -3381 -4501 3167 2484 -5608 -2964 4381 557 -4816 -23
$$ packed form
1065C678L791j1538p06J0801q92j1575K405J0452m827r054O580P014q082m889
1079f842R473K828r715j084J0035m24r379K626Q041n076o772O662N047q328l520
1094f428R320J355r054P67Q060k449o840M773N964n851m755O822L628p143l021
1109d852P198J613p029N23O901l148n742M394N137m873m293N951K763n646j237
1124b340N642q77n764L053M840l895m843N393L511o428j411O424k07o565K220
1139a247O439l823o081M792M699n507k938N421J757n636m78O071j053o496J894
1154b186O178l068m896L348L621m722j601N298j14n618J169N954k123n891K802
1169a849N069l776l558N279K266o812j120P668o83q092K644P345l824n373M793
$$ plain form
1184 -23 4427 -1754 -4563 2509 3709 -3434 -3160 3829 2433 -3567 -1458 3674 16 -4336 1553 4516
1200 4516 -2222 -3192 3382 3402 -2951 -1218 5188 1573 -3639 1187 5944 -487 -4941 2449 5931 -2373
1216 -2373 -4414 4470 4217 -4683 -1765 6635 2108 -5864 906 7327 -479 -5399 2622 5596 -2502
1231 -2502 -3566 3918 2856 -5135 -1650 4144 870 -5708 -483 5870 -1291 -5138 2575 4535 -3783
1246 -3783 -3560 4574 2152 -6289 -2523 4917 -68 -7276 -817 4796 -2604 -6887 2136 5056 -4566
1261 -4566 -5528 4885 3785 -6155 -3230 5596 515 -6577 -602 4984 -2710 -6350 1731 3912 -4324
1276 -4324 -4033 3506 2693 -4791 -833 5755 228 -4415 1252 5071 -1840 -4599 3349 4156 -3988 -2633
1292 -2633 4252 2273 -4164 -391 5761 1282 -4607 1887 6917 -85 -3912 3427 4969 -2551 -2650
$$ packed form
1184b3M450o181k809P072J200p143K74O989j396o000K109N132l658m352N889K963
1200D516o738r70O574K0o353J733O406l615n212M826M757o431m454P390L482q304
1216b373k041Q884k53q900K918Q400m527p972O770O421p806m920Q021K974q098
1231b502j064P484j062p991L485N794l274o578N225O353p161l847P713J960q318
1246c783K23Q134k422q441L766P440m985p208O459N613p400m283R023K920r622
1261d566r62J0413j100r940K925Q826n081p092N975N586p694l640Q081K181q236
1276d324K91P539q13p484L958O588n527m643N667L819o911k759P948Q07q144J355
1292b633O885j979o437L773O152m479n889O494N030p002l827P339J542p520r9
$$ plain form
1307 -2650 4701 2409 -4674 -993 5092 268 -4446 1224 4839 -1143 -2674 3997 3526 -2751 -1265
1322 -1265 4654 1685 -4199 -456 4100 -1468 -4371 1272 2582 -3762 -3248 2882 2073 -3680 -1969
1337 -1969 3808 1018 -3309 -170 3284 -1143 -4283 478 1908 -3421 -4486 1417 817 -3826 -2241
1352 -2241 2093 -241 -3052 769 2985 -1484 -2715 1689 2512 -2604 -2254 2007 7 -4134 -873
1367 -873 2339 -1762 -3686 889 2703 -1765 -1927 2456 2488 -2122 16 3919 1173 -2456 1397 3389
1383 3389 -1508 -3006 1139 1546 -2524 -1079 2837 1141 -2255 1287 4727 515 -979 2092 3750
1398 3750 -658 -1334 2323 1162 -2994 -1045 3518 -43 -3192 273 3563 -665 -2218 2320 3395
1413 3395 -1591 -848 3669 1891 -3108 -580 3258 -372 -4202 52 2223 -2541 -3343 1863 1893 -3139
$$ packed form
1307b650P351k292p083L681O085m824m714N670L615n982j531O671m71o277J486
1322a265N919k969n884L743M556n568k903N643J310o344N14O130q09n753J711
1337a969N777k790m327L139L454m427l140M761J430n329j065N903o00m643J585
1352b241M334k334k811L821K216m469j231M404Q23n116L50M261k000m141L261
1367h73L212m101j924M575J814m468j62M383L2m610K138L903k746l629L853J992
1383C389m897j498M145M07m070J445L916j696l396L542L440m212j494L071J658
1398C750m408o76L657j161m156J949M563l561l149L465L290m228j553M538J075
1413C395m986P43M517j778m999K528L838l630l830M254K171m764q02N206L0n032
$$ plain form
1429 -3139 -1741 3568 783 -3689 -125 3479 -1052 -3847 1200 2082 -3901 -3681 1998 720 -4551
1444 -4551 -2734 2579 -252 -4317 12 3541 -1476 -3238 2328 3267 -2436 -3014 3053 1714 -4107
1459 -4107 -1854 3081 -696 -4805 149 3620 -1305 -3689 2412 3666 -2155 -1785 4197 2179 -2907
1474 -2907 73 4704 179 -4172 926 4069 -2037 -3520 2368 3504 -2360 -1677 4547 2193 -3147
1489 -3147 622 5462 838 -3368 1591 4470 -1256 -3010 2720 2801 -3572 -2408 3689 1512 -4068
1504 -4068 -418 4291 1 -3592 1633 3884 -1734 -2864 2877 2910 -3833 -2483 3257 711 -4553
1519 -4553 -1544 3049 -981 -4180 782 2863 -2381 -3234 2347 2465 -3303 -2460 3038 796 -4065 -885
1535 -885 2829 -1352 -4286 669 2347 -2275 -3532 2137 1787 -2987 -1551 3147 1362 -2398 137
$$ packed form
1429c139J398N309k785m472L564L604m531k795N047Q82n983K20N679j278n271
1444d551J817N313k831m065M329L529n017j762N566R39n703n78O067j339n821
1459d107K253M935l777m109M954L471m925k384O101J254n821L70N982k018n086
1474b907K980M631m525m351N098L143o106j483N888J136n864O83O224k354n340
1489c147L769M840m624m206M959K879n726j754N730Q1o373J164O097k177n580
1504d068L650M709m290l593N225K251n618j130N741L3o743J350N740k546n264
1519d553L009M593m030l199M962K081n244q53N581J18n768Q43N498k242m861L180
1535h85L714m181k934M955J678m622j257N669l50m774J436M698j785l760K535
$$ plain form
1550 137 3164 -975 -3371 1303 2617 -1849 -2604 2151 1316 -2707 -932 3232 556 -2920 990 3694
1566 3694 -470 -2001 1910 2576 -1786 -1181 2834 1229 -2344 -192 2999 312 -2682 941 2824
1581 2824 -544 -1254 1991 1981 -1499 -580 2574 572 -2053 -503 2874 -227 -1648 1407 1531 -1193
1597 -1193 -1891 2146 1209 -2362 -988 2143 470 -2315 91 2017 -1275 -2237 1229 1075 -2114 -1800
1613 -1800 1767 486 -1938 -912 1558 -952 -1948 262 1310 -1156 -1065 1810 946 -3116 -1624 1474
1629 1474 -631 -3643 869 1459 -1506 -1750 409 1513 -2108 -1433 1438 625 -2195 -482 2267 -501
1645 -501 -2407 851 2419 -1327 -1889 1590 1717 -1853 -1130 2261 643 -2314 -8 2269 -230 -2184
1661 -2184 941 2313 -1471 -1211 2155 1468 -2241 -329 3118 661 -2507 847 2846 -1002 -2099
$$ packed form
1550A37L027m139k396M674J314m466p55M755q35m023J775M164k676l476L910K704
1566C694m164j531L911O66m362O05M015j605l573K152L191k687k994L623J883
1581B824l368p10L245j0l480R19L154k002k625J550L377l101j421L055J24k724
1597a193o98M037r37l571J374L131j673k785K406J926l292r62L466j54l189L14
1613a800L567j281k424J026K470k510r96K210J048k466R1K875q64m062J492L098
1629A474k105l012M512N90k965k44K159J104l621O75K871q13k820J713K749k768
1645e01j906L258J568l746n62L479J27l570P23L391j618k957K306K277k499j954
1661b184L125J372l784K60L366o87l709J912L447k457l168L354J999l848j097
$$ plain form
1676 -2099 1871 1653 -1862 -1195 2237 1200 -2328 -388 2958 192 -2167 785 2699 -831 -1925
1691 -1925 1801 1732 -1916 -1285 2182 678 -2676 -589 2345 -495 -2155 766 1928 -1321 -2176 2030
1707 2030 1947 -2572 -1048 2697 709 -3246 -26 2775 -1294 -3155 1029 2327 -2136 -2242 2289 1441
1723 1441 -2057 -666 2861 327 -2905 -2 3148 -867 -2909 686 1925 -2000 -2553 1796 974
1738 974 -2683 -807 2560 4 -2591 373 3018 -579 -2437 1470 2366 -1763 -2106 2520 1266 -3234
1754 -3234 -870 3158 -184 -3362 467 3246 -682 -2081 1871 2607 -1231 -1100 2428 1527 -2327 -957
1770 -957 2755 49 -2644 -216 2085 -1147 -1649 1547 1771 -1219 -553 2519 1504 -1436 483 2304
1786 2304 90 -2376 626 1717 -1491 -2485 1291 1632 -2430 -1212 2420 866 -2016 128 2639
$$ packed form
1676b099L970k18l515O67L432j037l528J940L346k766k359K952J914l530j094
1691a925L726o9l648O31L467j504l354K087K934k840j660K921J162l249q55M206
1707B030q3m519J524L745j988l955L220K801m069j861M184J298m463j06M531q48
1723A441l498J391L527k534l232K903L150m015k042L595J239l925n53M349q22
1738I74l657J876L367k556k595K964K645l597j858L907Q96m129l43M626j254m500
1754c234K364M028l342l178L829K779l928j399L952P36l838J31L528r01l854J370
1770i57L712k706k693K428K301l232n02L196K24k990O66L072j015k940J919J821
1786B304k214k466L002J091l208r94L776L41m062J218L632j554k882K144K511
$$ plain form
1801 2639 -196 -2039 1328 1916 -1277 -1967 860 490 -2034 -1670 1022 -242 -2054 -175 1566 -632
1817 -632 -1298 1260 1635 -833 -932 1590 476 -1753 -583 1144 -1118 -2620 -237 1095 -1493 -2228
1833 -2228 810 1354 -1275 -948 2263 1276 -1405 89 2281 -304 -2032 246 814 -1057 -1750 464
1849 464 203 -1777 -715 1530 520 -894 736 2115 540 -192 1764 1243 -1539 -1049 1332 35
1865 35 -2228 -700 1025 -644 -1679 608 1336 -271 -431 1811 2019 -272 -1 2167 999 -1126
1881 -1126 -90 1576 -421 -1963 167 447 -1851 -1425 853 744 -1101 -25 1886 509 -659 885
1897 885 1723 -569 -1190 1029 580 -1942 -1755 593 -992 -2936 -215 1390 -662 -1757 491 1657
1913 1657 -456 -942 1283 1031 -1423 -920 1473 -772 -2706 -906 1210 -1312 -2540 -32 839 -1367
$$ packed form
1801B639k835j843L367N88l193o90K827l70k524L64K692j264j812J879J741k198
1817f32o66K558L75k468r9K522j114k229J170J727k262j502K383J332k588p35
1833b228L038N44k629L27L211r87k681J494K192k585j728K278N68j871o93K214
1849D64k61j980J062K245j010j414J630J379j575p32J956n21k782M90K381j297
1865C5k263J528J725j669j035K287P28j607j60K242K08k291K71K168j168k125
1881a126J036J666j997j542K130K80k298M26K278j09j845J076J911j377j168J544
1897H85Q38k292o21K219m49k522J87K348j585j944K721J605k052j095K248J166
1913A657k113m86K225k52k454N03K393k245j934J800K116k522j228K508Q71k206
$$ plain form
1929 -1367 -1064 1742 1346 -1149 442 2404 567 -1881 181 1887 -750 -1606 22 1125 -2150 -1652
1945 -1652 1547 485 -1574 267 2739 1024 -900 1450 3133 64 -996 1547 1600 -1422 -1222 1284
1961 1284 261 -2317 -604 1556 -136 -1648 835 2617 -17 -819 2007 2158 -984 -195 1893 676
1977 676 -1997 -629 1397 -1350 -2813 6 1354 -1328 -1774 1510 1856 -1177 -649 2410 936 -1448
1993 -1448 147 1629 -370 -2701 -348 867 -2365 -2455 396 385 -2042 -1104 1512 557 -1492 434
2009 434 2347 -139 -1475 945 1238 -1297 -1584 663 282 -2594 -1227 1192 -145 -2044 -113 1916
2025 1916 -32 -1123 1563 2165 -407 -734 1574 1200 -1072 -831 1230 89 -1885 -241 1113 -436
2041 -436 -1406 786 1634 -158 -49 2153 1413 -385 356 2050 361 -1340 28 674 -1004 -1305 351
$$ packed form
1929a367L03K806l96k495J591J962j837k448K062J706k637q56J628J103l275M98
1945a652L199j062k059J841K472j715j924K350J683l069j060K543N3l022K00K506
1961A284j023k578J713K160j692j512K483J782k634q02K826J51l142P89K088j217
1977F76k673J368K026k747j463K819J348k682m46L284L46l033N28L059j474k384
1993a448J595J482j999k331K353J215l232r0K851j1k427R38K616r55k049J926
2009D34J913k486j336K420K93k535k87K247l81k876J367K419j337j899J931K029
2025A916j948j091K686O02k572l27K308l74k272K41K061j141j974J644J354j549
2041d36r70K192Q48j792J09K202p40j798P41J694j689j701J368O46j678l01J656
$$ plain form
2058 351 397 -1245 -893 1161 681 -1052 352 2010 95 -711 638 1413 -741 -1088 494 186 -1440
2075 -1440 -1238 541 -533 -1675 -149 806 -293 -1096 637 1255 -434 -280 894 488 -1116 -590 666
2092 666 -580 -1682 -386 248 -1006 -1380 396 581 -862 -7 1205 436 -636 392 1092 -121 -1032
2109 -1032 619 672 -1047 -975 556 -111 -970 -229 1063 78 -932 928 1682 -60 -106 930 1108 -640
2127 -640 -472 1285 264 -1332 6 913 -391 -1392 566 1070 -544 -404 1417 1010 -605 98 1294
2144 1294 304 -859 173 1004 -722 -1299 195 579 -1174 -536 780 538 -1089 -378 1523 108 -953
2161 -953 620 1233 -680 -1020 550 580 -1486 -1085 642 -40 -1575 -253 1261 -340 -1136 377 1621
2178 1621 -698 -863 975 732 -929 -733 1125 -106 -1689 -226 942 -447 -1429 361 1133 -739
$$ packed form
2058C51M6j642L52K054m80j733J404J658j915q06J349P75k154l47J582l08j626
2075a440K02J779j074j142J526R55j099q03J733O18j689J54J174m06j604N26J256
2092F66j246j102J296O34j254l74J776J85j443Q55J212p69j072J028P00j213r11
2109a032J651N3j719P2J531o67q59P41J292r85j010J860P54j742m6J036J78j748
2127f40J68J757j021j596J338R07j304j001J958N04j614J40J821m07j615P03J196
2144A294r90j163J032Q31j726n77J494L84j753O38J316k42j627P11J901j415j061
2161i53J573O13j913l40J570L0k066M01J727o82j535J322J514j601p96J513J244
2178A621k319j65J838k43j661J96J858j231j583J463J168j389r82J790P72j872
$$ plain form
2194 -739 -808 1455 1038 -857 -109 1693 468 -1219 193 1190 -548 -1454 581 1017 -951 -1122 1191
2211 1191 979 -1251 -185 1706 527 -999 409 1682 172 -923 983 1044 -667 -961 1130 769
2227 769 -1367 -603 1395 245 -1058 254 1348 -105 -1004 879 1252 -712 -1040 1095 379 -1487
2243 -1487 -613 821 -274 -1544 129 1055 -680 -1152 547 865 -886 -780 796 395 -1044 -332 1198
2260 1198 -346 -1547 -186 653 -724 -1321 468 422 -1310 -499 1051 129 -873 95 843 73 -829
2277 -829 217 787 -607 -688 562 496 -574 -449 910 143 -881 421 1238 -162 -579 726 1006 -450
2295 -450 -435 892 725 -729 -344 792 137 -513 215 907 23 -694 489 610 -202 -168 1065 410 -472
2314 -472 188 623 -273 -471 208 590 -374 -750 461 436 -616 -293 732 -181 -1068 245 843 -516 -738
$$ packed form
2194g39o9K263m17j895P48J802j225j687J412R97j738r06K035M36j968j71K313
2211A191k12k230J066J891j179j526J408J273j510j095J906O1j711k94K091l61
2227G69k136P64J998j150j303J312J094j453q99J883L73j964l28K135p16j866
2243a487Q74J434j095j270J673R26j735m72J699L18j751J06J576m01j439P12J530
2260A198j544j201J361Q39j377n97J789m6j732Q11J550r22j002R68P48p70r02
2277h29J046N70j394q1J250o6j070J25J359p67j024J302Q17j400m17J305K80j456
2295d50J5J327j67j454L85J136o55o50P28O92q84p17J183J21q12L4J233o55q82
2314d72O60M35q96j98O79L82r64l76J211k5j052L23J025r13q87J313N98j359k22
$$ plain form
2333 -738 286 381 -781 -513 640 215 -696 -674 766 -199 -872 260 223 -539 -774 92 -155 -897 -483
2352 -483 863 -775 -689 283 547 -436 -785 617 574 -848 -1022 1075 870 -843 483 1075 76 -952
2370 -952 72 842 -114 -1234 1100 416 -496 -145 781 734 -1000 523 917 199 -581 406 813 -541
2388 -541 -417 757 749 -421 60 1350 433 -657 499 1014 -108 -734 465 633 -848 -664 412 417
2406 417 -805 -199 870 184 -1043 -25 1256 -39 -734 538 1083 -572 -30 185 214 -694 158 340
2424 340 -99 -1197 -29 530 -370 -894 313 533 -679 -547 1107 448 -1230 -427 693 -419 -1116
2441 -1116 91 418 -768 -1278 565 538 -781 -651 809 567 -688 53 971 76 -899 434 1057 -601
2459 -601 -939 548 511 -843 -412 885 447 -581 197 946 333 -568 652 1337 -127 -596 765 664
$$ packed form
2333g38J024R5j162K68J153m25r11K2J440r65o73J132l7p62k35Q66k47p42M14
2352d83J346j638Q6R72K64r83l49J402m3j422j74K097k05j713J326N92r99j028
2370i52J024P70r56j120K334o84r12L51R26m7j734J523L94p18p80R87M07j354
2388e41J24J174qj170M81J290r17j090J156N15j122o26J199J68j481J84J076N
2406D17j222O06J069o86j227J018J281j295o95J272N45j655N42K15K9r08Q52J82
2424C40m39j098J168N59r00n24J207K20j212J32J654o59j678Q03J120j112o97
2441a116J207L27j186n10J843k7j319J30J460k42j255P41R18q95r75J333O23j658
2459f01l38J487l7j354M31J297m38j028P78P49o13r01J220O85j464m69J361j01
$$ plain form
2477 664 -509 20 827 236 -988 251 1067 -186 -590 729 976 -40 -363 1111 753 -577 -168
2494 -168 979 446 -669 -103 622 -119 -1180 -204 73 -569 -382 515 228 -536 -175 465 179 -490 -22
2513 -22 709 -464 -809 -167 238 -921 -867 257 58 -809 -454 577 -73 -654 -26 660 -97 -522 125
2532 125 197 -707 -717 158 31 -548 -545 407 -268 -683 202 484 -135 -254 687 428 -180 27 757 503 -321
2553 -321 132 461 -199 -287 229 191 -577 -112 537 358 -172 189 1103 546 -302 417 761 327 -328 410 326
2574 326 -369 -250 273 119 -615 142 467 -99 -82 459 569 -113 -419 573 148 -564 -333 158 -402 -769
2594 -769 -187 90 -126 -590 293 316 -357 34 522 152 -451 62 352 -310 -678 -105 80 -732 -983 -90
2614 -90 -426 -995 -346 119 -114 -615 175 396 -319 -348 377 570 -588 -434 99 154 -914 -419 381 -253
$$ packed form
2477F64j173N29Q07n91j224J239Q16j253m04J319K47j016l23J474l58j330M09
2494a68J147n33j115N66P25p41j061R76K77o42J87Q97k87p64L61O40k86o69M68
2513b2P31j173l45O42M05j159N4J124j99q67L55J031o50n81O28O86p57m25O47
2532A25P2r04j0Q75j27n79LR52o75m15Q85K82o19j19R41k59o08K07P30k54q24
2553c21M53L29o60q8N16l8p68M65O49j79n30L61R14n57q48P19L44m34o55P38q4
2574C26o95J19N23j54p34P57L25n66J7N41J10o82l06R92m25p12K31M91n60l67
2594g69N82K77k16m64Q83K3o73L91M88l70o03N13K90o62l68N73J85q12k51Q93
2614i0l36n69O49M65k33n01P90K21p15k9P25J93j158J54N33N5j068M95Q00o34
$$ plain form
2634 -253 -838 -10 323 -226 -160 492 957 -500 -91 938 636 -505 4 622 -136 -587 186 535 -371
2653 -371 -486 954 569 -289 39 1167 551 -20 174 1183 193 -417 286 545 -369 -717 99 5 -714
2672 -714 -475 890 295 -462 311 948 190 -240 559 681 -521 -530 389 -27 -1120 -690 27 -296 -919 -362
2692 -362 430 -429 -433 366 699 -432 -564 547 470 -462 -369 383 -477 -884 -578 498 -647 -824 152 527
2712 527 -589 -364 597 331 -496 38 743 40 -438 289 469 -380 -718 -46 540 -479 -201 400 140
2731 140 -434 383 836 539 -89 656 962 188 -126 552 368 -627 -293 324 171 -495 -67 390 119 49
2751 49 472 819 269 -126 738 608 -253 36 448 -64 -583 -168 227 -390 -723 98 338 -202 -72 311
2771 311 461 -65 89 551 74 -468 -215 212 97 -751 485 498 -511 -352 13 184 -44 -454 287 152
$$ packed form
2634b53n85Q28L33n49O6O52M65j457M09J029l02j141N09O18p58m51P73L49r06
2653c71j15J440l85q58L28J128o16n71J94J009r90o10P03K59r14l48Q16r4p19
2672g14K39J365n95p57P73O37p58m30P99J22j202rR19m16j093M30P17l23o23N57
2692c62P92q59mP99L33j131j32J111p7r32R3P52q60m07L06J076j145j77R76L75
2712E27j116K25R61k66q27N34P05p03m78P27J80q49l38O72N86j019K78O01k60
2731A40n74Q17M53k97o28P45L06p74l14O78j84r95L34O17j53o66M28M57k71p0
2751D9M23L47n50l95Q64j30q61K89M12n12n19M15L95o17l33Q21K40n40J30L83
2771C11J50n26J54M62m77n42K53M27j15q48J236J3j009J59L65J71k28m10P41j35
$$ plain form
2791 152 -201 94 128 -255 -345 144 12 -706 -379 -82 -171 -862 -23 5 -151 -133 0 498 123 147 580 326
2813 326 -333 44 321 -15 -546 -137 172 -475 -281 218 117 -380 -244 818 56 276 266 482 60 34
2833 34 823 367 -360 -327 185 -36 -311 49 294 -73 -264 241 469 44 171 784 380 210 194 299 438
2854 438 -581 -182 543 -26 -676 -132 277 -389 -464 402 351 -289 79 573 107 -232 59 715 -308 -656
2874 -656 -60 -180 -366 -573 96 27 -617 -340 561 134 -422 31 561 -164 -262 333 413 -354 -680 106 -60
2895 -60 -544 -218 193 -253 -606 165 618 -235 -257 390 630 -338 -269 87 363 -382 -51 543 20 -630 -77
2916 -77 -202 -75 -498 449 538 -344 -64 411 552 -119 112 654 112 -303 348 516 -210 -508 419 247 -218
2937 -218 -272 525 69 -194 114 586 334 -389 239 579 -262 -455 237 -10 -568 -357 333 -114 -507 -166
$$ packed form
2791A52l53K95L4l83r0M89j32p18L27K97q9o91Q39K8j56J8J33M98l75K4M33k54
2813C26o59L77K77l36n31M09L09o47J94M99j01m97J36J062p62K20j0K16m22k6
2833C4P89m56p27L3N12k21k75L60K45l67j91N05K28m25J27O13m04j70j6J05J39
2854D38j019L99P25n69o50N44M09o66p5Q66n1o40L68M94m66l39K91O56j023l48
2874f56N96j20j86k07O69o9o44K77R01m27n56M53N30p25r8N95Q0p67l26P86j66
2895f0m84L26M11m46l53P71M53q53k2O47K40r68O9L56K76p45L31N94n23o50N53
2916g7j25J27m23R47Q9q82K80M75J41o71K31N42n42m15O51J68p26k98R27j72m65
2937b18n4P97m56k63L08M72k52p23O28L40q41j93O92k47n58K11O90m47l93L41
$$ plain form
2957 -166 536 -152 -590 284 477 -61 -108 165 203 -559 -316 147 81 -484 -369 269 -608 -768 102 450 -376
2978 -376 -226 218 146 -298 -368 426 158 -619 -65 223 -249 -421 108 413 -472 -431 116 -31 -178 -50 275
2999 275 298 35 380 334 -215 -131 241 130 -252 -167 571 87 -182 -111 496 -23 7 259 436 -154 -126 369
3021 369 282 -163 127 159 3 -177 152 50 -239 -220 147 102 -343 -147 262 267 -290 169 -28 -244 -189 87
3043 87 6 -230 -122 11 108 -632 -201 287 -325 -209 -33 169 83 -587 113 246 -229 -30 -8 -124 -435 181
3065 181 -29 -201 76 237 375 -314 -576 -55 140 -326 -137 -76 298 -385 208 798 -679 -399 -188 90
3085 90 -96 -391 309 614 -291 -232 495 -281 -362 141 475 -36 -440 344 -41 -93 289 138 -62 -426 -355 -98
3107 -98 30 -364 338 70 -121 -267 -339 1140 -225 -280 653 248 -138 -376 532 -340 89 295 590 -635
$$ packed form
2957a66P02o88m38Q74J93n38m7K73L8p62K43M63o6n65J15O38q77j60Q70L48q26
2978c76J50M44p2m44p0P94k68p77N54K88m72j72N29L05q85M1N47j47j47J28L25
2999B75K3k63L45m6n49Q4L72j11l82Q5P38m84k69P1O07n19L0K52J77n90K8M95
3021C69q7m45K90L2j56j80L29j02k89J9L67m5m45J96M09Nn57M59j97k16N5K76
3043H7q1k36J08J33R7p40M31M88o12J16J76K02q6o70P00J33m75J99K2j16l11O16
3065A81k10j72K77J61J38o89k62N21J95m66J89O1L74o83N93N90j477K80K11K78
3085I0j86k95P00L05r05N9P27p76q1N03L34n11m04P84l85n2L82j51k00l64P1K57
3107i8J28l94P02k68j91j46p2J479j365n5R33m05l86k38R08q72M29K06K95j225
$$ plain form
3127 -635 -24 -102 815 -648 -313 1161 2 256 -15 505 -130 -4 -134 9 226 -328 417 192 -20
3146 -20 -593 677 -375 -204 108 1241 143 -903 -196 -567 -481 -118 285 173 -693 113 481 49 -696
3165 -696 -514 -248 -872 -314 253 266 -697 250 1197 755 -617 611 462 -47 247 -158 -393 486 -981
3184 -981 -456 -209 -852 137 940 -342 -761 98 417 129 132 26 879 -428 -216 -352 -113 -396 -500 -261
3204 -261 -594 -756 11 705 103 45 1027 524 369 -436 277 200 -660 -183 -83 867 -505 -343 243 621
3224 621 -586 -1077 398 -466 -486 776 -225 -84 -440 166 456 -270 -146 435 218 -745 30 -280 -974
3243 -974 -432 124 -235 127 -521 -325 168 -417 220 124 -678 -715 -95 193 -221 -257 382 63 -361 -359 92 -264
3265 -264 -18 -212 -546 36 -126 -208 354 -316 188 2 67 302 498 233 -413 72 91 173 -127 239 499
$$ packed form
3127f35O11p8R17j463L35J474j159K54k71N20o35J26j30J43K17n54P45k25k12
3146b0n73J270j052J71L12J133j098j046P07l71Q6L63M03j12q66Q06L68m32p45
3165f96J82K66o24N58N67J3r63R47R47m42j372J228j49n09K94m05k35Q79j467
3184i81N25K47o43R89Q03j282m19Q59L19k88Lj06Q53j307K12j36K39k83j04K39
3204b61l33j62P67O94o02n8R82n03j55q05P13p7q60M77J00R50j372J62N86L78
3224F21j207m91J475q64k0J262j001J41l56O06K90p26J24N81k17r63P75l10o94
3243i74N42N56l59L62o48J96M93n85O37r6q02l7O20K88m14l6O39l19m24KM51l56
3265b64K46j94l34N82j62q2N62o70N04j86O5K35J96k65o46M85J9Q2l00L66K60
$$ plain form
3286 499 871 -333 338 918 311 642 222 -78 -425 -23 31 372 7 -66 50 -398 456 340 332 -71 243
3307 243 183 -124 -450 225 134 74 -19 -152 308 -212 -18 -169 447 -595 46 -418 139 48 254 -544 -427
3328 -427 -471 108 441 241 -90 149 20 -763 -119 130 278 -628 -28 -522 112 -542 -24 -82 -549 -385 -1
3349 -1 -131 5 -132 140 -200 -262 -229 67 -14 -368 101 -38 -38 -575 502 101 223 -402 -33 321 303 -34
3371 -34 387 -75 -379 406 194 -342 -237 253 288 89 293 534 42 -462 375 914 -133 -350 -307 119 -58
3392 -58 -30 39 -16 168 164 -2 651 -617 118 798 -99 -10 -419 591 -447 -302 237 -585 42 -15 283 19
3414 19 -554 -274 -212 -200 -860 281 305 -336 -232 -465 197 -536 -196 15 509 -289 202 431 -1037 -170 52
3435 52 252 -122 -161 12 692 -109 149 239 306 552 -242 -61 -28 -414 43 -488 445 396 535 -413 -81 -400
$$ packed form
3286D99L72j204O71N80o07L31m20l00l47M02N4L41l65p3J16m48Q54j16qm03L14
3307B43o0l07l26O75r1o0r3j33M60n20J94j51O16j042O41m64N57r1K06p98J17
3328d27m4N79L33k00l31K39j29p83O44K49J48r06O00m94O34o54N18n8m67J64L84
3349aj30J36j37K72l40o2L3K96q1l54M69j39%n37J077m01J22o25L69L54j8l37
3371c4M21m62l04P85k12n36J05M90L5j99K04K41m92n04Q37N39j047k17M3M26j77
3392e8K8O9n5J84mj66O53j268P35O80q97Q9m09J010j038J45N39q22O27n7K98k64
3414A9n73K80O2J2o60J141K4o41J04k33O62p33L40K11M94p98M91K29j468Q67K22
3435E2K00l74l9J73O80q01K58R0O7K46p94J81L3l86M57n31R33m9J39r48L32l19
$$ plain form
3457 -400 -137 387 -574 -96 214 -549 -347 337 37 23 -131 -286 -251 -207 -269 119 31 -576 -164 -111 17 214
3479 214 186 -110 233 -164 -97 -92 -13 -96 5 -8 -100 -244 325 -560 190 170 55 -209 -97 -356 -76 -451 -305
3502 -305 -391 34 -805 -404 -137 414 18 94 213 178 -48 236 -368 -221 143 -270 -286 159 433 -193 -614
3523 -614 -474 -386 607 -198 -380 -115 -117 52 -485 27 -274 152 -108 -229 -317 106 -327 -8 12 97 -291 -91
3545 -91 273 124 504 -520 -550 53 288 65 280 638 375 258 -352 -6 3 106 250 -327 -131 -114 956
3566 956 -164 603 263 76 211 -179 -137 -240 -36 -2 342 212 -343 -154 461 -83 -148 244 331 53 -203
3587 -203 116 101 -229 -249 86 138 -79 -51 -71 -145 -220 353 74 -137 -75 48 -153 -318 26 112 139 -72 47
3610 47 81 -124 -173 -391 224 -118 -60 -1 -177 56 -131 58 61 -67 -85 188 -20 -165 16 485 -318 -129 222
$$ packed form
3457d00K63N24r61M78L10p63K02O84l00j4j54j55L5M4o2L88q8o07M12N3J28J97
3479B14k8k96L43l97O7NP9q3J01j3r2j44N69q85P50k0j15k64J12k59K80l75J46
3502c05q6M25q39M01K67N51l96P6J19l5k26K84o04J47L64m13j6M45K74o26m21
3523f14J40Q8R93q05j82K65kJ69n37N12l01M26k60j21q8M23m33L19K0Q5l88K00
3545i1L64j49L80j024l0O03K35k23K15L58k63j17o10L46RJ03J44n77J96J7J070
3566I56j120P67l40j87J35l90M2j03K04L4L44j30n55J89O15n44o5L92Q7k78k56
3587b03L19j5l30k0L35N2k17K8k0p4p5N73k79k11O2J23k01j65L44Q6K7k11J19
3610D7L4k05m9k18O15l42N8N9j76K33j87J89Lj28j8K73k08j45J81M69q03J89L51
$$ plain form
3633 222 80 69 -78 35 -107 -198 -93 35 -300 78 48 339 -71 -207 191 77 -46 -191 58 246 269
3654 269 110 341 383 -394 -62 232 181 -69 -104 457 85 155 135 -381 -454 -744 510 611 106 215 -184 -131
3676 -131 75 -206 92 -185 -320 51 126 -55 -89 165 -35 -74 -137 -134 -109 -64 96 269 -426 -231 386 -52 -259
3699 -259 7 84 3 -30 -58 -64 50 -308 -7 72 95 -174 -24 324 -136 -214 -61 81 -269 680 71 -140 -330
3722 -330 -38 199 46 122 111 -29 -347 -51 164 -381 -123 412 -336 286 -171 241 338 -35 180 363 -596
3743 -596 -109 117 -328 103 221 183 -220 -422 -528 571 256 -141 355 -575 609 411 -261 -16 279 -93
3763 -93 63 -274 18 47 528 -162 136 380 356 98 157 97 -76 -196 338 263 -268 13 154 177 -94 23
3785 23 -57 -71 -164 108 48 190 -91 86 54 -352 -297 124 -148 -225 -199 -60 35 19 -389 173 -116 87 -1 -86
$$ packed form
3633B22j42j1j47J13j42r1J05J28l35L78l0K91m10j36L98j14j23j45K49J88K3
3654B69j59K31M2p77L32K94n1k50l5N61l72P0k0n16p3k90J254J01n05J09l99N3
3676a31K06k81K98k77j35L71P5j81l4K54k00l9o3LK5M5J60J73o95J95O17m38k07
3699b59K66P7q1l3k8oJ14l58L01P9K3k69J50L48m60p8J53J42l50R49o09k11j90
3722c30K92K37j53P6j1j40l18K96K15n45K58N35p48O22m57M12R7l73K15J83r59
3743e96M87K26m45M31J18l8m03k02j06J099l15l97M96r30J184j98o72K45K95l72
3763i3J56l37K92K9M81o90K98K44k4k58N9o0j73j20N34p5n31K81J41K3k71J17
3785B3q0j4r3K72o0J42k81J77l2m06N5M21k72p7K6J39R5j6m08N62k89K03q8q5
$$ plain form
3809 -86 -141 -131 271 -195 -201 116 -154 116 -123 -318 105 -85 1 -64 337 91 -37 5 193 -188 -92 248 -109
3832 -109 -233 -1 -42 48 144 190 137 236 94 -215 348 62 -127 -47 163 -185 77 279 16 -203 161 -293
3854 -293 391 -116 127 -295 -276 -67 31 108 -202 307 186 -399 -379 285 464 -660 -273 264 59 -367 -381
3875 -381 108 -453 189 34 293 -250 -430 363 -117 -532 -112 -53 644 -527 -84 451 -187 56 -48 -121
3895 -121 -493 -53 482 162 -723 23 -47 -344 463 -244 -290 328 -421 -713 -449 -523 -219 -657 217 -130 -964
3916 -964 898 -321 693 950 -205 -91 -661 -547 177 -240 -1555 217 267 359 -563 -560 -472 -1164 -336 675
3936 675 -275 -298 -876 -71 557 244 163 -639 384 455 198 374 -652 130 1102 -248 346 569 -284 869
3956 869 -309 -379 -848 614 -288 -190 -600 -1349 -64 -1423 -1 -1274 -13 18 -217 -629 -168 -225 -119
$$ packed form
3809h6n5J0M02m66oL17k70K70k39j95M23j90Q6o5M01k46j28M2J88l81R6L40l57
3832a09j24K32m1R0R6M6n3R9j42l09N63k86j89Q0K10l48K62K02k63k19L64m54
3854b93O84n07K43m22J9K09R8P7l10N09j21n85K0O64J79j124L87N37k05m26j4
3875c81M89n61O42j55K59n43j80P93m80m15M20N9O97j171M43N35o38K43j04p3
3895a21l72M40N35l20q85P46p0k97Q07p07m6O18p49k92K64p4L04m38Q74l47q34
3916i64J862j219J014K57j155J14n70J14P24m17j315J772N0R2r22LQ8o92Q28J011
3936F75r50k3n78Q05O28l13q1q02J023P1k57J76j026P82R72j350N94K23q53J153
3956H69j178p0m69J462r02R8m10p49J285j359J422j273J261L1k35m12M61n7J06
$$ plain form
3975 -119 -125 644 -171 -88 305 -185 -147 51 -232 -329 164 -211 157 -139 -88 62 202 -300 127 169 30 26 -44
3998 -44 317 39 55 314 111 -7 57 -116 -161 -40 1 -111 -30 -114 -22 -68 193 -119 -174 57 192 -134 44
4021 44 285 18 178 184 188 -134 -97 220 -20 105 65 31 -3 -161 47 -17 27 -116 9 -130 31 -154 25 -3
4045 -3 73 -72 -28 227 10 -166 126 -6 -2 -197 -95 -273 -242 -267 -140 28 160 -140 -94 147 82 -265 -266 -219
4069 -219 -256 -7 177 -49 -66 99 -305 10 -195 17 136 -182 -254 29 -156 -166 -259 -267 -43 101 18 -105 -82
4092 -82 179 133 341 164 21 4 64 -16 -119 -367 -143 46 170 -71 -121 -70 -161 -133 -104 138 95 123 74 96 -199
4117 -199 283 315 127 -114 303 9 -440 140 -192 -73 -63 60 83 171 -196 34 99 0 55 177 -25 -232
4139 -232 46 105 -99 -188 164 88 -10 -7 -15 7 -259 -41 11 -64 80 223 96 85 19 -214 195 80 -332 93
$$ packed form
3975a19oP69q15Q3L93m90L8J98k83r7M93l75L68k96N1J50J40n02M27M2j39mp0
3998d4L61k78J6K59k03j18O4j73m5J21M1j12Q1q4R2m6K61l12n5K31J35l26J78
4021D4K41k67J60OMl22L7L17k40J25m0l4l4j58K08o4M4j43J25j39J61j85J79k8
4045cP6j45M4K55k17j76K92j32Mj95J02j78L1k5J27J68J32l00M6K41o5l47jM7
4069b19l7K49J84k26j7J65m04L15k05K12J19l18p2K83j85j0r3qK24J44q3j23K3
4092h2K61m6K08j77j43j7O0q0j03k48K24J89J24k41n0N1r1K8K9K42m3K8m9K2k95
4117a99M82L2j88k41M17k94m49N80l32J19J0J23K3Q8l67K30O5r9N5J22k02k07
4139b32K78N9k04q9L52p6r8LqK2k66K18N2p5J44J43j27j1o6k33M09j15m12M25
$$ plain form
4163 93 191 96 -42 -123 91 116 -60 291 0 10 10 54 14 -240 -129 -71 -71 -323 -169 -135 155 28 -100 -74 3
4188 3 16 178 206 198 57 17 -371 38 76 -34 109 7 40 -109 72 -109 -220 81 25 106 212 18 355 169
4212 169 227 1 89 240 -138 -115 -6 17 163 408 39 -196 9 87 -171 -23 60 20 169 11 113 94 -77
4235 -77 -166 136 93 82 40 -76 -86 -201 111 -207 -20 18 -127 -50 281 19 -37 60 -138 -43 54 -225 -178 -174 117
4260 117 -19 200 47 -6 97 110 42 -14 86 81 150 -180 325 -60 -134 -157 138 -57 100 -156 -69 72 70 -411
4284 -411 -59 33 348 96 143 202 -55 85 169 96 -3 103 45 -185 38 260 50 99 41 32 210 -123 -116 -168 -88
4309 -88 114 -297 134 25 -39 -137 -381 -95 9 178 227 -265 -138 -175 -73 -40 -60 62 -87 -265 -95 4 -62
4332 -62 139 -177 238 108 154 -267 228 340 201 -89 -109 247 37 268 -69 117 -8 143 117 87 1 249
$$ packed form
4163I3R8r5j38q1K14K5j76L51k91J0%M4m0k54J11N8%k52J54L4K90j27j28K6P7
4188CJ3J62K8qj41m0l88M09L8j10J43j02L3j49J81j81j11L01n6Q1J06j94L37j86
4212A69N8k26Q8J51l78K3J09K3J46K45l69k35K05P8k58J48Q3m0J49j58J02j9j71
4235g7q9L02m3j1m2j16j0j15L12l18J87L8j45P7L31k62n6R7j98R5R7k79M7MK91
4260A17j36K19j53n3J03J3o8n6J00nO9l30N05l85p4k3K95j95J57k56Q7J41km81
4284d11L52R2L15k52M7N9k57J40Q4p3r9J06n8k30K23K22k10M9n8rJ78l33Pn2Q0
4309h8K02m11M31j09o4r8k44K86J04J69M9m92J27l7J02L3k0J22j49j78J70R9o6
4332f2K01l16M15j30M6m21M95J12j39k90k0L56k10K31l37J86j25J51k6l0q6K48
$$ plain form
4354 249 -265 -35 -84 -42 42 -134 72 -20 -134 -58 48 190 -2 46 262 -63 76 110 -69 -263 45 158
4376 158 -81 246 287 159 174 -47 14 314 6 144 67 156 -123 -93 218 142 -83 -139 -11 -99 -247 -24 155
4399 155 -185 -41 34 40 98 239 57 -74 25 -77 -110 328 175 37 -99 -10 -184 79 119 -132 -52 81 -194
4422 -194 70 55 -11 128 -138 -130 -132 204 109 -230 -180 -318 -152 -114 134 -401 -3 121 164 81 65 -143 -200 156
4446 156 -58 -174 -55 258 140 37 -29 99 51 -236 116 100 463 100 -213 84 -44 24 -49 -46 -4 53 82
4469 82 -57 25 185 50 173 91 169 83 83 -10 -17 -110 142 -198 201 17 -422 -80 -132 91 88 -128 -259 -110 -62
4494 -62 38 2 272 30 -140 -148 499 104 -23 -30 -131 38 -142 11 -292 15 -244 -29 -178 -80 -197 -208 52
4517 52 -28 -29 -233 -76 -229 -238 -153 -271 -116 -65 60 169 -49 -212 -174 -221 -230 -82 231 3 -87 30 236 -28
$$ packed form
4354B49n14K30m9M2Q4j76K06r2j14P6J06J42j92M8K16l25J39L4j79j94L08J13
4376A58k39L27M1j28J5k21O1L00l08J38p7Q9k79L0L11p6k25n6J28q8j48K23J79
4399A55l40J44P5ON8J41j82j31R9j02l3M38j53j38j36Q9j74K63M0k51Q0J33k75
4422a94K64j5o6J39k66QkL36r5l39N0j38J66L8K48n35L98J24M3q3j6k08n7L56
4446A56k14j16J19L13j18j03o6J28m8k87L52j6L63l63l13K97j28O8p3LM2N7K9
4469H2j39Q2J60j35J23q2P8q6%r3pr3K52l40L99j84m39L42n2K23lk16j31J49M8
4494f2J00l6K70k42j70qO47l95j27pj01J69j80J53l03L07k59K15j49R8j17j1K60
4517E2q0jk04J57j53rQ5j18J55N1J25J09k18j63L8m7rJ48L13k28r0J17K06k64
$$ plain form
4541 -28 -136 -153 115 144 -128 -453 -23 2 277 143 26 27 -21 -75 -23 144 34 -2 51 27 400 -120 69 44
4565 44 158 -142 -180 -8 65 44 -3 -47 171 6 153 -26 25 -24 -138 93 16 -24 -72 -93 -9 -277 -36 -207
4589 -207 101 -65 5 65 -98 -34 325 -108 -107 -158 58 170 185 -285 123 140 -283 -32 -240 -18 -191 -138 -80
4612 -80 86 -29 144 38 -163 94 -210 220 -109 129 -43 188 131 -248 91 182 -36 157 448 129 -70
4633 -70 254 134 -39 224 45 29 -80 -34 177 -156 96 139 41 179 -31 368 108 9 211 -286 67 20
4655 20 136 13 -272 -67 -128 -111 124 122 -167 -103 15 -69 128 -104 -20 179 -96 -29 -45 40 22 188 -4 91
4679 91 -45 -258 -26 -111 -188 198 173 -112 -163 47 231 208 -189 17 -29 -79 192 -10 -53 62 36 -12 209 24
4703 24 29 -215 -125 -243 314 87 66 -87 -72 292 5 -82 -104 -43 202 253 -279 4 58 30 -9 -98 -235 289 161
$$ packed form
4541b8j08j7K68K9k72l25M30K5K75j34j17Jm8n4N2J67j10l6N3k4L73n20J89k5
4565D4J14l00l8J72P3k1m7m4K18j65J47j79N1m9j14K31p7m0m8k1Q4k68K41j71
4589b07L08j66P0O0j63O4L59m33Jn1K16J12J5m70M08J7m23K51k08K22j73N3N8
4612h0J66j15J73j06k01K57l04M30l29K38j72K31n7l79L39R1k18J93K91l19j99
4633g0L24j20j73K63j79j6j09M6K11l33K52M3r8J38k10L99k60r9K02m97L53m7
4655B0J16j23k85K05o1J7K35kk89O4J18q4J97k32Q4J99k75O7j6Q5j8J66j92R5
4679I1j36k13K32q5p7L86k5k85n1K10J84k3l97K06m6n0K71k02m3J15k6m8K21j85
4703B4Nk44R0j18N57k27k1j53J5L64k87q7k2O1K45N1n32K83N4k8l9q9j37N24j28
$$ plain form
4728 161 234 261 93 -60 -181 119 -32 224 -159 -39 22 70 272 -71 368 210 633 485 711 829 -689
4749 -689 -906 1156 826 189 185 15 -112 -99 243 489 -225 438 436 86 -384 477 41 -159 -242 114 -362 -224
4771 -224 76 -364 38 -82 -51 29 207 -138 -353 174 5 -179 -116 120 18 244 -68 -17 145 -44 39 251
4793 251 -122 -37 -78 -330 109 -75 -142 -174 -47 -50 136 137 -335 135 -248 -173 -85 106 40 -193 213 -35 -244 -121
4817 -121 -182 70 285 63 -160 16 78 58 -242 -63 -21 -39 -173 -150 97 63 294 105 -77 58 13 39 160
4840 160 137 151 449 105 152 -76 -97 243 -108 14 -269 -32 -168 -69 -33 -75 -259 325 -49 -254 52 -197
4862 -197 140 -111 21 185 122 -266 -168 -13 -77 -211 211 -91 83 -96 -103 96 53 -262 -14 -33 118 200 -77
4885 -77 88 -61 55 145 168 168 -85 148 -6 -118 130 143 46 70 -75 -171 -56 122 68 -144 112 137 36 181
$$ packed form
4728A61P3K7j68j53j21L00j51K56l83J20O1M8K02l43M39j58M23j48K26J18j518
4749f89k17K062l30o37mj70j27J3L42K46p14O63kl50m70Q61m36k00q3L56m76J38
4771b24L00m40M02j20L1Q0J78l45k15N27j69j84O3K36j02K26l12N1J62j89Q3K12
4793B51l73Q5m1k52M39j84o7l2J27lJ86Jm72M70l83P5Q8J91o6k33M06k48k09J23
4817a21o1K52K15k22k23J76O2k0l00J79M2j8j34K3K47l4K31j89j82J35m5K6J21
4840A60k3J4K98l44M7k28k1L40l51J22k83K37j36R9L6m2j84N84l74k05L06k49
4862a97L37k51J32J64o3l88R8J55o4j34M22l02J74j79pJ99m3l15K48j9J51Q2k77
4885g7J65j49J16R0K3%k53K33j54j12K48J3r7K4j45r6J15J78n4k12K56K5j01J45
$$ plain form
4909 181 -64 19 223 85 -81 -116 138 -103 -6 -112 113 154 59 -166 55 -96 17 -95 110 -45 -84 286
4931 286 -15 21 -218 244 -207 60 -76 -151 40 196 292 -105 183 165 5 -176 71 81 173 -240 266 -15
4953 -15 126 -101 -150 92 -24 226 17 -86 371 25 54 -111 -116 229 68 131 70 -27 29 254 75 -150 23
4976 23 75 261 -235 -52 -58 38 -106 187 -88 63 -406 236 140 -219 -188 278 -10 -196 48 76 -122 123 0
4999 0 -135 84 65 -26 127 -30 -24 167 -34 -73 -288 131 184 -135 11 -122 5 -23 38 255 33 -252 -209 120
5023 120 -41 40 -180 -202 -149 12 -137 -14 -122 251 -22 161 51 -157 112 134 16 -128 46 98 130 -103
5045 -103 -67 37 59 -276 117 -117 -27 78 220 -108 112 110 -30 -61 147 -216 7 54 154 43 154 -147
5067 -147 -104 12 -41 175 29 64 31 83 5 -208 -73 233 -65 -170 33 281 -80 -102 65 267 -136 109
$$ packed form
4909A81k45Q3K04j38j66l5K54k41R7j06K25M1r5k25K21j51J13j12K05j55l9L70
4931B86l01L6k39M62m51K67j36p5J91J56R6l97K88j8j60j81K47J0R2m13N06k81
4953a5J41k27m9K42j16K50k09j03M57l46K9j65nL45j61O3o1r7N6K25j79k25J73
4976B3N2J86m96J83oR6j44K93k75J51m69O42r6l59L1M66k88j86K44K8j98K45j23
4999@j35K19j9r1J53j57OJ91k01l9k15M19N3l19J46j33J27k8O1K17k22k85M3L29
5023A20j61Q1k20k2N3J61j49J23j08L73k73J83j10k08K69K2j18j44J74N2L2k33
5045a03L6J04K2l35L93k34R0J05J42l28K20kj40l1K08l63K23M7J00j11J11l01
5067a47M3J16n3K16j46L5l3N2p8k13J35L06k98j05K03K48l61k2J67K02m03K45
$$ plain form
5089 109 -76 329 130 69 261 77 -114 215 40 -29 109 -185 122 107 72 -24 -164 200 14 -162 -226 219
5111 219 -208 224 -192 -10 254 365 88 -128 -208 133 -163 -95 22 33 -9 -13 31 213 -103 13 89 -141 -51
5134 -51 -199 -30 71 -3 42 43 157 -146 159 57 -91 203 -120 77 -227 302 -58 11 -138 27 133 166
5156 166 -71 127 45 -53 91 -92 324 -88 151 20 -242 -170 -188 116 -17 168 92 -145 75 88 -87 31
5178 31 -164 -180 42 146 -24 159 0 -107 -92 17 -14 -159 -107 -12 -27 -164 20 14 -24 -79 155 193 -13 -64
5202 -64 -199 155 -108 95 -174 158 104 -32 56 -270 164 -38 -142 -303 -35 -53 171 28 129 64 21 235
$$ packed form
5089A09j85M05j99o1J92j84j91L29j75o9J38k94L07j5l5r6j40L64j86j76o4M45
5111B19m27M32m16J82K64J11k77k16q0L41k96O8J17J1m2mM4J82l16J16P6k30R0
5134e1j48J69J01p4M5JJ14l03L05j02j48K94l23J97l04N29l60O9j49J65J06L3
5156A66k37J98q2r8J44j83M16m12K39j31k62P2j8L04j33J85p6k37K20J3j75J18
5178C1j95j6K22J04j70J83j59j07J5J09l1j45N2R5j5j37J84ol8n5K34L8k06n1
5202f4j35L54k63K03k69L32n4j36Q8l26M34k02j04j61K68j8K24j43J01o5m3K14
$$ [...]
8191i2
##END NTUPLES=NMR FID
##END=
