##TITLE=1H_Pr Am-2764-E
 CDCl3, 8 sc, 
 23.08.2021
##JCAMPDX= 6.0         $$ Bruker NMR JCAMP-DX V2.0
##DATA TYPE= NMR FID
##DATA CLASS= NTUPLES
##ORIGIN= UXNMR, Bruker Analytische Messtechnik GmbH
##OWNER= root
$$ XWIN-NMR		Version 3.5
$$ Mon Aug 23 13:41:45 2021 Russian Standard Time (UT+4h)  she@DPX200
##.OBSERVE FREQUENCY= 200.131506
##.OBSERVE NUCLEUS= ^1H
##.DELAY= (6, 6)
##.ACQUISITION MODE= SIMULTANEOUS
##.ACQUISITION SCHEME= undefined
##.AVERAGES= 8
##.DIGITISER RES= 18
##SPECTROMETER/DATA SYSTEM= spect
##.PULSE SEQUENCE= zg30
##.SOLVENT NAME= CDCl3
##.SHIFT REFERENCE= (INTERNAL, CDCl3, 0, 15.7039)
##AUDIT TRAIL= $$ (NUMBER, WHEN, WHO, WHERE, WHAT)
$$ ##TITLE= Audit trail, XWIN-NMR		Version 3.5
$$ ##JCAMPDX= 5.01
$$ ##ORIGIN= Bruker BioSpin GmbH
$$ ##OWNER= she
$$ F:/spectra/data/she/nmr/H-F/1/audita.txt
$$ ##AUDIT TRAIL=  $$ (NUMBER, WHEN, WHO, WHERE, WHAT)
(   1,<2021-08-23 13:40:42.96 +0400>,<she>,<DPX200>,
      <created by zg, POWCHK disabled, PULCHK disabled
       configuration hash MD5:
       00 E9 B6 7A A2 85 ED C7 34 08 36 98 17 FE 4E 26
       data hash MD5: 16K
       58 04 EC B3 D4 F5 E2 D8 30 18 67 F9 37 2E 12 95>)
$$ ##END=
$$ 
$$ hash MD5
$$ 56 0C C6 89 77 76 70 97 94 9F 2E B1 10 87 F8 EA
##$RELAX= 
##$RELAX= 
##$RELAX= 
##$RELAX= 
##$RELAX= 
##$RELAX= 
$$ Bruker specific parameters
$$ --------------------------
##$DU= <F:/spectra>
##$EXPNO= 1
##$NAME= <H-F>
##$PROCNO= 1
##$TYPE= <nmr>
##$USER= <she>
##$AMP= (0..31)
100 100 100 100 100 100 100 100 100 100 100 100 100 100 100 100 100 100 
100 100 100 100 100 100 100 100 100 100 100 100 100 100 
##$AQSEQ= 0
##$AQ_mod= 1
##$AUNM= <au_zg>
##$AUTOPOS= <>
##$BF1= 200.13
##$BF2= 200.13
##$BF3= 200.13
##$BF4= 200.13
##$BF5= 200.13
##$BF6= 200.13
##$BF7= 200.13
##$BF8= 200.13
##$BYTORDA= 1
##$CFDGTYP= 0
##$CFRGTYP= 5
##$CHEMSTR= <none>
##$CNST= (0..31)
1 1 145 1 1 1 1 1 1 1 1 1 1 1 1 1 1 1 1 1 1 1 1 1 1 1 1 1 1 1 1 1 
##$CPDPRG= <>
##$CPDPRG1= <>
##$CPDPRG2= <>
##$CPDPRG3= <>
##$CPDPRG4= <mlev>
##$CPDPRG5= <mlev>
##$CPDPRG6= <mlev>
##$CPDPRG7= <mlev>
##$CPDPRG8= <mlev>
##$CPDPRGB= <>
##$CPDPRGT= <>
##$D= (0..31)
0 1.2 0 0 0 0 0 0 0 0.06 0 0.03 0 0 0 0 0.0002 0 0 0 0 0 0 0 0 0 0 0 0 
0 0 0 
##$DATE= 1629711642
##$DBL= (0..7)
120 120 120 120 120 120 120 120 
##$DBP= (0..7)
150 150 150 150 150 150 150 150 
##$DBP07= 0
##$DBPNAM0= <>
##$DBPNAM1= <>
##$DBPNAM2= <>
##$DBPNAM3= <>
##$DBPNAM4= <>
##$DBPNAM5= <>
##$DBPNAM6= <>
##$DBPNAM7= <>
##$DBPOAL= (0..7)
0.5 0.5 0.5 0.5 0.5 0.5 0.5 0.5 
##$DBPOFFS= (0..7)
0 0 0 0 0 0 0 0 
##$DE= 6
##$DECBNUC= <off>
##$DECIM= 32
##$DECNUC= <off>
##$DECSTAT= 4
##$DIGMOD= 1
##$DIGTYP= 9
##$DL= (0..7)
0 120 120 120 120 120 120 120 
##$DP= (0..7)
150 150 150 150 150 150 150 150 
##$DP07= 0
##$DPNAME0= <>
##$DPNAME1= <>
##$DPNAME2= <>
##$DPNAME3= <>
##$DPNAME4= <>
##$DPNAME5= <>
##$DPNAME6= <>
##$DPNAME7= <>
##$DPOAL= (0..7)
0.5 0.5 0.5 0.5 0.5 0.5 0.5 0.5 
##$DPOFFS= (0..7)
0 0 0 0 0 0 0 0 
##$DQDMODE= 0
##$DR= 18
##$DS= 0
##$DSLIST= <SSSSSSSSSSSSSSS>
$$ [...]
##$SUBNAM2= <"">
##$SUBNAM3= <"">
##$SUBNAM4= <"">
##$SUBNAM5= <"">
##$SUBNAM6= <"">
##$SUBNAM7= <"">
##$SUBNAM8= <"">
##$SUBNAM9= <"">
##$SW= 20.0188882624521
##$SWIBOX= (0..15)
0 0 2 0 0 0 0 0 0 0 0 0 0 0 0 0 
##$SW_h= 4006.41025641026
##$TD= 16384
##$TD0= 1
##$TE= 0
##$TE2= 300
##$TE3= 300
##$TEG= 300
##$TL= (0..7)
0 120 120 120 120 120 120 120 
##$TP= (0..7)
150 150 150 150 150 150 150 150 
##$TP07= 0
##$TPNAME0= <>
##$TPNAME1= <>
##$TPNAME2= <>
##$TPNAME3= <>
##$TPNAME4= <>
##$TPNAME5= <>
##$TPNAME6= <>
##$TPNAME7= <>
##$TPOAL= (0..7)
0.5 0.5 0.5 0.5 0.5 0.5 0.5 0.5 
##$TPOFFS= (0..7)
0 0 0 0 0 0 0 0 
##$TUNHIN= 0
##$TUNHOUT= 0
##$TUNXOUT= 0
##$USERA1= <user>
##$USERA2= <user>
##$USERA3= <user>
##$USERA4= <user>
##$USERA5= <user>
##$V9= 5
##$VALIST= <valist>
##$VCLIST= <CCCCCCCCCCCCCCC>
##$VD= 0
##$VDLIST= <DDDDDDDDDDDDDDD>
##$VPLIST= <PPPPPPPPPPPPPPP>
##$VTLIST= <TTTTTTTTTTTTTTT>
##$WBST= 1024
##$WBSW= 4
##$XGAIN= (0..3)
0 0 0 0 
##$XL= 0
##$YL= 0
##$YMAX_a= 227331
##$YMIN_a= -336203
##$ZGOPTNS= <>
##$ZL1= 120
##$ZL2= 120
##$ZL3= 120
##$ZL4= 120
##$ABSF1= 10
##$ABSF2= 0
##$ABSG= 5
##$ABSL= 3
##$ALPHA= 0
##$AQORDER= 0
##$ASSFAC= 0
##$ASSFACI= 0
##$ASSFACX= 0
##$ASSWID= 0
##$AUNMP= <proc_1d>
##$AZFE= 0.1
##$AZFW= 0.1
##$BCFW= 1
##$BC_mod= 2
##$BYTORDP= 1
##$COROFFS= 0
##$CY= 11.3945322036743
##$DATMOD= 1
##$DC= 2
##$DFILT= <>
##$DTYPP= 0
##$F1P= 2.36226072786647
##$F2P= -0.459571619588291
##$FCOR= 0.5
##$FTSIZE= 0
##$FT_mod= 4
##$GAMMA= 1
##$GB= 0.15
##$INTBC= 1
##$INTSCL= 1
##$ISEN= 128
##$LB= 0.24
##$LEV0= 0
##$LPBIN= 0
##$MAXI= 10000
##$MC2= 0
##$MEAN= 0
##$ME_mod= 0
##$MI= 1.114404
##$NCOEF= 0
##$NC_proc= 0
##$NLEV= 6
##$NOISF1= 3.799351
##$NOISF2= 2.8
##$NSP= 1
##$NTH_PI= 0
##$NZP= 0
##$OFFSET= 15.70392
##$PC= 1
##$PHC0= -13355.84
##$PHC1= 11.401
##$PH_mod= 1
##$PKNL= yes
##$PPARMOD= 0
##$PSCAL= 0
##$PSIGN= 0
##$REVERSE= no
##$SF= 200.130013532006
##$SI= 16384
##$SIGF1= 3
##$SIGF2= 2
##$SINO= 400
##$SIOLD= 16384
##$SREGLST= <1H.CDCl3>
##$SSB= 0
##$STSI= 0
##$STSR= 0
##$SW_p= 3612.71676300578
##$SYMM= 0
##$S_DEV= 0
##$TDeff= 0
##$TDoff= 0
##$TI= <>
##$TILT= no
##$TM1= 0
##$TM2= 0
##$TOPLEV= 0
##$USERP1= <user>
##$USERP2= <user>
##$USERP3= <user>
##$USERP4= <user>
##$USERP5= <user>
##$WDW= 1
##$XDIM= 8192
##$YMAX_p= 0
##$YMIN_p= 0
$$ End of Bruker specific parameters
$$ ---------------------------------
##NTUPLES= NMR FID
##VAR_NAME=  TIME,          FID/REAL,        FID/IMAG
##SYMBOL=    X,             R,               I
##VAR_TYPE=  INDEPENDENT,   DEPENDENT,       DEPENDENT
##VAR_FORM=  AFFN,          ASDF,            ASDF
##VAR_DIM=   8192,          8192,            8192
##UNITS=     SECONDS,       ARBITRARY UNITS, ARBITRARY UNITS
##FACTOR=    0.0002496,     1,               1
##FIRST=     0,             0,               0
##LAST=      2.0444736,     0,               0
##MIN=       0,             -336203,         0
##MAX=       2.0444736,     227331,          0
$$ Real data points
##PAGE= N=1
##DATA TABLE= (X++(R..R)), XYDATA
$$ plain form
0 0 0 0 0 0 0 0 0 0 0 0 -5 8 -8 8 -8 16 -16 24 -26 32 -40 48 -56 69 -80 96 -111 128 -144 168 -192 218 -248
33 -248 281 -318 358 -402 452 -503 563 -627 696 -773 856 -947 1047 -1155 1273 -1404 1547
50 1547 -1703 1877 -2068 2281 -2521 2790 -3095 3446 -3853 4332 -4906 5607 -6485 7624 -9172
65 -9172 11397 -14888 21198 -36183 150655 -15691 -258528 147158 199231 -97358 -122227
76 -122227 149276 90057 -82123 -26951 49924 -73577 -75873 46866 35108 -56615 21173
87 21173 86729 -7784 -61839 38722 53914 -46611 -61845 31078 50789 -21772 -83096 -66188
99 -66188 -18325 -16119 -66205 -59260 9398 19275 -23681 -14201 -2817 -35789 -21057 33855 -2025
112 -2025 -53594 11085 43659 -66486 -102336 5696 4560 -97684 -45883 77187 11271 -89398
$$ packed form
0@%%%%%%%%%%nJ3j6J6j6K4l2M0n0N8p2Q8j04J25j49J76k07K39k72L12l60M10m66
33b48N29n99O76p60Q54r55J066j190J323j469J629j803J994k202K428k677K951
50A547l250L580l945M349m802N311n885O541p299Q185r238J0513j2092J4109j6796
65i172K0569k6285L6086n7381J86838j66346k42837M05686N2073k96589k4869
76a22227K71503n9219j72180N5172P6875j23501k296J22739j1758r1723P7788
87B1173O5556r4513n4055J00561J5192j00525j5234R2923J9711p2561o1324J6908
99f6188M7863K206n0086O945O8658R877m2956R480J1384l2972J4732N4912l5880
112b025n1569O4679L2574j10145l5850J08032j136j02244N1801J23070o5916j00669
$$ plain form
124 -89398 -331 71535 -29204 -51521 69354 66194 -39791 485 77382 -17545 -89842 18854
136 18854 60702 -52749 -51892 73504 56246 -58096 -24182 77814 40643 -28914 29962 91795
148 91795 37676 -10249 28254 41679 -13514 -21496 30162 25958 -21083 -3512 41660 11055
160 11055 -36735 4256 58553 21696 -15544 38901 73534 5467 -37300 21403 41174 -30331
172 -30331 -41905 26541 21252 -45225 -32391 15855 -14430 -45943 5913 31711 -16952 -16505 38669
185 38669 17958 -46812 -23506 30971 -9278 -58492 -10059 24392 -38798 -68954 -6767 8562
197 8562 -51634 -44951 27837 22363 -35251 -15335 30477 -952 -37940 -63 24797 -20125 -32601
210 -32601 13031 5231 -49601 -35589 18130 -865 -39819 2112 43671 -725 -27051 26336
$$ packed form
124h9398Q9067P1866j00739k2317J20875l160j05985M0276P6897r4927p2297J08696
136A8854M1848j13451Q57J25396j7258j14342L3914J01996l7171o9557N8876O1833
148I1795n4119m7925L8503J3425n5193p982N1658m204m7041J7571M5172l0605
160A1055m7790M0991N4297l6857l7240N4445L4633o8067m2767N8703J9771p1505
172c0331j1574O8446n289o6477J2834M8246l0285l1513N1856K5798m8663M47N5174
185C8669k0711o4770K3306N4477m0249m9214M8433L4451o3190l0156O2187J5329
197H562o0196O683P2788n474n7614J9916M5812l1429l6988L7877K4860m4922j2476
210c2601M5632p800n4832J4012N3719j8995l8954M1931M1559m4396k6326N3387
$$ plain form
222 26336 42859 -13930 -17930 43042 38829 -21244 -14190 31251 7418 -33726 -2636 30944 -622
235 -622 -16538 29304 39360 -9095 -7089 43844 34646 -11230 9901 51810 16687 -27309 7927
248 7927 35456 -13660 -36385 18118 35860 -17049 -23600 29466 25278 -22474 -3951 39498 13310
261 13310 -19805 15806 34485 -16784 -33447 14907 14072 -38830 -27752 22826 2769 -43679
273 -43679 -13435 26434 -9867 -36477 9266 29706 -15839 -25717 18004 12696 -34278 -22946
285 -22946 15372 -7530 -40565 -11133 14979 -21122 -38949 4630 17682 -23512 -22918 23635
297 23635 18988 -23079 -11310 25427 4565 -28532 -2506 21083 -11981 -28038 7653 15630
309 15630 -21580 -18284 22320 14119 -19372 2045 34299 7626 -17242 15895 33694 -6038
$$ packed form
222B6336J6523n6789m000O0972m213o0073P054M5441k3833m1144L1090L3580l1566
235f22j5916M5842J0056m8455K006N0933r198m5876K1131M1909l5123m3996L5236
248G927K7529m9116k2725N4503J7742n2909o551N3066m188m7752J8523M3449k6188
261A3310l3115L5611J8679n1269j6663M8354q35n2902J1078N0578k0057m6448
273d3679L0244L9869l6301k6610M5743K0440m5545r878M3721n308m6974J1332
285b2946L8318k2902l3035K9432K6112l6101j7827M3579J3052m1194N94M6553
297B3635m647m2067J1769L6737k0862l3097K6026K3589l3064j6057L5691P977
309A5630l7210L296M0604q201l3491K1417L2254k6673k4868L3137J7799l9732
$$ plain form
321 -6038 -17439 22170 22124 -18744 -12580 24258 10282 -21551 1447 29544 1873 -15695 18446
334 18446 29952 -4780 -7480 27630 20613 -16269 -4295 26099 3254 -24159 2469 23240
346 23240 -8458 -23521 10866 18527 -15410 -13004 21892 13812 -17574 -2942 24321 -21 -24756
359 -24756 2265 17934 -14318 -23252 9417 9555 -25199 -18897 15300 2237 -26448 -3775 22628
372 22628 -3037 -23160 5362 17824 -15517 -20613 13287 10124 -23541 -13971 15930 -1776 -28829
385 -28829 -5401 18153 -7654 -20420 10931 18256 -13586 -14824 17249 10912 -18950 -4997 22166
398 22166 2092 -21217 1545 17627 -10942 -20564 12756 17936 -13317 -9428 21829 10988 -18054
411 -18054 -2151 23998 3375 -16443 10071 23018 -8088 -16700 12991 13614 -15964 -8782 21907
$$ packed form
321f038j1401L9609m6m0868O164L6838j3976l1833K2998K8097k7671j7568L4141
334A8446J1506l4732k700L5110p017l6882J1974L0394k2845k7413K6628K0771
346B3240l1698j5063L4387P661l3937K406L4896q080l1386J4632K7263k4342k4735
359b4756K7021J5669l2252q934L2669J38l4754O302L4197j3063k8685K2673K6403
372B2628k5665k0123K8522J2462l3341n096L3900l163l3665R570K9901j7706k7053
385b8829K3428K3554k5807j2766L1351P325l1842j238L2073o337k9862J3953K7163
398B2166k0074k3309K2762J6082k8569r622L3320N180l1253L889L1257j0841k9042
411a8054J5903K6149k0623j9818K6514J2947l1106q612K9691O23k9578P182L0689
$$ plain form
424 21907 8999 -17687 1382 22172 -2324 -18927 10383 22627 -7465 -12583 17430 12646
436 12646 -18534 -9241 17762 3786 -18673 2026 20705 -4676 -18689 7547 14339 -12918
448 -12918 -12199 17391 11618 -17256 -5610 17726 -674 -21491 468 17519 -5796 -15787 9411
461 9411 12056 -15499 -12955 12807 5667 -16899 -2697 18872 -611 -19309 2324 14142 -10422
474 -10422 -15700 12130 13618 -13706 -9699 14887 3123 -19158 -3367 15708 -1784 -14555 6510
487 6510 13972 -11465 -14493 11097 8942 -14848 -5088 18357 4464 -16702 -138 15204 -5633
500 -5633 -15728 8156 14108 -8626 -10009 10248 4883 -15316 -5153 13969 1064 -12864 5328
513 5328 16239 -6258 -14778 8964 11900 -10858 -7335 14887 7141 -14021 -4052 11907 -2565
$$ packed form
424B1907j2908k6686J9069K0790k4496j6603K9310J2244l0092n118L0013m784
436A2646l1180R293K7003j3976k2459K0699J8679k5381j4013K6236O792k7257
448a2918P19K9590n773k8874J1646K3336j8400k0817K1959J7051k3315r991K5198
461I411K645k7555K544K5762p140k2566J4202K1569j9483j8698K1633J1818k4564
474a0422n278K7830J488k7324M007K4586j1764k2281J5791J9075j7492j2771K1065
487F510P462k5437l028K5590k155k3790R760K3445j3893k1166J6564J5342k0837
500e633j0095K3884N952k2734j383K0257n365k0199J0163J9122j2905j3928J8192
513E328J0911k2497q520K3742K936k2758L523K2222p746k1162R969J5959j4472
$$ plain form
526 -2565 -14650 3832 13997 -3729 -8548 10302 9247 -10774 -5269 14799 4862 -12083 3318
539 3318 16432 -3611 -15277 3976 10653 -9108 -9024 11482 8624 -10092 -3237 12538 1895
552 1895 -11293 3913 15619 -1905 -9115 8844 9512 -12163 -10195 10222 4625 -13910 -2211
565 -2211 13563 -797 -14479 2093 11624 -4785 -9182 10163 11569 -8666 -7038 10062 2091
578 2091 -15604 -3594 11559 -4137 -15009 3638 9417 -11103 -12358 8813 8193 -10355 -4048
591 -4048 13721 3504 -13048 -1546 9814 -5204 -13537 3507 8561 -10590 -11076 7007 2595
604 2595 -13802 -4210 12496 3044 -9726 3607 13334 -2533 -9616 5369 8908 -6895 -7271 8444
618 8444 4586 -12269 -5156 10099 -494 -11108 4479 14113 -1871 -6771 11725 11239 -7852
$$ packed form
526b565j2085J8482J0165j7726m819J8850j055k0021N505K0068r937j6945J5401
539C318J3114k0043j1666J9253O677j9761Q4K0506k858j8716O855J5775j0643
552A895j3188J5206J1706j7524p210J7959O68k1675J968K0417n597j8535J1699
565b211J5774j4360j3682J6572R531j6409m397J9345J406k0235J628J7100p971
578B091j7695J2010J5153j5696j0872J8647N779k0520j255K1171o20j8548O307
591d048J7769j0217j6552J1502J1360j5018q333J7044N054j9151m86J8083m412
604B595j6397R592J6706r452j2770J3333R727j5867p083J4985L539j5803l76J5715
618H444l858j6855P113J5255j0593j0614J5587R634j5984m900J8496m86j9091
$$ plain form
631 -7852 -3874 14217 6715 -10706 -1152 12421 -1483 -13306 2550 9797 -6457 -6978 12160
644 12160 9069 -9207 -1155 15570 3585 -9971 4411 13881 -2481 -10001 4719 6851 -9961
657 -9961 -9857 6420 3515 -9970 -3152 9201 981 -9368 2016 9948 -2982 -6419 6393 6763
671 6763 -9106 -8698 5157 914 -13618 -6748 7081 -1574 -13207 -1898 8517 -3465 -9786
684 -9786 5435 8814 -6092 -4043 8730 1438 -11508 -2316 6807 -5480 -12502 2415 5989 -8624
698 -8624 -8256 6280 4407 -8233 -1392 11398 3181 -6787 4110 10526 -3263 -6590 5554 5175
712 5175 -7256 -4048 6541 870 -8177 106 8707 629 -5070 6181 12262 614 -3482 7936
726 7936 9156 -3430 -3549 8140 3686 -8159 -1828 7356 -1824 -8895 2956 8686 -2956 -4571
$$ packed form
631g852L978J8091p502j7421R554J3573j3904j1823J5856P247j6254n21J9138
644A2160l091j8276Q052J6725j1985j3556J4382R470j6362p520J4720K132j6812
657i961J04J6277k905j3485O818J2353q220j0349J1384P932j2930l437J2812L70
671F763j5869M08J3855m243j4532O870J3829q655j1633J1309J0415j1982o321
684i786J5221L379j4906K049J2773p292j2946R192R123j2287p022J4917L574j4613
698h624L68J4536j873j2640O841J2790q217r968J0897O416j3789l327J2144l79
712E175j2431L208J0589n671r047Q283Q601q078n699J1251O081j1648m096J1418
726G936J220j2586j19J1689m454j1845O331R184r180p071J1851N730j1642j615
$$ plain form
740 -4571 9168 8360 -5560 -1345 11017 3285 -8870 151 8823 -3989 -11098 2054 4778 -9047
754 -9047 -7752 5326 2675 -8121 -1314 8244 -273 -6858 3062 7077 -4135 -7086 3381 2770
768 2770 -9054 -7655 2997 -899 -10192 -3843 4986 -1962 -7955 1828 6922 -2644 -5189 5291
782 5291 5385 -5166 -4145 5759 502 -9263 -2936 5314 -3270 -9428 1933 6169 -4379 -4949 7728
797 7728 6426 -4644 69 9855 3120 -5832 2493 8482 -2467 -6719 3999 4825 -5855 -4075
811 -4075 6594 3470 -5543 1079 9724 2412 -3642 5025 9300 -461 -3130 5723 5315 -5095 -3932
826 -3932 5000 1098 -7386 -1924 6091 -421 -6123 2620 7233 -1800 -3565 5585 5437 -4187 -2817
841 -2817 5836 579 -8121 -2142 4066 -4348 -8744 582 3649 -5625 -5611 4550 3361 -5946 -1894
$$ packed form
740d571J3739q08j3920M215J2362p732j2155R021Q672j2812p109J3152K724j3825
754i047J295J3078k651j0796O807R558q517o585R920M015j1212k951J0467o11
768B770j1824J399J0652l896r293O349Q829o948n993R783N094r566k545J0480
782E291R4j0551J021R904n257r765O327Q250q584o158J1361M236j0548n70J2677
797G728j302j1070M713R786o735q952Q325N989j0949m252J0718Q26j0680J780
811d075J0669l124r013O622Q645p312o054Q667M275r761k669Q853m08j0410J163
826c932Q932l902q484N462Q015o512n702Q743M613r033j765R150j48r624J370
841b817Q653n257q700N979O208q414m396R326L067r274J4J0161j189r307M052
$$ plain form
856 -1894 6556 1016 -6318 539 5051 -3734 -7402 1275 1872 -6613 -5477 2841 500 -6466 -1767
871 -1767 5416 -1 -4695 2715 6524 -1473 -3777 3839 3631 -4621 -3486 3907 632 -5987 -1143
886 -1143 4549 -1137 -4751 2475 5765 -1402 -1719 6049 5237 -2426 -413 6539 1741 -4733 685 5185
902 5185 -1966 -5148 2462 3936 -3335 -2817 5524 3595 -3223 742 6698 1725 -3596 2275 5416
917 5416 -2177 -4060 2750 2448 -5036 -4023 3090 505 -5834 -939 5037 -541 -4288 2444 4922
932 4922 -2281 -3148 3437 2915 -4537 -2902 3062 -785 -6453 -1799 2699 -2844 -5663 1341 3558 -3356
948 -3356 -3404 3850 2675 -3861 -998 4670 455 -5164 145 3459 -2904 -5619 1375 2290 -3934 -3069
964 -3069 3877 1924 -3764 44 5312 659 -3342 2246 5337 -1679 -3398 2793 2810 -3705 -2265 3424
$$ packed form
856a894Q450n540p334O857M512q785l668Q677N97q485J136Q318k341o966M699
871a767P183n417m694P410L809p997k304P616k08q252J135P393l275o619M844
886a143N692n686l614P226L290p167l17P768q12p663K013O952m798o474N418M500
902E185p151l182P610J474p271N18Q341j929o818L965N956m973n321N871L141
917E416p593j883O810l02p484J013P113k585o339M895N976n578l747O732K478
932D922p203q67O585n22p452J635N964l847n668M654M498n543k819P004K217o914
948c356m8P254j175o536K863N668m215n619N309L314o363k715O994R15o224Q65
964c069O946j953n688L808N268m653m001N588L091p016j719O191J7o515J440N689
$$ plain form
980 3424 1251 -4240 -15 4778 -184 -3522 2410 4987 -871 -1826 4316 3490 -2960 -1293 4295 630
996 630 -4254 38 3976 -1424 -3787 1760 3261 -2784 -2427 3988 2643 -3118 -783 4439 320 -4055
1012 -4055 549 3280 -2166 -3850 1553 2190 -3805 -3172 2816 1052 -4081 -1044 3661 -14 -3668
1027 -3668 1018 3371 -2250 -3441 1951 1900 -3496 -2289 2699 477 -4102 -762 3115 -1126 -3641
1042 -3641 1569 3476 -1713 -2206 3221 2379 -3175 -906 3501 487 -3488 -154 3065 -1085 -3361
1057 -3361 1699 2894 -1912 -1587 3263 2020 -2505 -320 3667 824 -2669 967 3382 -1412 -2967
1072 -2967 1947 2123 -2410 -1585 3155 1328 -2948 82 3333 -172 -2682 1276 3028 -1414 -2078 2404
1088 2404 1839 -2917 -1608 2683 477 -3143 -161 2886 -759 -2825 1184 2127 -2055 -2207 2076 1510
$$ packed form
980C424k173n491M225M793m962l338N932K577n858r55O142q26o450J667N588l665
996F30m884M292L938n400k363N547J501o045L57O415j345n761K335N222m119m375
1012d055M604K731n446j684N403O37n995O33N988j764n133L037M705l675l654
1027c668M686K353n621j191N392n1n396J207M988k222m579L340L877m241k515
1042c641N210J907n189m93N427q42n554K269M407l014l975L334L219m150k276
1057c361N060J195m806L25M850j243m525K185L987k843l493L636K415m794j555
1072b967M914J76m533Q25M740j827m276L030L251l505k510L958J752m442o64M482
1088B404n65m756J309M291k206l620K982L047l645k066M009R43m182j52M283n66
$$ plain form
1104 1510 -2627 -901 2745 -126 -3208 -32 2360 -1546 -2966 1455 1574 -2352 -1574 2191 984
1119 984 -2689 -342 2769 -225 -2686 708 2376 -1132 -2012 1774 1613 -2063 -1299 2761 674 -2749
1135 -2749 189 2780 -363 -2560 1200 2506 -1533 -1459 2390 1440 -1905 -587 2988 706 -2706 392
1151 392 2744 -728 -2145 1584 2186 -1807 -1667 2309 1043 -2331 -191 2808 -173 -2434 453 2505
1167 2505 -1013 -2194 1195 1563 -1683 -1179 1941 804 -2542 -623 2734 -979 -2888 1020 2166
1182 2166 -1147 -2312 1780 1405 -1678 -1127 2194 407 -2432 -504 1679 -361 -2942 279 1316
1197 1316 -1024 -2271 2231 593 -2304 -1550 2023 -447 -2034 558 1932 -514 -1619 1261 1344 -1191
1213 -1191 -1779 1493 1092 -2306 -943 1976 541 -1863 1092 2974 -424 -1895 2557 1922 -1030 -62
$$ packed form
1104A510m137J726L646k871l082L176K392l906j420M421J19l926P78L765j207
1119I84l673K347L111k994k461L394J668l508q80L786j61l676P64M060k087l423
1135b749K938K591l143k197L760J306m039P4L849r50l345J318L575k282l412L098
1151C92K352l472j417L729O02l993J40L976j266l374K140K999k981k261K887K052
1167B505l518j181L389L68l246N04L120j137l346J919L357l713j909L908J146
1182B166l313j165M092l75l083N51L321j787k839J928K183k040k581L221J037
1197A316k340j247M502j638k897P54L573k470j587K592J374k446j105K880Q3k535
1213a191n88L272m01l398J363K919j435k404K955J882l398j471M452o35k952R68
$$ plain form
1229 -62 1317 1353 -2420 108 2168 -115 -1589 731 1802 -113 -1801 1157 2514 -1833 -605 1703
1245 1703 900 -2003 157 1799 -533 -1332 511 1637 -1445 -1512 1202 539 -1798 -665 1425 893
1261 893 -2049 1108 1683 -1013 -1972 959 1092 -2289 -1632 1393 602 -2497 -1044 1450 -382 -2004
1277 -2004 89 1281 -1059 -1465 1302 1001 -1507 -753 1095 458 -2057 -376 1233 -851 -1727 523
1293 523 995 -863 -1035 1141 784 -1234 -185 1849 697 -1527 334 1643 -328 -1474 878 1260
1309 1260 -1319 -1237 1319 594 -1340 -161 1653 124 -1180 722 1989 -296 -886 1084 1464 -877
1325 -877 -739 1343 368 -1575 -261 1385 -480 -1161 440 1320 -417 -886 1315 1306 -1002 -529 1204
1342 1204 141 -1437 -27 915 -802 -1817 114 882 -1181 -1286 1015 463 -1389 -175 1545 344
$$ packed form
1229f2J379L6l773K528K060k283j474K320J071j915j688K958J357m347J228K308
1245A703q03k903K160J642k332p99J843J126l082o7K714o63k337J133K090n32
1261H93k942L157N75k696r59K931J33l381O57L025p91l099J453K494j832j622
1277b004K093J192k340m06K767l01k508P54J848o37k515J681J609k084q76K250
1293E23M72j858j72K176l57k018J049K034j152k224J861J309j971j146K352L82
1309A260k579Q2K556p25j934J179J814j529j304J902J267k285n90J970L80k341
1325h77J38K082r75j943J314J646j865o81J601Q80j737m69K201rk308M73J733
1342A204j063j578J410R42j717j015J931P68k063j05K301n52j852J214J720j201
$$ plain form
1358 344 -1340 43 998 -482 -1343 429 798 -1252 -1025 803 340 -1183 -321 1323 -61 -1491 561
1375 561 1507 -442 -862 1095 715 -1094 -576 1022 143 -1450 -150 1131 -333 -1347 570 1229 -643
1392 -643 -816 1177 973 -614 -144 1529 269 -799 3 1326 -367 -1570 648 831 -594 -977 696
1409 696 843 -951 -126 1321 710 -797 506 1123 -222 -570 668 913 -802 -883 1061 351 -1263
1426 -1263 -301 1069 4 -945 184 1345 -214 -626 971 851 -737 -783 602 208 -1487 -273 815
1443 815 -336 -1319 331 851 -873 -897 829 783 -997 -260 749 291 -973 -159 757 -403 -1505 53
1461 53 422 -858 -804 534 338 -688 -284 1103 82 -986 251 1118 -111 -747 493 549 -934 -633
1479 -633 697 200 -897 -137 628 -185 -870 549 912 -227 -491 646 671 -432 -157 546 401 -1000
$$ packed form
1358C44j684J383R55j480q61J772L69k050K27J828m63j523Q62J644j384j430K052
1375E61R46j949m20J957l80j809N18J598q79j593J300J281j464j014J917O59j872
1392f43j73J993k04j587M70J673j260j068Q02J323j693j203K218J83j425l83J673
1409F96J47j794Q25J447o11j507J303O17j345l48J238K45j715q1J944p10j614
1426a263R62J370j065r49J129J161j559m12J597j20j588m6J385l94j695J214J088
1443H15j151r83J650N20j724k4J726m6j780P37J009m58j264Q14R16j160j102J558
1461E3L69j280N4J338j96j026M04J387j021j068J237Q67j229o36J240N6j483L01
1479f33J330m97j097P60P65q13o85J419L63j139k64J137K5j103K75P03j45j401
$$ plain form
1497 -1000 -37 939 -174 -1025 262 798 -335 -478 792 811 -218 -39 974 598 -566 154 611 36
1515 36 -919 446 537 -560 -640 620 67 -767 -277 1067 -133 -1074 231 926 -74 -496 298 431 -671
1534 -671 -573 331 -81 -946 -365 596 -106 -882 -52 782 -387 -582 349 279 -806 -582 506 206 -986
1553 -986 -72 659 -306 -836 116 513 -577 -787 437 132 -806 -272 815 139 -502 224 504 -334 -569
1572 -569 348 760 -347 -799 530 49 -522 -229 700 -66 -506 181 673 -63 -707 548 586 -497 -562
1591 -562 604 249 -509 89 783 138 -597 363 727 -36 -575 250 551 -497 104 725 296 -542 8
1610 8 635 -37 -448 348 636 -510 -319 656 354 -288 -39 294 98 -340 -114 335 54 -550 210 612
1630 612 -132 -417 359 470 -453 -328 675 14 -426 -85 592 -299 -673 242 131 -340 -699 198 314 -693
$$ packed form
1497a000R63R76j113q51J287N36j133j43J270J9j029J79J013l76j164P20M57n75
1515C6r55J365R1j097q0J260n53q34M90J344j200r41J305O95j000m22P94J33j102
1534f71R8R04m12q65N81R61p02p76Q30Q34j169j95R31p0j085K24J088l00j192
1553i86R14P31r65n30R52L97j090k10J224l05r38N34J087o76o41P26K80q38k35
1572e69R17M12j107m52J329m81n71K93R29p66m40O87M92p36o44J255L8j083o5
1591e62J166l55p58N98O94o45p35R60L64p63n39Q25L01j048O01O21m29q38N50
1610HO27o72m11P96K88j146J91R75l02o42K49L33j96m38K26M49k81o04P60M02
1630F12p44k85P76J11r23J25J003o61m40L41O77q91l74R15j11m71l59Q97J16j007
$$ plain form
1650 -693 -274 333 17 -566 -194 393 -477 -506 162 245 -412 -458 144 18 -622 -330 286 -30 -647 338 282
1671 282 -240 -539 358 66 -382 -214 355 -282 -415 51 327 62 -148 144 418 -145 -344 591 329 -170
1691 -170 -78 553 74 -301 435 543 -80 -215 93 291 -303 44 397 196 -134 -152 686 83 -551 172 614
1712 614 -327 -304 346 245 -310 -293 95 100 -461 34 454 -350 -367 101 250 -100 -435 290 218 -488 -386 519
1734 519 138 -351 -228 15 193 -334 350 361 -1 -335 150 447 -158 -246 127 -215 -543 -83 79 -388 -521
1755 -521 58 -49 -530 -297 286 401 -483 -121 455 60 -171 -249 415 -235 -145 240 -2 -398 -283 300 186
1776 186 -435 258 286 343 37 273 512 -56 -322 511 355 -302 -143 363 192 -247 -107 270 -39 -243 383
1797 383 415 -29 133 336 565 61 -27 165 105 -352 -72 316 44 -270 0 495 -73 -254 39 250 -308
$$ packed form
1650f93M19O07l16n83L72N87q70k9O68Q3o57m6O02j26o40K92O16l16o17R85n6
1671B82n22k99Q97k92m48J68N69o37j33M66K76k65k10K92K74n63j99R35k62m99
1691a70R2O31m79l75P36J08o23j35L08J98n94L47L53k01l30j8Q38o03o34P23M42
1712F14r41K3O50j01n55J7L88Nn61M95M20q04j7M68J49l50l35P25p2p06J02R05
1734E19l81m89J23K43J78n27O84J1l62l34M85K97o05q8L73l42l28M60J62m67j33
1755e21N79j07m81K33N83J15q84L62N76l95k31p8O64o50R0L85k42l96J15N83j14
1776A86o21O93K8N7l06K36K39n68k66Q33j56o57J59N06j71m39J40L77l09k04O26
1797C83L2m44J62K03K29n04q8J92o0m57K80L88k72l14K70M95n68j81K93K11n58
$$ plain form
1818 -308 -308 157 198 -170 -212 125 -67 -401 -23 57 -469 -227 103 -93 -336 -415 248 184 -273 -110 203 10
1840 10 -236 112 78 -305 -119 246 -197 -394 -71 120 120 -495 -90 157 99 -351 130 129 79 -429 364 132 -458
1863 -458 26 242 -8 -353 217 -46 -219 87 444 152 -22 -168 435 378 -242 205 439 -152 -400 140
1883 140 267 -206 -218 147 -12 75 122 693 185 -42 53 543 262 -370 210 148 -53 -58 82 -49 -409 -52
1905 -52 290 87 -85 143 100 59 -275 368 233 -115 -161 93 57 -291 -289 119 107 -363 -142 152 -164 -236 203
1928 203 105 -314 -342 321 13 -261 35 -74 16 -470 -167 152 -303 -324 -3 3 -281 -164 395 -62 -225 19
1950 19 232 -316 -241 -81 429 128 -652 -70 44 -534 -209 -98 82 -417 158 281 72 -187 288 322 153
1971 153 -77 550 99 -324 -10 -26 -108 -413 4 221 16 -230 309 239 160 -1 162 260 -95 10 273 163
$$ packed form
1818c08%M65M1l68m2L37j92l34L78Q0n26K42L30j96k43p9O63o4m57J63L13j93
1840A0k46L48l4l83J86L65m43j97L23J91%o15M05K47n8m50M81jn0n08P93k32n90
1863d58M84K16k50l45N70k63j73L06L57k92j74j46O03n7o20M47K34n91k48N40
1883A40J27m73j2L65j59Q7M7N71n08k27R5M90k81o32N80o2k01nJ40j31l60L57
1905e2L42k03j72K28m3m1l34O43j35l48m6K54l6l48KM08j2m70K21K94l16p2M39
1928B03r8m19k8O63l08k74K96j09R0m86L03L19m55k1L21Ok84J17N59m57j63K44
1950A9K13n48P5J60N10l01p80N82J14n78L25J11J80m99N75J23k09k59M75L4j69
1971A53k30O27m51m23L14j6q2l05M17K17k05k46N39p0p9j61J63R8l55J05K63j10
$$ plain form
1993 163 -242 -51 94 -190 -235 -157 -43 -342 -226 259 215 -311 -139 229 -4 -371 -159 -1 125 6 343
2014 343 -75 -340 -379 -65 287 -492 108 350 165 -283 87 210 -12 33 63 193 -233 -118 -112 -165 -499 -257
2036 -257 223 -61 -226 -229 269 14 -120 304 407 -174 63 242 94 -259 -89 134 -281 -412 -26 11 -290
2057 -290 -98 501 216 159 -127 160 366 -53 -55 318 -8 -160 21 92 -43 -293 280 91 -99 160 77 83
2079 83 30 169 236 -10 -155 7 132 119 -104 68 -25 -385 -46 52 -162 -158 -89 207 -56 -199 99 99 -192 -154
2103 -154 75 119 -251 -125 111 11 -234 -153 144 -138 -190 111 187 -34 129 101 66 -128 66 95 -60 -74 -48
2126 -48 -42 -132 -402 64 26 -441 -266 104 -66 -250 -49 299 192 -406 133 243 -29 -118 252 -122 -94 -259
2148 -259 19 117 -265 -38 603 166 -283 206 372 -2 -44 297 153 -92 68 172 92 -249 -169 0 10 -9
$$ packed form
1993A63m05J91J45k84m5P8J14k99J16M85m4n26J72L68k33l67K12J58J26j19L37
2014C43m18k65l9L14L52p79O00K42j85m48L70J23k22M5L0J30m26J15On3l34K42
2036b57M80k84j65lM98k55j34M24J03n81K37J79j48l53J70K23m15j31L86L7l01
2057b90J92N99k85n7k86K87K06m19kL73l26j52J81P1j35k50N73j89j90K59q3O
2079H3n3J39O7k46j45J62J25j3k23J72r3l60L39R8k14MO9K96k63j43K98%k91L8
2103a54K29M4l70J26K36j00k45Q1K97k82n2L01P6k21J63k8l5j94J94K9j55j4K6
2126d8Or0k70M66l8m67J75L70j70j84K01L48j07n98N39J10k72q9L70l74K8j65
2148b59K78R8l82K27O41m37m49M89J66l74m2L41j44k45J60J04q0l41Q0J69J0j9
$$ plain form
2170 -9 6 238 -160 -12 541 155 -7 -122 224 62 -169 -89 288 -63 -191 87 191 -278 -91 350 162
2191 162 -271 226 373 -127 -127 45 334 38 -303 78 -212 -387 3 189 -34 -94 57 48 -428 -104 -22 93
2213 93 80 81 367 -153 -157 -42 32 184 -227 -27 431 -643 -396 84 139 -162 -162 142 402 -276 -25 291 -114
2236 -114 -315 12 240 80 -111 438 18 -553 -191 431 83 19 7 292 357 -57 221 530 -93 -404 66
2257 66 411 -387 -289 277 337 -239 57 247 269 -229 335 282 -32 -333 139 147 -172 -285 86 199 -125 -25
2279 -25 201 27 -175 154 2 -91 -86 211 201 -64 -357 295 100 -146 158 19 -117 -429 12 210 -140 -153
2301 -153 173 -107 -181 18 249 239 -145 72 221 -6 -35 246 -145 -140 67 357 20 -457 -210 -19 194 -152
2323 -152 104 241 -271 -180 263 249 21 -182 66 9 -86 12 66 106 -201 336 392 -136 -406 239 253 -226 22
$$ packed form
2170iJ5K32l98J48N53l86j62j15L46j62k31Q0L77l51j28K78J04m69J87M41j88
2191A62m33M97J47n00%J72K89k96l41L81k90j75L90J86k23o0J51rm76L24Q2J15
2213I3j3JK86n20mJ15P4J52m11K00M58j074K47M80N5l01%L04K60o78K51L16m05
2236a14k01L27K28j60j91N49m20n71L62O22l48o4j2K85O5m14K78L09o23l11M70
2257F6L45p98R8N66O0n76K96J90K2m98N64n3l14l01M72Ql19j13L71J13l24J00
2279b5K26j74k02L29j52r3NK97j0k65k93O52j95k46L04j39j36l12M41J98l50j3
2301a53L26k80p4J99K31j0l84K17J49k27k9K81l91NK07K90l37m77K47J91K13l46
2323a52K56J37n12R1M43j4k28k03K48n7r5R8N4M0l07N37N6n28k70O45J4m79K48
$$ plain form
2346 22 82 -50 -185 288 396 -93 -221 93 333 -246 -340 115 43 -342 -106 66 319 -273 265 235 -247 -229
2368 -229 -126 225 25 35 281 17 -141 -146 385 -218 -380 68 144 -239 -62 151 -51 -293 31 70 -27 -111
2390 -111 -44 502 -140 -29 186 4 -167 -240 17 298 -332 51 174 -19 -229 -409 -47 -44 -173 -22 188
2411 188 -106 -278 136 381 -356 123 6 73 -104 55 449 -143 -300 -32 153 -309 -5 361 342 -422 -119
2432 -119 410 -155 -99 169 260 -267 -421 18 153 -219 -9 516 90 -37 -66 262 211 -2 290 369 -269 -234
2454 -234 97 48 -315 -175 328 -1 -336 262 273 -190 -225 121 234 -163 -30 289 369 -145 1 -127 98
2475 98 -278 -24 129 -182 -373 222 138 -147 -219 181 159 -63 129 -54 2 -252 76 39 -354 -298 233 115
2497 115 -134 -33 361 110 -184 106 294 -196 -304 115 161 -94 -292 442 20 -105 -218 334 209 -408
$$ packed form
2346B2O0j32j35M73J08m89j28L14K40n79r4M55p2l85K36J72K53n92N38l0m82J8
2368b29J03L51k00J0K46k64j58nN31o03j62M48P6l83J77K13k02k42L24L9r7q4
2390a11O7N46o42J11K15j82j71p3K57K81o30L83J23j93k10j80L62Lj29J51K10
2411A88k94j72M14K45p37M79j17O7j77J59L94n92j57K68J85m62L04L66j9p64L03
2432a19N29n65N6K68R1n27j54M39J35l72K10N25m26j27k9L28n1k13K92P9o38L5
2454b34L31m9l63J40N03l29l35N98J1m63l5L46J13l97J33L19Q0n14J46j28K25
2475I8l76K54J53l11j91N95q4k85p2M00k2k22J92j83N6k54L28l7l93N6N31j18
2497A15k49J01L94k51k94K90J88m90j08M19M6k55j98P34m22j25j13N52j25o17
$$ plain form
2517 -408 -124 194 219 41 15 160 -353 387 184 672 301 1 -102 -106 -297 277 287 -316 -207 102 347 -88
2539 -88 25 422 352 2 -379 474 -21 -228 5 480 -231 -472 313 184 140 -121 -34 24 -190 89 292 -14
2561 -14 -171 126 461 70 -132 -28 17 -198 -17 462 111 -465 -51 144 -193 -119 412 -36 -36 148 593 311
2583 311 -105 66 148 -202 -478 9 203 -76 -360 337 55 -169 -265 243 192 -140 7 302 142 -99 -214
2604 -214 -104 -512 -53 188 0 -351 -173 281 36 -334 60 337 -36 -24 166 43 55 -96 213 117 -303
2625 -303 -45 103 -58 -141 -47 225 -35 -54 148 337 -226 -321 448 194 -1 -204 260 -121 -449 275 258 -144
2647 -144 -416 -181 -146 -229 22 161 135 -84 60 393 126 -125 132 -29 -115 -313 -12 21 -239 -103 148 -51
2669 -51 -424 -151 377 -16 -139 363 44 112 154 86 35 -228 -42 275 -237 -343 -33 232 -108 -280 -164 294
$$ packed form
2517d08K84L18K5j78k6J45n13P40k03M88l71l00j03mj91N74J0o03J09L09K45m35
2539h8J13L97p0l50l81Q53m95k07K33M75p11k41P85j29m4k61Q7N8k14K79K03l06
2561a4j57K97L35l91k02J04M5k15J81M79l51n76M14J95l37P4N31m48%J84M45k82
2583C11m16J71Q2l50k76M87J94k79k84O97k82k24r6N08n1l32J47K95j60k41j15
2604b14J10m08M59K41j88l51J78M54k45l70L94K77l73J2J90j23J2j51L09r6m20
2625c03K58J48j61q3R4K72k60j9K02J89n63r5P69k54j95k03M64l81l28P24j7m02
2647a44k72K35L5q3K51J39k6k19J44L33k67k51K57j61q6j98L01L3k60J36K51j99
2669e1l73K73N28l93j23N02l19O8M2o8n1k63J86L17n12j06L10K65l40j72J16M58
$$ plain form
2691 294 -197 -52 234 215 -299 101 285 -33 -437 21 -69 -276 -523 -281 -9 -337 -75 177 102 -137 0
2712 0 334 299 -349 85 223 -84 -300 34 -69 -215 -233 256 -106 -290 25 295 309 -231 392 594 -295 197
2734 197 231 173 -21 11 70 -559 162 -178 45 -6 -135 -46 244 -283 -45 90 333 9 117 190 -227 -373
2756 -373 61 163 -83 -238 185 206 -368 54 282 213 -55 -50 -43 176 -50 188 133 -185 -135 171 -171 -352 -109
2779 -109 20 107 -477 33 245 68 -261 143 119 -157 -165 372 -12 -145 20 66 -83 -203 -103 51 -212 -108
2801 -108 302 -79 -69 -55 258 392 -8 105 191 252 -144 15 253 -392 -159 14 -48 -291 -68 12 242 14
2823 14 34 279 -17 -126 277 93 -109 -103 213 58 -480 -228 -50 -70 -291 -52 -35 27 -62 -12 253 -123 12
2846 12 332 202 127 63 54 -57 -125 31 -12 -337 -49 -167 -7 -393 39 267 164 35 146 211 -152 -480 0
$$ packed form
2691B94m91J45K86j9n14M00J84l18m04M58r0k07k47K42K72l28K62K52p5k39J37
2712@L34l5o48M34J38l07k16L34j03j46j8M89l62j84L15K70J4n40O23K02q89M92
2734A97L4n8j94L2N9o29P21l40K23n1j29Q9K90n27K38J35K43l24J08P3m17j46
2756c73M34J02k46j55M23K1n74M22K28o9k68NPK19k26K38n5l18N0L06l42j81K43
2779a09J29Q7n84N10K12j77l29M04k4k76qN37l84j33J65M6j49j20J00J54k63J04
2801a08M10l81J0J4L13J34m00J13Q6O1l96J59K38o45K33J73o2k43K23Q0K30k28
2823A4K0K45k96j09M03j84k02OL16j55n38K52J78k0k21K39J7O2q9N0K65l76J35
2846A2L20j30p5o4rj11o8J56m3l25K88j18J60l86M32K28j03j29J11O5l63l28M80
$$ plain form
2869 0 -59 -176 -163 165 -114 -358 -279 60 -160 -194 -5 3 25 -312 324 132 334 -140 304 -35 -334 -24 -2
2892 -2 89 -279 16 179 -423 -36 -1 272 -136 -38 90 -58 -155 -152 268 346 -239 -77 171 -26 -35 193 237 -309
2916 -309 -284 267 152 -42 134 238 337 -197 154 251 -112 -180 -14 -78 -254 -38 -153 70 -212 -147 1 -53
2938 -53 147 130 379 -153 -94 -136 179 -152 158 282 -87 -265 -119 12 -89 -49 111 -62 -290 96 102 -133
2960 -133 -15 299 34 27 -364 -122 112 -58 -256 374 112 -145 -59 321 -53 135 -72 290 491 87 137
2981 137 79 -13 -157 21 294 20 105 113 32 -161 -20 346 -155 -73 185 330 -24 -52 229 335 -32 -120 120
3004 120 93 -283 176 -118 -123 -206 86 -168 -257 -41 30 -26 -204 3 129 37 -68 -130 62 125 -343 -176 -12
3027 -12 -108 -218 55 148 -333 -147 138 -152 161 -169 -201 -105 195 259 37 -97 -5 -187 -108 16 57 10 -40 -173
$$ packed form
2869@n9j17J3L28k79k44P9L39k20l4J89QK2l37O36j92K02m74M44l39k99L10K2
2892bR1l68K95J63o02L87L5K73m08R8J28j48r7LM20P8n85J62K48j97rK28M4n46
2916c09K5N51j15j94J76J04R9n34L51R7l63o8J66o4j76K16j15K23k82O5J48n4
2938e3K00j7K49n32N9m2L15l31L10J24l69j78J46J31j01M0J60j73k28L86Ok35
2960a33J18L14k65pl91K42K34j70j98O30k62k57Q6L80l74J88k07L62K01m04N0
2981A37n8r2j44J78K73k74Q5Qq1j93J41L66n01Q2K58J45l54k8K81J06l67q8K40
3004A20k7l76M59k94nq3K92k54q9K16P1n6j78K07J26r2j05o2J92O3m68J67J64
3027a2r6j10K73R3m81J86K85k90L13l30l2R6L00O4k22j34R2j82P9J24M1m7n0j33
$$ plain form
3051 -173 66 259 -117 -97 283 78 -32 69 219 79 96 234 62 118 -166 100 15 31 -86 343 182 -81
3073 -81 94 -56 45 44 47 174 -8 8 315 197 -129 333 179 -76 -173 39 205 63 -125 -159 7 -200 63
3096 63 184 -138 -152 -62 75 -34 -322 -165 176 -77 -98 98 143 -87 -112 77 101 -246 93 328 -149 -406
3118 -406 -37 -233 -93 -86 -4 57 -213 63 67 -59 -39 -238 159 193 -50 -4 -157 -12 101 130 -80 -348 131
3141 131 143 -36 56 41 162 -59 -286 67 228 45 -13 -61 -107 -177 -50 142 2 153 -121 290 39 -70
3163 -70 1 -99 -180 40 71 45 -229 242 235 225 -291 73 293 109 -100 65 245 341 318 -38 268 128 135 52
3187 52 -65 -99 -119 -110 -314 -1 40 -21 -63 70 62 -22 -26 150 -156 18 -199 -145 31 126 131 -9 92 -69 103 -189
3213 -189 -129 283 -2 122 -254 42 57 64 -156 -247 -157 -12 -67 178 -124 -11 -154 125 360 -7 6 49 217
$$ packed form
3051a73K39J93l76K0L80k05j10J01J50j40J7J38j72N6k84K66q5J6j17M29j61k63
3073h1J75j50J01jLJ27j82J6L07j18l26M62j54k55r7K12J66j42j88l4J66k07K63
3096F3J21l22j4R0J37j09k88J57L41k53k1J96M5k30k5J89K4l47L39K35m77k57
3118d06L69j96J40PQ2O1k70K76Mj26K0j99L97L4k43M6j53J45J13K9k10k68M79
3141A31J2j79R2j5J21k21k27L53J61j83n8m8m6p0J27J92j40J51k74M11k51j09
3163g0P1j00q1K20L1k6k74M71pj0n16L64K20j84k09J65J80R6k3l56L06j40Pq3
3187E2j17l4k0Rk04L13M1o1m2J33qq4mJ76l06J74k17N4J76R5Nj40J01j61J72k92
3213a89O0M12k85J24l76K96J5Pk20r1R0J45n5K45l02J13j43K79K35l67J3M3J68
$$ plain form
3236 217 -77 -186 242 43 -23 123 92 -22 -52 -90 -49 7 38 -117 111 137 -145 168 -60 38 141 39 -168
3259 -168 57 25 -26 -306 86 71 11 -339 12 179 -82 172 69 189 -176 166 291 14 -67 -143 28 80
3281 80 -269 -5 36 83 -61 -84 317 226 -141 232 47 -227 118 127 -25 -39 -225 -17 -223 -257 -149 120 -42
3304 -42 -38 -35 39 -87 -19 -267 -1 51 183 229 -237 79 72 86 -69 -122 -81 -139 8 25 166 -46 -144 191 180 -142
3330 -142 17 -99 -57 -123 28 -3 -92 -20 92 -43 -52 -95 116 208 -42 -163 329 295 -143 -125 490 101 -232 -49
3354 -49 202 -74 17 152 69 -200 -31 231 46 108 -49 156 41 -34 -115 -30 -167 -62 199 185 113 112 116 -151
3378 -151 106 -53 168 -176 -64 -28 -32 182 167 58 43 -124 -186 79 -124 -184 -232 163 -97 -321 58 83 -385
3401 -385 -99 -177 75 79 105 15 16 -85 -158 -145 -301 -42 141 -24 62 138 -149 -33 87 6 61 -45 -229 -41
$$ packed form
3236B17k94j09M28j99o6J46l1j14l0l8M1N6L1j55K28K6k82L13k28R8J03j02k07
3259a68K25l2n1k80L92j5o0l50L51J67k61K54j03J20l65L42J25k77q1p6J71N2
3281H0l49K64M1M7j44k3M01r1l67L73j85k74L45Rj52j4j86K08k06l4J08K69j62
3304d2MLP4j26O8k48K66N2J32M6m66L16pJ4j55n3M1n8J47J7J41k12r8L35j1l22
3330a42J59j16M2o6J51l1q9P2J12j35rm3K11R2k50j21M92l4m38J8O15l89l33J83
3354d9K51k76R1J35q3k69J69K62j85O2j57K05j15p5q1Q5j37J05K61j4p2jMk67
3378a51K57j59K21l44J12L6mK14j5j09j5j67o2K65k03o0m8L95k60k24L79K5m68
3401c85K86p8K52MK6r0Jj01p3J3j56K59J83j65Q6P6k87J16J20q1N5j06j84J88
$$ plain form
3425 -41 -29 -167 87 87 167 127 -127 255 -15 78 5 156 -83 55 80 231 169 -38 16 29 267 95 315 58
3449 58 177 -184 314 94 -42 -77 -225 184 -116 46 -8 -60 100 43 113 -72 -46 -55 3 -143 133 10 170
3472 170 14 -89 10 -108 -62 320 -144 -8 322 -183 -211 -252 -4 72 -108 -371 -36 219 -43 -73 101 -122
3494 -122 85 64 52 214 -35 118 -96 -176 28 14 -136 88 -45 280 -168 21 202 -19 12 -186 -37 -38
3516 -38 -51 -132 253 175 -170 162 76 -53 132 -10 128 -18 25 187 -123 270 252 56 311 46 87 102 -124
3539 -124 109 104 -67 -84 164 -234 -9 -159 -110 -39 10 230 -29 -223 286 34 226 -62 79 -51 -47 107 170
3562 170 311 -106 -218 -52 49 96 -258 52 -52 -183 202 -71 17 -28 56 -35 -59 115 -18 129 -51 -148
3584 -148 -304 -107 -37 27 -128 219 -25 -80 207 157 6 -29 87 -160 -177 262 -175 -77 -223 85 -79 -74 18
$$ packed form
3425d1J2j38K54%Q0m0k54L82k70R3p3J51k39J38K5J51o2k07N4J3K38j72K20k57
3449E8J19l61M98k20j36l5j48M09l00J62n4n2J60n7P0j85K6rN8j46K76j23J60
3472A70j56j03R9j18M6L82m64J36L30n05k8m1K48P6j80k63L35K55k62l0J74k23
3494a22K07k1j2J62k49J53k14q0K04j4j50K24j33L25m48J89J81k21L1j98J49j
3516c8j3q1L85p8l45L32q6j29J85j42J38j46M3J62l10L93j8j96K55k65M1J5k26
3539a24K33nj71j7K48l98K25j50M9P1M9K20k59j94N09k52J92k88J41j30MJ54O3
3562A70J41m17j12J66J01M7l54L10j04j31L85k73Q8m5Q4r1k4J74j33J47j80r7
3584a48j56J97P0O4j55L47k44n5K87n0j51l5J16k47j7M39m37R8j46L08j64NR2
$$ plain form
3607 18 -31 -20 -14 26 145 -16 83 279 -166 95 -93 -166 203 -46 -220 -40 -38 186 -60 189 125 30 99 194 -96
3632 -96 -16 83 341 177 -70 42 68 -175 338 50 -18 67 315 225 61 128 173 109 14 42 -67 -187 -183 88 15
3657 15 -7 -169 -42 57 -120 -92 76 173 -220 -38 173 -238 -118 69 119 222 62 365 -100 -36 -225 68
3679 68 10 60 218 20 -13 -133 76 -59 -105 -158 187 -211 271 -169 -171 128 45 -99 128 -201 -134 -117 -42 42
3703 42 -9 40 -32 -33 32 127 14 22 -91 -29 164 -220 -73 113 -180 -111 -261 26 48 -9 40 -39 -36 89 138 -24
3729 -24 -141 -163 74 38 -109 -15 60 -15 -92 -36 82 -48 -142 35 105 -149 125 20 -7 -75 -67 -142 -165 13 8 1 126
3756 126 1 293 54 90 165 96 17 -210 91 71 -217 96 -65 -49 -337 -72 100 -108 7 85 -141 -75 89
3779 89 109 -15 -206 14 -81 -218 -69 102 -387 -132 154 302 196 -76 -107 216 28 102 -150 -218 -70 -242
$$ packed form
3607A8m9J1OM0J19j61R9J96m45K61j88p3L69k49j74J80KK24k46K49o4r5O9R5k90
3632i6Q0R9K58j64k47J12K6k43N13k88o8Q5K48r0j64O7M5o4r5K8j09j20MK71p3
3657A5k2j62J27R9j77K8J68R7l93J82K11m11J20J87N0J03j60L03m65O4j89K93
3679F8n8N0J58j98l3j20K09j35m6n3L45l98M82m40kK99q3j44K27l29O7J7P5Q4
3703D2n1M9p2jO5R5j13Qj13O2J93l84J47J86k93O9j50K87K2n7M9p9LJ25M9j62
3729b4j17k2K37l6j47R4P5p5p7N6J18j30r4J77P0k54K74j05k7o8Qp5k3J78npJ25
3756A26j25K92k39L6P5o9p9k27L01k0k88L13j61J6k88K65J72k08J15P8k26O6J64
3779H9K0j24j91K20r5j37J49J71m89K55K86J48j06k72l1L23j88P4k52o8J48j72
$$ plain form
3801 -242 22 -28 70 -39 -126 -110 29 -60 -339 73 109 131 28 77 134 176 178 127 84 10 -92 70 -62 109 343
3826 343 -114 -187 -127 -90 48 -1 -173 -194 -123 -69 108 -241 210 266 -167 -61 -111 -24 -156 -98 86 -28 19 -19
3850 -19 61 37 293 86 203 145 235 78 -201 -210 -182 -267 -298 -22 -75 219 -34 -44 54 96 14 -66 -21 22 128 -210
3876 -210 -15 -32 82 108 158 66 -94 35 6 67 237 21 -48 210 -39 0 -307 28 -133 -220 -21 -38 73
3899 73 -73 -129 133 -132 -188 -73 236 87 269 139 -29 185 140 -200 -18 15 -129 -202 -41 109 -244 117
3921 117 270 -4 -38 27 129 -25 -53 50 -64 187 82 -202 -130 69 101 -404 -177 -59 4 38 -132 -72 45
3944 45 88 -262 -151 36 29 -308 92 340 57 -214 32 375 5 325 10 68 -107 -145 -42 -119 -216 -181 -266
3967 -266 -167 8 175 215 21 196 67 -238 -54 58 138 32 53 158 163 134 -176 7 -13 -214 -106 -226 113
$$ packed form
3801b42K64n0R8j09q7J6J39q9k79M12L6K2j03M9N7M2Kn1m3p4j02J62j32J71K34
3826C43m57p3O0L7J38m9j72k1P1N4J77l49M51N6m33J06n0Q7j32N8J84j14M7l8
3850a9Q0k4K56k07J17n8R0j57k79rK8q5l1K76n3K94k53j0R8M2q2q0M5M3J06l38
3876b10J95j7J14K6N0r2j60J29k9O1J70k16o9K58k49L9l07L35j61q7J99j7J11
3899G3j46n6K62k65n6J15L09j49J82j30j68K14m5l40J82L3j44p3J61J50l53L61
3921A17J53k74l4O5J02j54k8J03j14K51j05k84P2J99L2n05K27J18O3L4j70O0J17
3944D5M3l50J11J87pl37M00K48k83k71K46L43l70L20l15N8j75l8J03p7r7L5q5
3967b66R9J75J67M0j94J75j29l05J84J12Q0j06K1J05Nk9l10J83k0k01J08j20L39
$$ plain form
3990 113 -102 -71 -131 -270 -262 -61 24 9 -67 -33 -171 -176 100 195 26 27 -108 -77 -14 33 -82 46 247 -143 136
4015 136 36 -139 123 143 -254 151 84 77 135 190 -193 -88 -206 127 -229 -14 66 -248 131 103 -314 88 73
4038 73 -252 -185 191 -78 -440 -77 219 -97 114 -300 -116 -103 -180 -210 32 128 -176 -47 16 -72 -324 -77 10
4061 10 -181 -95 109 -87 -82 137 -12 -81 162 -58 208 -123 160 -59 107 -51 -166 -106 223 -36 -261 2
4083 2 239 62 54 -77 42 25 -159 345 79 280 14 159 -84 240 199 65 83 4 -128 -338 -29 154 -91
4106 -91 19 -70 -48 -162 39 -10 211 -11 -225 156 81 -219 -58 348 86 193 -11 18 -70 67 -93 115
4128 115 193 38 62 -30 138 -135 -105 -57 46 148 -64 10 -64 -100 -7 23 24 47 84 203 -109 167 -140 50 16
4153 16 -302 -71 -3 28 94 -98 81 87 -14 10 -66 4 20 16 -87 -47 -165 -121 -1 -72 83 180 -137 -139 -30 82
$$ packed form
3990A13k15L1o0j39QK01Q5j5p6L4j38nK76R5j69Jj35L1O3M7j15J28K01l90K79
4015A36j00j75K62K0l97M05o7pN8N5l83J05j18L33l56K15Q0l14L79k8m17M02j5
4038G3l25O7L76k69l62L63K96l16K11m14J84J3p7l0K42R6l04J29O3q8k52K47Q7
4061A0j91Q6K04j96NK19j49o9K43k20K66l31K83k19J66j58j15O0L29k59k25K63
4083BK37j77qj31J19j7j84N04k66K01k66J45k43L24m1j34J8p9j32k10L09J83k45
4106i1J10q9K2j14K01m9K21k22k14L81p5l00J61M06k62J07k04K9q8J37j60K08
4128A15P8j55K4r2J68k73L0M8J03J02k12P4p4l6R3L0JK3L7J19l12K76l07J90l4
4153A6l18K31O8L1O6j92J79Oj01K4p6P0J6mj03M0j18M4J20p1J55R7l17kJ09J12
$$ plain form
4179 82 -156 35 134 132 -143 197 226 80 51 35 73 -121 -62 -137 10 -64 -345 -110 -76 -144 12 111 262 45 -265
4204 -265 -216 -46 99 0 -60 -60 21 166 -52 163 105 -31 -215 -57 -182 -64 -54 -134 14 -132 -17 -354 69
4227 69 -100 -25 -141 -153 30 45 214 -65 20 125 48 -115 96 240 107 80 -25 114 534 321 -267 -84
4249 -84 -301 22 64 -158 -219 193 96 -72 140 -22 87 42 243 134 189 -154 158 -52 -125 34 -59 -82 -140
4272 -140 170 -160 120 51 174 98 78 -19 9 -182 185 -194 53 -126 -49 301 53 114 -51 -154 -104 -145 70
4295 70 -40 114 114 -80 -178 34 -38 43 128 -71 164 -245 5 -13 80 94 109 289 359 154 17 -110 -93 -31 -137
4320 -137 -83 -129 299 -31 123 -137 -43 275 -220 192 154 124 -183 -58 -25 239 -125 -74 -13 8 19 -51 150 -229
4344 -229 11 -68 130 -241 -110 -72 169 14 -309 74 123 -133 -168 161 52 72 -79 -302 -80 -70 117 -160
$$ packed form
4179H2k38J91R9kk75L40K9j46k9j6L8j94N9p5J47p4k81K35L4o8J56R9J51k17l10
4204b65M9J70J45r9o0%Q1J45k18K15n8j36j84J58j25J18J0q0J48j46J15l37M23
4227F9j69P5j16j2J83J5J69k79Q5J05p7j63K11J44j33k7j05J39M20k13n88J83
4249h4k17L23M2k22o1M12r7j68K12j62J09m5K01j09N5l43L12k10p3J59r3k3n8
4272a40L10l30K80o9J23p6k0r7K8j91L67l79K47j79P7L50k48O1j65j03N0m1K15
4295G0j10J54%j94r8K12p2Q1Q5j99K35m09K50j8R3J4J5J80P0k05j37j27J7O2j06
4320a37N4m6M28l30J54k60R4L18m95M12l8l0l07J25L3K64l64N1O1K1J1p0K01l79
4344b29K40p9J98l71J31L8K41j55l23L83M9k56l5L29j09K0j51k23K22J0J87k77
$$ plain form
4366 -160 -112 -135 191 198 50 174 -23 -92 124 232 55 -49 141 18 -279 122 87 26 -232 121 138 63 -193
4389 -193 -138 190 -4 147 -35 -83 33 -10 81 -52 -210 -118 117 -379 153 -181 -10 57 -128 -6 120 -112
4411 -112 103 -100 176 207 -45 4 100 162 -82 -124 -134 -164 -51 28 -70 -61 141 -217 37 43 43 -58 -83 121 -32
4436 -32 243 139 82 -273 -115 76 72 0 335 -140 126 59 25 184 156 269 38 -151 128 100 -41 183 -107
4459 -107 4 105 147 -13 -36 -384 69 -11 27 221 97 93 59 50 86 121 109 -73 -92 -98 56 21 233 190 142 126
4485 126 44 -123 11 1 -134 -42 -154 -253 24 -191 -326 -46 174 41 -47 136 49 -71 -72 -76 -93 98 59 -95
4509 -95 -84 50 22 -95 -75 -254 -321 224 49 -37 22 35 -131 -107 114 236 -238 66 150 77 181 -91 50 -28
4533 -28 136 125 94 200 33 35 231 67 63 93 177 -16 49 8 149 -129 -357 -437 -68 57 -74 -17 263 -19
$$ packed form
4366a60M8k3L26Pj48J24j97o9K16J08j77j04J90j23k97M01l5o1k58L53J7p5k56
4389a93N5L28j94J51j82m8J16m3R1j33j58R2K35m96N32l34J71O7j85J22J26k32
4411a12K15k03K76L1k52M9R6O2k44m2j0l0J13P9r8RK02l58K54O%j01k5K04j53
4436c2K75j04n7l55J58J91mp2L35m75K66o7l4J59k8J13k31j89K79k8j41K24k90
4459a07J11J01M2j60k3l48M53q0L8J94j24ml4rL6L5j2j82j9oJ54l5K12m3m8j6
4485A26q2j67J34j0j35R2j12r9K77k15j35K80K20j33q8J83q7j20jmj7J91l9j54
4509i5J1J34k8j17K0j79o7N45j75q6N9J3j66K4K21J22m74L04Q4p3J04k72J41p8
4533b8J64j1l1J06j67KJ96j64mL0Q4j93O5m1J41k78k28q0L69J25j31N7K80k82
$$ plain form
4557 -19 129 -15 34 33 314 138 35 -12 124 132 186 87 20 277 -183 -60 -94 -102 138 144 -195 13 1 -50 -3 -8 -7
4584 -7 -95 80 -98 -95 -108 6 -36 88 -16 -64 -8 -127 31 -220 -32 20 -219 81 -78 -95 -1 -59 57 -43
4608 -43 57 89 144 130 -51 207 76 -57 179 -336 119 118 53 73 11 69 -19 -102 166 41 4 -13 116 -58 138
4633 138 3 130 -50 -161 -83 -62 -12 -90 -92 209 103 -226 -152 -197 86 -201 137 278 43 -172 28 -107 70
4656 70 89 -108 210 291 132 251 16 -120 147 -126 1 -40 155 34 -146 -180 -141 22 -220 -20 182 38
4678 38 283 164 -271 -45 -207 33 -48 194 82 -46 -192 -122 18 125 -106 175 -105 -3 -113 -46 -290
4699 -290 69 135 36 -161 -71 461 65 -318 44 151 89 14 20 150 139 -18 -60 -118 2 -4 -56 -215 113 -214
4723 -214 -56 33 -20 192 87 -11 -177 230 23 200 -13 133 -114 -48 83 -63 173 11 90 -106 190 -26
$$ packed form
4557a9J48j44M9jK81j76j03m7J36QN4r9o7K57m60J23l4qK40Ol39K08j2n1M7nJ
4584gq8J75j78Lj3J14m2J24j04m8N6j19J58k51J88N2k39L00j59j7R4n8J16j00
4608d3J00L2N5j4j81K58j31j33K36n15M55jo5K0o2N8q8q3K68j25l7j7J29j74J96
4633A38j35J27j80j11P8K1N0p8kL01j06l29P4m5K83k87L38J41k35k15K00j35J77
4656G0J9j97L18Q1j59J19k35j36K67k73J27m1J95j21j80l4L9J63k42K00K02j44
4678C8K45j19m35K26j62K40q1K42j12j28j46P0J40J07k31K81k80J02j10O7k44
4699b90L59O6r9j97R0N32l96l83L62J07o2p5OJ30j1j57m2n8J20on2j59L28l27
4723b14J58Q9n3K12j05r8j66M07k07J77k13J46k47O6J31j46K36j62P9j96K96k16
$$ plain form
4745 -26 -67 -25 -115 -207 -66 -82 -111 -58 -30 180 105 76 -55 -313 -189 28 31 -252 -106 -126 -32 84 -89 79 -251
4770 -251 -167 -138 -201 9 46 16 14 55 -14 168 -99 -284 55 -12 -73 26 35 34 75 95 -192 126 286 48 7 80 154
4797 154 5 -128 175 -26 -57 18 61 -31 194 -79 -81 -33 79 154 79 -213 -242 69 -84 -252 -113 210 -54
4820 -54 -220 -325 -137 -23 -26 -111 64 -8 5 -18 219 -53 -133 93 -19 -20 -181 335 211 106 219 -69 272
4843 272 169 46 -200 -399 -68 -41 -81 409 -224 6 -75 -208 -46 -300 94 34 -164 -204 251 -10 83 190
4865 190 -239 162 58 144 137 -158 50 -44 -81 -61 -323 32 -53 -65 118 -39 14 -102 -362 -91 -14 157 -83
4888 -83 101 -265 112 35 109 -115 85 -242 163 197 10 -28 -99 -17 -175 -58 90 -254 -58 220 -26 17 -285
4911 -285 107 -201 -15 -309 -359 15 156 8 -13 20 -118 86 73 -58 124 -196 122 -103 54 161 111 -140
$$ packed form
4745b6m1M2r0r2J41j6k9N3K8K10p5k9j31k58J24K17Lk83J46k0R4J16j73J68l30
4770b51Q4K9o3K10L7l0kM1o9J82k67j85L39o7o1R9RjM1K0k87L18J60k38m1P3P4
4797A54j49j33L03k01l1P5M3r2K25k73kM8J12P5p5k92k9L11j53j68J39L23k64
4820e4j66j05J88J14lq5J75p2J3k3K37k72q0K26j12jj61N16j24j05J13k88L41
4843B72j03j23k46j99L31K7m0M90o33K30q1j33J62k54L94o0j98m0M55k61R3J07
4865A90m29M01j04Q6pk95K08r4l7K0k62L55q5j2J83j57N3j16k60K71P7J71k40
4888h3J84l66L77p7P4k24K00l27M05L4j87l8p1Q2j58J17J48l44J96K78k46M3l02
4911b85L92l08J86k94n0L74J41j48k1L3j38K04j3j31J82l20L18k25J57J07n0k51
$$ plain form
4933 -140 -137 -117 -90 126 -71 -179 193 0 191 -129 5 -182 -17 184 -131 112 46 100 54 18 -124 116 -34
4956 -34 -183 -105 -170 -117 85 67 48 -5 74 68 159 -249 -9 233 35 101 81 -5 94 91 -130 106 -57 154 164 204
4982 204 67 -26 111 230 98 -107 -58 80 -45 -34 -85 75 356 -261 211 19 80 66 123 -13 45 147 156
5005 156 0 -5 -20 35 -24 -27 -89 -145 -4 183 -178 85 189 91 -44 -181 89 -88 106 -140 -215 47 185 98
5029 98 3 -84 -40 165 -19 -159 -49 -174 -272 -135 -7 130 -75 -9 -57 -246 -7 14 76 -343 50 94 26 -127
5053 -127 155 129 105 -117 132 -46 39 82 -311 45 37 289 -22 142 -4 177 218 51 16 34 -45 -198 277
5076 277 164 15 179 1 -140 147 4 -2 154 -23 39 52 -18 343 41 205 -215 -241 -5 -219 170 140
5098 140 172 4 -134 80 -27 -260 -166 -135 19 37 -5 -141 277 60 427 399 280 27 -490 217 -309 249
$$ packed form
4933a40LK0K7K16j97j08L72j93J91l20J34j87J65K01l15K43o6N4m6l6j42K40j50
4956c4j49P8o5N3K02j8j9n3P9oR1m08K40K42j98O6k0q6R9lk21K36j63K11J0M0
4982B04j37r3J37J19j32k05M9J38j25J1n1J60K81o17M72j92O1j4N7j36N8J02R
5005A56j56nj5N5n9lo2n6J41J87l61K63J04r8j35j37K70j77J94k46p5K62J38q7
5029I8r5q7M4K05j84j40J10j25r8J37J28J37k05O6m8j89K39K1O2m19L93M4o8j53
5053a27K82k6k4k22K49j78Q5M3l93L56qK52l11J64j46J81M1j67l5J8p9j53M75
5076B77j13j49J64j78j41K87j43oJ56j77O2J3p0L61l02J64m20k6K36k14L89l0
5098A40L2j68j38K14j07k33R4L1J54J8m2j36M18k17L67k8j19k53n17P07n26N58
$$ plain form
5120 249 54 366 -625 -226 -98 -235 165 -161 210 84 89 40 303 10 179 6 151 -129 -115 177 117 19
5142 19 -40 103 125 -229 1 -5 180 388 1 305 -42 318 60 248 64 -83 -130 31 -32 -32 25 -91 270
5165 270 -381 12 68 -320 413 29 10 -266 471 606 117 -103 12 308 105 -407 185 166 -305 76 221
5186 221 -278 -81 155 -513 20 45 30 -261 9 -12 275 224 162 217 149 -92 -327 268 -277 5 123 -135
5208 -135 -136 200 56 49 82 48 113 0 118 -63 -93 2 -33 -153 135 -20 -154 150 -98 21 194 -117 -122 -61
5232 -61 137 -314 173 -31 48 115 -194 -30 258 237 -311 -129 -30 -63 471 -227 162 -17 33 -13 110 283 -238
5255 -238 93 61 -154 104 90 -82 63 371 -34 -502 331 211 217 -24 -602 -25 -92 139 -51 -132 88 14
5277 14 137 -232 -151 -283 86 26 -101 -48 -121 -176 71 54 -34 -125 -312 -202 23 149 -244 -47 -140 -199 -82 -245
$$ packed form
5120B49j95L12r91L99J28j37M00l26L71j26Nm9K63k93J69j73J45k80J4K92o0r8
5142A9n9J43K2l54K30oJ85K08l87L04l47L60k58J88j84j47m7J61o3%N7j16L61
5165B70o51L93N6l88P33l84j9k76P37J35m89k20J15K96k03n12N92j9m71L81J45
5186B21m99J97K36o68N33K5j5k91K70k1K87n1o2N5o8k41k35N95n45K82J18k58
5208a35jL36j44pL3l4O5j13J18j81l0R5l5j20K88j55j34L04k48J19J73l11nO1
5232f1J98m51M87k04P9O7l09J64K88k1n48J82R9l3N34o98L89j79N0m6J23J73n21
5255b38L31l2k15K58j4j72J45L08m05m68Q33j20Ok41n78N77o7K31j90q1K20p4
5277A4J23l69Q1j32L69o0j27N3p3n5K47j7q8r1j87J10K25J26l93J97r3n9J17j63
$$ plain form
5301 -245 212 -52 -70 -22 -32 50 23 165 24 32 -35 88 -111 126 167 150 19 -41 4 90 -6 14 -98 -12 -63 197
5327 197 -113 -132 -1 -254 -173 -16 216 -16 65 64 36 16 134 -100 272 -71 58 41 -99 82 -107 117 120
5350 120 -51 -99 110 -64 349 98 -137 -96 -13 -250 -33 -86 -71 -268 -65 11 80 -47 -90 -114 -203 -72 183
5373 183 -76 69 248 -270 -205 -236 -168 -123 -22 -141 -129 35 29 30 130 -38 -95 -137 -324 44 -50 180 47 -93
5397 -93 105 220 -1 -290 580 513 610 528 313 -88 19 -69 -229 637 34 70 263 195 10 21 -100 -198 -6
5420 -6 -56 113 -16 -174 150 -24 238 -84 -240 153 -40 118 -129 373 -347 -214 205 43 306 -92 -159
5441 -159 184 532 32 125 163 73 35 155 -116 103 -390 -123 -185 155 -23 129 72 30 16 -136 -112 10 -285
5464 -285 117 -336 -251 -202 -390 -219 -467 -136 -15 175 15 -46 66 183 128 17 20 129 -144 29 19 -39 -43
$$ packed form
5301b45M57k64j8M8j0Q2k7J42j41Qo7J23j99K37M1j7j31o0M5Q6r6K0j12Q6n1K60
5327A97l10j9J31k53Q1J57K32k32Q1jk8k0J18k34L72l43J29j7j40J81j89K24L
5350A20j71m8K09j74M13k51k35M1Q3k37K17n3J5j97K03P6O9j27m3k4q9J31K55
5373A83k59J45J79n18O5l1O8M5J01j19J2J64oJJ00j68n7m2j87L68r4K30j33j40
5397i3J98J15k21k89Q70o7R7q2k15m01J07q8j60Q66o03L6J93o8j85J1j21r8J92
5420fn0J69j29j58L24j74K62l22j56L93j93J58k47N02p20J33M19j62K63l98o7
5441a59L43L48n00R3L8r0l8J20k71K19m93K67o2L40j78J52n7m2j4j52K4J22k95
5464b85M02m53Q5M9j88J71k48L31J21J90j60o1J12J17n5j11LJ09k73J73j0n8m
$$ plain form
5487 -43 -182 43 -44 -7 -26 -25 39 -132 -67 -81 -45 -116 -62 -43 -57 -165 -19 75 -24 282 35 13 118 -173 -35 -53
5513 -53 185 10 152 -93 24 -116 16 -177 -92 -32 -113 -182 15 -38 -22 -160 408 -55 -391 84 -754 361
5535 361 -367 -526 243 -583 -251 1064 -295 -314 170 -522 73 80 -59 -109 -124 223 -379 58 74 -29 -25 -102
5557 -102 -175 93 -116 -50 -41 143 -230 -89 -168 0 -95 13 25 -113 -114 -26 -63 4 208 155 53 -124 153 -96
5581 -96 -20 -31 -98 104 203 26 -102 -178 86 62 35 353 26 -209 56 68 -214 -366 -145 163 127 -122 27
5604 27 -104 14 73 149 265 52 105 -89 -339 -84 92 -58 240 -63 -35 -91 65 18 127 180 -111 -138 -6
5627 -6 22 -73 -25 -24 78 43 -147 -157 -187 7 -135 51 -69 334 -168 -113 68 -17 -380 -78 266 25 -252 48
5651 48 44 -271 -126 42 313 81 88 64 79 231 34 2 -129 -70 -160 -269 -53 215 47 -76 263 -6 147
$$ packed form
5487d3j39K25q7L7j9JO4j71O5j4L6p1N4J9j4j08J46R4r9L06k47k2J05k91J38j8
5513e3K38j75J42k45J17j40J32j93Q5O0q1o9J97n3J6j38N68m63l36M75q38J115
5535C61p28j59P69q26L32J315j359j9M84o92N95Pj39n0j5L47o02M37J6j03Mp7
5557a02p3K68k09O6RJ84l73J41p9J68r5J08J2j38jQ8l7O7K04n3j02j77K77k49
5581i6P6j1o7K02R9j77j28p6K64k4k7L18l27k35K65J2k82j52K21L08l6k49J49
5604B7j31J18N9P6J16k13N3j94k50K55J76j50K98l03K8n6J56m7J09N3k91k7J32
5627fK8r5M8JJ02l5j90j0l0J94j42J86j20M03n02N5J81q5l63L02L44k41k77L00
5651D8ml15J45J68K71k32Pk4J5J52j97l2j31N9r0j09K16K68j68j23L39k69J53
$$ plain form
5674 147 128 25 -298 -105 108 -26 76 82 5 59 -181 -153 118 150 6 -141 131 316 -35 -7 -80 393 -40
5697 -40 158 23 129 -12 -214 -222 -29 97 48 -96 83 -77 -11 -56 299 -43 8 129 57 -162 44 -176 42
5720 42 -143 -84 209 -110 65 -174 58 181 197 -281 -3 84 261 42 -48 -84 -192 20 -150 105 110 -63 -34
5743 -34 152 17 41 -356 -185 70 23 -97 -309 -95 -93 -61 -4 -274 -15 -334 26 -72 69 100 222 110 10
5766 10 64 -12 25 -48 -17 214 -174 66 273 -51 89 -28 109 -25 -76 168 118 -178 58 -101 -21 109 -124
5789 -124 -31 -224 -322 -268 149 0 -130 -97 -167 132 29 58 3 -20 -61 -38 169 75 -159 16 -134 136 71 39
5813 39 125 285 119 210 -137 82 28 -8 -73 55 70 68 335 -24 345 130 123 -65 77 -51 106 215 -154 -232
5837 -232 160 -213 -135 151 61 26 -228 -87 -195 105 85 -196 185 66 -33 -54 68 102 -240 -63 72 61 -3
$$ packed form
5674A47j9j03l23J93K13j34J02Op7N4k40K8K71L2j44j47K72J85l51K8p3M73m33
5697d0J98j35J06j41k02qJ93J26m9j44J79j60O6m5L55l42N1J21p2k19K06k20K18
5720D2j85N9K93l19J75k39K32J23J6m78K78Q7J77k19r0l6j08K12j70K55Nj73K9
5743c4J86j35K4l97J71K55m7j20k12K14KL2N7k70K59l19L60r8J41L1J22j12j00
5766A0N4p6L7p3L1K31l88K40K07l24J40j17J37j34n1K44n0k96K36j59Q0J30k33
5789a24R3j93r8N4M17j49j30L3p0K99j03K9n5k3m1K3K07r4k34J75j50K70o5l2
5813C9Q6J60j66R1l47K19n4l6o5J28J5kK67l59L69k15pj88J42j28J57J09l69p8
5837b32L92l73P8K86r0l5k54J41j08L00k0k81L81j19r9k1J22L4l42J77J35j1o4
$$ plain form
5860 -3 198 -55 129 66 -12 185 -73 -37 -1 57 -132 227 104 -10 289 3 -38 -86 63 125 113 -110 -2 401
5884 401 130 -136 7 93 35 20 137 -74 -7 1 -170 44 -122 -19 39 300 -184 81 217 201 126 -81 193
5907 193 -118 41 228 -125 247 36 -221 225 -167 -132 -59 -92 -160 -116 -35 -6 70 43 -47 -34 80 100 181 -58
5931 -58 19 212 366 -5 35 -285 -9 -74 95 -173 -67 -138 -54 -91 23 -448 -67 180 -146 -150 158 -61 116
5954 116 -10 76 213 175 143 -338 152 135 9 150 -132 118 -10 198 -35 -165 -108 -174 -37 -24 173 75 -56
5977 -56 -22 136 -149 -99 -53 -108 -39 -150 56 18 159 -249 -170 84 -214 119 192 215 -46 268 -29 161 -238
6000 -238 322 -108 152 0 99 92 180 -163 226 164 -152 66 -55 -89 -77 -113 67 -80 78 48 -30 -16 -170 118
6024 118 148 -5 -93 107 -185 75 -173 -69 -33 -11 165 260 -89 82 190 50 -32 -219 -39 6 97 -89 175
$$ packed form
5860cK01k53J84o3p8J97k58L6L6N8j89L59j23j14K99k86m1m8J49O2j2k23J08M03
5884D01k71k66J43Q6n8j5J17k11O7Qj71K14j66J03N8K61m84K65J36j6p5k07K74
5907A93l11J59J87l53L72k11k57M46l92L5P3l3o8M4Q1K9P6k7r0J3J14K0Q1k39
5931e8P7J93J54l71M0l20K76o5J69k68J06p1Q4l7J14m71L81K47l26mL08k19J77
5954A16j26Q6J37l8l2m81M90j7j26J41k82K50j28K08k33j30N7o6J37J3J97r8j31
5977e6L4J58k85N0M6n5O9j11K06l8J41m08P9K54k98L33P3K3k61L14k97J90l99
6000b38N60m30K60j52R9pQ8l43L89o2l16K18j21l4J2l6J80j47J58l0p8J4j54K88
6024A18L0j53q8K00k92K60k48J04L6K2J76R5l49J71J08j40q2j87J80M5R1j86K64
$$ plain form
6047 175 -40 59 48 163 99 -22 233 -108 44 244 8 -263 102 131 -44 47 78 4 42 247 68 26 -227
6070 -227 -107 -114 -147 135 -75 145 -245 -91 154 105 126 153 -14 -308 103 105 237 62 17 159 66 36 -182 178
6094 178 -142 -23 51 -76 232 -9 108 75 236 -104 -129 17 -26 176 -118 -228 -113 47 -120 194 -99
6115 -99 -159 127 -93 -106 -64 38 -193 -245 -270 193 36 68 -109 12 -55 186 346 130 -191 230 -127 73 108
6138 108 1 -12 -102 8 -217 -42 -210 -271 -356 -423 -173 -19 -282 -96 182 -46 127 -145 211 249 255 -179 26
6161 26 14 115 -63 6 -172 -65 190 32 -110 -35 32 26 137 91 58 158 7 -76 -164 139 -26 -169 65 -99
6185 -99 -20 -213 -303 666 397 555 -135 -907 -692 184 -156 150 -80 -136 54 -50 -15 80 35 77 83 137 -126 -12
6209 -12 -228 2 116 -37 36 -88 63 -42 157 83 38 -375 62 -28 257 40 196 -126 12 325 -113 -95
$$ packed form
6047A75k15R9j1J15o4j21K55l41J52K00k36k71L65K9j75R1L1p4L8K05j79m2k53
6070b27J20pl3K82k10K20l90J54K45m9K1K7j67k94M11KJ32j75m5J42r3l0k18L60
6094A78l20J19P4j27L08k41J17l3J61l40k5J46m3K02k94j10J15J60j67L14k93
6115i9o0K86k20j3M2J02k31n2k5M63j57L2j77J21o7K41J60k16l21M21l57K00L5
6138A08j07j3r0J10k25J75j68o1q5o7K50J54k63J86K78k28J73k72L56L8Om34K05
6161B6j2J01j78O9j78J07K55j58j42P5O7oJ11m6l3J00j51q3q8L03j65j43K34j64
6185i9P9j93r0R69k69J58o90p72K15Q76l40L06k30n6J90j04L5R5m5M2ON4k63J14
6209a2k16K30J14j53P3j24J51j05J99p4m5m13M37r0K85k17J56l22J38L13m38J8
$$ plain form
6231 -95 79 -116 -96 206 -95 -171 170 189 -202 100 -103 156 -313 267 150 -26 5 69 74 -15 -239 -58 220
6254 220 -1 153 -66 -180 194 -67 23 341 -82 2 -95 167 61 -79 -166 47 -140 18 0 -181 64 -212
6276 -212 -127 -1 76 76 173 -137 17 133 -95 6 116 -4 189 -195 -12 -71 14 -199 125 -27 274 8
6298 8 216 57 -55 -153 -316 -9 55 -211 200 -71 -105 139 -42 66 38 353 230 268 0 285 525 -156
6320 -156 -277 108 -894 294 -386 300 157 -186 -26 -49 -222 247 -89 769 147 210 8 -86 391 120
6340 120 -76 77 4 297 134 -66 125 -109 88 210 81 129 268 -379 -197 -148 -21 124 216 -12 -243
6361 -243 114 -166 -122 21 -17 73 96 130 387 -106 32 153 -230 103 82 743 393 657 -196 248 164 -62
6383 -62 -293 -87 18 130 -144 -120 211 -94 -245 -231 20 -271 -99 -261 -220 61 -349 211 35 140 -63
$$ packed form
6231i5J74j95K0L02l01p6L41J9l91L02k03K59m69N80j17j76L1O4Nq9k24J81K78
6254B20k21J54k19j14L74k61R0L18m23Q4r7K62j06j40q7K13j87J58j8j81K45k76
6276b12Q5J26P7%R7l10J54J16k28J01J10j20J93l84J83n9Q5k13L24j52L01k66
6298HK08j59j12r8j63L07O4k66M11k71l4K44j81J08k8L15j23L8k68K85K40o81
6320a56j21L85j002J188o80O86j43l43J60k3j73M69l36Q58o22O3k02r4M77k71
6340A20j96J53p3K93j63k00J91k34J97J22j29M8J39o47J82M9J27J45R2k28k31
6361b43L57k80M4J43l8R0K3L4K57m93J38J21l83L33k1O61l50K64q53M44q4k26
6383f2k31K06J05J12k74K4L31l05j51J4K51k91J72j62M1K81m10N60j76J05k03
$$ plain form
6404 -63 218 -219 -260 -62 -184 110 -357 393 208 -196 90 -90 -9 0 228 136 161 62 594 -626 -571 -167 -606
6427 -606 117 -164 -7 76 191 -8 228 -162 13 -21 132 -50 176 -135 -133 45 188 130 289 -135 151 -139
6449 -139 -78 62 200 102 41 -76 233 172 53 -31 -157 -47 148 255 -23 22 18 75 74 56 101 -60 120 -170
6473 -170 -131 -48 54 32 -229 -263 -124 41 -32 105 139 -2 -85 69 18 -116 90 96 -101 -109 -146 -72 -193 30 15
6498 15 -15 340 280 -139 -128 63 212 95 -46 -170 78 -115 147 -287 132 99 8 -152 4 64 -279 452
6520 452 -178 -191 1 -61 -177 53 -18 139 -115 -128 292 -177 179 28 102 -1 52 87 5 -40 -18 -30 135 173
6544 173 -20 -91 -134 4 10 -18 20 86 6 51 -134 62 17 17 86 -19 329 61 -50 -102 182 -138 -56 -52 -282 -119
6570 -119 61 91 -85 -7 62 137 24 70 128 -134 339 282 5 270 -35 -54 195 255 193 -92 -93 -152 21 -261
$$ packed form
6404f3K81m37m1J98j22K94m67P50j85m04K86j80Q1RK28r2K5r9N32j220N5M04m39
6427f06P23k81J57Q3J15j99K36l90J75l4J53j82K26l11KJ78J43n8J59m24K86k90
6449a39O1J40J38r8o1j17L09o1j19q4j26J10J95J07k78M5mN7jj8M5j61J80k90
6473a70L9Q3J02k2k61l4J39J65p3J37L4j41q3J54n1j34K06Oj97ql7P4j21K23j5
6498A5l0L55o0m19J1J91J49j17j41j24K48j93K62m34M19l3r1j60J56O0l43P31
6520D52o30j3J92o2j16K30p1J57k54j3M20m69L56j51P4j03N3L5q2m5K2j2J65L8
6544A73j93p1m3J38Ok8L8O6q0M5j85J96m5%O9j05L48k68j11n2K84l20Q2Mk30J63
6570a19J80L0j76P8O9P5j13M6N8k62M73n7k77K65l05j9K49O0o2k85jn9J73k82
$$ plain form
6594 -261 -246 3 -34 140 -192 -216 -141 -84 -151 91 -37 -129 40 -146 233 130 -123 -284 -223 -35 -31 -53 -47 194
6618 194 59 -73 -352 106 -62 96 -274 -55 -76 34 -74 -44 173 5 -199 33 182 -69 129 -230 -30
6639 -30 11 42 161 136 222 66 346 -125 152 -18 -95 57 -116 97 15 67 -194 -172 -27 -32 -52 -425 123 139
6663 139 76 168 -102 106 59 140 -134 4 -61 59 -52 30 63 -280 -94 219 64 -161 97 55 -72 -64 41
6686 41 -91 -146 -24 178 -119 64 183 -66 122 259 -6 113 270 -11 28 82 -98 -285 -54 -1 -299 19
6708 19 173 -256 -231 -19 133 -80 221 147 91 -70 160 68 60 -28 -195 -130 179 273 77 -67 204 70 100 -39
6732 -39 77 -4 -45 -17 109 21 -278 19 65 208 105 81 283 293 -80 54 -3 -95 122 110 83 165 -49 -51 -12
6757 -12 -20 77 -52 -109 -37 191 -102 -10 107 -216 56 -8 175 -10 259 166 -69 30 194 121 -103 38 366 74
$$ packed form
6594b61J5K49l7J74l32k4P5N7o7K42j28r2J69j86L79j03k53j61O1J88Mk2OK41
6618A94j35j32k79M58j68J58l70K19k1J10j08L0K17j68k04K32J49k51J98l59K00
6639c0M1L1J19k5Q6j56K80m71K77j70p7J52j73K13q2N2k61K2J45nk0l73N48J6
6663A39o3R2k70K08m7Q1k74J38o5J20j11Q2L3l43J86L13j55k25K58m2j27QJ05
6686D1j32n5J22K02k97J83J19k49J88J37k65J19J57k81L9N4j80j87K31N3k98L18
6708A9J54m29K5K12J52k13L01p4n6j61K30r2qq8j67O5L09R4j96j44K71j34L0j39
6732c9J16q1m1K8J26q8k99K97M6J43j03k4K02J0l73J34n7r2K17j2k7Q2k14kL9
6757a2qR7j29n7P2K28k93R2J17l23K72o4J83j85K69r3k35R9J64p3k24J41L28k92
$$ plain form
6781 74 188 -70 16 180 67 37 78 -109 22 84 112 -68 -118 8 80 -236 -143 182 110 -104 -116 57 -90 117
6805 117 94 -74 -42 -260 180 10 -111 23 -79 -202 -7 -44 -294 125 -242 160 48 -45 -85 52 -54 -277
6827 -277 87 -117 73 -234 109 -242 -162 -171 -63 -167 -273 193 2 -153 77 33 -4 19 93 36 -23 -227 104
6850 104 -145 -56 -136 173 195 171 -149 -25 -247 -59 169 -35 -205 93 113 -182 93 -157 54 -23 -122 -217 -143
6873 -143 -106 129 149 201 58 210 19 19 -182 149 -219 29 190 -21 90 -15 85 -41 -170 -180 115 30
6895 30 134 -69 235 83 3 80 108 163 48 -93 133 292 253 128 138 -91 126 -43 -205 68 180 5
6917 5 -214 -51 -156 -12 168 57 156 49 -310 -172 -20 -57 15 -27 68 213 2 83 -284 -117 -133 172 -65
6940 -65 -73 118 13 214 198 253 193 -5 -2 222 -193 93 104 -124 203 21 -13 -202 -45 -87 -220 189 -248 -107
$$ packed form
6781G4J14k58Q6J64j13l0M1j87J31O2K8j80n0J26P2l16R3L25p2k14j2J73j47K07
6805A17k3j68L2k18M40j70j21J34j02j23J95l7k50M19l67M02j12r3m0J37j06k23
6827b77L64k04J90l07L43l51Q0rJ08j04j06M66j91j55K30m4l7K3P4n7n9k04L31
6850A04k49Q9q0L09K2k4l20J24k22J88K28k04j70K98K0k95K75k50K11p7r9r5P4
6873a43L7K35K0N2j43J52j91%k01L31l68K48J61k11J11j05J00j26j29j0K95q5
6895C0J04k03L04j52q0P7K8N5j15j41K26J59l9j25J0k29K17j69j62K73J12j75
6917Ek19J63j05J44J80j11R9j07l59J38J52l7P2m2R5J45k11Q1l67J67j6L05k37
6940f5qJ91j05K01j6N5o0j98LK24m15K86J1k28L27j82l4j89J57m2j33M09m37J41
$$ plain form
6964 -107 391 197 37 -20 -50 158 187 -68 31 -70 240 -73 -34 169 114 154 -21 -202 -12 -114 181 -97
6986 -97 298 68 224 -108 -178 -60 -95 -105 110 -131 -95 -199 60 119 64 -53 -289 224 -123 83 -43 -73 89
7009 89 -1 18 80 -107 11 108 336 41 193 127 46 161 -102 77 -148 -53 -105 -104 -3 -69 -237 14 -44 92
7033 92 -98 -75 -101 41 -188 224 16 -22 4 324 118 -25 -98 282 281 3 -251 -177 -109 -133 110 194 -7 -7 -75
7058 -75 81 -44 -234 -93 -48 151 -101 145 -46 -5 -55 168 191 -336 -33 -294 17 -104 -54 -41 -8 -88 19
7081 19 63 -51 127 -187 92 -16 -32 -88 -254 -70 -151 -305 -16 -155 -203 -131 -1 -49 -105 115 3 -19 -71 89
7105 89 99 291 -281 121 55 -81 171 -12 -110 154 -222 -29 -144 166 19 -144 -186 49 128 -12 39 190
7127 190 45 -139 -137 9 27 129 95 -96 -10 113 -58 3 -47 -134 180 83 92 2 90 -72 303 11 108 175 -112
$$ packed form
6964a07M98j94j60n7l0K08K9k55R9j01L10l13L9K03n5M0j75j81J90j02K95k78
6986i7L95k30J56l32p0J18l5j0K15k41L6j04K59N9n5j17k36N13l47K06j26l0J62
7009H9r0J9O2j87J18R7K28k95J52o6q1J15k63J79k25R5n2JJ01o6j68K51n8J36
7033I2j90K3k6J42k29M12k08l8K6L20k06j43p3L80jk78k54P4O8k4K43Q4k01%o8
7058g5J56j25j90J41M5J99k52K46j91M1n0K23K3n27L03k61L11j21N0J3L3q0J07
7081A9M4j14J78l14K79j08j6n6j66J84q1j54K89j39m8P2J30m8n6K20j12k2n2J60
7105H9J0J92n72M02o6j36K52j83r8K64l76J93j15L10j47j63m2K35P9j40N1J51
7127A90j45j84KJ46J8J02l4j91Q6J23j71O1n0q7L14r7Rr0Q8j62L75k92R7O7k87
$$ plain form
7152 -112 215 -42 -210 -209 -263 119 16 85 -361 -116 164 -83 -350 -56 -55 200 -152 66 -58 -276 -251 -117
7174 -117 -43 82 -1 -63 22 189 73 -164 -19 103 -180 101 -80 -85 53 303 141 -103 -108 -12 77 292 117
7197 117 29 -107 225 -95 -197 140 200 27 -46 82 -60 137 -172 -96 -96 70 -42 -437 -50 -40 -164 169
7219 169 18 -214 -292 -24 359 -130 371 -326 45 172 201 -297 15 -184 -267 208 96 -135 -207 64 -317
7240 -317 -638 -299 -233 -506 -540 169 649 -38 176 266 39 -396 247 -740 474 -276 -126 530 -51 -70 47
7261 47 640 -108 -117 731 207 -378 111 350 74 596 25 102 286 280 -220 -203 129 727 -448 291 163 413
7283 413 -14 -202 211 147 -482 359 42 -268 331 -428 242 128 -567 -703 167 3 332 -613 -254 230
7303 230 224 -39 231 636 57 -181 -302 280 719 215 162 189 -379 -215 54 -669 -487 -236 -310 -434 626
$$ packed form
7152a12L27k57j68Jn4L82j03O9m46K45K80k47k67K94JK55l52K18j24k18K5J34
7174a17P4J25q3o2Q5J67j16k37J45J22k83K81j81nJ38K50j62k44nR6Q9K15j75
7197A17q8j36L32l20j02L37O0j73p3J28j42J97l09P6%J66j12l95L87J0j24L33
7219A69j51k32p8K68L83m89N01o97L71J27K9m98L12j99q3M75j12k31p2K71l81
7240c17l21L39O6k73l4P09M80o87K14R0k27m35O43r87J214p50J50O56n81j9J17
7261D7N93p48rQ48n24n85M89K39k76N22n71P7J84on00J7L32N98j175P39j28K50
7283D13m27j88M13o4o29Q41l17l10N99p59O70j14o95j36Q70j64L29r45L59M84
7303B30ok63K70M05n79k38j21N82M39n04n3K7n68J64K69p23J82K51p4j24J060
$$ plain form
7324 626 33 97 158 -274 -140 84 113 -137 -10 5 238 -226 -358 232 -123 131 -83 -138 -341 103 -57 -71
7346 -71 112 52 -5 -95 30 -114 -141 -84 154 85 425 268 -25 -196 82 -129 -71 35 64 -164 -231 123 4
7369 4 -142 18 -17 -8 -36 -95 135 85 -120 -13 142 204 -164 -112 120 91 -6 199 160 -126 26 -100 -47 40 10
7394 10 -57 -146 43 -2 228 18 -159 162 191 289 88 63 -107 1 99 -226 -124 14 -19 187 22 -32 55 44
7418 44 -33 -80 360 -110 77 12 8 44 -275 37 -198 -110 -251 31 -37 99 152 -16 -116 -62 -5 -295 70 135
7442 135 -18 64 -3 -113 -186 -83 29 62 -23 -19 -140 -54 53 -256 -225 -64 74 -10 60 157 -135 66 176 -20
7466 -20 -19 373 -166 -59 -3 -174 -92 -128 -28 218 -65 -14 96 -100 72 -51 -44 -73 40 31 136 126 146 204 -134
7491 -134 17 -231 24 188 40 210 -159 -130 -106 -109 -52 -19 -200 6 31 -98 -136 281 295 -203 -254 139 -34
$$ packed form
7324F26n93O4O1m32J34K24K9k50J27J5K33m64j32N90l55K54k14n5k03M44j60j4
7346g1J83o0n7r0J25j44k7N7K38o9L40j57k93j71K78k11N8J06K9k28o7L54j19
7369Dj46J60l5Rk8n9K30n0k05J07J55O2l68N2K32k9r7K05l9k86J52j26N3Q7l0
7394A0o7q9J89m5K30k10j77L21K9R8k01k5j70J08R8l25J02J38l3K06j65n4Q7j1
7418D4p7m7M40m70J87o5mL6l19L12k35Q8j41K82o8J36N3j68j00N4N7k90L65O5
7442A35j53Q2o7j10p3J03J12L3q5Mj21Q6J07l09L1J61J38q4P0R7k92K01J10j96
7466b0JL92n39J07N6j71Q2l6J00K46k83N1J10j96J72j23Pk9J13rJ05j0K0N8l38
7491a34J51k48K55J64j48J70l69K9K4lN7L3j81K06K5j29l8M17J4m98n1L93j73
$$ plain form
7514 -34 218 178 -8 63 -292 72 9 19 -312 -171 -248 181 118 -122 159 -137 146 -254 -55 -249 78 50 19
7537 19 227 -126 -25 -172 10 -95 -159 -223 114 189 53 -244 -1 -222 184 90 -182 1 -67 436 454 -96
7559 -96 384 90 32 -552 -451 808 391 683 193 -366 805 -107 244 579 223 -244 -93 122 68 -393
7579 -393 -40 175 -104 367 4 -29 -78 150 33 36 -154 -4 193 -162 -75 -145 60 -2 -198 -170 -34 -56 -81
7602 -81 78 -20 73 46 249 -5 13 31 22 85 106 -114 -292 21 2 -249 12 -180 -354 -91 232 59 -71 -101
7626 -101 19 -118 -63 86 -27 -82 -69 172 -33 -321 120 -86 48 -259 -45 106 -50 250 -65 40 63
7647 63 47 90 -75 88 34 37 -61 194 -16 84 -12 -70 98 -50 76 -15 -46 -17 -139 100 94 -22 142 63 94
7672 94 -238 75 -70 7 67 109 -132 85 -241 -29 55 -48 197 60 -46 -243 89 23 -37 13 15 98 -259 -122
$$ packed form
7514c4K52m0j86P1l55L64o3J0l31J41p7M29o3k40K81k96K83m00J99j94L27k8l1
7537A9K08l53J01j47J82j05o4o4L37P5j36k97K43k21M06r4k72J83o8N03J8n50
7559i6M80k94n8n84J01J259m17K92m90n59J171r12L51L35l56m67J51K15n4m61
7579c93L53K15k79M71l63l3m9K28j17Lj90J50J97l55Q7p0K05o2j96K8J36k2k5
7602h1J59r8R3k7K03k54J8J8rO3K1k20j78L13j9k51K61j92j74K63L23j73j30l0
7626a01J20j37N5J49j13n5J3K41k05k88M41k06J34l07K14J51j56L00l15J05K3
7647F3j6M3j65J63n4Lr8K55k10J00r6n8J68j48J26r1l1K9j22K39oj16J64p9L1
7672I4l32L13j45P7O0M2k41K17l26K12Q4j03K45j37j06j97L32o6o0N0KQ3l57J37
$$ plain form
7696 -122 75 -53 29 -205 79 117 199 -129 -102 66 34 91 70 -1 -38 140 265 -135 74 -44 125 215 -43
7719 -43 105 74 -5 151 4 135 -6 19 291 125 478 13 -30 84 -220 217 -163 221 52 -111 -63 -65 483
7742 483 39 -116 -195 -222 210 -26 22 -355 -31 -60 -70 -187 -160 0 -81 33 233 143 160 22 -67 -201 63
7765 63 -8 163 -160 -23 -4 -32 -4 77 -25 -141 50 -8 -84 204 -302 -99 -93 -229 -73 -41 8 -14 131 58 180
7790 180 -181 79 24 21 -172 -281 -211 190 17 138 -6 -231 -404 44 -4 -52 -87 -33 -22 19 93 -114 -4 109
7814 109 20 246 -244 255 -32 132 -3 -131 -231 -2 102 -49 117 -221 280 -377 -201 -190 -77 2 -64
7835 -64 665 467 587 -133 232 7 378 -310 -106 248 56 -138 -97 -73 -260 265 140 -116 17 37 80 64
7857 64 227 -17 190 -72 -37 96 37 112 -33 67 -127 132 32 126 32 -10 72 -8 -32 -32 -312 -190 126 -258
$$ packed form
7696a22J97j28Q2k34K84L8Q2l28K7J68l2N7k1p1l7J78J25m00K09j18J69R0k58
7719d3J48l1p9J56j47J31j41K5K72j66L53m65m3J14l04M37l80L84j69j63M8kN48
7742D83m44j55p9k7M32k36M8l77L24k9j0j17K7J60q1J14K00r0J7j38q9j34K64
7765F3p1J71l23J37J9k8K8Q1j02j16J91n8p6K88n06K03Oj36J56L2M9k2J45p3J22
7790A80l61K60n5lj93j09P0M01j73J21j44k25j73M48m8m8l5N4J1M1P4k07J10J13
7814A09q9K26m90M99k87J64j35j28j00K29J04j51J66l38N01o57J76J1J13P9o6
7835f4P29j98J20p20L65k25L71o88K04L54j92j94M1K4j87N25j25k56J33K0M3j6
7857F4J63k44K07k62L5J33n9P5j45J00j94K59j00R4r4m2Q2q0k4%k80J22L16l84
$$ plain form
7881 -258 -164 18 -211 79 -180 28 -145 52 7 69 420 545 221 -125 -970 -4 96 394 -212 -279 297
7902 297 63 124 217 -278 153 -13 -55 85 -37 66 580 -14 -442 356 50 83 -352 474 387 282 178 558
7924 558 -56 -119 -108 -160 18 -86 52 321 290 587 61 -145 -118 -74 239 288 231 486 286 -218 -122 -138 112
7947 112 89 -274 284 175 79 105 -108 180 -276 1 4 -398 112 -190 -267 25 -112 -205 22 194 80 -98
7969 -98 -177 109 234 -11 -71 -75 153 174 139 -176 103 42 51 -190 -207 77 -82 302 -212 -77 116 -100 -100 -137 198
7994 198 -222 55 -100 410 23 -309 92 41 352 89 736 535 636 699 -462 532 -145 196 204 302 -177
8015 -177 210 5 -222 303 -444 168 443 -210 -384 -282 -154 -294 323 -180 -57 -47 363 -323 675 563
8035 563 167 199 -77 -132 -111 484 181 -373 -132 -184 135 1221 72 186 585 -371 694 -197 6 290
$$ packed form
7881b58R4J82k29K90k59K08j73J97m5O2L51J25l24l46q45R66J00K98o06o7N76
7902B97k34O1R3m95M31j66m2J40j22J03N14n94m28P98l06L3m35Q26q7j05j04L80
7924E58o14o3J1n2J78j04J38K69l1K97n26k06K7M4L13M9n7K55k00n04R6j6K50
7947A12k3l63N58j09r6K6k13K88m56K77Lm02N10l02p7K92j37r3K27J72j14j78
7969i8p9K86J25k45o0mK28K1l5l15K79o1Rk41j7K84j59L84n14J35J93k16%l7L35
7994A98m20K77j55N10l87l32M01n1L11k63O47k01J01O3j161R94o77L41QR8m79
8015a77L87k05k27N25p47O12K75o53j74J02J28j40O17n03J23J0M10o86R98j12
8035E63l96L2k76n5K1N95l03n54K41n2L19J086j149J14L99r56J065q91K03K84
$$ plain form
8055 290 -12 -407 -57 -176 771 -129 -378 -186 47 -348 500 26 -240 542 509 -150 -330 101 -200 228
8075 228 -69 -62 -11 235 0 47 27 40 32 19 15 87 20 -172 104 85 16 162 6 -23 79 -96 140 -339 99
8100 99 -353 168 -13 51 -79 -104 107 109 287 -38 -36 114 -80 -60 -86 79 97 -21 230 11 -77 376 156 -54
8124 -54 -77 -135 55 -6 34 6 -176 276 -270 35 74 121 -314 91 508 -665 241 83 32 23 203 211 59 100
8148 100 -100 106 -88 111 -13 87 72 -153 320 65 1 8 -3 34 13 -36 -56 59 112 182 114 86 195 45
8172 45 -89 -89 -42 -497 139 -256 1025 -224 -57 -403 274 0 -148 -34 517 -75 -108 -67 -298
$$ packed form
8055B90l02l95L50j19R47r00k49J92K33l95Q48m74k66P82l3o59j80M31l01M28
8075B28k97PN1K46k35M7k0J3qj3mP2o7j92K76j9o9J46j56k9J02j75K36m79M38
8100I9m52N21j81O4j30k5K11KJ78l25KJ50j94K0k6J65J8j18K51k19q8M53k20k10
8124e4k3n8J90o1M0k8j82M52n46L05L9M7m35M05M17j173R06j58n1rJ80Qj52M1
8148A00k00K06j94J99j24J00j5k25M73k55o4Pj1L7k1m9k0J15N3P0o8k8J09j50
8172D5j34%M7m55O36l95J281j249J67l46O77k74j48J14N51n92l3M1k31
8191b98
$$ Imaginary data points
##PAGE= N=2
##DATA TABLE= (X++(I..I)), XYDATA
$$ plain form
0 0 0 0 0 0 0 0 0 0 0 0 0 0 0 -8 8 -8 8 -10 16 -16 24 -24 32 -32 40 -48 56 -64 72 -84 96 -108 124 -140 156
35 156 -175 196 -220 246 -274 304 -338 372 -412 458 -505 556 -612 675 -744 817 -902 994
53 994 -1099 1216 -1348 1498 -1676 1880 -2127 2426 -2798 3277 -3920 4822 -6187 8474 -13011
68 -13011 25326 -126267 -336203 104732 227331 -111668 -165272 136176 118040 -96533 -56280
79 -56280 49728 -66061 -106266 21516 24823 -87805 -48893 17842 -69210 -119692 474
90 474 49262 -41666 -52549 46438 63636 -16960 -60086 -19975 25343 10816 -44541 -44256 16210
103 16210 17971 -45275 -49757 -17337 -27228 -9874 50930 35411 -16003 35449 78354 -10565 -46997
116 -46997 61708 75580 -37563 -16255 90882 25907 -91605 -15533 73567 -15485 -52807
$$ packed form
0@%%%%%%%%%%%%%qJ6j6J6j8K6l2M0m8N6o4P2q8J04j20J36j56J80k04K32k64K96
35A56l31L71m16M66n20N78o42P10p84Q70r63J061j168J287j419J561j719J896
53I94k093K315k564K846l174L556m007M553n224O075p197Q742j1009J4661k1485
68a3011L8337j51593k09936M40935J22599l38999n3604L01448j8136k14573M0253
79e6280J06008j15789m0205J27782L307j12628L8912O6735q7052n0482J20166
90D74M8788r0928j0883R8987J7198q0596m3126M0111M5318j4527n5357K85O0466
103A6210J761o3246m482L2420r891J7354O0804j5519n1414N1452M2905q8919l6432
116d6997J08705J3872j13143K1308J07137o4975j17512P6072Q9100q9052l7322
$$ plain form
127 -52807 70079 88165 -21692 1702 93982 25588 -49515 53483 107687 -11419 -40671
138 -40671 70185 51559 -76031 -52878 56249 22797 -58404 -3552 67618 15024 -37182
149 -37182 10636 42891 -2106 -12767 38805 34691 -23139 -21688 15069 -16446 -67336 -32943
161 -32943 19790 -16521 -59104 -9717 30062 -27125 -61361 6659 42044 -21305 -37646 30309
173 30309 27847 -47473 -45834 6626 -18326 -60226 -18332 12248 -36263 -46268 10524 4651 -49675
186 -49675 -20892 45054 17311 -33297 10912 49952 -10956 -48171 10734 30346 -32670 -38149
198 -38149 28711 23131 -41377 -25122 31642 11939 -23106 18062 53794 14640 -4302 39762
210 39762 38656 -16100 -8421 43078 23458 -25935 1932 40616 -3648 -36450 15821 41466
$$ packed form
127e2807J22886J8086j09857K3394R2280o8394p5103J02998N4204j19106k9252
138d0671J10856j8626j27590K3153J09127l3452q1201N4852P1170n2594n2206
149c7182M7818L2255m4997j0661N1572m114n7830J451L6757l1515n0890L4393
161c2943N2733l6311m2583M9387L9779n7187l4236O8020L5385o3349j6341O7955
173C0309k462p5320J639N2460k4952m1900M1894L0580m8511j0005N6792n873n4326
186d9675K8783O5946k7743n0608M4209L9040o0908l7215N8905J9612o3016n479
198c8149O6860n580o4508J6255N6764j9703l5045M1168L5732l9154j8942M4064
210C9762j106n4756P679N1499j9620m9393K7867L8684m4264l2802N2271K5645
$$ plain form
222 41466 -9332 -14528 48173 50423 -10150 -5887 44966 26115 -20259 3629 36844 1315 -27634
235 -27634 7591 18224 -29852 -32728 20250 18215 -26300 -8319 37694 10862 -32548 1881
247 1881 36077 -8265 -36288 11764 27899 -30002 -46328 4350 4891 -44999 -31592 17232 -1943
260 -1943 -37027 -3506 24655 -17324 -34335 16933 24066 -28011 -24736 24386 5390 -46451 -22780
273 -22780 19413 -13306 -44931 -1314 25094 -18220 -30215 17505 23009 -20412 -10668 33340
285 33340 16155 -21567 2840 29652 -6003 -29385 9213 23981 -18384 -23124 22762 22059 -19757
298 -19757 -8876 33394 19603 -14264 10461 38866 8285 -13332 18623 28180 -10697 -15009
310 -15009 22457 15773 -21877 -6668 27024 4635 -21579 10154 33019 -2033 -16020 24088
$$ packed form
222D1466n0798n196O2701K250o0573M263N0853j8851m6374K3888L3215l5529k8949
235b7634L5225J0633m8076k876N2978k035m4515J7981M6013k6832m3410L4429
247A881L4196m4342k8023M8052J6135n7901j6326N0678N41m9890J3407M8824j9175
260a943l5084L3521K8161m1979j7011N1268P133n2077L275M9122j8996n1841K3671
273b2780M2193l2719l1625M3617K6408m3314j1995M7720N504m3421R744M4008
285C3340j7185l7722K4407K6812l5655k3382L8598J4768m2365m740M5886p03m1816
298a9757J0881M2270j3791l3867K4725K8405l0581k1617L1955R557l8877m312
310a5009L7466o684l7650J5209L3692k2389k6214L1733K2865l5052j3987M0108
$$ plain form
322 24088 28742 -12851 -11622 25274 12839 -24076 -7902 20532 -6153 -29022 2340 17669
334 17669 -15823 -21528 15041 14346 -20773 -10554 23387 5566 -24434 -1451 21484 -9790 -29819
347 -29819 1636 12169 -22744 -25328 10104 5916 -26226 -13799 17550 -778 -25288 1561
359 1561 22166 -7489 -20617 11145 14462 -20731 -18836 15034 4863 -26918 -8008 20340 -3155
372 -3155 -25736 3060 20696 -8359 -16022 19333 20258 -13944 -7891 22804 8058 -21441 -1337
385 -1337 23950 -1499 -19690 8929 19490 -12291 -15553 17783 16744 -13556 -2479 26795 9385
398 9385 -16648 4155 22991 -3118 -16543 13701 20473 -12960 -14021 17110 9735 -20104 -5725
411 -5725 23069 5351 -17138 6421 22695 -6915 -18342 11904 16567 -13437 -11001 18472 7673
$$ packed form
322B4088M654m1593J229L6896j2435l6915J6174K8434k6685k2869L1362J5329
334A7669l3492n705L6569o95l5119J0219L3941j7821l0000K2983K2935l1274k0029
347b9819L1455J0533l4913k584L5432m188l2142J2427L1349j8328k4510K6849
359A561K0605k9655j3128L1762L317l5193J895L3870j0171l1781J8910K8348k3495
372c155k2581K8796J7636k9055p663L5355R25l4202O053L0695j4746k9499K0104
385a337K5287k5449j8191K8619J0561l1781l262L3336j039l0300J1077K9274j7410
398I385k6033K0803J8836k6109j3425L0244O772l3433j061L1131p375k9839J4379
411e725K8794j7718k2489K3559J6274k9610j1427L0246M663l0004K436K9473j0799
$$ plain form
424 7673 -22027 -6759 17251 -4404 -22074 5465 20687 -9207 -18030 12244 12328 -18540 -11454
437 -11454 17873 6023 -19025 -1949 18068 -6197 -22896 3282 14076 -12424 -14873 14091
449 14091 10863 -18644 -10269 16392 1567 -20378 346 19627 -3360 -17151 6261 12509 -14264
462 -14264 -13886 13296 8929 -15233 -4211 17649 430 -19680 701 16262 -6107 -14463 12230
475 12230 15578 -12649 -11927 14112 6572 -16741 -2561 18668 1994 -14223 5166 14578 -9292
488 -9292 -14716 11307 12364 -12343 -6430 16991 5017 -17596 -2377 16582 -1705 -14062 8834
501 8834 16931 -7006 -11199 9687 7585 -13253 -4688 15024 2997 -13561 2213 14207 -6322
514 -6322 -15932 8226 14871 -7838 -7564 15051 9114 -13294 -4490 13406 1242 -13154 3136
$$ packed form
424G673k9700J5268K4010k1655j7670K7539J5222k9894q823L0274Q4l0868P086
437a1454K9327j1850k5048J7076K0017k4265j6699K6178J0794k6500k449K8964
449A4091l228k9507Q375K6661j4825k1945K0724J9281k2987j3791K3412O248k6773
462a4264L78K7182m367k4162J1022K1860j7219k0110K0381J5561k2369q356K6693
475A2230L348k8227P22K6039p540k3313J4180K1229j6674j6217J9389R412k3870
488i292n424K6023J057k4707N913K3421j1974k2613J5219J8959j8287j2357K2896
501H834Q097k3937m193K0886k102k0838Q565J9712j2027j6558J5774J1994k0529
514f322r610K4158O645k2709K74K2615n937k2408Q804J7896j2164j4396J6290
$$ plain form
527 3136 14023 -4591 -12459 5277 7173 -11353 -7354 13447 6466 -11786 1185 15735 -2158
540 -2158 -14865 4609 13865 -6092 -10213 9386 7331 -13205 -8982 8660 44 -13450 370
553 370 13448 -2421 -11977 6074 9970 -9693 -9112 11983 7708 -12912 -4529 11319 -1947 -16815
567 -16815 -2538 10320 -6016 -12547 6764 10147 -9877 -9080 10328 5820 -11269 -1143 15269
580 15269 403 -13985 2226 9885 -10142 -13824 7281 7849 -11406 -6939 11912 3771 -12366
593 -12366 -489 14175 1640 -8170 7705 13662 -5648 -9111 8618 6003 -12011 -4890 11959
606 11959 2498 -11797 342 11783 -1813 -9019 7458 13368 -1366 -3619 11846 8989 -8681
619 -8681 -3716 11200 1625 -11490 1025 11203 -4865 -11916 5872 8989 -8697 -5762 14006
$$ packed form
527C136J0887j8614p868J7736J896j8526L999K0801o981j8252J2971J4550j7893
540b158j2707J9474R256j9957m121J9599k055k0536M223J7642q616j3494J3820
553C70J3078j5869r556J8051L896j9663N81K1095m275k0620Q383J5848j3266j4868
567a6815J4277J2858j6336o531J9311L383k0024P97J9408m508j7089J0126J6412
580A5269j4866j4388J6211P659k0027l682K1105N68j9255M467J8851q141j6137
593a2366J1877J4664j2535r810J5875N957j9310l463J7729k615j8014P121J6849
606A1959r461j4295J2139J1441j3596p206J6477N910j4734k253J5465k857j7670
619h681M965J4916r575j3115J2515J0178j6068p051J7788L117j7686K935J9768
$$ plain form
632 14006 8965 -9329 -1126 14036 1416 -12378 1640 10264 -6730 -11243 5844 4099 -14600
645 -14600 -8666 9757 616 -13680 918 13324 -1888 -10434 5057 9053 -7264 -8806 6649
658 6649 4069 -11677 -7301 5397 -2637 -13826 -3441 6890 -4458 -9136 5675 8275 -6547
671 -6547 -5700 8868 5744 -9222 -3636 9353 1824 -12246 -3134 8083 -3918 -11539 2349 8488
685 8488 -5114 -4709 9585 5744 -6489 1899 13371 1718 -7280 6496 10435 -5975 -8178 6082
699 6082 4994 -8457 -4013 10326 2940 -8056 1984 11680 511 -3673 8541 10047 -2372
712 -2372 -1248 9062 3130 -7930 -1524 6542 -1819 -9329 777 7298 -3577 -7820 4853 7982
726 7982 -3626 -3809 8495 6176 -6384 -2181 7366 -1495 -10348 -945 5100 -7119 -10968 2310
$$ packed form
632A4006n041j8294Q203J5162j2620j3794J4018Q624j6994m513J7087j745j8699
645a4600N934J8423r141j4296J4598J2406j5212q546J5491L996j6317j542J5455
658F649k580j5746M376J2698q034j1189J0385J0331j1348m678J4811K600j4822
671f547Q47J4568l124j4966N586J2989p529j4070R112J1217j2001p621J3888O139
685H488j3602M05J4294l841j2233Q388J1472j1653q998J3776L939j6410k203J4260
699F082j088j3451M444J4339p386j0996J0040R696j1169m184J2214J506j2419
712b372J124J0310n932j1060O406Q066q361p510J0106O521j0875m243J2673L129
726G982j1608j83J2304k319j2560M203R547q861q853R403O045j2219l849J3278
$$ plain form
740 2310 3669 -10200 -6680 7578 2634 -9203 -443 10247 -866 -9571 3100 6647 -7476
753 -7476 -8976 4008 1664 -10679 -6069 4669 -2235 -9461 633 7256 -2323 -5531 5943 7499
767 7499 -4289 -3203 7429 3794 -6656 -2318 5957 -1285 -8723 -157 6156 -2960 -5757 5061
781 5061 7140 -2298 -1462 9186 6101 -3826 1426 10045 1490 -6622 2855 7692 -4214 -7267 5181
796 5181 5023 -6501 -2586 8754 3601 -5280 2632 10780 819 -4591 5583 7760 -4098 -4954 5253
811 5253 2015 -8260 -3553 5434 -1383 -8114 393 6012 -2218 -5242 4563 6121 -4048 -3378 5681
826 5681 2265 -6963 -3390 4394 -2312 -9437 -2103 3155 -5092 -7799 2186 3534 -5294 -3790 6092
841 6092 3093 -5913 -537 6682 -1288 -7177 1043 4302 -5353 -7100 2454 1979 -7091 -3975 5642
$$ packed form
740B310J359j3869L520J4258m944j1837Q760J0690j1113q705J2671L547j4123
753g476j500J2984k344j2343M610J0738o904p226J0094O623r579l208J1474J556
767G499j1788J086J0632l635j0450M338Q275p242p438Q566O313r116k797J0818
781E061K079r438Q36J0648l085r927N252Q619q555q112R477M837j1906l053J2448
796E181j58j1524L915J1340n153q881P912Q148r961n410J0174K177j1858q56J0207
811E253l238j0275M707Q987o817o731Q507N619q230l024R805J558j0169O70R059
826E681l416r228L573P784o706p125P334N258q247k707R985J348q828J504R882
841F092k999r006N376P219p970n889Q220L259r655j747R554m75r070L116R617
$$ plain form
856 5642 1644 -5406 1182 7604 95 -3933 4456 6482 -2971 -3391 4833 2795 -6000 -2341 4946
871 4946 -239 -5585 1254 6205 -713 -3275 4871 6713 -1430 -831 7135 3911 -3357 132 5679
886 5679 -148 -5709 931 4315 -2837 -4478 3488 3966 -3695 -1343 6103 2846 -3804 1272 6602
901 6602 -269 -4911 1866 3816 -4301 -5018 2397 1179 -6122 -3066 3648 -315 -5580 297 5200
916 5200 -1299 -4032 3396 4013 -4040 -3714 3424 893 -6274 -2807 3344 -1955 -6728 -310 3078 -2770
932 -2770 -4173 3407 3737 -3176 -1729 4868 1804 -4250 -335 4447 -1091 -5145 864 3552 -3773
947 -3773 -4523 3064 2733 -3905 -1379 5619 2181 -3259 1580 5700 -205 -3104 3134 4460 -2525 -2955
963 -2955 3361 2051 -4453 -1381 4301 493 -3773 1653 5554 -467 -2862 3806 4572 -2286 -1368 4457
$$ packed form
856E642l998p050O588O422p509m028Q389K026r453m20Q224k038q795L659P287
871D946n185n346O839M951o918k562Q146J842q143N99P966l224p268L489N547
886E679n827n561O640L384p152j641P966M78p661K352P446l257o650N076N330
901F602o871m642O777J950q117p17P415j218p301L056O714l963n265N877M903
916E200o499k733P428O17q053L26P138k531p167L467O151n299m773O418L388n848
932b770j403P580L30o913J447O597l064o054L915M782n538m054O009K688p325
947c773p50P587l31o638K526O998l438n440M839M120n905k899O238J326o985m30
963b955O316j310o504L072N682l808m266N426L901o021k395O668P66o858R18N825
$$ plain form
979 4457 2097 -4319 -1246 3891 -976 -5004 507 3487 -2052 -3135 2952 2882 -3419 -1733 4197 1733
995 1733 -3678 -167 4012 -1243 -4870 571 2208 -3276 -4017 1837 1584 -4085 -2113 3451 444 -3931
1011 -3931 379 4076 -900 -3374 1992 2952 -3107 -3068 2392 1372 -4137 -1743 3016 -485 -4120 270
1027 270 3710 -1536 -2783 2997 3332 -2244 -1469 3469 1422 -3332 -683 3529 -600 -3486 1010 3262
1043 3262 -1928 -2817 2765 3065 -2264 -1117 4195 1578 -2603 468 3581 -500 -2765 1838 2926
1058 2926 -2081 -2035 2347 1498 -2937 -1442 3252 891 -3078 527 3502 -802 -2672 1948 2530 -2354
1074 -2354 -2116 2586 929 -3605 -815 2465 -500 -3506 421 2819 -1346 -2614 2119 2087 -2643 -1788
1090 -1788 2776 1173 -3359 -412 2832 -833 -3406 605 1983 -1775 -2340 2108 1587 -2367 -1067
$$ packed form
979D457k360o416L073N137m867m028N511K980n539j083O087p0o301J686N930k464
995A733n411L511M179n255l627N441J637n484p41N854k53n669J972N564l007m375
1011c931M310L697m976k474N366R60o059L9N460j020n509K394M759l501l635M390
1027B70L440n246j247N780L35n576P75M938k047m754K649M212m129k886M496K252
1043C262n190q89N582L00n329J147N312k617m181L071L113m081k265M603J088
1058B926n007M6M382q49m435J495M694k361l969L605K975m304j870M620N82m884
1074b354K38M702j657m534K790L280k965l006L927K398m165j268M733l2m730Q55
1090a788M564j603m532K947L244l665k573M011J378l758n65M448n21l954J300
$$ plain form
1105 -1067 2801 389 -2652 254 3062 -450 -2588 1412 2295 -2143 -2088 2857 1038 -2643 -460 3158
1121 3158 255 -2482 960 2804 -486 -1949 1948 2365 -2020 -1468 2600 1130 -2463 115 3221
1136 3221 -609 -2821 932 2443 -1488 -2114 1780 1548 -2007 -853 2472 620 -2872 109 2700
1151 2700 -463 -2454 865 2286 -1653 -1928 1929 1177 -2741 -939 2154 -320 -2886 207 1937
1166 1937 -1212 -2498 889 2105 -1710 -1648 1863 673 -2461 -1055 2270 -665 -2573 92 2511
1181 2511 -1486 -2554 1976 1275 -1815 -1156 2150 861 -1639 -10 2036 -235 -1973 237 2274
1196 2274 -958 -1671 1525 1517 -1799 -821 2577 1069 -2099 -161 2734 570 -1602 735 1723 -1553
1212 -1553 -1754 1313 1053 -1914 -1838 2132 543 -2179 -50 1436 -165 -1056 1461 1251 -1663 -1367 1552
$$ packed form
1105a067L868k412l041K906K808l512k138M000Q83m438N5M945j819l681K183L618
1121C158k903k737L442J844l290j463L897M17m385N52M068j470l593K578L106
1136C221l830k212L753J511l931o26L894k32l555J154L325j852l492K981K591
1151B700l163j991L319J421l939k75L857p52l918J802L093k474k566L093J730
1166A937l149j286L387J216l815O2L511j190l134J406L325k935j908K665K419
1181B511l997j068M530p01l090O59L306j289k500J629K046k271j738K210K037
1196B274l232p13L196ql316R78L398j508l168J938K895k164k172K337R88l276
1212a553k01L067k60k967P6L970j589k722K129J486j601q91K517k10k914K96K919
$$ plain form
1229 1552 1356 -1252 -50 1759 -825 -2820 45 1981 -1531 -1998 692 647 -2323 -1618 1069 466
1245 466 -2297 -834 1752 -357 -1790 471 1604 -1083 -1786 968 927 -1891 -1072 951 346 -2454
1261 -2454 -504 1756 -819 -1609 543 1745 -1225 -1149 1293 1166 -2125 -228 1002 -89 -1745 -650
1277 -650 1076 -730 -1069 953 1866 -1008 -442 1777 1002 -1351 5 2138 -69 -1295 874 1367
1293 1367 -709 -1423 1070 933 -1176 -715 1852 410 -1436 343 1796 338 -1097 604 1687 -1017
1309 -1017 -884 1247 511 -1643 -486 1378 -16 -1741 73 1440 -343 -1335 892 1574 -1062 -900
1325 -900 1643 564 -1620 -65 1475 -288 -1794 -84 712 -981 -1619 584 586 -1420 -594 1480 529
1342 529 -1463 13 1388 -160 -1491 252 1084 -1121 -1402 713 398 -1470 -741 1120 117 -1402
$$ packed form
1229A552j96k608J202J809k584j995K865J936l512m67K690m5k970P05K687o03
1245D66k763J463K586k109j433K261J133k687p03K754m1k818Q19K023o05k800
1261b454J950K260k575p90K152J202k970P6K442j27l291J897J230j091j656J095
1277f50J726j806l39K022R13k874N66K219p75k353J356K133k207j226K169M93
1293A367k076p14K493j37k109M61K567j442j846J779J453j458j435J701J083k704
1309a017J33K131p36k154J157J864j394j725J814J367j783r92K227O82k636J62
1325i00K543j079k184J555J540j763j506J710P96j693o38K203Kk006Q26K074r51
1342E29j992J476J375j548j331J743Q32k205k81K115l15j868P29J861j003j519
$$ plain form
1358 -1402 335 1398 43 -1277 709 1275 -522 -758 1469 684 -1246 -495 1257 -40 -1450 33
1374 33 1021 -296 -985 1123 1445 -356 -660 1455 1073 -785 -85 1450 132 -1058 399 929 -750
1391 -750 -1209 1054 840 -1105 -272 1485 591 -831 241 1375 52 -932 471 1138 -457 -1133 493
1408 493 637 -1101 -959 796 -5 -1442 -40 1201 -74 -842 495 1048 -866 -658 851 300 -984
1425 -984 -492 769 -123 -1365 -303 815 -561 -946 613 838 -865 -764 727 576 -1147 -301 794
1442 794 -42 -1041 156 858 -504 -930 520 569 -847 -628 787 398 -732 45 983 146 -714 370
1460 370 725 -534 -723 544 823 -824 -481 974 227 -866 118 873 45 -894 544 1036 -164 -284
1478 -284 790 485 -993 59 934 50 -816 302 770 -133 -646 734 649 -399 -374 1032 410 -925
$$ packed form
1358a402J737J063j355j320J986N66j797k36K227p85j930P51J752j297j410J483
1374C3R88j317o89K108L22j801l04K115l82j858P00J535j318j190J457N30j679
1391g50m59K263k14j945Q33J757q94j422J072J134j323r84J403O67j595o76J626
1408D93J44j738J42J755q01j437J402J241j275p68J337N53j914K08J509n51j284
1425i84M92J261q92j242J062J118j376l85J559K25j703J01J491j51j723Q46J095
1442G94q36r99J197P02j362m26J450M9j416K19J415l89j130P77R38q37q60J084
1460C70L55j259j89J267K79j647L43J455p47j093R84P55q28r39J438M92j200j20
1478b84J074l05j478J052Q75q84q66J118M68r03n13J380q5j048K5J406o22j335
$$ plain form
1496 -925 160 764 80 -650 277 579 -701 -849 330 499 -861 -323 689 256 -621 -85 982 -293
1514 -293 -619 387 613 -501 -315 581 401 -646 -370 680 -143 -1177 -13 639 -214 -884 105 704
1532 704 -662 -142 545 362 -789 -132 213 94 -896 -158 542 -410 -670 391 381 -554 -601 543 288
1551 288 -783 -321 755 133 -788 269 755 -420 -639 670 488 -506 -56 851 396 -727 115 917
1569 917 -112 -857 606 823 -378 -546 499 386 -375 -467 725 101 -435 176 610 -138 -347 310 484
1588 484 -397 -508 566 613 -307 75 684 316 -616 -49 742 -217 -266 319 517 -385 -605 429 202 -739
1608 -739 -77 542 -133 -420 48 434 -381 -940 343 233 -395 -331 433 85 -968 -177 444 -180 -588 169
1628 169 596 -367 -522 427 418 -317 -195 545 130 -647 238 633 -103 -417 151 528 -487 -507 539 116
$$ packed form
1496i25J085O04o84p30R27L02j280j48J179J69j360N38J012m33q77N36J067j275
1514b93l26J006K26j114J86Q96j80j047K76J050q23j034J164O52q53o70R89N99
1532G04j366N20O87j83j151O57L45j19r90P38P00r52k60J061j0r35m7J144k55
1551B88j071M62J076o22r21J057M86j175k19J309j82r94M50R07m55j123Q42Q02
1569I17j029p45J463K17j201j68J045j13p61r2J192o24n36O11M34p48k09O57J74
1588D84q81j11J074M7r20L82O09l68r32N67P91r59m9N85J98r02k20J034k27r41
1608g39O62O19o75k87M68L86q15n59J283j10o28O4P64l48j053P91O21o24m08P57
1628A69M27r63j55R49rp35J22P40m15p77Q85L95p36l14N68L77j015k0J046m23
$$ plain form
1648 116 -451 -41 321 59 -504 190 850 -232 -312 235 487 -395 -278 236 226 -217 -257 598 35 -455 76
1669 76 530 18 -424 325 531 -294 0 545 133 -297 -34 599 -157 -637 183 574 -66 -153 409 385 -27
1690 -27 84 402 122 -602 -223 571 -199 -470 258 176 -418 -107 217 236 -475 -419 359 10 -475 157 460
1711 460 -103 -55 179 133 -350 -367 -181 81 -559 -245 407 -197 -495 50 297 -14 -325 285 196 -534 -440 505
1733 505 498 -381 -90 390 -156 -508 -52 32 -333 -526 84 324 -126 -139 475 265 -113 121 119 101 -296 159
1755 159 239 -111 -437 300 -93 -183 -17 279 454 -254 155 533 16 -41 269 583 -377 -122 334 73 -351
1776 -351 -67 486 7 -78 332 372 -107 -181 360 549 -158 -204 690 356 -280 -36 566 130 -465 -6 273
1797 273 -87 -191 256 154 -151 -75 42 -40 -179 -354 56 11 -242 -68 99 -106 -72 -132 172 -536 -278 344
$$ packed form
1648A16n67M10L62k62n63O94O60j082q0N47K52q82J17N14j0m43m0Q55n63m90N31
1669G6M54n12m42P49K06q25K94N45m12m30K63O33p56m80Q20L91o40q7N62k4m12
1690b7J11L18k80p24L79P94p70k71P28q2n94L11L24J9p11N6P78l49m85O32L03
1711D60n63M8K34m6m83j7J86K62o40L14O52o04k98N45K47l11l11O10q9p30R4R45
1733E05pq79K91M80n46l52M56Q4l65j93O10K40m50j3O14k10l78K34kj8l97M55
1755A59Q0l50l26P37l93r0J66K96J75p08M09L78n17n7L10L14r60K55M56k61m24
1776c51K84N53m79q5M10M0m79p4N41J89p07m6Q94l34o36K44O02m36n95M59K79
1797B73l60j04M47j02l05P6J17q2j39j75M10m5k53J74J67k05L4o0L04p08K58O22
$$ plain form
1819 344 -65 -317 70 151 -221 -178 80 276 -492 -119 149 19 -214 -315 32 113 -415 -47 89 -286 -361
1840 -361 157 229 -7 -249 70 235 -314 -149 207 65 -429 -105 36 -123 -281 435 257 -90 -13 368 84
1861 84 -7 260 447 167 -264 -38 246 22 -195 73 -50 -198 -30 212 189 -4 29 607 -72 61 313
1882 313 169 -125 -157 -3 421 -365 -123 241 -14 -433 -23 9 -247 -198 15 265 -52 -221 201 376 -104
1903 -104 -207 206 -91 -234 103 92 -423 -771 135 109 -123 -144 286 338 -159 -330 270 -87 -303 -44 242
1924 242 -442 -229 -249 -110 -453 -171 -129 30 -310 -56 222 125 20 341 199 92 -117 -32 272 -427 -207
1945 -207 138 229 -443 -47 447 211 -211 180 309 118 -10 402 218 -19 29 402 67 -235 289 -101 69
1966 69 -220 136 280 -75 -275 325 381 185 53 388 250 -113 58 70 -145 -195 -100 -50 -458 -336 100 135
$$ packed form
1819C44m09k52L87Q1l72M3K58J96p68L73K68j30k33j01L47Q1n28L68J36l75p5
1840c61N18P2k36k42L19J65n49J65L56j42m94L24J41j59j58P16j78l47P7L81k84
1861H4r1K67J87k80m31K26K84k24k17K68j23j48J68K42k3j93L3N78o79J33K52
1882C13j44k94l2J54M24p86K42L64k55m19M10L2k56M9K13K50l17j69M22J75m80
1903a04j03M13k97j43L37j1n15l48R06k6k32k1M30N2m97j71O00l57k16K59K86
1924B42o84K13k0J39l43K82M2J59l40K54K78r7j05L21j42j07k09Q5L04o99K20
1945b07L45R1o72L96M94k36m22L91J29j91j28M12j84k37M8L73l35l02N24l90J70
1966F9k89L56J44l55k00O00N6j96j32L35j38l63J71J2k15n0R5N0m08J22M36L5
$$ plain form
1988 135 -356 83 367 105 -235 -100 102 -107 -41 55 -81 -283 -312 83 14 -393 -168 92 -176 40 -172
2009 -172 74 283 -155 7 182 -200 -78 7 126 -191 -86 115 66 -535 -164 135 41 -349 216 225 -56 89
2031 89 288 150 -421 -353 120 98 -142 44 199 -178 -222 157 281 -55 91 267 265 56 -56 461 97 -280
2053 -280 82 248 -163 -369 52 -16 -312 -311 440 -38 27 294 310 214 175 304 218 8 -374 62 85 -130 -377
2076 -377 70 -4 -477 -8 247 -18 -130 244 402 -156 -175 -39 204 -166 -396 411 -96 -232 -62 61 -413
2097 -413 -499 -91 138 -255 -447 55 -118 95 189 190 -138 -318 3 105 -174 -263 -238 225 -312 -39 389 162
2119 162 -138 183 209 31 -119 99 250 -199 -133 172 325 -222 -191 39 -113 -423 59 173 -133 98 124
2140 124 214 302 -56 619 326 -129 18 259 8 -380 133 356 -191 -268 197 324 66 24 -37 168 -138 9
$$ packed form
1988A35m91M39K84k62l40J35K02k09O6R6j36k02k9L95o9m07K25K60k68K16k12
2009a72K46K09m38J62J75l82J22Q5J19l17J05K01m9o01L71K99r4l90N65Rk81J45
2031H9J99j38n71O8M73k2k40J86J55l77m4L79J24l36J46J76kk09j12N17l64l77
2053b80L62J66m11k06M21o8k96JP51m78O5K67J6r6l9J29q6k10l82M36K3k15k47
2076c77M47p4m73M69K55k65j12L74J58n58j9J36K43l70k30Q07n07j36J70J23m74
2097d13q6M08K29l93j92N02j73K13R4Jl28j80L21J02k79q9K5M63n37K73M28k27
2119A62l00L21K6j78j50K18J51m49O6L05J53n47L1K30j52l10M82J14l06K31K6
2140A24R0Q8l58O75k93m55J47K41k51l88N13K23n47p7M65J27k58m2o1K05l06J47
$$ plain form
2162 9 102 104 -185 253 505 -11 -630 -48 16 -316 -124 -89 115 -217 95 432 232 -196 118 304 57 -210
2184 -210 -35 182 -7 -327 175 109 -400 -145 -7 17 -318 -69 314 -103 -120 269 115 -335 25 313 -6
2205 -6 -97 116 76 -95 -244 94 87 -242 -325 332 114 14 -187 344 50 -3 -202 242 -5 -395 -22 0 -390
2228 -390 -321 74 337 -8 354 210 9 -92 306 278 -48 -192 138 223 -36 -143 166 302 -333 -348 213
2249 213 -237 -209 176 345 -295 -137 282 98 -133 -202 441 -165 -194 -146 181 -75 -392 -47 105 -249 -200 332
2271 332 -158 -303 94 -40 -102 86 41 156 -111 28 107 156 -224 -247 -47 53 16 -300 51 107 -412 -166
2293 -166 448 -257 -138 541 57 -239 -13 154 118 -238 129 329 19 -100 -68 296 -156 -174 -93 288 -91
2314 -91 -124 302 165 -146 89 64 175 -226 -45 202 -47 -39 214 133 -306 -71 221 320 -250 -24 275 -91
$$ packed form
2162IR3Kk89M38K52n16o19N82O4l32J92L5K04l32L12L37k00m28L14J86k47k67
2184b10J75K17j89l20N02o6n09K55J38K4l35K49L83m17j7L89j54m50L60K88l19
2205fr1K13m0j71j49L38pl29q3O57k18j00k01N31k94n3j99M44k47l90L73K2l90
2228c90O9L95K63l45L62j44k01j01L98k8l26j44L30Q5k59j07L09J36o35j5N61
2249B13m50K8L85J69o40J58M19j84k31o9O43o06k9M8L27k56l17L45J52l54M9N32
2271C32m90j45L97j34o2J88m5J15k67J39P9M9l80k3K00J00l7l16L51N6n19K46
2293a66O14p05J19O79m84k96K26J67l6l56L67K00l10j19L2L64m52j8Q1L81l79
2314i1l3M26j37l11K35k5J11m01J81K47k49QK53q1m39K35K92R9n70K26K99l66
$$ plain form
2336 -91 -163 102 350 -13 -62 -94 -9 12 -157 187 255 -248 -13 214 140 -259 70 378 -294 -109 -129 -28 -187
2359 -187 -51 97 -180 -522 123 208 -265 -294 82 266 -30 -291 277 -333 -344 18 69 -161 -199 -4 431 268
2381 268 80 -143 101 -121 -22 323 179 -76 -115 379 -287 -173 317 7 37 34 -176 289 -176 -216 176 253
2403 253 -517 29 172 27 -295 106 395 -296 -205 500 -6 -42 -156 322 42 -134 277 225 189 -95 124
2424 124 201 -246 -252 360 282 -204 68 234 97 -89 298 341 -195 -175 96 118 -155 -50 -35 29 -281 -74 239
2447 239 -80 -277 -229 182 -212 -201 -6 446 -524 -151 228 102 -205 -166 3 -185 -68 -69 202 -220 -85 379
2469 379 337 -153 -123 198 35 -59 26 183 -220 -27 19 166 -201 -151 118 57 -460 -16 203 85 -336 110
2491 110 360 -255 -82 232 424 -29 -66 44 -75 -388 -95 315 143 -113 10 296 142 -119 291 75
$$ packed form
2336i1p2K65K48l63m9l2Q5K1j69L44O8n03K35K27p4l99L29L08o72J85k0J01j59
2359a87J36J48k77l42O45Q5m73k9L76J84k96k61N68o10j1L62N1k30l8J95M35j63
2381B68j88k23K44k22R9L45j44k55l9M94o66J14M90l10L0lk10M65m65m0L92P7
2403B53p70N46J43j45l22M01K89o91R1P05n06l6j14M78k80j76M11n2l6k84K19
2424A24P7m47oO12p8m86K72J66j37j86L87M3n36K0K71K2k73J05J5O4l10K07L13
2447B39l19j97M8M11l94J1J95M52r70L73L79j26l07L9J69j88J17jK71m22J35M64
2469C79m2m90L0L21j63r4Q5J57m03J93M6J47l67N0K69o1n17M44K19j18m21M46
2491A10K50o15J73L14J92m53l7J10j19l13K93M10j72k56J23K86j54k61M10k16
$$ plain form
2511 75 -287 119 389 -105 -151 -70 -99 -326 -144 79 520 -491 -520 -280 65 454 80 611 556 823 676 105
2533 105 -184 46 28 139 -121 -658 185 241 -284 -14 324 180 -45 475 555 -5 -192 72 166 -219 -210 -33
2555 -33 -153 -408 -255 261 -217 -416 -38 338 243 -112 258 56 98 -33 346 102 -499 62 -11 -228 -423
2576 -423 -86 -243 -457 -274 -109 79 -80 -58 189 -150 -44 -80 359 -129 9 -56 102 -102 -265 174 -148
2597 -148 -81 -380 409 53 -279 259 510 98 -160 471 121 -141 -234 416 4 -399 -199 128 -209 -187 -16
2618 -16 105 61 -79 292 249 -285 -172 303 -78 -167 -238 27 -148 -377 -288 15 -38 -26 153 215 15 -152 313
2641 313 249 -41 301 71 -105 -61 231 -33 -470 -243 265 -268 -360 -359 240 -262 -154 -40 185 13 105 228
2663 228 264 -322 -232 108 67 -452 90 177 -237 -182 130 101 -313 -288 164 264 84 128 73 61 -85 117 293
$$ packed form
2511G5l62M06K70m94m6Q1k9k27J82K23M41j011k9K40L45L89l74N31n5K67j47n71
2533A05k89K30j8J11k60n37Q43N6n25K70L38j44k25N20Q0n60j87K64R4l85RJ77
2555c3j20k55J53N16m78j99L78L76r5l55L70k02M2j31L79k44o01N61p3k17j95
2576d23L37j57k14J83J65J88j59K2K47l39J06l6M39m88J38o5J58k04j63M39l22
2597a48O7k99P89l56l32N38K51m12k58O31l50k62r3O50m12m03K00L27l37K2J71
2618a6J21m4j40L71m3n34J13M75l81q9p1K65j75k29Q9L03n3J2J79O2k00j67M65
2641C13o4k90L42k30j76M4K92k64m37K27N08n33r2JN99n02J08J14K25j72R2J23
2663B28L6n86R0L40m1n19N42Q7m14N5L12k9m14K5M52J00j80M4n5j2j46K02J76
$$ plain form
2686 293 -85 -193 -108 131 34 -316 42 186 -244 221 436 92 -60 527 112 -88 -71 314 423 -225 -61
2707 -61 66 185 -192 -138 235 123 -127 47 284 161 -246 172 626 190 -185 -91 7 -189 -458 407 -482
2728 -482 -199 265 12 -397 -224 164 127 34 -58 505 -164 155 -27 100 134 -256 -2 -141 -200 -231 -109 11
2750 11 -225 -34 222 399 -153 98 189 224 -127 -31 61 -449 48 -10 158 -477 -98 81 -181 -376 218 115
2772 115 94 -13 237 443 -328 -109 302 -49 -244 150 132 -61 -235 8 234 -134 -288 -76 225 -106 295
2793 295 198 299 -131 108 100 -50 -549 0 -157 -257 -216 87 -77 -49 85 483 -28 65 -3 30 173 217 132
2816 132 138 -306 -115 215 143 -409 -209 251 -355 -279 -169 216 -36 14 346 -15 30 13 165 -115 -292 -70
2838 -70 171 -94 -292 -138 107 -190 -263 292 19 17 149 84 208 -214 90 155 -36 -308 -162 -43 -67 -370
$$ packed form
2686B93l78j08Q5K39r7l50L58J44m30M65K15l44j52N87m15k00J7L85J09o48J64
2707f1J27J19l77N4L73j12k50J74K37j23m07M18M54m36l75R4R8j96k69Q65q89
2728d82K83M64k53m09J73L88l7r3r2N63o69L19j82J27L4l90K54j39n9l1J22J20
2750A1k36J91K56J77n52K51R1L5l51R6R2n10M97n8J68o35L79J79k62j95N94j03
2772A15k1j07K50K06p71K19M11l51j95L94j8j93j74K43K26l68j54K12L01l31M01
2793B95r7J01m30K39qj50m99N49j57j00M1L03j64K8J34L98n11R3o8L3J43M4q5
2816A32Om44J91L30p2n52K00M60o06P6J10L85k52N0L32l61M5j7J52k80j77K22
2838g0K41k65j98J54K45k97p3N55k73kJ32o5J24m22L04O5j91k72J46J19k4l03
$$ plain form
2860 -370 168 -278 -556 -122 205 25 -16 239 364 -168 25 191 253 -168 -238 10 208 -332 117 79 55 -230
2882 -230 74 152 -49 54 397 107 -6 9 136 35 -177 212 -15 81 -57 117 230 109 -74 134 115
2903 115 -174 -104 317 181 67 270 197 83 -121 97 294 -406 -221 -200 67 -100 -108 309 -261 -30 125 151
2925 151 -21 -212 185 87 -70 -173 181 286 -257 45 42 24 -135 -125 76 11 -115 62 268 -131 -292 290
2947 290 -73 -61 -175 156 -5 -393 -8 87 -99 -207 136 -14 -190 -61 248 148 -77 75 322 304 89
2968 89 229 210 6 -27 -125 -106 -441 130 239 -15 -340 22 228 278 -115 52 197 21 192 248 -14 -34 -12
2991 -12 191 -15 -106 101 108 212 -249 36 -44 -138 -210 174 69 -167 126 138 -276 -212 -87 129 -99 -197 289
$$ packed form
2860c70N38m46k78M34L27j80m1K55J25n32J93J66O2m21p0K48J98n40M49l8k4k85
2882b30L04P8k01J03L43k90j13J5J27j01k12L89k27R6j38J74J13j21j83K08j9
2903A15k89P0M21j36j14K03p3j14k04K18J97p00J85K1K67j67qM17n70K31J55K6
2925A51j72j91L97r8j57j03L54J05n43L02lj8j59J0K01o5j26J77K06l99j61N82
2947B90l63J2j14L31j61l88L85R5j86j08L43j50j76J29L09j00k25J52K47j8k15
2968H9J40j9k04l3r8J9l35N71J09k54l25L62K06N0l93J67J45j76J71N6k62k0K2
2991a2K03k06r1K07PJ04m61K85q0r4p2L84j05k36K93J2m14O4J25K16k28r8M86
$$ [...]
8191a53
##END NTUPLES=NMR FID
##END=
