##TITLE=1H_Pr Am-247
 CDCl3, 8 sc, 
 9.07.2021
##JCAMPDX= 6.0         $$ Bruker NMR JCAMP-DX V2.0
##DATA TYPE= NMR FID
##DATA CLASS= NTUPLES
##ORIGIN= UXNMR, Bruker Analytische Messtechnik GmbH
##OWNER= root
$$ XWIN-NMR		Version 3.5
$$ Fri Jul  9 13:29:53 2021 Russian Standard Time (UT+4h)  she@DPX200
##.OBSERVE FREQUENCY= 200.131506
##.OBSERVE NUCLEUS= ^1H
##.DELAY= (6, 6)
##.ACQUISITION MODE= SIMULTANEOUS
##.ACQUISITION SCHEME= undefined
##.AVERAGES= 8
##.DIGITISER RES= 18
##SPECTROMETER/DATA SYSTEM= spect
##.PULSE SEQUENCE= zg30
##.SOLVENT NAME= CDCl3
##.SHIFT REFERENCE= (INTERNAL, CDCl3, 0, 15.7039)
##AUDIT TRAIL= $$ (NUMBER, WHEN, WHO, WHERE, WHAT)
$$ ##TITLE= Audit trail, XWIN-NMR		Version 3.5
$$ ##JCAMPDX= 5.01
$$ ##ORIGIN= Bruker BioSpin GmbH
$$ ##OWNER= she
$$ F:/spectra/data/she/nmr/H-F/1/audita.txt
$$ ##AUDIT TRAIL=  $$ (NUMBER, WHEN, WHO, WHERE, WHAT)
(   1,<2021-07-09 13:28:47.56 +0400>,<she>,<DPX200>,
      <created by zg, POWCHK disabled, PULCHK disabled
       configuration hash MD5:
       00 E9 B6 7A A2 85 ED C7 34 08 36 98 17 FE 4E 26
       data hash MD5: 16K
       59 38 DA 51 F4 55 E5 6F 34 7E 97 C6 C2 84 F7 8E>)
$$ ##END=
$$ 
$$ hash MD5
$$ B8 74 ED 3F D1 1D 48 37 3C F8 00 23 9C 15 48 0A
##$RELAX= 
##$RELAX= 
##$RELAX= 
##$RELAX= 
##$RELAX= 
##$RELAX= 
$$ Bruker specific parameters
$$ --------------------------
##$DU= <F:/spectra>
##$EXPNO= 1
##$NAME= <H-F>
##$PROCNO= 1
##$TYPE= <nmr>
##$USER= <she>
##$AMP= (0..31)
100 100 100 100 100 100 100 100 100 100 100 100 100 100 100 100 100 100 
100 100 100 100 100 100 100 100 100 100 100 100 100 100 
##$AQSEQ= 0
##$AQ_mod= 1
##$AUNM= <au_zg>
##$AUTOPOS= <>
##$BF1= 200.13
##$BF2= 200.13
##$BF3= 200.13
##$BF4= 200.13
##$BF5= 200.13
##$BF6= 200.13
##$BF7= 200.13
##$BF8= 200.13
##$BYTORDA= 1
##$CFDGTYP= 0
##$CFRGTYP= 5
##$CHEMSTR= <none>
##$CNST= (0..31)
1 1 145 1 1 1 1 1 1 1 1 1 1 1 1 1 1 1 1 1 1 1 1 1 1 1 1 1 1 1 1 1 
##$CPDPRG= <>
##$CPDPRG1= <>
##$CPDPRG2= <>
##$CPDPRG3= <>
##$CPDPRG4= <mlev>
##$CPDPRG5= <mlev>
##$CPDPRG6= <mlev>
##$CPDPRG7= <mlev>
##$CPDPRG8= <mlev>
##$CPDPRGB= <>
##$CPDPRGT= <>
##$D= (0..31)
0 1.2 0 0 0 0 0 0 0 0.06 0 0.03 0 0 0 0 0.0002 0 0 0 0 0 0 0 0 0 0 0 0 
0 0 0 
##$DATE= 1625822927
##$DBL= (0..7)
120 120 120 120 120 120 120 120 
##$DBP= (0..7)
150 150 150 150 150 150 150 150 
##$DBP07= 0
##$DBPNAM0= <>
##$DBPNAM1= <>
##$DBPNAM2= <>
##$DBPNAM3= <>
##$DBPNAM4= <>
##$DBPNAM5= <>
##$DBPNAM6= <>
##$DBPNAM7= <>
##$DBPOAL= (0..7)
0.5 0.5 0.5 0.5 0.5 0.5 0.5 0.5 
##$DBPOFFS= (0..7)
0 0 0 0 0 0 0 0 
##$DE= 6
##$DECBNUC= <off>
##$DECIM= 32
##$DECNUC= <off>
##$DECSTAT= 4
##$DIGMOD= 1
##$DIGTYP= 9
##$DL= (0..7)
0 120 120 120 120 120 120 120 
##$DP= (0..7)
150 150 150 150 150 150 150 150 
##$DP07= 0
##$DPNAME0= <>
##$DPNAME1= <>
##$DPNAME2= <>
##$DPNAME3= <>
##$DPNAME4= <>
##$DPNAME5= <>
##$DPNAME6= <>
##$DPNAME7= <>
##$DPOAL= (0..7)
0.5 0.5 0.5 0.5 0.5 0.5 0.5 0.5 
##$DPOFFS= (0..7)
0 0 0 0 0 0 0 0 
##$DQDMODE= 0
##$DR= 18
##$DS= 0
##$DSLIST= <SSSSSSSSSSSSSSS>
$$ [...]
##$SUBNAM2= <"">
##$SUBNAM3= <"">
##$SUBNAM4= <"">
##$SUBNAM5= <"">
##$SUBNAM6= <"">
##$SUBNAM7= <"">
##$SUBNAM8= <"">
##$SUBNAM9= <"">
##$SW= 20.0188882624521
##$SWIBOX= (0..15)
0 0 2 0 0 0 0 0 0 0 0 0 0 0 0 0 
##$SW_h= 4006.41025641026
##$TD= 16384
##$TD0= 1
##$TE= 0
##$TE2= 300
##$TE3= 300
##$TEG= 300
##$TL= (0..7)
0 120 120 120 120 120 120 120 
##$TP= (0..7)
150 150 150 150 150 150 150 150 
##$TP07= 0
##$TPNAME0= <>
##$TPNAME1= <>
##$TPNAME2= <>
##$TPNAME3= <>
##$TPNAME4= <>
##$TPNAME5= <>
##$TPNAME6= <>
##$TPNAME7= <>
##$TPOAL= (0..7)
0.5 0.5 0.5 0.5 0.5 0.5 0.5 0.5 
##$TPOFFS= (0..7)
0 0 0 0 0 0 0 0 
##$TUNHIN= 0
##$TUNHOUT= 0
##$TUNXOUT= 0
##$USERA1= <user>
##$USERA2= <user>
##$USERA3= <user>
##$USERA4= <user>
##$USERA5= <user>
##$V9= 5
##$VALIST= <valist>
##$VCLIST= <CCCCCCCCCCCCCCC>
##$VD= 0
##$VDLIST= <DDDDDDDDDDDDDDD>
##$VPLIST= <PPPPPPPPPPPPPPP>
##$VTLIST= <TTTTTTTTTTTTTTT>
##$WBST= 1024
##$WBSW= 4
##$XGAIN= (0..3)
0 0 0 0 
##$XL= 0
##$YL= 0
##$YMAX_a= 48277
##$YMIN_a= -90638
##$ZGOPTNS= <>
##$ZL1= 120
##$ZL2= 120
##$ZL3= 120
##$ZL4= 120
##$ABSF1= 10
##$ABSF2= 0
##$ABSG= 5
##$ABSL= 3
##$ALPHA= 0
##$AQORDER= 0
##$ASSFAC= 0
##$ASSFACI= 0
##$ASSFACX= 0
##$ASSWID= 0
##$AUNMP= <proc_1d>
##$AZFE= 0.1
##$AZFW= 0.1
##$BCFW= 1
##$BC_mod= 2
##$BYTORDP= 1
##$COROFFS= 0
##$CY= 11.3945322036743
##$DATMOD= 1
##$DC= 2
##$DFILT= <>
##$DTYPP= 0
##$F1P= 17.5019972093344
##$F2P= -2.517084195857
##$FCOR= 0.5
##$FTSIZE= 0
##$FT_mod= 4
##$GAMMA= 1
##$GB= 0.15
##$INTBC= 1
##$INTSCL= 1
##$ISEN= 128
##$LB= 0.24
##$LEV0= 0
##$LPBIN= 0
##$MAXI= 10000
##$MC2= 0
##$MEAN= 0
##$ME_mod= 0
##$MI= 1.114404
##$NCOEF= 0
##$NC_proc= 0
##$NLEV= 6
##$NOISF1= 3.799351
##$NOISF2= 2.8
##$NSP= 1
##$NTH_PI= 0
##$NZP= 0
##$OFFSET= 15.70392
##$PC= 1
##$PHC0= -12273.18
##$PHC1= 4.400995
##$PH_mod= 1
##$PKNL= yes
##$PPARMOD= 0
##$PSCAL= 0
##$PSIGN= 0
##$REVERSE= no
##$SF= 200.130013532006
##$SI= 16384
##$SIGF1= 3
##$SIGF2= 2
##$SINO= 400
##$SIOLD= 16384
##$SREGLST= <1H.CDCl3>
##$SSB= 0
##$STSI= 0
##$STSR= 0
##$SW_p= 3612.71676300578
##$SYMM= 0
##$S_DEV= 0
##$TDeff= 0
##$TDoff= 0
##$TI= <>
##$TILT= no
##$TM1= 0
##$TM2= 0
##$TOPLEV= 0
##$USERP1= <user>
##$USERP2= <user>
##$USERP3= <user>
##$USERP4= <user>
##$USERP5= <user>
##$WDW= 1
##$XDIM= 8192
##$YMAX_p= 0
##$YMIN_p= 0
$$ End of Bruker specific parameters
$$ ---------------------------------
##NTUPLES= NMR FID
##VAR_NAME=  TIME,          FID/REAL,        FID/IMAG
##SYMBOL=    X,             R,               I
##VAR_TYPE=  INDEPENDENT,   DEPENDENT,       DEPENDENT
##VAR_FORM=  AFFN,          ASDF,            ASDF
##VAR_DIM=   8192,          8192,            8192
##UNITS=     SECONDS,       ARBITRARY UNITS, ARBITRARY UNITS
##FACTOR=    0.0002496,     1,               1
##FIRST=     0,             0,               0
##LAST=      2.0444736,     0,               0
##MIN=       0,             -90638,          0
##MAX=       2.0444736,     48277,           0
$$ Real data points
##PAGE= N=1
##DATA TABLE= (X++(R..R)), XYDATA
$$ [...]
1876A11j76O5J33k84L63j72l04p8R24q02j12M90j56l25N86j72n95J43L55j05m5
1897a56K78k78l20K71L10o30N21k04j04L76l12j8K49j08K0k01L00j83k8L48m33
1918c02J35J17j45L7J55p7jk90L17Nl25N40l9k90J67L01l02j11J64K2R7M8R4k67
1942E0N3J44Mjj11J42P4p4JqR4l15r0J73P9j2n2K39j50k9j99j9K60j11j38K62
1968B66j50J45m21K37J63k60k54K98j21l91M64P3m7L4j92j9j36J06K8L19k53l20
1990d31J58J11j24J05j50P2P5J91k39J7L9j41m1J07K7q2J49K1K8p6K17j92j56
2013c15O1J88J10k19J45R3J35m6L6o9K6M2p7l66K50j81M28N1j4Q9l4Rj29M9L4
2038B96k25O9R6J69K5l56O9Qk42M22k90K96J71k58r6q6o4K62l09l7K10k5k03K03
$$ y = [111, -65, 0, 133, -151, 212, 40, -264, -342, 582, -220, -332, 158, 2, -323, 263, 91, -504, -361, -6, -111, -156, 122, -156, -476, -205, 105, -525, -4, -208, -312, 64, -248, -266, -17, -125, -105, -306, -6, -189, -217, 131, -302, -167, -50, -195, -158, -3, -80, -81, -371, -54, -49, -374, 166, 127, -163, 4, 305, 3, -108, 56, 78, 175, 223, 317, 50, 103, 247, 251, 250, 139, 281, 355, 281, 282, 274, 368, 53, -37, 136, 215, 203, 151, 390, 240, 211, 12, -7, 253, 142, 4, 266, 116, 261, -160, 77, 240, -20, -274, 24, -97, -488, -24, 49, 2, 36, -156, -175, -311, -205, -177, 142, -111, -431, -273, -162, -286, -181, -331, -259, -184, 7, -232, -215, -176, -317, -358, -251, -224, -306, -157, -136, -108, -184, 33, -159, -315, -254, -66, 44, -175, -30, 63, 198, 152, 188, 119, 145, 187, 110, -256, -6, -187, 241, 292, 278, 367, 333, 342, 213, 262, 296, 71, 140, 236, 405, 430, 74, 143, 151, -91, 331, 41, 337, 508, 250, 154, 68, 4, 266, -43, -80, 130, 105, -98, 105]
2062A05l31N0J21J5Pl2K12l20M08k67P0M9j36j2P8k7l78k4J59P2O9k82M58k28
2086a64k16J18k4pn4J77J14j90kK55k22k1J94p5p9p3O0r9K13j39J93j56J83j65
2110a79j26N46m20K38o5J5m2j47L47q4J46P6k19o5N7o5OK97J82n51N34l00n1J31
2134B61j7J6k35N57l68j16k08J30k16L10M81p65J78L43k94j57K72q2l56J28K15
2155G7k88K44K14m04J83J2k46L8L74j81j67j47L78j22j34M92n36K35M7p9j40l1
2177a81j66l07N65j38J07K7j70J9L63j27j72M2m1j26Q8L33l27M13j89j90J28J70
2199A21K00k72L8P1m51j39P85j50n13L79j37K80q4J05l27L65J84l79o1J61Jk60
2221h3L11N3NK40m87l84M13O11o99p3K63k15J03K11J39j95j15J71k61j9KM11k32
$$ y = [105, -226, -176, -55, -40, -33, -65, 147, -173, 235, -32, 38, 87, -49, -61, 17, -10, -388, -412, -253, -181, -112, -394, 64, -164, -380, -262, -286, -293, -347, -170, -56, -246, -248, 7, -215, -236, -42, -117, -196, -269, -209, -308, -95, -234, -41, -197, -14, -179, -305, 241, -179, 59, -6, 9, -33, -180, 167, 83, 229, 305, 86, 21, 78, 13, 19, 316, 498, -53, 481, 181, 130, 261, 244, 260, 25, 582, 214, 98, -110, 20, -196, 114, 595, -170, 8, 351, 57, -100, 172, 90, -266, -138, 77, -211, 33, 247, -157, 26, 38, -208, -170, 204, 23, -144, -291, 87, -35, -169, 323, -213, 22, 69, -10, -150, -181, -347, -654, -89, -227, -120, -93, -263, -244, 119, -8, -180, -138, -179, -305, -217, 116, -211, 202, 13, -177, -49, 121, 321, 49, 87, 158, -293, -432, 353, 203, -310, 69, -68, 212, 128, 233, -94, 271, 455, 76, 15, 176, 177, -83, 228, 281, 286, 526, 39, -345, 68, 679, -20, -93, 170, -45, 58, 269, 408, 213, 98, 269, 8, -11, -9, 402, 170]
2244A70k12k34ON41l70k86J62J97k20K66j3j38k42K92M0l64M96K6n89L36J05k10
2266b41J49o9l14N17k30j86J42L56n89n9M92J25l49OL43o86L87J97n4m5M28m80
2288a60Q5K56J46l09K50j96k17N78j69m09J58K12k21j46M32k07m1J60j26q1L44
2309C39M1m82K36Q0k82O9L76qk13J16rl65L79k10l40K30L51m48J26J66n4k81K05
2332B2K29l88K33p3l79J68M76k73l41M71m91p9O59k40o3J85J37p21K38K53l78
2353c55q0K46o8o6L37j83k13K68j51j08K41Q8q2l10L13K5k60J64K64l45Q4J83
2375hk76L21J28l67r6M42j29j39K62n6k41P3p1J9K10%Q8k88J62Q6N5j61J85l19
2399a20K46K69m36l9K69k86K71L1Q2m99L58K66n79K91K43n79L86Q9l03L0M15k82
$$ y = [170, -42, -276, -270, 271, -99, -385, -223, -26, -246, 20, 7, -131, -373, -81, -41, -405, 91, 117, -472, -136, -31, -241, -92, -161, -475, 42, -188, -374, -232, 124, -465, -524, -32, 93, -256, -250, 93, -593, -206, -9, -63, -108, 320, -160, -75, 181, 327, 18, 268, 72, -145, 433, 264, -145, 13, 225, 4, -142, 290, 83, 42, 202, 76, -5, 339, 380, -102, 134, 214, -68, 1, 377, 369, 156, 272, 263, -102, 277, 67, -273, -43, 308, -140, -14, 152, 98, -183, 22, 251, -137, 96, 23, -356, -188, 288, 15, -326, 145, -346, -425, 234, -6, -69, 116, 253, -468, -230, 23, -355, -435, -189, -257, -323, 14, -169, -382, -114, -265, -373, -132, -44, -126, -436, -123, -98, -358, -194, 70, -275, -191, -8, -284, 37, 165, -202, -298, 144, 15, -124, 138, 82, -159, -86, -157, -138, 72, 72, 160, -128, 34, 120, 175, 14, 199, -120, 126, 395, -41, -80, 189, -97, 174, 205, 287, -212, 146, 412, -167, 124, 367, -212, 174, 263, -40, -10, 405, 123]
2421A23k20J41K4o2p3N1P0j26j7R3k83K55k21o8m8L83j24k6M8m6n7J05Q9l05L69
2446G5m01O7L5q6J87J64L3k26o3K9K00j96q9P3J75Q5r0k12K86j29J05N9J47j83
2470D5n9j53J32M7k7j29J28K6Q4m2l9J28n8j23L12k51J05K00j75j20J54mJ07k60
2494B8L7Q0q0L40j01k63J70j08P6R4k06K9J16J53l05j08M40j00k00L8p7j7j46
2517a10K88m14P8J99j10n1K81l54R9J41j10r8K78l35PJ33j66p5J43K08l66J22
2539b12j3LO2J22j44N2M2%j52J10K6L96l38J61l13N0M9l4L81k65j19k09K51R2
2563bn8j44L09k72J17r0L64k13o5K98k45J81l1k1Mq1K85j94M9J32p9l6j18J70
2587B60m11J84L11j60j2l2j18j3K7j22J99J61l28J47q0K13j06k19n1o5K00L07
$$ y = [123, -97, 44, 68, 6, -67, -16, 54, -72, -89, 4, -279, -24, -245, -313, -361, 22, -102, -128, -80, -126, -183, -78, 11, -294, 75, -326, -259, -224, -310, -123, 41, 74, -152, -215, -186, 14, -182, -271, -198, -23, 62, -28, -240, 46, -83, 22, 81, 228, 45, -14, -167, -35, 12, -15, -144, -16, 10, 94, 52, 13, 141, 83, -40, 272, 21, 126, 326, 151, 31, 185, 181, 288, 28, 65, 145, 65, 405, 304, 41, 211, 103, 179, 273, 67, 96, 212, 365, 60, -48, 392, 292, 92, 130, 53, 36, -110, 178, -236, -158, 41, -69, -120, 161, -193, -94, 47, -63, -161, 117, -218, -211, -78, -244, -319, -176, 32, -334, -212, -225, -222, -160, -38, -182, -130, -88, -88, -240, -130, -104, 292, -46, 115, -198, -148, -99, -133, 248, -17, -136, -345, -94, -2, -60, -204, 105, -167, -50, -140, 224, 11, -54, 244, -1, 180, 149, 128, 132, 51, 336, 142, 191, 323, 244, 208, 90, 260, -151, 33, 344, 184, 172, 140, 22, 9, 36, -86, 113, 274, -54, 93, 13, 226, 120, -99, -150, -215, -15, 292]
2609B92m60K97n9j72k35J47J25o8P3J4k24J80J9k02LM6k7rJ04N6M3Jo5r7M27m29
2635b20M7L7J14l04K32L1j06Q5J57J3k30L75m61M08K9k38j51J85K45m06J98J5
2657E5P2j45K14k92K63k09L75k52p2K66k17n5K95l19K93k34j16J55%L34k40J20
2679B91j28P2J0k49O8M7k40K19j09oR3Pj58l7jR0N8nk88K09j43J14K15Q5l96K02
2705B0K5M9j27k10R3j78j25K67J50j87j56J24j50N55l80K5oJ0L11m29L16l69K85
2728h7M6m78K71k3J36m7L6K8R4j4k16K01q9K13k07R0Q0p7J40K16l51K05j59R1
2752I9k14M53k92J33q2k60K33K01j39j87N5K78j78J80N5m53L26j00k59MM74k27
2774A00j46Q2J04j88j02M52m36J34K09r5J30j1k28r3J71Q7n61N96m02ML66P5l74
$$ y = [292, -168, 129, 70, -102, -337, -190, -65, -133, -60, -46, -270, -90, -71, -273, -270, -224, -251, -260, -156, -100, -57, -56, -121, -218, 209, -220, -173, -136, -22, -326, -94, -63, -169, -84, 73, 86, -144, 231, -230, 178, 207, -31, -182, 3, 248, -158, 40, 55, 127, -18, 196, -96, 167, -42, 333, 81, 9, 275, 58, 3, 298, -21, 272, 38, -78, 77, 77, 411, 171, 291, 163, 235, 245, -4, 64, 111, -129, 90, -19, -25, 68, 75, -83, -120, -121, -31, 27, 22, -266, -57, -200, -86, 129, 214, -182, 20, 45, 94, -33, -243, -150, -328, -453, -186, -36, -223, -379, -255, -405, 150, -230, -205, -211, -201, 110, -319, -3, -372, -87, -41, -519, -248, -271, -135, -182, -146, -118, -24, -38, -254, -53, -142, 71, -136, -46, 34, -43, 97, 313, -38, 167, 8, 99, -115, 338, 46, 179, 97, -163, 70, 271, 132, -55, 0, 278, 100, 280, 335, -118, 208, 108, -151, -147, 327, 100, -46, 36, 140, -48, -150, 302, -134, 0, 209, 114, 244, 233, 5, -88, 83, 170, -391, 205, -197, -193, 173, 248, -126]
2797a26l52L00Qj27K92J72k23l26L17l15K84K9m4Q8l33K39j8K52j75j84J15l5
2819a62K37j26O6q3n68P82k08J0J53k18rn8K95l05K67K33n37m3L96J06l92N93
2841D29n06k79N64L67o91J32J67l53K1L15J52m15P7J32l85P18M2k75l97N53l32
2862C6m3N41l35l23K77J7l66L04l2k22J10Q5j63K7M41j94m73m6L40j19p5L57m54
2885c10N5M05k55j07L78n81M2L42K76n92J46L16m01J1L81l69L7mj18O7K48J70
2907A37p12N05r1m25P73mm24J62j63L25r6K14k47J52j7n9q6K26K2k78Q7P9O7q1
2931F6J52o2k28J13K91l93K98rm96N14j03J42K6k84j70J15K84j88P0J2j53o9K8
2954d4lL88l07j4J54j83J21J50j05k16P0l8R1K76m44j49L09j82L05j34r4q7J6
$$ y = [-126, -478, -178, -170, -297, -5, 167, -56, -382, -65, -380, -96, -67, -111, -23, -356, -117, -135, 117, -58, -242, -127, -162, 75, -51, 15, -68, -636, 146, -62, -52, 101, -117, -126, -184, 111, -194, 73, 306, -231, -274, 122, 228, -164, 429, -77, -356, 208, 575, -116, 16, 183, -170, -149, 166, 318, -97, -20, 112, -273, 445, 487, 212, -185, 368, 36, -7, 534, 199, -124, 153, 170, -196, 108, 76, -146, -36, 49, -114, -87, 354, 160, -313, -359, -19, -138, -213, 144, -310, -255, 150, -105, -212, 166, -415, -373, -31, 245, -347, -201, 115, -286, -275, 106, -263, -226, -230, -348, -281, -33, 137, -575, -70, -161, -586, 187, 183, -241, -79, -242, 83, -13, 201, -46, 106, 89, 30, -56, 170, 192, -86, 1, 80, 147, 66, 218, 156, -72, 41, 332, -61, 237, 228, -268, 246, 143, 285, 311, 27, -143, -28, 256, 68, 138, 150, -3, -72, -44, -47, 341, 34, 20, 174, -9, 112, 262, 157, -59, 11, -27, 64, 340, -104, -253, 56, -126, 179, 45, -49, -136, -120]
2977a20J05j11k7J18J24k69K09j45m9J12r2j91J93p7J11Q1j65k07KM39j06j46
2999b11J77k7P7o8K2nQj6j89mL68K06l13P9Nk01J83L5j05K02q3l75J74K07k29
3024h3M7J62p3l2N2n4P5K16j23j13K08R5j89k11L33k41M7k39K90J04M1mm11N47
3048D44k17k87J95k40M12k84N5N0k19J44r6J5J83j82kn9N9j27P2J8K53m98J50
3071a61Q9k62K70J10j94l1j42J61K56k20o0K86l19l6NJ00J98l43K33j13J83j28
3093a18k2J55l27K18J67K5K1K8N7J1r9o4J34k95K83J98k89k22J60Q8l7J6j09L05
3117B84p5j39q4J51Q3l12J89n3N0j41J76jq7Q1L9mj77r8J10K66o9k43J32Mj30
3142d8j4K32N5k24J0p4R6j34J91j33N0k1J93j01o2k04R6k00K30k4k14o3K33Q8
$$ y = [-120, -15, -126, -153, -35, 89, -180, 29, -116, -165, -53, -145, -336, -143, -220, -109, -28, -193, -400, -398, 41, -65, -211, -34, -61, 16, -52, -30, -35, -27, -43, -232, -236, 132, 338, 25, 104, 109, -92, 91, 126, 21, 223, 140, -235, -61, 146, -83, -36, 126, 53, 21, 73, 19, 94, 310, 187, 74, 282, 377, 188, -23, 310, 69, 116, -123, 167, 271, 312, 308, -103, 444, 227, -60, 135, -105, 307, 23, 78, 128, -91, 53, -43, -28, 155, -27, -29, -88, -29, -156, -84, -66, 187, -311, -161, -72, -334, -64, 46, -148, -179, -321, -160, 96, -124, -184, 102, -217, -253, -248, -148, 50, -293, -60, -173, 10, -118, -140, 15, -312, -94, 73, 98, 119, 147, 204, 215, 116, 52, 186, -109, 174, 372, 83, -139, 21, 109, 72, 88, -21, 284, 209, 70, -14, 137, 220, -92, 97, 44, 94, -47, 129, 128, 41, 122, 161, 157, -20, -118, -8, 258, 189, -54, 78, 82, -48, -62, 170, 225, 1, 11, -63, 33, -101, 90, -43, 7, -14, 179, 78, 16, -188, -92, -292, -62, -86, -300, -363, -130, -42]
3166d2j13j3Q2j06O0j56J01L60n63K36Lj16M06n15K04M7R5k03J46J46j32N4K05
3189A86l95J18J47j8k08M85k67R3Ok31K46k1j60J04J62Qm77M68J02l03J52M8q0
3212A65k03M8r0J99R7j06j44m9L16r0n6J52l03K62m3l1K33m20K50r6J98j33j00
3235E6j7J62l09j49L12m1k34L79k1n18O75k50l20M90k61l37J97M3j02j08k47M72
3257a28k49K54J57l93K21Q7K6j43j53J63P3J59q9J29m36L26n9j29M15p8l90r3
3279c30K00R9nK33n3k05J57j72J17J00k85J03K08j64l9M5M8L3N7J51m45P21l56
3302B18k76M18k55L2j44J56N3j38K05J19m37L10j60j28j96M14j91o0J35j44q0
3323a49J71M04l67o6M17n87k8K75k97J35K2k93K20m9J34k31K53J95l12P4J53k23
$$ y = [-42, -155, -168, -86, -192, -132, -288, -187, 173, -390, -154, -151, -267, 139, -376, -172, -125, -30, -233, -87, 59, -73, -19, 186, -209, -91, 56, 38, -170, 315, 48, 141, 147, -84, 162, 141, -19, 85, 247, 255, -222, 246, 348, 45, 197, 245, 165, -38, 10, -80, 119, 216, 110, -34, -83, 233, 143, 87, 239, -64, 198, 155, 124, 357, -63, 187, 91, 289, 156, 56, 39, 201, -108, -257, 55, 14, -220, 159, 138, -380, 295, 45, -275, 215, -46, -383, -186, -143, -245, -353, -600, -128, -377, -123, 34, -359, -138, -51, -25, -168, -321, -158, -85, 74, -15, 114, -322, 4, -55, -184, 231, 153, -237, -330, -130, -31, -36, 197, 144, -61, 96, -76, 41, 141, -144, -41, 167, 3, -36, 9, 57, 90, 147, 298, -147, 574, 218, -58, 360, 105, 137, -7, 149, 202, 64, 269, 388, -49, 261, 101, -27, -223, 191, 0, -60, 75, -69, -149, 22, 426, 59, -7, 410, -177, -205, 70, -227, -92, -70, -363, -143, -192, -58, -289, -36, 159, -153, -79, 74, -149]
3345a49j65j27L43l7K28J7n16J63J49L3j25R3R9l26K94P0l37L80j99k9M16k77
3367bp4K31j17k6j55M30j93m17M68k07M4J59J01j87J5J24j67J55N8j34N9j34k7
3390DJ33J64lr6o5j68L39j19l3QL1O6m6k05P9M1k84J71j04J28J74J19o60L79j59
3415a06J54j58J01j49NO4J64k97L19n9k90K0K65p6p3r1k06J41J5J92N0m2J67m14
3439c04J19L99j42n61O33k91k91M68J77j28l68L85k54p4O11l60k49l2K96o7J57
3460A24J26l03l78O02j30j48M58m12P3o2J47N9K44j37j87j57K89q5L59j61k08
3481A13Q2R3l49Q9K12J41o23N16q9j49K00k48j36q0M14l6j59K32k7k17R9j90J54
3504D2q6j0j37J03J65j51o9p5M32l50J57J41n68M9J16Q0J29k6j02R1J21k60k35
$$ y = [-149, -314, -441, -98, -135, 93, 110, -406, -243, -94, -61, -186, -93, 6, -320, -26, 44, -293, 87, -112, -141, 275, -2, -76, 155, 38, 12, -143, 287, 94, -323, 145, -62, -18, 141, 242, 55, 70, 194, 27, 182, 240, 106, 165, 31, 4, 137, 301, 298, 202, 137, -31, 308, 189, 156, 164, 195, 261, 215, 10, 89, 130, -154, 17, -87, 41, 215, 334, -326, 53, -106, 48, -110, -9, -158, -153, -89, 75, -222, 97, 38, -252, -232, 33, -43, -116, -207, -413, -272, -257, -65, -15, -57, 110, -304, -185, 214, 72, -489, 144, -147, -438, 30, 207, 79, -289, 96, -158, -232, 379, 19, -230, -262, 34, -33, 124, 250, -53, -431, 171, 41, -107, 351, -61, 12, -50, 97, 156, 400, 263, 76, -81, 208, 123, 482, 321, 113, 195, 288, -61, 28, 240, 381, -242, 274, 185, 36, 236, -12, -148, -228, 186, 150, -9, 223, 196, -21, 78, -112, 42, -44, -54, -191, -88, 77, -74, -143, -218, 214, -136, 21, 162, -406, -357, -241, -161, -32, -58, -160, -69, 52, -208, -443]
3527d43M32J11m99L55j53L4J64J40k87j23M71k44j21Q7P7k24J12L06j32j98M17
3548B82m37J56J23j52k00O59l87J4k32L93R0n66L00j92O0M04p1l47q8M45j97J1
3570F8j1Q8N2k71K29m8J83j29M2j77O3k15N1M39l43q4K66l2O8J4l43L1L00k02
3594C9k5J90j52R4l0J44m33l8K22j85J83k29K85k52K22j23l12K97J87l61J09k
3616a70J43k72J47Q3l2j0j71Q5q7K63J99k40j93M05l05K13k65K22j87J15J8K57
3638B18k59r2L05l34R4K70j27J04k29K21l12o2K15R6k48j0R9M27j27j42N1j25
3660C3%o4O7J87J14j40q7K50k46j83R5p7o7J29l3m1L63l44N4q1K52k2j60K67l13
3685d7K99m67J57K8R1J12m38p3K66J42k53J54k33K36r7Q6qp9K10m19k5J48J36
$$ y = [-443, -11, 100, -399, -44, -197, -163, 1, 141, -146, -269, 202, -42, -163, -76, 1, -223, -111, 195, 63, -135, 282, -155, 1, 124, -28, -228, 431, 44, 58, -174, 219, 309, -257, 43, -149, -89, 315, 244, -103, -191, 254, 57, 68, 57, 145, 197, -74, 155, 107, 290, 161, 203, 26, 89, -126, -75, 364, 21, -63, 203, 171, 239, 253, -90, -59, 241, 39, 14, 204, 52, 146, 116, 260, -173, -211, 11, -174, 9, -220, 65, -187, 35, -88, -400, -103, 84, -277, -168, -170, -27, -299, -152, -69, -101, -111, -282, -197, -284, -21, 178, -62, -255, 150, -155, 58, -207, 15, -172, -57, -39, 218, -41, -133, 172, -162, -68, 202, 75, 179, -50, 171, -141, -203, 12, 108, -140, -150, -51, 376, 249, 107, 158, 33, 33, -31, 36, 223, 337, 197, 110, 360, 114, -69, 26, -51, -118, 11, -22, -63, 300, -44, 10, -71, 181, 159, -1, 266, -47, 252, -215, -58, -30, 61, 173, -265, -338, -72, 70, -183, -29, -262, -26, -123, -37, -45, -124, 86, -333, -358, -210, -74]
3708g4j26J89k44K97k09P3k7J36j56K30k82L68j89o3m9J9J35N3J07m62J69R0O3
3731D8Pj36r8J10L6J04k77K40j62J96j29L61j89L18l72j81M70j62j37J22K6Pj40
3754F2J98p4J45l35K21k26p9R9j14J82n3k04J86J98k46K01q3Q5k08K0K17k72j7
3777i7J92j15J90k16k0J57q9J75k41K00o8j1k93P7q1J07N5j39j18J29o8k75N64
3800A5O6j07l8LR3L0k07j63J57j05L90j47k92L12K64m01j33K11O4J20qk42K08
3823I0jj03mP1J57m23K90J28k67K01L08l58rJ66k28k0M36m45L16k42J60o4m1J34
3847B52k88J31q5q3L69N4k96K26K3m57R1K58l49J60O1n6r6l8j3L88l86O7K44k86
3871a09R2k09l1K39j21o7J30K28l51j04K10k51J79q9J66O5j59j2j9L1O3l43J90
$$ y = [-74, -200, -11, -255, 42, -167, -94, -121, 15, -141, 89, -193, 175, -14, -77, -126, -107, 28, 81, 188, -274, -105, -15, 48, 55, -81, -179, -69, -33, 71, -206, 34, -128, 68, -61, 300, 111, 429, 57, -124, 346, 184, 47, 169, 195, 202, 62, 260, 186, 331, -4, 217, -9, -88, 11, -103, 79, 26, -178, 8, 206, -40, 161, 78, 163, -45, -25, 192, -80, -97, 95, -20, 170, -46, -66, 91, 2, 177, -64, 136, 68, 57, -236, -159, -240, -133, -78, -217, -335, -206, -274, -549, 15, 81, -26, -64, -61, 32, 62, -145, -308, -151, -256, 134, -13, -305, 7, 271, -130, -263, -52, 12, 132, 124, -118, 90, 89, -14, -18, 53, 210, -213, 77, 205, -62, 139, 447, 89, 80, 246, 18, -2, 434, -11, 305, 63, 223, 159, 118, 252, -36, 95, 10, -73, 296, 350, 54, 280, 303, -154, -63, 195, -154, 6, 67, 11, -85, -123, -136, 252, -134, -67, 177, -109, -17, -226, -257, -18, -139, -206, -76, 152, -199, -303, -93, -344, -165, -254, -88, -23, -182, -194, -213, -182, -119, -462, -272]
3894b72j3k1K01K44oj14j5j37K23R5o1q4M7kj34n7L82l14j54M56l02K34j66O0
3918I0J1k19K98j40O5L10m25o9K38p6j46M93k46k00J11O5q1o7J22j09k27K94L12
3941D04l86M68n14j78M75r2m08L89o0q9q7P0R5K4M0o6k98J25K64m82J22j07q6
3964c77L00k9L99p35K66L62l92J41J07m72L30K29r0K7l70JJ95L5K13l06l7J45
3986e8k55J90L09l68m4J1P2k2K32O6j97q1K48N6j25L40m7j85n7jk91K77N3j52
4010b9K79k18k14N43l52J63p8J14k15j88M37j21k89L25k18M17n70M53l03J56M1
4031A33K08j33Q3j71l03L34r1J46o02L43j15O8L66k98q1j79K89Q1k30L11j70L0
4053A9l4k47K34R2j53j52L41l98q4K91j49j12J2M11k93MJ6M8J53l0m2j07J83j82
$$ y = [-272, -285, -306, -105, 139, 133, 19, 4, -133, 90, 185, 124, 40, 87, 85, -49, -106, 276, -38, -192, 264, -38, 196, 30, 90, 101, -118, 180, 40, 105, 415, -10, -79, 159, 83, -63, 430, 184, -16, 95, 160, 79, 12, 134, 25, -202, 92, 404, 18, 486, -28, -206, 269, 177, -231, 158, 98, 9, -78, -8, 87, 111, 151, 85, -213, -88, 176, -306, -184, -291, -377, -77, -106, 293, -442, -176, 186, -206, -65, 42, -430, -100, 129, 39, 66, -304, -303, -108, -73, 140, -166, -203, -58, -313, -123, 186, -182, -226, -215, -143, -165, 67, 133, -64, -145, 103, 159, 34, 374, 327, 142, 85, 84, -207, 70, 123, -29, 250, 32, -182, 361, 9, 172, 94, 208, -7, -195, 242, 121, -168, 157, -61, 356, -214, 239, -64, 92, 133, 341, 208, 291, 120, -183, 151, 60, 206, -396, -53, -168, -100, 266, -32, -113, -292, -3, 78, -152, 159, -11, 19, -15, -262, -28, 64, -89, -241, 100, -298, -382, -91, -240, -352, -340, 71, -222, -218, -202, -154, -1, -31, -73, -180, 3, -179]
4077a79o3K20L6k20M68k73l40K79L85j0n23L54l4k47K34m8O4j89L01l83J05K11
4099A48p7N5p9l9K6K61k99j43J69pm4rM28k27n3K15j37l89K1N29n03K15Q8m6j55
4124e2N35m99M2K63k96j18K66m0k16N3K53M1m05K55j34O0r2p6n8N11k07l02J07
4147a09J90k01Q1J08l09Q5J61nj65n0R7p4K32j80K6J68j15l4k33K34j13J2j3N4
4171a53K15k6n7J26j48L44j45k96J57N1l4L6k13R4J06M2r2J47j29J61J65k04M7
4194A94m56K50J91k97K92j00l46N01m1j97K70k78K67k52K43k56p0J66rj90p2K96
4216A06j71L13q4j65k6K06j74J95J24n28m5J70M69o35J18R5k62J74Q7o5m3j00
4238b41K7J50p1N1j5M0l3K00k65N9J65P0l31L03k33k04J70KP4J24l25L72l9k53
$$ y = [-179, -242, -22, 14, -206, 262, -11, -351, -72, 313, 303, -220, 134, 100, -147, 87, 39, 103, -86, 215, -168, -63, 148, 71, 126, 47, 8, 34, 295, -4, -147, 22, 15, -29, -38, 390, 163, 110, 325, 188, -201, -180, 349, -154, 61, 149, 103, -52, 483, -16, 26, 289, -7, -125, 141, 101, -115, -62, 191, 232, -173, 82, -52, 8, -84, -160, -218, 293, 86, -216, -109, 81, -120, -39, 69, -240, -155, 6, 1, -164, -214, -117, -191, 41, -139, -113, 55, -60, -94, -327, -93, -206, -194, -207, -153, 62, 36, -21, 105, -43, 301, 156, -140, 17, 68, 34, 70, -143, -49, 57, 99, 7, 154, 25, 186, 351, 147, 194, -262, -12, 179, -118, 174, 74, -272, 229, 188, -9, 261, -17, 250, -2, 241, -15, -85, 81, 72, -118, -190, 106, -65, 248, 164, -1, -27, 179, 5, 200, 324, -204, -249, -79, 390, -245, -127, -32, -294, -120, -33, -98, -141, -241, -214, -64, -135, -84, -99, -59, -92, 108, -157, -98, 67, 137, -194, 109, -124, -328, -158, -156, -82, 42, -283, 89, 50, -203]
4262b03J82n7J2j91K96J53j23k80L65n50J55L01O5j06J90K5j63r2J32J07j39P0
4284A49l26J27J63M0q6l5L64k56j56J69o9p1j25K30J05%j69k7j05J82l3lk3j79
4308a34m3L73r1j26o1N1k7p5N8j95K84L7k15N3K9pM4q5j03Q0J29K06k42k91K09
4333a42j1K32l13Q2J78k6j82P5J71k3JJ0j02j79M0J17j47q9K28n1O8K55j15k5
4357E2k99J01J87M0q5j8J99j7k34L31j07j22K6J71l7M5j12k1R9L4q4l4J6mm21
4382b94O08J01l48p8J89k61p4K58J05l7k40J72j75N31l46q3K1k12l0lK69l3O4
4405A04p3O0j14k9J27j62J72p7j46K18l48K13k21L71j48l9q5L40J6k89J8j70J96
4428f6j05j56L13J3n3R3j7j14j1j75M00j24O0j33K21j45j98O17o41L26j50P4L02
$$ y = [-203, -21, -78, -66, -257, 39, 192, 69, -211, 154, -396, -241, 60, 125, 19, 209, 234, 71, -21, 111, 218, 79, 149, -177, -50, 113, 153, 67, 32, 396, 140, -16, 153, 84, 13, -112, 118, 223, 223, 54, 27, -78, 104, 71, 68, 45, -134, -177, 196, 105, -21, -82, -31, -58, -133, -75, -270, 14, 51, -164, -111, -82, -89, -45, -130, -233, -153, -24, 182, -60, -351, -142, -153, 79, -234, -152, 26, 0, -182, -107, 64, 41, 42, 52, -50, -229, -189, -72, -219, -308, -80, -131, -63, 192, 77, 52, -247, -146, 41, 81, -4, -22, 177, 160, -74, 257, 150, 28, 54, 225, 188, 233, 121, 100, 199, 233, 149, 115, 131, 127, -294, 314, 415, 67, -11, 178, -83, -157, 101, 206, 169, -71, 101, -74, 457, 111, 28, 49, -163, -193, -196, 73, 40, 104, 31, 91, -23, -52, 75, -87, 85, 8, -138, 80, -268, -55, -276, 95, -53, -92, -177, 163, 179, -110, -92, -262, -66, -171, -327, -14, -1, -54, 39, 22, -92, -103, -278, 122, -2, 58, -75, 146, 1, -197, 420, -221, 105, -45, 29, 331]
4451C31l42J43j95J9L72m60J92r4j02qK41k1j03J66j39r5L15P0k35q5j8J12m4
4474B0j7J03L2K7K34k50K11q7k37J84j0j74j58L37k40J05j16m4j75J41m5J46k28
4497b41K33j30M41j41k65j21P3J61p6K69j63l80m5N96k66l03L60l46L73j20K08
4518A17k25J68o2k40K20j60K93j84K64l79J75K4K65m07j05J26k02K82M4M9k25
4539a62N30m47L47j85K01r7m42L75j17P2K20n26K18K56m02L28K3R9J10m14q1K15
4561A21K33l70J62j5ql0K0M4Q0m26J54j48J41j04N7Q0k11L30j3k79L53l37L27
4584A61l96L19o4O7k92n1J67J83J9l63K43l49J35K4Q7o7J85p9l2K04j16OJ3K9
4608C3q2P3o9K37l53o9K00m05N37j66j21J65J96m36K54R0j94jK6J79m9o7K61m88
$$ y = [331, -11, 132, -63, -44, 328, -132, 60, -34, -136, -144, 97, 76, -27, 139, 0, -95, 220, 290, 55, -30, -48, 64, 20, 3, 106, 138, 165, 399, 149, 360, 273, 36, 220, 210, 36, -122, 215, -25, 80, -36, -80, -255, -114, -159, -13, -241, -8, -138, 303, 162, -103, -224, -151, 10, -66, 203, 40, -340, -385, 211, -55, -358, 2, -344, 29, -91, 117, -108, 60, -2, -242, -22, -182, 111, -73, 191, -188, -13, 11, 276, -131, -236, -110, -312, -30, 14, 63, -162, 368, -79, 268, 83, 284, 187, -255, 120, 3, 75, 295, -231, -13, 243, -159, 169, 192, 291, 401, -13, -94, 121, 354, -16, 146, 131, 123, 93, 113, 157, 237, -189, -35, -183, -42, -146, -89, -9, -220, 110, 97, -182, 171, -166, 161, -235, 84, 20, 87, -205, -256, -89, 94, 113, -250, -7, -356, -221, -197, -110, -177, 8, -71, -103, 101, -15, -9, 4, 33, -49, 24, -45, 192, -161, -230, -30, -435, 102, -64, -185, -20, 176, -260, -6, 84, -110, -111, -85, 94, 45, -22, 239, -249]
4632b49J89P9P2j12r1o4K3K63Ol11N03l12K9K53j06l9j48N7R9n5l09L76k21L13
4656B45k01L5J2L48l31K66k37j64j15O2J70j22M4J75k14J60j83Pj28K41k7j75
4678a32J51j75k00j24L99O9q9K4q1P9O6k44J89P2j22J10j58K07r1J18l07J07K74
4701A42n13L92n0M3J8l55J84M90l68l1j06K56L5k12lJ16N4j5K1k80K30J10k8l9
4725I1k68K8o0L22k72L79J37k18j26J45j44N6J01k1M5k36P1NN9O5j29J74k92N0
4749c8MP3N3j91L27k47L87k68j10K58m04J12r7K85p8k65J57p9K01nR0n3m10K12
4773h6j6J57k63m4j67M65Q8j75PL9m06J77K79j64l7L32l28j03P3N2n1Q8L1n1j8
4798a21J6J68j80j45J3K40R2P9k34j6J90j35P7O6k16p2o3K21O8M6K23j47k00Q7
$$ y = [-249, -60, 19, 91, -21, -112, -176, -153, 110, 116, -195, 308, -4, 25, 278, 172, 133, -15, 42, 141, 86, -223, 153, -68, 245, 44, 79, 91, 439, 108, 374, 137, -27, -142, -80, 90, -32, 12, 187, -27, 133, -50, -43, -171, 70, 43, -132, 19, -156, -356, -480, -81, -12, -101, -77, -158, -79, -13, -257, -68, 4, -118, -8, -166, 41, -50, 68, -239, -132, 142, -371, 21, -29, 14, 32, -323, -139, 351, -17, -48, -154, 102, 137, -75, -78, 38, 92, 77, 98, -182, 48, 158, 130, 91, -177, -149, -209, 113, -159, 220, 357, 139, 13, 158, 14, 70, 171, 150, 195, -41, 30, 35, 94, 159, 30, 204, -88, -38, -34, 39, 92, -99, 228, -19, 368, 100, -10, 248, -156, -44, -141, 144, 66, -199, -42, -121, 80, 75, 165, 112, -298, -86, -102, 55, -208, -252, -419, 46, 134, -41, -34, 5, -401, -224, 55, -109, -146, 186, -142, -245, -172, -120, -171, -83, -52, -103, -121, -105, 63, -117, -262, -249, -9, 83, 162, -72, -88, 102, -33, 44, 110, -106, -178, -241, -20, 48, 94, 317, 170, -30, 57]
4822E7k7J07k5j29J14j0J5p6j04j4J1L57j75j88Q3J84k08K6q7J14Q1j8o8l9k0
4847c9Q5P4l70K05L93k34m6l2j32J83j94J32j1r1j90K72L1J10n4j50k8O0R4p1
4871cl40J99L89n40J21M3K47r0k9l15L49j43R7J8k52K97j63O2J72K6j0j9k20q
4895a12j38L80J4k69l5J10J00M8o6M2p0J48k0K00l60oK4J56P9j28J09j88j36K16
4919I8l2QJ23J27k76r4J69R8k89M38l05q9l8N4n5J18k39K93K10m45K48J9k15N1
4943b3K32j11q0n2K00n14J79K4k0j01P5K39j80N3J20j42J83k40J59j57K43k54
4965a67o1J42j20L18j05q0j32L05j30J04J00j60k35p3M84N5n1j65K36q2m01K89
4987G1j24N8r8K78k06JK0l1J75k31K69m2m30M07r1J60j83J37J43l47j02K48j0
$$ y = [57, 30, 137, 112, -17, 97, 87, 102, 26, -78, -92, -81, 276, 101, -87, -4, 180, -28, -2, -89, 25, 106, 88, 20, -19, -39, 46, 120, -250, -45, 348, 114, 68, 36, -96, 87, -107, 25, 14, -77, -267, 5, 36, 146, 92, -58, -86, -26, 68, -3, -343, -144, 245, -295, -174, -131, 116, 26, -3, -318, 31, -112, -15, 3, -249, 48, -115, -53, 119, 145, 135, 116, -104, -112, -250, 130, 144, -125, -160, -50, 50, 98, 32, 74, 4, 152, 132, 332, -28, -34, -10, 146, 225, 97, 206, 18, -118, 98, 66, 74, 197, 324, 48, -46, 123, 221, -68, 370, 65, -24, -62, -8, -63, 55, -184, 109, 319, -126, 122, 141, -74, -23, 209, 98, 18, -34, 166, -348, -169, -145, -165, -266, -191, 48, -132, -79, 41, -101, 82, -158, 1, -156, 87, -167, -228, -86, -206, 112, 7, -73, -205, 100, -30, 74, 174, 14, -221, -294, 190, 245, 194, 29, 265, 183, -218, 71, -53, 5, -93, 185, -21, -20, 0, -31, 144, -87, 182, 140, -290, 117, 26, 186, 3, 140, 283, -64, -166, 82, 72]
5010G2m25N22k6k22K02J76k61m9l6p3K08k57K71Kj33J36j39L88l72k12OK19k21
5033b24K12n1J55K5k28O5p0L99m07J5k8R8j41J96n9k7N3j44L01m12K16j12Q1k53
5057c40K45n3K08nl1Q8k68N68m06L2j95J2n0N86l36r6o5Q5j08K83O4l05K79j0
5081A82j99Q5O4j74j5q6N0J42m8J7j1k46J48j66J80J48J90k25m8Q2K8l07N52r3
5105B50l85K97o3N9j06pJK03L1j76K4k69K23k27K43p2p2L00j82k76K51MJ02k7
5129A26J7l55J03J25O9j3q3R4j60k9K7j65K06j05k1J35J20k3m3KL6l56K89o8J60
5154H8j21mJ08j06K38l19J0l0K97l82J23m9L3K04Rm6%J05k67r5J51J08Q7j72L21
5179B91m81K43N2j8q0J91l23J61L07k55p2J54j82J34p3K3j06L59m36J80m0K23
$$ y = [72, -353, 169, 143, -79, 123, 299, 38, -11, -47, -120, 88, -169, 102, 104, -29, 107, -32, 356, -16, -228, -222, -3, -224, -12, -63, 92, 117, -111, -46, -116, 283, -124, -109, -137, -39, -180, 16, -43, -70, -17, -161, 140, -272, -56, -168, -87, -340, -95, -148, 60, 55, 24, 112, -156, 412, 6, 38, -157, -145, -195, 391, 55, -41, -106, -21, -129, 154, 218, -87, 192, 182, -17, 68, 132, -42, -57, -143, -93, 49, 1, 18, 7, -239, -91, -257, -77, 71, 261, 36, -12, 70, 98, -209, 343, 250, -135, 162, 99, 158, 52, 45, 46, 249, 280, 104, 128, -141, 82, -145, 98, 26, -46, 254, 72, -204, 47, 51, 153, 126, 143, -212, -109, 16, 85, 72, -11, 83, -77, -106, -79, -244, -38, -143, -164, -29, 91, 68, 25, 27, 63, -293, -4, -72, 88, -33, -37, 71, -35, 203, -116, -106, -136, 161, -221, -98, -147, -114, 90, 99, 53, 53, 158, -109, -204, -53, 55, 142, -30, 291, -190, 53, 105, 87, 7, 198, -125, 36, 343, 88, 16, 170, -12, 122, 49, 72, -34, 325, -111, 69, 29, 252]
5201B52j16j06m14K68J72j0L85n42L78o8k17r5m3J71J83j48j35PJ52j11P8J42
5223A83lj96p1J14K4P9l42J82M6J38n8j86k43M18m26L16k4n0J6J3J65n5J10m96
5247c46J37J70qj20pK76r0ll7J3j17K84K9m48K18K33l2N1j97NJ05k9j12jK24Q
5273B06k54o1o2J51r2Q6J56p7j90L52j39Qj59mK3K11J02j14Kq9j43J06q2J29P6
5298A42pk37%N1J99k01K78l02o2nJ77p9L86l58j76J50j04O8j59R4j4K69l42L64
5322A32Q8l16j37L01k98M06k02m4J3J78k17R7M3j87j53K33R8J4p6j60P2J13N6
5345E4m42L26J01N3O2PO7j75k0k29J65M1k9N6K95n0j29M6j78j21M0L47l45R1O5
5370I8j41R6r4Q3L0o4R8L0k34L22l3k82R1P1m7R2l40K8J12L68m98J43K5n5J69
$$ y = [252, 136, 30, -384, -116, 56, 46, 431, -111, 267, 199, -18, -113, -156, 15, 198, 50, -85, -78, 74, -37, 41, 183, 180, -16, -87, 27, 51, 130, -212, -30, 16, 154, 96, -90, -333, 85, -341, -25, -49, -99, -83, -70, 95, 40, 150, -346, -209, -39, -47, -167, -174, 102, 12, 9, -28, -15, -132, 152, 181, -267, -49, 184, 152, 203, 6, 11, 116, 87, -25, -26, 198, 206, -48, -109, -171, -20, -112, -26, 130, 53, -137, 215, 76, 84, -75, -79, -56, 155, 257, 143, 145, 56, -87, 19, -63, 66, 142, 135, -102, -102, -51, 148, -53, 225, -77, -139, -144, 33, -46, 340, -18, -194, -44, -148, -80, -239, -145, -159, 110, -232, 132, 220, -96, -233, 68, -230, 176, -26, -70, -57, 121, -96, 1, 44, -143, -296, -63, 35, 49, -27, -187, -115, -2, 54, -388, -62, 39, 92, 154, 161, 228, 53, 33, -196, -31, 10, -19, 37, 332, 282, 153, 199, 21, -100, -60, 287, -58, 33, 98, -43, 53, -41, 42, 72, 8, 106, 136, -98, 224, 191, -91, 0, 71, 24, 116, -224, -196, -84, 284, -214, -71, -46, -101, 68]
5395F8K56m92j44P9r3K34O4L3O3k7q5j77K90N4r3k53L55O4k31K21j53j75p1K45
5419C2kKn57K92L36j66o7j43L82j46P8p2R6O0l44J86j67KJ70J04p7M0k09L41k24
5444e3J76p9j44J9J97j30R4j80L94%j00q1o4p5OK26r8L0j84M3J42k51L70k08j96
5469a46J91L1k29K25k62J48J8m7K87k35j11K24P9m15L61j78m5K37l07L2p2pK39
5492A8p5J84k42J09j09p2M07k91o2J43J03l91J63J64k32L18k23P8M5J20k54J88
5514H9j56J16k25MJ34j8J32J18r1l11L24j07l6o7M9j13K69Q0k34l3L16l51MJ59
5538E2J52j77Q9O4r0L9j44O4K2L31j65k36J34j14J5L3r1Jr2J33R8k28L05k32K24
5563A87k50J15j47n2nJ36m2J8J22l03K78P3j34L27j26k09q0J89k62K19j60j21
$$ y = [68, 324, -168, -312, -233, -326, -92, -28, 5, 68, 41, -44, -221, 69, 123, 30, -223, 132, 196, -35, 186, 33, -142, -213, 32, 30, 32, -525, -233, 103, -63, -130, -273, 109, -37, 41, -31, 65, 125, -219, -33, -200, -198, -28, 76, -1, 39, -170, 171, -53, 123, 44, -100, -81, 116, -14, 80, -100, 294, 294, 194, 113, 49, -26, -20, 206, 108, 138, -46, -3, 139, -112, 258, 50, -146, 45, 76, -153, 72, -190, -42, -24, -71, 216, -19, -130, 94, 173, -242, 119, -59, -104, 133, -174, -142, -214, -221, 18, -57, 127, -115, -6, -115, -187, 220, -71, -133, 10, 113, -278, -115, 49, -183, 135, -88, -10, 35, 155, -99, 89, -67, 49, -176, -172, -38, -56, 76, 194, 103, -208, 116, 9, -27, -94, -45, -158, 111, 191, -43, -76, 240, -111, -107, 52, 204, 27, 116, 180, 90, 129, -15, 49, 71, 402, 237, 1, 135, 21, 36, 69, -22, -21, -113, 20, 118, -110, 195, -37, 187, -63, 52, -95, -147, -152, -16, -58, -40, 82, -221, 57, 130, -4, 323, 197, -12, -92, 97, -165, 54, -106, -227]
5585b27N0O3R4J89m2j49O1j51jK22J61j63k99o7K30j01J06j0p1K2j93p1N49j54
5609D8J4j97J49O5r8J45k52J41J67m96K05KN4r7N9K80J30n78JL64j99O2o0j02
5633a93R6o8L46J47j43j68M0j4L03l30J60q2l1J51k51m5J03K50j16k26P0Mk53
5656b50Q4K01j43R0J04l29M25n14M23O6N2j60K8kj95R3K2j83K68k76J76k17q4
5679c21M78n3j42k34j7N79n46J76K77k54p3N6K02l22J43k90K28M7j81J6J82J8
5701c1P5k9P2Q2k27K03k35qL25m52Q5L76P2k35O1n0R8m1l2j84K10j44MM4O5k33
5727a29L9J93p1j36P9j71N19k07p1L3m49M70k06K19j73K46l52J07J38j73j06L66
5749A65o9k72K47j85J54q2M8M5N6j47J02K36m35N8j82J79J36p7j71K61j62r5K58
$$ y = [-227, -177, -114, -20, 169, 127, -22, 39, -112, -113, 109, 270, 107, -192, -259, -29, -130, -24, -34, -105, -83, -276, -347, 202, 48, 62, -135, 14, 79, -19, 126, -126, 15, 182, -314, -109, -107, -53, -150, -91, 189, 319, -259, -258, 106, -93, -31, -91, -193, -97, -165, 181, 328, 185, 17, 57, 43, 346, 16, 176, 94, 63, 214, -37, -82, 21, 271, 155, -71, -1, 3, -250, -166, 35, -108, -18, 86, -243, 182, -332, 91, 157, 209, 49, 77, 75, -120, -27, -5, -188, 80, -196, -20, -237, -321, 157, 104, -38, -272, -289, 290, -256, -80, 197, -57, -130, -74, 128, -194, -51, -341, -113, -66, -247, -231, -49, -31, 44, 15, 87, 169, -58, 145, -90, -98, 227, -225, -140, 236, 308, 73, 134, 84, 182, 141, 109, -75, 135, -9, -5, 39, 104, -129, -90, 103, 32, -104, -25, -196, 323, 116, 45, 78, -371, 99, -107, 112, -61, 185, -167, -60, 78, -95, -201, 165, 96, -176, 71, -114, 40, -42, 6, 51, 107, -40, 62, 298, -137, -79, -261, -82, 54, -23, -194, 67, -95, -190, 68]
5772F8k12K32k93P5o4J33J33M1k49L01l84Kj16J71L49lj22j32L24j4j56l6l1J3
5796C0P0k47K07l52M02N7j98k7J83R6k16J39j28J41k89L90m22J84m3n3K32q9l26
5819b59K68L8J66j33k14L15Q2j32j80o8r1M1J08j24J57o2N3K6K70k66J46j7j9
5842A05j78j69J27k36L44k0R3k6l3J01Kj38r8O2P6k55K0K13r5k4LJ62m0j15K1
5867i8J49l90K31Q8n9J62k44P0L6K12m8k81L77j87mK4p8%P4q7nM7J5K7L6K37k99
5894EJ7j80J43m1m4m3K40j38K23jj90j51K30l63J70L48j8l47L89j60j49N7J15
5917A12j9k53K23j30O3J61K2p2m8j3o6N0k62K94j82J68P1n08M12k14P5N7l7p1
5941a67L21j54PP0j37M3J49l62K78J42l13j82M06j9J23Q0l10J0jj75j6J70q9J61
$$ y = [68, -144, 88, -205, -130, -194, -61, 72, 113, -136, 165, -219, -217, -333, -162, 187, 184, 62, -70, 254, 240, 84, 48, 17, 30, 100, -147, 60, -292, 110, 167, -31, -58, 125, 221, 5, 144, 16, 157, -132, 258, -164, 20, -23, -76, 156, 67, -259, 9, 47, 213, 80, -134, 181, 263, 131, -49, -117, -208, -167, -59, -183, -26, -88, -35, -9, 261, -5, 141, 124, 105, -73, -242, -115, -351, -7, -27, 66, 40, 7, 108, 110, -28, -126, -64, 12, -243, -223, -10, -105, -129, -126, 36, -4, -119, -98, 51, -339, -108, -20, -79, 83, -161, -91, -55, 157, 109, -172, 205, 18, 14, 38, -40, -40, 34, -53, -58, -11, 4, 31, 67, 304, 5, 22, -158, -15, -56, -100, -143, 97, -41, 182, 181, -9, -160, 70, -293, -123, 225, 207, -140, 249, 89, -60, -3, 112, 93, -160, 63, -67, -4, 157, 179, 107, 59, 46, -20, 30, -232, 62, -120, 48, 119, -389, 23, -191, -116, -59, -96, -167, 154, 0, 7, 77, -60, -17, 132, -230, 48, 190, -123, -305, 101, 82, 205, 285, -25, -15, -16, -191, -207, -37, -126, 35]
5965C5k67K36k18K17R1q9nK70r1o3K0j80J52k69J02J48P4j94J06k54j60O35l39
5988d3J01k32r7K51J0J99j59j11J06n4k00L18k41L31j98J18k9k04L46j15j31j21
6010a55M62l48o6Q7K70l77K8k3K58J44k94q9l5K59j85p4J60m9j00OM27l00k41
6033b35K98k24O2O2j8q6L3r1K38j85L84j63n1l2j03j34J76J7N0r0J62ok41J39
6057c8J92k32L76l87k2J02j4J27M8q8n9jk4j09k5L68k16J55k49K73m0q0l1j82
6081a56K75j49j16J06Q0K5q0j6J02R5k04K56k42O2j00m1J98k81L16j54k7M2J65
6104A56n18J80J0K65j35N8l14L37k0P0l03K09k33K59r1J85q1q7j44K38L4l5o0
6127b0k77K24J06L4j64j23J76J92j90j1K01j49l27J14Q8l9L84j85R9l20j16J71
$$ y = [35, -232, 4, -214, 3, 94, 5, 0, 270, 179, 116, 136, -44, 108, -161, -59, 89, 163, -31, 75, -179, -339, 296, -43, 58, -174, -271, -20, -10, 189, 30, -81, 25, -29, -229, 89, -152, 179, -19, 99, 70, -134, 212, 97, -34, -155, 307, -41, -107, -20, 250, -127, -99, -122, 136, 280, -14, -103, -138, 121, -64, -138, 22, -27, -127, -121, 306, 6, -235, 63, -161, -99, -37, -55, -141, -108, -199, 39, -146, 238, 75, 24, -8, -111, -245, -69, -52, -2, -92, 70, 64, -177, -38, 154, -78, 298, -89, -111, -9, -23, 104, 152, 64, 5, 4, -20, -129, -154, 214, -2, 153, -96, 177, 137, 57, 26, -156, 119, -30, -146, -40, 40, 65, -15, -31, 71, 166, -38, 218, -24, 38, -62, -103, 95, -186, 130, -24, -51, -9, 156, -362, -182, -172, 93, -42, 16, -298, 39, 19, 89, -214, -5, -238, 21, -70, 115, 34, -53, -197, 41, 75, 40, -20, -297, -73, 33, 67, -97, -220, -44, 148, -42, -53, 148, -1, -328, -214, -126, -165, 219, 34, 133, -187, -303, -132]
6149a32J09k96P4O1K68J50l48K89m9j29j07P8ko1k30N02L0q8J25k31J09k21J93
6172I4K1j46pJ37P2n5k89K88Q0j5j49R6j34P5L33m87k6K49q2m3j77J53J41j83
6196e4J10JJ30l17J12k61J24L3o0L02k2m9j44J60J42j02K8j12k06N7j50P9M40
6219B41k07J9m31L58M7j50J05j81J3K83l40L04l3J28n05J95L74L8r5j60nm7J40
6242I1l77L14Q2j97M0L1j08L51k18L7o2j43M3K32k04L21j29O1j79mn4l9J15J63
6266A67o4k67K01J26k69M6q8L63j50m10N92l23nJ20K9M1j12r1K04j21K09j10J92
6289B80m76K48r1l2J06j11p6J77J77k35K35n16j8L60j28p0J25L30k86o9NJ09l9
6312E%M7oj17M5L0j27R0L0J23j88j04L55j84m5j04L10o7k31J97j0J44k83J23k29
$$ y = [-132, -23, -319, -245, -184, 84, 234, -114, 175, 126, -3, -110, -32, -34, -95, -325, 177, 207, 119, 244, 13, 122, -99, 94, 115, -31, -38, 99, 171, 116, -173, 115, 195, 180, 31, 127, -7, 68, 401, -86, -112, 137, 55, 12, -165, -12, 129, -54, 56, 57, 187, -130, -18, -279, -155, -122, -182, 120, 98, 49, -95, 65, 207, 105, 133, 21, -185, -128, -278, -199, 241, 34, 53, -378, -20, 27, -123, -18, -199, -186, 97, -243, 61, 28, 156, -349, -154, 220, 258, 163, 3, -2, -49, 91, -286, 28, 110, -87, -47, -16, -124, 227, 9, 46, -16, -159, -116, 116, -88, 233, 104, 165, -14, -18, -72, -111, 4, 167, 103, -164, 37, 163, -106, -60, -148, 215, 65, -345, 247, -76, -81, 39, 68, 109, -3, -94, 110, -11, 198, 88, 280, -196, 52, -39, -71, 35, -76, -152, 25, 202, -33, 202, -314, -332, 28, -100, -170, -45, 285, -1, -70, -65, 44, 5, 5, 52, 46, -71, -26, 4, -123, -33, -3, 120, -68, -172, 183, -1, -46, -150, 160, 93, -138, 59, 49, 193, -90, 33, -196]
6337a96L41j52j02R8j5j47r5L25K18j77J35k47O3J91k30n9L27j29j08L8j67j0
6359i8J6J62j02R0j70K14m12K72j11J39k31J51J63l70L54j6J6M6n0j10L4J68j61
6382fN8n4k33k5J45J84j13K7L9Nl18N44k98Pq2J42J0j69J84j91Q7j87J38M6J48
6407H8j02j48M8J94l58K68q0J70p8j08J61N5n8o8JJ60m4j46j61K68Q7j30j00L8
6431d3K77j32j24J44r1J24j15N9j13K47k67J86o3j90K81n6j37Q3J20k9R6j39l40
6454b22L38jq6J71m4l49L18k55J44r0M9K45k01Q7j37P5L0J57o46L68K34r1L9l42
6478b09M8mK61j85J64k78K80K49l74k5K78j24j08j47J43j90N06m88K20j55K4K54
6500A40k52L13k76j39J46J63j04k6K6J74k77K47k39M41j73k44J35n6k06K64Jq2
$$ y = [-196, 145, -7, -109, -11, -26, -173, -268, 57, 275, 98, 233, -14, 49, 240, 10, -49, 278, 149, 41, 79, -88, -98, -82, 80, -22, 68, -102, 112, -300, -28, -139, 0, -231, -80, 83, -287, 67, 51, 67, 113, 63, -47, -13, 155, -6, 52, -2, -235, -260, -115, 69, -44, -17, 22, 27, -291, 253, -45, -38, -120, 22, 32, -137, 47, -144, -57, -244, -106, -60, 88, -14, -162, -114, 80, -278, -10, -90, 80, 2, -106, 55, 110, 52, -16, -15, 145, 101, -45, -206, 62, 149, 19, -81, -43, 234, 102, -22, 122, 31, 155, 40, 99, -14, 233, -34, 152, 89, -101, 180, 124, -13, 70, 190, 161, 257, 118, -222, 116, 115, 29, 200, 156, -193, 125, -130, 14, -76, -27, 218, 17, 104, -33, 42, 72, 229, -417, -49, 185, 94, 133, -209, -161, -165, 96, -89, 75, -203, 77, 326, -48, -73, 205, 81, -27, -174, -31, -221, 285, -203, 17, -138, -114, 140, -112, 201, -75, -214, -68, 95, -9, -35, -9, 165, -112, 135, -104, 337, 164, -80, 55, -1, -207, 57, 58, -24]
6522b4R3K06l94qL67l93k8L02JJ66k14J7rL0Kj42m8K8J36q3K57j41o8j73L04r8
6548H6K11n9l41L28p8k42K36k17j04L95j61n5n7j24J7Q9j51M01l43m6L27m9o5
6571bj70N2j0m3K22J04k84K13j10k11N93m35p4K47k26P6j65K91j6l29K79K1O1
6594H4j18j52Q5K71l47m9L11j08K11l75J14o3K50j06K0Qj40o5J12j7R4J07M0l16
6618a49K95k43k5J64N3l13J75M8K68oj35K19j93k20nR6K9J19j08N3k79J82j52
6641a27J78r2k74K83J44k79P6J93k45R9M5j0l8M5J22j99J73r8n2K06k00O1j18
6664a07K45k24J8L05l59J88R5j47m3j41Q6m9L28j74k00J40j37J0P1J45O6j54K08
6687A70k37J94j06P8J14m88K88K7J40n1p5k67K16m14N55j7n4k81K18J40k30L58
$$ y = [-24, 69, 275, -119, -127, 240, -153, -181, 121, 122, 288, 74, 91, 82, 112, 114, -28, -76, -48, 88, 5, 262, 121, 53, -120, 184, 86, 297, 238, -103, 225, 147, -95, 141, -76, -180, 215, 54, -1, -58, -182, -165, -76, -227, 174, -169, -215, 112, 63, -2, -172, -120, -130, -173, 49, 153, -131, 82, -28, -239, 354, -81, -155, 92, -134, -58, -223, 68, 52, -277, 2, 23, 84, -34, -186, -101, 170, -177, -226, 85, -23, 188, -187, -73, -136, 114, 8, 28, 36, -104, -169, -57, -74, 20, 127, 167, -149, 146, -97, -122, 42, 95, -218, -43, 5, 273, 267, 132, 351, 158, -62, -67, 29, 58, 177, 69, 122, -157, 25, -127, 51, -41, -315, -32, 112, -167, -91, 102, -143, -44, 1, -9, -47, -2, 120, -79, 94, -4, -56, 150, -50, 11, -107, 138, -86, -68, 237, -122, 66, 161, 14, -29, -170, -84, -133, 195, 21, -179, -39, -176, -166, -95, 50, 116, -38, 170, -67, 127, 21, 99, 213, -275, 13, 40, 180, 129, 54, -213, 3, -411, 144, 127, 73, -208, 10, 150, -80, 278]
6709B78n14m4L06n2J4J66p3m9K89m75J54l0J83j21N9J01j74L10k53j79L11j32
6731G5o1j6J05P6n2j07o3J00j61K57k46K6k4J69j07q7M7J61k19J48mj09J20j65
6755a37R3j80K95J2m4k12K81J06k49P5p7l2j32qK31j29K9%J83j77k4K29k74M14
6779B73m89K1J38l9k3M0J50L8l2J8J31j54j46J41Q6k85O9J27j24oM9K25j97Q6
6803I7j85j45K85o0j20R4M5K3Pk73L23j15Q7r9k6P6l51N42k02P3k49o7K98rj05
6828e6P1k04J29L9J46k18J03Nk05M0J12J33j16l9j32J45q6Q8j34J44r7J37j04
6851i9n4K48k98o9K03K88j58l3k26J10R0P5M2K20l35j4PL7r9J87k14j9m1L02k01
6876e1J08K20m51L6J2MR9K28p3k36R2k3M2J55n86P18l92K04j02K34m59m5L25p
$$ y = [278, -236, -280, 26, -26, -12, 154, 81, 32, 321, -154, 0, -30, 153, 32, 91, 192, 18, 328, 75, -104, 207, 75, 14, -2, 103, 179, 127, 20, -43, 57, -104, 153, -93, -67, -91, 78, -29, -116, -69, 92, -127, 21, 17, -92, 28, -137, -44, -224, 71, 83, 39, -173, 108, 214, -35, 40, -37, -69, -201, -209, 22, -107, -78, -78, 105, -72, -96, 133, -141, 273, -216, -195, -57, -96, -119, -79, 71, 109, 77, 95, 226, 72, -74, 67, 153, -132, -63, 64, -60, -66, -17, 208, 11, 97, -88, -233, 52, -8, -128, -34, 11, 34, 41, -232, 91, -24, 63, -36, -62, 14, -337, 205, 3, 76, -173, -240, 58, 49, -56, 15, -189, -60, -21, 125, -93, 10, 15, -190, -150, -38, 95, -21, -60, -192, -47, -133, -45, -179, -35, -132, 5, -99, -153, 95, -203, -272, -69, 219, 61, 28, -198, -88, 2, 77, 119, 339, 4, -10, -3, 34, -65, 122, -92, -111, -152, 150, -51, 57, 277, -174, -138, -126, -122, -23, 205, 132, -104, -12, -35, 7, 162, -424, 294, -98, 106, 4, 238, -221, -266, 59, 52]
6900E2J27N6n0k25k6j06K38j27J05M2j65J19P7j94l9J07K71l84J27K19k08m4l8
6923f6J1J1l4M4j69J59J90j55k83o2L91l01J30LK3K79j99J73l0j53p7L88n78Q8
6947b17j6j50J61Q9J23o0K0J08o8J8J79l36J67n4n6P4q2J34j6p3k8J64O5k7j17
6972Bj4M6q5o3L77j96k8L6j79L0P1J68n25L10R6J49k36K82n8k13J88j55o5k9P1
6997b0k4J31J47j03k2k78p5K50j54K16K0j02K31l01R4p3J24n2J61j95o4q7K17
7020D1k55Q2P3j77J69j86n5M19j25j24j8J00J53k78L8L08j41l04J75m7J03LJ30
7043H4k82R5m6O9j57N6L4K14L5k46K11o6J26j49k48M60j7q3J13l58Q2J23K00l66
7067a16L62j07k47K65j11j56j18M61k40l38K83J52k27K35P0L2j82j73M4O4k9J5
$$ y = [52, 179, 235, 185, -40, -66, -172, 66, -61, 44, 86, -79, 40, 117, -77, -116, -9, 262, -122, 5, 224, 16, -28, -66, -55, -44, -78, -34, -203, -44, 146, -9, -292, -354, 37, -264, -134, -131, -108, 171, -28, 145, 115, -38, -115, 273, -305, -217, -233, -383, -222, -133, -10, -70, -50, 58, -10, 8, 187, -149, 18, -36, -92, -18, -100, 34, 18, -55, -83, 81, 146, 119, 2, -12, 34, -51, -114, 263, 67, 39, 75, -104, -74, -3, 165, -360, -50, 46, 195, -41, 241, 183, -30, 158, 3, -62, -91, -20, -44, 87, 234, 131, 109, -169, -244, 6, -148, 68, 88, -14, 217, -84, 10, -63, 61, 9, 170, -25, -89, -176, 41, -214, -132, -59, -236, -67, -253, -308, 111, -14, -138, -156, -56, 97, -181, -143, 165, 24, -280, -105, -152, -49, -46, 84, -198, -103, -149, -80, -237, -181, -147, 67, 102, -144, 67, 1, 127, -22, -270, 190, 173, 90, 203, -155, -73, 50, 250, -116, 246, 139, -108, 157, 46, -110, -228, 233, -7, -345, -62, 90, -137, 98, 168, 200, 18, -155, -111, -47, -76, -61]
7089f1R1K85l91J97J2j91RP3j92M56m19M9Q8K9o3j8j21K14l4J71l77K26q7J45
7113I1k05J67j45O1J74l02J40p5j81J83R6L03l29Jj42P3K22l61J6m3L04O6j46
7136c2L45n18J63J03j91M15k79p2p6K45r7j30o7L13j31oK11K2j7m21M83k85q8
7159a10K63j23oj04K45J53j68q3k7k03L29q5K6J29k38QJJ61k95J91k40o7J40J76
7183G3J90k14k4j60K61n9l20L31k08K13%l33L52k52j49K83l0P2j15o9M18l4l44
7206a18N2Q8K10m20J92J32k48J40K1J65j11k20J67j35j35R3J08l46K89p7l2J62
7228b3J24N9k25M0K04l00L9JK49j14j00J02j64k4R7J42k9J29o6j88K67j26l36
7251b42K26Pk24P8k1J90j27J06j67J3L44L2k70k3P6k01L22J84j64k02K86j86l46
$$ y = [-61, 30, 315, -76, 121, 133, -58, -49, 24, -168, 288, -131, -82, 6, 35, -28, -46, -167, 47, 13, 184, -193, 33, -54, 91, -114, 53, -92, -31, 143, -159, -19, -94, -275, -92, 4, 307, -22, -21, -163, -90, 132, -229, -213, -256, 48, 114, -32, 313, -205, -42, 61, -130, 285, 6, -66, -142, 103, 6, -124, -191, 122, -9, -15, 196, 218, 201, -220, 263, -22, -110, 153, 30, 24, -80, 165, 318, 150, 67, 40, -163, 166, 81, 107, 236, -2, 6, 7, 168, -127, 64, -176, -243, -103, 73, 263, 49, 25, -135, 126, 67, -253, 78, -130, 83, 83, -250, 102, -150, -299, -16, -46, 26, -89, -158, 260, 226, -118, -66, 22, 232, -188, 4, 136, -112, 28, 49, 214, 103, -117, 50, -85, -220, -127, -19, -365, -76, -153, -185, -23, 101, 160, -65, -25, 179, -121, -82, -81, 168, 54, -46, 56, -108, -132, -35, 107, 78, 207, 141, -47, 220, 94, -242, -16, -9, -233, -155, -176, 14, -113, -7, -174, -161, 183, 215, -55, -78, -2, -203, 119, 303, 139, -63, 223, 37, -309]
7274c09K26K07j88K29m9k36K73j43N6j5m9J20j62j31J97l86M61J3k52R6P3j10
7296g9P5n7ML01m53K67r7L9k7O4j57j62J13K7K40j02K8nj36J11o5l7J37O3Lj58
7322f3k39N30j93k09ML05k52Q9k8pO5J88j57P6m6J05p1j28%m4J97K4m08K44J83
7347A65l41K53J51r5j02R1p9K1j32J82M6j25O2m56K30J27Q4j91J42k2J7n6J53
7370A25k13K39l10K06k99L70j93N6r5K61l06OK84j50J4R9n9O5K0l59N9Q1J49j03
7394e3N7j09J73o8M5J06l05L3Q8j07K9K24k99J49k09j56L14p4p3m6J18M52m71
7417a82K39N6J20l10Q6j28P1N6l78K09L28l00k0R7J9k14L34k21l3J47P9k9l5L8
7441B9J01r1l34L00k8J43k73K41p6j6P6l6KJ05l92K92j21P1J87j72j15J96j42
$$ y = [-309, -83, 124, -64, 165, 116, -120, 153, 10, 66, 51, 2, 122, -40, -171, 26, -360, 101, 114, -138, -42, 31, -79, -4, -61, -57, 244, -209, 58, -39, 0, -27, 37, -120, -282, -169, -142, 98, -4, 24, 19, -117, -6, -71, -108, 29, 92, 95, -63, -302, 228, 35, -174, -170, 135, -117, -28, -56, -63, 2, 190, 33, 109, 63, 168, 97, -31, -31, -75, 122, 146, -262, -18, 165, -176, 77, 228, 133, 31, 122, 43, 64, -68, 114, 160, 35, 97, -359, -129, -2, 82, -109, 33, 11, 28, -28, 125, -88, 151, -159, 47, -252, 118, -75, -19, -114, 147, -159, -153, 131, -19, -5, 94, 35, 100, 120, -239, -180, -99, 50, -53, 4, -105, 68, 0, 45, 151, -154, -121, -33, -140, -111, 113, -186, -37, -246, -402, -88, -162, -235, -281, -163, 289, -182, 57, 113, 233, -77, 9, -119, -48, 8, -370, -161, 167, -133, -153, -56, -37, -251, 83, -138, -171, -24, 55, 26, -9, 29, 130, 39, -295, 5, -23, 120, -153, 88, 12, -4, 72, 36, 38, 143, -249, 43, -78, -7, 180, 8, -107, 89, -53]
7464e3J26M6J54l0n9K0k31jn6J10k67K28n0J30k45j15J89K0pJ00l26K74J15P8
7488A50k57Q5J21M3Q4j43j60J41j66M9j08O2J84l67Q7R4J39L9j89NJ61j66j31
7511b43O8K63j13k31J20J16j8J01m5O6R3j96O5J21l11J08N6J92k30J28n1L6n6
7534C9j22K09l3R9j92m7J13K3M0K94l57k0n3j84L7L37l42K83N3k96K24j09K6o0
7558c8m3J45j71j97J19j12L56k34K60P2k66J32J37m12L05j15N8j27O1j45J55k43
7580c03L29o9n7J66P3o7j23m7r3L40p4r5j36P3j21K54J54j21j04R4P1n3m9j14
7604g2J04k8r2N1j02R0P8j18K42K2q1O0K8j95L04o45L61J01k24K3K63n6l60K56
7628A0J9K19m9j40k20R5j01K56k33K8R1M6l4J18M7k8k01j78L13p8j49J85p2O3
$$ y = [-53, 73, 119, 273, 243, 184, 204, -27, -28, -84, 26, -241, -13, -63, 67, -178, -293, -104, -84, -91, 9, -317, -43, 72, 150, -107, -22, 99, 142, 226, 83, -77, 64, -102, -53, -161, -99, 85, -282, -195, -101, 38, 77, -112, -107, 54, -112, -243, -175, 88, -25, -256, -136, -20, -38, 63, 18, 84, 177, -19, 46, 167, -144, -36, 20, 212, -18, 110, 59, 95, 39, -83, 126, 93, 192, 0, -47, 66, 89, 129, 423, 66, 46, -7, -191, -154, 183, -159, 124, 177, -119, 105, -4, 22, -38, -81, 64, -107, -304, -185, -297, 59, -175, 85, 157, -109, 23, 160, -252, 53, -62, -4, -131, -70, -215, -60, -303, 26, -43, -100, 66, 139, 72, -51, -98, -191, 149, 75, -20, -156, -83, -204, 50, 204, 83, -21, 73, 144, 91, 42, -72, 32, 4, -88, -37, -139, -49, 29, -89, 153, 175, 94, 154, 182, -13, 291, -354, 7, 108, -116, -93, 170, 114, -246, 10, 29, 248, 199, 59, -161, -66, -167, 89, -144, -116, -25, 21, -13, 105, 152, 124, -77, -255, 58, -20, -169, 16, -56, 7]
7652Gj87K74k31L37l18L53l28M6J5k2L23m64J62R2N4k75L4J38M52p36J08J74j25
7675a17J84p7K2l03m2M60j11k38J83K43m18M33k06k60L34k56J23MO9o9O1Q2k0
7698H1j72K29q2J29r6k59K78j21n2PQ0Q1J95j70j58k10M20j41J36j33K82l30r6
7721a02L80k34L4j01k4K92k3J6k32J03k44qp8L2k4J64j98J88K19j43j56K07j43
7744g5J38l21K19P2L13m16o4P7j67M8l7K28o6k0k0J46j98J09M2l3%J7k38J61J10
7769B5K0K5J6j09p7J47N2k07J31J60j80%O8o4Q1k13L7K39r0j45J75K7M7l04K88
7794A49k9l71K71P9l5K46j48N6j46jjq2K42k68pJ19j75O6L98l74k61K20j33L34
7818A49k21q1K56k2K3o6j5mM9k08M8J09j77J6K33m2j73L9Q2j55n6J42j05L14J12
$$ y = [7, -180, 94, -137, 200, -118, 235, -93, -47, -32, -54, 269, -195, -33, 59, 113, -162, -128, 10, 462, -274, -166, 8, -117, 67, -10, 12, -291, -333, 127, 16, -222, -39, 204, -214, 219, 13, -247, 87, -169, -46, -42, 27, -42, 19, 101, 81, -91, 138, 56, 185, 89, -170, 108, -13, -65, -58, 22, 103, 298, 128, -30, -240, 180, 39, 175, 42, 324, -6, -102, 278, 44, 78, -23, -47, 245, 222, 238, 6, 109, -135, -143, -221, -189, -213, -49, -247, -59, 160, 17, -139, 68, -75, 63, -258, -39, 33, 346, -70, -134, -57, -224, -176, -213, 15, -51, -71, -91, 55, -143, -34, 8, -25, -25, -8, -246, -85, 25, 45, 70, 86, -23, -100, 47, 99, -108, 23, 183, 3, 3, 71, 7, 88, -125, -88, 151, 61, -84, 91, 118, 165, -139, 149, 120, -251, 20, 99, 64, 310, 162, 218, 72, 71, 70, -12, 230, -38, -45, 74, -101, -35, 363, -11, -272, -52, -185, 149, -72, -153, 103, 81, 104, 38, 23, 19, 68, -140, -92, 17, -160, -144, 89, 47, -126, -87, -5, -160, -216, -74, -179, 135, 247]
7843B47k59j26J43j10p1K39r3k4k21M10m29M12j08N7m68M27j84L80j76n2j6J19
7865I7k78M3K76k3LO6j80rr8k2K54j66J13r7J25k62M5L07N4m02O2J06j54M18l31
7890e3l3J10m3r7K19j22J87Ol1Lm94K53J03L73l72J51q0k97L53j19j11L68j62
7913A12l45K97k54j1K33j96J70l09J85L26j16k66L07j76K3M5j98M7l9J63k14Q3
7935a33J20j83J4N5K21k39K22O0j41J07k12J73j92L8O8J2J87l74J95k0N2k17L36
7958A49l00K39R6k03L51m98J93j51j16N3K28J49l00n9Q6p1J22r2M33l70K10J4
7980A63R8j04n4j73p0J86J15k2k0j86K98j50p8j61K16o1J06k28J14q5k40K10K64
8003A38m4k79L08k05K34q6p2l50K88K27n44O59m89J76k6O8l0k4j35L30l69M01
$$ y = [247, -12, -138, 5, -105, -176, 63, -30, -54, -275, 135, -294, 118, 10, 67, -401, 26, -158, 222, 46, -6, -22, 97, -181, -138, 138, 115, 118, 184, 4, -5, -103, -125, 129, -37, 76, -21, 104, -158, -113, 194, 248, -154, -92, 14, -140, 278, -53, -86, 24, -19, -116, 103, -19, 168, 174, 143, 146, -348, -95, 8, 381, 9, 160, 80, -217, 136, 17, -94, 274, 112, -233, 64, -190, -201, 32, -164, 6, -303, -118, 208, 92, -174, 133, -43, -20, 25, -173, -126, -165, -2, -216, -133, -13, -196, -182, -127, 94, -145, 77, 137, -4, 103, -109, 64, -128, -90, -22, -10, 177, -197, -2, -22, 30, -187, 149, -151, 88, 184, -19, 332, -166, 27, -124, -240, -187, 41, 190, -110, -169, -83, -154, -32, -124, 309, -61, 149, 163, 261, 157, 103, -70, -140, 46, 161, 139, 119, -67, 231, 81, 3, -158, 58, -3, 103, -125, -11, -96, -336, -126, 138, 94, -185, 123, -82, 152, 66, -6, -356, -68, 159, -385, 274, -215, -39, -65, 3, -27, -51, -186, 144, -225, 176]
8025A76l27R1Qk56K02j07k8K91n3j24ln0J21K8J04K7k63Q8L69k64q6r0K25j64
8049h5K61k01l3J52j64K0R1P4k88K73j9j59J02n9j10L88Rj17k78J5j10J76r9J21
8073d0p2K9J81l16K5J67P1J9q9K27m12L1M77n5q6l7j05J37R1l33j3o4L83k71j67
8098b22o1K84k14Q5K50j50J70l14J2J19j74J25j19L05k37P6p6j34L84j16k2j58
8120a87J2K06K6J42j69J64l40J86M3q2K19k82k28K07J09k19J2J99q4K20m06L40
8142H8K44k66J12k90K84l65M6J64K56j90jQ2j04k03K05l83K03J62J33j02p8j98
8164b01J41K05k97J18l87L95k00L43o2j17k00L24m7K77l62O2J29j25Q8o6m2K68
8186B44k73J48k8k06K08
$$ y = [176, -151, -60, -52, -308, -106, -213, -241, 50, -3, -127, -130, -180, -59, -31, 73, 100, -163, -75, 294, 30, -56, -146, 79, -85, 176, -25, -58, 94, -70, -50, 41, 115, -173, 100, 81, -78, 24, -35, -145, 243, 252, 135, -143, -128, -238, -62, -161, -40, -112, -83, 98, -218, -193, -26, 45, 64, -25, 202, -210, -179, 298, 243, 157, 120, 15, 152, 243, -90, -103, -167, 216, -55, -222, -283, 1, -213, -128, 122, -28, 142, -172, -160, -41, -215, -90, -209, 96, -141, -65, -141, -275, 109, -7, -29, -187, -175, 31, 57, 199, 30, 194, -146, 40, 83, 1, 220, -62, -290, -83, 26, -193, -181, 18, -66, 154, -252, 88, 332, 66, 178, -112, 172, -193, -147, 17, 273, 83, 82, 164, 60, -143, 62, -321, -118, 44, 177, 75, -3, -201, -60, 145, -152, -34, -421, -26, -226, 117, 55, -62, -262, 62, 15, 292, -70, -8, 121, -4, 84, 18, -24, 244, -29, 119, 91, -115, 93]
8191I3
$$ Imaginary data points
##PAGE= N=2
##DATA TABLE= (X++(I..I)), XYDATA
0@%%%%%%%%%%%%%%%%%%Qj6J6j6J6j6K1k9L2l3M1m8N3o1O9p8Q7r7J08j22J37j51
40g9J68j89K10k32K58k85L13l46L81m18M60n07N60o19O85p58Q41r37J048j181
60f27J341j537J786k112K558l210M256o196J0944m2632n5209J05897K0462o6935
74c1214k888M3912j4549k3573Q572J2035L855M438k0640j1189K0400J4070o050
87b821j0398j3220R571K1513n182j4175J3492R525j5785k569J7404L916K61m773
101F759k3159P381L7285j1202k9909K0718J7118k8389l968L1186n138k1612J2735
114I805L544j5249J2684J1247k1192r862J4640L528q949J457O362k667n911k443
128c006J436P091j275r924l87M904L203k488j0737L266J4537p722j6908J4205
$$ y = [0, 0, 0, 0, 0, 0, 0, 0, 0, 0, 0, 0, 0, 0, 0, 0, 0, 0, 0, 8, -8, 8, -8, 8, -8, 13, -16, 16, -17, 24, -24, 29, -32, 37, -41, 46, -51, 57, -65, 72, -79, 89, -100, 110, -122, 136, -149, 164, -182, 199, -219, 241, -266, 294, -325, 360, -398, 443, -494, 554, -627, 714, -823, 963, -1149, 1409, -1801, 2455, -3741, 7203, -35429, -90638, 15259, 35721, -31214, -34102, 9810, -4739, -28312, -19740, -7705, -3850, 588, -20052, -31241, -10841, 3229, -2821, -13219, -26439, -16868, 4645, -537, -14712, -1220, 8305, -7480, -10049, 7355, 11271, 11532, 6759, -16400, -9019, 28266, 17064, -12845, 7873, 24991, -3398, -7366, 23820, 18682, -2930, 9805, 13349, -1900, 10784, 22031, 839, -9023, 5617, 9145, 196, 1653, 8015, 5348, -563, -3006, -1570, 5521, 4246, -5678, -6065, -1161, 2042, -446, -11183, -7917, 6620, -1102, -18010, -3805]
142c805J9923j9254j7152K5966R542k7592Q45K3743r039j7154J1213J1899j0813
155a678m081J2058m52r348J318M740L81r29Q00J672l987l364L959L50k131J516
171H24R2k558R12K973j750k633L204l170o926Q745N416j0547k455Q221k620p550
187i822O053P460q402m049Q685o03n344N418M305o771o662O521Q055n680n410
202f246N952L771n307k949P553N380p477m996M378M649J863l175k470M153j28
217D951p408J281J1035K60j1617P02J0782m365p238O482L753q084l206P612J702
232F642o314N79L504n032k335N703K597m281m491L084K624l415k5L336j916m986
248d726r54M141K590k245j003p77j000J056k46R98K136k975k555L120K195k131
$$ y = [-3805, 16118, -3136, -20288, 5678, 15220, -12372, -11527, 12216, 3177, -13977, -2764, 9135, -1678, -5759, 6299, 5847, -3501, -2183, 2557, 2938, 2009, 2809, 4481, 494, -2870, 1089, 1439, -692, 824, 916, -1642, -730, 2243, 493, -2140, 1064, -2106, -9032, -287, 5129, -5418, -7873, 348, -2272, -9822, -3769, 3691, -4711, -8760, -75, -678, -6022, -604, 3701, -3070, -9732, -3211, 4844, -836, -6246, -294, 3477, -1830, -4779, 2774, 8154, 677, -4319, 59, 4708, 6571, 3396, 926, 5079, 4951, -2457, -1176, 9859, 10119, -1498, -796, 9986, 5621, -1617, 4865, 8618, 534, -2672, 4940, 6642, 328, 907, 4411, -621, -2956, 2747, 5344, 1063, -3428, -344, 2280, -1135, -1160, 2176, 260, -4726, -5680, -1539, 1051, -1194, -2197, -2974, -3974, -2918, -3164, -2166, -30, -3005, -5560, -2440, -245, -2376]
264b376j818L945q35o767M057P977m110o069M522L791m331l194N800K833o323
279b898j215M400K339j920k646K188Q60k415P23K777R60j846k147J846J488j572
295I22K20P33l01j703r83M168J846m177j032L207p32l276J741M882k479n276L782
312A542K359l361j111K860K09l154k09L837n01k729Q72Q51j194q42N91K093j703
329D10k474K418J110j352j111Q40J243j788k153L141J862k493k373R31K479k368
345a678k224M159J183m055j369L484J477l489m33L838j490l323K094K671j205
360c60k762J264K290k009j785K687J057j693j097K079J885k505j407K516L60j359
376h39l94J244J699j818j345K314N62j365n01K041L00k589N52L308j528k390J814
$$ y = [-2376, -4194, -249, -1084, -7851, -3794, 4183, 73, -5996, -1474, 2317, -2014, -5208, 592, 3425, -2898, -4113, 287, 2626, 706, -1940, 248, 1108, -1307, -584, 2193, 3153, 1307, -840, 1006, 2494, 922, 1142, 1875, 1574, -129, -1112, 3056, 4902, 725, -307, 2900, 2168, -1108, 633, 5515, 3036, -2240, 1542, 3901, 540, -571, 2289, 2498, -656, -865, 2972, 2471, -258, 614, 1465, 271, -571, 20, 2113, 410, -2064, 354, 1464, 112, -999, -159, 1084, -704, -2857, 284, 2146, -347, -2720, -1789, 690, -1678, -3902, 257, 1440, -2615, -3984, -500, 977, -2512, -2945, 893, -597, -3920, -1826, 845, -360, -3122, -1858, 432, -1577, -3362, -675, 382, -1311, -2408, -329, 1556, -949, -2356, 160, 520, -839, -1233, 11, 1710, -108, -1453, 861, 1423, 58, -443, 1598, 1898, -691, -139, 3169, 1641, -749, 1065]
393A065J138j412j672K177K165k113j388J877P65j145j138J531J809k617p81K089
409B350m60p62k96O53K50j261L9R41n19r5l33O25N8k506O12K297j441k315J735
428d28J814j644k296J502J454j723r20L43J407J85k422p9K321j460j232J447M93
445a238j298q7J436k34n06Q45n60q64Q87k91N04K108j608j271J309O04j205K90
463a179K719j354j874K368J092k224J271P85r90%K8P37Q46o32j313L82K398j157
481A903k555L405k82l226J790K032j550q80J090j078o23J474P27j801K59M89j592
498d18J402P48j919P65M99k530P60K662q24l084K055J536l085N7K878j596p96
515h90J438o30m45J796r42k199J206K249j406q93J172q80L5Q10k190Q45L253k791
$$ y = [1065, 2203, 791, -881, 1296, 3461, 1348, -40, 1837, 2602, 1457, 319, 1850, 3659, 1042, 261, 2350, 1890, 1128, 832, 1485, 1735, 474, 513, 1454, 935, 840, 507, 1132, 1190, -1316, -704, 1593, 152, -2163, -428, 1386, -258, -2554, -1052, 402, -1321, -2241, -1898, -491, -306, -2728, -2807, -486, -1946, -3178, -1731, -1238, -2536, -2623, -1187, -1421, -1927, -1082, -1642, -2506, -1619, -1910, -1406, 702, -906, -2177, -868, -264, -1469, -1179, 1540, 186, -1688, 680, 1772, -452, 819, 1604, 614, 614, 642, 1379, 2225, 1593, 280, 662, 3060, 1903, -652, 2753, 2471, -755, 1035, 3067, 1517, 637, 1727, 649, 26, 1500, 2227, 426, 685, 1174, -418, 984, 1732, -187, 578, 1077, -1453, -693, 1969, 1145, -1939, 116, 1652, -1433, -1376, 1502, -94, -890, 548, -82, -527, 1269, 327, -1872, -666, 1583, 177, -716, 456, -424, -389, 421, -1769, -924, 2329, -462]
533d62l606L113L272l278j731K502q64j178K526j198j836K604K95l078J069K796
549I46j216k582O00J277Q36R88k659j882M244M18l469J902K697k894j517K674
565C63O96k46J494j936l392M371L151m448k85L032j464j559J581J045n0j85k345
582a77j243M766J568m821p35K688j396P11J978k742j068K617j661l144M507L833
598E681o143m479M768J988o54r98j745P27J083k271N49L400o84m674N07L311r33
615e67J57J879l854k238M754J718k941M2P50j402j01J945J57j52j81l111L94M389
633A638o33j999J033j040j915K654K439k232j028P40p49J79K372q95j386J347
649E25j791j256M432P58l626o33J714k6K48J352j458p06J376q22k29L032j340
$$ y = [-462, -4068, -955, 2317, -961, -2692, -190, -1054, -2232, 294, -904, -2740, -136, 159, -2919, -1850, 946, -270, -2852, -2252, -975, -139, 849, -1810, -3692, 552, 970, -2499, -597, 2100, -794, -2311, 363, 1059, 813, 2307, 371, -3021, 1350, 4501, 53, -232, 2800, 1336, -223, 1358, 2403, 2353, 2168, -177, -1420, 3346, 4914, 93, -642, 2046, 650, 1361, 3339, 597, -471, 2146, 485, -2659, 1848, 5681, -462, -4941, -173, 1815, 1161, 163, -1582, -855, 228, -2043, -1494, 1906, 1222, -3452, -2945, 366, -567, -410, 1469, -2385, -4623, 131, 1849, -1092, -1050, -300, -1702, -1803, 142, 299, 147, -34, -3145, -2751, 1638, 1005, -994, 39, -1001, -2916, -262, 2177, -55, -1083, -343, -1092, -913, 1459, 564, -822, 525, -1266, -2522, 1910, 2668, -958, -1591, 123, 97, 345, 1697, 239, -467, 909, 87, -142, 2890, 1550]
666A550k829K341J43j639K826J272m112j313M494Kl320J830R55j720k54N28M51
683A205J918j780l125K321K163k687j101L178j250k821K602O73l320J554J360
698H90l088Q34K648k087j218J280p05l18J906r78k139K438M80l740K113K708l251
715b227o20K318k16j169J562J47k202J411J392k252Q92J791k513P44K253j564
731b53o32K133q02k136K356J428k241O5J393j197M01J428j602k05J714j799j049
748i98L199L80l298N95K627k101j183K691l60j841R06M3m77P80J6j127N70O3o62
767a77O39J139j796r87K314n81j450J508P89k136k34J330Q00j097K21n42j83O15
785A72l68J69J274j205j787J555P56j459K75J059o15j684J056J820j369q57M34
$$ y = [1550, -1279, 1062, 1205, -434, 2392, 3664, -448, -1761, 2733, 2735, -585, 1245, 2200, 480, 226, 754, 1205, 3123, 1343, -1782, 539, 2702, 15, -1086, 2092, 842, -1979, 623, 1296, -2024, -470, 890, -2198, -1364, 1284, -803, -2021, -741, -1446, -1764, 142, -836, -2975, -537, -57, -3797, -1684, 1024, -2227, -2847, -529, -745, -1914, -352, -205, -2407, -996, 396, -1856, -964, 827, -1686, -942, 1311, -253, -885, 1248, 446, -1690, 666, 2094, -147, -82, 1311, 114, 515, 1943, 341, 136, 1850, 51, -998, 2201, 2581, -717, -122, 2505, 404, -779, 1912, 1552, -289, 617, 660, 183, 963, 979, -148, 422, 485, -177, 462, 1601, -195, -1182, 1132, 551, -899, 609, 1398, -738, -972, 358, 1158, 61, 282, -260, -443, 172, -196, -27, 1247, 42, -1745, -190, 566, -893, -618, 441, -174, -1858, -802, 1018, -351, -1208, -774]
802g74K82qo38M27Q70p86j700J163J642p73j398O11J006j440LJ499r8o29r13R36
822g18L52j75k90J053m31n67k75K005m7j545N47J251q29r44J631O11q68r88J110
841H83O51n97l23P27J23l96o72Q97M00r73n17J360m17n76j15J159m39j398N06
860B83J044o67m65m5Q16m08j215P66R08j001r33K71R61m83j235J634K83j545o55
879a686Q61Q68p41p03J154J47j405K26Q07N69j235n54J633l8j260N77R80n23o91
898a014L04J260m26j335Q38R23r97l37M70R20p07j294J485N12q97r6P62K46j213
917e96m23J922K03j763L76Q34j13j180O18J383o08j464P63R78n18j049Q34J200
935A397j242q29J448M54r75m32J195P29j529k50J501j58j392J07J200J79j460
$$ y = [-774, -492, -500, -1138, -711, 159, -627, -2327, -1164, 478, -295, -1693, -1082, -76, -1516, -1513, -14, -112, -741, -1654, -718, -366, -541, -831, 222, -209, -776, -1051, 954, 907, -638, -91, 1160, 331, -613, 1018, 1629, 761, -227, 883, 1534, 937, 614, 1341, 1464, 1068, 396, 1293, 1693, 720, 203, 1563, 1146, 570, 455, 1614, 1175, -223, 283, 1327, 660, 195, 150, 966, 558, -657, 109, 1017, 16, -917, -646, 315, -168, -1403, 231, 514, -1031, -1686, -825, 43, -698, -1401, -247, -100, -1505, -1279, -472, 97, -1138, -1692, -59, -97, -1357, -780, 200, -323, -1014, -710, 550, 124, -1211, -373, 550, -447, -784, -314, 606, -101, -1395, 90, 602, -295, -391, 371, 617, -596, -1019, 903, 1106, -657, -281, 553, 440, -740, -122, 1261, 653, -811, -48, 930, 412, -637, 197, 1397, 155, -674, 774, 1228, 253, -179, 1016, 1745, 216, -34, 1467, 1309, -83, 24, 1224, 1403, -57]
952e7j92J859p42j173N06J063l51j609M63J384p34q33L96P63p49j065R55J392
970A276j781n06J123Jj536K56J148m7j110J66O78n36j95m06Q34L30r78j13J091
989c05k1j058N99Q99p46q37R35Q15j177K63L55j52J64l80L48R94n99j173J427
1008C51J145j354r04J596P12j847M07J327m32p59K37O6K61k17L1K11K2m97k95
1027F1J351j76j594J068O78j500j74J683k17j481J52R33l89k35n2P9L82n75n21
1046e27J176O21j916l31J370j44o53L32O53j195j97R94m80q5L32m76P4K17j98
1065d33L27L30j103l98Q62N95p92n1P88m75o89O95l0k0j20p64P44O78m93o73Q75
1086a47L71j341M6J823r02r10Q12J78l24M45L18P8j008k4R64L91l80p75Q26L60
$$ y = [-57, -249, 1610, 868, -305, 201, 1264, 913, -696, -233, 1151, 417, -416, -20, 743, -6, -1071, -116, 1276, -505, -1011, 112, 113, -1423, -1167, -19, -66, -1176, -1010, -332, -868, -1063, -1469, -635, -305, -1283, -1396, -305, -326, -1384, -785, 114, -632, -1469, -534, 281, -896, -633, -278, -430, -266, -646, -298, 696, 97, -1076, 351, 1496, 142, -762, 834, 1546, -301, 106, 1433, 1001, 242, 479, 545, 806, 589, 620, 831, 853, 356, 61, 1412, 1236, -358, 710, 1388, -112, -286, 1397, 1180, -301, -149, 784, 395, 160, 108, 187, 569, -6, -527, 649, 1270, -646, -977, 393, 249, -404, -72, 581, -614, -811, 183, -297, -382, -50, -526, -452, -235, -433, -106, 224, -879, -1277, -415, 180, -612, -663, 125, -350, -1039, -344, -374, -394, -514, -1278, -534, 144, -349, -1022, -147, 224, -1117, -1071, 752, -150, -1060, -248, -70, -394, 51, 369, 447, -561, -585, 379, 770, 390, -385, 441, 801]
1106H01j445M76K105j184j704J197J073n94m39M50j4l24R4L31N03k50j169o9J398
1125A236l92n44J169m78j816Q06J518m73j290K23N59p40L23N76m26j6p07m52J126
1144B02M82j066P1L09o87j76J268j58j621N13O30o42O18O70j231j37N24n01M51
1163d81J382p21k137R13J774j316J4Q83j035o55J301N26p19PL19q21M57N61j63
1182H9K36j74j742Q09K259j499r85J520K30j621L93J805o30q71M84l55R8J250
1200A296j190k82R56n60o28J541K74j933N02J476j303q72K601n92k405J066J015
1217I62n33j28K18l96r7O46o28K72Q44q72j404J838K62j485P53J01j657M70J716
1236H82p23q21Q20n44o70J146L38j492J017L21j717R18J472j576j009J554J76
$$ y = [801, -644, -168, 1937, 753, -951, 246, 1319, 725, 286, 736, 722, 398, 492, 823, 1326, 1076, -93, -162, 1236, 844, 300, 1469, 991, -825, -19, 1499, 1026, -264, -41, 518, -222, 101, 677, 251, 235, -472, -924, 202, 684, -382, -311, -2, -689, -865, 403, 245, -1376, -863, -233, -875, -257, 413, -818, -955, -431, -932, -481, 901, 180, -1957, -1044, 730, -586, -572, 311, -724, -1379, -78, 448, -271, -264, 55, -766, -309, 252, 89, 325, 151, -1591, -782, 1477, -22, -1007, 513, 743, -878, -485, 1320, 690, -181, 303, -52, 46, 1296, 106, -176, 780, 220, -408, 1133, 1407, -526, -24, 1452, 149, -723, 1878, 1286, -1119, -53, 962, 429, 301, 519, 123, 26, 672, 44, 316, 1160, 288, -1116, 722, 984, -501, 252, 353, -1304, -834, 882, 159, -662, 158, -386, -1056, 90, 428, -1064, -47, 274, -1443, -525, 947, -629, -1638, -84, 92]
1253I2j294R63N67j488K61N68l36N35K30j059L1J117o10j59Q74k57j194P72J140
1272G53j046M8P43p63n01J139k28j25J95l13l32Q35M73j072N04P11j466Q3J634
1291A272j75q98L5L88m35L78J51k61o2M3m56N93P85r43k50M49o55NJ075o0j102
1312a23o0L44oq9N56p19m7L77p74J79J126q30o84P56j0o08K26N16k03j177P83
1333d67M20k52K46l43k46L30n00L01K05j9n18K95O31m07m56R14k74o23N58K50
1353D5n9j19m6j66qO9L18m5J25m50p0Q75r2p42O32M3p12L40N94k16l82KM18j29
1377B25J97J42k56J56k40j9K74J8l09K12K71l21J19l16K98p4Q8J21p49K80M23
1398E40m95J03J66l25N0K0L51m11J70R4n95K45M01l01j21L18m84J33O1mM4q9m1
$$ y = [92, -1202, -239, 328, -1160, -899, -331, -667, -132, 98, -961, -930, 187, -423, -582, 292, 35, -1159, -387, 753, -293, -245, 498, -265, -766, 373, 145, 20, 215, -98, -430, 405, 878, -194, 310, 1021, -445, -362, 1272, 1097, 199, 234, 622, 187, 565, 716, 455, 393, 436, -20, 573, 1358, 415, 165, 614, -41, -36, 1039, 979, -123, -183, 161, 155, 66, 622, -97, -144, 233, -541, -362, 764, -66, -750, 6, -4, -612, -386, 130, -73, -1250, -467, -47, -299, -53, -396, -642, -312, -812, -511, -306, -325, -843, -548, 83, -324, -780, 134, -140, -763, -205, 45, -14, -133, -179, -345, -353, -284, 34, -11, 114, -336, -406, 469, 377, -365, 267, 310, -402, -62, 532, 316, -66, -64, 354, 225, 422, 564, 308, 464, 224, 205, 479, 497, 188, 400, 671, 350, 469, 153, 451, 377, 465, 586, -163, 117, 540, 45, 148, 314, -11, 39, 59, 410, -1, 169, 263, -332, -87, 314, 13, -108, 210, -274, -141, -80, -84, -40, -129, -170]
1421a70R9k02L67l12m8K79n86L91lj90Q9O7k59J50p3P5J50l46J46J29k78M02j1
1444a34n33L32l9J63k43L44j03k74L72q3M1l2N7J02P8K4J0K79l8j27K94j84j74
1467A32KM42L1k84r0L5L90j93j33J60k5Q0K00l49o0K05k75K86k55k35K27j3l47
1490f9O43l45L0J35m44K33k31j51K06j4o8n3k4j7p8o0K94l91j87O40k81q9n3k2
1514c96L30n22j82O11q1k18j06R1J88l54K11M43k68p0r7R3L5J84n8J83j62j44
1536b89M04j18K69j37J64k75j20K90Q0k22J67k09o8N56m10j24L77k68k28L66J81
1557C86p9l03K15p0l44K50K35j53J15j25o9J79l4K88k37R4j23M1J28j5k76L64
1579D67j48l02L91r4j2j56Mr2J3J89q5k75L15j45m3L27j06o17M18k8m56L71R2
$$ y = [-170, -71, -273, 94, -218, -266, 13, -573, -182, -185, -375, -286, -219, -478, -328, -401, -326, -176, -522, -376, -247, -525, -123, -134, -667, -335, -374, -211, -454, -110, -213, -487, -115, -198, -157, -189, -132, -30, 48, 72, 82, 361, 323, 196, 490, 306, 132, 134, 576, 607, 323, 233, 268, 658, 465, 332, 492, 467, 547, 747, 398, 338, 543, 268, 554, 299, 64, 291, 278, -69, 574, 229, 259, 394, -50, 183, -48, -199, 7, -7, -75, -128, -152, -169, -247, -307, -13, -404, -591, 49, -232, -321, -374, -396, -66, -588, -770, -159, -240, -458, -564, -473, -285, -639, -428, 15, -253, -323, -420, -327, -292, -108, -166, 17, -145, -289, 115, -3, 266, 129, 293, 18, -102, 188, 268, 46, 213, 4, -64, 492, 82, -42, 335, 67, -161, 205, 386, 307, 4, 219, 149, -195, 55, 290, 137, 252, 127, 58, 237, 203, 491, 254, 348, 225, 266, 394, 379, 103, 467, 319, 17, 408, 314, 302, 146, 150, 58, 71, 260, 175, -100, 215, 70, 27, 354, 248, -369, 49, 21, -435, -64, 28]
1602B8k36j08m3J05l02K90J68n88K43L06m22J01N44o85MK24k4j38N85k38m21M04
1624b03Q6m13L47J75n32m8P99j2o20M68J6m13L20M31n07j16O35n72L67L37m91
1645E4j0N96n93j7O50rm78k32Q32n80RP28m89o33O99O0l70R7J98o24R9L13l35
1668c5J69M88m01p86R52J25p57N19P0j005N78N81l05m15m4n7q7N15J92q01N05
1689Al31m93O18O24p28o45R96k0n02M42K11q30J95O40n60K55L22o30J10J76Kj99
1711c46M11qq26K43Q15o50J70N85n01K09J47j28k07K33j62o23O05L37m46J06L51
1732C15j006M95J076p30l95M2L93m51J59P76n03l81M33l0n2N89m04k39P5K6m48
1753b60N99K32m90k45L42oJ4K07k57n39P68m16L68p2Rp64K28R74o23l5L37l55
$$ y = [28, -208, -316, -359, -254, -556, -266, -98, -686, -443, -137, -559, -458, 86, -599, -595, -371, -395, -533, 52, -186, -607, -203, -117, -530, -183, -8, -540, -588, 211, 199, -421, 47, 63, -350, -30, 401, -106, -222, 413, -159, 208, 545, 54, 44, 640, 47, 30, 680, 671, 193, -39, 793, 213, 222, 950, 461, -172, 527, 587, 217, 314, 512, -112, -13, 300, -35, 134, 622, 221, -565, 387, 512, -245, 274, 344, -661, -83, 498, 193, -222, -266, -323, -410, 105, 297, -504, 1, -330, -823, -205, 419, -309, -954, 42, 22, -480, -38, 173, -657, -462, 178, -382, -127, 195, -435, -325, -149, -147, -346, 65, 57, -769, -526, 289, -361, -191, 394, -107, 102, 249, 121, -86, 147, -15, -638, -33, 304, -142, -36, 315, -691, -196, 880, 150, -245, -203, 190, -261, -102, 674, 171, -210, 223, 193, 141, 730, 326, 87, 162, 188, -260, 339, 571, 81, -164, 178, 172, 186, 393, 136, -403, 365, -51, 317, 245, 254, -510, -282, 692, 69, 34, 371, 16]
1775A6m55N55K55m95Q9J16l41J94k5k48J32j77J61r6L29k51j00K34l40j59L21
1796b85K33j05n2k95l0K97r3J66j54K25l44n7O45K49r23J21N91k24k9P01k35q03
1818d01L1P11l06K6R1j69J26j19J20N43k85m51j57O36J93m95K20K27o04M53K56
1839F46o00L43j4l86J28L56k44o4K11k42o9J48M69r14J34N78m40l26M46K1k20
1860c9m3K31j10k25M43k99l72M09l72K19M68n19l47J92K13k18L14J02l22k39L35
1881a79j63j81N11k82j14M27k91k69N57m9k94r7O37k51n04M92m3O0o5P8j14M13
1903B79j85j49j53N0J87l31M12n4p4J26K04m51L17J37k15J23J9l1j9o6j94K41
1925A73K55m7m08J36M56n57L35K77k99n06N49j87p7J31r8K20l47R4N4q1o6k81
$$ y = [16, -439, 116, 371, -124, -35, 81, -260, -66, -91, -339, -207, -384, -223, -319, 10, -241, -341, -107, -447, -606, -285, -52, -157, -209, -504, -534, -237, -330, -164, -318, -93, -437, -494, 151, 400, -523, -402, 189, -35, -64, 637, 402, -401, -370, 341, 35, 61, 152, -17, 109, -10, 110, 653, 368, -83, -240, 396, 589, 94, 314, 541, -63, 390, 646, 46, 389, 375, -11, 117, 473, 229, 165, 376, 134, 65, 213, 682, -232, -98, 480, 40, -286, 160, 181, -39, -82, 149, 39, -186, 257, -42, -414, -5, -377, -158, 310, -209, -556, -364, -151, -369, -55, 47, -275, -514, -179, -342, -523, -12, -294, -408, 19, -272, -541, 16, -33, -327, -424, 213, -38, -542, -50, -93, -33, -98, -20, -134, 279, 94, -55, -208, -158, 29, -302, 110, 56, -18, 108, 312, -139, 178, 315, 100, 223, 242, 211, 192, 126, -68, 173, 428, 381, -27, 109, 565, 8, 343, 620, 321, -185, 364, 177, 100, 231, 133, 353, 6, 100, 154, 73, 7, -274]
1947b74K63O9k6p0j16K35k57n4K47k3k95K96j39k08L07l59O28l46k27J47j97P0
1969c29n1K91l6j65j05M73r4k95K02k12K30k64r7M75k19k16K47J72j16j21J00
1990a30n8K67k11J63Rr9J31K49j18j05k3Km9K96k32J54N8j44J27k16K17j44J00
2013B44r8Q6pR5J53o17N15k22K21R5m20k8L48j97j4J20k26k1L9r6m3R6R8J57j46
2038A32j04j81J56P3q4j85P7J14l52K81j90K33K22j06l03K25nj58Rj84J36j83
2060c77K38M5q4m4J21m0J50k49K79l75J47J84j39R3Rk01K26j2k93L68m4j09J9
2083h8R4N5k02J04R4rq9K13J6j50j57L17j64k2J48J24k20K0J88p14M94N8K3j55
2107b2J15O4K00J31j0k09l8o7k17L41m1l3kj60Q8j46L24o6P5k02k92J38J43lj79
$$ y = [-274, -11, 58, 32, -38, -154, 81, -176, -230, 17, -6, -301, -5, -144, -352, -45, -404, 224, -122, -349, -202, -399, -329, -380, -89, -125, -290, -395, 78, -16, -311, -109, -321, -91, -355, -452, 23, -196, -412, -165, 7, -109, -230, -130, -188, 79, -132, 31, 40, -59, 72, 321, 203, 98, 75, 77, 28, 324, 92, 246, 304, 160, 287, 71, 288, 144, 244, 146, 232, 225, 320, 473, -144, 371, 149, 370, 465, 45, 17, 365, 168, 154, 274, 48, 27, 66, -30, -73, 23, 121, 278, 132, 28, -153, 3, 76, -8, -193, -116, -2, -354, -73, -263, -30, 192, 86, -217, 8, 3, -155, -146, -330, -194, -377, -139, -94, -178, -222, -101, -141, 9, -240, 39, -336, -189, -5, -144, -51, -42, -243, -17, -29, -322, 46, 2, -107, -88, 6, 61, -141, -37, 57, 48, -41, 172, 188, 38, -119, 198, 34, 12, 160, 284, 64, 84, 272, -442, 52, 110, 133, -22, 93, 157, 357, 488, 478, 269, 231, 164, -53, 288, 247, 214, 212, 52, 140, -6, 318, 252, 327, 125, -167, -29, 114, 111, -68]
2132f8l3J26j17r5r3K44k06k4n5k25L96m0k00R9L3L26l50J46j16j9J37m0l53J46
2156c81K81k06M2K80j93MM10k07n05L46P9j53P3K25l67J6L09j41N7K1J00j94o0
2179a64L11l97k8L02k29K20M31m08l2M09j86j77K88P1l91K98Q8k19J0L68n46J05
2201A24O6k3j87L70k17j85J92J00j85K21K40o23JK29l4k64J57m5l7j36M95l76
2223a17K30n04N9L16R7L8l70N2J02j23L60N0n11J86r5q4L67j13k8k80R4J42nK31
2247I4j00n49M13j34j1K81J91m73j22J10L03k68L85rl41K71om0J73L9l42J96j15
2270e4J9k2J78k83k59N33J27l05K88q9l78J98N75m57J88pjl57N67p1j02j95J03
2293A96n08M10M28p61J84J47r7J79J3K00m23j7J11k10L28K39k71m33Q31q18L61
$$ y = [-68, -101, 25, -92, -187, -280, -36, -242, -266, -321, -546, -150, -190, -390, -291, -258, 68, -282, -136, -252, -271, -134, -174, -527, -381, -100, -306, -264, 16, -177, -173, 237, 30, -475, -129, -50, -203, -130, 95, -272, -256, 53, -88, -31, -10, 90, -104, -164, 147, -250, -278, 24, -205, 15, 446, 38, 6, 415, 229, 52, 340, 411, 20, 318, 406, 187, 197, 565, 19, 124, 190, 167, -20, 350, 133, -52, 140, 240, 55, 276, 516, -107, -106, 123, 89, -175, -18, -63, -100, -236, 259, -117, 113, -391, -332, -16, 81, 119, -251, -199, -97, -220, 140, 190, -321, -135, -230, -314, 53, -60, -88, -368, -274, -132, -137, 94, -6, -555, -142, -276, -287, -6, 185, -288, -410, -300, 3, -265, 120, 111, -230, 41, 35, -5, 168, 207, -135, 61, -54, -35, -57, 121, -162, -421, 112, 239, -66, 222, 133, -245, -47, 528, 71, 259, 252, 251, -106, 461, 390, 288, 93, 196, -312, 98, 526, -235, -51, 96, -1, 178, 191, 391, -32, -49, 62, -148, 180, 419, 148, -285, 546, -272, 89]
2314H9L9l33J05l40N09m57L09J75k89J20P9l71q3N00l53j12N49k15J00k00K12
2335C3l46lO48n15l60N04l48J50L96P0l82j5j03M4R5J34Rm23M24j21M2J33K88
2358C54q39J98M18k54K14L73l22m25K77J63l60M83K87o22K31J51j14q1O4j22j42
2379f8R6J31j98O6L70m99K42K64j05j75J47l21r9L29n1r9k43M76k62m0L58l11
2401HJ28l98J43N0L66%l86r3j2J47K0j17jj09K12j97J37Jj75l10N26r1j92m8N40
2426A49l19j66J97J10j34K72k70k48J21L21k42J95P1k31Q2R7P9j95K43n7k95L60
2448A40j90m2J41J2O6L2L49l45j79M2N6j66K05r9jK85j6m91K60Q2rj8lr7K27k21
2474B0K05j88j0M9K0J64K25m08j15P8R4J29j76j5k66J45N31l71J15k14l9j65j05
$$ y = [89, 128, -205, -100, -440, 69, -388, -79, 96, -193, -73, 6, -365, -448, 52, -301, -413, 136, -79, 21, -179, 33, -313, -316, 332, -183, -543, -39, -387, -237, 159, 229, -153, -168, -271, -227, -132, 2, 11, -412, 12, -109, -67, 66, 354, -485, -287, 131, -123, 91, 464, 142, -283, -6, 157, -203, 280, 567, -55, 176, 327, 213, 132, 196, 74, -68, 28, 159, -39, 27, 397, -102, 140, 404, 299, 124, 271, -50, -149, 180, 129, 30, -213, 263, 1, -39, 319, 8, 136, -262, -119, -69, 297, 297, -89, -182, -194, -47, -27, -144, -145, -254, -42, -239, -102, -101, -276, -586, -60, -151, -343, -391, 149, -170, -336, -139, -29, -163, 109, -161, -409, -288, 33, -209, -14, 57, -174, -92, 5, 84, -111, 132, 75, -220, 140, -50, -92, 49, 61, 127, 159, 508, 163, -16, 26, 82, -84, 121, 22, 21, 306, 290, -201, 59, 141, 132, 114, 111, 14, 241, 20, 225, 37, 27, 76, 96, 260, 485, 77, -38, 40, 134, 263, 87, 72, -194, -49, 482, 111, 226, 12, -27, -192, -297]
2497b97M32k74L14l7m32L53l46j8Q2J22l25L25j7o9J97J4k90K10j06R4j80R7O2
2520h9J4j71L12k33L3J06k46L12q3J97j66j28J88k81J94L11k25l92M59j55%J49
2542A06J23o8k42J06P3J69q1j43L0l8J92j37N06o00j31K50L8J64n7j17l0k53M18
2565B78j82n4k1k1P5L44k32P0PJ3l51J96k9K03k65jJ44n42L90k4Pk25L14j69J37
2590F2k97j35L34p3J20q8r5J30n9P2j3n5m2k6j68P6J53R7l44J44p4K44j93J93
2614c7j93P1J29J9J38l72J41M5L54l61L5Q7k47L5M1J76j62o4J08J91J22j36K56
2637C76l08o3k0P8M08l02r9N1j04k29L50J52k01J75k91L03k27N9J99pl03J4l1
2660b0J22j54KJ50q5K76k93K76l85L25j58J19N8k88J71L22l62n8k74J31k8j3N53
$$ y = [-297, 135, -139, 175, 138, -294, 59, -287, -305, -223, -101, -426, -101, -118, -187, 10, 24, -266, -56, -162, -68, -248, -151, -89, -75, -246, 66, -167, -134, -28, -274, 38, -45, 152, -14, -142, 46, -235, -41, 270, 45, -347, 112, -43, -43, 106, 229, 161, -81, 25, 98, 267, 186, 43, 73, 35, 227, 90, 596, -4, -135, 115, 153, 317, 260, 143, 113, -140, 278, 96, 42, 21, 0, 75, 419, 187, 257, 264, 277, -74, 122, 93, 296, 31, 30, 174, -368, 22, -2, 5, -220, 94, -75, 62, -235, -370, -36, -109, 11, -77, -172, -42, -101, -29, -42, -97, -139, -165, -333, -257, -104, -7, -351, -207, -281, -37, -230, -37, -230, -159, -30, -11, 127, -245, -104, -59, 295, -66, -31, 56, -191, -156, -115, 61, -101, -165, -57, 134, 256, 120, 376, 68, 5, -15, 63, 471, 169, 70, 121, 17, -212, 138, 290, 89, 264, -27, 276, 49, 108, 307, 300, -3, 11, -20, 102, -52, -50, 100, 15, 291, -2, 274, -111, 214, 56, 175, 233, -55, 116, 438, 76, 18, -256, -125, -153, -166, 387]
2683C87o48nK95n8l46M49k03J79j74j45K5K7l3J07K1j34J13q2J73J9L7j48k49
2706c93O72m96J72J05q1k22N2J80o1m4J15k79K55J64m4j61K48k77K32J39j0p4
2728A92l44J72K50j83q9L40l52M9N5N1n2J23j65NK7j9J89k28K66O4k05J01k37
2751A0R6J7L7o5J10qk93J54L2k88j17K35L18l30J24J5k29M2K06k04J19NO9j54
2775i9J72k47JJ7L6J27k13J00J5q6O5k35K87o2j47n7L42j39m3N28m24k69J32J65
2799c4j96M06j16j02r8K27k83L9L90l04k64K31L17l01M15%l71K9J44kN2L58m14
2822A23k40M08j05L1q3J19m58q5N15o1q2j6L4k52K26J63j80J6K7l51J69M76m40
2845d6j71J29J27J13J09J09j29r9n1j44N6L31p85J81L34O6k75K21k60l7OJ9K02
$$ y = [387, -261, -266, 29, -29, -375, 74, -129, 50, -124, -269, -244, -217, -250, -143, -122, -256, -143, -225, -52, -33, 4, -144, -393, 279, -217, -45, 60, -21, -243, -191, -11, -72, -116, -1, -280, -25, 139, 95, -66, 182, -95, 137, 276, 266, 192, -152, 20, 270, 87, -2, 338, -14, 35, 90, 141, 89, 212, 47, 52, 79, 60, 249, 21, 287, 351, 146, 247, 10, 106, 123, 160, 95, 205, 197, -96, 58, 90, -198, -315, -80, 238, -92, 32, 47, -182, -140, 66, -138, -19, -14, 55, -99, 73, -174, -173, -156, -120, 7, -206, -106, -91, -177, -112, -347, -60, -122, -269, -326, 16, -123, -166, 362, -62, -331, -199, -34, -230, 176, 60, -42, -140, 87, -196, -157, 233, -71, -335, -104, 213, -88, 327, 327, -44, -15, 129, 127, 179, 537, 123, -117, 291, 186, 217, 134, 253, -205, -290, 225, 164, 82, 66, 100, -152, 74, 237, 57, 73, 100, -251, -82, 394, -46, -217, -88, 39, 152, 261, 370, 241, 142, 91, -53, 3, 334, -451, -270, 64, 130, -145, 76, -184, -221, -215, -196, 6]
2868Fr8L04n76P3J27J39k31J76j01l57M83Q5k54K1J13k23l01P75o1n26M21j19
2890a24l24N19k4l36O8L56l34J98N60n60q7K26j77j54N71L3k71r5J85j74L7J81
2912B74j12j93J39K03r0J84qn19J14K83k42M20j05m35M8L58k37J57Q6l94n3L21
2934A99Lj41k3K64l34Q5L39l39J01o8o3j35K59J35k52n7Kk71N1L67m22N2L08k08
2958a48j52K50P8l23J64R8l29K55j55O8j29J50r6J15M64l26j22J7K17j50M6J64
2980A56l91M5M06l15j34J06P3j29j29N07j15J42j93J3q2K33r3J8J0p0j22P2J24
3003A32O2m1j9J34k57K97o7l30J43j23r6L19K25l76J53J49l93J66K16l94J15k21
3025b06L41R9Q3j55j51N1Q0l5k04L4RR0k5K1k25K87j85q3j19L37k01j01L09j90
$$ y = [6, -92, 212, -364, -291, -164, -25, -256, -80, -181, -538, -55, 30, -224, -203, -90, -313, -614, 161, 100, -426, -5, -124, -448, 71, 47, -289, -221, 135, -199, -1, 559, -1, -88, 138, -39, -193, 378, 411, 140, 45, 230, 56, 93, 274, 162, -31, 108, 311, 221, 405, 397, -122, -8, 275, 33, 453, 348, -87, -39, 319, 82, 239, 325, -69, -122, 199, 202, 61, 38, 302, -32, 53, 392, 53, 154, 86, 23, -112, 147, 282, 30, -27, -25, -296, -245, 122, -300, -248, 60, -148, -300, -50, 28, -295, -131, -33, -362, -107, -262, -194, -323, -173, -269, -154, 310, -16, -138, -121, 96, -54, -8, 156, -235, -190, 216, -99, -233, -127, -54, -183, -312, 195, 80, 222, 29, 42, -40, 193, 100, 118, 128, 58, -64, 8, 132, 194, 153, 134, 268, 11, 308, 241, -89, 54, -69, -165, 154, 379, 3, 156, 305, -88, 78, 294, -100, 15, -206, 135, 234, 317, 162, 11, 62, 142, 107, -97, -63, -54, 36, 11, 32, -193, 94, -91, -174, -293, 44, -157, -258, 51, -139]
3049a39J00l08L87j8k00j87J55J97L16m89l6Q2J48k44j05L30j55J15m9N1Q9n5
3071a5o5K1P7R1k18J6M2l8J24k33K10o2K55k11j0p2R4l5J22k84L40j77J79L31
3095D82m23Q8J54j00r4K61l36K28Kk45M0K48k55j88L11Q3j21J92k73j01O8K9J28
3118A78j31o2l2L8J40k56M7K1R4j16j50L93m93J89j37K82qj33J96k98r3K04K1
3141a06j16K11j75N5q1m7J77p1j02L00j73P2O0j63J43n1p4P0J57p0j82J12p2J42
3165A6q7J35J4k09Q1j06J69j22J36J64R5l92J71J16j22L02m14K63k17J81j68J04
3187A10j55J43J62j54N9M6k71J58r3K55j24k13K11j72J78r3L04m90J8K71j07j24
3209h1l0M2j21J62J5P9L5l03K37Q7k53K96j49Ml10P2R1J22n0K48k55J22n6k9M3
$$ y = [-139, -39, -347, 40, 22, -178, -365, -210, -13, 303, -186, -222, -140, 8, -236, -341, -11, -166, -51, -100, -49, 40, -15, -80, -59, 18, 109, -109, -93, -51, -89, 35, -198, 12, -50, 205, -6, -16, -88, 6, -29, 93, -191, 149, -28, 151, 482, 59, 147, 301, 201, 107, 368, 32, 260, 262, 17, 57, 305, 50, -138, 173, 256, 135, 327, 54, -47, 21, 50, 178, 47, -15, -47, -9, 131, -125, -78, -57, 37, -79, -229, 164, -329, -140, -277, 5, -3, -136, 60, -238, -331, -127, -106, -222, -11, -186, -131, -212, -259, -82, -153, -255, 45, -128, -56, 4, -159, -16, -67, -141, -71, 86, 16, -166, -54, -126, 16, -71, 64, 78, -131, -50, -156, 13, -109, 27, 191, 286, -106, 65, 181, 59, 361, -53, 210, -7, 174, 6, 110, -45, 98, 260, 106, 165, 211, -60, 98, 5, 260, 136, -77, 134, -38, 140, 47, 351, -139, -121, 150, 43, -81, -111, -69, -190, -28, -13, 66, 101, -202, 35, 122, -131, 165, 16, 20, -290, -218, -127, -5, -55, 193, -62, 60, 4, -25, 18]
3234A8m7N5q6n63K27K57M1J07O8k61J68j33J13J41k64L01j46j92J34k12j8N25
3256B33j04K4l20L13j90R7j60K38j44o7K6R5P8m3j54M82j46m09K35m8K2k57K82
3279H3M3m1K14l39K53R7k49L05j06j08K6K64n47Q0J98o4j20o0K59k71J6J96O0
3302A89k20Oj7q0K61j11j63M95m57N8j24K89q4k27k5K47k52J89j88J60Q4k79n0
3325b99j64L82Q5p4k1k02J42O4J19j64L03j42j42j14K27P6j51J81k7k35L91o5
3347A70j38J32M6k63p4K61j65J16K19J38n03K60J9k49J62J44l24j58M23k84N5
3368a3M67o37M9L14q0j01N18k49m03K25K68k15j49j30L19j26mM3k60M15l60l7
3390a46L32l0m43K13Q4j15P1K95j66m81K68q9k8M03k08l41j16N72O1k4q5l70J39
$$ y = [18, -29, 26, -60, -623, -396, -139, -98, 9, 77, -184, -16, -149, -36, 105, -159, 142, -4, -196, -62, -274, -292, 233, 129, 153, -167, 146, -44, 53, -107, 131, -13, -80, -54, 41, 119, 76, -78, 404, 258, -151, 84, 36, 58, -199, 83, 126, 85, 299, -40, 213, 310, 61, 366, 260, 152, 178, 442, -105, -25, 173, 109, -11, -71, 188, -83, -67, 129, 189, -31, -25, -42, -122, 139, 28, -135, 360, -97, -39, -163, 126, 42, -185, -210, 37, -215, -26, -214, -54, 30, -249, -299, -463, -81, 4, -70, -91, -293, -151, -87, 32, -132, 171, 29, -113, -227, 0, 76, -75, 106, 79, -156, 235, 170, 32, 164, 210, -53, -127, 134, -31, 85, 304, 442, -61, 199, 218, -31, 131, 275, -49, -207, 216, -68, -13, 454, -183, -134, 180, 100, -1, 517, 268, -135, 90, 358, 143, -6, -136, 183, 57, 53, 96, -164, 251, -109, -146, 186, 156, -287, -74, 10, -105, -34, 261, 95, -386, -118, -207, -235, 168, -40, -381, -497, 75, 136, 112, 27, -343, -204]
3413b04L61j49l16K79j3k48l9L69j80J51K09l89J72n4L8l3R4J16k01J16K45l33
3435iQ9K14p2o02N23J8m05M0K08jJ72K48m61l5K81j54k20N84n11j36K90L85k57
3458A89J64k53j33O9J65pK70m34K63k68J92m2l15K85K2k24K38K42n03J2K66l50
3480a52J04K40l3l06J86j9K2k38J91J32o2J03l18K42j09K2k51K06pj33l0J65J03
3503E8k12M4M6j5O6j11k16K52J24l88p4L10K67m38L14k84K10K14k08p5K8J83j60
3526f5K76qk11N0J11j68l5K7k37J71L58p6j11m2j05M06l33K43j72k61N02m41L59
3549B38R5j25L2k7Qn9j1j23J73l65J33M1M8Q4J5K3j10l34J63K58L4k70l6L05q1
3574A09j11l7QN0k54K24k29M00m2k10K8L2j30J89J7l93R9J71j2k39J51L3j06k5
$$ y = [-204, 157, 8, -308, -29, -42, -290, -329, 40, -140, 11, 220, -169, 3, -51, -13, -46, 48, 164, -37, 79, 324, -9, 80, 294, 222, -380, 143, 161, -244, -204, 4, 3, 175, 423, -38, -73, 208, 54, -166, 418, -93, -229, 61, 446, 189, 353, 100, -33, 36, 201, 194, 464, 30, 293, 25, 217, 175, -140, 145, 167, -57, 181, 423, -80, -68, 198, -152, -48, 192, 159, -147, 39, 20, 42, -196, -5, 127, 65, 168, -150, 92, -17, 5, -246, -40, -47, -180, -210, -45, 58, -154, -110, -64, -79, -13, -124, -340, -88, 36, -352, -426, -116, 151, -287, 27, -257, -47, 167, -41, -116, -88, 95, -65, 211, 203, -8, 42, 153, -15, -50, -23, -260, -89, 269, 193, 82, 40, -65, 341, 8, 251, 79, -182, 320, -121, 238, 333, 208, 240, 213, 221, 162, 151, 28, 201, -164, -31, 10, 58, 142, 157, 180, 70, -264, -101, 157, 191, -79, -115, 190, 109, -2, -39, -31, 19, -235, -11, -240, 160, 118, -92, -64, -32, -162, 27, 44, -349, -250, -79, -91, -330, -179, -146, -252, -277]
3598b77L20j34k7K0j15j98M74j92l64O01R5k81p2K04k9k38K49k43K00mm8O8j15
3621a06M36l44j40J03L4N00o94J59j49L00p2J52J50k46k8J53j99J85Mk42J41K12
3643C09j97q7J82k19K18j58j69MK65J88m32O1J45J60r9k24N4M7r1j9M4j12N5L52
3667B77l60k06J57PJ28k00q5q5J11K28o6l14m4J41J81K65j98K07k98k05K87O8
3689dk71L05j61j9J92p2q5J80N1m49K23j87K46q8K09p7J0R1L8j29P6P7j69J40
3713A27J45K6k80K38k16J08l5L21n20K63j65K58m86M80k99p5M7N6L9j0L27j09
3735B40m6j62k6q0r9L61r4j51j3K00q7R0o0j07R2L6l0j02M9n3K59o78L22j40Q9
3760a90J14j6J19p4p8m19N03p2j04J50j3K38n09J48J66k81K57R8J1%j14m8k6j07
$$ y = [-277, 43, -91, -118, -98, -213, -411, 63, -129, -493, 108, 203, -78, -150, 54, 25, -213, 36, -207, -7, -11, -59, 9, -106, 330, -14, -154, -51, -17, 483, -211, -52, -201, 99, 27, 179, 329, 83, 55, 208, 9, 194, 198, -44, 97, 309, 112, 25, 207, -12, 206, 48, -121, -117, 148, 336, -96, -35, 110, 270, 171, -53, 1, 48, -43, -62, -18, -130, -75, 277, -83, -289, -132, -125, 3, -197, -282, -367, -256, -28, -94, -408, -452, -311, -130, 135, -63, 144, -154, -359, -72, -4, -275, 30, -131, -150, 42, -30, -115, 65, 116, -333, -110, -297, -51, -139, 70, -7, 3, 94, 132, 3, 79, 156, -13, 127, 272, 298, 18, 256, 40, 148, 113, 434, -86, 177, 12, 270, -216, 264, -35, -110, -63, -7, 32, 22, 349, 240, 194, 32, 6, -74, -173, 188, 94, -57, -70, 130, 43, 133, 73, -34, 58, 94, 64, -38, 11, -42, 217, -461, -139, -279, -190, -76, -92, 27, -47, -125, -544, -41, -113, -217, -67, -80, 158, -351, -203, -37, -318, -61, 37, 48, 48, -66, -114, -140, -247]
3784b47J13K26j38K4j86K04j40k18K53J78J46r9j45J99k39K4oR2L7k58n3L6J79
3807a8K0J44j93K91k41k03L76j45M50l60j07k17J62L19k57Q8Jj07j59J46J01p5
3829A6j37J55J45n6l59J66K87j16K0j73n3O5J72o7K8j05j25K90l17J39k01l4P0
3852a90J25j82K12J88l47p8K94K9l9j28k19m5J39L8k24N36k46k44J04J10J6J35
3874a6k90K97m32P79n70K70PM7j30K99l80O3p8K21j9l2M47m84R5K54p8k93M8J66
3898A91k17J8J36k56N56k17j79K1J83r5m4J86j71l04K34K8J2o5K2J98q2k03q7
3921a35J37j20J23NJ17K1k23J81j37k9J99p6j17J17N7n8j27K07p9Pj97L15j33
3944E5j84J79k12k23K16J47l21K25m9l10M34r9r1K40m31k2K35K36o1j08Q3J11
$$ y = [-247, -134, 92, -46, -22, -208, -4, -144, -362, -109, 69, 215, 116, -29, 170, -69, -45, -51, 41, 78, -180, -233, -197, -18, 2, 146, -47, 244, 3, -200, 176, 31, 481, 121, 14, -203, -41, 278, 21, 109, 110, 3, -156, -10, 91, 16, -121, 34, 179, 123, -236, -70, 217, 101, 121, -52, -105, -40, 132, 65, 93, -12, -137, 153, -164, -25, -226, -260, -190, -65, -247, -35, 153, -194, -272, 22, 51, 12, -116, -335, -380, -241, -203, -427, 109, -137, -381, -277, -167, -151, -16, -306, -9, -441, 338, -232, 38, 45, 92, -38, 261, -119, -56, -134, 87, 68, 36, 483, -1, 94, 348, 270, -23, 25, 191, -26, -8, 128, -128, 428, 211, 32, 53, 236, 141, 97, 283, 112, -192, 42, 70, 82, 17, 39, 237, 155, -48, -135, 2, -118, 5, 10, 127, 148, -75, 106, -31, -60, 139, 63, -54, 63, 120, 62, -65, 142, 63, 70, -127, 188, 55, -129, 50, -162, -385, -169, -22, -343, -118, -167, -477, -43, -142, -233, 7, -424, -446, -211, 25, -36, -144, -61, 50]
3966E0k69P2K9O9k31K97m18L79K37j61j83K92m06J27R7J96j44nO0l1q7L39j2m55
3990a58j6K6J56P5M4P2k28J78o3k43N01r3k74j3J91j60Q7L2p9m5K51M8O5M4k74
4015A24j67J55M5j24n1L3k66l6L30j78J6K21L0m3q0L7l8n1qk44K86k0r7Q5l26
4040c67n8M95R7Ol65J15K77k55k0J24j98M9j53j48L55J52j21j6l8j16j06K61K01
4063A71j73k18K81r8J62l55K81j04k7J44j68K20k90K61k3NK16p4m8L0l57L34O1
4086B31j83P2l06L68k10L14j87j20O3j23L04K1o2j24J05m5J10j52k08L8J41j47
4108a00NQ2J39j34k47L83R5m92M30j43l20J39J39M40o70K03k84N6k5K02k9N2M2
4131c7j59L7j54K24j25M92k90k17J21P3p2K75l81K10k54K3K36j34P6pR7M9j35
$$ y = [50, -219, -147, -118, -49, -280, 17, -401, -22, 215, 54, -129, 163, -243, -116, -19, 177, 33, 28, 88, 57, -30, 309, 297, -158, -174, -148, 8, 83, 127, 199, -29, 149, 86, -157, 344, 251, -23, -36, 155, -5, 82, 114, 35, -10, 241, 289, 354, 398, 124, -43, 112, 157, 33, -18, 15, -251, -287, 43, -135, -119, 102, 132, 89, 9, 46, 8, -43, -51, -295, -9, -29, -126, -41, -367, -425, 70, 167, 173, -192, -77, 200, -55, -75, 49, -149, -100, -253, -401, -46, 106, -15, -31, -69, -185, -291, -30, 171, -2, -220, 61, -37, 125, -230, 51, -53, -80, 64, -104, 116, -174, 87, 64, 69, 285, 211, 163, 193, -164, 170, 231, 48, 120, -186, 182, -28, 286, 99, -21, 42, -81, 223, 244, 182, 58, 163, 118, 228, 76, -132, -94, 47, -100, -95, -13, 126, -8, -255, 128, 223, -269, 161, 18, -302, -163, -24, 416, -254, -51, -335, -279, -304, -102, -131, -79, -37, -196, -159, -313, -89, -214, 278, -12, -229, -108, -35, -107, 168, -213, -3, -257, -234, 2, -132, -56, -63, 34, 83, -52]
4154e2j97K16j79J45J00M1j32k63L23J03N9K7n7j15R6p7J09j47p4M2K81j62o8
4177A9J27j08k3J45p0l7m5m8J95j4j6L5n9oj64P8p3J12K71l28q3j0o6L9lJ40m1
4204c3K20r1j94j45J26M1J07O7j49r9K96k07j99N57k06Q4n24K51LK80k84L44K
4227B47m32q1n8L19m8R8j9j15j84L42k23J90p7N4rJ96k06n2m5N3L04n67K55K2
4251c6M6J72k66K03J87J5k24j5N6R8k43J81j37p5k6K39O0%J6K5p0j04p7N3k63
4276a85K49k30L29L1j23K8q2J38j53o3j35R5nJ6N14k06m32o4L52j48M4j74K88
4299H4k23M6J25j3j96J97p9q2q8P0K89j13k05m7K59j02k35K32o8m7L8R4j2p7R4
4324e9k39J06K34j92L44l30N8j75J29L07k94p7K01n6j32l2M43%l08J58k79K53
$$ y = [-52, -249, -33, -212, -67, 33, 74, -58, -321, 2, 105, 164, 191, 134, 19, 115, 38, 147, 0, -74, -32, 249, 87, 19, 146, 38, 15, 160, 90, 53, 8, -40, 155, 141, 125, 160, 101, 95, -69, 9, -64, 48, 319, -9, -92, -102, -168, -129, -132, 8, -33, 187, 96, -98, -243, -117, -76, 31, 98, -51, -150, 146, -61, -260, 297, 91, 175, -349, -98, -95, 185, -99, 245, 247, -185, -266, -324, -5, -53, 45, 26, -89, -273, 69, -154, 36, -41, 13, 4, 200, -6, -58, -103, -50, 254, -313, -58, -36, 10, 182, -84, 119, 306, 321, 97, 82, 138, 236, -7, 174, 37, -38, -64, 175, 235, 235, 251, 276, 206, 102, 25, 78, -185, 64, -166, 163, 194, 71, 99, 17, 155, 2, -61, -196, -101, -106, -90, 424, 218, -214, -278, 74, -74, -30, -204, 84, -139, -93, 32, 19, -177, 20, -59, -141, -229, -159, 130, 17, -188, -235, 24, -78, -313, -81, -149, -196, -158, -64, -76, -153, -59, -298, -192, 42, -150, 194, -136, -78, -253, -124, 183, -111, -188, 13, -43, -175, -207, 236, 236, -72, 86, -193, 60]
4346F0m7L54k63O0R2r7k67L76l20K8O5J38j93l9J86m04M39N1m29M42L7n48M37
4369A58J46q3j73k9P6l29L80M2K6k52J12p1J19l1R3l02K01j71n5Q1r9n1J38J5
4393e9k6k9j49L73m0j41Jj42qL8K01k3k44K09n4N2j47O0K6l7J71j50J71o9L3O5
4419H2l4l8K24n10O3L34l0n4J69k61Q7k75N7K25k28K09j83L57l44L39k97J92J07
4442A91k20m4Q2L34l36O7J33l23K38k34M8N9o0K9J2lL46k61J90J1J02l63K24j84
4466C8j87L97m08K01j59R5k30J65j28L17k43K10l98J00L74o9k78J98o4J0q5N92
4488D48o16R2j48mK88J01k20j82K61Q7l19K31p4l10P0N9M25o7q7k87L65N6n3k57
4512a41L9N8l82O19Jk29PJ9o6J82N5l0r4J66k91J97L5n7k96K18L5J90k32K29k25
$$ y = [60, 13, 367, 104, 164, 256, 159, -108, 268, -52, -24, 41, 179, -14, -53, 133, -271, 168, 219, -210, 232, 269, -279, 158, 304, 221, 48, 19, 95, -234, 146, 188, 214, -38, 74, 3, 122, 91, 184, -118, 83, -88, -143, -62, -161, -212, -74, -59, -85, -114, -263, 110, 70, -71, -70, -212, -220, -182, 19, -4, -248, -39, -93, -41, -188, -128, -102, -139, 32, -118, 53, -16, 17, 82, 48, 10, 234, -276, -213, 121, 91, 37, 206, -55, 32, -243, -186, 39, -189, 20, -163, 194, -150, 189, -108, 84, 191, -29, -73, 9, 343, 7, 74, 207, -116, 122, -112, -64, -5, -65, -36, -24, -27, 319, 58, 248, 259, 361, -2, 222, 38, -149, 248, -160, 41, -118, -23, -253, -88, -216, 101, -142, 68, -330, -230, 144, 75, -203, -5, -69, -59, -144, 448, -168, -76, -224, -228, 60, 161, -59, -241, 20, 107, -212, 19, -55, -365, -295, -236, 189, 122, 35, -252, 113, 169, 116, -141, -102, -44, -426, 193, 194, -35, -28, -9, -75, 107, 162, 132, 38, 204, -87, 110, 145, 88, -208, 10, 45, 235, 3, 232, 7]
4537Gl9L26oq1n0K8k04K1J37J5j32J74m47J76K63k62J25N5o0q4J92n7k04L46j70
4562F9p9q3J82k04J50r0q2jQL6K24k67k2K5n2K08l1R2p9Q1m49K19R7j63K22k34
4588b23J16l4k3j12K09O7j61mK05j62p1K54N5N3J20k08m9Rj19Q9J11L7j16l70
4612c27L88k92J06J04K45k82M3Q9P9p3j87K98k69J63K42m34K19J56j34k62J27
4633aQ7k5n8J02J77k32N9j73Q2P6j11k8M25m85K7K3L48l58J91j33k94J17L32j61
4657a3r0L36k49K7k39J45r4J72j08l2r2L75j20k67J28L0K33k40K06J7k28J7K64
4680A78l99J60J72k27K1M5j4k1Q2j32K43k5j52K02p7o1j29K80k10jJ3L25l35R6
4704C4l3L9n9J19k16J17L20m33J31P7J31n8n1m3j68K98l25QJ05K52k5n78N20Q
$$ y = [7, -32, 294, 288, 207, 157, 185, -19, 2, 139, 154, 22, 196, -251, -75, 188, -74, 51, 106, 46, -38, 154, 97, -107, 239, 69, -10, -93, 89, -115, 35, -55, -137, -138, -130, -94, 130, -137, -159, -134, -186, 22, -9, 83, 4, 85, -364, -145, -48, -211, 11, -223, -107, -141, -164, -276, -67, 0, -161, -165, 40, -122, -193, 61, 116, 169, 289, 81, 32, 41, -78, 11, 122, 159, 43, -327, 61, -231, -125, -21, 224, -58, -15, 74, 153, 80, -107, 191, -78, 85, 327, -107, 112, 268, 134, -128, -1, 86, 61, 3, 105, 282, 50, 109, -64, 18, 94, -17, -45, 380, -105, -78, -55, 293, -65, 126, -7, -301, -184, 148, -13, -103, 233, -16, 11, -228, -83, -177, -5, -113, -145, -237, 138, 18, -249, -121, -91, 142, -98, 108, 125, -103, -86, 178, -221, -61, 111, -116, -95, -50, -64, -85, -3, -135, 108, 83, -69, 133, 56, -5, -134, 146, -64, -65, -52, 273, -62, 34, 1, 40, -19, 100, -116, 1, 321, -112, 19, 96, 227, 169, 118, 75, -93, 205, -120, -112, -7, 245, 220, -358, 162, 170]
4728A70l11kK72k19p6M5K43K0J0J80k55p9J98m17K35j48j05K74J67r4n1l9j59
4751a41P9k36L03n2J43j90J80k04n6P3j28K75j70j10j86M32J7k38J13j78K5J23
4773a26J4n3J91P3j99k27M24K3k97L89q6j16J64j07j77N0J73q6J19J2j04R5k58
4796a09K32K36j79j58j00K6K63K37m24k90O7K64l5RMrP3n1M2n9J59j60j64J07
4820a9K08k48lP1J98l03l9J99q5J22k87K46j69j23O8j6O4J26k8N1L7l36K82J09
4844A25j83J4J63q0j48N6j37K60j31k11j49L71K07j55j09J45k59j08K3J0L28J60
4866A92j99j57J24J46j48M2q7K20j44J6m3j22P0K59k7j89K70o4k70Q6J26J19J11
4889C31m91K40Q1K20k35Nk20J38j29j08L34j58O0j43L60j46k5k19K42l23J53q1
$$ y = [170, -141, -143, 129, -90, -166, -121, 122, 142, 152, 332, 77, -2, 196, -221, 14, -134, -239, 35, 202, 108, 57, 18, -141, -62, -298, 5, -47, 96, -94, 86, -118, -174, -101, -229, 46, -124, -234, -420, 12, 29, -209, -96, -274, -249, -126, -112, -165, 26, 99, -100, -327, 97, 120, -177, 212, 126, 10, 174, 67, -110, -60, 113, 27, 146, 158, 54, 149, -109, 123, 359, 180, 22, -78, -52, 211, 448, 24, -266, -199, 65, 30, 39, 43, 34, 107, 56, 98, 39, 198, 38, -126, -19, 189, -59, -62, 9, 207, -96, -135, 64, -21, 101, -186, 60, -109, -232, -164, -180, -116, 10, -18, 33, 70, -266, 16, 125, -58, -44, 119, 39, -109, -53, -190, 70, -61, -272, -421, -50, 157, 2, -107, 38, -221, -329, -306, -296, 32, 192, -7, -164, -40, 106, -42, 0, -87, 133, -11, 5, -38, -160, -90, 169, 142, -47, 223, 159, -111, -25, 101, 220, 331, -160, 80, 161, 381, 146, 151, -69, 69, -60, -168, 166, 8, 68, -75, 285, 139, 114, -105, 137, -186, -33, -114]
4911a14K67j45L10l44q3L24l00KK3K18j70k24P5PN53l98j7K8Oj55j09L42p0l0
4935dj14J68l50L58Rk07P3OJ15o1k89L38K8r4J09L9j13pJ54k20k20J50j49J75
4959a06J1L1j3J76rj26J13j44pJ30Q3m0oK56k19J16l54q9R1O4K29m8j2j15n0K5
4985a3q0J65M5p1J6P2k69K14K3j95K46k31K3J87j27j69J71l21J72J93Kl16K45
5008a8j12m0K9J38j17O6K64k17j47n6K99j39J48p8l7p1%kJ70o6n5j33l4K16k32
5033b24K60K60m55l0K04q3k85L47M2L01M3l51K17k68j08j8q0L79r6k78J88r5K01
5056G1k0j15J5Q5j34J17m2L20K8l04j75L19l95K38K15l22K37k81J23L67l57p8
5078h8K4K76j73j03L04j9l90L27J34k92J52j22P5Ql11ML18j50P0l3k5K33o49L92
$$ y = [-114, 153, 8, 318, -26, -109, 215, -85, -83, -60, 158, -12, -236, -161, -154, 399, 1, -16, 12, 18, -137, -246, 96, 26, -4, -118, 50, -300, 58, 67, -140, -67, -61, 54, -7, -296, 42, 70, -24, 85, 124, 11, 4, 158, -62, -282, -132, -281, -106, -95, -64, -77, 99, 90, -36, 77, -67, -74, 56, 139, 99, 93, 349, 130, 246, -108, -197, -106, -42, 187, 139, 127, 12, -38, -13, -93, 72, 117, 46, 62, 134, -135, 79, 102, -93, 153, -78, -55, 132, 5, -164, 7, -314, -142, 51, 53, -263, -18, -130, -170, -141, -3, -120, -54, 210, -7, -154, -210, 89, -50, 98, 20, -17, -88, -88, -90, 80, 14, -41, -174, -208, 8, -224, 36, 296, -159, -189, 15, -68, -353, -6, 36, 337, 380, 29, 246, -22, -130, -148, -228, 151, 55, -223, -35, -130, 71, 51, -64, -49, 36, -98, 19, -23, 297, 325, 21, -154, 165, -230, 8, 223, -99, 138, -143, -20, 347, -10, -88, -64, 212, 39, -64, 240, 221, -169, 158, 292, 0, 152, 30, 105, 113, -198, -194, 124, -26, 44, 11, -14, 219, -430, -38]
5102c8K47l33k41K72J02j8J03l41j3J0K08J28l76L33j78L8K01j74KK0L7Pj0J85
5126A71k17r4L60M2l32j3K85k00k98J81r1L80O7l33M6K94l68J72P4l58J23K93
5148A84m30M16l8j85p3K86k42L54l18J10j00r0P6Q4J73J06j78j73K1n1J13NNL43
5172C98l71j94L27j04J38k50J40n5K27k66j05K47K7k51J51n3j4K7k49M7K71m1
5194D7k26J36Rm5O9j6j2Q8k01K7J82O1l12pN3K54m22J62M42l95K71j85Q5K8l11
5219b18K04o8r1M26j60J60m02N2M0K14l71K77M7j56K42k90L91j92j53J94k06J04
5241D4j9j3m7J53k3J07J0l75j0J66Q7K67Q3m69J91r0J20p1r7J25k69K84j95k3
5265f4K99k88K52l7m1k33J30o2M4m8k4P9J90rp5P1Mk70k33J16M07k09J08p6j06
$$ y = [-38, 209, -124, -365, -93, 9, -9, 94, -247, -260, -250, -42, 86, -290, 43, -135, -97, 104, -70, -68, -48, -11, -4, -14, 171, -46, -140, 220, 262, -70, -83, 202, 2, -296, -115, -206, 174, 241, -92, -46, 248, -120, 52, 126, -232, -109, 184, -246, 170, 132, -53, -126, 160, -82, 272, -46, 64, -36, -126, -50, 34, 207, 313, 135, -38, -17, -68, 45, 50, 55, 398, 27, -167, 160, 56, 194, -56, 84, 29, 256, -10, -115, 132, 159, -92, 59, 6, -8, 19, -230, -183, 88, 47, -179, -43, -34, -79, -10, -26, -38, 50, -151, -124, 58, 119, -193, -200, -147, 107, -315, -153, 289, -106, 165, -20, 65, 93, -218, -14, -82, -173, 253, 93, 253, -149, -97, -57, 157, -214, 63, 110, -46, 196, -94, 297, 105, -48, 146, -60, 44, 25, 12, -35, 118, 95, 202, 212, -163, -173, -7, 80, 347, 430, -39, 152, 62, 182, 111, 14, 139, -130, 154, -41, -64, 235, -53, 199, 162, 121, -112, 18, -44, 0, -48, -72, 7, 197, 188, 113, 184, 188, -82, -315, -199, 208, -1, 107, 31, -75]
5290g5J85r7o3j83L83j39l71L49l2k44J72L08m55K20J21J6o6l8J74j68k14P7P1
5313f9J92k64Q0K43j07J09j74r0J36m8j58J19j09J60j26J5K45l9k46P3O8l8K1
5336gK58j28J19r8k56%J63o2K8LJ15j19N4j35K98n00K23R3k90J82K38pr8j8r1
5361c5L1l1o0n9J31J5k62J04K89l7k01j15m8J00K55j81K48j86r9O0n3J65j04J58
5385H5p8J79l01L19k42K1q3O5j71J36L7K07k80J74j44j95M0P8J72RK38l11O1J40
5409A56l31L3J11l1jJ18J10m36L68J33k52K25j33m9M0j40K63pm26J77K6l7N4O8
5433C9KK16k38Oj06J83o8J43J33l74K71k37k1N8K33j69j61L3pJ23LK76l01q8l8
5458h9P0Rj18J03J54j06q0j9L03j86J05j72o7J01Q7j41J30J00j45R2l45O2J60
$$ y = [-75, 110, 13, -50, -233, 150, 11, -360, -11, -43, -287, -115, 193, -262, -42, 79, 95, 29, -9, 165, -3, -217, -140, -69, 123, -141, -61, 182, 75, 184, 10, -80, 56, 8, -150, -31, -140, 20, -106, -91, 154, 115, -131, -58, 10, -28, -7, 251, 123, 242, 144, -112, -112, 51, -11, 17, 20, 135, 16, 70, -65, 233, -267, -44, 49, -241, -59, 179, 172, 74, 56, -35, -4, -35, -95, -154, -23, -8, -270, -166, 123, 86, -115, -230, -278, -178, 77, -104, 144, -42, -141, -81, -134, 31, -73, 85, 7, 186, -115, 204, -38, -17, -100, -35, -206, -70, -33, 174, -106, 68, -76, -271, -231, -153, 19, 28, 266, -45, 16, 156, -175, -142, -31, -62, -63, 55, 165, -271, 97, 230, -22, 203, 70, 21, 61, -79, 184, 177, -249, -72, -46, -83, -29, 39, 41, 257, 19, 25, -81, 102, 34, 177, 310, -64, 207, -30, -51, 7, 240, 71, -90, -57, -64, 59, 62, 338, 37, -51, -89, -19, -10, -128, -25, 129, 23, -57, -76, 227, 41, 146, -26, -93, 8, 95, -46, 84, 184, 39, 131, -214, -152, 8]
5481HM6j8k76N8J86n7J45j18L01l57l9L67l53n6L34K6k20J45k57K7J44m6k15L64
5505A39l86N58m10K01o1J35O0n28L49Q4j47K14m13J89j08K99m1k25O2k00J96J90
5527A57n5k7J02Q9l1k54L08n39K22jK53j85J50j30JP4j37J6J5On5N8j26M84o44
5552b49J01K19p8N7J3j30j83N1K97l15J63MM4J98m99J68K9J30l17O5L72j94J37
5575H3k1k15K87p9L6k58K38J26l08P3Kk66n2L07J47p9K7j57K21O2k98K00k43J79
5599A2J64k76Q8n2K66O8k91o8K25o5J46K4LJ2j16k44L24n60K58J90J18j26j94
5622i4n3j10M14k34K3P3K7J01l84K25J07k2J24k31J78j12j48q5K33j71k2K95j68
5645c4O2j02K74j92K74l7k83L5k79N05j87L2J16l75L81l62K84K0j10N3j83j7K29
$$ y = [8, 54, 36, -240, -182, 4, -53, 92, -26, 275, -82, -121, 246, -107, -163, 171, 197, -23, 122, -135, -108, 36, -10, -225, 139, -247, 311, -99, 102, 41, 176, 236, -292, 57, 141, -6, 208, -205, -16, -124, 175, 134, -91, -29, -229, -33, 157, 102, 75, 177, 266, 235, -19, 289, -250, -28, -29, 224, 39, 189, 59, 60, 134, -3, 13, 28, 34, -21, 37, -89, 395, -249, -148, 71, -7, 50, 63, -67, -250, -199, 98, -217, -54, -50, -6, 192, -307, -139, -110, 20, -297, -232, 140, -54, 83, 62, -153, 134, 55, 91, -167, 71, 197, -111, -38, -36, -302, -354, -47, 100, 21, 48, -109, 112, 174, -124, 76, -167, 12, 176, -100, -12, -64, 202, 270, -21, -89, 136, 71, 217, 241, 244, 256, 140, -104, 220, -340, -82, 108, 226, 100, -94, -147, -257, 157, -77, -54, 19, 46, 147, -237, -12, 95, 73, 197, -34, 144, 32, -116, -201, 32, -139, -161, 134, -34, 28, -74, 200, 8, 282, 245, -38, -3, -282, 223, 36, 68, 184, -191, 190, -172, 112, 132, 22, 75, -108, -125, 104]
5668A04L1l33K12q3rJ76m03O76l67j3j19J37J87k31N9m1J33j08K89m20K79j90
5690c4j4J68k1L1l6R8k8q0L13n96K27J2J56k35J77J67m06m2Q7K45Q5n10L43j74
5714f7q5K70pj7j68K03j52M4k7P5rK11l32o5M7L34r7j39r8P6j05M2K07m02L8L36
5740A13Oj08PJ1q0J9L13l3l48k8K6J49k03ro7K28j44j27K88P4p8J08Q6k22j04
5765a23o0J24J53l31K06J97k81L4J77j09J82j45Q3k1j08Mj46k54L21R8R2j6o2
5788A5J28o5o3K96k58L2j87R0J47j91L44m46J31j0J48J07j24j60p3L93k13J53
5810A94j74J62J22l46m6L79l36L3j90L37p1j20M7N2j28R2K6pJ44j30j62M04m58
5833a76J90pk8j80R6k45K62J7L0M9P3j38o4jL9O7J8J05k58Q5Q7r7l15J88j04M05
$$ y = [104, 135, -198, 14, -69, -78, 98, -305, 371, 4, -9, -128, 9, 196, -35, 24, -17, 116, 8, 297, -123, 156, -34, -48, 120, 99, 130, 94, 192, 164, 84, 397, -199, 28, 40, 196, -39, 138, 305, -101, -143, -56, 189, 274, -236, 107, -67, -152, 118, 111, 94, -74, 129, -23, 21, -6, 69, 60, 271, -61, -126, -79, 255, 158, 19, -79, -3, -108, -66, 141, -261, -223, 113, 119, 11, 18, 29, -51, -32, 281, 248, -100, -128, -102, 47, -156, -165, -232, -4, -148, -275, 13, 87, 9, 117, 203, -19, -123, -183, -59, 94, -237, -31, 166, -115, -81, 96, -13, 169, 24, 107, 86, -22, -18, -164, -418, -97, 1, 93, 77, 15, 143, 78, 15, 311, 53, 85, -102, -12, 135, -56, 288, -158, -27, -37, 111, 218, 94, -66, -139, 254, 41, 194, 20, 182, 304, -42, -88, 291, -45, -12, -202, 135, 64, -56, -9, 43, -85, 7, 33, 26, 170, 40, -122, 282, -176, 14, 7, -21, -201, -105, -350, -88, -71, -41, 8, 81, -57, -121, -122, -83, -16, 2, 107, -151, -66, 21, -76, -391, -203, -307, 98]
5859I8j49J23J9j29j63K68m70M22P4L3j43M52k56K56k57qR2j00k44K43J4j6m3
5882A16q9qQk33N70k65o2J3k3m2k54k1L59j12J6Q1l7m5lP1p6j45K60j82M0M2J16
5909I5k11m4M03r0J58k48k38k2m1J40J04Q6k60J10RJ84j44k29n4M58l07L5L0M0
5933c6j99M1L51j64j82J92n1J33j36P1j48J54K6j93K18j62k6k01J87M4N2J05K58
5956C34j97M3l6k71K13K6j74J34pM3K4k71JL71o1j47J52j49l00K61j49L39R1J40
5980D10n28K68RP1j55m3k00M04r6j04j02O6j01j03K55J25k81J39k42K93O2k85
6002a38K14k72O9J73j66K09J46n5j23m7k94L99j18k5j25j0K48J98m58J83j27J98
6024G9L6l33N4j11N18m26K69k54J16O2k66K15k4O7R0qj86K74k36R4q3R2k06K20
$$ y = [98, -51, 72, 91, -38, -201, 67, -403, 19, 93, 126, -17, 435, 179, 435, 178, 170, 262, 162, -82, 161, 175, 159, 116, 27, 19, 27, -206, 364, 99, 37, 50, 27, -15, -269, -290, 69, -43, -27, 54, 17, -28, -31, 40, -36, -181, 79, -103, -63, -21, 95, -116, -160, 243, 153, 311, 63, -175, -197, -238, -98, 6, 92, -168, -58, -49, 135, -9, -238, -292, 166, -141, -106, -76, -36, -235, -194, 157, -7, -189, 3, -48, 85, -51, 20, -128, 26, 52, -141, 77, -85, -111, -312, -125, -81, -29, 76, 334, 137, 180, 144, -127, 86, 112, -62, 72, 65, 108, 132, -139, -138, 233, 172, 25, 177, 28, -272, -11, -160, 179, 270, 410, -118, 150, 159, 230, 75, 32, -168, 236, 140, 36, -66, 0, -101, -204, 51, 176, -105, 34, -208, 85, 147, -138, 76, -196, -127, 46, -120, 89, 235, 180, 57, 10, -284, 115, -3, -28, -153, -163, 85, 283, -175, 8, -119, 79, 115, -218, -164, -275, 243, -183, 86, -168, -52, 10, -256, -41, -65, 2, 92, 84, -102, 172, -64, 30, -53, 39, -167, 53]
6048E3J44k64P6K48j41j43p5o9L11j77J26k01L06k63K11p6r4J94k48K58m7l7K1
6071A13M7l02N28l95R9j70J70o8j28J39l7j98M05j37J00k79K39j44j39K63Rk71
6093a56PM68k15n04N74n5k06l1K5K00r4o5rL8q8J94j68M7l00M27L5j09j77Q6R8
6118B2j06K5K04K9k42J32k89M75j38J52k17J00K04l26K6Qp4KN7j10K02r8J3l12
$$ y = [53, 197, -67, 9, 257, 116, -27, -102, -171, 140, -37, 89, -112, 194, -69, 142, 66, -28, 166, -82, 176, 129, 92, 113, 160, -142, 386, -9, 90, -80, 90, 22, -106, 33, -4, -202, 203, 66, 166, -113, 126, -18, -157, 106, 115, -156, -149, 319, 104, -400, 174, 119, -87, -118, -93, 107, 13, -52, -61, -23, -111, 83, -85, -38, -338, 89, 124, 15, -162, -76, 22, -84, -59, 145, 174, -68, 64, -225, 250, 112, 264, 47, 147, 351, 25, 51, 59, -15, -13, 44, -66, 136, 38, 51, -261]
$$ [...]
8191b16
##END NTUPLES=NMR FID
##END=
