##TITLE=1H_Pr Am-2222
 CDCl3, 8 sc, 
 28.10.2020
##JCAMPDX= 6.0         $$ Bruker NMR JCAMP-DX V2.0
##DATA TYPE= NMR FID
##DATA CLASS= NTUPLES
##ORIGIN= UXNMR, Bruker Analytische Messtechnik GmbH
##OWNER= root
$$ XWIN-NMR		Version 3.5
$$ Wed Oct 28 13:20:36 2020 Russian Standard Time (UT+4h)  she@DPX200
##.OBSERVE FREQUENCY= 200.1315066352
##.OBSERVE NUCLEUS= ^1H
##.DELAY= (6, 6)
##.ACQUISITION MODE= SIMULTANEOUS
##.ACQUISITION SCHEME= undefined
##.AVERAGES= 8
##.DIGITISER RES= 18
##SPECTROMETER/DATA SYSTEM= spect
##.PULSE SEQUENCE= zg30
##.SOLVENT NAME= CDCl3
##.SHIFT REFERENCE= (INTERNAL, CDCl3, 0, 15.7039)
##AUDIT TRAIL= $$ (NUMBER, WHEN, WHO, WHERE, WHAT)
$$ ##TITLE= Audit trail, XWIN-NMR		Version 3.5
$$ ##JCAMPDX= 5.01
$$ ##ORIGIN= Bruker BioSpin GmbH
$$ ##OWNER= she
$$ F:/spectra/data/she/nmr/H-F/1/audita.txt
$$ ##AUDIT TRAIL=  $$ (NUMBER, WHEN, WHO, WHERE, WHAT)
(   1,<2020-10-28 13:19:27.82 +0400>,<she>,<DPX200>,
      <created by zg, POWCHK disabled, PULCHK disabled
       configuration hash MD5:
       00 E9 B6 7A A2 85 ED C7 34 08 36 98 17 FE 4E 26
       data hash MD5: 16K
       FA 53 43 22 80 C5 7B AB 7E 33 3D E6 B9 39 2C 68>)
$$ ##END=
$$ 
$$ hash MD5
$$ 2A F9 05 D8 7A 03 34 51 93 61 0D 56 67 DF F2 36
##$RELAX= 
##$RELAX= 
##$RELAX= 
##$RELAX= 
##$RELAX= 
##$RELAX= 
$$ Bruker specific parameters
$$ --------------------------
##$DU= <F:/spectra>
##$EXPNO= 1
##$NAME= <H-F>
##$PROCNO= 1
##$TYPE= <nmr>
##$USER= <she>
##$AMP= (0..31)
100 100 100 100 100 100 100 100 100 100 100 100 100 100 100 100 100 100 
100 100 100 100 100 100 100 100 100 100 100 100 100 100 
##$AQSEQ= 0
##$AQ_mod= 1
##$AUNM= <au_zg>
##$AUTOPOS= <>
##$BF1= 200.13
##$BF2= 200.13
##$BF3= 200.13
##$BF4= 200.13
##$BF5= 200.13
##$BF6= 200.13
##$BF7= 200.13
##$BF8= 200.13
##$BYTORDA= 1
##$CFDGTYP= 0
##$CFRGTYP= 5
##$CHEMSTR= <none>
##$CNST= (0..31)
1 1 145 1 1 1 1 1 1 1 1 1 1 1 1 1 1 1 1 1 1 1 1 1 1 1 1 1 1 1 1 1 
##$CPDPRG= <>
##$CPDPRG1= <>
##$CPDPRG2= <>
##$CPDPRG3= <>
##$CPDPRG4= <mlev>
##$CPDPRG5= <mlev>
##$CPDPRG6= <mlev>
##$CPDPRG7= <mlev>
##$CPDPRG8= <mlev>
##$CPDPRGB= <>
##$CPDPRGT= <>
##$D= (0..31)
0 1.2 0 0 0 0 0 0 0 0.06 0 0.03 0 0 0 0 0.0002 0 0 0 0 0 0 0 0 0 0 0 0 
0 0 0 
##$DATE= 1603876767
##$DBL= (0..7)
120 120 120 120 120 120 120 120 
##$DBP= (0..7)
150 150 150 150 150 150 150 150 
##$DBP07= 0
##$DBPNAM0= <>
##$DBPNAM1= <>
##$DBPNAM2= <>
##$DBPNAM3= <>
##$DBPNAM4= <>
##$DBPNAM5= <>
##$DBPNAM6= <>
##$DBPNAM7= <>
##$DBPOAL= (0..7)
0.5 0.5 0.5 0.5 0.5 0.5 0.5 0.5 
##$DBPOFFS= (0..7)
0 0 0 0 0 0 0 0 
##$DE= 6
##$DECBNUC= <off>
##$DECIM= 32
##$DECNUC= <off>
##$DECSTAT= 4
##$DIGMOD= 1
##$DIGTYP= 9
##$DL= (0..7)
0 120 120 120 120 120 120 120 
##$DP= (0..7)
150 150 150 150 150 150 150 150 
##$DP07= 0
##$DPNAME0= <>
##$DPNAME1= <>
##$DPNAME2= <>
##$DPNAME3= <>
##$DPNAME4= <>
##$DPNAME5= <>
##$DPNAME6= <>
##$DPNAME7= <>
##$DPOAL= (0..7)
0.5 0.5 0.5 0.5 0.5 0.5 0.5 0.5 
##$DPOFFS= (0..7)
0 0 0 0 0 0 0 0 
##$DQDMODE= 0
##$DR= 18
##$DS= 0
##$DSLIST= <SSSSSSSSSSSSSSS>
$$ [...]
##$SUBNAM2= <"">
##$SUBNAM3= <"">
##$SUBNAM4= <"">
##$SUBNAM5= <"">
##$SUBNAM6= <"">
##$SUBNAM7= <"">
##$SUBNAM8= <"">
##$SUBNAM9= <"">
##$SW= 16.880792210976
##$SWIBOX= (0..15)
0 0 2 0 0 0 0 0 0 0 0 0 0 0 0 0 
##$SW_h= 3378.37837837838
##$TD= 16384
##$TD0= 1
##$TE= 0
##$TE2= 300
##$TE3= 300
##$TEG= 300
##$TL= (0..7)
0 120 120 120 120 120 120 120 
##$TP= (0..7)
150 150 150 150 150 150 150 150 
##$TP07= 0
##$TPNAME0= <>
##$TPNAME1= <>
##$TPNAME2= <>
##$TPNAME3= <>
##$TPNAME4= <>
##$TPNAME5= <>
##$TPNAME6= <>
##$TPNAME7= <>
##$TPOAL= (0..7)
0.5 0.5 0.5 0.5 0.5 0.5 0.5 0.5 
##$TPOFFS= (0..7)
0 0 0 0 0 0 0 0 
##$TUNHIN= 0
##$TUNHOUT= 0
##$TUNXOUT= 0
##$USERA1= <user>
##$USERA2= <user>
##$USERA3= <user>
##$USERA4= <user>
##$USERA5= <user>
##$V9= 5
##$VALIST= <valist>
##$VCLIST= <CCCCCCCCCCCCCCC>
##$VD= 0
##$VDLIST= <DDDDDDDDDDDDDDD>
##$VPLIST= <PPPPPPPPPPPPPPP>
##$VTLIST= <TTTTTTTTTTTTTTT>
##$WBST= 1024
##$WBSW= 4
##$XGAIN= (0..3)
0 0 0 0 
##$XL= 0
##$YL= 0
##$YMAX_a= 22228
##$YMIN_a= -19063
##$ZGOPTNS= <>
##$ZL1= 120
##$ZL2= 120
##$ZL3= 120
##$ZL4= 120
##$ABSF1= 10
##$ABSF2= 0
##$ABSG= 5
##$ABSL= 3
##$ALPHA= 0
##$AQORDER= 0
##$ASSFAC= 0
##$ASSFACI= 0
##$ASSFACX= 0
##$ASSWID= 0
##$AUNMP= <proc_1d>
##$AZFE= 0.1
##$AZFW= 0.1
##$BCFW= 1
##$BC_mod= 2
##$BYTORDP= 1
##$COROFFS= 0
##$CY= 11.3945322036743
##$DATMOD= 1
##$DC= 2
##$DFILT= <>
##$DTYPP= 0
##$F1P= 15.9154993809931
##$F2P= -4.1035820241983
##$FCOR= 0.5
##$FTSIZE= 0
##$FT_mod= 4
##$GAMMA= 1
##$GB= 0.15
##$INTBC= 1
##$INTSCL= 1
##$ISEN= 128
##$LB= 0.24
##$LEV0= 0
##$LPBIN= 0
##$MAXI= 10000
##$MC2= 0
##$MEAN= 0
##$ME_mod= 0
##$MI= 1.114404
##$NCOEF= 0
##$NC_proc= 0
##$NLEV= 6
##$NOISF1= 3.799351
##$NOISF2= 2.8
##$NSP= 1
##$NTH_PI= 0
##$NZP= 0
##$OFFSET= 15.70392
##$PC= 1
##$PHC0= -10848.78
##$PHC1= 13.00088
##$PH_mod= 1
##$PKNL= yes
##$PPARMOD= 0
##$PSCAL= 0
##$PSIGN= 0
##$REVERSE= no
##$SF= 200.130013532006
##$SI= 16384
##$SIGF1= 3
##$SIGF2= 2
##$SINO= 400
##$SIOLD= 16384
##$SREGLST= <1H.CDCl3>
##$SSB= 0
##$STSI= 0
##$STSR= 0
##$SW_p= 3612.71676300578
##$SYMM= 0
##$S_DEV= 0
##$TDeff= 0
##$TDoff= 0
##$TI= <>
##$TILT= no
##$TM1= 0
##$TM2= 0
##$TOPLEV= 0
##$USERP1= <user>
##$USERP2= <user>
##$USERP3= <user>
##$USERP4= <user>
##$USERP5= <user>
##$WDW= 1
##$XDIM= 8192
##$YMAX_p= 0
##$YMIN_p= 0
$$ End of Bruker specific parameters
$$ ---------------------------------
##NTUPLES= NMR FID
##VAR_NAME=  TIME,          FID/REAL,        FID/IMAG
##SYMBOL=    X,             R,               I
##VAR_TYPE=  INDEPENDENT,   DEPENDENT,       DEPENDENT
##VAR_FORM=  AFFN,          ASDF,            ASDF
##VAR_DIM=   8192,          8192,            8192
##UNITS=     SECONDS,       ARBITRARY UNITS, ARBITRARY UNITS
##FACTOR=    0.000296,      1,               1
##FIRST=     0,             0,               0
##LAST=      2.424536,      0,               0
##MIN=       0,             -19063,          0
##MAX=       2.424536,      22228,           0
$$ Real data points
##PAGE= N=1
##DATA TABLE= (X++(R..R)), XYDATA
$$ plain form
0 0 0 0 0 0 0 0 0 0 0 0 0 0 0 0 0 0 0 0 0 0 0 0 -8 8 -8 8 -8 8 -8 16 -16 16 -18 24 -24 29 -32 36 -40 46 -49 56 -62
43 -62 68 -76 84 -92 102 -113 124 -137 150 -165 181 -200 221 -246 275 -307 343 -387 439 -506 592
64 592 -702 860 -1095 1497 -2359 9163 -16209 -10507 21821 -4600 -9047 8915 63 -6472
78 -6472 5446 439 134 -2394 -3582 6219 4440 -12326 -246 11513 -6625 -5419 6052 -2273
92 -2273 -3502 3599 -1881 -3023 497 -2281 3946 -1602 -8385 4258 5743 -8273 -2460 5113 -2989
107 -2989 -976 779 -1874 -546 328 393 554 -3056 -1978 6506 -1667 -5970 4613 1925 -4277 3956
123 3956 585 -6106 7119 1923 -7318 4912 3433 -5940 4471 4345 -7642 3108 6406 -4018
137 -4018 -1348 3704 282 357 1099 -1508 2371 635 -930 2569 -700 -2549 4393 1832 -5731 2721
$$ packed form
0@%%%%%%%%%%%%%%%%%%%%%%qJ6j6J6j6J6j6K4l2L2l4M2m8N3o1O8p6Q6r5J05j18
43f2J30j44J60j76J94k15K37k61K87l15L46l81M21m67N21n82O50p30Q26r45J098
64E92j294J562j955K592l856J1522k5372N702L2328k6421m447J7962q852o535
78f472J1918n007l05k528j188R801j779j6766J2080J1759j8138J206J1471q325
92b273j229P101n480j142L520k778O227n548o783J2643J485j4016N813P573q102
107b989K013J755k653J328Q74O5J61l610J078Q484q173m303J0583k688o202Q233
123C956l371o691J3225n196r241J2230j479r373J0411j26j1987J0750L298j0424
137d018K670N052l422P5P42k607L879j736j565L499l269j849O942k561p563Q452
$$ plain form
153 2721 2806 -3137 1116 831 -2742 1835 1516 -3405 1048 55 -1237 1244 -1150 -2182 955 637 -2141
170 -2141 211 -1151 -758 1246 -1556 -1884 800 -390 -1555 1429 -2671 -1267 3374 -2459 -2778 3021
186 3021 -873 -3137 3794 -1269 -3689 3449 1170 -3313 224 2320 -1001 -59 272 508 467 -552
202 -552 1410 919 -1621 134 3969 -1674 -1953 3832 558 -1677 1959 915 -1354 2156 457 -449
218 -449 1130 -320 968 1302 -1088 -617 2653 -284 -1325 1100 388 -210 -13 351 -577 266 -483 345
236 345 299 -2066 598 1431 -2000 -1407 2279 -1398 -1499 1347 -1309 -1097 548 -209 -1437 -71 -607
253 -607 -110 -120 -1498 -33 162 -442 -951 302 -658 -254 564 -1056 -111 385 -310 -144 683 -1174 509
272 509 1462 -1491 296 1199 -339 -232 1370 -219 -67 1163 253 349 -165 889 665 373 -123 789
$$ packed form
153B721Q5n943M253k85l573M577l19m921M453r93j292K481k394j032L137l18k778
170b141K352j362L93K004k802l28K684j190j165K984m100J404M641n833l19N799
186C021l894k264O931n063k420P138k279m483L537K096l321R42L31K36m1j019
202e52J962m91k540J755L835n643k79N785l274k235L636j044k269L510j699r06
218d49J579j450J288L34k390M71L270k937j041K425p12n98J97L64r28Q43p49Q28
236C45m6k365K664Q33l431N93L686l677j01K846k656K12J645p57j228J366n36
253f07M97j0j378J465J95o04n09J253r60M04Q18j620R45M96o95J66Q27j857J683
272E09R53k953J787R03j538J07J602j589J52J230r10R6n14J054k24k92m96R12
$$ plain form
290 789 956 -414 871 541 -165 402 1395 -638 13 1279 -420 404 74 -178 306 486 -645 129
308 129 315 -676 464 -279 -346 -292 160 -413 -538 -97 -505 12 -559 -453 -482 -28 -668 -299 -84 -1200 274
329 274 -263 -947 -364 90 -604 -305 -63 -723 222 -286 -91 -334 -145 70 -52 -56 -356 453 5 84 -5 448
351 448 -43 186 764 -291 479 324 447 471 162 147 805 547 -380 932 323 345 295 567 367 -137 679
372 679 445 35 -282 888 169 -429 133 643 168 -935 734 155 -686 -119 474 -471 -624 250 -180
391 -180 -238 -894 144 -39 -835 -343 -96 -290 -943 -24 -160 -596 -724 279 -204 -1096 87 -195 -180 -601
411 -601 -67 -94 -148 -315 -249 211 -334 -19 -155 405 -249 -258 739 -22 -187 207 562 -79 266 124 596 509
433 509 -399 646 660 140 -312 1218 664 -861 652 1562 -469 -853 1917 257 -963 625 1041 -291
$$ packed form
290G89J67j370J285l30p06N67R93k033O51J266j699Q24l30k52M84J80j131P74
308A29J86r91J140p43o7N4M52n73j25M41m08N17n71J06k9M54o40L69K15j116J474
329B74n37o84N83M54o94K99K42o60R45n08J95k43J89K15j22ml00Q09m48P9q9M53
351D48m91K29N78j055P70j55J23K4l09j5O58k58r27J312o09K2n0K72k00n04Q16
372F79k34m10l17J170p19n98N62N10m75j103J669n79q41N67N93r45j53Q74m30
391a80n8o56J038j83p96M92K47j94o53R19j36m36j28J003m83q92J183k82J5m21
411f01N34k7n4j67O6M60n45L15j36N60o54rR97p61j65L94L55o41L45j42M72q7
433E09r08J045J4n20m52J530n54j525J513R10k031l84K770j660j220J588M16j332
$$ plain form
451 -291 -489 905 382 -344 -385 828 172 -900 -75 851 -146 -1594 871 620 -1565 -467 1270 -787
469 -787 -1472 874 -19 -1039 -686 556 -413 -1028 -96 -129 -234 -769 -200 48 -208 -976 297 404 -1345
488 -1345 178 554 -631 -618 845 -226 -699 697 -92 -318 545 368 -898 906 680 -1091 729
505 729 1045 -723 -150 1605 -210 -343 840 456 150 -18 594 422 404 -280 649 967 -704 -22 1422
524 1422 28 -1274 1468 663 -1244 165 1156 -279 -991 836 374 -625 -435 527 -26 -746 -158 174
542 174 145 -1169 -52 659 -754 -1097 643 174 -1717 241 513 -1054 -875 860 -441 -1309 648
559 648 -241 -774 126 39 -750 397 -49 -797 633 -15 -425 73 502 -349 35 319 -55 327 -57 159
579 159 436 416 -447 644 813 -709 512 919 -80 -297 1013 344 -323 352 664 300 -501 635 526
$$ packed form
451b91j98J394n23p26m1J213o56j072Q25R26r97j448K465k51k185J098J737k057
469g87o85K346q93j020L53J242r69o15R32l3j05n35N69K48k56p68J273J07j749
488a345J523L76j185J3J463j071m73J396p89k26Q63j77j266J804k26j771J820
505G29L16j768N73J755j815j33J183l84l06j68O12j72j8o84R29L18j671O82J444
524A422j394j302K742q05j907J409R91j435p12J827m62r99J90R62n53p20N88L32
542A74k9j314J117P11j413l43J740m69j891J958K72j567J79J735j301q68J957
559F48q89n33R00q7p89J147m46p48J430o48m10M98M29q51L84K84l74L82l84K16
579A59K77k0q63J091J69j522J221M07r99k17J310o69o67O75L12l64q01J136j09
$$ plain form
598 526 -76 -182 508 478 -402 -45 410 343 -788 218 668 -553 -491 532 353 -1148 190 562 -719
617 -719 -664 618 -272 -995 324 -197 -404 -454 -136 -128 -419 -441 -158 91 -708 -119 -149 -278 -429 44 -54 -525
639 -525 121 -205 -80 -150 -32 -123 127 -39 -164 552 -269 92 273 95 19 157 348 62 321 129 451
660 451 68 310 304 106 300 159 389 64 343 138 179 234 261 113 29 411 -205 275 133 -96 157 158 -106
683 -106 -163 250 -248 23 -119 -19 -164 -234 34 -345 -146 -259 -81 -427 -237 -97 -315 -292 -311 133 -623 -126
705 -126 -62 -378 -255 -200 -161 -325 4 -324 -11 -199 -101 -75 -224 91 -123 122 -135 118 -22 91 88 26 267
728 267 4 323 -46 411 222 23 386 261 196 157 376 55 319 123 239 316 98 323 90 226 40
749 40 283 79 158 148 88 147 -172 238 -172 115 -94 -103 131 -240 -121 -85 -31 -399 63 -153 -294 -104 -247
$$ packed form
598E26o02j06O90l0q80L57M55o7j131J006M50j221O2J023j79j501J338L72j281
617g19N5J282q90p23J319n21k07n0L18Qk91k2K83K49p99N89l0j29j51M73r8m71
639e25O46l26J25p0J18r1K50j66j25P16q21L61J81j78p6J38J91k86K59j92L22
660D51l83K42oj98J94j41K30l25K79k05M1N5K7j48q4L82o16M80j42k29K53Jk64
683a06n7M13m98K71j42J00j45p0K68l79J99j13J78l46J90J40k18K3j9M44p56M97
705a26O4l16J23N5L9j64L29l28L13j88R8K6j49L15k14K45k57K53j40J13lo2K41
728B67k63L19l69M57j89j99L63j25o5l9K19l21K64j96J16P7k18K25k33J36j86
749D0K43k04P9j0o0N9l19M10m10K87k09rK34l71J19L6N4l68M62k16j41J90j43
$$ plain form
772 -247 -127 -285 -67 -368 -186 -300 -101 -238 -335 -33 -341 -173 -342 29 -224 -349 115 -136 -180 -192 162
793 162 -314 117 -12 -26 122 -94 283 -24 106 37 319 54 43 320 169 269 48 420 106 248 259 269
815 269 366 87 286 217 276 43 407 122 57 329 -29 250 -4 149 52 221 -63 -16 171 -216 4 -26 74
838 74 -360 36 34 -259 -65 -275 22 -228 -269 -244 32 -357 -377 198 -414 -217 -204 -76 -384 -176 -152 -114 -168 -385
862 -385 165 -263 -221 -49 84 -211 -186 206 -164 30 9 99 -59 143 -133 142 433 -332 307 310 -3 91 466
885 466 41 179 420 -38 369 156 99 201 392 -43 38 660 -116 33 397 166 -266 292 272 -149 35
906 35 -31 284 -170 -148 136 91 -312 -124 259 -303 -131 -243 69 -276 -390 151 -18 -443 -334 376 -538 -523
928 -523 255 -104 -654 -11 169 -666 17 -156 -209 53 -217 -317 220 -36 -659 484 -31 -480 299 271 -386
$$ packed form
772b47J20j58K18l01J82j14J99j37r7L02l08J68j69L71k53j25M64k51m4j2L54
793A62m76M31j29j4J48k16L77l07J30o9K82k65j1K77j51J00k21L72l14J42J1J0
815B69R7k79J99o9N9k33L64k85o5K72l58K79k54J53r7J69k84M7J87l87K20l0J00
838G4m34L96kk93J94k10K97k50m1K5K76l89k0N75o12J97J3J28l08K08K4L8n4k17
862c85N50m28M2J72J33k95K5L92l70J94k1R0j58K02k76K75K91p65O39Ll13R4L75
885D66m25J38K41m58M07k13n7J02J91m35Q1O22p76J49L64k31m32N58k0m21J84
906C5o6L15m54K2K84m5m03J88L83n62J72j12L12l45j14N41j69m25J09P10r14J5
928e23P78l59n50O43J80q35O83j73n3K62k70j00N37k56o23J143n15m49P79k8o57
$$ plain form
949 -386 45 474 -355 210 253 -98 134 416 -131 82 601 -303 257 385 -1 67 421 126 57 360 46
970 46 408 1 147 235 121 132 30 266 18 108 -39 297 5 -239 215 98 -285 -108 487 -532 -320
991 -320 456 -318 -459 179 -69 -579 231 -365 -205 50 -514 -159 180 -421 -579 486 -365 -510 337 -169
1011 -169 -491 142 185 -553 255 -43 -281 148 -61 -208 160 83 -307 397 -37 -173 318 87 -22 148 226
1032 226 -35 292 67 171 295 31 279 144 239 73 394 -16 198 366 -160 232 314 -29 39 487 -265
1053 -265 35 453 -283 -11 193 -116 -88 284 -320 62 201 -424 29 25 -250 -322 266 -395 -247 248 -468
1074 -468 -235 3 -317 -351 145 -472 -124 74 -502 -11 -26 -260 -237 240 -364 -150 185 -336 -30 2 -79 -82
1096 -82 157 -169 39 208 -187 198 99 -31 95 385 -206 176 384 -199 283 234 61 176 329 -117 289
$$ packed form
949c86M31M29q29N65M3l51K32K82n47K13N19r04N60J28l86O8L54k95o9L03l14
970D6L62m07J46Q8j14J1j02K36k48R0j47L36k92k44M54j17l83J77N95j019K12
991c20P76p74j41O38k48n10Q10n96J60K55n64L55L39o01j58J065q51j45Q47n06
1011a69l22O33M3p38Q08k98k38M29k09j47L68p7l90P04m34j36M91k31j09J70P8
1032B26k61L27k25J04J24k64K48j35R5j66L21m10K14J68n26L92Q2l43O8M48p52
1053b65L00M18p36K72K04l09K8L72o04L82J39o25M53mk75p2N88o61J48M95p16
1074d68K33K38l20l4M96o17L48J98n76M91j5k34K3M77o04K14L35n21L06L2q1l
1096h2K39l26K08J69l95L85r9j30J26K90n91L82K08n83M82m9j73J15J53m46M06
$$ plain form
1117 289 331 -107 369 167 80 188 215 -128 238 250 -165 252 123 4 108 196 -189 98 126 -420 237 -12
1139 -12 -309 0 55 -356 27 31 -438 102 -229 -207 -81 -88 -353 -92 -122 -426 69 -208 -261 -66 15 -318 -58
1162 -58 57 -409 130 -184 -163 33 1 -218 135 78 -247 289 -79 -19 89 95 -110 195 87 -107 358 20
1184 20 65 231 168 -55 300 194 -163 433 51 57 267 128 -6 321 131 -151 395 -57 32 162 66 -42
1206 -42 140 61 -145 218 -99 -13 72 -53 -116 36 -78 -306 151 -288 -176 33 -150 -249 -25 -160 -342 78
1228 78 -335 -179 -46 -197 -192 -27 -162 -275 116 -225 -116 4 -135 -108 -65 21 -165 152 -85 15 108 -31
1250 -31 24 132 38 -60 309 -143 113 192 69 151 197 49 70 323 -34 230 126 69 200 184 56 42 322 -35
1274 -35 143 159 18 66 156 57 -48 288 -202 64 60 -63 17 -5 -50 -104 90 -205 19 -1 -117 -77 -150 -53 -215
$$ packed form
1117B89M2m38M76k02q7J08K7l43L66J2m15M17j29j19J04Q8l85K87K8n46O57k49
1139a2k97L09N5m11L83Mm69N40l31K2J26pk65K61l0l04M95k77n3J95Q1l33K60
1162e8J15m66N39l14K1J96l2k19L53n7l25N36l68O0J08Ok05L05j08j94M65l38
1184B0M5J66o3k23L55j06l57N96l82OK10j39j34L27j90k82N46m52Q9J30r6j08
1206d2J82p9k06L63l17Q6Q5j25o3J52j14k28M57m39J12K09j83r9K24j35j82M20
1228G8m13J56J33j51NJ65j35j13L91l41J09J20j39K7M3Q6j86L17k37J00R3j39
1250c1N5J08r4r8L69m52K56P9j23Q2M6j48K1K53l57K64j04n7J31j6j28j4K80l57
1274c5J78J6j41M8R0r9j05L36m90K66mj23Q0k2m5n4J94k95K24k0j16M0p3R7j62
$$ plain form
1299 -215 -27 -227 -115 -108 -184 -146 -129 -62 -240 1 -179 -56 -119 -135 -33 -155 -72 -82 24 -201 62 -58 -84 41
1323 41 -36 19 -26 137 -55 147 119 67 183 48 131 69 283 5 197 251 89 141 171 148 38 216 77 155
1347 155 193 105 100 42 113 -59 147 90 -5 29 109 -3 -111 111 -107 34 -69 -64 -95 -68 -7 -148 32 -181 -100
1372 -100 -91 -55 -218 -180 35 -297 -73 -108 -87 -217 -48 -90 -187 -21 -119 -133 -154 53 -176 -24 -4 -113 33 -31
1396 -31 -45 -45 170 -119 47 122 -72 75 134 117 -70 241 92 17 168 165 45 155 259 -64 243 139 43 239
1420 239 177 62 29 217 -27 114 71 57 42 73 85 -97 165 -103 -9 65 -13 -105 -34 55 -165 104 -9 -87 -149
1445 -149 -8 -184 -205 9 -151 -126 -142 -53 -229 -58 -112 -263 17 -141 -134 -79 -21 -196 -88 3 -164 -81 -35 -33 -210
1470 -210 91 -110 -90 152 -97 27 24 89 -98 180 99 29 180 47 173 106 174 27 225 201 58 141 165 123
$$ packed form
1299b15J88k00J12Pp6L8J7O7j78K41j80J23o3j6J02j22Q3j0J06k25K63j20k6J25
1323D1p7N5m5J63j92K02k8n2J16j35Q3o2K14k78J92N4j62N2L0k3j10J78j39P8
1347A55L8q8nn8P1j72K06n7r5L4Q0j12j08K22k18J41j03Nl1K7O1j41J80k13Q1
1372a00RL6j63L8K15l32K24l5K1j30J69m2r7J66r8j4k1K07k29J52K0j09J46o4
1396c1j4%K15k89J66P5j94J47N9j7j87L11j49p5J51lj20J10J04l23L07j04r6J96
1420B39o2j15l3J88k44J41m3j4j5L1J2j82K62k68R4P4p8r2P1Q9k20K69j13p8o2
1445a49J41j76k1K14j60K5j6Q9j76J71n4j51K80j58PN5N8j75J08R1j67Q3M6Kj77
1470b10L01k01K0K42k49J24lO5j87K78q1p0J51j33J26o7O8j47J98k4j43Q3K4m2
$$ plain form
1494 123 21 252 6 125 200 64 155 75 102 -10 88 3 123 6 19 -13 -118 61 -86 -73 -64 1 -103 -85
1518 -85 -62 -156 -1 -153 -98 -138 -57 -171 -119 -1 -181 -42 -105 -98 -140 -49 -162 -70 65 -177 -39 -110 -52 -115 -20 -70
1544 -70 -53 -2 -102 20 16 80 -69 102 66 -2 142 45 48 40 170 25 188 81 45 182 -22 169 30 170 76
1569 76 138 132 126 127 50 181 17 185 -5 81 51 -6 118 -81 108 32 -37 18 88 -64 -59 29 -204 -11 -95 -42 -143
1596 -143 -103 -139 -131 23 -214 -60 -107 -35 -179 -56 -124 -169 -33 -145 -105 -102 -73 -111 -38 -107 -83 32 -114 29 -115
1621 -115 -2 13 12 52 -3 63 -57 143 6 40 77 38 68 16 170 15 184 19 112 114 126 31 76 163 25 222
1647 222 67 91 105 70 50 111 142 9 62 38 80 0 62 85 -73 47 -118 -10 -41 -48 -80 -70 -103 -101 9 -143 -24
1674 -24 -169 -77 -141 -108 -74 -132 -100 -165 -49 -193 -119 -121 -118 -84 -122 0 -111 -7 -97 11 -49 -26 1 -19 81 -36 87
$$ packed form
1494A23j02K31k46J19P5j36R1q0K7j12R8q5J20j17J3l2j05J79j47J3RO5j04J8
1518h5K3r4J55j52N5m0Q1j14N2J18j80J39o3Pm2R1j13R2J35k42J38p1N8o3R5n0
1544g0J7N1j00J22mO4j49J71l6o8J44r7LqJ30j45J63j07l6J37k04J91j39J40r4
1569G6O2ooJp7J31j64J68j90Q6l0n7J24j99J89p6o9N5P0j52NQ8k33J93q4N3j01
1596a43M0l6QJ54k37J54m7P2j44J23o8m5J36j12M0LK9l8P3o9K4J15j46J43j44
1621a15J13J5jM0n5O6j20K00j37L4L7l9L0n2J54j55J69j65R3KJ2r5M5Q7j38J97
1647B22j55K4J4l5k0O1L1j33N3k4M2q0O2K3j58J20j65J08l1pl2J0l3KJ10j52J19
1674b4j45R2o4L3L4n8L2o5J16j44P4kLL4l8J22j11J04r0J08o0K3K7k0J00j17J23
$$ plain form
1701 87 46 63 77 24 95 40 151 -15 151 85 69 82 98 143 23 237 -5 126 66 128 55 135 127 -14 155 42
1727 42 195 22 70 9 -16 114 17 70 -37 45 -59 6 -35 -67 62 -133 29 -120 -58 -148 -120 -49 -80 -121 -160 -65
1753 -65 -185 -19 -92 -71 -73 -120 -104 -160 7 -230 -13 -81 -74 -53 -32 -18 -89 92 -123 -40 63 13 -16 20 28 -71 107
1780 107 14 75 121 130 53 33 149 -2 105 25 115 51 167 134 30 188 -11 124 57 172 17 57 114 -15 81
1805 81 45 40 -9 119 -17 -11 64 -30 12 -74 79 -125 4 -16 -68 45 -87 -61 -108 -13 -195 -82 -112 -89 -95 -100 -71 -206
1833 -206 31 -121 -74 -32 -104 -57 -130 -65 -154 -13 -73 -13 -54 -24 2 -39 108 -50 111 54 69 -10 70 78 -4 143 49
1860 49 112 88 161 35 48 115 25 117 89 83 -18 185 41 48 114 25 66 62 113 -15 157 53 -3 6 -4 3 -20 114 -108
1889 -108 -17 22 -98 2 -14 -66 -92 23 -131 -9 -50 -104 -59 -116 -81 -172 11 -153 -104 -57 -99 -62 -123 -10 -155
$$ packed form
1701H7m1J7J4n3P1n5J11j66J66o6j6J3J6M5j20K14k42J31o0O2p3Q0qj41J69j13
1727D2J53j73M8o1k5J30r7N3j07Q2j04O5m1l2J29j95J62j49O2r0K8P1l1m1l9R5
1753f5j20J66p3K1km7J6n6J67k37K17o8PK1K1J4p1J81k15Q3J03n0k9L6Qr9J78
1780A07r3O1M6Rp7k0J16j51J07q0R0o4J16l3j04J58j99J35o7J15j55M0N7j29R6
1805H1l6nm9J28j36OP5r4M2q6J53k04J29k0n2J13j32K6m7R5j82J13l0K3onK9j35
1833b06K37j52M7M2p2M7p3O5q9J41o0O0m1L0K6m1J47j58J61n7J5p9Q0Qq2J47r4
1860D9O3k4P3j26J3O7r0R2k8oj01K03j44PO6q9M1mN1j28J72j04n6Rj0Pk3J34k22
1889a08R1L9j20J00j6n2k6J15j54J22m1n4M5n7L5r1J83j64M9M7m2L7o1J13j45
$$ plain form
1914 -155 -61 -115 -84 -19 -57 33 -84 12 -32 59 13 44 -7 2 105 -83 104 34 69 -10 142 94 -49 161 21 147
1940 147 88 170 44 153 131 14 212 43 43 84 157 -14 91 131 -14 101 26 4 -28 101 -55 5 69 -13 11
1965 11 -14 35 -34 22 -101 -4 -53 -123 -1 -106 -64 -142 11 -123 -19 -76 -168 20 -148 -79 -96 -107 -120 -48 -99 -127
1991 -127 30 -91 -53 -56 -72 -55 55 -12 -129 104 -18 3 38 37 -27 138 51 -44 159 5 123 121 106 37 114 141
2017 141 54 128 9 135 77 120 40 107 132 -59 81 -31 72 22 26 -9 40 14 -81 98 -105 39 -31 -33 -75 7
2043 7 -36 -92 28 -148 -9 -90 -121 -114 -6 -69 -164 17 -156 -41 -66 -92 -136 14 -68 -128 133 -183 -27 -15 -104 -85
2069 -85 -39 -58 -60 57 -97 26 11 -19 10 64 22 -13 84 -47 47 73 70 58 108 106 31 185 0 127 57 79 176 118
2097 118 59 78 139 -40 127 78 60 95 51 -18 -13 138 -73 102 42 -54 11 -23 -29 -105 54 -122 -31 -48 -120 -30 -28 -78
$$ packed form
1914a55R4n4L1O5l8R0j17R6m4R1m6L1n1RJ03j88J87p0L5p9J52m8j43K10j40J26
1940A47n9Q2j26J09k2j17J98j69%M1P3j71J05M0j45J15p5k2l2J29j56O0O4q2K4
1965A1k5M9o9N6j23R7m9p0J22j05M2p8J53j34J04n7r2J88j68O9j7j1j3P2n1k8
1991a27J57j21L8lj6J7J10o7j17K33j22K1L5jo4J65q7r5K03j54J18kj5o9P7K7
2017A41q7P4j19J26n8M3q0O7K5j91J40j12J03n0Ml5M9k6r5J79k03J44p0km2Q2
2043Gm3n6J20j76J39q1l1PJ08o3r5J81j73J15k5k6m4J50q2o0K61l16J56J2q9J9
2069h5M6j9kJ17j54J23j5l0K9N4m2l5R7j31R4K6lj2N0kp5J54j85J27p0K2R7n8
2097A18n9J9O1j79J67m9j8L5m4o9NJ51k11J75o0r6O5l4op6J59j76R1j7p2R0Kn0
$$ plain form
2125 -78 -64 45 -170 -25 -72 -112 -33 -112 -50 -79 -11 -176 -48 -70 -50 -21 -49 -43 -94 55 -145 43 -8 -75 100 -5
2151 -5 -6 32 73 -105 107 -37 12 116 13 43 60 62 3 172 63 21 114 44 25 66 126 -16 111 97 38 66 12
2178 12 42 37 92 -92 68 -2 5 70 -35 9 -35 49 -75 -12 -62 -15 -19 -104 -28 -107 -92 -114 -26 -99 -44 -42 -141 -119 -44 -98
2208 -98 -90 9 -100 -56 -9 -90 -6 -89 6 -123 -2 -90 -17 42 -25 -36 1 66 -10 97 -11 -19 98 -21 22 -32 56 37
2236 37 103 71 17 107 38 88 68 121 38 87 81 63 113 14 65 100 109 80 71 4 28 87 -65 115 -62 4 -48 35 -70 29
2266 29 4 -147 83 -49 -31 -72 15 -99 -81 19 -173 15 -107 -62 -56 -85 -73 -115 -44 -137 -33 -51 -90 -85 -64 -45 1
2293 1 6 -52 53 16 42 -7 16 24 13 64 -36 114 -19 39 21 67 46 89 62 14 147 9 101 26 31 150 64 109 19
2322 19 123 38 48 53 72 47 72 12 -27 92 4 75 -25 39 -2 -33 39 -63 -11 -63 -40 -79 8 -47 -65 -20 -119 -28 -102
$$ packed form
2125g8J4J09k15J45m7m0P9p9O2k9O8j65J28k2K0K9k8On1J49k00J88n1o7J75j05
2151ejL8M1j78K12j44M9J04j03L0J7Kn9J69j09m2R3p0j9M1O0j42J27j4n9K8n4
2178A2L0nN5j84J60p0PO5j05M4m4Q4j24O3n0M7mq5P6p9J5k2Q8p3N5Kr9K2P5n4
2208i8QR9j09M4M7q1Q4q3R5j29J21q8P3N9o7j1L7O5p6J07j08qJ17j19M3n4Q8j9
2236C7O6l2n4R0o9N0k0N3q3M9oj8N0r9N1L5Rk9ro7K4N9j52J80j77O6n2Q3j05R9
2266B9k5j51K30j32J8m1Q7j14J8J00j92J88j22M5Ok9J2m2P1r3J04j8l9NK1J9M6
2293ANn8J05l7K6m9K3Qj1N1j00J50j33N8j8M6k1M3k7m8J33j38R2p5NJ19q6M5r0
2322A9J04q5J0NJ9k5K5o0l9J19q8P1j00O4m1l1P2j02N2n2K3l9Q7n5j8M5r9R1p4
$$ plain form
2351 -102 -42 0 -119 -39 -53 -85 -103 -40 -140 -89 -76 -128 -5 -84 3 -93 17 -70 11 -73 18 14 -7 64 -42 50 -2 67
2379 67 -26 62 60 45 100 61 123 19 71 20 44 119 39 69 12 152 -23 120 65 12 33 -8 89 29 81 -66 67 -1
2407 -1 24 14 -55 72 -38 29 -80 40 -25 -35 13 -91 27 -95 -43 -34 7 -31 -58 -36 -116 9 -91 -35 -95 -67 -90
2434 -90 -142 -84 -57 -36 -107 -6 -47 -23 -23 86 2 -89 43 -65 33 -46 28 -44 63 58 -23 108 2 29 41 57 28 88
2462 88 104 -4 95 81 76 21 38 28 26 97 10 70 12 71 35 18 3 22 61 -35 76 -16 63 18 -40 62 -28 9 7 0 -70
2493 -70 -20 -29 -93 -54 -92 3 -44 4 -108 29 2 -67 -62 -18 -30 -112 17 -124 -44 -44 -77 -50 -20 41 -58 -38 -129 21 -33
2522 -33 -14 -2 17 58 -71 17 -7 26 51 10 40 25 113 -49 128 -2 99 19 102 75 23 101 46 118 -4 70 77 47
2550 47 47 61 31 -15 69 -36 64 18 8 36 -74 4 -27 69 -119 30 -10 -99 -44 -13 -41 -39 -6 -102 -46 -24 -32 -25 -39 -46
$$ packed form
2351a02O0M2j19Q0j4l2j8O3j00N1J3n2J23p9Q7r6J10q7Q1q4R1mk1P1j06R2n2O9
2379F7r3Q8kj5N5l9O2j04N2n1K4P5q0L0n7J40j75J43n5n3K1m1R7o0N2j47J33o8
2407aK5j0o9J27j10O7j09J20o5j0M8j04J18j22N2RM1l8k7K2q0J25j00N6o0K8k3
2434i0n2N8K7K1p1J01m1K4%J09q4r1J32j08R8p9P4p2J07nq1J31j06K7J2J6k9O0
2462H8J6j08R9j4nn5J7j0kP1q7O0n8N9l6j7j5J9L9r6J11r2P9m5n8J02r0L7kpp0
2493g0N0ro4L9l8R5m7M8j12J37k7o9NM4j2q2J29j41Q0%l3K7L0O1r9K0r1J50n4
2522c3J9J2J9M1j29Q8k4L3K5m1L0j5Q8j62J77j30J01q0Q3k7n2P8n5P2j22P4Pl0
2550D7%J4l0m6Q4j05J00m6j0K8j10P8l1R6j88J49m0q9N5L1k8KL3r6N6K2qPj4p
$$ plain form
2580 -46 -136 -7 -125 -19 -27 -17 -11 -63 0 -60 -21 -75 -41 -9 -46 -15 -38 8 -38 -14 -83 1 -58 4 51 -4 87 39 38 47 86
2611 86 22 51 85 62 95 61 97 54 106 34 17 83 21 17 32 79 -5 56 68 -15 48 37 -7 4 94 -89 -25 11 -21 -14 -77
2642 -77 -51 -27 1 -101 -7 -28 -125 -67 -69 -19 -71 -8 -71 -40 -46 -101 -29 -37 -35 -49 -24 -67 -18 -96 -91 -6 -67 28 -44 48 -84 9
2674 9 -32 -13 -3 -61 45 21 -3 -78 91 -40 -60 130 66 63 48 55 34 73 40 63 98 13 62 24 82 -22 101 92 -18
2703 -18 81 55 -9 -14 66 66 24 34 -7 9 -16 7 -21 -5 -24 17 -18 -39 -32 -99 16 -101 -5 -40 -74 -19 -81 1 -112 15
2733 15 -59 -57 -7 -64 14 -39 -16 -94 47 -52 -12 -1 29 -6 -84 53 -65 35 27 29 -16 13 30 -21 73 -29 57 11 61
2762 61 18 44 92 2 93 -12 30 69 133 14 49 47 -26 86 34 61 -27 88 20 47 78 27 53 -23 51 -7 59 15 -6
2791 -6 -9 -42 8 -87 25 -70 -74 -61 -72 -48 -66 44 -146 -16 -132 -26 -65 -43 -54 -55 -13 -74 -47 -45 -32 -27 -30 8 -55 61
$$ packed form
2580d6r0J29j18J06qJ0On2O3o0L9n4L4L2l7L1k3M6m6K4o9Q4n9O2M7n5R1m8jRL9
2611H6o4K9L4k3L3l4L6m3N2p2j7O6o2mJ5M7q4O1J2q3O3j1m4J1R0j83O4L6l2Po3
2642g7K6K4K8j02R4k1r7N8kN0n2O3o3L1on5P2qKj4K5m3M9p8NQ5o1R5p2R2j32R3
2674Im1J9J0n8J06k4k4p5J69j31k0J90o4lj5Pk1L9l3K3L5q5M9l8N8j04J23rj10
2703a8R9k6o4nQ0%m2J0m1J6k5K3k8J6j9M1l5k1Po7J15j17R6l5l4N5o2Q2j13J27
2733A5p4KN0n7P8n3K3p8J41r9M0J1L0l5p8J37j18J00qKm5K9J7n1R4j02Q6m6N0
2762F1m3K6M8r0R1j05M2L9O4j19L5kp3J12n2K7q8J15o8K7L1n1K6p6P4n8O6m4k1
2791fll3N0r5J12r5mJ3j1K4j8J10j90J30j16J06l9K2j1jM2o1K7KJ3NlL8o3J16
$$ plain form
2821 61 -58 -40 44 38 11 -5 1 -37 91 -27 59 18 62 -8 29 57 15 97 49 47 12 96 -35 9 82 -31 90 37 95
2850 95 12 18 -6 13 56 -23 92 -18 23 33 51 51 6 13 -24 3 -53 17 -28 4 -29 -116 -20 -61 8 -135 -28 -53 -65 -44
2880 -44 -19 3 -114 -17 -56 -75 -59 -37 -24 -79 -37 -87 -52 -71 8 -22 17 20 -16 29 -63 75 -32 45 46 30 -5 7 82 -50
2910 -50 59 -35 43 29 45 6 9 86 -3 80 15 96 59 27 53 21 67 -21 92 56 32 31 34 4 -21 -23 8 21 -21 -10 -20
2941 -20 -40 40 -30 12 -33 -56 -46 -22 -73 -43 -45 -96 -23 -80 -16 -83 -40 -44 -54 -25 -75 -7 -84 59 -53 -29 -48 -66 3 14
2971 14 38 -100 72 -93 4 42 -21 30 83 57 -26 101 11 4 47 5 42 -3 92 -3 127 71 34 57 31 60 32 54
2999 54 -21 105 12 33 64 69 18 -30 18 -53 34 -21 30 -4 -20 11 -45 13 -35 47 -29 -45 -21 -15 -14 -74 -28 -32 11 -58 -26 -32
3031 -32 -91 19 -66 -7 -52 -51 -57 -50 -2 -56 -32 -48 -41 -86 30 -45 -35 88 -36 0 -27 9 -26 5 -41 6 35 14 79 9
$$ packed form
2821F1j19J8Q4ok7j6Ol8J28j18Q6m1M4p0L7K8m2Q2m8kl5Q4j31M4P3j13J21n3N8
2850I5q3Ok4J9M3p9J15j10M1J0J8%m5Pl7K7n6P0m5L2l3q7R6m1O9j43J07k5j2K1
2880d4K5K2j17R7l9j9J6K2J3n5M2n0L5j9P9l0L9Ll6M5r2J38j07P7Jj6l5J2P5j32
2910e0J09r4P8j4J6l9LP7q9Q3o5Q1l7l2K6l2M6q8J13l6k4jLl0k5kL1J3m2J1j0
2941b0k0Q0p0M2m5k3J0K4n1L0kn1P3n7O4o7M3mj0K9n0O8p7J43j12K4j9j8O9J1
2971A4K4j38J72j65R7L8o3N1N3k6q3J27r0pM3m2L7m5R5r5J30n6l7K3k6K9k8K2
2999E4p5J26r3K1L1Nn1m8M8p1Q7n5N1l4j6L1n6N8m8Q2p6j6K4OJo0M6mM3o9L2o
3031c2n9J10q5N9m5JoPM8n4K4j6Pm5J16p5J0J23j24L6k7L6l5L1m6M7K9k1O5p0
$$ plain form
3061 9 77 -35 120 70 52 49 63 42 36 35 45 89 47 22 48 8 46 -55 56 43 12 -21 8 6 -17 23 -8 3 -57 6 -30
3092 -30 1 -7 -39 -8 -58 -29 -47 46 -63 -34 30 -145 -31 -31 -16 -57 -4 -82 -59 24 -84 -7 13 -20 -83 -16 -30 -32 -15 -83
3122 -83 -14 -28 0 -71 44 -35 2 -8 -22 1 -4 35 60 38 -5 51 73 11 102 5 51 30 89 48 16 69 24 101 38 105
3152 105 42 17 -37 47 11 -60 51 -14 -13 7 75 -29 -34 -20 -57 51 14 -61 -78 17 13 -69 -26 -30 -44 -69 24 -42 -29 -56
3182 -56 -7 -42 -69 -41 -53 -48 -37 -92 -84 -74 -15 -5 -37 -62 14 -124 -41 -4 2 21 -23 61 -47 82 42 57 2 32 1 1 104
3213 104 -3 22 12 16 61 121 65 -1 92 -12 45 11 44 32 28 44 -20 59 -16 71 17 45 30 6 36 -13 -16 -13 -6 -14 -50 -44
3245 -44 -55 26 -91 8 -23 -23 -63 -47 20 -33 -57 -79 -32 6 -14 -60 -34 -2 -51 -53 -33 47 -51 50 21 7 47 1 17 -11
3275 -11 15 -31 5 -22 11 -12 51 71 -65 29 -46 5 -2 21 25 9 20 9 68 -26 51 53 12 65 24 13 61 72 8 77 21
$$ packed form
3061IO8j12J55n0j8lJ4k1ojJ0M4m2k5K6m0L8j01J11j3l1l3K9kk3M0l1J1o0O3l6
3092c0L1ql2L1n0K9j8R3j09K9O4j75J14%J5m1N3p8K3Q3j08P7K0l3o3O7j4kJ7o8
3122h3O9j4K8p1J15p9L7j0j4K3nL9K5k2m3N6K2o2R1r7M6k1N9m1l2N3m5P7o3O7
3152A05o3k5n4Q4l6p1J11o5JK0O8j04nJ4l7J08l7p5j7R5mq2M3mj4k5R3o6J3k7
3182e6M9l5k7K8j2NJ1n5QJ0N9J0l2k5P6j38Q3L7OJ9m4Q4j08J29m0J5n5L0l1%J03
3213A04j07K5j0MM5O0n6o6R3j04N7l4L3j2mJ6o4P9p5Q7n4K8j5k4L0m9lLPql6O
3245d4j1Q1j17R9l1%m0J6O7n3k4k2M7L8k0m6K6L2m9kK0Q0r8J01k9j4M0m6J6k8
3275a1K6m6L6k7L3k3O3K0j36R4p5N1pK3Mj6J1j1N9r4P7Km1N3m1j1M8J1o4O9n6
$$ plain form
3306 21 66 6 12 -3 -23 25 -45 60 -15 -8 7 -28 -9 -35 -23 -27 -2 -5 -78 12 -50 -18 -64 -30 -48 0 -32 0 -21 -36 -41 -2
3338 -2 43 -62 8 -24 -46 -21 -24 11 -69 50 27 41 39 0 0 -20 25 -16 56 -20 27 77 69 51 25 63 41 88 39 88 29 23
3370 23 69 28 103 11 40 40 29 31 25 39 29 83 -19 68 11 2 25 1 30 -21 -10 -4 18 -9 30 -9 -50 21 -41 60 -59
3401 -59 -15 -45 -53 -22 -50 11 -22 1 -64 31 -15 -23 -15 -63 -45 -98 23 -67 -9 -2 -4 42 -57 60 -1 54 -23 56 5 5 24 1
3433 1 14 -5 71 2 35 4 82 73 21 22 -8 52 15 75 59 -5 11 8 40 53 39 -10 2 -9 19 44 -4 -23 2 67 2 47
3465 47 41 1 -10 -14 4 -61 -18 -108 -20 -59 -41 -53 -72 7 -123 -28 -77 -18 -25 -25 -26 -22 -32 -58 -31 -47 -26 -44 4 5 -33 57 -48
3498 -48 -5 -19 39 18 17 65 -47 29 51 72 -30 46 -6 -22 25 -13 59 33 -3 32 68 25 -13 89 5 34 34 77 26 24
3528 24 38 27 50 -27 52 -6 -4 40 66 28 -20 18 14 15 12 -19 -4 4 -11 -29 7 -31 -2 -45 7 -33 -24 -20 10 -29 -39 -1 -80 -23
$$ packed form
3306B1M5o0Oj5k0M8p0J05p5PJ5l5J9k6J2mK5lp3R0o2L2m6L4j8M8l2L2k1j5nL9
3338bM5j05P0l2k2K5lL5q0J19k3J4kl9%k0M5m1P2p6M7N0qj8k6L8k2M7m9M9n9o
3370B3M6m1P5r2K9%j1KoJ4j0N4j02Q7n7rK3k4K9n1J1OK2k7L9l9m1P1o2J01j19
3401e9M4l0qL1k8O1l3K3o5R5m6qQm8J8n3J21r0N8PkM6r9J17o1N5p7P9n1%J9k3
3433AJ3j9P6o9L3l1P8rn2Jl0O0l7O0j6o4J6lL2J3j4m9J2j1K8K5m8j9K5O5o5M5
3465D7om0j1mJ8o5M3r0Q8l9J8j2j9P9j30R5m9N9p%jMj0k6K7j6K1j8M8Jl8R0j05
3498d8M3j4N8k1jM8j12P6K2K1j02P6n2j6M7l8P2k6l6L5L6m3l8J02q4K9%M3n1k
3528B4J4j1K3p7P9n8KM4K6l8m8L8mJll1J5Qj5j8L6l8K9m3N2m0RML0l9j0L8p9N7
$$ plain form
3562 -23 -24 -36 -92 8 15 -39 1 -35 -32 -48 9 -43 -14 33 -51 37 -21 26 -42 34 18 41 28 -26 61 59 70 51 68 5 20 35
3594 35 28 34 13 69 -18 18 48 50 82 -19 19 -9 15 24 21 -61 -15 -2 -54 16 -37 27 -14 -2 -55 -16 -98 -27 -6 -23 -36 -66
3626 -66 -23 2 -77 12 1 13 -65 -30 -9 24 23 -47 11 -48 31 -84 7 -38 -24 -51 -26 3 -2 12 -3 16 -17 -25 20 -42 39
3657 39 -19 97 11 35 -5 50 60 17 54 -48 111 28 42 20 27 53 44 12 12 25 24 13 31 54 22 14 60 32 8 5 -39 50
3689 50 2 -40 -33 47 -12 5 -43 -11 -27 -47 -9 -50 -48 -54 -37 -35 -2 -36 -90 -34 -38 9 -29 31 -12 -28 -5 -7 -22 3 -63 25 40
3722 40 -55 12 48 8 -9 -3 12 -60 55 18 58 57 -49 28 -15 21 47 72 -8 -25 53 58 -9 55 55 65 78 40 84 33 -14
3753 -14 -18 21 64 -14 34 -30 -26 58 13 -1 -56 12 -20 2 6 9 26 11 20 -79 -7 -40 -40 -75 -50 -26 -48 34 -35 -47 -30 -17 -68
3786 -68 -8 -17 -18 -14 -33 -74 -26 17 -1 -10 -29 0 -36 -41 11 -16 10 -65 19 5 -20 50 -30 75 3 46 -5 33 25 12 69 39 61
$$ packed form
3562b3jj2n6J00Pn4M0l6Lj6N7n2K9M7q4Q8n8M7o8P6j6K3j3n4Q7kJ1j9J7o3J5J5
3594C5pOk1N6q7L6L0KL2j01L8k8K4Rlq2M6J3n2P0n3O4m1J2n3L9q2P1K1j7j3l0
3626f6M3K5p9Q9j1J2p8L5K1L3jp0N8n9P9j15R1m5J4k7K5K9nJ4j5J9l3qM5o2Q1
3657C9n8J16q6K4m0N5J0m3L7j02J59q3J4k2PK6rl2%J3jj1J8K3l2qM6k8k4lm4Q9
3689E0m8m2PQ0n9J7m8L2j6k0L8m1KoJ7KL3l4n4N6mM7l8O0m3j6K3kj5K5o6Q8J5
3722D0r5O7L6m0j7OJ5p2J15l7M0jj06P7m3L6K6K5q0j7P8No7O4%J0J3l8M4n1m7
3753a4mL9M3p8M8o4MQ4m5j4n5O8l2K2MLJ7j5Rr9P2l3%l5K5K4k2Q2o9j2J7J3n1
3786f8O0rjMj9m1M8M3j8rj9K9l6nN2k7K6p5Q4j4k5P0q0J05p2M3n1L8qj3N7l0K2
$$ plain form
3819 61 -4 82 0 44 42 2 67 24 48 27 38 23 79 46 4 54 21 72 -35 42 12 -11 -3 -3 -43 11 18 -8 -14 -14 0 -26 -40
3852 -40 1 -48 -45 -74 -23 -16 -12 -52 -16 -15 -74 -20 -78 21 -4 22 -26 -38 -4 4 7 -66 -20 5 5 22 3 -5 44 5 5 48 -17 -14 41
3887 41 14 -6 47 9 3 45 57 41 70 -16 65 16 37 -13 45 -28 39 12 43 19 -47 74 14 33 50 -14 -6 9 2 -4 3 13
3919 13 -28 -14 -27 -8 -25 19 -62 36 -23 -2 -33 -22 -27 -37 -46 -47 -11 -30 -45 -20 -33 -5 13 47 -47 -49 2 -47 -21 28 5 -1 24
3952 24 4 35 -9 -5 4 29 31 5 48 -2 58 22 47 -8 31 60 -19 30 10 25 -21 3 57 3 44 10 39 60 37 -12 2 30
3984 30 -8 20 -52 44 -8 36 -10 -6 40 -63 -10 -35 36 -31 3 -64 -34 -26 -30 35 -33 -9 -62 -5 -22 -38 -24 12 -18 -67 80
4015 80 -60 -57 16 -24 15 -92 9 -57 -30 -25 9 -1 26 1 -32 27 1 -3 -23 50 -38 11 -13 23 88 55 52 48 42 -3 12 -1
4047 -1 -42 42 -29 18 -49 26 -41 46 60 -35 95 -56 39 -20 31 23 -10 18 11 -13 -7 9 -12 -48 -37 -23 -29 -16 -4 -71 -28 -42
$$ packed form
3819F1o5Q6q2M4km0O5m3K4k1J1j5N6l3m2N0l3N1j07P7l0k3Q%m0N4Pk6o%J4k6j4
3852d0M1m9Lk9N1PMm0L6Jn9N4n8R9k5K6m8j2L4QLp3M6K5%J7j9qM9l9%M3o5LN5
3887D1k7k0N3l8oM2J2j6K9q6Q1m9K1n0N8p3O7k7L1k4o6J21o0J9J7o4QJ5poPJ0
3919A3m1J4j3J9j7M4q1R8n9K1l1J1nj0rjL6j9j5K5j3K8J8L4r4kN1m9K6M9k3oK5
3952B4k0L1m4MRK5Kk6M3n0O0l6K5n5L9K9p9M9k0J5m6K4N4n4M1l4K9K1k3m9J4K8
3984C0l8K8p2R6n2M4m6MM6j03N3k5P1o7L4o7L0QmO5o8K4n3N7j7j6J4L6l0m9J47
4015H0j40LP3m0L9j07J01o6K7NL4j0K7k5l3N9k6mk0P3q8M9k4L6O5l3lmom5J5j3
4047am1Q4p1M7o7P5o7Q7J4r5J30j51R5n9N1ql3K8pk4OJ6k1l6J1J4oJ3J2o7M3j4
$$ plain form
4079 -42 -17 -36 -65 -32 -73 -28 -80 7 -13 -89 -23 12 -49 -56 30 -44 -23 -2 -15 -17 -4 13 -20 10 -24 27 -22 28 21 -21 15 -14
4111 -14 56 -28 67 77 51 52 1 16 15 48 -2 42 1 17 -46 -26 -9 -6 36 56 24 49 34 29 -4 -17 -26 12 24 50 -26 -17 -35
4144 -35 -3 -32 1 -12 -2 52 21 -45 2 7 -76 -64 17 -50 -71 29 -6 -15 -40 -36 -93 -30 -58 -38 -33 -22 -1 14 4 12 16 -39 -12
4177 -12 -11 -1 8 -48 36 26 86 -10 19 -11 34 23 20 44 -16 -10 -30 52 22 7 39 -18 30 56 -30 -35 10 42 31 35 19 10 -52 -41
4211 -41 -19 20 -12 -55 -19 -15 29 -31 -15 -28 -52 -27 -63 -6 -17 14 -58 -34 -80 -42 -24 -10 -25 -28 -13 -53 -53 -27 -29 -27 -18 11 -38
4244 -38 -15 -29 45 -21 -5 -31 -3 21 -45 -2 -7 34 4 50 -42 -3 -16 -38 29 31 32 -5 36 2 59 -24 18 63 79 75 74 45 62
4277 62 12 24 11 50 19 12 -74 38 -29 3 -32 -50 -28 -67 28 -65 2 10 -43 -7 -88 1 -23 -11 -50 -20 -65 -22 -34 -32 -27 -56
4309 -56 12 -15 -78 0 -22 -13 -4 44 1 25 -3 63 -14 -47 18 -43 -4 -76 1 10 7 -9 35 6 50 64 5 43 24 9 -23 2
$$ packed form
4079d2K5j9k9L3m1M5n2Q7k0p6O6L5o1pQ6p4K1K1j3kJ3J7l3L0l4N1m9N0pm2L6k9
4111a4P0q4R5J0k6Jn1J5jL3n0M4m1J6o3K0J7LM2K0l2K5j5nl3j3rL8J2K6p6Rj8
4144c5L2k9L3j3J0N4l1o6M7Nq3J2Q1o7k1J00l5rk5Mn7O3k8K0NJ1K1J5j0QMn5K7
4177a2JJ0Rn6Q4j0O0r6K9l0M5j1lK4o0Ok0Q2l0j5L2n7M8K6q6nM5L2j1Mj6ro2J1
4211d1K2L9l2m3L6MM4o0J6j3k4K5l6N7j1L1p2K4m6L8J8J4j5lJ5m0%K6kKRK9m9
4244c8K3j4P4o6J6k6K8K4o6M3nM1l0M6r2L9j3k2O7KJl7M1l4N7q3M2M5J6mjk9J7
4277F2n0J2j3L9l1pq6J12o7L2l5j8K2l9R5r3O7Qn3L6q1Q9k4J2l9L0m5M3j2KNk9
4309e6O8k7o3P8k2RRM8m3K4k8O6p7l3O5o1L9p2P7Rlj6M4k9M4J4n9L8j9j5l2K5
$$ plain form
4341 2 33 21 59 -11 72 7 99 -12 -17 14 24 66 2 20 -17 55 38 -2 25 -12 1 -1 -29 15 43 -84 -14 7 -31 20 -28
4372 -28 17 -11 -5 -63 -54 -8 -66 -43 -57 29 -36 -56 -89 -24 6 -60 -28 -45 6 -25 -40 27 -36 -6 28 -4 -17 -18 -38 6 8 -19
4404 -19 0 28 82 -2 26 7 -17 -23 0 14 -14 -17 -36 46 -17 13 15 -40 35 54 48 -11 51 35 32 30 -3 7 -4 -16 19 18 -24 25
4438 25 18 -46 -35 -53 10 5 -47 -5 10 25 -17 -28 -20 -5 -21 -16 -97 -15 -32 -67 -23 -36 -23 -62 36 -56 -50 -18 -11 17 -19 -7 -39
4471 -39 48 14 22 42 15 -11 -24 34 20 -43 -21 4 33 14 14 53 7 28 -16 -21 52 -22 3 41 9 25 41 26 -26 68 -11 -1
4503 -1 56 -34 61 -7 36 22 0 27 12 18 -7 -62 -21 -6 -14 -34 20 -59 15 -36 -17 -26 2 -6 -67 -31 -9 23 -58 14 -48 -31 -23
4536 -23 -24 -36 20 50 -33 8 -64 6 -35 0 41 -2 -6 -17 -25 19 13 -8 33 -56 -44 70 67 49 15 -1 43 -10 43 39 14 51 26
4569 26 -2 -19 1 -12 24 30 17 51 24 -3 52 14 9 33 39 40 -42 48 45 -36 -5 5 33 -46 30 36 -13 -26 28 -41 22 -36 -1
$$ packed form
4341BL1j2L8p0Q3o5R2j11nL1J0M2o4J8l7P2j7m0K7l7J3kk8M4K8j27P0K1l8N1m8
4372b8M5k8On8RM6n8K3j4Q6o5k0l3O5L0o6L2j7N1l1j5O7o3L0L4l2j3jk0M4Kk7
4404a9J9K8N4q4K8j9k4oK3J4k8lj9Q2o3L0Kn5P5J9on9O2j6lkl3J0j1j2L5jm2M9
4438B5po4J1j8O3nn2M2J5J5m2j1QJ5j6Nq1Q2j7l5M4j3J3l9R8r2OL2PK8l6J2l2
4471c9Q7l4QK0k7k6j3N8j4o3K2K5K9j9%L9m6K1m4nP3p4K5L8l2J6J6j5n2R4p9J0
4503aN7r0R5o8M3j4k2K7j5Ok5n5M1J5qk0N4p9P4n1J9rK8qo1L6K2L2q1P2o2J7Q
4536b3jj2N6L0q3M1p2P0m1L5M1m3mj1qM4ok1M1q9J2J14lj8l4j6M4n3N3mk5L7k5
4569B6k8j7K0j3L6Oj3L4k7k7N5l8nK4OJq2R0lq1L1J0K8p9P6Om9j3N4o9O3n8L5
$$ plain form
4602 -1 -3 -34 16 2 -58 -1 -48 -10 -81 16 -44 -9 -2 -31 -4 -30 -18 8 -17 5 -30 -49 28 -26 21 37 -27 1 73 -24 66 6
4634 6 65 37 -14 -8 61 16 45 49 18 52 37 51 60 15 7 57 -39 -19 23 19 0 0 44 -12 13 -17 -15 23 -53 27 18 34 -20 8 -17
4669 -17 44 11 20 -3 -11 51 -15 -28 19 -39 -62 -84 -20 -6 -29 -7 -38 -28 -33 -55 -9 22 -65 6 -31 -16 -53 -71 -25 -13 61 7
4701 7 9 16 -69 14 15 17 -57 25 11 63 -19 31 -30 -42 49 44 32 47 65 21 43 37 -2 -22 -23 1 16 -5 -5 22 -34 -29 31 -11 3
4736 3 31 32 -22 29 -28 6 1 -37 18 7 11 -42 -45 -12 1 -13 -27 -4 -46 -4 -34 -26 22 -39 -18 -25 -6 -22 -13 -56 -16 -15 -14 -22 32 -1
4772 -1 -51 -4 -33 -2 18 -63 48 57 -6 -12 43 51 3 28 12 4 38 43 -17 -28 17 18 45 -5 4 0 61 -24 7 -3 32 16 -33 -13
4806 -13 21 47 -2 42 -4 -19 11 -50 -8 -20 21 32 -7 2 -30 -40 -42 5 12 -28 -10 -38 -35 30 -8 -57 -21 -69 17 -18 -65 -29
4838 -29 2 28 -9 24 -18 91 -27 1 -6 29 3 50 14 -68 45 10 2 53 3 -26 25 39 10 27 2 -16 38 -17 17 -14
$$ packed form
4602akl1N0j4o0N7m7L8p1R7o0L5Pk9K7k6J2K6k5K2l5j9P7n4M7J6o4K8P2r7R0o0
4634FN9k8n1OO9m5K9Ml1L4j5J4Rm5qN0r6K0M2mj9%M4n6K5l0KL8p6Q0rJ6n4K8k5
4669a7O1l3Rk3qO2o6j3M7n8k3k2O4J4k3K2l1J0nk2M6L1q7P1l7J5l7j8M6J2P4n4
4701GKPq5Q3JKp4Q2j4N2q2N0o1j2R1nj2J5J8m4K2ol9k0jK4J5k1%K7n6NO0m2J4
4736CK8Jn4N1n7L4nl8N5j1Mn3lL3J3j4j4K3m2M2l0QM8o1K1pJ9j6Rm3M0JJqN4l3
4772an0M7k9L1K0q1J11Ro3oN5Qm8K5j6qL4No0j1M5JK7n0RmO1q5L1j0L5j6m9K0
4806a3L4K6m9M4m6j5L0o1M2j2M1J1l9Rl2j0kM7Pm0J8k8LO5l8m9L6m8Q6l5m7L6
4838b9L1K6l7L3m2J09j18K8pL5k6M7l6q2J13l5qN1n0k9N1J4k9J7k5j8N4n5L4l1
$$ plain form
4868 -14 44 -2 49 -8 -11 -39 -16 39 28 52 28 53 24 -8 -6 -15 -14 54 -3 34 -23 2 5 -33 1 -31 -1 -14 -25 -2 -11 -41 -20
4901 -20 -55 14 18 -5 7 7 -40 -43 23 -58 -19 -24 -32 -10 13 -23 9 3 -41 -21 12 21 -2 6 6 1 3 1 -25 21 16 66 56 19 -16 34 -11
4938 -11 18 0 1 32 37 45 7 39 39 35 9 54 8 10 40 -22 2 -8 28 -36 16 14 0 -5 26 -30 -10 -12 6 -15 -61 -22 20 37 -17
4973 -17 -14 -36 -2 -21 -81 -13 -26 -43 6 -56 -2 -20 -15 -17 -71 -21 -31 6 12 -1 21 7 -50 18 28 19 -60 -41 -4 -27 20 -13 -6
5006 -6 29 22 90 49 38 -69 -32 -40 8 10 -2 45 9 30 7 45 39 11 19 22 3 31 2 66 62 -55 14 -14 33 -1 -22 25 -30
5039 -30 27 22 -24 -24 21 18 -55 -72 -44 29 -23 -24 -36 -16 -50 -5 30 -43 -15 16 -26 39 -26 0 -31 4 -21 7 -54 -25 17 -63
5071 -63 20 -20 -8 -3 48 29 -21 -20 -23 4 10 38 4 53 59 30 25 14 -5 6 28 -23 -30 -7 2 5 29 -13 -38 7 -29 37 -23 -13 11
5106 11 -40 34 -22 -11 -23 32 9 14 21 3 -15 45 -10 -43 2 -12 20 -2 2 -14 33 -29 -1 -38 -30 38 -10 10 -32 -60 -23 -106
$$ packed form
4868a4N8m6N1n7lk8K3N5j1K4k4K5k9l2KrJO8n7L7n7K5Ll8L4l2L0j3j1K3rl0K1
4901b0l5O9Mk3J2%m7lO6q1L9nqK2K3l6L2om4K0L3Rk3Q%nKkk6M6nN0j0l7l5N0m5
4938a1K9j8JL1NQl8L2%mk6M5m6KL0o2K4j0L6o4N2kj4nL1n6K0kJ8k1m6L9M2J7n4
4973a7Lk2L4j9o0O8j3j7M9o2N4j8Nkn4N0j0L7Oj3K2j4n7O8J0rp9J9L7k3M7l3P
5006fL5pO8m1j1j07L7qM8Kj2M7l6K1k3L8ok8QLj9K8k9O4mj17O9k8M7l4k1M7n5
5039c0N7nm6%M5lp3j7K8P3n2jj2K0l4M5L5p3K8L1m2O5o5K6l1L5k5K8o1K9M2q0
5071f3Q3m0J2NN1j9n0JlK7OK8l4M9Ok9nj1j9J1K2n1pK3RLK4m2k5M5l6O6o0J0K4
5106A1n1P4n6J1j2N5k3NPj8j8O0n5l3M5j4L2k2Mj6M7o2K8l7QO8m8K0m2k8L7q3
$$ plain form
5138 -106 -16 -34 -24 -16 -43 -24 -40 -8 -42 -3 -18 -16 -2 -58 -17 7 28 -18 23 9 -51 -61 66 3 -8 22 2 6 -24 -3 5
5169 5 46 34 13 14 36 10 38 -4 20 -8 -17 1 -30 6 81 31 39 -51 -27 -13 -17 33 -5 23 -11 -9 -11 -14 -46 -21 4 -7 7 -37
5203 -37 -24 19 20 21 -62 -69 5 -11 12 -7 -22 -36 2 -68 -15 -54 -19 -41 -7 -22 -20 19 20 7 -32 5 -10 11 -22 -32 12 16 12 -6
5237 -6 11 -29 -8 15 14 21 -47 21 17 36 10 -5 42 -38 9 -4 -20 -54 16 -10 -53 -10 -41 -19 -15 56 -44 -16 14 24 22 -35 -27
5270 -27 0 9 -68 28 -17 -30 -33 -13 -16 -22 -11 6 5 -35 -31 -26 -15 9 21 22 -14 -47 -50 -11 -35 -61 3 -20 -37 -4 -19 -9 0 18 -9
5305 -9 -15 -35 -26 5 89 39 -20 34 -31 33 50 -5 23 8 47 22 29 -2 -10 -48 -14 39 6 3 12 31 -3 25 22 41 39 -11 0 24 -49
5340 -49 -4 0 -5 -53 -33 -41 11 -13 -32 -40 19 -26 -8 19 33 -14 -19 34 -52 6 -9 -24 -16 -27 14 35 16 -9 -20 -35 -1 4 -31 -17
5374 -17 -11 -13 -2 -7 -53 -13 2 20 -26 -24 -26 -26 20 -40 32 -6 -12 0 -9 20 52 -13 11 51 9 5 75 25 -4 -9 9 14 8 26 3 -2 6
$$ packed form
5138a06R0j8J0Qk7J9j6L2l4L9j5KJ4n6M1K4K1m6M1j4o0j0J27o3j1L0k0Ml0K1Q
5169EM1j2k1JK2k6K8m2K4k8rJ8l1L6P5n0Qr0K4J4mN0l8K8l4Kkll2K5K5j1J4m4
5203c7J3M3JJq3pP4j6K3j9j5j4L8p0N3l9L5k2L4j5KL9Jj3l9L7j5K1l3j0M4Mmj8
5237fJ7m0K1K3jPo8O8mJ9k6j5M7q0M7j3j6l4P0k6m3M3l1K2MP1j00K8L0J0kn7Q
5270b7K7Rp7R6m5j3lK0loJ1J7jm0MNJ1K4J2Jl6l3lL9k4k6O4k3j7L3j5J0RJ8k7
5305iok0RL1Q4n0n9N4o5O4J7n5K8j5L9k5Pl1ql8L4N3l3lRJ9l4K8lJ9kn0J1K4p3
5340d9M5Mnm8K0qN2k4j9qN9m5J8K7J4m7nN3q6N8j5j5Qj1M1K1j9k5j1j5L4Nl5J4
5374a7OkJ1nm6M0J5J8m6Kk%M6o0P2l8oJ2rK9L2o5K4M0m2mP0n0k9nJ8NoJ8k3nQ
$$ plain form
5411 6 38 13 48 -31 49 -20 -3 -10 -9 -48 4 10 -10 -38 -58 -22 -19 -23 15 -17 18 -43 -43 -21 -1 43 -4 -13 -2 -38 -12 -12 12 -53 -1
5446 -1 -18 -11 -32 -12 -18 38 14 -16 33 -35 -21 -24 18 15 30 25 -4 -15 30 5 -22 44 -8 0 40 25 28 30 15 10 -3 44 -72 21 72
5481 72 71 8 25 50 14 26 40 -28 12 -23 -16 56 -14 25 -27 16 17 -8 -38 -7 -31 -14 -29 -51 -9 -47 -15 -47 -76 5 -12 26
5513 26 10 -45 -37 -22 2 -16 12 2 66 -35 37 57 10 55 14 -6 -25 11 -32 39 9 -20 69 25 65 -42 15 -1 -16 -49
5543 -49 25 6 -15 30 2 -12 -45 11 3 13 8 -31 31 5 7 35 -4 13 -36 40 -50 -17 -9 -25 27 -22 10 30 -20 -3 32 3
5575 3 -57 -61 17 -12 -21 -12 -48 -39 5 -4 -4 -65 -25 -12 -13 -55 -39 -30 -4 -1 19 71 -70 30 12 -17 47 1 -30 11 13 39 13 -1 16
5610 16 16 50 -24 42 -15 23 48 -2 10 13 31 0 -21 59 36 26 6 40 -31 7 6 43 -38 -22 43 -59 -30 20 -7 -4 8 19
5642 19 8 9 41 11 -18 4 -42 -35 -13 -31 -7 -45 -14 0 14 41 -50 -35 -20 13 -47 41 -54 -38 -15 -43 -11 -37 37 38 -12 1
$$ packed form
5411FL2k5L5p9Q0o9J7pJl9N2Ok0k8k0L6LmL8l2L5o1%K2K0M4m7rJ1l6K6%K4o5N2
5446aj7Pk1K0oN6k4l0M9o8J4lM2lJ5nk9j1M5k5k7O6n2QM0j5LKj5nj3M7j16R3N1
5481G2jo3J7K5l6J2J4o8M0l5PP2p0L9n2M3Jk5l0L1k4J7j5k2M2l8L2l2k9Q1j7L8
5513B6j6n5QJ5K4j8K8j0O4j01P2K0m7M5m1k0j9L6m3P1l0k9Q9m4M0j07N7j6j5l3
5543d9P4j9k1M5k8j4l3N6qJ0nl9O2k6KK8l9J7m9P6r0L3Qj6N2m9L2K0n0J7L5k9
5575Co0mP8k9rRl6RM4r%o1M0J3jm2J6RK6LK0N2j41J00j8k9O4m6l1M1KK6k6j4J7
5610A6%L4p4O6n7L8K5n0J2LJ8l1k1Q0k3j0k0L4p1L8jL7q1J6O5j02K9N0k7LJ2J1
5642A9j1JL2l0k9K2m6PK2j8K4l8L1J4J4K7r1J5J5L3o0Q8r5J6K3k8L2k6P4Jn0J3
$$ plain form
5674 1 28 -64 23 -9 -17 15 35 25 16 24 69 21 7 -16 11 26 37 35 45 -25 -23 -25 27 -25 -14 39 32 -13 7 -30 -14 -69 -28 -4
5708 -4 63 -35 22 39 5 17 -28 46 23 5 -35 -15 -52 -10 29 5 -17 4 10 24 -5 50 4 -4 -75 18 -50 -19 65 -24 38 -10
5740 -10 -2 -39 -31 -33 20 -20 -43 -6 1 -11 0 -37 -4 27 12 9 -10 32 -8 7 35 23 2 8 6 3 7 7 -1 51 28 27 42 -28 -19 -22 -13 -24
5778 -24 13 -36 -16 -17 41 55 -19 18 -40 -14 14 0 -42 9 -66 -68 77 -10 34 -16 47 15 -46 -3 21 28 -5 9 -28 22 -24
5809 -24 25 24 -28 0 11 -40 -45 34 10 -23 -26 -15 10 -47 -27 -49 -11 -32 9 73 -8 61 12 -13 14 62 -15 -13 19 -33 15 -37
5841 -37 3 43 41 9 8 30 34 5 3 29 17 40 6 21 -10 -13 43 -10 -8 -14 -21 -11 -1 0 -26 -17 -71 48 1 -21 -3 -27 90 14
5875 14 -6 -28 18 -13 5 -30 -9 47 -17 1 -46 -34 -21 -13 10 -6 78 -28 34 -11 -36 15 -24 17 13 -17 23 5 16 32 -13
5906 -13 26 13 -25 -16 -33 21 -16 28 27 39 45 -15 45 10 -21 35 45 -2 15 23 -43 11 24 7 35 2 0 -3 -20 -40 8 -2 27
$$ packed form
5674AK7r2Q7l2qL2K0j0rQM5m8j4k3K7J5J1kJ0p0KkN2n2J1N3pm5K0l7J6n5M1K4
5708dO7r8N7J7l4J2m5P4k3j8m0K0l7M2L9k4k2K1OJ4k9N5m6qp1R3o8L1Q4q9O2m8
5740a0Ql7QkN3m0k3L7Pj2J1l7L3L1j5lj9M2m0J5K8j2k1OklM%qN2k3jJ5p0RlRj1
5778b4L7m9K0jN8J4p4L7n8K6K8j4m2N1p5kJ45q7M4n0O3l2o1M3K4Pl3J4l7N0m6
5809b4M9jn2K8J1n1nP9k4l3lJ1K5n7K0k2L8k1M1O4q1O9m9k5K7M8p7KL2n2M8n2
5841c7M0M0kl2jK2Mk9kK6j2K3l4J5l1lN6n3KopJ0J0Jk6Rn4J19m7k2J8k4J17p6
5875A4k0k2M6l1J8l5K1N6o4J8m7J2J3QK3j6Q4j06O2m5k5N1l9M1ml0M0j8J1J6m5
5906a3L9j3l8Rj7N4l7M4jJ2Oo0O0l5l1N6J0m7J7Qo6N4J3j7K8l3klj7k0M8j0K9
$$ plain form
5939 27 -21 -4 27 -5 -6 -17 -36 -28 -23 3 -14 -5 42 -15 -39 5 -63 -2 34 26 3 -22 39 -16 -36 -6 -20 -19 -50 -27 23 -21 -11
5972 -11 29 -4 38 -38 -9 2 1 51 52 16 -10 44 2 -44 -34 11 -5 2 39 -23 4 -20 -40 36 33 11 17 19 24 33 -43 11 -4 -13 -6
6007 -6 -18 9 31 -4 28 -1 1 -51 0 -30 21 -57 -63 -37 33 -31 15 -4 -61 5 12 -26 -31 22 -12 -1 14 -5 -16 32 -30 -34 12
6040 12 32 -13 -45 -43 -8 -21 -22 26 3 -39 -22 -62 16 -21 -22 -33 61 2 55 19 -11 1 -6 -49 61 -34 -7 -32 -54 28 25 17 26
6073 26 35 -24 -28 14 6 -25 -12 -5 -16 -48 27 38 30 -29 5 43 25 -14 -18 16 9 -18 20 -27 29 26 -3 -28 -59 -11 -4 -28 -4 -34 -51
6108 -51 -36 21 -40 10 -24 -13 -40 -20 0 -30 -14 15 -2 -4 -16 6 2 -71 1 -15 3 -63 23 0 -7 -53 -28 -34 -31 -26 35 3 -19
6141 -19 13 54 23 20 -14 -40 29 27 2 -15 -5 -10 20 -46 -35 28 30 -13 27 -2 70 22 -31 16 21 -6 12 5 -5 -5 -41 -6 -8 -19
6175 -19 -27 7 -43 -32 -2 -32 -21 5 -21 -14 -5 51 18 -10 -3 -26 -26 -65 7 -10 -11 1 -17 27 -19 24 0 -71 -14 -11 -24 3 10 1 21
$$ packed form
5939B7m8J7L1l2jj1j9QNK6j7RM7n7k4M4o8O1L6qk3k5O1n5k0L0j4Jl1K3N0m4J0
5972a1M0l3M2p6K9J1jN0Jl6k6N4m2m6J0M5j6PL7o2K7k4k0P6lk2OKNRp6N4j5rP
6007fj2K7K2l5L2k9Kn2N1l0N1p8oK6P0o4M6j9n7O6Pl8nN3l4J1J5j9j1M8o2mM6
6040A2K0m5l2KL5j3jM8k3m2J7m0P8l7jj1R4n9N3l6l0J2pm3J10r5K7k5k2Q2lqR
6073B6Rn9mM2ql1J3Pj1l2P5J1qn9L4L8j8l9mL4pk7L8m7N6lk9k5l1M8Pk4K4l0j7
6108e1J5N7o1N0l4J1k7K0K0l0J6K9j7kj2K2mp3P2j6J8o6Q6k3pm6K5oLNO1l2k2
6141a9L2M1l1ll4k6O9kk5j7J0nL0o6J1O3Km3M0k9P2m8n3M7Nk7J8pj0%l6L5kj1
6175a9qL4n0J1L0l0J1K6k6PRN6l3k8Pk3%l9P2j7jJ2j8M4m6M3k4p1N7Lj3K7PrK0
$$ plain form
6210 21 29 10 -19 3 13 -7 -37 -28 43 -8 19 19 -15 -1 -18 -37 -5 29 -57 2 -20 -10 -15 -44 -16 -11 -18 -16 11 -40 -3 20 -10 27
6244 27 11 42 32 30 -46 -27 26 -47 -27 -74 -37 21 -56 -34 3 -18 5 -13 3 -28 -28 -22 -2 -54 72 -16 36 23 -3 -16 -28
6275 -28 -30 13 -13 -4 2 42 10 3 17 -5 22 -7 12 -44 1 17 -10 -9 15 8 -55 37 -9 -17 -7 31 21 55 -12 -22 -22 -36 66 13
6309 13 21 -22 22 -54 -38 20 -7 16 -14 25 -62 -4 -21 -18 -28 -18 -21 -38 42 47 -16 12 -40 16 -27 -53 -48 -29 -14 -23 -32 -54 -3 -40
6343 -40 9 -57 -37 -4 -12 -44 -12 -12 -59 -11 37 21 -23 -18 -46 -14 24 -6 36 -7 12 2 13 -4 -5 21 -5 4 25 23 10 35 18
6376 18 13 24 -4 -49 31 -86 24 13 -41 -3 36 -3 -4 0 33 -10 -42 34 -26 24 -38 -17 -13 25 35 -28 -47 -26 17 36 -57
6407 -57 9 -34 -49 -6 27 -45 -50 12 -33 -57 -20 -6 -24 -1 -5 -13 -27 14 -21 24 1 30 -23 -52 39 -40 -43 29 -3 27 -2 53
6439 53 -51 32 10 0 -3 67 63 -3 39 -64 -34 8 -17 -12 -16 -24 -43 -15 30 44 23 -18 -13 4 -8 -70 -44 -13 -2 -12 -41 -57
$$ packed form
6210B1Qj9k9K2J0k0l0RP1n1K7%l4J4j7j9L2L4q6N9k2J0nk9K8NpKK7n1L7K3l0L7
6244B7j6L1j0kp6J9N3p3K0m7L7N8p7K2L7k1K3j8J6l1%OK0n2J26q8N2j3k6j3j2
6275b8kM3k6ROM0l2pJ4k2K7k9J9n6M5J6k7JK4po3R2m6qJ0L8j0L4o7j0%j4J02n3
6309A3Qm3M4p6J6N8k7K3l0L9q7N8j7Lj0J0lj7Q0No3K8n2N6m3k6NJ9J5rrk2N1l7
6343d0M9o6K0L3ql2L2%m7M8M8j6m4Nk8L2L8l0M2m3J9j0J1j7jK6k6RK1kj3K5j7
6376A8nJ1k8m5Q0j17J10j1n4L8L9l9jML3m3l2P6o0N0o2K1ML8J0o3j9K1M3J9r3
6407e7O6m3j5M3L3p2nO2m5k4L7J4j8K3mqj4M1l5M5k3K9n3k9R1p9lP2l2L0k9N5
6439E3j04Q3k2j0lP0mo6M2j03L0M2k5Nmqj9K8M5J4k1m1NJ7j2o2K6L1J1j0k9j6
$$ plain form
6471 -57 -5 -18 7 -8 -51 19 -23 -8 -39 -61 -17 12 43 -26 14 11 -35 24 6 -35 8 -5 -8 -72 67 -25 -6 -51 9 28 11
6502 11 -8 -37 -30 -44 23 -46 15 -17 4 -14 7 75 -13 32 62 19 -18 40 1 -1 -19 -21 48 -25 54 19 -2 42 10 -29 5 -19
6534 -19 18 -31 15 -26 -16 -47 -32 4 -22 -40 14 -60 -52 -25 -10 -13 -50 16 12 58 0 18 -20 -9 -25 -7 13 -49 3 -28 -3 -42
6566 -42 30 60 -1 -29 25 -8 -49 -44 35 15 -36 16 10 13 -23 3 -62 -47 -7 18 30 45 -58 -3 39 26 4 -32 -48 26 -15
6597 -15 -21 5 15 -6 22 9 -38 25 -11 -44 30 -64 32 -35 -18 -41 -35 35 -13 40 -42 -4 4 6 21 11 -41 -62 28 1 3 -16 -11
6630 -11 -2 -17 -7 1 -16 22 17 -79 -11 -82 -20 -32 -2 -49 -46 -56 -7 -8 -29 21 59 11 38 -26 -21 -3 -31 32 -7 -15 16 27 -11 -22
6664 -22 18 -41 16 -31 38 -16 -16 -26 -20 -9 13 35 3 -4 -11 23 3 3 47 -29 19 -16 13 -30 -30 23 -1 -42 -18 47 -55 48
6696 48 -4 29 -10 -2 0 30 -25 19 1 -25 -34 9 19 29 -5 18 -19 -39 10 -36 -34 -18 5 -32 9 11 -21 -2 21 -25 47 -69
$$ packed form
6471e7N2j3K5j5m3P0m2J5l1k2M4K9L1o9M0lm6N9j8m1M3j3lo4J39r2J9m5O0J9j7
6502A1j9k9Pj4O7o9O1l2K1j8K1O8q8M5L0m3l7N8l9kj8kO9p3P9l5k1M4l2l9L4k4
6534a9L7m9M6m1J0l1J5L6k6j8N4p4QK7J5ll7O6mM6n8J8l8J1j6J8K0o2N2l1K5l9
6566d2P2L0o1k8N4l3m1NP9k0n1N2oLl6K6o5J5M0K5J2J5j03N5M2j3k2l6j6P4m1
6597a5oK6J0k1K8j3m7O3l6l3P4r4R6o7J7k3OP0m8N3q2L8QKJ5j0n2k1R0k7Kj9N
6630a1Rj5J0Qj7L8nr6O8p1O2j2L0m7Lj0M9jk1N0L8m8K7o4NJ8k8O3l9qL1J1l8j1
6664b2M0n9N7m7O9n4%j0OJ1K2K2l2ppL4k0%M4p6M8l5K9m3%N3k4m1K4O5j02J03
6696D8n2L3l9QKL0n5M4j8k6rM3J0J0l4K3l7k0M9m6KJ6K3l7M1Kl2J9K3m6P2j16
$$ plain form
6728 -69 2 -1 7 18 16 -56 -15 5 1 -22 16 -42 -3 -11 -17 4 58 37 -34 -17 -40 8 -54 12 -37 -14 -29 -24 -35 -48 -18 -18 49 -9
6762 -9 -4 14 22 44 -14 15 18 6 -5 -1 11 -33 -40 -26 -10 -27 -20 -22 -19 -25 -14 61 -1 -88 -10 23 -15 -30 -16 8 0 -4 32 2 -6 -17 -7
6799 -7 -3 1 -4 -34 6 -11 -36 4 -10 30 34 36 26 34 0 -38 -14 25 3 0 35 -12 -6 44 -6 -8 24 62 21 14 -39 -12 22 1 -30 13
6835 13 -23 -19 -11 10 -25 14 -16 -5 -14 -1 -49 34 -7 -27 -21 -79 -7 -22 21 -12 9 -20 -23 23 -37 -39 -17 22 16 -27 -24 5 10 -10 -4
6870 -4 -41 -7 21 6 -31 -8 -5 -22 9 3 -15 -17 -21 -28 8 -9 63 -44 47 28 3 -35 -41 37 29 -16 24 39 16 -17 -30 37 17 -24
6904 -24 25 14 -76 5 -39 22 -36 8 -22 -20 -3 -57 4 -21 17 -34 -6 0 7 14 -45 44 -32 -2 7 25 -17 6 18 -10 -4 -28 58
6937 58 10 15 0 -24 -31 4 18 -19 -34 8 -15 -23 -60 23 10 -17 -24 -31 -21 -17 80 -17 4 18 32 -54 7 -24 27 25 9 33 2 -58
6971 -58 -31 -32 -4 -3 -29 5 -1 41 -72 20 9 23 -11 42 7 -53 -32 -18 -37 -51 -54 1 -52 -32 -19 -1 -25 -13 6 -5 10 38
$$ packed form
6728f9P1lQJ1kp2M1K0mk3L8n8L9qoK1N4k1p1J7k3M8o2O6m9K3j5Nj1j3L0%O7n8
6762iNJ8QK2n8K9Lj2j1MJ2m4pJ4J6j7PkLoJ1P5o2q7P8L3l8j5J4K4qmL6l0qj1J0
6799gMMnl0M0j7k5M0j4M0MKj0Ql4l8K4L9k2lL5m7ON0n0kL2L8m1pn3K7L4k1l1M3
6835A3l6MQK1l5L9l0J1rJ3m8Q3m1k0On8P2j5M3l3K1k9lM6o0kK2L9om3LK9Nk0O
6870dl7L4K8j5l7K3Lj7L1oj8kmpL6j7P2j07R1j9k5l8oP8qm5M0J5k3l3j3O7k0m1
6904b4M9j1r0Q1m4O1n8M4l0KJ7n4O1k5L8n1K8OPPn9Q9p6L0RJ8m2K3J2k8Ok4Q6
6937E8m8Nj5k4pL5J4l7j5M2k3ql7Q3j3k7ppJ0MR7r7K1J4J4q6O1l1N1kj6K4l1o0
6971e8K7jK8Jk6L4oM2j13R2j1J4l4N3l5o0K1J4j9j4lN5n3K0J3J8k4J2J9j1J5K8
$$ plain form
7003 38 -1 4 35 19 -6 50 19 -1 -15 8 9 -58 -27 -7 12 -18 -7 -4 -37 -77 16 -39 -19 30 14 6 18 4 6 20 23 -33 11
7036 11 -7 3 57 -15 39 -1 8 4 43 13 36 30 15 33 19 13 -67 21 -45 29 -85 1 -12 -18 25 -7 12 -50 -15 2 -29 -23 -26
7069 -26 -52 -11 -30 -18 -9 21 -37 8 -102 18 12 -24 -34 0 -51 11 10 -12 65 -1 -27 11 5 6 14 13 13 2 27 -42 12 15 -58 30
7103 30 92 -39 -45 -5 0 -52 -7 14 23 -5 3 -37 -7 7 17 13 -22 -27 43 -17 42 25 28 15 27 33 -13 -26 -31 26 -23 37 -27 -2
7137 -2 18 5 27 -25 -5 -17 -38 1 29 -5 -7 -36 5 25 -13 -21 -10 -1 -23 -13 -20 9 -12 -1 -36 -2 0 -48 33 -77 -9 42 24
7170 24 50 15 -3 11 -35 -9 34 -32 41 -46 -9 -7 31 -6 -5 -7 13 -26 30 18 -45 38 -48 -51 3 -10 -19 8 69 -5 -11 34 -37
7203 -37 -68 -50 6 12 26 -9 -9 -12 -19 -8 -27 8 -53 -42 1 -73 24 -1 18 0 -33 12 -27 -23 6 -12 -16 -51 -37 -51 -23 0 9 1
7237 1 -52 -5 -61 16 11 24 -5 -20 -15 -13 12 -31 47 -31 29 23 20 -31 18 34 19 -9 18 32 -16 1 -14 4 -13 -8 -20 -19 -20 0 -4
$$ packed form
7003C8l9NL1j6k5N6l1k0j4K3Jo7L1K0J9l0J1Ll3m0R3n5K0M9j6qJ2j4KJ4Ln6M4
7036A1j8J0N4p2N4m0RmL9l0K3oj5J8j4oq0Q8o6P4j14Q6j3oM3l2J9o2L5J7l1Ol
7069b6k6M1j9J2RL0n8M5j10J20ol6j0L4n1O2jk2P7o6k6L8oJQj%j1K5o9N4Lp3Q8
7103C0O2j31oM0Nn2M5K1Rk8Qm0L0J4J0ml5nP0o0N9j7Lj3J2Om6j3nN7m9O0o4K5
7137bK0j3K2n2K0j2k1L9K8l4kk9M1K0l8qJ1Rk2J0pK9k1J1l5L4Km8Q1j10O8N1j8
7170B4K6l5j8J4m6K6M3o6P3q7L7KL8l7JkK0l9N6j2o3Q3q6lN4j3rK7O1p4oM5p1
7203c7l1J8N6OJ4l5%lpJ1j9L5o1J1M3p4R7k5J9j8l3M5l9MK9j8ml5J4j4K8K3Rq
7237An3M7n6P7nJ3k9j5NKK5m3P8p8O0oln1M9J6j5k8K7J4m8J7j5J8j7Nj2JjK0m
$$ plain form
7272 -4 9 -18 41 -20 -6 -19 -50 14 12 -20 -19 55 27 7 47 18 -11 71 5 21 32 34 -36 -20 -15 19 29 -52 -3 -12 -26 46 -27
7305 -27 1 4 57 -12 -36 52 22 -26 45 20 31 -4 -68 -18 10 0 -42 18 -1 -23 -9 -27 -3 45 26 14 -20 41 24 -13 10
7336 10 -39 -4 13 18 6 -6 5 10 12 6 -29 35 20 -2 78 -33 16 -30 53 4 -41 3 -16 -48 -9 15 20 -36 -15 -63 8 19
7368 19 -22 -27 -15 10 -37 -44 7 2 30 -3 11 -9 -9 -2 -1 9 14 -23 15 -28 -34 -5 39 -44 7 -28 24 8 -55 -23 42 -13 8 21
7402 21 21 -28 43 0 -8 16 59 21 56 24 -12 49 26 -17 18 -27 11 41 -28 8 39 23 -31 -9 69 28 43 -9 -5 -14 -2 -19
7434 -19 -7 -17 33 -2 36 -30 -15 38 -2 4 -42 -12 -28 -16 -25 20 -19 -18 23 -3 36 17 13 40 -4 -11 -30 19 17 -11 -26 48 -3
7467 -3 -18 -53 -11 -44 -31 -34 34 -11 -6 15 8 -57 21 15 -7 -2 -23 4 36 -25 35 -26 6 8 -53 -10 -20 21 -32 45 -33 -29 10 53
7501 53 42 -6 21 17 4 40 8 34 -68 23 -33 -36 -15 78 45 -28 -56 -23 40 -33 29 -20 -6 8 -23 15 -35 18 10 -32 16
$$ packed form
7272dJ3k7N9o1J4j3l1O4kl2JP4k8k0M0k9k9Q2o6J6J1Kp0J6NL4J0q1M9rj4P2p3
7305b7K8LN3o9k4Q8l0m8P1k5J1l5o4N0K8j0m2O0j9k2J4j8K4M8j9j2l4O1j7l7K3
7336A0m9L5J7Nj2j2J1NKol5O4j5k2Q0j11M9m6Q3m9m5M4j9l2L9K4Nn6K1m8P1J1
7368A9m1nJ2K5m7pN1nK8l3J4k0%PJJ0Nl7L8m3oK9M4q3N1l5N2j6o3L2O5n5K1J3
7402B1%m9P1m3qK4M3l8L5l2l6O1k3m3L5m5L8L0o9L6L1j6n4K2P8m1J5n2MrJ2j7
7434a9J2j0N0l5L8o6J5N3m0Om6L0j6J2rM5l9JM1k6L9j9mK7m4pj9M9kk8j5P4n1
7467cj5l5M2l3J3lO8m5NK1po5P8ok2Nk1K7L2o1O0o1L2Ko1M3j0M1n3P7p8ML9M3
7501E3j1m8K7mj3L6l2K6j02R1n6lK1R3l3p3k8L3O3p3O2m9J4J4l1L8n0N3qm2M8
$$ plain form
7532 16 -36 -24 -51 8 24 13 -24 -1 34 -38 -11 -61 -12 -18 -49 -17 -27 -26 -19 31 -6 -18 -4 0 -14 11 2 -5 9 -8 -14 -18 4 74
7566 74 12 14 29 -33 -24 -26 32 2 15 78 -2 14 23 -8 51 47 -18 21 0 11 -18 26 -65 43 -19 -21 -4 -19 23 7 -10 -61 -3
7599 -3 17 -18 17 -13 -12 -9 -32 -7 -22 -22 10 -7 -27 9 -26 3 -6 3 3 47 -14 9 -1 -30 -30 -37 22 5 15 -1 -29 30 -3 -7 -6 -12
7635 -12 12 -17 -3 -23 3 3 -37 -26 33 -9 7 1 42 0 -19 -15 10 31 -7 47 -21 39 -36 66 9 -14 52 -41 -14 -11 -15 29
7667 29 8 -41 -53 13 1 -41 -7 -38 -5 -89 -27 -30 -24 -3 -48 26 16 -47 0 63 7 -22 59 22 7 25 -30 20 -14 -32 -8
7698 -8 -25 29 26 -45 26 8 8 14 -39 -31 -54 -52 24 5 -51 29 0 2 9 27 31 -55 -53 16 21 9 20 -2 7 20 3 0 41 8 35 39 -7
7735 -7 -45 3 18 2 -10 6 -19 13 25 20 -27 -17 16 22 -33 52 41 -34 -34 -12 9 -14 -24 12 -19 18 -55 -52 -12 -12 27 -32 -7
7768 -7 -4 -2 -62 7 -31 18 22 -20 -12 53 -8 -11 59 -13 3 2 6 12 44 -21 34 -9 -32 37 7 17 2 -74 -34 -18 14 17 4 -45 -13
$$ packed form
7532A6n2J2k7N9J6j1l7K3L5p2K7n0M9ol1L2j0JPN0l7j2J4Mj4K5rpJ4j7omK2P0
7566G4o2KJ5o2RkN8l0J3O3q0J6Rl1N9mo5L9k1J1k9M4r1J08o2kJ7j5M2j6j7n1N8
7599cK0l5L5l0JLk3K5j5%L2j7k0L6l5K9rR%M4o1K3j0k9%pN9j7J0j6k8N9l3mJo
7635a2K4k9J4k0K6%m0J1N9m2J6oM1m2j9MK5K1l8N4o8O0p5J02n7k3O6r3K7LmM4
7667B9k1m9j2O6j2m2L4l1L3q4O2lOK1m5P4j0o3M7O3n6k9Q1l7j5J8n5N0l4j8K4
7698hj7N4lp1P1j8%On3Qk3KP6j9n6Q0k9KPJ8Mq6KO9Nj2J1k2RJ3j7lM1l3K7Mm6
7735gl8M8J5j6j2J6k5L2J2nm7J0L3On5Q5j1p5%K2K1k3j0L6l1L7p3LM0%L9n9K5
7768gLKo0O9l8M9Mm2QO5o1lP0p2J6jMOL2o5N5m3k3O9l0J0j5p6M0J6L2Lj3m9L2
$$ plain form
7803 -13 28 40 -51 45 -19 11 -10 -77 -20 -34 -7 -4 3 43 16 -11 11 -53 -32 18 13 -40 -37 28 -3 22 23 -7 1 11 11 48 -10 -44
7837 -44 21 25 -7 12 -10 -25 32 -26 23 -61 -31 99 -33 0 35 14 -34 -13 -5 18 29 11 -8 -2 3 31 2 11 26 -34 25 10
7869 10 71 -59 30 32 -24 13 -3 25 16 -48 -3 30 25 -29 6 6 -5 -31 37 -17 -15 -38 19 30 -28 -7 11 42 -16 -35 -22 21
7901 21 3 28 -46 -55 -27 44 -16 -52 -38 -57 -24 -1 23 57 10 -5 54 38 -33 -25 12 -3 -23 33 -1 -31 3 18 -7 -41 -30
7932 -30 16 26 -27 54 3 3 21 14 -11 31 -26 1 -24 8 -55 19 2 5 39 36 2 30 9 53 -59 -35 -1 8 -33 33 -51 -56 3
7965 3 -68 -15 -50 0 -4 -72 -1 27 17 12 19 57 4 -46 -22 17 8 9 23 -8 20 -26 -48 50 -4 -38 -1 10 -6 -11 1 26 32 -23
7999 -23 -39 -19 -34 26 64 8 -38 9 40 8 -54 14 44 13 -46 -33 29 -13 37 -4 -35 -6 -13 -2 19 -32 41 21 13 -13 -39
8030 -39 65 14 27 -1 -18 22 0 7 -25 -40 9 -21 -48 0 10 -46 32 -36 -28 9 -6 1 7 25 -29 -18 2 30 21 12 -20 39 -14
$$ packed form
7803a3M1J2r1R6o4L0k1o7N7j4K7LPM0k7k7K2o4K1N0nn3LO5l1K5Jl0QJ0%L7n8l4
7837d4O5Ml2J9k2j5N7n8M9q4L0J30j32L3L5k1m8K1QK3J1j8j9ONK8k9RJ5o0N9j5
7869A0O1j30Q9Kn6L7j6K8ro4M5L3nn4L5%j1k6O8n4Kk3N7J1n8K1J8L1n8j9J3M3
7901B1j8K5p4rK8P1o0l6J4j9L3K3K4L4m7j5N9j6p1QL7j5k0N6l4l0L4J5k5l4J1
7932c0M6J0n3Q1n1%J8pk5M2n7K7k5L2o3P4j7LL4ll4K8k1M4j12K4L4Rm1O6q4nN9
7965Cp1N3l5N0mo8P1K8j0nPL8n3n0K4L9rJJ4l1K8m6k2R8n4l4L7J1j6nJ2K5On5
7999b3j6K0j5O0L8n6m6M7L1l2o2O8L0l1n9J3O2m2N0m1l1K9pJ1K1n1P3k0qk6k6
8030c9J04n1J3k8j7M0k2Pl2j5M9l0k7M8J0n6P8o8QL7j5POJ8n4J1K0K8rrl2N9n3
$$ plain form
8063 -14 -16 6 26 8 -31 20 5 -27 -29 -68 38 -51 22 -25 3 -21 -69 -2 32 1 -21 -41 2 17 -8 22 -24 -12 26 3 40
8094 40 6 10 13 37 -23 -1 -9 -66 11 -26 24 -17 23 40 16 -7 -29 -21 -54 -31 13 -17 3 13 -9 17 -8 28 -16 26 -31 27
8126 27 2 -67 -22 -14 -21 -6 -11 -57 80 29 -5 -9 54 -48 -41 -35 -45 37 53 8 15 13 -27 22 -20 -44 -7 -5 -21 -50 -65 23 -7 -10
8160 -10 -6 -2 30 -10 -24 -39 7 22 18 18 -24 -12 -20 -4 -25 -37 -33 4 -7 13 -20 2 -42 -20 19 64 -1 -18 24 -6 13
$$ packed form
8063a4kK2K0j8l9N1j5l2kl9J06q9P3m7K8k4m8O7L4l1k2k0M3J5k5L0m6J2L8k3L7
8094D0l4MLK4o0K2qn7P7l7N0m1M0J7k4k3k2Ql3K3M4l0K0J0k2K6k5L6m4M2n7N8
8126B7k5o9M5QpJ5nm6J37n1l4mO3j02POj0Q2J6m5Pkm0M9m2k4L7Kj6k9j5Q8l0l
8160a0MML2m0j4j5M6J5m%m2J2qJ6k1j2ML7j1K0l3K2m4K2L9M5o5j7M2l0J9
8191A3
$$ Imaginary data points
##PAGE= N=2
##DATA TABLE= (X++(I..I)), XYDATA
$$ plain form
0 0 0 0 0 0 0 0 0 0 0 0 0 0 0 0 0 0 0 0 0 0 0 0 0 -8 8 -8 8 -8 8 -8 16 -16 16 -16 20 -24 24 -29 32 -34 40 -43 48 -55
44 -55 58 -64 72 -80 88 -96 106 -115 130 -140 155 -172 194 -216 242 -274 310 -357 420 -498 611
65 611 -776 1048 -1567 2894 -12819 -19063 22228 382 -15659 6589 4112 -9804 3659 1826
79 1826 -3707 -1588 -2848 3335 3925 -10108 -3605 12296 -4154 -9681 6703 537 -5225 3030 495
94 495 -4314 2011 -368 1453 946 -6880 3071 7603 -6306 -4211 7749 -482 -2701 2707 -715
109 -715 112 1695 1039 525 -671 -1106 5569 1156 -6358 4112 4758 -4207 1541 3688 -5331 4053
125 4053 5267 -7841 2257 6087 -5574 701 6150 -6577 -344 7882 -4174 -3656 3923 626
139 626 -1974 694 -1539 464 1239 -2475 914 -285 -3154 2003 2234 -6018 -2 4368 -4101 -1093
$$ packed form
0@%%%%%%%%%%%%%%%%%%%%%%%qJ6j6J6j6J6j6K4l2L2l2L6m4M8n3O1o6P4q3R1j03
44e5J13j22J36j52J68j84K02k21K45k70K95l27L66m10M58n16N84o67P77r18J109
65F11j387J824k615M461j5713o244M1291k1846j6041K2248k477j3916J3463j833
79A826n533K119j260O183N90j4033O503J5901j6450n527J6384o166n762Q255k535
94D95m809O325k379J821n07p826R951M532j3909K095J1960q231k219N408l422
109g15Q27J583o56n14j196m35O675m413p514J0470O46q965N748K147r019R384
125D053J214j3108J0098L830j1661O275N449j2727O233Q226j2056N18P579l297
139F26k600K668k233K003P75l714L389j199k869N157K31q252O016M370q469L008
$$ plain form
155 -1093 1542 -2711 -98 1999 -3619 -622 1661 -2077 495 -418 -2093 674 1287 -2106 -391 561
171 561 -964 1446 -622 -1551 1149 1046 -1376 1123 -167 -1643 3773 -437 -2932 3193 1522 -3094
187 -3094 2988 1593 -3864 3294 2776 -3009 28 3501 -324 -718 1217 371 830 -266 955 1077
203 1077 -1035 -243 3139 -482 -3318 3286 1233 -2738 885 1431 -1939 710 917 -1896 538 -375
219 -375 -335 631 -1280 -1429 1577 -95 -2689 594 193 -1093 -664 -151 -809 -404 -234 -710 313 -1858
237 -1858 -222 1444 -1661 -1858 1932 -122 -2458 1590 -321 -1356 949 280 -998 143 566 -115
253 -115 640 -824 348 1037 20 -279 652 609 -169 1218 -213 130 1140 278 120 911 -12 112 2115
272 2115 -891 -142 1783 -44 -377 1122 377 -630 1144 149 -73 -37 384 539 -293 -295 -4 712 -804
$$ packed form
155a093K635m253K613K097n618K997K283l738K572r13j675K767O13l393J715R52
171E61j525K410k068r29K700j03k422K499j290j476N416m210k495O125j671m616
187c094O082j395n457P158n18n785L037L473l825l94J935q46M59j096J221J22
203A077k112P92L382l621k836O604k053l971L623N46l370K649K07k813K434r13
219c75M0R66j911j49L006j672k594L283m01j286M29N13o58M05J70m76J023k171
237a858J636J666l105j97L790k054k336M048j911j035K305o69j278J141M23o81
253a15P55j464J172O89j017k99R31m3p78J387j431L43J010q62j58P91r23J24K003
272B115l006P49J925j827l33J499p45j007J774r95k22L6M21J55q32kK91P16j516
$$ plain form
291 -804 -59 363 -754 -283 543 -699 -1225 995 -709 -697 -31 -734 -176 -79 -780 -747 296 -1017 -258
310 -258 -227 -759 -278 -174 -217 -844 43 -335 -77 -139 -444 -61 81 -12 -369 551 -594 288 599 -596 183
331 183 631 117 -130 711 -145 576 490 71 416 173 704 239 416 117 675 509 110 411 432 441 -36 794
353 794 -47 214 511 23 379 -160 100 305 399 -706 337 318 -418 79 -177 60 -580 44 2 -494 -548
374 -548 156 4 -1213 -277 26 -199 -1226 -30 272 -1134 -353 126 -429 -1019 182 -153 -454 -623 -99
393 -99 388 -896 -137 142 27 -595 92 365 -386 -160 331 539 -791 424 490 31 93 129 543 131 249
414 249 153 707 145 217 445 450 397 -149 980 351 -114 380 682 84 -23 427 191 573 -435 316 584
435 584 -180 -329 526 689 -1240 43 1145 -523 -1373 1159 471 -1760 152 684 -569 -1107 424
$$ packed form
291h04P45M22j117M71Q26j242n26K220j704J2O66p03N58R7p01L3J043j313P59
310b58L1n32M81J04m3o27Q87l78K58o2l05L83J42r3l57R20j145Q82L11j195P79
331A83M48n14k47Q41q56P21q6m19L45k43N31m65J77k99N58j66l99L01K1Rm77Q30
353G94q41K61K97m88L56n39K60K05R4j105J043j9p36M97k56K37o40O24m2m96n4
374e48P04j52j217R36L03k25j027J196L02j406P81M79n55n90J201l35l01j69N24
393i9M87j284P59K79j15o22O87K73p51K26M91K08j330J215O6m59O2L6M14m12J18
414B49r6N54n62P2K28Nn3n46J129o29m65M94L02n98j07M50k36L82j008P51K68
435E84p64j49Q55J63j929J283J102j668q50K532o88k231J912N32j253n38J531
$$ plain form
452 424 111 -926 -658 165 59 -1382 -343 478 -242 -1566 200 932 -1629 -685 1057 -301 -1672
469 -1672 793 573 -1125 -362 645 228 -941 285 359 28 -249 39 598 120 -335 346 1033 -790
487 -790 227 1275 -234 -256 980 579 -612 916 502 -291 602 708 -443 409 1246 -966 362 1318
505 1318 -589 -520 1394 129 -932 738 351 -241 -277 225 175 -157 -368 -176 675 -898 -651 834 -139
524 -139 -1650 547 882 -1802 -317 862 -438 -1455 286 385 -1056 -591 210 31 -970 -139 89
541 89 38 -811 -406 880 -577 -949 573 667 -1324 12 1162 -706 -661 895 412 -1100 819 619
559 619 -607 475 528 -251 426 720 -575 777 631 -338 360 664 95 -48 738 56 341 194 71
578 71 424 279 -215 169 932 -717 -26 866 -208 -594 545 367 -800 44 306 21 -761 55 463
$$ packed form
452D24l13j037K68Q23j06j441J039Q21p20j324J766P32k561R44J742j358j371
469a672K465k20j698P63J007m17j169J226P4l31k77K88N59m78m55O81O87j823
487g90J017J048j509k2J236m01j191J528m14p93Q93J06j151Q52Q37k212J328R56
505A318j907O9J914j265j061J670l87n92l6N02n0l32k11J92Q51j573K47J485r73
524a39j511K197L35k684J485J179j300j017J741R9j441M65Q01j79j001Q31K28
541H9n1q49M05J286j457l72J522R4j991J336J150j868M5J556m83j512J919k00
559F19j226J082N3p79O77K94j295J352j46r69O98L04n69j43P86o82K85j47j23
578G1L53j45m94L84P63j649O91Q92j074l86J139j78j167Q44K62k85p82Q16M08
$$ plain form
597 463 -630 -486 16 216 -810 -420 151 3 -881 -370 627 -760 -674 252 223 -1179 -331 737 -742
616 -742 -791 491 197 -1058 226 275 -495 -109 17 184 -243 -70 45 367 -235 -27 501 -21 77 187
636 187 489 -170 337 329 50 303 227 305 315 398 -31 681 134 -43 565 195 168 160 458 -22 137 109 193 126
660 126 -87 271 -168 110 -70 70 -110 -138 43 -293 15 -160 -88 -374 60 -396 -280 63 -494 -153 -128
681 -128 -271 -495 -17 -299 -348 -69 -311 -74 -416 -3 -320 -234 -101 -77 -96 -272 200 -184 -132 -119 260 -197
703 -197 -186 414 -164 63 89 226 -11 293 148 83 313 58 399 22 429 143 278 280 151 324 173 350
725 350 79 356 95 228 120 140 334 -139 299 104 87 -25 216 17 -64 142 -199 169 -230 -39 -134 -136
747 -136 -116 -230 -120 -329 -80 -318 -70 -364 -101 -175 -361 -84 -434 -65 -366 -269 -126 -170 -395 -156 -4 -433
$$ packed form
597D63j093J44N02K00j026L90N71j48q84N11R97j387Q6R26k9j402Q48J068j479
616g42m9J282k94j255J284M9p70L86J26J67m27J73J15L22o02K08N28n22R8J10
636A87L02o59N07qk79K53p6P8J0Q3m29P12n47j77O08l70k7qK98m80J59k8Q4o7
660A26k13L58m39K78j80J40j80k8J81l36L08j75P2k86M34m56J16L43n57L41K5
681a28j43k24M78k82m9K79k42K37l42M13l17Q6J33K4j9j76M72l84N2J3L79m57
703a97J1O00n78K27K6J37k37L04j45o5K30k55L41l77M07k86J35Kj29J73j51J77
725C50k71K77k61J33j08K0J94m73M38j95j7j12K41j99q1K06l41L68l99J91r5k
747a36K0j14J10k09K49k38K48k94K63p4j86K77l50L69l01R7J43m4k25K39J52m29
$$ plain form
769 -433 -17 -131 -65 -173 -34 -5 -156 118 -11 109 -164 260 117 46 22 141 309 -155 371 214 103 166
791 166 355 208 162 375 80 407 46 288 284 118 222 258 304 -46 381 73 162 12 221 140 -144 190 -30
814 -30 131 -189 -16 80 -77 -186 -108 -16 -414 102 -247 -201 -107 -260 -103 -151 -193 -357 52 -388 -238 -112 -219
837 -219 -247 -272 39 -391 -108 -214 -78 -141 -299 -149 38 -65 -395 384 -140 -225 141 154 -41 -75 216 64
859 64 181 -49 294 147 -86 271 233 114 -44 461 98 93 334 144 241 185 199 52 507 -189 158 530 -145
882 -145 64 310 86 -191 388 -121 41 156 -193 40 28 -75 -360 355 -175 -409 148 -24 -439 -203 168
903 168 -462 -182 -201 -42 -201 -482 39 -101 -306 -439 159 -242 -279 -60 -52 -93 -470 117 42 -267 -281 368 -117
926 -117 -559 426 139 -349 15 532 -315 60 432 -89 275 92 -26 322 340 -419 494 482 -452 407 495
$$ packed form
769d33M16j14O6j08J39K9j51K74j29J20k73M24j43p1k4J19J68m64N26j57j11O3
791A66J89j47m6K13k95L27l61K42mj66J04L6M6l50M27l08Q9j50K09q1k84L34k20
814c0J61l20J73R6j57j09P8R2l98N16l49M6R4j53J57m8m2j64M09m40J50J26j07
837b19k8k5L11m30K83j06J36o3j58J50J87j03l30P79n24q5L66J3j95l4K91j52
859F4J17k30L43j47k33L57l8j19j58N05l63nK41j90R7n6J4j47M55o96L47L72o75
882a45K09K46k24k77N79n09J62J15l49K33j2j03k85P15n30k34N57j72m15K36L71
903A68o30K80j9J59j59k81N21j40k05j33N98m01l7K19Qm1l77N87p5l09j4O49m85
926a17m42R85k87m88L64N17q47L75L72n21L64j83j18L48J8p59R13j2r34Q59Q8
$$ plain form
947 495 -87 33 661 -112 -11 586 -104 122 366 9 -103 571 -159 -83 527 -167 -72 180 125 -276 141
968 141 -80 -34 -39 -218 145 -181 -139 -182 3 -123 -261 -196 -113 -53 -500 54 -27 -414 -332 246 -302 -690 493
991 493 -227 -584 111 103 -501 70 -24 -373 286 -251 -167 324 -93 -378 531 163 -525 529 215 -258 222
1012 222 502 -250 200 534 -268 272 207 23 161 376 -181 322 388 -231 445 206 28 129 250 -9 185
1033 185 201 -74 302 -93 61 2 28 -43 37 -62 -203 278 -308 -60 114 -215 -271 215 -276 -469 291 -318
1055 -318 -277 41 -232 -284 40 -294 -286 180 -488 -157 112 -288 -278 136 -170 -429 313 -251 -188 206 -105 -216
1077 -216 229 -41 -251 462 -200 -27 367 -50 -54 402 54 -102 493 -49 87 235 68 98 269 111 -7
1098 -7 441 -46 195 276 30 71 320 -13 -2 513 -165 57 240 -70 35 195 -105 -114 238 -343 76 79 -240
$$ packed form
947D95n82J20O28p73J01N97o90K26K44l57j12O74p30P6O10o94R5K52n5m01M17
968A41k21M6nj79L63l26M2m3J85j26j38O5Q3O0m47N54q1l87Q2N78n48l88J183
991D93p20l57O95qo04N71r4l49O59n37Q4M91m17k85R09l68o88J054l14m73M80
1012B22K80p52M50L34q02N40o5j84J38K15n57N03O6o19O76k39j78J01J21k59J94
1033A85J6k75L76l95J54n9K6p1Q0r9j41M81n86K48J74l29n6M86m91j93P60o09
1055c18M1L18k73n2L24l34QM66o68L31K69m00J0M14l06k59P42n64O3L94l11j11
1077b16M45k70k10P13o62J73L94m17mM56l48j56N95n42J36J48j67L0J71j58j18
1098gM48m87K41Q1k46M1K49l33J1N15o78K22J83l10J05J60l00rL52n81M19Ll19
$$ plain form
1121 -240 -27 16 -196 -156 216 -383 -61 42 -290 -164 -44 -259 -253 119 -444 -43 12 -416 -100 -30 -243 -174
1143 -174 197 -398 19 71 -300 48 12 -166 -64 214 -290 102 135 -146 107 160 -58 -23 361 -131 185 294
1165 294 -128 274 241 -15 218 390 -157 274 239 -16 281 165 78 128 259 -119 264 117 -89 194 40
1186 40 -34 55 202 -317 105 98 -186 104 -39 -185 -35 91 -316 137 -60 -335 66 -132 -180 -103 -34 -335 -2
1209 -2 -191 -335 34 -188 -175 -91 -40 -346 31 -91 -315 129 -41 -184 -35 78 -277 166 -25 -151 224 -47
1231 -47 -22 101 139 -135 205 54 -47 310 46 130 138 244 15 288 180 1 259 62 132 188 223 -43 248
1254 248 117 -35 282 -67 79 78 107 -25 135 -51 -108 129 -161 62 -46 -8 -130 52 -111 -147 122 -221
1276 -221 -133 -71 -84 -215 36 -205 -275 78 -271 -132 -99 -108 -224 -25 -133 -214 -52 -248 -31 -94 -49 -137 -7 -37
$$ packed form
1121b40K13M3k12M0L72n99L22J03l32J26J20k15OL72n63M01N5m28L16P0k13O9
1143a74L71n95M17N2l71L48l6j78J02K78n04L92L3k81K53N3k18L5L84m92L16J09
1165B94m22M02l3k56K33J72n47M31l5k55K97j16q7N0J31l78L83j47k06K83j54
1186D0p4Q9J47n19M22pk84K90j43j46J50J26m07M53j97k75M01j98m8P7O9l01L33
1209bj89j44L69k22J3Q4N1l06L77j22k24M44j70j43J49J13l55M43j91j26L75k71
1231d7K5J23L8k74L40j51j01L57k64Q4QJ06k29K73j08j79K58j97P0N6L5k66K91
1254B48j31j52L17l49J46jK9j32J60j86n7K37k90K23j08L8j22J82j63l6K69l43
1276b21Q8O2j3j31K51k41p0L53l49J39L3rj16J99j08q1J62j96K17o3M5q8J30l0
$$ plain form
1300 -37 -118 91 -75 12 0 50 -115 84 134 5 169 -63 238 18 95 120 171 38 91 234 -32 224 127 187
1324 187 58 212 142 89 311 -7 128 79 114 -16 168 47 -94 218 -64 35 -3 67 -98 17 -36 -127 44
1347 44 -131 -27 -155 -12 -221 -122 -20 -215 -85 -156 -107 -268 -44 -204 -222 -65 -158 -87 -189 47 -159 -84 -86
1370 -86 -85 13 -39 -72 -157 143 -105 -38 42 -44 4 -5 52 -98 92 89 13 69 183 131 27 214 -23 136 179 87 87 192
1398 192 105 7 373 15 95 144 159 22 111 186 -130 176 98 32 8 171 -103 -7 84 -160 27 -45 -23 -106 58
1423 58 -183 -246 21 -182 -148 -129 -52 -196 -75 -76 -219 -44 -184 -198 -176 13 -295 -116 -87 -182 -86 -127 25 -169
1447 -169 46 -37 -105 -39 -34 -36 -99 139 -71 84 31 -56 135 102 70 -56 221 32 133 96 121 74 131 202 -36 282
1473 282 47 44 165 112 64 105 160 4 224 10 112 106 94 14 -36 182 -78 3 31 29 -32 68 -48 -159 90
$$ packed form
1300c7q1K09j66Q7j2N0j65J99N0j29J64k32L01k20P7K5N1j33N3J43k66K56r7O0
1324A87j29J54p0n3K22l18J35m9L5j30J84j21j41L12k82R9l8P0j65J15n3r1J71
1347D4j75J04j28J43k09R9J02j95J30p1M9j61K24j60j8J57r3P1j02K36k06P5k
1370h6JR8n2l3q5L00k48O7Q0q6M8rN7j50J90lp6N6J14n2j04J87k37J59M3r2%J05
1398A92q7r8L66l58Q0M9J5j37Q9P5l16L06p8o6k4J63k74R6R1k44J87p2K2q3J64
1423E8k41o3K67k03L4J9P7j44J21jj43J75j40j4K2J89l08J79K9r5R6m1J52j94
1447a69K15q3o8O6Nko3K38k10J55n3q7J91l3l2j26K77j89J01l7K5m7N7P1k38L18
1473B82k35lJ21n3m8M1N5j56K20k14J02oj2q0n0K18k60Q1K8ko1J00j16j11K49
$$ plain form
1498 90 -140 -36 -80 -79 -173 -137 -129 -167 -57 -181 -16 -215 -78 -162 -155 -50 -171 -113 -184 -69 -178 -26 -66 -149 -43
1523 -43 -116 -55 -93 80 -136 43 25 -30 -33 42 40 -20 146 -43 102 174 70 74 146 188 -3 195 95 129 140 83 103
1550 103 79 172 10 192 33 84 110 47 77 53 78 -11 92 -88 118 28 -32 12 -84 29 -122 39 -74 -12 -71
1575 -71 -150 -77 -76 -46 -192 -16 -149 -70 -107 -218 -114 -134 -82 -182 -34 -193 -66 -74 -130 -71 -102 -84 -189 58 -137
1600 -137 -61 69 -66 46 1 133 -120 87 0 64 114 16 72 62 131 1 208 39 118 156 140 112 57 194 86
1625 86 176 63 162 78 41 153 70 126 -15 90 6 69 87 -55 42 -20 -4 -91 69 -92 5 2 -88 20 -79 -14 -125
1652 -125 -9 -129 -149 -41 -200 -83 -101 -52 -187 -77 -191 -132 23 -143 -145 -122 -64 -199 -44 -97 -36 -45 -89 34
1676 34 -74 11 -28 -15 -7 43 -10 2 120 19 138 79 149 31 88 125 31 153 62 115 37 184 21 102 153 68 132
$$ packed form
1498I0k30J04m4Jr4L6Ql8J10j24J65j99J37q4PJ05j21N8p1J15j09J52m0q3J06
1523d3p3O1l8J73k16J79j8n5lP5ko0J66j89J45P2j04MP2M2j91J98j00L4J1n7K0
1550A03k4R3j62J82j59N1K6o3L0k4K5q9J03j80K06r0o0M4r6J13j51J61j13O2n9
1575g1p9P3JL0j46J76j33P9l7j11J04k0N2j00J48j59J27qn6N9l1J8j05K47j95
1600a37P6J30j35J12m5J32k53K07q7O4N0r8N6j0O9j30K07j69P9L8j6k8n5J37j08
1625H6R0j13R9q4l7J12q3N6j41J05q4O3J8j42R7o2J6q7J60j61R7lr0J08r9O5j11
1652a25J16j20k0J08j59J17j8M9j35J10j14N9J55j66kK3N8j35J55n3O1rm4J23
1676C4j08Q5l9J3QN0n3J2J18j01J19n9P0j18N7L7r4J22r1N3p8J47j63Q1N1q5O4
$$ plain form
1703 132 20 168 58 162 28 63 114 -10 70 -8 119 -82 97 -22 -80 53 -20 -52 -58 73 -82 2 -98
1726 -98 -73 -54 -134 -32 -158 -64 -106 -109 -56 -76 -74 -215 -36 -167 6 -115 -70 -140 -138 -60 -130 -35 -106 -46 -106 57 -94
1753 -94 -5 56 -118 83 12 41 -29 116 35 59 136 12 177 69 159 12 120 46 80 155 55 97 75 157 26
1778 26 167 110 -47 127 29 95 14 76 11 62 70 5 37 -27 60 -113 53 -54 -25 14 -61 36 -108 10 -116 -82
1804 -82 -53 -89 -187 -95 -11 -277 -17 -164 -134 -65 -47 -163 -69 -58 -187 -39 -107 -66 -59 -8 -94 -126 70 -98 -18 -17 30
1831 30 -61 101 43 -50 129 -24 75 53 77 -3 72 135 70 108 83 154 -21 216 76 86 113 51 138 48 159 32
1857 32 160 18 26 26 50 55 -58 50 -76 0 4 -36 -64 5 -3 -112 20 -115 -65 -30 -48 -59 -112 -25 -204 -82 -41 -90
1885 -90 -101 -15 -103 -166 -16 -163 2 -22 -36 -83 8 -45 -110 97 -86 22 -37 13 -29 -2 68 -42 71 65 24 5 131
$$ packed form
1703A32j12J48j10J04j34L5N1j24Q0p8J27k01J79j19n8J33p3l2oJ31j55Q4j00
1726i8K5J9q0J02j26R4m2lN3k0Kj41J79j31J73j21M5p0KP8p0R5p1O0o0J63j51
1753i4Q9O1j74K01p1K9p0J45q1K4P7j24J65j08R0j47J08p4L4P5j00M2k2Q2j31
1778B6J41n7j57J74r8O6q1O2o5N1Qo5L2o4Q7j73J66j07K9L9p5R7j44J18j26L4
1804h2K9l6r8R2Q4k66K60j47L0O9J8j16R4J1j29J48o8M1PN1q6l2J96j68Q0JM7
1831C0r1J62n8r3J79j53R9k2K4q0P5O3o5L8k5P1j75K37j40J0K7o2Q7r0J11j27
1857C2J28j42Q%K4Nj13J08j26P6Mm0k8O9qj09J32j35N0L5j8j1n3Q7j79J22M1m9
1885i0j1Q6q8o3J50j47J65k4j4m7R1n3o5K07j83J08n9N0m2K7P0j10J13om1j9J26
$$ plain form
1912 131 43 69 86 -1 137 -13 90 22 136 93 99 124 48 155 -12 180 23 58 115 94 81 -5 118 -10 154
1937 154 48 -4 52 -10 9 -29 128 -132 63 2 -82 -44 32 -110 -76 41 -151 -43 -108 -110 -68 -81 -73 -119 25 -155
1963 -155 -109 -108 -66 -85 -74 -52 -102 16 -88 -11 -74 -37 -49 4 -35 -46 24 -44 119 -51 -8 31 22 38 73 92 -70 112
1991 112 34 65 130 105 73 90 164 -38 175 92 12 158 137 70 68 160 -40 160 87 57 78 40 -23 -7 101 -68 87
2018 87 -22 -36 -24 8 7 -75 70 -188 5 -85 -86 -3 -72 -85 -87 -45 -188 48 -131 -78 -54 -132 -71 -67 -59 -188 -1 -74
2046 -74 -58 27 3 -40 -5 43 -84 133 -45 -41 49 -20 -32 39 67 -73 146 27 -35 118 44 75 96 121 30 190 3
2073 3 33 124 43 60 83 108 0 103 5 52 99 52 81 21 78 -57 115 -31 -18 134 -51 38 -3 -23 -74 100 -127
2100 -127 -62 20 -146 -29 -45 -35 -85 4 -129 -106 5 -170 -39 -68 -114 -121 -22 -81 -105 1 -192 0 -54 -43 -64 82
$$ packed form
1912A31q8K6J7q7J38j50J03o8J14m3OK5p6J07j67J92j57L5N7k1j3q6J23j28J64
1937A54j06n2N6o2J9l8J57k60J95o1q4L8P6j42L4J17j92J08o5kM2j3Qm6J44j80
1963a55M6JM2j9J1K2n0J18j04P7o3L7j2N3l9j1P0o8J63j70M3L9rJ6L5J9j62J82
1991A12p8L1O5k5l2J7P4k02K13q3q0J46k1o7kR2k00K00p3l0K1l8o3J6J08j69J55
2018H7j09j4J2L2jq2J45k58J93r0jQ3o9j3kM2j43K36j79N3K4p8O1MQj29J87p3
2046g4J6Q5k4m3L5M8j27K17j78MR0o9j2P1K8j40K19j19o2J53p4L1K1K5r1J60j87
2073CL0R1q1J7K3K5j08J03r8M7M7m7K9o0N7j35J72j46J3J52j85Q9m1k0n1J74k27
2100a27O5Q2j66J17j6J0n0Q9j33K3J11j75J31k9m6pR9n9k4J06j93J92n4J1k1J46
$$ plain form
2126 82 -65 -83 19 -64 44 0 15 -18 47 38 30 92 -1 108 45 91 31 108 26 61 123 -6 136 80 35 40 151 -8
2154 -8 77 108 -19 114 17 -8 43 34 26 -51 99 -127 87 2 40 0 16 -78 6 -10 -121 44 -63 -62 -84 -27 -128 -42
2182 -42 -59 -129 45 -130 -98 -11 -25 -89 -102 -63 -121 12 -142 -30 -32 -72 -101 -26 -13 -93 39 -31 12 41 49 -25 8 85
2210 85 -38 147 17 74 80 45 68 115 112 -68 162 23 42 93 85 26 66 115 -25 133 42 49 51 61 37 28 44 -32 67
2239 67 -66 28 -16 -39 -12 -35 -12 -89 21 -105 17 -66 -77 -8 -103 -9 -74 -12 -112 -26 -41 -100 -54 -28 -69 -115 5
2266 5 -161 -35 -74 -93 -26 6 -96 -118 49 -103 2 -21 -91 34 17 56 -81 132 -41 11 83 19 70 28 85 -4
2292 -4 134 45 86 115 93 94 70 72 15 74 19 120 28 72 144 0 72 -23 32 9 109 18 -19 82 -22 18 -14 -17 -67
2321 -67 5 -26 -123 2 -51 -14 -62 -23 -143 -21 -64 -71 45 -102 -70 -97 -5 -92 -88 -49 -107 -46 -110 5 -120 -16 -68
$$ packed form
2126H2j47j8J02q3J08m4J5l3O5rqO2r3J09o3M6o0P7q2L5O2j29J42n6m5NJ11j59
2154hQ5L1j27J33r7k5N1rqp7J50k26K14q5L8m0J6r4Q4j6j11J65j07Jk2N7j01Q6
2182d2j7p0J74j75L2Q7j4o4j3L9n8J33j54J12km0k9P5J3q0J32p0M3K9Qp4L3P7
2210H5j23J85j30N7Ol5K3M7lj80K30j39J9N1qn9M0M9j40J58r1PKJ0k4rJ6p6R9
2239F7j33R4m4k3K7k3K3p7J10j26J22q3j1O9r5R4o5O2j00Q6j5n9M6K6m1m6J20
2266Ej66J26l9j9O7L2j02k2J67j52J05k3p0J25j7L9j37K13j73N2P2o4N1m2N7q9
2292dJ38q9M1K9k2Jk4Kn7N9n5J01r2M4P2j44P2r5N5k3J00r1l7J01j04M0l2ln0
2321f7P2l1r7J25n3L7m8L9j20J22m3pJ16j47L2k7R2q7ML9n8O1o4J15j25J04n2
$$ plain form
2348 -68 -25 -9 -68 -15 -91 3 -21 20 -31 -8 -4 -20 63 -32 90 4 60 -5 111 12 62 105 45 125 33 122 61 45 26 -26
2378 -26 97 15 110 32 81 6 107 75 -70 57 -37 58 -61 43 -14 -13 -20 -39 -23 -47 -6 -39 -6 -93 -64 -23 -130 -56
2406 -56 -126 -73 -75 -17 -122 -86 -68 -73 -3 -125 -26 -101 -24 -44 -80 -59 -53 24 -50 17 -26 48 -74 6 15 -25 35 -28 70 -13 45
2437 45 -66 16 46 28 26 44 130 55 17 117 104 64 12 40 54 128 -27 74 64 54 64 26 79 -4 67 0 30 -33 40
2466 40 54 6 4 -31 22 -20 -19 -93 -36 -21 -67 7 -95 -33 -100 -12 -116 -90 -43 -73 -32 -134 -28 -112 -36 -83 -89 37 -82
2495 -82 -2 -60 -41 -74 -30 -18 -46 13 -55 27 8 30 -84 110 31 -46 105 2 33 1 60 7 34 -17 52 130 -23 56
2523 56 37 177 26 89 67 81 52 46 59 27 75 -26 67 39 14 34 -1 60 -11 33 -14 24 -48 -88 27 -87 71 -71
2551 -71 -38 -66 -40 -79 -73 -38 -68 -17 -36 -97 -98 -67 -94 -116 -10 -103 -33 -66 -46 -62 -28 -83 -94 -6 -93 43 -32 8 -88 29
$$ packed form
2348f8M3J6n9N3p6R4k4M1n1K3Mj6Q3r5J22q6N6o5J16r9N0M3o0Q0r2Q9o1j6j9n2
2378b6J23q2R5p8M9p5J01l2j45J27r4R5j19J04n7Jpj9J6k4M1l3L3q7K9M1j07P4
2406e6p0N3kN8j05L6J8nP0j22R9p5P7k0l6K1OP7p4O7m3P4j22Q0Rm0O0o3R8q3N8
2437D5j11Q2L0j8kJ8Q6p5l8J00j3m0n2K8J4P4j55J01j0j0J0l8N3q3P1o7L0o3P3
2466D0J4m8kl5N3m2Jp4N7J5m6P4j02O2o7Q8j04K6M7l0M1j02J06q4P6m7oJ26j19
2495h2Q0n8J9l3M4J2k8N9o8Q2j9K2j14J94p9p7J51j03L1l2N9n3K7n1O9P8j53P9
2523E6j9J40j51O3k2J4k9oJ3l2M8j01R3k8k5K0l5O1p1M4m7L8p2m0J15j14J58j42
2551g1L3k8K6l9OL5l0N1j9o1jL1k7k2J06r3P0l3K0j6L4n5j1Q8q7J36p5M0r6J17
$$ plain form
2581 29 -19 -58 79 -89 32 -1 62 -14 80 36 -28 99 -19 63 6 48 16 92 17 -25 92 2 144 -21 66 48
2607 48 30 25 27 53 -65 99 3 31 75 6 -7 -75 -29 -81 47 -30 -12 -43 -20 -60 -82 -37 -97 -16 -83 -76 -95 -62 -54 -108 -1
2638 -1 -115 -8 -106 -53 -123 -67 -60 -45 -1 -103 -49 -70 -17 -88 -35 14 -1 17 -1 27 4 50 13 -22 30 5 50 29 141
2667 141 -32 73 79 34 35 40 61 9 75 5 60 39 19 27 45 94 -85 67 29 69 46 -24 27 -76 9 -78 104 10 -53
2696 -53 33 -1 -32 -66 31 -60 19 -46 -83 -26 -10 -51 -110 -10 -118 -8 -52 -30 -39 -62 3 -40 -11 -100 -47 -22 -9 -21 -31
2725 -31 20 -40 -21 1 43 -7 -32 -4 1 33 36 4 -9 81 57 79 46 11 93 93 6 -33 67 22 8 26 55 77 40 154 -16
2756 -16 109 18 14 55 -27 -25 -14 68 -62 46 43 -29 -9 -45 -38 -78 -40 -67 -14 -60 -33 13 -60 -52 -74 36 -100 -45 -72 -97
2786 -97 -59 -96 -4 -110 -28 -87 -10 -55 19 -53 -93 16 -78 -14 -24 -16 -3 -33 1 -60 0 -44 26 15 67 -7 3 79 -5 19
$$ packed form
2581B9m8l9J37j68J21l3O3p6R4m4o4J27j18Q2n7M2l2P6p5m2J17r0J42j65Q7j8
2607D8j8nKK6j18J64r6K8M4o9j3o8M6n2J28p7J8l1K3m0k2M5o0Q1o7Pj9L3Qn4J07
2638aj14J07r8N3p0N6PJ5M4j02N4k1N3p1N3M9j5J8j8K8k3M6l7l5N2k5M5k1J12
2667A41j73J05Om5JNK1n2O6p0N5k1k0QJ8M9j79J52l8M0k3p0N1j03Q5q7J82r4o3
2696e3Q6l4l1l4R7r1P9o5l7N7J6m1n9J00j08J10m4K2rk3O5m3K9q9N3K5J3j2j0
2725c1N1o0J9K2M2n0k5K8NL2Ll2j3R0k4K2l3l5Q2%q7l9J00m5j4J8K9K2l7J14j70
2756a6J25r1mM1q2KJ1Q2j30J08lp2K0l6Pm0L8k7N3m6K7M6p3Qk2J10j36N5k7k5
2786i7L8l7R2j06Q2n9P7m5P4p2m0J09r4O4j0QJ3l0L4o1O0m4P0j1N2p4J0P6q4K4
$$ plain form
2816 19 47 98 -3 84 34 61 47 69 36 52 135 -1 99 54 36 84 35 37 -20 37 -13 49 -10 26 10 -43 14 -7 38
2845 38 -71 -15 -35 -44 5 -5 4 -27 6 -50 -51 -25 -44 -20 -66 0 -79 -12 -53 -24 -37 -80 -53 -35 11 -51 -26 -77 -19 -17 8 -13
2877 -13 -52 20 -64 -1 -22 -4 -18 -16 24 -2 50 38 72 1 48 49 37 65 14 126 41 67 51 58 46 13 60 29 31 22 10 19 12
2910 12 41 43 -18 -29 33 -14 22 -76 27 48 -22 -27 -53 -25 -62 23 -82 -17 -35 -54 -55 -52 -49 -64 -23 -97 -51 -32 -88 -2 -119
2941 -119 1 -48 1 -81 -1 -11 -97 0 -53 30 -88 -57 -45 -24 12 12 38 -49 31 -54 47 59 83 52 23 32 20 81 69
2970 69 80 17 68 90 -8 66 29 82 14 53 -18 25 99 -9 85 13 22 -36 92 -53 5 28 -27 50 -26 16 0 2 8 -43
3000 -43 -11 -8 51 -55 -15 -72 -22 -48 -84 -71 -71 -27 -25 -37 -37 -22 -54 -11 34 -87 -32 -57 -21 -35 -27 -33 61 15 -39 59 5 38
3032 38 -44 -1 20 72 14 32 112 -35 1 61 61 21 93 32 -68 79 30 42 -19 58 20 -28 69 20 77 16 47 3 12 39
$$ packed form
2816A9K8N1j01Q7n0K7j4K2l3J6Q3j36J00m5j8M8m9Kn7N7n0O2n9L6j6n3N7k1M5
2845C8j09N6k0rM9j0Rl1L3n6jK6j9K4m6O6p9O7m1K9j3m3K7J8M6o2K5n1N8KK5k1
2877a3l9P2q4O3k1J8j4KM0k6N2j2L4p1M7Jj2K8n1J12q5K6j6Pj2l3M7l1Krj2Rp
2910A2K9Ko1j1O2m7L6r8J03K1p0nk6K8l7Q5j05O5j8j9jLLj5M1p4M6J9n6Q6j17
2941a19J20m9M9q2Q0j0q6R7n3Q3j18L1J2K1L6%K6q7Q0q5J01J2K4l1k9Rj2O1j2
2970F9J1o3N1K2r8P4l7N3o8L9p1M3P4j08R4p2Rn8J28j45N8K3n5P7p6M2j6KOn1
3000d3L2LN9j06M0n7N0k6l6J3%M4Kj2%J5l2M3M5j21N5k5L6j4QoR4m6n4R8n4L3
3032C8q2M3K1N2n8J8Q0j47L6O0%m0P2o1j00J47m9J2o1P7l8m8R7m9N7o1L1m4RK7
$$ plain form
3062 39 73 27 -16 61 -9 17 -6 -12 12 -39 7 -53 7 -93 11 3 -40 -33 -25 -22 -144 -15 -63 -89 7 -46 -68 -59 -36 -58 23
3093 23 -51 -10 -23 -24 -13 26 -42 -20 58 -54 25 30 -12 33 24 20 -18 31 -59 109 40 35 19 78 114 -8 88 -37 46 88 44
3124 44 40 60 39 19 81 18 30 82 49 43 82 37 -13 43 -92 35 28 -21 12 -21 12 -27 71 -43 18 -30 -71 -8 -13 -66 -79
3155 -79 22 -90 36 -63 -87 23 -35 0 -65 18 -63 -4 -10 -88 -20 -100 -45 -120 11 -61 -20 -10 -60 -36 20 42 26 70
3183 70 -4 42 -54 -29 -8 15 59 14 67 25 94 72 86 40 54 44 -39 45 -21 42 -4 15 39 40 46 23 35 46 59 23 8
3214 8 75 61 4 22 46 -68 15 -12 -68 -19 -14 -14 -44 68 -52 16 17 -122 -14 -5 -32 -71 -60 -97 -93 -42 -51 -57 -91 -75 -99 -42
3246 -42 -58 -15 -50 -40 -54 -40 23 -2 26 -15 0 2 -20 65 -21 48 7 35 8 91 8 -4 59 -3 83 16 54 47 35 30 46 93
3278 93 12 10 34 25 -16 80 -15 -19 53 -59 26 41 5 -13 -12 17 -14 16 -22 -22 -69 19 -77 -31 -25 6 42 -56 35 -102 24 -105
$$ packed form
3062C9L4m6m3P7p0K6k3oK4n1M6o0O0j00J04qm3PQLj22J29m8k6R6n3k2RK3k2Q1
3093B3p4M1j3jJ1L9o8K2P8j12P9Nm2M5rml8M9r0J68o9nj6N9L6j22R6j25Q3M2m4
3124D4mK0k1k0O2o3J2N2l3oL9m5n0N6j35J27pm9L3l3L3l9R8j14O1m8m1O3nn3j3
3155g9J01j12J26r9k4J10n8L5o5Q3q1N9op8O8q0N5p5J31p2M1J0n0K4N6K2j6M4
3183G0p4M6r6K5K1K3M4m5N3m2O9k2J4m6J4j0q3Q4o6O3m6J9K4JOk3J2J1J3l6j5
3214HO7j4n7J8K4j14Q3k7n6M9N%l0J12j20O8Jj39J08Rk7l9J1l7MN1rol4J6k4N7
3246d2j6M3l5J0j4J4O3k5K8m1J5Kk2Q5q6O9m1K8k7Q3q3j2O3o2Q6o7L8pj2nJ6M7
3278I3q1kK4rm1R6r5mP2j12Q5J5l6j8JK9l1L0l8%m7Q8r6M6OL1L6r8R1j37J26j29
$$ plain form
3310 -105 -27 -20 -3 -13 -107 4 -123 -68 -20 -4 -11 -57 21 -54 -11 -48 59 -4 -52 22 -16 69 -14 63 -40 17 17 49 3
3339 3 0 72 33 95 73 23 96 12 97 67 102 32 48 12 -9 34 126 19 7 42 11 32 -33 8 -25 -6 41 -22 46 -35 -13
3370 -13 -66 -35 -21 -6 8 -19 -18 -94 -12 -64 -1 -30 -32 -6 -73 -45 -50 -24 26 -54 -6 -8 -15 -62 14 -67 11 -59 -76 -10 -34 -2 -25
3403 -25 -6 -80 -2 -14 7 22 -19 -16 20 30 -14 63 58 72 45 63 57 47 72 10 70 35 13 49 57 67 75 106 33 65 24 10 17
3436 17 38 32 41 48 -4 -14 -27 -9 -10 -6 19 -67 20 -24 -46 -45 6 -107 -33 27 -91 -24 -59 -4 -51 -37 -99 -47 -16 -47 -8 4
3468 4 -9 -16 -4 -2 -79 -9 25 -13 -72 16 11 -29 -44 4 -43 -14 76 -1 51 20 46 4 17 26 10 114 18 93 17 20 36 40 54
3501 54 20 17 -29 43 63 45 38 20 76 -40 62 31 32 -10 4 35 -38 4 0 34 -8 -90 -65 -13 -24 -54 7 -41 -22 -29 -59 -58
3533 -58 -11 -16 -51 -66 -79 -4 -35 -15 -3 -3 -43 -5 -24 -79 12 -68 26 11 -18 -36 12 -3 -22 4 -39 22 33 -31 -8 -16 44 -11
$$ packed form
3310a05P8PJ7j0r4J11j27N5M8J6pm6P8p5M3l7J07o3m8P4l8Q5q3P7j03N7%L2m6
3339ClP2l9O2k2n0P3q4Q5l0L5p0J6l6k1M3R2j07j2L5l1K1o5M1l3J9M7o3O8q1K2
3370a3n3L1J4J5J4k7Jp6Q2n2O3k9kK6o7K8nK6N0q0M8kpm7P6q1P8p0j7O6k4L2k3
3403b5J9p4P8j2K1J5m1LL6J0m4P7nJ4k7J8oj0K5o2O0l5k2L6QJ0QL1p3L2m1j4P
3436A7K1oRPn2j0j3J8jMK5q6Q7m4k2JN1j13P4O0j18O7l5N5m7J4o2N2L1l1L9J2
3468Dj3pJ2Kp7P0L4l8n9Q8nm0j5M8m7K9R0p7N2l1K6m2J3Rj6J04r6P5p6LJ6MJ4
3501E4l4lm6P2K0j8pj8N6j16J02l1Jm2J4L1p3M2mL4m2q2K5N2j1l0O1m8J9pl0J
3533e8M7nl5j5j3P5l1K0J2%m0L8j9n5R1q0R4j5k9j8M8j5j9K6m3O1J1o4K3qO0n5
$$ plain form
3565 -11 21 34 6 56 11 45 3 49 -18 98 72 40 13 58 85 38 59 -24 70 -21 -10 -7 -7 49 36 39 -41 20 -2 45 -31
3596 -31 24 -9 5 4 -43 -31 -17 -19 18 -27 -14 -59 -62 -73 -34 -90 -14 17 -9 -30 -59 11 -55 -8 -51 24 -8 -33 5 -5 1 -66
3628 -66 28 -36 26 24 -14 24 59 89 39 101 50 2 -15 6 12 -13 26 8 42 24 15 7 23 24 8 84 28 36 13 79 35 22 78
3661 78 2 0 23 39 -31 9 21 -44 46 2 2 -17 -12 36 24 -45 -52 -35 -69 -49 -26 -16 -38 -55 -48 6 -33 -31 -16 -14 -26 -54 -93 -19
3695 -19 -54 -25 -68 -18 -51 -8 -42 -20 -5 -49 40 -15 30 -48 18 -43 14 29 59 4 19 32 43 8 7 -2 60 39 40 23 46 36
3727 36 1 -60 43 29 -16 63 -27 61 -16 36 -5 -26 39 11 -1 15 -11 -8 56 25 -8 10 -14 41 -32 -21 -79 11 -51 -36
3757 -36 -81 -63 -17 -59 -24 -50 -56 -29 -48 -36 -37 -4 -13 0 -48 29 -53 9 47 -73 28 24 41 -17 0 -8 8 11 -52 84 -20
3788 -20 71 19 13 10 20 50 -1 79 -11 22 16 17 64 53 64 26 90 15 3 10 43 38 28 25 -20 -23 -1 14 -18 19 40 -15 19 -42
$$ packed form
3565a1L2J3k8N0m5L4m2M6o7J16k6l2k7M5K7m7K1q3R4r1J1L%N6j3Lq0O1k2M7p6
3596c1N5l3J4jm7J2J4kL7m5J3m5lj1L9n6P6L1k6k1k9P0o6M7m3P5l2k5L8j0Oo7
3628f6R4o4O2kl8L8L5L0n0O2n1m8j7K1Ok5L9j8L4j8rqJ6Jj6P6n6Qk3O6m4j3N6
3661G8p6kK3J6p0M0J2o5R0m4%j9NM8j2o9pJ7l4K0K3J0k2j7PN4l9KJ5Kj2k8l9P4
3695a9l5K9m3N0l3M3l4K2J5m4Q9n5M5p8O6o1N7J5L0n5J5J3J1l5jrO2k1Jj7K3j0
3727C6l5o1J03j4m5P9r0Q8p7N2m1k1O5k8j2J6k6LO4l1l3J8k4N5p3J1n8R0o2J5
3757c6m5J8M6m2L5k6oK7j9J2jL3rJ3m8P7q2O2L8j20J01mJ7n8J7qJ6Lo3J36j04
3788b0R1n2olJ0L0n1Q0r0L3oJM7j1J1l8O4p5j2PL3nj0lm5lK2J5l2L7K1n5L4o1
$$ plain form
3822 -42 28 -58 -12 -6 1 -10 -68 24 -41 -7 -60 -4 -52 -97 -30 -75 -43 -63 7 -67 -18 -92 1 -29 -46 -69 -17 -54 -62 -24 -87 -22
3854 -22 5 -24 -6 -19 -29 -14 -26 -21 -1 -34 -6 47 7 13 43 41 25 81 22 90 37 8 111 24 54 40 18 42 44 20 -21 -8
3886 -8 -14 51 -27 -7 18 -26 -18 -33 25 -21 -35 -9 11 -14 -18 6 -1 -26 -52 -14 -15 -36 5 -33 -33 -67 2 -6 -9 -5 -36 33 -57 -63 -41 -23
3922 -23 -36 3 -27 -43 26 -32 -49 -9 -27 15 40 35 23 78 22 30 -7 -18 0 56 15 24 11 -4 5 59 68 24 26 56 8 55 -6
3955 -6 66 44 64 26 68 36 16 60 -1 23 -50 -6 -26 -10 41 36 7 9 -26 -6 -53 -26 4 -16 -21 -40 -43 32 -14 16 -34 -25 -77
3988 -77 -24 -29 -25 3 -27 35 -14 -35 -49 -26 -24 -77 16 -37 -21 50 -29 -40 26 -22 -11 -4 -32 -4 -49 -21 22 -11 28 1 24 -16
4020 -16 57 20 54 30 93 39 10 49 -12 60 22 56 28 15 55 59 49 28 106 -22 -24 -12 -43 27 -34 16 6 38 -15 -29 -75
4051 -75 -21 -27 -32 -62 -83 -19 -12 -45 -66 -58 -53 -62 -38 -46 -48 -45 -18 23 -40 24 -66 -43 -18 8 -9 -11 -4 -35 44 -30 35 -15 -14 -32 0 1 -9
$$ packed form
3822d2P0q6M6OPj1n8R2o5L4n3N6m8m5O7m5L2k0P0p4M9p4R3l0j7k3N2l7qL8o3O5
3854b2K7k9J8j3j0J5j2NK0l3K8N3m0OL0kj6N6n9O8n3k9J03q7L0j4k2K4Kk4m1J3
3886hoO5p8K0K5m4Qj5N8m6j4K6K0k5mK4pk5k6L8jk1M1l8%l4O9qlMl1O9r0oK2J8
3922b3j3L9l0j6O9n8j7M0j8M2K5nj2N5n6Ql7j1J8N6m1Rj3j5RN4Rm4KL0m8M7o1
3955fP2k2K0l8M2l2k0M4o1K4p3M4k0J6N1nk9Kl5K0m7K7L0k0nj9lP5m6L0n0Rn2
3988g7N3nMK8l0O2m9k1j4K3Kn3R3n3J6P1p9j1O6m8J1Pk8K8m5K8M3l3L9k7K3m0
4020a6P3l7L4k4O3n4k9L9o1P2l8L4k8j3M0Mj0k1P8j28kJ2l1P0o1N0j0L2n3j4m6
4051g5N4onl0k1O4Pl3k1QNrK4qkLK7M1o3O4r0K3K5K6j7kPl1P9p4O5n0Jj8L2Jj0
$$ plain form
4088 -9 -28 -39 33 41 77 45 -27 29 8 18 -41 56 67 63 -16 52 -15 -58 15 7 71 -12 45 31 20 34 -13 29 -21 36 16 -31
4120 -31 5 -19 -16 -6 -19 -43 25 -71 -30 -37 -7 -62 -57 13 -59 31 -23 -19 -24 18 -39 -40 -1 -16 -2 -19 -17 -94 -37 0 -44 -50 -15 -25
4154 -25 -27 37 26 -29 -3 0 13 12 17 37 31 0 32 19 56 46 -7 6 0 23 -23 -2 17 15 9 2 0 46 -13 -13 -10 28 -25 30 22 29 -18
4191 -18 49 19 16 2 -20 -21 -3 48 -13 -29 -50 -23 -26 -39 -34 -45 -17 -117 5 -15 -44 1 -68 18 -49 -27 -46 -1 -10 -18 39 -58
4223 -58 11 3 -43 10 36 21 8 5 -23 48 19 50 17 -1 83 -5 11 -14 37 -2 45 -37 18 46 -25 -21 -27 69 -10 21 37 12
4255 12 5 81 -14 -12 45 11 9 7 -1 -9 24 23 -28 35 -13 24 -11 -20 -17 -17 -16 -68 2 -55 7 -23 28 -37 -45 5 -15 19 8 -25 -47 -77
4291 -77 -2 -22 5 -32 -10 -41 -5 -67 -74 -13 -24 14 -58 -1 -20 10 -67 23 61 18 -10 -32 19 67 58 -18 7 31 -12 47 37
4322 37 33 -12 51 32 32 25 -44 3 -15 53 -19 45 -15 1 26 17 6 -36 3 7 22 1 27 19 -31 52 45 18 -34 -28 -15 -77 19 -67
$$ packed form
4088ij9j1P2QL6l2p2N6k1J0n9R7J1mp9O8o7m3P3qO4q3N7j4j1J4m7M2n0N7k0m7
4120c1L6k4LJ0j3k4O8r6M1pL0n5NP0p2R0n4MnM2n7jL9j5J4j7Kp7N7L7m4oL5j0
4154b5kO4j1n5K6LJ3jNK0ol1L2j3L7j0n3J3oK3m6K1J9kopkM6n9%LL8n3N5qPm7
4191a8O7l0lj4k2jJ8N1o1j6k1K7lj3Nj1K8j00J22k0k9M5o9Q6o7K2j9M5rqN7r7
4223e8O9qm6N3K6j5j3lk8P1k9L1l3j8Q4q8J6k5N1l9M7q2N5K8p1MoR6p9L1J6k5
4255A2pP6r5KN7l4kkqqL3jn1O3m8L7l5rL%Jn2P0n7O2l0N1o5qN0k0L4j1l3k2l0
4291g7P5k0K7l7K2l1L6o2pO1j1L8p2N7j9L0p7R0L8m3k8k2N1M8rp6K5K4m3N9j0
4322C7mm5O3j9%po9M7j8O8p2O4o0J6K5rj1m2L9MJ5k1K6qn0Q3pk7n2OJ3o2R6q6
$$ plain form
4356 -67 65 -92 -32 4 -34 -35 -34 11 -51 26 -25 30 -13 -36 -53 -8 -32 -7 -1 -12 -63 -33 29 -17 -18 -12 0 36 -11 22 -38 8
4388 8 29 -1 24 -43 20 11 25 28 14 5 22 89 24 63 43 40 9 34 13 12 -7 -10 56 -43 27 -56 -9 -14 -32 0 -10 8 -58 10
4422 10 -7 28 13 -18 -51 25 9 -10 -20 -29 -19 -31 -49 -8 -25 -43 -10 0 -30 13 -3 -60 -42 -34 -16 -50 -55 -39 -23 -18 -53 20
4454 20 -14 -4 -68 21 27 10 -2 -19 -26 31 51 -33 61 -1 -2 41 12 34 13 60 -49 50 66 20 -2 -3 32 11 -28 2 44 92
4486 92 36 -14 -41 58 27 46 -33 35 -9 -8 -42 -52 0 -11 -39 -1 24 -43 -32 7 -4 20 -49 -1 -70 -62 -27 -15 -14 -57 -36 -32
4518 -32 1 -46 -16 4 -37 -21 -27 -27 -64 52 3 8 -44 -24 28 -10 76 41 1 -38 -12 23 12 30 36 7 -23 20 18 -12 36 12
4550 12 46 -53 39 41 52 35 5 -22 51 83 0 26 -18 46 1 26 1 -5 -42 19 42 -20 -25 -78 -27 -45 -45 15 -36 -28 -3 -1 -8 -2
4584 -2 -10 -14 -1 17 -48 9 5 -21 8 -4 -28 38 23 -67 3 -27 34 10 10 -43 8 -76 5 -28 7 71 7 -34 -7 48 -8 15 7
$$ packed form
4356f7J32j57O0L6l8jJM5o2P7n1N5m3k3j7M5k4K5Oj1n1L0O2m6jOJ2L6m7L3o0M6
4388HK1l0K5o7O3rJ4Lj4rJ7O7o5L9k0ll1K5k1jj9lO6r9P0q3M7nj8L2j0J8o6O8
4422A0j7L5j5l1l3P6j6j9j0rJ0j2j8M1j7j8L3J0l0M3j6n7J8QJ8l4nJ6J6Nl5P3
4454B0l4J0o4Q9Oj7j2j7pN7K0q4R4o2jM3k9K2k1M7j09R9J6m6k2jL5k1l9L0M2M8
4486I2n6n0k7R9l1J9p9O8m4Jl4j0N2j1k8L8K5o7J1L9j1K4o9M8o9QL5J2Jm3K1M
4518c2L3m7L0K0m1J6o%l7J16m9Nn2K0N2l8Q6l5m0l9K6L5j1J8Ok9l0M3kl0M8k4
4550A2L4r9R2KJ1j7l0k7P3L2q3K6m4O4m5K5k5ol7O1K3o2nn3N1j8%O0n1QK5KpO
4584bqmJ3J8o5N7mk6K9j2k4O6j5r0P0l0O1k4%n3N1q4Q1l3L5O4o4m1K7N5n6K3q
$$ plain form
4617 7 1 22 40 33 -2 8 -11 -23 -7 12 54 17 35 8 44 26 10 49 43 -34 18 41 17 33 31 21 18 12 -1 -4 42 -34 -30 -42 46
4652 46 2 -42 -52 -20 19 -33 -12 -72 -8 -6 -40 -16 12 -26 -18 -34 -26 12 -2 -20 39 3 8 -29 25 -39 10 -51 -22 4 2 -20 -11
4685 -11 9 12 8 -27 -22 -20 -2 42 45 -9 45 41 -11 39 18 -27 18 6 -51 32 12 -15 51 -6 -3 18 19 18 -4 42 -21 5 1 -20 4
4720 4 -5 -9 -24 38 -34 -43 -25 -29 -33 -6 -19 -43 -50 1 9 -73 -11 -26 -18 15 -122 1 14 -46 6 -20 -18 16 64 -49 -1 -24 -37 -15
4754 -15 14 -9 -17 -9 4 62 -6 52 57 31 25 9 72 -23 39 39 -30 -42 -62 32 -13 32 -30 48 37 -17 4 -1 68 -37 -8 -14 11
4787 11 -30 36 -2 -54 81 15 81 32 5 -30 -7 47 -76 -15 -21 37 -10 -12 -69 6 30 -14 -16 -61 10 -13 7 -77 -1 19 -72
4818 -72 -11 -18 25 -47 -2 1 -25 26 -3 -25 13 30 -24 -18 -5 24 24 37 -26 19 9 10 9 -28 64 40 51 12 -17 43 -37 16 10 7
4852 7 -20 38 64 -17 -43 -17 49 -5 7 52 -32 -13 -36 49 20 1 -38 24 11 5 7 29 10 -60 -2 -3 49 -6 -43 22 -36 -60
$$ packed form
4617GoK1J8pl5J0j9j2J6J9M2l7J8k7L6j8j6L9op7N2K3k4J6kj0loj3lM6p6Mj2Q8
4652D6m4m4j0L2L9n2K1o0O4Kl4K4K8l8Qj6QL8j4j8N9l6Nl7N4o4M9o1K9K6kk2R
4685a1K0Lml5NKJ8M4Ln4N4mn2N0k1m5M5j2n7Q3k0k7O6n7LK1Jjk2M6o3K6mk1K4
4720Drmj5O2p2rJ8mmK7j3k4pN1Qq2O2j5QL3j37J23J3o0N2k6KL4M8j13M8k3j3K2
4754a5K9k3qQJ3N8o8N8Nk6oj6O3r5O2%o9j2k0R4m5M5o2P8j1n4K1nO9j05K9oK5
4787A1m1O6l8n2J35o6O6m9k7l5K3N4j23O1oN8m7kn7P5K4m4km5P1k3K0q4P6K0r1
4818g2O1pM3p2M5Lk6N1k9k2L8J7n4OJ3K9%J3o3M5j0Jjl7R2k4J1l9k9O0q0N3ol
4852Gk7N8K6q1k6K6O6n4J2M5q4J9k3Q5k9j9l9O2j3oKK2j9p0N8jN2n5l7O5n8k4
$$ plain form
4884 -60 13 2 -32 -1 0 -7 8 -38 34 -83 3 -13 24 -9 -8 -18 20 0 -25 -1 16 56 31 4 30 -10 -27 27 15 -33 71
4915 71 23 -26 51 18 -23 10 48 51 -2 -1 -35 22 23 30 34 0 22 37 -2 -16 19 44 -15 0 2 -20 8 27 29 -19 -6 -31 -13 9
4949 9 5 -22 -48 17 -75 -11 12 -51 -5 -8 -29 -28 39 -38 -24 7 -1 -34 -37 12 34 -17 -8 -44 -14 -1 -37 -41 -38 42 -31 -26 -23 -2 3 -47
4985 -47 8 -13 2 2 31 28 49 32 8 2 -51 0 -9 -65 33 22 -9 4 -20 37 45 -42 -17 -20 29 25 2 40 64 18 7 62 10 -53
5019 -53 25 12 25 -9 16 -51 50 24 30 33 -37 35 -72 0 -29 6 -76 -30 -39 32 -31 3 -62 14 7 -16 4 -42 -12 -29 -30 8
5051 8 -21 11 -37 51 5 11 2 -26 -11 -38 -29 -6 -12 31 -19 -5 -13 24 23 -2 -15 22 32 25 7 14 58 -22 0 -39 -29 10 27 21 -20
5086 -20 3 -52 6 8 79 -8 -61 -14 -66 -9 54 -25 -22 -36 -4 2 -4 25 10 -14 -22 -21 -64 -58 -15 -13 -72 5 -39 0 -21 14 9 -34 19
5121 19 20 29 -4 2 -8 13 -6 -13 5 -24 -25 13 -9 -2 -8 -29 -20 72 -64 0 -38 25 13 35 -2 -12 -35 45 41 10 -32 -9 -9 36 29
$$ packed form
4884f0P3j1l4L1JpJ5m6P2j17Q6j6L7l3Jj0L8k0k5K4J7M0k5k7K6m0j7N4j2m8J04
4915G1m8m9P7l3m1L3L8Ln3Jl4N7JPMl4K2J5l9j4L5K5n9J5Kk2K8J9Km8J3k5J8K2
4949Imk7k6O5r2O4K3o3M6lk1JO7p7J4L1ql3lM9K2n1Rl6L0J3l6mLQ0p3NLK1Nn0
4985d7N5k1J5%K9lK1j7k4on3N1rn6R8j1l1J3k4N7Qq7K5lM9mk3L8K4m6j1N5n2o3
5019e3P8j3J3l4K5o7J01k6OLp0P2j07P2k9L5q2M6rP1o3L4o5P6pk3K0m6L0j7jL8
5051Hk9L2m8Q8m6Ork8J5k7RK3oM3n0J4qL7jk5j3L7J0pj8PM4q0K2l9J0L9J7om1
5086b0K3n5N8KP1q7n3M7n2N7O3p9Lj4L2OoK9j5k4qJm3OM3Kn9P7m4L9k1L5nm3N3
5121A9JRl3Oj0K1j9pJ8k9jL8k2Pok1RR2j36O4l8O3j2K2l7j0k3Q0ml1m2K3%M5p
$$ plain form
5156 29 -18 66 23 25 19 -7 -7 -15 37 19 24 -18 -18 3 -18 -49 18 -15 -21 -32 39 -51 46 -14 -22 -42 5 -37 -5 -54 6 6 10 5 49 -52
5192 -52 -46 -48 -60 -37 -16 25 -7 -21 -64 -57 -57 -23 -6 40 35 30 -15 2 66 -16 -6 40 -4 12 7 36 35 32 -26 37 11 -14 25 -6 19
5227 19 -12 32 -8 7 17 27 -41 40 -26 9 -1 21 68 26 -16 7 14 17 25 9 -58 3 -25 -38 6 3 -17 -18 -13 -57 -35 -67 11
5260 11 -54 -5 -54 -59 8 -72 19 -36 30 -34 -24 -22 -51 17 2 17 19 26 14 -31 -20 -15 -3 10 -29 -63 26 32 10 33 -9 28 -34
5293 -34 7 -29 5 59 60 17 -3 31 17 28 35 3 31 18 5 17 9 0 7 -12 12 18 39 -35 16 33 -28 52 -25 -25 -17 0 22 -43
5327 -43 58 17 25 11 4 4 -58 10 -36 -11 -36 -7 15 -30 -39 13 -20 -41 -41 -13 11 -16 -41 6 2 -16 22 1 -2 11 80 66 58 22
5361 22 -36 30 41 -38 -14 4 18 8 -8 -12 -23 32 10 2 37 32 -59 9 48 -18 -7 59 28 42 -19 -3 41 11 -25 52 3 5
5393 5 -21 4 25 1 20 -41 33 45 11 24 7 49 -6 47 -2 22 -19 9 12 -32 -47 -25 8 -27 -18 -46 13 -23 -8 -3 -29 -3
$$ packed form
5156B9m7Q4m3Kok6%qN2j8Nm2%K1k1l1O7l3oj1P1r0R7o0qk0M7m2L2m9O0%MnM4j01
5192e2Okj2K3K1M1l2j4m3P%L4J7M6nnm5J7O4q2J0M6m4J6nK9jln8O3k6k5L9l1K5
5227A9l1M4m0J5J0J0o8Q1o6L5j0K2M7m2m2K3PLQj6o7O1k8j3M4lk0jNm4K2l2P8
5260A1o5M9m9nO7q0R1n5O6o4J0Kk9O8j5J5KPj2m5J1NJ2J3l9l4Q9Ok2K3m2L7o2
5293c4M1l6L4N4Jm3k0L4j4J1Pl2K8j3j3J2qrPj9K4OK1p4N1J7o1Q0p7%QJ7K2o5
5327d3J01m1Qj4p%o2O8m6K5k5K9K2m5rN2l3k1%K8K4k7k5M7mj8L8k1lJ3O9j4ql6
5361B2n8O6J1p9K4J8J4j0j6mj1N5k2qL5nr1O8L9o6J1O6l1J4o1J6M4l0l6P7m9K
5393Ek6K5K1k4J9o1P4J2l4J3j7M2n5N3m9K4m1K8Lm4j5K2L3l5Rk8N9l6J5Nk6K6
$$ plain form
5425 -3 -10 -64 -25 -22 -45 17 20 9 41 2 47 9 41 -13 5 25 39 8 51 32 23 26 1 25 69 -2 30 30 -36 -45 -8 40 -34 -17
5459 -17 -9 21 -9 -44 -11 3 22 -22 21 -34 -58 -44 -15 -10 -12 -1 0 -9 -13 -5 -15 3 -8 17 -44 28 -16 -48 -50 0 -14 -46 14 -46
5493 -46 6 -42 17 13 -19 -19 27 -6 -18 -16 -18 9 40 -26 15 -69 -6 9 -6 38 16 -3 25 30 -17 9 0 8 51 16 41 -7 39 -38
5527 -38 -34 38 -5 27 -44 -1 3 -2 -61 -19 -28 28 21 -16 67 -19 -28 -7 -13 -44 -49 -37 -19 5 -90 -23 26 1 26 -7 -26 23 -34 -20
5561 -20 -2 -49 -45 5 10 -18 -9 -48 -57 17 26 -43 -18 -1 -31 -38 -40 -6 8 -29 1 -57 21 15 -25 -41 37 3 4 36 23 -7 27 1 21
5596 21 -12 -11 37 36 28 -21 66 2 15 40 41 66 51 14 13 10 11 3 -31 21 -21 -6 0 27 14 1 -13 -20 7 -5 -27 18 -9 -55 3
5631 3 -6 19 23 48 -25 12 -31 1 -27 6 -29 -14 -31 -62 -64 -18 13 0 19 -77 5 -6 9 -16 25 -17 25 14 -1 -25 -23 -9 32
5664 32 30 15 -13 44 -23 -13 30 -21 -1 9 61 69 22 22 7 40 -2 5 14 42 15 20 -25 -41 -24 -63 17 -34 -12 -44 44 -9 -12 -1
$$ packed form
5425cpn4L9Lk3O2Lj1L2l9M5l8L2n4J8K0J4l1M3j9rLk5K4M4p1L2%o6rL7M8p4J7
5459a7QL0l0l5L3J4J9m4M3n5k4J4K9NkJ1JrmQj0J8j1K5o1P2m4l2kN0j4l2O0o0
5493d6N2m8N9ml2%M6l3j2KkK7L1o6M1q4O3J5j5M4k2j9K8Nm7K6rQM3l5K5m8M6p7
5527c8MP2m3L2p1M3Mnn9M2rN6pl7Q3q6rK1ol1nJ2J8K4r5O7M9k5K5l3j9M9n7J4
5561b0J8m7MN0Nk8Rl9rP4Ro9K5J7l0pkL4J4l7L0n8P8om0j6P8l4JL2j3l0L4k6K0
5596B1l3JM8jqm9Q7o4J3K5JK5j5l7jlJql4N2m2J5OK7j3j3j4pK7j2k2M5k7m6N8
5631CrK5MK5p3L7m3L2k8L3l5J5j7l1kM6L1j3J9r6Q2j1J5k5M1m2M2j1j5k4KJ4M1
5664C2kj5k8N7o7J0M3n1K0J0N2Qm7%j5L3m2PRK8k7Nm5j6J7l9Q0n1K2l2Q8n3lJ1
$$ plain form
5698 -1 -8 -12 -9 -39 -40 -29 -5 -44 -53 -57 -10 -28 32 19 -67 -30 -43 25 -14 13 -36 -4 -4 -57 -29 15 11 6 -4 -28 -2 -7 4 -6 -47 -9
5734 -9 -17 24 -11 -64 -15 18 -22 3 -2 -47 23 24 36 -21 21 -37 45 2 15 19 -22 9 53 46 31 26 -19 3 29 20 14 8 74 14 -18
5769 -18 38 -1 0 -1 2 -11 -6 -2 -3 4 22 -19 -21 3 -35 10 -23 -62 -61 -57 -30 -41 22 53 -34 -4 -29 -11 -15 5 52 -16 24 12 63 50
5805 50 70 5 5 -4 -1 33 26 61 46 -77 19 1 16 -45 30 -5 19 -38 56 -16 58 11 -21 25 -8 -12 27 7 -4 37 11 -32
5837 -32 5 5 -9 24 -42 -20 27 -6 -18 10 2 4 -53 -14 -61 -27 -5 -12 14 61 -45 -47 -25 -13 76 6 -25 -5 -18 -25 19 -5 -1
5870 -1 -32 -3 8 41 36 7 -38 20 -57 77 59 37 26 62 38 8 14 24 15 25 -6 25 32 25 24 27 18 0 -9 -3 8 34 29 -31 -18 -17
5906 -17 -2 -24 3 -12 12 -36 18 40 25 21 -7 15 -22 36 -17 1 -43 4 66 -12 19 0 12 50 -42 -4 -54 -31 21 -17 6
5937 6 12 -20 -2 0 -32 -24 12 -9 -30 -17 13 -12 4 -37 -6 -8 -46 15 23 18 -41 31 21 29 -9 -48 31 -42 23 75 -18 -58 64 -21
$$ packed form
5698apmLl0jJ1K4l9rmM7j8O0j3q6L7j3O8l9K7m9L2%n3K8M4mnj0k4K6nJ1j0m1L8
5734iqM1l5n3M9L3m0K5nm5P0JJ2n7M2n8Q2m3J3Mm1L1M4pj5nm5K2K6rooO6o0l2
5769a8N6l9JjLj3NMjPJ8m1kK4l8M5l3l9JMK7j1O3L1q7L0k5J8mK0M7o8M0j2N1j3
5805E0K0o5%rLL4pL5j5j23R6j8J5o1P5l5K4n7R4p2P4m7l2M6l3mL9k0j1M1k6m3
5837c2L7%j4L3o6K2M7l3j2K8qKn7L9m7L4K2pK6M7j06kK2J2Q9p0l1K0j3pM4k4M
5870al1K9J1L3nk9m5N8p7J34j8k2j1L6k4l0OJ0rJ0l1L1PpjLrj8rOJ1K6no0J3J
5906a7J5k2K7j5K4m8N4K2j5mk8K2l7N8n3J8m4M7O2p8L1j9J2L8r2L8n0K3N2l8K3
5937FOl2J8Kl2QL6k1k1J3L0k5J6m1L1kl8O1Qnn9P2j0Ql8l9P9p3O5N2r3m0J22q5
$$ plain form
5971 -21 -3 50 -53 4 -13 23 4 27 -42 -22 15 28 -4 -5 52 50 6 36 -22 -31 -32 1 -28 -11 -18 13 18 0 -10 37 -8 -30 7
6004 7 -2 38 -3 -39 -29 -24 -27 3 -50 -41 -43 -63 15 -28 20 -22 -44 4 -63 8 -72 7 2 2 1 37 27 -51 -70 6 -5 -7 -11 -14 -9 -22 25
6041 25 23 27 8 30 25 4 -18 42 23 62 14 50 -1 30 -15 -18 -12 11 -9 -23 33 -5 79 4 -44 -40 -28 40 -8 -36 -2 12 -38
6074 -38 0 65 13 -9 16 25 9 34 -17 10 -44 18 -42 -5 -28 -10 43 14 -49 -5 13 -14 -47 -26 -20 -39 -4 10 -15 -55 -28
6105 -28 -27 21 -8 -5 47 -16 -12 -23 53 17 9 -3 20 47 27 3 24 2 -14 1 9 -56 -3 16 9 27 15 -15 13 5 36 20 -61 -53
6139 -53 -49 66 -22 13 21 2 -26 2 8 -14 -30 -21 45 7 -8 47 -2 -36 -2 -59 -25 40 -2 -5 31 -19 -20 -14 -7 -18 23 -7 7 24
6173 24 1 -7 -46 -3 -1 -18 -18 -34 -13 37 31 -52 1 -18 58 21 -25 40 0 9 -5 68 30 17 -18 -13 47 24 0 48 18 25 28 64
6207 64 -36 57 13 28 51 15 28 3 33 0 52 41 -5 42 21 39 -26 27 -18 -19 -39 -16 -40 28 1 10 3 -34 -26 -37 -25 -19
$$ packed form
5971b1J8N3j03N7j7L6j9K3o9K0L7J3l2jN7km4L0n8rjL3k9J7pL1Nj8j0M7m5k2L7
6004GrM0m1l6J0NlL0n3Rkk0P8m3M8m2k2M8o7P1q0P9n%jL6j0p8j9P6j1kmlNj3M7
6041B5kMj9K2nk1k2O0j9L9m8L6n1L1m5lOK3k0j4N6l8Q4p5m8MJ2O8m8k8L4J4n0
6074c8L8O5n2k2K5Rj6K5n1K7n4O2o0L7k3J8N3k9o3M4J8k7l3K1Oj9L5J4k5m0K7
6105b8JM8k9LN2o3Mj1P6l6qj2K3K7k0k4K1k2j6J5Qo5N3J9pJ8j2l0K8qL1j6q1Q
6139e3MJ15q8L5Qj9k8K8Ok2j6RO6l8j5N5m9l4L4n7L4O5m2lL6n0jOPj1M1l0J4J7
6173B4k3ql9M3Kj7%j6K1N0oq3N3j9P6l7m6O5m0Rj4P3l8j3l5NO0k3k4M8l0PLL6
6207F4j00R3m4J5K3l6J3k5L0l3N2j1m6M7k1J8o5N3m5jk0K3k4O8k7Rpl7Qj1J2O
$$ plain form
6239 -19 -54 -44 4 -6 -28 37 -26 9 -3 -60 -17 -10 27 -24 -4 49 37 -11 -25 -30 -24 -14 26 28 -36 -49 24 8 -4 22 62 15
6271 15 -17 -8 36 44 14 -13 11 4 -3 51 7 27 17 -37 48 11 -5 -1 -74 -34 14 1 2 -36 27 6 -42 23 -27 -36 -50 -38 -32 -21
6305 -21 -7 -35 -2 -26 -4 12 -13 -25 2 -33 24 -34 -16 -8 -18 -59 -6 25 47 4 20 32 55 -3 -9 48 10 10 -9 -32 16 -2
6337 -2 -12 65 4 -4 1 -12 28 18 51 14 44 2 54 3 17 46 29 -7 57 45 23 49 -3 47 -1 -1 -32 -22 13 -23 55 59 2
6370 2 -19 -35 41 36 44 -37 7 15 22 0 45 23 -16 -8 -50 17 -3 -26 3 -20 -5 -29 -40 -43 -17 23 1 -7 -14 -27 18 1 27 10 9
6405 9 -11 -4 19 -7 -14 16 29 -38 9 -15 -13 4 45 14 -7 -13 27 21 -52 25 -4 10 27 -12 54 32 54 -21 19 28 11 8 -12 17
6439 17 -13 19 -25 -11 -20 -13 -4 -5 -21 -14 -7 -6 33 9 -3 -67 -30 5 -23 51 37 -46 -42 -11 -42 -47 -15 -72 -15 -33 -50 37 31 7 -14
6474 -14 -9 -32 -28 -11 38 -15 35 -19 -17 -27 -16 -6 -25 23 17 3 11 -18 -34 -29 16 -36 42 33 -14 18 -11 14 9 27 -27 28 -18 -13 -31
$$ packed form
6239a9l5J0M8j0k2O5o3L5j2n7M3PL7n1K0N3j2m8j4nOJ0M0Ko4j3P3j6j2K6M0m7
6271A5l2RM4Ql0k7K4ppN4m4K0j0n4Q5l7j6Mp3M0M8j3Jl8O3k1m8O5n0rj4J2OJ1
6305b1J4k8L3k4K2J6k5j2K7l5N7n8J8Qj0m1N3L1K2m3J6J2K3n8oN7l8%j9k3M8j8
6337bj0P7o1qNj3M0j0L3l7L0m2N2n1J4K9j7l6O4j2k2K6n2N0m8%l1J0L5l6P8Mn7
6370Bk1j6P6nQq1M4QPk2M5k2l9Qm2O7k0k3K9k3J5k4j1lK6M0k2qpj3M5j7K6j7j
6405Ik0PK3k6pL0J3o7M7k4KJ7M1l1k1oM0op3P7k9J4J7l9O6k2K2p5M0Rj7lk0K9
6439A7l0L2m4J4rPRjj6PPJL9k4j2o4L7L5k8P4j4q3ML1l1nL2n7N7j8j7Q7ok4k1
6474a4Nk3MJ7M9n3N0n4Kj0J1J0j9M8oj4Qk9j6NM5n2P8rm7L2k9K5nJ8n4N5m6Nj8
$$ plain form
6509 -31 6 -50 -9 38 27 -9 -9 10 -11 5 49 13 -12 26 37 -22 -41 36 -11 11 3 -23 18 -29 -9 -5 10 -20 -24 -34 -27 -29 -18
6542 -18 -3 -2 -47 -54 -5 -2 -19 -2 9 28 7 -48 47 30 -2 58 5 0 28 46 20 70 22 16 -13 5 -5 -23 -47 8 23 2 23
6575 23 9 -30 41 13 -28 -3 10 34 -51 10 18 -6 21 -45 -10 -7 23 10 -33 -58 38 -9 4 -53 -2 -20 -28 1 39 5 36 -13
6607 -13 20 7 -32 14 -12 -27 -30 6 13 -36 -31 -26 7 15 33 -2 7 5 -24 11 32 2 4 -9 -30 9 -41 -13 -4 11 8 -3 -58 30 -48
6642 -48 25 -10 44 16 17 11 -37 5 42 11 36 -1 36 1 23 33 -1 14 -32 12 10 -26 -25 15 6 -14 30 42 7 -7 -20 -4 -8
6675 -8 48 -7 -9 37 5 -22 57 -45 -8 19 -19 19 -16 14 -9 20 23 -48 20 21 -16 -16 -55 -2 -21 2 10 17 1 23 4 -24 8
6708 8 -45 29 -37 -28 -47 -1 0 22 5 -28 42 -12 37 -25 17 13 -23 48 15 4 0 -8 6 -12 45 -10 -38 15 3 62 11 -17 0
6741 0 33 19 -6 47 -16 -8 34 -37 -19 -14 -25 8 -47 -10 -21 -15 -30 8 33 -24 -30 -30 -7 8 25 -14 -5 76 13 -2 32 44 -7 -17
$$ packed form
6509c1L7n6M1M7j1l6%J9k1J6M4l6k5L8J1n9j9P7m7K2qk6M1m7K0MJ5l0mj0PkJ1
6542a8J5Jm5pM9Lj7J7J1J9k1n5R5j7l2O0n3nK8J8k6N0m8ok9J8j0j8k4N5J5k1K1
6575B3j4l9P1k8m1K5J3K4q5O1Qk4K7o6L5LL0j3m3k5R6m7J3n7N1j8qK9L8l4L1m9
6607a3L3j3l9M6k6j5lL6Pm9NNL3QJ8l5Rkk9L5K1l0Kj3k1L9n0K8RJ5lj1n5Q8p8
6642d8P3l5N4k8Jom8M2L7l1K5l7L7l5K2J0l4J5m6M4kl6JM0rk0M4J2l5j4j3J6m
6675hN6n5kM6l2k7P9j02L7K7l8L8l5L0k3K9Lp1O8Jl7%l9N3j9K3QPj6K2j9k8L2
6708Hn3P4o6Rj9M6JK2j7l3P0n4M9o2M2ml6P1l3j1mqJ4j8N7n5k8N3j2N9n1k8J7
6741@L3j4k5N3o3QM2p1J8Nj1L3n5L7j1Oj5L8K5n7o%K3J5J7l9RQ1o3j5L4J2n1j0
$$ plain form
6775 -17 -15 -28 -30 -12 20 44 -81 16 0 -18 24 -10 3 -6 20 6 -22 -15 15 44 -8 83 3 16 18 -7 67 -30 -75 2 29 -18
6807 -18 15 0 27 20 -20 15 31 -33 33 -36 -32 28 33 -28 33 4 -9 -66 -21 2 -36 -9 19 30 -14 -20 -32 -1 -49 -31 -55 10
6839 10 -23 -34 -59 15 14 -5 -3 -8 16 -10 45 65 1 65 31 -12 -2 -8 -28 16 40 14 53 -30 -5 -60 2 58 31 39 7 -10 -28
6872 -28 -15 1 -18 -31 -36 -5 31 20 -31 0 38 -4 -29 -3 16 19 71 77 14 -6 76 34 13 -48 -13 36 18 -24 -1 -48 32 -52
6904 -52 21 -3 13 -71 -23 -49 -18 -10 -28 2 -41 10 -13 11 -5 13 8 -1 -21 26 4 -6 17 36 4 -18 -16 10 7 12 -2 -13 -2
$$ packed form
6775a7Kj3kJ8L2K4j25R7j6j8M2l4J3rK6j4k8PL0K9n2R1q0J3Kk5P4r7m5P7K7m7
6807a8L3j5K7pm0L5J6o4O6o9MO0No1O1k9j3n7M5K3l8K7K8J1m4oj2L1m8J8k4O5
6839A0l3j1k5P4jj9KnK4k6N5K0o4O4l4m3J0ok0M4K4k6L9q3K5n5O2N6k7Ql2j7j8
6872b8J3J6j9j3nL1L6j1n1L1L8m2k5K6J9LN2Oo3k0Q2m2k1o1L5M9j8m2K3m7Q0q4
6904e2P3k4J6q4M8k6L1Qj8L0m3N1k3K4j6J8nrk0M7k2j0K3J9l2k2KK6lNj4j1J1
$$ [...]
8191i
##END NTUPLES=NMR FID
##END=
