##TITLE=1H_Pr Am-2
 CDCl3,8 sc, 
 23.9.2021
##JCAMPDX= 6.0         $$ Bruker NMR JCAMP-DX V2.0
##DATA TYPE= NMR FID
##DATA CLASS= NTUPLES
##ORIGIN= UXNMR, Bruker Analytische Messtechnik GmbH
##OWNER= root
$$ XWIN-NMR		Version 3.5
$$ Thu Sep 23 13:15:42 2021 Russian Standard Time (UT+4h)  she@DPX200
##.OBSERVE FREQUENCY= 200.1314
##.OBSERVE NUCLEUS= ^1H
##.DELAY= (6, 6)
##.ACQUISITION MODE= SIMULTANEOUS
##.ACQUISITION SCHEME= undefined
##.AVERAGES= 8
##.DIGITISER RES= 18
##SPECTROMETER/DATA SYSTEM= spect
##.PULSE SEQUENCE= zg30
##.SOLVENT NAME= CDCl3
##.SHIFT REFERENCE= (INTERNAL, CDCl3, 0, 15.7039)
##AUDIT TRAIL= $$ (NUMBER, WHEN, WHO, WHERE, WHAT)
$$ ##TITLE= Audit trail, XWIN-NMR		Version 3.5
$$ ##JCAMPDX= 5.01
$$ ##ORIGIN= Bruker BioSpin GmbH
$$ ##OWNER= she
$$ F:/spectra/data/she/nmr/H-F/1/audita.txt
$$ ##AUDIT TRAIL=  $$ (NUMBER, WHEN, WHO, WHERE, WHAT)
(   1,<2021-09-23 13:14:32.34 +0400>,<she>,<DPX200>,
      <created by zg, POWCHK disabled, PULCHK disabled
       configuration hash MD5:
       00 E9 B6 7A A2 85 ED C7 34 08 36 98 17 FE 4E 26
       data hash MD5: 16K
       07 82 26 76 C1 41 8D D5 78 01 2B 98 D7 CA 80 1D>)
$$ ##END=
$$ 
$$ hash MD5
$$ E4 5F 00 76 AE 9E DA CE 9E 4D 16 88 B6 F9 48 30
##$RELAX= 
##$RELAX= 
##$RELAX= 
##$RELAX= 
##$RELAX= 
##$RELAX= 
$$ Bruker specific parameters
$$ --------------------------
##$DU= <F:/spectra>
##$EXPNO= 1
##$NAME= <H-F>
##$PROCNO= 1
##$TYPE= <nmr>
##$USER= <she>
##$AMP= (0..31)
100 100 100 100 100 100 100 100 100 100 100 100 100 100 100 100 100 100 
100 100 100 100 100 100 100 100 100 100 100 100 100 100 
##$AQSEQ= 0
##$AQ_mod= 1
##$AUNM= <au_zg>
##$AUTOPOS= <>
##$BF1= 200.13
##$BF2= 200.13
##$BF3= 200.13
##$BF4= 200.13
##$BF5= 200.13
##$BF6= 200.13
##$BF7= 200.13
##$BF8= 200.13
##$BYTORDA= 1
##$CFDGTYP= 0
##$CFRGTYP= 5
##$CHEMSTR= <none>
##$CNST= (0..31)
1 1 145 1 1 1 1 1 1 1 1 1 1 1 1 1 1 1 1 1 1 1 1 1 1 1 1 1 1 1 1 1 
##$CPDPRG= <>
##$CPDPRG1= <>
##$CPDPRG2= <>
##$CPDPRG3= <>
##$CPDPRG4= <mlev>
##$CPDPRG5= <mlev>
##$CPDPRG6= <mlev>
##$CPDPRG7= <mlev>
##$CPDPRG8= <mlev>
##$CPDPRGB= <>
##$CPDPRGT= <>
##$D= (0..31)
0 1.2 0 0 0 0 0 0 0 0.06 0 0.03 0 0 0 0 0.0002 0 0 0 0 0 0 0 0 0 0 0 0 
0 0 0 
##$DATE= 1632388471
##$DBL= (0..7)
120 120 120 120 120 120 120 120 
##$DBP= (0..7)
150 150 150 150 150 150 150 150 
##$DBP07= 0
##$DBPNAM0= <>
##$DBPNAM1= <>
##$DBPNAM2= <>
##$DBPNAM3= <>
##$DBPNAM4= <>
##$DBPNAM5= <>
##$DBPNAM6= <>
##$DBPNAM7= <>
##$DBPOAL= (0..7)
0.5 0.5 0.5 0.5 0.5 0.5 0.5 0.5 
##$DBPOFFS= (0..7)
0 0 0 0 0 0 0 0 
##$DE= 6
##$DECBNUC= <off>
##$DECIM= 32
##$DECNUC= <off>
##$DECSTAT= 4
##$DIGMOD= 1
##$DIGTYP= 9
##$DL= (0..7)
0 120 120 120 120 120 120 120 
##$DP= (0..7)
150 150 150 150 150 150 150 150 
##$DP07= 0
##$DPNAME0= <>
##$DPNAME1= <>
##$DPNAME2= <>
##$DPNAME3= <>
##$DPNAME4= <>
##$DPNAME5= <>
##$DPNAME6= <>
##$DPNAME7= <>
##$DPOAL= (0..7)
0.5 0.5 0.5 0.5 0.5 0.5 0.5 0.5 
##$DPOFFS= (0..7)
0 0 0 0 0 0 0 0 
##$DQDMODE= 0
##$DR= 18
##$DS= 0
##$DSLIST= <SSSSSSSSSSSSSSS>
$$ [...]
##$SUBNAM2= <"">
##$SUBNAM3= <"">
##$SUBNAM4= <"">
##$SUBNAM5= <"">
##$SUBNAM6= <"">
##$SUBNAM7= <"">
##$SUBNAM8= <"">
##$SUBNAM9= <"">
##$SW= 20.0188988654967
##$SWIBOX= (0..15)
0 0 2 0 0 0 0 0 0 0 0 0 0 0 0 0 
##$SW_h= 4006.41025641026
##$TD= 16384
##$TD0= 1
##$TE= 0
##$TE2= 300
##$TE3= 300
##$TEG= 300
##$TL= (0..7)
0 120 120 120 120 120 120 120 
##$TP= (0..7)
150 150 150 150 150 150 150 150 
##$TP07= 0
##$TPNAME0= <>
##$TPNAME1= <>
##$TPNAME2= <>
##$TPNAME3= <>
##$TPNAME4= <>
##$TPNAME5= <>
##$TPNAME6= <>
##$TPNAME7= <>
##$TPOAL= (0..7)
0.5 0.5 0.5 0.5 0.5 0.5 0.5 0.5 
##$TPOFFS= (0..7)
0 0 0 0 0 0 0 0 
##$TUNHIN= 0
##$TUNHOUT= 0
##$TUNXOUT= 0
##$USERA1= <user>
##$USERA2= <user>
##$USERA3= <user>
##$USERA4= <user>
##$USERA5= <user>
##$V9= 5
##$VALIST= <valist>
##$VCLIST= <CCCCCCCCCCCCCCC>
##$VD= 0
##$VDLIST= <DDDDDDDDDDDDDDD>
##$VPLIST= <PPPPPPPPPPPPPPP>
##$VTLIST= <TTTTTTTTTTTTTTT>
##$WBST= 1024
##$WBSW= 4
##$XGAIN= (0..3)
0 0 0 0 
##$XL= 0
##$YL= 0
##$YMAX_a= 640774
##$YMIN_a= -811018
##$ZGOPTNS= <>
##$ZL1= 120
##$ZL2= 120
##$ZL3= 120
##$ZL4= 120
##$ABSF1= 10
##$ABSF2= 0
##$ABSG= 5
##$ABSL= 3
##$ALPHA= 0
##$AQORDER= 0
##$ASSFAC= 0
##$ASSFACI= 0
##$ASSFACX= 0
##$ASSWID= 0
##$AUNMP= <proc_1d>
##$AZFE= 0.1
##$AZFW= 0.1
##$BCFW= 1
##$BC_mod= 2
##$BYTORDP= 1
##$COROFFS= 0
##$CY= 11.3945322036743
##$DATMOD= 1
##$DC= 2
##$DFILT= <>
##$DTYPP= 0
##$F1P= 2.36226072786647
##$F2P= -0.459571619588291
##$FCOR= 0.5
##$FTSIZE= 0
##$FT_mod= 4
##$GAMMA= 1
##$GB= 0.15
##$INTBC= 1
##$INTSCL= 1
##$ISEN= 128
##$LB= 0.24
##$LEV0= 0
##$LPBIN= 0
##$MAXI= 10000
##$MC2= 0
##$MEAN= 0
##$ME_mod= 0
##$MI= 1.114404
##$NCOEF= 0
##$NC_proc= 0
##$NLEV= 6
##$NOISF1= 3.799351
##$NOISF2= 2.8
##$NSP= 1
##$NTH_PI= 0
##$NZP= 0
##$OFFSET= 15.70392
##$PC= 1
##$PHC0= -14085.52
##$PHC1= 23.80088
##$PH_mod= 1
##$PKNL= yes
##$PPARMOD= 0
##$PSCAL= 0
##$PSIGN= 0
##$REVERSE= no
##$SF= 200.130013532006
##$SI= 16384
##$SIGF1= 3
##$SIGF2= 2
##$SINO= 400
##$SIOLD= 16384
##$SREGLST= <1H.CDCl3>
##$SSB= 0
##$STSI= 0
##$STSR= 0
##$SW_p= 3612.71676300578
##$SYMM= 0
##$S_DEV= 0
##$TDeff= 0
##$TDoff= 0
##$TI= <>
##$TILT= no
##$TM1= 0
##$TM2= 0
##$TOPLEV= 0
##$USERP1= <user>
##$USERP2= <user>
##$USERP3= <user>
##$USERP4= <user>
##$USERP5= <user>
##$WDW= 1
##$XDIM= 8192
##$YMAX_p= 0
##$YMIN_p= 0
$$ End of Bruker specific parameters
$$ ---------------------------------
##NTUPLES= NMR FID
##VAR_NAME=  TIME,          FID/REAL,        FID/IMAG
##SYMBOL=    X,             R,               I
##VAR_TYPE=  INDEPENDENT,   DEPENDENT,       DEPENDENT
##VAR_FORM=  AFFN,          ASDF,            ASDF
##VAR_DIM=   8192,          8192,            8192
##UNITS=     SECONDS,       ARBITRARY UNITS, ARBITRARY UNITS
##FACTOR=    0.0002496,     1,               1
##FIRST=     0,             0,               0
##LAST=      2.0444736,     0,               0
##MIN=       0,             -811018,         0
##MAX=       2.0444736,     640774,          0
$$ Real data points
##PAGE= N=1
##DATA TABLE= (X++(R..R)), XYDATA
0 0 0 0 0 0 0 0 0 8 0 8 -8 8 -16 16 -24 32 -40 48 -56 67 -80 96 -115 136 -160 189 -216 254 -293 334 -382
31 -382 438 -499 565 -637 718 -807 905 -1011 1127 -1255 1397 -1547 1715 -1899 2097 -2313
47 -2313 2550 -2812 3098 -3413 3760 -4145 4571 -5051 5590 -6203 6905 -7721 8680 -9828
61 -9828 11232 -12993 15278 -18376 22831 -29835 42474 -72432 296181 -93890 -765872 23449
73 23449 555939 197563 -349689 -148865 193842 180640 -56087 -95431 -63381 48528 158531
84 158531 105824 -160859 -223125 68251 313304 49201 -303667 -155976 228126 181600 -140325
95 -140325 -199552 37859 145331 17848 -97941 -85230 -35875 64863 113843 -39899 -183394
106 -183394 -39805 142194 41387 -137609 -51989 113401 25592 -123759 -45639 62075
116 62075 22735 -6270 15886 -29144 -77734 -1733 104898 48327 -88035 -54570 68883
127 68883 33805 -59015 9337 103928 3958 -129635 -13336 166839 48178 -147074 -26565
138 -26565 163060 41403 -150205 -43916 162573 90852 -112093 -77228 77465 55079 -30631
149 -30631 -3538 25877 -12265 -13320 35292 11015 -64367 -20178 91681 43394 -96725 -79318
161 -79318 53316 80111 -22774 -77365 -5918 39346 -14870 -33988 6785 4716 -17263 -1196
173 -1196 -501 -40004 -34862 43910 59371 -48595 -93190 8510 69119 7696 -44888 -21395
185 -21395 18818 15372 -11969 -16044 -5032 16677 41552 4522 -61738 -27411 67776 64112 -35186
198 -35186 -67066 26017 80929 -4600 -64766 10395 72633 19730 -46368 -23566 36538 33528
210 33528 -1459 2714 -660 -22363 6551 41179 7808 -32162 -7308 33729 9179 -42984
222 -42984 -16202 45059 24419 -34179 -36009 797 19548 5294 -12216 -10548 -13380 -11209 9730
235 9730 723 -28056 -9858 22677 2851 -40291 -30090 28186 33873 -30543 -43150 12587 26115
248 26115 -12305 -26242 2640 25308 3927 -24449 -13373 9421 20622 16546 -11672 -23890
260 -23890 10195 30684 5093 -20872 -2365 38525 24625 -34866 -29444 37453 52441 -1978
272 -1978 -40491 -8983 38160 25016 -11961 -10348 5173 13515 13387 -8541 -22067 6646 34328
285 34328 13114 -35420 -37337 22879 46057 -8833 -45269 -14796 24836 19471 -21640 -34861
297 -34861 1090 24532 4386 -26986 -34446 87 33552 8619 -37705 -35590 11815 37696
309 37696 -5984 -50349 -11255 42349 16861 -37894 -34935 17423 42181 3145 -35142 -18521
321 -18521 17859 30874 6156 -27324 -11346 31151 25209 -16280 -25544 12860 44972 13598
333 13598 -35274 -19412 30771 38194 446 -28407 -5294 30835 18496 -13533 -13440 7476 23437
346 23437 11368 -21830 -22470 14460 31939 4329 -34067 -22554 24920 25599 -19028 -29705 29
359 29 21464 6262 -27305 -25929 10549 22779 -3836 -31038 -23717 14647 23782 -12705 -32292
372 -32292 -8959 20520 15356 -23143 -33312 10305 33529 388 -33302 -19496 21814 28723
384 28723 -9151 -26344 -1262 22128 17006 -10904 -22119 10431 35206 8003 -25446 -16113
396 -16113 23272 36473 -366 -28035 -4425 26660 22897 -6686 -21455 6695 31454 7347
408 7347 -22375 -12024 18408 27434 -1106 -28373 -10587 21248 21255 -8094 -28848 -5974 26195
421 26195 9345 -25767 -20803 9124 20260 -3363 -30178 -16581 16270 16952 -11355 -30764 -10976
434 -10976 23089 12094 -26324 -25688 8253 23828 932 -30742 -20183 19661 25143 -8292 -29707
447 -29707 -7684 27638 18220 -20946 -21184 13056 27077 6789 -22132 -16827 21486 32969 -287
460 -287 -27115 -9869 28813 30353 -10909 -25500 6424 29536 14295 -17204 -19858 17050 33909
473 33909 749 -28734 -11894 24689 27491 -10237 -28571 -1239 21606 11467 -13263 -22483
485 -22483 1278 22204 3202 -23549 -17544 8623 18051 -6114 -26925 -9931 14216 10511 -12179
498 -12179 -25129 -4409 20723 3341 -24971 -14874 13078 15036 -10941 -23559 1206 19651
510 19651 1180 -16614 -8078 12033 14826 -7387 -18338 4098 21038 9015 -10298 -12688 6957
523 6957 22305 7120 -13207 -8953 14072 25893 772 -26176 -2435 33871 20600 -20135
535 -20135 -26332 13289 39737 7168 -32413 -17676 23270 30475 -4854 -32786 -7430 29555
547 29555 17155 -20146 -29485 535 31061 13720 -29084 -31404 7627 30559 5123 -35524
559 -35524 -27297 20153 30115 -10230 -39912 -17270 28692 26674 -24057 -39928 3246 34616 8716
572 8716 -33999 -26101 21215 29091 -9278 -27885 -5892 21624 17273 -11871 -19541 2834 19541
585 19541 13471 -6665 -16995 2392 23105 10738 -13069 -11247 15002 25610 -3648 -23306
597 -23306 2822 27022 10755 -14153 -11233 13058 17963 -4411 -13660 1615 12320 6981 -6504
610 -6504 -10047 3514 9755 -1213 -9670 -8156 3398 12189 -1903 -18858 -9282 9512 9342 -9751
624 -9751 -19327 -307 15503 -327 -19491 -14234 6705 16119 -4808 -24400 -6955 17453 9493
637 9493 -16050 -20032 6251 21773 -274 -19862 -6985 12087 13300 -3010 -13475 -838 14748
650 14748 10337 -3730 -10286 -406 16180 11770 -7539 -10867 6591 21684 8777 -18364 -11706
663 -11706 19868 21081 -5226 -15569 1632 17879 7706 -11438 -8689 7309 13309 4979 -12642
676 -12642 -12974 7847 14902 -1416 -15962 -9594 10404 13637 -9280 -20971 -2951 14403 6733
689 6733 -16246 -18658 6013 15239 -5330 -19527 -9096 9893 12162 -8050 -19200 -3324 13192
702 13192 7355 -11856 -16105 5099 16520 -274 -13848 -5766 7887 11229 -944 -10539 -1261
715 -1261 11617 9836 -3511 -10919 1973 17240 8428 -8340 -7185 7528 15878 4178 -11953
728 -11953 -3490 14493 11444 -4377 -9497 2272 13506 4687 -9554 -5834 6515 10602 1330
741 1330 -12729 -7703 9994 10212 -5839 -14378 -2946 11592 3862 -15165 -11527 6280 9362 -3950
755 -3950 -16273 -7592 10730 6908 -12079 -14982 -559 11300 3765 -13909 -12398 5337 10958
768 10958 -684 -13898 -7965 11456 11589 -7520 -12956 1297 13640 7745 -9721 -10146 8091
781 8091 14953 2937 -10676 -7117 11563 16819 -833 -11889 -836 13680 12706 -4619 -11765
794 -11765 5312 16869 5035 -9932 -8231 9224 15784 -2212 -14658 -2707 11499 9756 -6067
807 -6067 -14163 -273 12843 4031 -11261 -10872 4124 11335 -3446 -16001 -4942 8993 5640
820 5640 -8440 -14748 -1221 10867 902 -13129 -9544 3590 8781 -2443 -13375 -4661 7953
833 7953 5189 -5141 -10438 -927 11507 3707 -10430 -6635 6944 11507 419 -10855 -2340 12019
847 12019 8898 -3179 -7715 1035 13225 7584 -7245 -6163 7575 12076 2225 -9439 -3200 12394
861 12394 10627 -4180 -9861 402 13448 7752 -9890 -9496 6172 11218 635 -10900 -6458
874 -6458 8401 8629 -6354 -12028 -2787 10037 5874 -12251 -13531 3731 10651 -1213 -13709 -10248
888 -10248 6837 9572 -6155 -13638 -3755 8206 6376 -8879 -12360 2573 10487 1147 -10427
901 -10427 -8515 5940 12134 -1753 -12217 -3168 10751 10386 -4447 -11365 2684 13311 4883
914 4883 -6237 -6298 5734 13153 2226 -9458 -2333 10788 11031 -2255 -10902 1497 14057 6539
928 6539 -7081 -7890 4123 12670 2154 -11380 -4535 8216 7883 -3680 -10769 -1640 10016 3863
942 3863 -9290 -9606 944 9720 1124 -13234 -8997 6870 7418 -5083 -12854 -3989 8684 4029
956 4029 -9381 -10009 668 7919 2097 -11005 -8140 6498 9119 -2307 -11151 -4704 10024 9147
970 9147 -6135 -10429 2076 11265 5454 -8002 -6908 8208 10831 -466 -6948 -1968 9041 9908
984 9908 -2911 -8194 1534 11063 7561 -5712 -8393 5737 12167 907 -8004 -3101 7349 8282
998 8282 -4313 -8545 1565 8071 2436 -6902 -7757 3267 8518 -1308 -9597 -5476 4656 6738
1012 6738 -4378 -11891 -1238 7917 1194 -9333 -7813 3863 6968 -4239 -10546 -2650 5560 4495
1026 4495 -4343 -10219 -1575 8531 3759 -6893 -8629 3161 11802 1190 -10992 -3514 9604
1039 9604 9024 -3545 -10394 1978 13734 4617 -8072 -5493 6304 11837 2680 -8144 -3572 8189
1053 8189 9937 487 -9171 -2524 11619 8629 -6554 -9029 3224 11402 3155 -10442 -6860 7080
1067 7080 9115 -1125 -10764 -5902 8056 7448 -6459 -11060 -570 8187 3063 -10382 -9552 4353
1081 4353 7380 -2913 -10607 -4752 6794 4963 -7146 -8555 -117 5237 3090 -4688 -8040 442
1095 442 7311 2320 -6554 -6554 5688 10119 -3474 -10536 1059 11112 4775 -6760 -6018 6831 9728
1110 9728 -872 -5866 -414 6280 6987 -411 -4305 1218 5677 4464 -1066 -5118 1833 9181 3442
1125 3442 -6444 -4789 5291 8358 -1947 -9529 -466 7881 3080 -5364 -6734 279 5960 249
1139 249 -6930 -3821 2545 4273 -2974 -9422 -2275 6836 1757 -6854 -6845 224 4738 -845 -6522 -3436
1155 -3436 1806 3271 -542 -6005 -3865 4194 4333 -2426 -6108 -420 7925 3902 -7649 -5793 6722
1170 6722 8999 -974 -7830 -103 9615 4548 -4959 -2338 3996 5614 2772 -2638 -2573 3292 6203
1185 6203 2717 -4507 -4509 6770 9323 -2723 -8550 -280 8517 5259 -6460 -6944 4363 7152 -1226
1200 -1226 -7519 -3879 4765 5042 -4143 -6977 -1611 4093 3232 -5263 -9071 117 7561 781 -8646
1215 -8646 -6937 2981 6051 -3200 -7489 -1150 3721 2351 -3023 -6585 -975 6372 3185 -5299 -5699
1230 -5699 2696 8752 420 -8227 -2009 7456 6166 -2445 -5885 1540 8065 2327 -4408 -1521 4366
1245 4366 5921 1049 -3905 -1191 4831 5531 593 -5336 -1703 8792 5873 -6410 -6560 3994 7974
1260 7974 -216 -7575 -1697 6219 2452 -4379 -5056 -796 4709 2224 -5694 -5772 349 4335 655 -7593
1276 -7593 -6200 3908 5669 -2939 -8552 -2647 5984 3050 -7068 -5832 2881 4543 -1075 -5413
1290 -5413 -3437 3470 5014 -903 -5353 -2687 5197 6809 -3222 -7179 2346 8326 2303 -5155 -3186
1305 -3186 5752 6496 -1713 -3998 844 5890 4781 -1900 -4481 2000 6264 3249 -2811 -4534 2760
1320 2760 7734 371 -6772 -1809 5929 4899 -3947 -6720 2180 6048 -763 -5440 -3239 1864 4119
1335 4119 -950 -5734 -3526 2073 3930 -1977 -7884 -2581 5809 1663 -6653 -5681 2091 5195 -1698
1350 -1698 -7830 -1749 4782 2580 -3268 -5391 -679 4812 2272 -3079 -3764 663 5762 2711 -5404
1365 -5404 -3438 5489 6286 -1593 -5757 768 7841 3650 -4600 -2539 3908 5943 1975 -3856 -2191
1380 -2191 4178 5427 371 -4438 -1946 5562 5167 -3865 -5478 1986 6128 1495 -5979 -4194 4461
1395 4461 4599 -2659 -5531 -1984 3043 2758 -3153 -5166 -776 3095 1649 -4570 -6138 1117 4821
1410 4821 -1434 -6777 -2891 4010 3591 -4144 -6356 678 4371 664 -3561 -3985 1704 4336 19
1425 19 -3932 -1937 3183 4981 -817 -5509 458 6557 3241 -3472 -3812 3248 7211 289 -4564 -330
1441 -330 4538 4338 -495 -3458 764 5460 2731 -2347 -3248 1323 6065 1695 -5251 -2772 3972 4641
1457 4641 -1226 -6102 -1232 5132 2020 -4171 -4547 366 3760 250 -5262 -3467 2101 3014 -1162
1472 -1162 -5686 -2823 3965 2439 -4334 -5163 -319 4366 1063 -5427 -3935 2773 3377 -1249 -4281
1487 -4281 -1907 3839 3443 -2538 -3535 657 4661 3125 -3477 -3551 3487 5856 588 -4086 -1388 5105
1503 5105 5037 -2020 -3296 1714 4892 2238 -2758 -2392 3198 4882 -15 -3423 -1629 3702 4811 -1375
1519 -1375 -4967 -330 4311 2799 -3537 -4808 1232 4610 -789 -4844 -2596 2488 2966 -2830 -5676
1534 -5676 -893 3259 1314 -3538 -5271 71 3911 -72 -5099 -3337 1717 3347 -1539 -5133 -603
1549 -603 3977 1827 -2768 -3809 727 4646 829 -4088 -2099 2510 4459 296 -4315 -931 4686
1564 4686 3843 -1621 -3376 1013 5653 1812 -3765 -1534 3698 4662 -2 -3568 -587 5028 3506
1579 3506 -1924 -3203 312 4588 2181 -3382 -2928 2143 3197 160 -3857 -2515 3073 2922 -2554
1594 -2554 -4786 -554 3757 1639 -4582 -4618 1705 3379 -709 -4631 -3064 2533 2805 -2500 -4604 -732
1610 -732 2896 1442 -3525 -3615 1394 3336 -131 -3503 -2422 2483 4047 -822 -3728 -596 3682 2931
1626 2931 -1750 -3160 1692 4796 1342 -2569 -1669 2982 4720 -731 -3686 756 4920 2963 -1918
1641 -1918 -2977 1887 4316 737 -2418 -1468 1946 3363 -200 -3575 -742 2863 2265 -1878 -3339
1656 -3339 -281 3328 1166 -3735 -3403 1002 3771 -675 -5481 -2166 3237 1398 -3004 -3953 -217
1671 -217 3239 147 -4276 -2745 1100 2571 -296 -4162 -1667 2800 2246 -1799 -3227 -613 3391
1686 3391 2620 -2266 -2808 1514 3777 1202 -3523 -1820 4047 3820 -817 -3150 -63 4207 3024 -2087
1702 -2087 -2646 1941 4312 1239 -2897 -1708 3393 3570 -1038 -2362 -208 2559 2517 -1951 -3253 826
1718 826 3513 1151 -3332 -3226 1385 2993 -1301 -4218 -1695 2411 2161 -2705 -4625 -74 2799 -153
1734 -153 -3567 -2841 1423 2481 -1525 -3809 -1359 2024 1923 -1339 -3768 -273 2877 1083 -2639 -2638
1750 -2638 1302 3630 259 -3224 -1091 3092 3120 -899 -2967 692 4377 1999 -2017 -2063 1879 3757
1766 3757 777 -2823 -1029 3026 2837 -332 -2423 -117 3620 1991 -2343 -2233 941 3152 568
1781 568 -3467 -1881 2236 2752 -1001 -3490 -1105 2637 1577 -2983 -3223 217 2631 69 -4035 -2957
1797 -2957 1901 1903 -1713 -3496 -1171 2156 1380 -2916 -3149 163 2469 1066 -2573 -2621 1396 2661 -436
1814 -436 -2825 -903 2886 2889 -1707 -3163 865 3678 1530 -2270 -1957 2377 3539 42 -2113 -368
1830 -368 2605 3145 -616 -2465 817 3115 1549 -1821 -2189 1791 3650 -11 -2657 -1063 2169 2523
1846 2523 -948 -3312 -210 2947 962 -2254 -2564 270 2466 -189 -3282 -1582 1543 2001 -1584
1861 -1584 -3953 -894 2527 846 -2779 -2830 263 2446 -110 -3195 -1802 1192 1652 -510 -2963 -1095
1877 -1095 2525 1509 -1391 -2167 473 2926 1274 -2567 -1445 2051 3088 4 -2549 -478 3277
1892 3277 2439 -1552 -1472 1065 3060 1534 -1586 -1258 2374 2814 169 -2155 -796 2751 2501 -1192
1908 -1192 -2344 6 2401 1521 -2086 -2323 1391 2289 -522 -2668 -1735 1746 1848 -1827 -3239 -677
1924 -677 1800 669 -2675 -3378 469 2135 -722 -3240 -1950 1349 1805 -1185 -3221 -200 1951 736
1940 736 -1417 -2178 717 2929 302 -1998 -1385 1713 3187 -74 -2413 -264 2925 2107 -1146 -1910
1956 -1910 1324 3312 1002 -1922 -728 1992 2948 -53 -2598 -61 3010 1961 -748 -2290 388
1971 388 2926 901 -2253 -1338 1610 2089 -189 -2930 -1041 2176 1198 -1415 -2439 -401 1958 535
1987 535 -2453 -2613 513 1843 -133 -3010 -1878 1494 1511 -1796 -2798 -364 2126 818 -2325 -2159
2003 -2159 1142 2235 -164 -2473 -1502 1873 2056 -838 -1944 -199 2067 1920 -1215 -1783 1117 2630
2019 2630 777 -1376 -1069 2090 2653 -415 -1834 87 2487 1987 -969 -2020 954 2787 606 -1507
2035 -1507 -1436 1527 2400 -515 -2140 -12 1770 1391 -1376 -2385 622 2088 63 -2381 -1885 698
2051 698 1784 -471 -2758 -1284 1295 1032 -1482 -2711 -211 1959 227 -2320 -1697 735 2088 -399
2067 -399 -2904 -884 1770 1388 -686 -2364 -233 2221 1110 -1545 -1294 1029 2042 700 -1834 -967
2083 -967 2120 2008 51 -1575 -45 2890 1880 -1414 -1214 917 2575 1137 -1702 -915 2380 2056
2099 2056 -537 -1539 -65 2244 1498 -1832 -1599 741 1908 653 -2002 -1490 896 1701 -889 -2198
2115 -2198 -842 1211 1264 -1464 -2601 -10 1685 148 -2211 -2193 799 1572 -733 -2443 -998 1444
2131 1444 1744 -1558 -2474 278 1787 371 -1390 -1231 988 1968 -88 -1548 -414 1357 1831 -282
2147 -282 -1665 524 2363 1292 -1053 -1231 963 2563 531 -1301 -515 1612 2122 -206 -1711 508
2163 508 2392 862 -1382 -1499 852 1991 176 -2078 -885 1526 1508 -703 -1760 -510 1795 652
2179 652 -1788 -1550 -153 1419 45 -2266 -1394 892 1361 -772 -2597 -972 1569 708 -1715 -1849
2195 -1849 27 1440 237 -2148 -1341 1372 1411 -254 -1631 -541 1719 1454 -978 -1434 614 1958
2211 1958 1164 -931 -1196 1011 1972 299 -1091 -321 1682 1906 -577 -1353 683 1910 1096 -1388 -1026
2228 -1026 1342 2263 -12 -1871 -508 1495 1607 -790 -1622 -16 1115 562 -1288 -1544 388 1505
2244 1505 -229 -1987 -1212 578 1320 -654 -2402 -542 1514 506 -1410 -1927 -79 1883 -174 -2142
2260 -2142 -1140 862 1325 -556 -1962 -181 1692 954 -795 -1585 399 1955 609 -1636 -669 1332
2276 1332 1580 -41 -1281 70 1864 1254 -403 -858 361 2036 854 -1427 -620 1059 1773 244
2292 244 -1712 -540 1684 1206 -1160 -1388 417 1537 621 -1431 -1073 577 933 -226 -1460 -863 1233
2309 1233 1008 -863 -1809 -430 1283 1194 -1825 -1950 541 1319 -215 -1694 -1214 845 1144 -1292 -1717
2326 -1717 -294 990 528 -1224 -1547 598 1818 60 -1513 -1071 988 1949 -280 -1262 273 1679
2342 1679 1141 -830 -1241 1031 1912 562 -1126 -403 941 1913 47 -1303 -19 1906 1610 -501
2358 -501 -1571 261 1866 614 -1319 -519 817 1353 -228 -1579 -232 1248 627 -551 -1497 -426
2374 -426 1585 387 -1492 -1514 162 1179 -179 -1884 -746 918 632 -1011 -1447 -422 1198 247
2390 247 -1556 -1293 421 1253 285 -1291 -1061 1057 1204 -534 -1490 167 1586 992 -1115 -627 721
2407 721 1104 464 -875 -427 1311 1235 -160 -747 -220 1564 1169 -266 -1099 704 1687 563 -925 -911
2425 -911 998 1236 -531 -1392 196 1336 616 -1433 -1373 392 805 -48 -1135 -1323 62 1051 -313
2442 -313 -1236 -1079 719 884 -938 -1727 172 1127 79 -1630 -1492 394 1149 -286 -1731 -524 770
2459 770 908 -467 -1380 50 1457 750 -795 -1115 353 1446 274 -1050 -236 1390 949 -86 -1075
2476 -1075 192 1848 875 -481 -861 756 1454 531 -1067 -468 1254 1346 -230 -1324 -179 1780 818
2493 818 -1201 -949 672 1401 68 -1405 -667 788 671 -405 -1154 -593 680 420 -1251 -1498 -122
2510 -122 1187 503 -1573 -1240 754 852 -628 -1392 -540 894 1070 -999 -1320 58 906 604 -709 -1049
2528 -1049 530 1644 9 -1041 -489 1188 1301 -559 -1192 508 1251 659 -509 -817 575 1473 114
2545 114 -932 19 881 1455 72 -1223 179 1350 905 -768 -1118 621 1662 160 -960 -432 794
2562 794 579 -337 -1350 -560 942 135 -894 -1297 -224 850 74 -1405 -981 566 787 -787 -1893
2579 -1893 -678 971 666 -945 -1151 57 774 338 -1371 -671 656 1090 -19 -852 -394 1162 824
2596 824 -492 -808 495 1354 664 -580 -382 836 1083 75 -847 11 1149 1266 -303 -646 230 935
2614 935 1039 -544 -799 554 1333 205 -937 -804 1186 1057 -758 -1253 22 1025 353 -783 -951
2631 -951 400 671 -165 -967 -1148 550 868 -835 -1293 -193 567 600 -782 -1411 -48 1001 -293 -1332
2649 -1332 -693 508 816 -400 -1336 -153 1130 589 -425 -1068 335 1173 360 -625 -246 933 1307
2666 1307 48 -908 340 1004 618 -264 -842 390 1214 515 -573 -493 848 1133 278 -892 -265 1150
2684 1150 665 -341 -1167 228 1031 298 -844 -758 391 704 -77 -1116 -559 725 406 -448 -1003 -408
2702 -408 503 549 -1025 -1215 110 1032 13 -1149 -857 613 614 -646 -1107 -359 713 483 -624 -971
2720 -971 245 952 58 -645 -814 771 1274 -300 -928 -155 983 708 -597 -610 541 1089 211 -394
2738 -394 -280 642 1353 70 -829 39 808 934 -135 -973 555 1047 99 -786 -769 614 1047 -490 -1166
2757 -1166 35 611 217 -413 -1192 -113 849 314 -693 -790 147 709 -519 -1103 -683 572 125 -538
2775 -538 -1388 -390 812 184 -1028 -844 413 1003 -78 -829 -421 731 444 -318 -635 -50 1180 871
2793 871 -308 -404 618 1077 270 -770 -394 1034 1173 -173 -808 -30 1244 869 -570 -487 358 1104
2811 1104 449 -742 -311 980 829 -364 -807 -286 562 720 -689 -1091 84 902 116 -850 -1109 395
2829 395 640 -285 -1108 -443 404 408 -805 -1096 18 640 -149 -1158 -750 517 771 -333 -1054 -578 465
2848 465 751 -413 -887 252 715 372 -307 -342 346 1092 5 -479 -445 806 970 18 -962 365 1163
2867 1163 526 -624 -715 627 1024 180 -698 -322 970 691 -126 -585 -15 1247 346 -660 -835 -38
2885 -38 480 471 -869 -427 326 584 -254 -968 -665 1004 629 -868 -627 145 697 61 -1225 -671 631
2904 631 423 -195 -960 -450 674 369 -455 -835 -54 616 326 -638 -598 625 756 262 -658 -147 744 554
2924 554 -65 -781 309 1014 595 -493 -727 484 1346 207 -481 -201 661 921 -157 -1000 131 850
2942 850 679 -426 -776 264 799 -157 -442 -558 230 756 -152 -800 -155 619 242 -634 -831 6 889
2961 889 -304 -1031 -507 560 505 -583 -1330 -6 1079 68 -677 -950 -160 679 37 -911 -354 143
2979 143 622 -101 -1155 -163 679 860 -482 -608 186 891 368 -758 -177 802 871 103 -694 -249 662
2998 662 271 -269 -482 -45 1089 674 -564 -761 295 1237 130 -877 -453 713 418 -485 -433 -171
3016 -171 600 284 -534 -1005 347 804 -81 -972 -548 562 474 -632 -1323 -229 727 394 -865 -976 32
3035 32 566 -109 -854 -544 597 616 -432 -705 -152 624 415 -521 -860 38 706 209 -629 -196 708 963
3055 963 -43 -657 193 1023 548 -445 -804 416 1307 303 -562 -224 666 760 27 -1018 43 737 756
3074 756 -336 -865 158 806 -34 -766 -361 182 570 -9 -1002 -335 319 191 -493 -1210 -320 516 175
3093 175 -802 -687 40 450 -313 -969 -445 535 -33 -321 -797 -181 727 341 -1082 -669 388 438 324 -797
3113 -797 -536 706 855 -237 -472 -126 1144 710 -470 -215 510 799 205 -679 -501 703 920 180
3131 180 -458 -49 747 483 -167 -573 184 813 238 -646 -419 339 719 -117 -809 46 435 448 -337 -984
3151 -984 -98 554 237 -615 -732 -66 570 -439 -809 -345 464 381 -462 -696 -148 893 96 -733 -389 32
3171 32 476 -235 -924 -116 464 540 -47 -652 -216 639 441 -631 -639 402 1215 123 -689 -344 988 490
3191 490 -231 -512 -16 762 437 -227 -300 383 1033 34 -566 -361 530 638 -283 -714 -103 920 424 -587
3211 -587 -716 -14 549 -24 -367 -627 332 376 -84 -874 -389 515 159 -945 -951 47 430 31 -859 -814 400
3232 400 336 -464 -690 -86 217 435 -550 -472 296 658 122 -501 -648 440 964 -20 -635 71 779 727 -315
3253 -315 -889 200 1102 254 -487 -498 315 958 111 -456 -101 649 537 86 -270 59 763 424 -608 -802
3273 -802 198 560 30 -976 -550 523 443 -445 -740 -78 677 59 -861 -760 44 480 -224 -902 -240
3292 -240 248 -6 -108 -800 -263 594 -23 -606 -466 -78 524 302 -661 -354 529 705 16 -838 -261 605
3312 605 438 -252 -609 259 720 542 -291 -27 544 713 4 -683 96 654 540 -212 -414 166 968 352
3332 352 -399 -456 331 735 -79 -388 -203 477 610 -786 -585 182 749 265 -508 -704 419 618 -192 -983
3352 -983 -436 254 362 -491 -684 -174 291 367 -639 -933 142 437 -334 -605 -428 265 603 -260 -832 -159
3372 -159 729 388 -470 -760 147 819 86 -305 60 38 811 -21 -566 359 1033 526 -229 -292 197 829 259
3393 259 -363 -360 181 822 5 -501 -153 516 289 -253 -429 69 739 -64 -847 -370 248 577 -364 -753 -454
3414 -454 430 287 -320 -659 -226 441 18 -596 -632 336 373 -310 -629 -638 554 426 -437 -637 27 531 319
3435 319 -644 -632 205 244 -65 -408 -246 670 686 -233 -669 335 561 520 -220 -542 269 579 20 -613 -84
3456 -84 395 776 -378 -401 136 352 168 -254 -270 530 576 -68 -196 -206 303 376 -297 -839 -90 237 372 -435
3478 -435 -684 -144 558 -16 -604 -425 192 212 -546 -800 -16 351 412 -445 -772 -172 614 -389 -702 -388
3498 -388 5 594 -222 -737 -262 696 416 -289 -635 -19 667 213 -579 -297 398 789 -39 -708 -92 704
3518 704 412 12 -543 -370 719 547 -253 -330 416 714 222 -393 -290 606 406 -364 -953 -103 412 305
3538 305 -257 -412 172 428 -30 -428 -361 354 312 -167 -585 -483 143 -58 -377 -470 222 236 45 -720 -470
3559 -470 -55 686 -13 -767 63 489 436 -546 -677 240 649 95 -581 -455 442 490 -163 -142 4 385 577
3580 577 -152 -430 291 614 288 -340 -433 505 891 -32 -397 113 747 307 -160 -648 160 741 269 -356
3600 -356 -647 63 840 -302 -635 46 412 256 -327 -592 -136 489 58 -430 -617 -77 355 206 -740 -471
3620 -471 115 432 -287 -698 -262 827 127 -436 -576 178 359 318 -479 -174 295 566 -152 -241 -33 485
3640 485 234 -468 -203 78 614 234 -400 -356 644 320 85 -354 -63 548 640 -243 -352 160 796 152
3660 152 -367 -292 420 498 -97 -145 -362 112 563 -353 -752 -37 476 -61 -479 -795 172 340 29 -877 -585
3681 -585 363 138 -714 -781 93 226 5 -608 -524 -12 638 -292 -734 -214 374 146 -319 -749 -83 536 -38
3702 -38 -385 -134 186 511 -152 -484 -73 369 583 3 -229 404 592 348 -172 -61 208 821 258 -426
3722 -426 -257 430 601 -233 -583 -81 840 247 -303 -268 -153 198 83 -496 -352 241 478 -82 -696 -648 210
3743 210 297 -527 -582 -165 365 77 -770 -552 275 106 -601 -431 -474 237 419 -481 -329 -315 457 219 -271
3764 -271 -540 286 459 -8 -215 -345 636 567 20 -529 297 488 2 -318 -113 617 981 23 -344 -182
3784 -182 633 587 -171 -348 51 438 434 -226 -88 212 716 12 -537 -122 261 501 -258 -473 52 398 14
3805 14 -648 -505 -131 537 -250 -661 -336 254 236 -146 -795 -62 326 -81 -502 -541 4 463 227 -412 -253
3826 -253 328 505 -226 -573 -388 326 126 -424 -453 239 642 351 -280 45 445 741 144 -534 211 600
3846 600 515 -388 -485 134 419 319 -422 -435 452 399 -6 -390 -292 380 244 -363 -389 -76 206 161 -528 -319
3868 -319 110 401 -7 -365 -534 450 144 -402 -510 -214 186 91 -553 -838 199 489 -260 -330 -148 178
3888 178 431 -159 -419 -132 438 157 -330 -181 316 531 175 -374 257 314 549 -27 -125 277 495 704 -244
3909 -244 -400 445 695 388 -537 -205 487 496 433 -680 121 583 622 -51 -386 79 469 289 -228 -235 111 212
3931 212 -106 -267 -160 434 -181 -224 -761 -72 361 81 -603 -594 -122 276 -144 -509 -646 88 195 -106 -304
3952 -304 -95 179 188 -468 -350 307 294 116 -429 -282 337 545 -222 -162 -54 392 436 -356 -206 391 405 270
3974 270 -210 -133 716 652 -322 -370 -84 266 313 -416 -287 368 657 -233 -91 41 113 364 90 -488 -242 527
3996 527 87 -583 -493 241 204 -57 -427 -539 -103 355 -164 -583 -109 284 178 -342 -258 159 265 172 -318
4017 -318 -256 178 267 144 -430 -213 456 378 -135 -549 -54 424 200 -70 -95 278 409 187 -184 66 454
4038 454 418 -51 -320 167 632 221 -55 -145 223 751 238 -422 -418 540 247 -357 -18 15 168 210 -261 -322
4060 -322 31 333 91 -613 -369 352 38 -293 -623 -176 331 -98 -598 -411 -172 552 2 -148 -685 398
4080 398 202 -94 -548 70 239 359 -453 -760 69 309 98 -318 -139 452 413 132 -274 56 276 327 -97
4101 -97 -487 348 410 -66 76 -176 239 711 -52 -152 -40 399 292 -13 -497 377 459 -23 -428 -471 17
4122 17 384 59 -539 -347 311 340 -239 -551 -433 290 6 -463 -250 -61 254 -387 -698 -400 166 130 -362
4143 -362 -257 -272 644 154 -384 -50 203 386 76 -369 -156 161 491 -29 -211 -313 288 130 -311 -411
4163 -411 140 228 208 -429 -140 152 370 118 -193 60 545 578 -74 -242 84 187 28 -248 -332 420 469 78
4185 78 -221 46 399 548 -267 -453 -67 45 138 -442 -675 468 142 -465 -509 -134 227 384 -291 -551 2
4206 2 58 -348 -463 -430 56 563 -406 -595 -188 444 47 40 -248 291 316 122 -154 -240 135 558 -77 -447 -38
4229 -38 395 143 0 -559 46 127 271 -137 -92 1 328 318 -225 -14 309 225 -115 -73 -77 423 211 -165 -228
4252 -228 108 472 -55 -560 28 44 165 109 -498 -365 259 73 -398 -492 84 4 -55 -603 -154 142 54 -295
4274 -295 -489 82 209 294 -191 -415 139 331 201 -371 -333 508 497 -170 -463 -135 366 335 -208 -453 56
4295 56 313 -60 -103 -254 319 557 19 -81 -43 291 541 154 -188 173 542 -184 -186 -250 172 119 -258 -126
4317 -126 -217 -296 238 -134 -562 181 124 306 -492 -337 -46 245 -148 -320 -245 105 206 -427 -697 -52 110
4338 110 -96 -199 -370 -9 405 -28 -370 -83 217 67 -406 -380 -54 334 208 -57 -334 55 604 133
4358 133 -174 -121 421 261 18 -381 -29 137 136 -132 -92 119 293 172 -202 -378 504 211 -70 -125 -191 386
4380 386 269 -107 -254 -268 167 412 -300 -463 382 118 -11 -218 -257 389 123 -241 -209 131 251 56 -237
4401 -237 -229 44 77 251 -306 80 122 270 -134 -357 -103 321 44 -245 -193 69 99 -72 -186 -284 321 36
4423 36 -134 -329 231 90 172 -223 -260 157 79 54 -74 -294 248 493 121 -243 187 350 244 -25 -407 298
4445 298 99 -293 -266 -93 145 365 -182 -530 -157 203 62 -72 -466 -53 405 87 -233 -48 -63 112 5
4466 5 -493 -193 55 339 -168 -256 -123 400 -66 -250 -128 169 267 -9 -403 18 402 361 -182 -245 288 194
4488 194 254 -270 -194 147 385 -112 -282 -82 211 410 -115 -157 42 251 256 -145 -129 351 528 -238 -324 -187
4510 -187 269 371 -40 -301 -99 206 293 -183 -393 99 425 68 -138 -147 56 23 47 -530 -93 169 -25 -453
4532 -453 -647 -85 1 -32 -351 -347 159 -145 -94 -506 142 272 76 -6 -416 147 472 21 -461 -75 233 195
4554 195 -95 -333 -103 377 192 -132 -203 181 349 63 -87 5 260 24 -73 -200 17 132 87 -350 -84
4575 -84 8 229 -111 -206 260 -78 325 376 69 -9 189 41 -182 -361 -64 132 32 -422 -396 -51 74 81 -446
4598 -446 -39 -4 75 -498 -152 -479 236 -22 -341 -136 -139 218 17 -135 -201 297 336 -152 -144 -190 407 193 -79
4621 -79 -218 362 220 -14 -177 -103 -8 305 28 -64 179 260 448 -373 -93 103 255 363 -420 14 138 226
4643 226 44 -244 -46 107 98 -153 -85 262 311 -57 -165 -143 241 215 -323 -442 -63 32 -81 -230 -496 -110
4665 -110 131 -2 -164 -288 0 49 168 -303 -162 438 136 -74 -137 -109 158 329 -469 -271 350 29 43
4686 43 -104 106 389 297 -116 -86 -62 274 -86 -168 -96 153 271 194 52 -39 126 199 168 -85 67 272 103
4709 103 -147 -235 114 223 -65 -289 -59 500 110 -217 -188 1 187 147 -328 -407 135 142 117 -463 -204 9
4731 9 -58 -354 -381 -180 119 156 -122 43 113 376 78 -158 164 190 330 -240 -136 78 109 171 53 -55 20
4754 20 405 284 -220 -295 278 369 -140 -375 251 50 -17 -26 -60 140 163 -43 -87 -284 219 184 -10 -314 -310 213
4778 213 117 -117 -221 226 430 -161 -291 -136 56 162 -165 -136 -205 -12 -129 -88 -268 -145 136 -138 -231 -427
4800 -427 18 -11 33 58 -314 77 173 86 -358 -95 56 182 -74 -291 397 54 243 -388 55 149 -33 -228
4822 -228 89 -59 489 187 -163 -238 184 356 126 -160 -13 349 161 112 -384 31 177 249 -28 21 137
4843 137 366 -217 -249 -207 53 31 164 -147 -184 -124 246 -493 -407 -134 188 -126 -348 -327 -262 235 -301 -217 22
4866 22 -61 -25 7 -138 75 172 -62 107 -105 -28 200 -189 -30 -179 -29 380 -280 -412 -141 305 64 59 -28
4889 -28 214 210 133 -169 10 328 165 -135 -130 114 33 32 -75 95 -80 272 -171 -147 -75 89 16 -36 -302 15
4913 15 39 182 -286 -218 -42 29 -243 -159 -218 188 44 -328 -361 -36 67 79 -445 -177 3 106 -3 -98 -189
4936 -189 136 51 -67 -498 -323 264 133 -41 -229 -83 54 131 -171 46 -12 108 -128 -114 24 336 110
4957 110 -230 22 98 362 87 14 -284 404 21 -49 -93 -44 20 206 26 -137 447 247 101 -91 160 61
4979 61 361 -363 -215 -173 171 -48 -293 -256 -126 238 -130 -264 3 -185 234 116 -354 30 -116 218 -148
5000 -148 -134 -322 246 50 -449 -146 81 187 -175 -180 2 462 152 -5 -22 8 218 -161 100 -77 158 431
5022 431 -58 -358 110 236 134 185 -343 73 406 59 -162 -381 228 90 -68 -107 -274 61 -13 124 -251
5043 -251 -89 56 56 -311 -358 -29 334 113 -75 43 248 102 -125 -101 -191 147 159 -93 -399 10 45 -127
5065 -127 -89 -167 228 -55 -205 -159 -5 -47 318 -94 -285 241 343 -4 -296 -102 195 183 59 -280 -170 44
5087 44 239 -159 -354 19 221 200 -299 23 -6 142 374 -185 -67 149 -123 -181 -365 96 252 126 -116
5108 -116 -82 -143 91 -211 -271 -87 334 -128 102 -299 -187 197 -53 -26 25 114 173 210 -400 -228 -155 -129 -81 -283
5132 -283 7 53 -102 -61 -30 26 113 216 -97 -75 133 56 -25 109 54 170 140 -41 -238 -64 384 84 86 -108
5156 -108 274 106 107 186 178 158 39 -226 -13 -118 250 -49 -191 188 147 178 -495 -147 -79 137 101 -405 -230
5179 -230 -143 192 -6 -293 -144 -99 374 -305 -272 129 45 130 -396 -424 -287 326 49 -77 136 59 177 -311
5201 -311 -156 59 180 -36 -32 58 -223 159 -129 -166 -187 131 244 80 -251 -94 26 251 49 -76 -3 179
5223 179 222 -270 -142 164 -12 -89 -42 -116 124 311 72 -241 3 212 -23 -68 -330 1 -36 -210 -337 -152
5245 -152 126 176 -75 -156 -139 278 -96 -224 -225 68 422 -95 -222 -145 -43 -113 37 -71 -120 87 -165 -68 -225
5268 -225 79 180 -45 -66 3 183 100 -185 -168 -88 340 41 36 -177 171 376 122 -115 1 17 -292 -49 -103
5291 -103 -100 111 320 46 -30 -76 198 -273 56 26 -31 146 330 -87 -171 284 308 -122 -327 76 37 -16 -249
5314 -249 -140 33 122 -23 -168 73 73 121 -203 -215 290 16 24 -375 -192 58 106 -253 -290 156 -56 276 -264
5337 -264 -405 197 35 171 -118 -23 100 84 -6 -14 -1 207 106 176 88 75 459 260 303 146 -150 8 202
5360 202 -108 -68 50 104 131 -77 73 -74 -3 -83 -12 -44 273 -47 -17 111 399 111 -212 11 -110 173 108
5383 108 -225 -230 73 91 66 -286 -350 109 367 74 -136 -168 219 339 -168 -313 86 121 -138 4 -147 -210 437
5406 437 1 -414 -125 59 386 -72 85 262 201 33 -126 60 460 237 -20 -236 -75 -181 104 -5
5426 -5 36 109 -97 379 -34 -108 -42 37 -26 -205 33 115 -8 57 16 -144 160 223 -230 -243 -393 -129 123 -208
5450 -208 -32 17 -53 -116 42 -205 243 -49 -192 -27 -31 151 5 37 -125 -113 351 20 -341 318 408 181 -301
5473 -301 10 -30 308 151 -180 87 42 157 -54 -92 25 431 53 -90 -75 24 161 121 -221 13 40 406
5495 406 -16 -15 -34 -9 9 -53 -523 -51 74 130 172 -179 6 169 57 -410 -105 112 281 -142 -239 52 -67
5518 -67 141 92 -323 33 231 135 -120 -226 -16 150 -378 -70 -148 165 -8 -111 96 22 154 -121 91 -108
5540 -108 165 239 -116 -42 -12 61 3 -30 -336 121 151 151 19 -132 199 163 111 -10 97 444 6 -28 -184 192
5564 192 316 -152 -69 -216 -12 -197 47 -128 36 204 -125 -61 -58 -8 -71 -80 -206 -173 -79 96 79 -190 -78 107
5588 107 -170 -33 -227 108 121 -13 -363 -15 2 82 -132 185 -28 257 -189 -164 -48 8 66 -32 67 88 157
5611 157 28 102 -66 -187 129 -103 118 -149 -76 245 363 -90 -22 179 131 280 53 107 148 242 -77 -345
5633 -345 235 23 -87 13 251 32 116 -310 -188 -98 -129 206 -168 -213 -293 217 -226 -32 -88 -6 421 57
5655 57 -157 -361 2 148 106 -172 -98 -30 143 -41 -141 -122 97 -246 -405 -261 162 140 -210 -22 25 102 -48
5678 -48 90 -229 2 190 -48 -155 -229 95 390 -109 -145 -32 -33 -117 -140 1 78 111 34 -280 9 -149 112
5701 112 -410 -67 84 230 13 -83 -190 -103 -48 122 -277 -225 -171 -17 3 -319 87 40 13 -423 -471 -24 53
5724 53 -117 105 228 143 194 -63 -65 39 38 122 -204 -13 274 69 174 63 -115 -91 140 79 129 -92 44 169
5748 169 152 -16 -262 129 271 2 -457 62 105 250 10 -106 108 129 16 -104 -122 129 144 -353 -406 -64
5770 -64 135 33 -161 -341 -6 66 137 46 -46 16 8 -8 47 148 466 -188 -182 174 -279 -4 -38 -140 -17 -28 53
5795 53 -272 22 -26 238 -151 -126 -145 186 -14 72 -261 -67 143 294 -67 -69 -25 193 104 -12 -114 120 249
5818 249 133 -1 311 387 76 45 21 104 282 35 -219 -109 228 -92 -303 -221 -67 56 27 6 -176 -172 -90
5841 -90 137 -84 -123 -130 -139 12 -312 -275 193 358 -320 -367 140 -105 148 60 -290 131 126 165 -114 -212 103 243
5865 243 -28 -195 -98 102 -109 -4 -42 -56 121 150 -222 201 -105 93 280 -50 41 132 288 -131 -217 246
5887 246 436 157 146 -56 118 47 -68 -82 -89 153 -35 99 -26 118 300 -331 1 -66 -169 20 -18 -50 59
5910 59 220 113 -274 -267 -273 299 -23 -255 -86 -264 99 -6 -67 -241 14 150 -246 -81 -32 210 -11 94
5932 94 252 97 -144 -128 -351 -168 121 155 -119 -286 123 299 201 -247 115 154 281 117 -62 -87 58 163
5954 163 -47 141 89 95 146 35 -84 19 309 -102 -58 13 140 155 -143 -269 32 -153 159 -67 -158 -295 41
5977 41 -163 -266 -112 -110 132 -339 -255 -60 -40 -192 234 -194 -82 205 120 -19 -150 79 234 -29 -294 90
5999 90 258 -7 100 34 14 346 280 37 1 -168 35 66 -141 -144 210 -83 -205 -158 -65 158 68 -70 -181 254
6023 254 123 -114 -77 -105 -38 80 -38 -227 -162 156 133 -190 -190 100 159 -277 -107 81 -39 -103 138 -253 -263
6046 -263 144 117 -344 -15 -222 215 -138 -134 118 330 72 -336 -189 146 -53 107 -211 -126 428 78 21 84
6068 84 83 2 66 -261 -10 114 99 287 264 -417 -20 278 60 -121 -362 -89 -17 94 42 -251 -217 148 -254
6091 -254 -323 -170 159 256 -111 -84 -155 42 115 84 -141 39 362 51 -43 -293 270 105 -148 -18 -104 -32 -84
6114 -84 4 -215 -55 190 177 -97 124 211 -190 -57 -2 -89 23 13 -180 -146 -5 162 113 -40 -66 124 288
6137 288 -51 69 192 288 90 66 261 23 -68 11 -50 12 306 207 -354 -58 -15 -201 -24 157 -45 -17 131
6160 131 76 58 -147 72 35 83 -151 17 -96 -52 -77 -359 131 24 -53 -138 136 210 60 8 -114 100 352
6183 352 89 -132 -224 77 456 156 220 -257 208 98 90 -129 96 223 70 -32 88 392 57 -95 93
6204 93 332 7 -119 -213 -71 181 233 -184 55 -62 -41 206 115 98 -6 32 129 18 38 67 169 -18 -134
6227 -134 -24 273 36 -64 -76 -169 -69 20 -45 -256 123 -114 -121 -46 -109 46 -224 308 -59 140 113 130 -140
6250 -140 -218 -101 68 -114 202 280 72 236 339 -229 57 -31 74 27 34 10 114 -158 -358 -110 37 -36 229
6273 229 -252 -53 19 -8 194 -75 -10 35 259 38 -165 388 105 184 -56 48 -13 -95 196 -301 -8 119
6295 119 219 -179 -151 -51 322 242 -226 -156 160 47 -187 -96 -298 473 51 -305 -30 141 70 241 -110 -161
6317 -161 101 356 6 -172 -339 78 308 175 -109 305 326 442 -139 -118 -97 254 154 49 -83 -212 71
6338 71 221 205 126 384 -58 -7 -154 54 100 -55 81 -81 -192 223 124 22 -39 40 211 157 -200 179 87
6361 87 -56 -97 -174 -109 54 -135 -123 -109 -35 -5 -120 -152 -266 170 -65 -52 -49 22 35 7 187 203 9 105 -47 -153
6387 -153 83 -78 213 -162 -61 59 331 13 -84 -59 123 -85 -86 -42 -18 28 203 160 -3 121 102 -68 329
6410 329 87 33 106 9 -220 82 201 -96 -186 -324 -279 194 -37 -119 -41 88 9 -24 -243 37 56 -36 -156 -76
6434 -76 -4 -67 -38 -142 -108 48 -1 -158 -240 -93 93 -71 -425 -83 -34 134 201 -23 -131 130 228 145 68 175
6458 175 6 -33 -147 79 -170 -51 124 -198 -160 -35 101 -3 -120 -27 157 72 -98 -79 95 184 -84 86
6480 86 -31 82 146 -88 -86 -364 250 188 11 -193 110 236 53 -175 -166 -196 235 -85 -28 -109 -60 110 -101 -154
6504 -154 -146 182 57 -178 -403 -84 192 103 -312 -101 -102 30 -108 183 -336 253 208 -148 23 -12 20 234 -34
6527 -34 -52 254 107 144 -180 212 -92 137 -46 -249 213 117 158 -110 -143 119 250 80 -74 185 35 -82
6549 -82 -54 -343 157 30 99 -183 -43 63 -40 175 29 -123 71 195 -161 -250 -222 72 43 -40 151 103 130
6572 130 -410 -296 -151 -122 43 68 -42 -58 119 37 16 61 -38 -45 193 59 -103 47 367 56 130 -46 90
6595 90 98 234 41 123 390 0 7 -32 166 155 -83 -172 76 -104 89 -149 -29 -143 72 -2 -110 -97 150 412
6619 412 -74 -505 -328 39 -81 -389 -345 -39 -24 -133 146 -88 -30 -73 -347 -153 18 -40 -4 -210 -63 84
6641 84 191 276 27 -133 -168 186 -70 -14 49 -112 232 161 224 -183 121 363 -88 93 -264 143 142 -27 -151
6664 -151 238 231 -18 33 -81 246 -84 -44 -132 -81 152 -184 177 84 -49 50 -339 -238 -243 71 319 -230 -95
6687 -95 -96 -39 -84 -57 -221 129 191 171 -364 -169 -164 -45 43 10 -31 3 197 -172 137 -15 -126 38 -183 -93 -264
6712 -264 -51 47 -298 -46 -65 334 -151 -52 224 128 -127 -249 -2 203 239 55 -214 159 46 484 13 179
6734 179 -117 40 214 327 172 -108 67 57 -390 -160 12 -39 -27 -151 124 179 -66 -63 -219 215 25 -43
6756 -43 -196 -106 227 -118 -134 -204 96 26 -47 -107 59 109 -167 92 -187 32 265 -9 -237 -55 -38 155 56
6779 56 -74 37 111 86 -59 137 -45 212 63 122 -232 -62 234 -154 -34 -79 96 339 75 -143 319 211
6801 211 -28 -151 40 -96 -11 -68 -297 -165 263 324 35 -151 156 -176 81 271 -272 13 -65 -143 -120 -261
6823 -261 -250 44 39 132 -142 -11 -102 59 -15 147 -88 4 -203 -24 -68 201 -106 42 43 -65 212 199 -320 264
6847 264 193 118 37 128 -72 129 102 83 -161 327 -37 -221 -78 78 307 81 -134 -32 -116 -31 168 9 -81
6870 -81 102 193 -45 -23 -154 -47 -4 329 -144 -115 -45 42 -442 -182 78 -5 -217 -102 -107 68 -209 -299 -408 69
6894 69 -32 -110 -143 -168 87 114 136 -369 -51 87 192 -208 -102 98 94 154 84 -149 -9 178 170 -195 -20 168
6918 168 86 -79 -154 -58 -21 167 33 -350 177 187 68 -87 -227 -161 62 99 -329 15 103 4 -104 -201 -189 106
6942 106 -63 161 -47 -152 273 -203 -179 -93 -23 -117 -353 -165 -36 -76 174 62 135 -117 123 22 -131 60
6964 60 -21 -241 -156 -425 -184 342 91 220 -19 -202 232 32 -59 -73 191 4 -429 -342 -88 15 -63 -19 255
6987 255 181 46 34 10 143 489 168 27 -194 -137 381 -62 -117 7 294 236 -29 0 54 105 255 -13 -26
7010 -26 -167 62 -21 69 -77 297 -239 3 -150 -22 28 239 -187 -204 54 226 54 205 -61 -64 50 -31 -16
7033 -16 57 135 169 -14 -23 -38 -256 335 -39 87 -9 22 143 -139 132 -4 -85 15 108 -160 160 187 -101 -26
7057 -26 -61 30 150 -119 -278 -25 361 154 -159 -229 435 117 -36 -83 2 41 97 -222 3 -30 85 75 -276
7080 -276 -100 98 4 -323 -203 -301 290 175 -168 -406 -190 161 -43 -235 50 50 304 -52 -40 -123 30 125
7102 125 181 -393 117 290 233 -122 -108 173 25 237 -14 29 -57 52 -137 31 192 126 131 33 -123 248 197
7125 197 -8 -116 321 62 -18 -30 -56 -175 109 256 107 139 -161 325 -201 -258 43 -129 71 91 -238 -127
7147 -127 191 -156 -97 -134 -112 -121 63 -25 -10 25 -65 -26 64 -258 106 -49 -313 70 -17 212 75 -217 247 -144
7171 -144 12 192 -8 -2 116 -78 89 -102 -91 281 12 -190 -345 -118 167 56 -114 88 95 229 191 -218
7193 -218 112 -92 135 -249 -127 224 181 43 -107 -235 214 104 10 4 65 313 153 -192 -125 430 457 87
7215 87 -62 -160 -68 57 -169 -287 57 97 -136 -17 -92 -133 -57 -238 5 77 255 60 139 -126 264 162 74
7238 74 -309 -188 -54 241 153 13 -38 38 236 -184 27 3 26 242 -79 3 230 168 -19 80 439 91 158
7261 158 -32 42 199 -135 166 -187 27 -124 131 62 -381 -20 240 267 -288 -192 -65 303 -75 -9 -36 -76
7283 -76 -90 -82 -303 -88 15 105 -110 -209 256 152 -14 -71 -187 198 10 60 -117 91 285 11 58 120 190 6
7307 6 293 -220 67 31 132 26 77 64 104 67 -11 -46 181 35 51 203 -193 185 55 -71 31 -138 28
7330 28 84 -250 -100 -204 160 -8 3 -140 9 -98 -175 208 27 -258 -94 -6 -30 -145 -99 -95 -141 178 110 -70
7354 -70 215 -268 -239 219 -60 -93 51 -87 102 102 10 -51 56 -43 82 -240 -293 -17 138 72 81 -16 340 -63
7378 -63 -222 -66 -33 483 -26 45 220 83 192 -24 -223 127 169 169 -127 -23 63 -51 -248 177 -280 -51
7400 -51 -31 -133 -160 88 13 14 -84 -151 -177 -52 -251 -144 -7 -182 118 -61 -239 107 -183 89 -202 -240 -279 -60
7424 -60 -21 -241 -164 -241 319 72 -121 -259 189 -7 96 -211 23 202 7 -144 -195 -158 222 176 -55 -114 147
7447 147 210 173 35 -171 132 146 -50 -115 261 -209 110 -8 -432 68 240 -31 58 -322 147 209 282 10
7469 10 57 244 -11 18 -225 -38 -154 -183 -391 -238 14 166 -135 -240 -95 -100 -156 -322 98 -150 -135 160 8
7492 8 -150 -4 149 51 14 -82 351 447 -14 -240 -205 -59 -95 143 28 2 114 91 -229 109 138 117 -9 -345
7516 -345 90 73 172 -206 -66 152 105 103 -83 -98 146 -55 -49 -145 137 71 217 -121 -127 78 -114 11 -379 -395
7540 -395 -66 -36 80 -10 26 56 -51 167 -94 36 13 -36 -96 -100 144 175 471 -83 -203 -13 97 316 -337
7563 -337 -85 56 156 -58 256 302 406 63 -34 273 273 172 103 -206 122 155 -10 -3 -27 123 91 28 -78 21
7587 21 175 212 -18 -54 -116 -13 -337 -91 -152 -29 77 139 -185 -140 59 16 -173 -237 -106 83 41 -275 -340 70
7611 70 -280 -228 -232 -235 87 148 -103 60 -58 119 113 -43 -66 201 420 10 -65 -99 223 157 -176 -59 58 210
7635 210 -1 231 223 58 57 257 -124 -16 76 -74 -157 -98 -123 -11 -99 -174 -82 74 80 154 -53 -14 189 205 208 -196
7661 -196 10 -28 0 3 144 180 78 -135 -341 -196 15 162 -79 -287 -228 131 67 -128 -192 -298 13 -114 154
7684 154 -212 206 -67 -84 -150 -44 43 -170 -54 -372 67 67 284 42 -339 -70 287 55 52 60 274 149 53
7707 53 -290 -46 117 244 83 -18 91 140 58 -21 -69 267 -69 -31 -8 -281 53 204 -11 84 -41 72 134
7730 134 -181 -186 -171 20 -28 218 -164 -93 65 -167 -241 -155 43 -39 -224 -94 68 -95 141 -191 -47 19 -18
7753 -18 -80 52 148 354 79 93 -87 -355 58 -117 55 -92 -104 249 -188 -57 7 87 -141 15 -258 107
7775 107 446 93 -37 55 -79 30 -80 -2 259 -192 -247 109 -186 158 -188 192 -221 -148 -68 -130 -117 30
7797 30 -79 68 14 1 -170 -209 129 -128 -19 -112 -53 80 185 -275 36 -65 -88 -213 -243 -152 -32 6 37 -20
7821 -20 142 90 118 43 20 132 45 84 212 -24 277 -9 -51 -349 242 20 108 -30 -144 184 27 19 89 -105
7845 -105 140 -231 -151 -313 57 128 -199 -142 -113 -342 141 156 -45 74 153 236 -125 49 -128 -202 -125 -152 -22
7868 -22 -180 76 36 -179 12 67 132 -250 -111 33 86 -19 -104 62 43 197 59 -202 14 -52 13 -84 -386
7891 -386 40 3 -105 -164 170 110 137 -114 -283 -7 256 28 73 43 -23 354 44 -122 17 18 230 97 -60
7914 -60 -141 192 79 1 -221 -181 82 110 -75 -181 27 -50 -29 -242 -184 231 -151 -184 -81 -56 99 48 -65 -203
7938 -203 -96 82 -148 -217 51 -109 -27 4 16 -22 83 64 0 -53 181 156 152 -346 -60 -2 171 -3 -370 21
7962 21 190 394 52 106 8 227 -60 -184 169 85 123 -50 8 96 23 163 36 -223 45 -79 104 -159 -192
7985 -192 121 -6 27 -116 -116 -24 118 113 -56 -216 75 -8 298 -169 -46 253 -258 -511 -49 -29 -78 -34 -98 -296
8009 -296 281 -10 82 79 40 106 -24 30 -108 77 224 33 -8 12 82 -92 110 -191 396 106 95 174 15 -32
8033 -32 109 262 278 122 140 206 240 -11 252 -89 -34 -86 -58 1 -162 65 -128 -72 26 220 225 -145 -193 91 -337
8058 -337 -93 62 117 -150 -141 -100 -66 199 76 16 -27 -93 175 -78 -26 -191 -160 -215 113 -78 -184 244 70 117
8082 117 14 129 -13 261 -165 230 377 78 190 -146 -215 322 235 110 37 -64 8 -273 -105 280 66
8103 66 123 70 -134 66 101 241 57 -5 -201 287 -163 -159 -69 -1 -160 43 -68 36 -109 -174 -29 88 -203
8126 -203 384 -206 200 -186 -53 57 -222 -119 -277 117 -194 -24 -15 60 -87 -62 -203 -82 111 -1 142
8147 142 63 14 -38 155 -18 -130 222 141 145 60 -32 134 -116 -314 90 -64 168 346 -252 7 78 125 -66
8170 -66 -48 -143 -151 10 126 113 -6 192 45 -135 -127 175 5 478 -118 149 143 139 113 -59 -60
8191f0
$$ Imaginary data points
##PAGE= N=2
##DATA TABLE= (X++(I..I)), XYDATA
0 0 0 0 0 0 0 0 0 0 0 -8 8 -8 8 -8 16 -16 24 -24 32 -39 45 -53 63 -72 85 -97 116 -133 150 -173 198 -226
32 -226 254 -288 326 -365 410 -459 512 -568 634 -703 778 -863 953 -1051 1158 -1276 1406
49 1406 -1549 1707 -1881 2075 -2292 2535 -2811 3127 -3495 3924 -4436 5060 -5837 6835 -8170
64 -8170 10052 -12899 17685 -27209 53327 -272773 -811018 80562 640774 110764 -467314
75 -467314 -178798 253271 170335 -131312 -137298 -9323 82881 117341 29750 -171578 -160202
86 -160202 127121 286587 -3705 -309303 -101964 281762 182927 -174834 -186598 97028
96 97028 184465 1084 -120128 -47406 40431 88394 84656 -51628 -154381 1454 170043
107 170043 47682 -137321 -48383 121765 34264 -125416 -39564 92920 32509 -39766 -14523
118 -14523 -26665 -55997 10849 88170 17944 -108901 -66306 68802 38989 -67736 -17533
129 -17533 70526 -14544 -124842 -13678 146196 28941 -162645 -42464 151580 30362
139 30362 -156981 -39355 160767 70837 -137963 -85692 99381 74396 -45332 -21434 33252
150 33252 924 -11521 30843 19829 -39853 -4800 88464 38221 -90825 -54589 85600 90174
162 90174 -29826 -75287 10203 63329 1818 -32245 14871 21397 -12214 -3737 6235 -20205
174 -20205 -15488 41795 43683 -53855 -85081 24453 79623 -4679 -63690 -23776 21813 10738
186 10738 -22902 -23117 -1814 10254 14626 -15338 -61212 -21400 62407 41689 -57755 -72131 24896
199 24896 71352 -17094 -75197 6813 68496 3589 -60131 -21707 44532 34617 -14913 -13665
211 -13665 2941 -8776 10834 40601 7178 -31057 -1710 38251 15183 -30513 -4545 53059
223 53059 27131 -35254 -25526 23316 35063 10145 -11585 -5685 1955 1990 14605 8790 -18093
236 -18093 -4798 24707 3813 -33934 -18030 32701 30209 -33981 -44745 16643 29591 -17789
248 -17789 -30754 1046 18982 -6375 -33098 -15152 12049 11460 -2522 -23137 -27810 5884 23603
261 23603 -6530 -28758 -7024 25626 10105 -39737 -28155 37924 42412 -20159 -46890 -3198
273 -3198 42722 22184 -21386 -14447 12628 15760 9248 -5228 -12067 14743 34672 7701 -30333
286 -30333 -19796 36480 49668 -10580 -42017 1782 39894 22208 -18561 -24465 14743 33127
298 33127 2690 -25564 -19209 14613 35420 3236 -39381 -25155 22629 34363 -11158 -48678
310 -48678 -7181 42555 8637 -46273 -31192 22482 34505 -12861 -46627 -17492 21851 20444
322 20444 -10170 -34953 -14828 25474 14338 -27883 -27839 12800 33705 -1738 -42857 -17501 34421
335 34421 30387 -13690 -32668 -2245 32737 15927 -18880 -11553 14919 22893 6545 -18278 -11848
348 -11848 24618 33409 -79 -28860 -9408 35348 30335 -17847 -23619 13771 29252 6733 -21617
361 -21617 -13901 22065 26912 -6531 -27415 -10391 23030 23972 -15899 -30782 -182 23702 9037
374 9037 -25678 -28974 13021 29850 -10575 -39345 -15221 22928 19931 -20820 -34019 -772 19453
387 19453 4328 -20344 -24094 6956 26347 -4603 -34336 -14051 23526 26178 -12535 -34294
399 -34294 -2427 28614 14874 -14589 -20460 8781 29712 3184 -24278 -5538 25227 24317 -5278
412 -5278 -24500 -223 31007 21253 -9991 -21014 5245 33004 12576 -22783 -11410 21281
424 21281 23607 -3897 -23794 -5126 25849 18343 -13811 -24425 -628 26897 10867 -27316
436 -27316 -21390 15557 22136 -7112 -31409 -14928 22698 19577 -19101 -32414 -4388 24484 9340
449 9340 -29147 -24812 13162 20230 -7324 -28932 -15497 19819 23438 -13963 -33257 -6576 27674
462 27674 20764 -20409 -29059 9635 28856 5296 -21958 -15199 19981 30708 -5766 -29042 -2651
475 -2651 31475 24848 -13545 -25205 8837 30079 10943 -13301 -13557 11142 26944 4391 -20329
488 -20329 -7212 18958 20615 -5369 -21538 -733 22347 10892 -13494 -18341 3074 22408
500 22408 2880 -25200 -11434 16750 12367 -15103 -23254 2385 18597 -3868 -22264 -8354
512 -8354 10013 7423 -13700 -21090 2157 16876 -1511 -19432 -14127 6027 15612 -2214 -20054
525 -20054 -9288 13196 16594 -7082 -26369 -907 31686 12237 -26200 -21434 19447 36502
537 36502 -742 -34221 -9461 32600 28430 -10205 -28586 2233 36030 16385 -22153 -20006
549 -20006 14663 35078 10284 -28694 -20657 21316 34210 862 -32052 -15820 29596 30030 -16098
562 -16098 -36256 -3891 34453 21730 -29007 -36185 11943 35282 218 -37953 -21306 24795
574 24795 24983 -19400 -33321 -2236 21520 8304 -20755 -22933 4329 17239 2714 -16053 -18548
587 -18548 2099 18707 2561 -19225 -11787 13230 18425 -9801 -24793 4237 27088 5416
599 5416 -18950 -9457 15458 17435 -6230 -13235 6662 16400 6060 -5547 -5547 8395 13869 836
613 836 -6374 84 10114 13440 -381 -13968 -1660 16639 11246 -8044 -13507 5590 17791
626 17791 -395 -18175 -6978 12596 14356 -6885 -22565 -3504 19236 5464 -19755 -17567
638 -17567 8128 18557 -6533 -24686 -7169 12962 7089 -10537 -16919 -2297 12010 2992 -12279
651 -12279 -13166 -414 12024 4913 -14009 -12498 7001 15822 812 -20288 -10057 20589 18424
664 18424 -11345 -16942 5127 19014 5783 -12101 -5494 12812 14537 1520 -10374 -6220 13938
677 13938 17857 -1925 -12739 -1394 16288 14644 -7820 -15666 5551 19886 6155 -14341 -12347
690 -12347 11654 17484 -6214 -18464 -2451 13857 10034 -10649 -18169 423 14422 3009 -15255
703 -15255 -14951 5595 14393 -5765 -19387 -5864 7892 5687 -6690 -14106 -3058 8923 2734
716 2734 -10149 -12450 926 13301 2385 -14304 -8582 7504 11693 -1128 -13704 -2939 14726
729 14726 8997 -8192 -8731 4940 14038 3955 -9703 -2379 11145 10892 216 -9403 -2090 14674
743 14674 12268 -5716 -9575 3631 15585 5459 -12150 -6279 12296 11829 -4102 -12183 -1728
756 -1728 14115 7677 -12245 -11938 4912 12497 1248 -14877 -10393 7999 9804 -5479 -15135 -6376
770 -6376 10281 7572 -12755 -15334 1903 10840 686 -14229 -11613 6735 11014 -4802 -14858
783 -14858 -6431 10193 11768 -7383 -15881 -262 13105 7122 -8955 -11832 6258 15727 1073
796 1073 -11837 -4699 11762 14581 -3436 -13151 2472 15772 8768 -6212 -9717 5153 16772
809 16772 4725 -9978 -5324 9849 13292 -2183 -12612 842 14143 6230 -8008 -9830 3737
822 3737 13140 902 -13271 -5737 7287 8427 -4273 -13185 -2956 9208 3054 -8772 -10647
835 -10647 -25 8722 -345 -13415 -7740 6343 6698 -5598 -13818 -3736 9918 4153 -9201
848 -9201 -9938 842 9999 2816 -10916 -7045 7818 9276 -2136 -10264 -2099 12207 7971 -7248
862 -7248 -8610 4199 14001 6061 -9847 -6511 10887 12749 -678 -8737 -1315 12025 10325 -5338
876 -5338 -8532 3775 13148 6245 -9767 -8666 9341 13375 -1937 -11970 -4643 10092 9939 -7020
890 -7020 -12695 262 9786 3720 -10114 -11356 3965 9976 -2864 -12533 -7355 6041 8513 -6429
904 -6429 -15386 -2924 9775 4990 -10031 -13167 1929 11155 -334 -11422 -6727 5054 9146
917 9146 -2257 -11862 -2069 10321 6978 -6077 -10470 3107 14104 3913 -9549 -5484 7730
930 7730 12368 865 -10278 -1274 12188 8265 -3988 -7321 3142 12969 4886 -7953 -5348 6834
944 6834 11300 1239 -10763 -3966 11432 8908 -5685 -10217 155 10975 4269 -10381 -7993
957 -7993 4356 7785 -479 -11450 -7073 7480 7155 -6726 -12194 -3253 8869 5213 -10279 -12299
971 -12299 2456 8898 103 -11694 -7942 6654 7916 -5822 -10166 -1513 7522 5680 -6491 -9321
985 -9321 2386 10061 3466 -7709 -7543 6749 12128 -1025 -8672 -192 9611 7781 -3807 -6614
999 -6614 4832 10888 2591 -5641 -3580 6936 10421 -736 -7688 -413 8337 7298 -3501 -9017
1013 -9017 2262 10564 1368 -8534 -4589 6271 7597 -4982 -9818 214 7164 2419 -6235 -9264
1027 -9264 -535 7968 715 -9957 -8254 3396 8244 -2966 -13633 -4077 8824 4903 -8292
1040 -8292 -11286 1438 11427 175 -12544 -6102 6738 8444 -1852 -10483 -2921 8979 7277
1053 7277 -2824 -9134 -893 11704 7107 -8181 -7224 6491 11871 1830 -9373 -3192 10852
1066 10852 9989 -2580 -8306 -778 11210 8626 -6109 -8011 4585 10636 2843 -8619 -5867 8038
1080 8038 9021 -4023 -9093 -1048 8399 4379 -7977 -7773 3005 5852 339 -6695 -7501 903 6327
1095 6327 -769 -8635 -6057 4257 6642 -6360 -12097 910 9131 58 -10175 -6887 5702 7058
1109 7058 -4623 -8706 -362 5690 3935 -3206 -5594 1145 5380 2073 -2625 -3810 2315 8716 1998
1124 1998 -6773 -2346 7601 8451 -2075 -7431 2397 10587 3347 -5223 -3347 4181 8354 1634 -5473
1139 -5473 -979 5726 4940 -2021 -6083 712 8979 2000 -7023 -4233 3337 5226 -1029 -6415 -1986
1154 -1986 3702 2119 -2388 -5937 -3456 3904 2837 -5249 -6746 -565 5545 636 -9884 -6535 6295
1169 6295 6103 -5127 -9931 -685 7848 1328 -8522 -3878 4143 4085 -565 -4285 -2562 3293 4702
1184 4702 156 -4697 -2452 6689 8181 -3598 -7937 2716 10370 4438 -6026 -4708 6999 8583
1198 8583 -1407 -5988 -37 7670 5950 -3407 -5249 2161 6426 2882 -4087 -5818 3131 8782 7
1213 7 -8445 -4448 5387 6228 -3889 -7775 351 4728 593 -4686 -6069 -467 5550 291 -7353 -5836
1229 -5836 2408 5935 -2425 -10308 -2461 7016 2858 -6039 -7299 1001 6708 -261 -7216 -2123 4241
1244 4241 3785 -1746 -4810 -854 4944 3787 -1897 -4921 -436 8624 4787 -6592 -5003 6517 8499
1259 8499 -651 -6240 634 8347 3283 -3817 -2676 3214 6367 2442 -4360 -3324 4016 5931 673
1274 673 -5442 -3346 5790 6159 -3766 -7350 -148 6893 2568 -7603 -5354 4407 4344 -3373 -6351 -2579
1290 -2579 3488 3040 -3725 -6369 -2264 4006 3557 -5530 -8298 1946 6591 -649 -7925 -3756 4784
1305 4784 4336 -4061 -6031 1127 5223 1897 -3716 -4773 2627 6457 1372 -4007 -3265 3733 7319
1320 7319 -117 -6517 121 7478 4690 -3765 -4718 4350 7833 -304 -4674 -100 4634 4834 -397
1335 -397 -4431 -387 4630 4285 -1355 -5773 -31 6945 1878 -6400 -3805 3912 4787 -2379 -7704 -697
1351 -697 5552 1046 -5165 -5292 284 4237 559 -5690 -4342 887 3708 -151 -6821 -4055 4871
1366 4871 4024 -4454 -6967 475 6677 1495 -6897 -3416 4350 4445 -534 -4722 -2159 4707 4566 -1364
1382 -1364 -4216 -509 5805 4720 -3820 -4497 3909 6982 1068 -5001 -1966 6664 5576 -2692 -4187
1397 -4187 1337 5393 3155 -2473 -3500 1785 4851 1823 -3387 -3934 2875 5963 -1872 -6442 -1155
1412 -1155 4926 3106 -4842 -5724 1829 4570 -873 -4764 -3424 1760 3343 -1793 -5667 -2054 2378
1427 2378 2438 -2998 -6495 -3 5278 623 -5906 -4103 2755 5489 -1934 -6147 -572 4750 2694
1442 2694 -2301 -3650 583 4961 1521 -2951 -2219 2367 5744 973 -4986 -948 5760 4533 -1598
1457 -1598 -4495 873 7002 2789 -3811 -2217 3284 4813 403 -4037 -1245 3771 3195 -1599 -4050
1472 -4050 -502 4881 2810 -4495 -4556 1676 4699 -48 -5792 -3464 3146 2975 -3099 -4799 -1342 2902
1488 2902 1599 -4388 -4658 910 3248 334 -5109 -4285 2846 4108 -2223 -5616 -1543 4359 3057
1503 3057 -4083 -4320 2095 4501 148 -3499 -2056 3391 4309 -960 -3512 -168 4210 4103 -1451 -3949
1519 -3949 1543 5810 2324 -2712 -2968 3364 5929 -45 -3849 -96 4415 3548 -1892 -4079 1188
1534 1188 4715 1036 -3350 -3303 1686 4808 -323 -5041 -2091 3003 2673 -2292 -5077 -243 3705 461
1550 461 -4165 -3467 787 3485 -1014 -5615 -2494 2679 2649 -2131 -5155 -1581 3904 1595 -3828 -3910
1566 -3910 748 4281 635 -5107 -2099 4014 3323 -1848 -3806 -77 4541 2475 -2927 -2839 1691 4611
1582 4611 1893 -3384 -1894 3573 4285 188 -3062 -555 4508 3666 -2069 -2847 1667 5018 1634 -3686
1598 -3686 -3113 3506 4486 -935 -4013 -1451 3395 2771 -2937 -4280 642 3183 647 -4064 -3369 1958
1614 1958 2587 -1989 -4357 -2175 1651 2578 -2505 -5020 -566 2757 745 -3233 -3974 1077 3589 -678
1630 -678 -4327 -1857 2494 3430 -1697 -4305 931 4472 1578 -3105 -2658 2334 4232 198 -2930 -301
1646 -301 2882 3254 -8 -2656 507 4221 1970 -1461 -1895 1479 4504 1413 -3054 -1668 2924 4054
1662 4054 -508 -4324 -617 4506 2007 -2936 -2860 1302 3554 323 -4175 -1697 2018 2304 -1181 -4051
1678 -4051 -1356 3013 1099 -3083 -3579 -170 2385 1068 -3760 -3689 1116 2651 -508 -4287 -2046 3129
1694 3129 2599 -2911 -3731 330 3570 1314 -3437 -2868 2649 3553 -219 -3124 -974 3716 3095 -1470
1710 -1470 -2467 1048 3220 1800 -1536 -2092 2016 4153 1111 -2687 -1510 2921 4046 -907 -3293
1725 -3293 405 4165 2233 -2415 -3564 1722 4172 -107 -3144 -1547 2307 2351 -1984 -3739 -147
1740 -147 2555 1230 -2117 -3402 3 2720 -50 -3392 -2482 1293 2683 -1140 -4519 -1326 2612
1755 2612 1496 -2363 -3553 156 3431 42 -3725 -2428 1818 3158 -365 -3338 -483 3043 1893
1770 1893 -1353 -2365 602 3844 1645 -2650 -1479 2574 3568 267 -2460 -275 3725 2729 -1174
1785 -1174 -2435 193 3702 2304 -2073 -1947 1957 3381 347 -3208 -1489 3017 2718 -2078 -3149
1800 -3149 231 2563 1145 -2795 -2894 983 2479 -1 -3086 -2714 1420 2299 -1567 -3309 -832 1880
1816 1880 1363 -2713 -3906 592 2739 -274 -3413 -2323 1967 2577 -1708 -2931 -309 2378 1621 -1682
1832 -1682 -2257 1082 3037 637 -1974 -1592 1817 3587 -101 -2810 132 3062 2459 -950 -2323 912
1848 912 3495 1230 -1798 -1043 1884 3139 79 -2560 -59 2588 2002 -1198 -2946 568 3609 752
1864 752 -3080 -2104 1029 2545 -438 -3431 -1287 2112 1206 -1755 -3003 -733 1930 653 -2716 -2524
1880 -2524 588 2075 91 -3684 -2291 2101 1957 -1359 -3100 -784 2735 1297 -2485 -2134 1185
1895 1185 2267 479 -2289 -1263 2413 2651 -793 -2267 -184 2875 2387 -1622 -2096 1412 3066 1441
1911 1441 -1752 -1192 2575 3052 -201 -2026 -266 2575 2352 -1594 -2301 1035 2836 563 -2152 -2182
1927 -2182 1760 2723 -757 -2779 -966 1947 1716 -1844 -2880 145 2171 -112 -2571 -2518 775 2182
1943 2182 -946 -3173 -1409 1480 1655 -1253 -3289 -609 2391 446 -2155 -2337 852 2637 -241
1958 -241 -2875 -564 1968 1787 -830 -2473 223 3100 1072 -1676 -1314 937 2855 984 -2020 -734
1974 -734 2345 2436 -297 -1945 72 2991 1624 -1509 -1495 1002 2666 1031 -2229 -1449 2073 2191 -327
1991 -327 -2542 -1082 2050 1468 -1904 -2312 157 1997 370 -2854 -2029 1376 1484 -1032 -2518 -1277
2007 -1277 1436 1235 -1846 -2642 -242 1656 533 -2267 -2365 1003 2063 -549 -2447 -1161 1808 1845
2023 1845 -1582 -2459 286 2466 801 -1535 -2024 1389 2842 174 -1524 -745 2234 2471 -285 -1896
2039 -1896 578 2752 1503 -1406 -1487 1603 2844 362 -1904 -515 1985 2310 -53 -2214 -146 2308
2055 2308 1168 -1335 -2025 333 2646 145 -2323 -1284 1337 1805 -727 -3014 -782 1798 821 -1769
2071 -1769 -2292 -274 1777 69 -2654 -1507 438 1368 -325 -2214 -1027 1586 1053 -1453 -1968 -197
2087 -197 2320 798 -2258 -1515 1567 2243 159 -1767 -814 2396 1774 -1031 -1276 634 2624 1067
2103 1067 -1511 -1116 1754 2411 150 -1600 -408 2120 2023 -710 -1451 129 1890 1641 -1051 -1588 825
2120 825 1959 -48 -1811 -1194 1399 1838 -1197 -2498 -412 1666 1087 -1912 -2449 682 1628 -426
2136 -426 -1944 -1352 722 1318 -1065 -2291 -487 1037 654 -1385 -2403 176 1981 491 -1513 -1520 995
2153 995 1879 -147 -2296 -594 1915 1359 -948 -1567 504 2495 435 -1603 -724 1348 2193 245
2169 245 -1835 -142 2302 1490 -433 -1191 506 2242 1070 -1332 -751 1113 1725 224 -1676 -821
2185 -821 1875 1563 -521 -2114 -98 2173 1009 -2071 -1897 509 1299 -34 -2134 -1340 1254 1018
2201 1018 -1355 -1873 -600 1159 799 -1588 -1815 587 1129 152 -1909 -1497 954 1605 -678 -1887 -624
2218 -624 1336 1428 -1181 -1690 851 2034 538 -1225 -1088 1516 2167 -194 -1618 561 2445 1720 -718
2235 -718 -1294 932 2068 603 -702 -480 976 2054 68 -1428 -309 1475 1361 -805 -1844 224
2251 224 1623 451 -1643 -1786 594 1648 86 -2018 -731 1217 812 -975 -2161 -403 1636 102
2267 102 -1839 -1440 342 1062 -255 -2328 -1188 976 942 -970 -1807 -275 1644 668 -1083 -1166 451
2284 451 1528 134 -1548 -779 1617 1687 -316 -1666 -116 2335 1372 -1162 -963 872 1959 783
2300 783 -1264 -739 1413 1463 -22 -756 -198 1487 1468 -736 -954 230 1513 1062 -1403 -1429 1041 1505
2318 1505 -518 -1746 -584 1335 916 -1402 -1705 216 941 -205 -1214 -1344 639 1442 -639 -1893
2334 -1893 -966 937 950 -922 -1815 182 925 37 -1243 -1332 411 1547 -291 -1413 -142 777 781 -366
2352 -366 -1319 87 1860 1253 -802 -1556 634 2262 419 -1324 -236 1381 1420 -441 -1151 314 1921
2369 1921 655 -672 -845 418 1810 548 -1482 -517 972 1752 -259 -1561 -613 1352 767 -1181
2385 -1181 -1280 -142 1255 250 -1829 -1254 578 976 -614 -1577 -1024 944 580 -1243 -1731 -246 1400
2402 1400 565 -1839 -1330 608 739 -418 -1339 -732 1326 1051 -871 -1035 173 1212 650 -1070 -1022
2419 -1022 892 1483 419 -1244 -559 1574 2004 -513 -1300 536 1679 890 -777 -861 1276 1641 396
2436 396 -602 -529 1005 1543 -33 -1403 102 1095 649 -833 -1194 398 1605 -81 -1467 -392 729
2453 729 834 -828 -1688 -260 754 533 -851 -1408 -351 1126 -8 -1347 -594 572 1324 -515 -2002
2470 -2002 -322 1083 398 -939 -1146 -117 1446 366 -1519 -949 511 988 289 -1175 -302 1093
2486 1093 1004 -202 -1213 317 1986 874 -1132 -487 1011 1497 94 -1032 -346 1523 1172 -378
2502 -378 -792 94 1349 810 -735 -718 532 1047 65 -1316 -848 1132 937 -882 -1356 -126 1214 234
2520 234 -1063 -1244 258 501 -339 -1046 -1381 252 896 -480 -1309 -512 760 840 -1241 -1568 60 1179
2538 1179 200 -1049 -714 672 1256 -237 -1102 -393 683 806 -332 -1111 361 1671 380 -576 -762
2555 -762 950 1670 54 -1319 7 1382 1315 -272 -620 581 1335 354 -681 -255 794 1300 250
2572 250 -851 -500 1147 790 -477 -1438 -342 1476 297 -1095 -792 305 1019 285 -1278 -605 582
2589 582 557 -763 -1178 -213 661 415 -1267 -1317 -112 1177 36 -1568 -635 704 652 -281 -1121 -142 1046
2608 1046 378 -548 -781 384 1012 443 -779 -574 746 1506 -105 -1308 0 1311 1373 -602 -1018
2625 -1018 549 1451 467 -938 -651 862 1335 -360 -548 -182 973 850 -725 -1177 175 1071 344
2642 344 -731 -1119 229 1370 -131 -1369 -570 374 613 -647 -1414 -258 1000 222 -1052 -1330 59
2659 59 1024 -304 -1452 -573 806 688 -654 -1280 -297 1051 262 -846 -763 431 1024 320 -1012 -680
2677 -680 655 863 56 -540 -23 1210 848 -355 -460 536 1351 589 -876 -237 974 865 50 -617
2695 -617 41 1187 424 -557 -822 341 1080 353 -909 -694 670 1404 -66 -1065 -506 550 622 -687
2713 -687 -1080 156 667 181 -843 -1236 379 770 -322 -1011 -725 602 753 -742 -1111 -261 786 22
2731 22 -721 -749 350 927 -249 -730 -637 717 1175 -362 -689 392 1000 597 -305 -716 577 1214 261
2750 261 -606 -574 647 1544 -300 -1077 81 1449 651 -441 -849 299 1432 292 -829 -455 383
2767 383 1052 -130 -912 -341 827 410 -519 -1068 89 1066 -37 -1123 -714 78 584 -273 -1452 -362
2785 -362 758 629 -695 -1000 -134 874 17 -1181 -661 339 685 -293 -1157 -412 762 515 -594 -894
2803 -894 68 1025 597 -830 -698 733 948 -109 -1065 -189 1106 1100 -290 -363 86 1069 974 -446 -692
2822 -692 661 1083 146 -660 -551 869 1121 -149 -608 -49 620 723 -801 -475 591 897 -11 -788
2840 -788 -779 270 592 -715 -1191 -436 429 406 -639 -1373 111 893 -273 -917 -518 139 656 -343 -668
2859 -668 -93 596 633 -514 -933 144 870 255 -681 -676 488 830 -95 -936 -43 854 674 -456 -807 276
2879 276 1183 349 -777 -229 421 1102 210 -791 -241 879 996 15 -404 30 1005 708 -801 -720 343
2898 343 894 41 -865 -563 830 465 -529 -710 -225 697 479 -851 -850 150 458 -25 -884 -688 398
2917 398 603 -506 -1225 -265 509 523 -831 -880 179 738 -211 -784 -716 390 944 -432 -705 -161 739
2936 739 776 -793 -886 493 981 365 -425 -103 913 997 205 -641 58 810 908 -286 -788 11 837 446
2956 446 -305 -564 285 1159 240 -930 -30 831 978 -590 -994 207 832 14 -880 -521 196 683 -394
2975 -394 -957 -508 392 321 -429 -1139 -278 748 64 -1068 -734 -48 665 -198 -1027 -547 576 509 -376 -659
2995 -659 -212 879 339 -676 -448 376 783 353 -744 -297 869 769 62 -592 -35 1059 718 -471
3013 -471 -582 248 837 248 -387 -276 670 683 -5 -560 -102 889 971 -638 -760 44 406 158 -679 -625 463
3034 463 457 -414 -716 -369 559 175 -851 -712 -47 422 147 -646 -1083 150 479 -295 -916 -503 647 505
3054 505 -443 -930 53 647 46 -744 -608 190 972 -109 -768 -72 616 495 -136 -767 49 1022 513 -175
3074 -175 -539 305 852 165 -720 -64 584 744 84 -780 102 845 381 -402 -527 213 864 351 -652 -426
3094 -426 518 665 -296 -626 -113 758 260 -512 -649 -10 535 -120 -926 -514 321 348 -395 -1184 -409 530
3114 530 542 -641 -794 -353 625 233 -1011 -1039 333 682 -165 -763 -297 673 578 -411 -586 477 671 619
3134 619 -449 -569 406 827 287 -673 -226 742 827 -266 -774 197 786 1042 -242 -701 489 911 -13
3153 -13 -502 -373 288 959 -182 -813 50 662 453 -477 -860 474 622 -322 -902 -461 311 755 -314
3172 -314 -848 -295 279 343 -218 -641 -253 532 -46 -848 -616 127 609 -367 -989 -309 715 595 -546 -874
3192 -874 106 686 328 -421 -462 621 786 106 -478 10 627 511 50 -426 334 890 222 -496 -163 608
3212 608 755 494 -677 -358 552 546 -401 -504 125 602 372 -284 -605 489 693 -6 -614 -387 601 558
3232 558 -292 -975 -12 430 294 -710 -927 102 507 269 -627 -667 72 694 -241 -634 -68 906 559 -702
3252 -702 -857 268 691 -156 -671 -376 407 727 -259 -634 95 538 649 -250 -877 122 748 372 -270 -488
3272 -488 515 893 58 -676 -178 1006 640 -169 -417 17 660 26 -554 -239 476 929 -185 -790 -50
3291 -50 673 429 -559 -786 46 643 38 -528 -652 245 390 -144 -992 -209 330 377 -329 -1132 -441 634
3311 634 248 -790 -872 73 370 -17 -820 -493 518 385 -228 -609 20 527 331 -799 -652 379 740
3330 740 215 -435 4 585 616 -152 -340 -137 680 920 -91 -588 449 657 206 -211 -359 556 894 -157
3350 -157 -265 -116 543 263 -462 -567 467 729 211 -727 -610 116 663 -409 -747 -490 67 627 -626
3369 -626 -831 -228 505 -63 -428 -646 263 419 -236 -855 -430 327 532 -458 -541 126 556 183 -433 -621
3389 -621 407 831 24 -771 7 557 287 -32 -548 29 1095 606 -317 -127 270 813 130 -520 6
3408 6 871 558 -241 -480 -112 628 498 -306 -467 245 266 -36 -613 -352 421 394 -326 -280 -102 390 113 -737
3430 -737 -543 328 613 86 -619 -475 251 336 -287 -854 -545 641 81 -233 -631 58 364 139 -583 -218
3450 -218 402 317 -128 -433 -55 346 737 -417 -448 441 582 104 -505 -473 518 710 20 -160 -5 592 344
3471 344 -259 -632 315 560 217 -387 -626 653 716 -10 -615 -123 267 524 -171 -570 282 581 61 -388
3491 -388 -495 103 523 -193 -423 -279 87 267 -71 -1012 36 271 252 -316 -585 -55 377 -194 -751 -128
3511 -128 271 154 -181 -607 -434 327 65 -516 -370 16 867 395 -662 -158 357 594 155 -372 12 753
3531 753 475 -92 -352 256 597 677 -495 -621 454 501 229 -120 -287 247 700 -206 -450 -120 367 82
3551 82 -392 -527 368 499 -1 -583 -414 519 105 -175 -424 -295 614 116 -514 -584 61 573 -67 -742 -374
3572 -374 39 234 -335 -783 140 573 381 -354 -300 210 359 74 -238 -441 -37 554 -69 -700 364 604
3592 604 144 -269 -381 346 757 358 -684 173 763 391 -76 -144 127 737 286 55 -338 172 429 206
3612 206 -277 -434 270 557 2 -780 -198 345 155 -360 -453 -170 344 182 -914 -10 81 -5 61 -724 -493
3633 -493 259 259 -629 -923 -14 482 208 -406 -666 289 511 122 -709 -482 319 384 -111 -499 130 664 481
3654 481 -366 -428 509 552 -140 -584 62 612 624 -336 -474 119 680 345 -9 -473 492 641 157 -231 -88
3675 -88 471 705 32 -866 -318 183 235 -330 -676 184 301 -59 -673 -186 42 295 -298 -665 -180 195 112
3696 112 -232 -416 128 419 -15 -319 -494 236 343 -271 -609 -110 492 138 -330 -406 -58 603 56 -342
3716 -342 -211 116 575 89 -503 -78 519 583 122 -236 322 569 304 -429 -300 196 774 347 -87 36
3736 36 501 408 -314 -72 -71 461 444 -275 -447 127 608 19 -514 -354 550 475 -525 -442 -64 425 234 -762
3758 -762 -502 -82 275 91 -935 -641 494 234 -464 -756 -132 275 265 -133 -873 124 360 79 -460 -247
3778 -247 419 465 -351 -413 -39 503 423 -157 -627 303 329 393 -291 -128 424 644 -205 -335 415 824 385 -295
3800 -295 -343 168 729 75 -67 -239 372 695 -217 -324 -44 457 665 -348 -449 68 449 379 -499 -272
3820 -272 -20 315 -324 -887 -374 255 245 -471 -316 -44 429 -2 -451 -411 -222 355 146 -352 -374 409 491
3841 491 8 -541 -158 318 421 -462 -308 -69 461 296 -488 -167 540 513 -191 -503 48 692 467 127
3861 127 -405 268 583 -44 173 -320 548 705 67 -265 -207 354 516 -236 -650 167 469 -123 -450 -486 354
3882 354 524 -346 -361 -272 -7 362 -154 -501 -305 436 336 -435 -279 150 252 -278 -667 -383 -68 104 -43
3903 -43 -549 -6 340 -42 -494 -691 -72 287 -77 -473 -96 544 846 -73 -493 222 839 8 -286 -86
3923 -86 254 769 238 -201 -396 439 688 296 -548 307 567 307 -189 -231 323 683 446 -485 -156 379 112
3944 112 -252 -565 -216 409 92 -817 -468 -106 381 66 -607 -290 191 196 -448 -570 -216 414 473 -236 -444
3965 -444 -24 569 11 -545 -429 -64 183 -317 -490 -72 380 21 -234 -417 353 558 169 -207 -232 124
3985 124 652 -3 -196 102 297 338 -26 -198 85 414 77 -98 -296 94 473 -98 -238 161 287 384 -24
4006 -24 -282 -15 536 256 -410 -64 15 226 -448 -761 -148 388 475 -78 -444 182 569 50 -417 -163 -33
4027 -33 386 -92 -703 -154 131 205 -366 -727 -577 537 48 -429 -54 152 672 309 -402 -33 398 467 133
4048 133 -185 133 420 440 3 -395 42 185 570 -192 -618 356 469 -7 -330 -117 399 472 -381 -318 150
4069 150 582 77 -517 -223 127 631 -80 -282 -105 287 294 -272 -422 144 364 204 -472 -586 -79 377 -254
4090 -254 -652 -324 196 305 -369 -354 -105 193 206 -230 -547 263 338 -57 -412 125 271 294 -101 -101 92 545
4112 545 311 -25 -389 236 630 135 -170 -56 330 410 60 -324 303 435 438 -134 -260 -59 624 45 -18
4133 -18 -194 304 337 -122 -531 -103 551 383 -143 -248 71 363 -116 -491 -209 114 290 -325 -611 -269 227
4154 227 121 -270 -557 -80 126 -42 -777 -116 122 110 -143 -536 -506 331 240 -288 -410 103 268 293 -318
4175 -318 -363 254 333 78 -216 33 441 292 -31 -125 233 583 296 -167 -138 378 770 91 -361 -325 37 295
4197 295 -320 -177 -81 698 43 -111 -362 132 303 -294 -224 -514 249 527 -232 -419 -83 283 65 -347 -158
4218 -158 -4 310 -192 -658 -273 69 103 -160 -414 -76 489 116 -399 -425 -40 191 33 -352 -242 164 342
4239 342 98 -380 51 359 208 -390 -522 312 538 -33 -204 -206 412 661 -147 -324 -152 701 418 -97 -283
4260 -283 39 256 259 -9 -301 206 256 -26 -326 -9 335 337 -162 -410 356 79 199 -315 -244 176 260 -92
4282 -92 -292 -59 443 82 -2 -292 -242 413 -1 -512 -382 278 290 -165 -280 -123 332 323 -227 -206 10 255
4304 255 196 -363 -588 108 287 52 -64 -482 307 408 300 -304 196 109 402 -21 -371 265 376 307 -391
4325 -391 -54 261 428 178 -536 -15 186 394 -278 -113 296 324 -27 -288 -179 135 287 -87 -401 -27
4345 -27 341 170 -303 -661 -93 185 -10 -287 -425 -304 -103 -10 -499 -150 291 88 -65 -457 -36 308 -180
4366 -180 -187 -106 -168 259 180 -313 -147 299 404 -47 -65 101 193 156 125 -98 302 148 212 -251 -201 455 145 13
4390 13 -126 33 319 164 -412 -328 105 352 231 -268 -403 260 170 -149 -42 -31 309 276 -402 -157 -170 -65
4412 -65 106 -245 -475 -12 182 -87 -222 -203 117 -18 -290 -104 77 498 -162 -242 -291 240 495 40 -82
4433 -82 3 129 397 302 -210 319 636 -38 -152 36 279 510 -43 -185 -60 336 177 102 -69 148 449
4454 449 429 13 -256 68 540 186 -130 -373 170 209 3 -164 86 187 41 -146 98 74 157 -141 -354
4475 -354 -453 194 87 -123 -471 -452 184 73 -385 -397 -184 136 -103 -607 -447 228 489 -58 -396 -155 50
4496 50 375 -106 -373 50 207 103 -31 87 110 436 201 -342 36 -15 675 -54 -286 225 384 -135 99
4517 99 -163 437 461 -138 -203 4 320 214 10 -361 10 297 245 -539 -70 287 234 23 -164 -226 95 -40
4539 -40 -12 -342 111 374 199 -271 -466 -88 -77 -216 -324 -205 83 240 -216 -430 15 221 75 -403 -449
4560 -449 22 308 -26 83 -34 320 388 -243 -83 37 454 279 -267 -106 336 151 -15 -568 55 110 480
4581 480 -144 134 -5 250 160 -115 -119 213 417 453 -385 65 393 177 93 -356 179 244 469 -441 -214 67
4603 67 91 -186 -211 -177 -86 313 -442 -369 -63 224 224 -210 -120 51 292 171 -352 -482 104 215 120 -105 -205
4626 -205 -48 163 -201 -189 125 529 130 -72 -215 375 434 -13 -29 -105 389 264 -167 71 121 453 96 -16
4648 -16 -40 67 412 -85 50 -70 -90 110 -164 -475 180 161 39 137 -46 -198 719 -44 -346 -203 65 41
4670 41 50 -59 160 221 187 -323 -288 219 152 -113 -224 -330 310 55 -254 -42 -136 409 -168 -163 -104 -224 362 91
4694 91 -394 -101 70 357 -139 -223 -2 315 175 167 -30 209 196 183 -203 -54 85 358 2 132 -204 146
4716 146 -50 -379 -378 318 79 -100 -125 -69 -87 116 244 -164 -8 169 403 -162 -161 172 99 172 -158 -229 337
4739 337 125 184 -233 12 102 -54 -117 -99 171 53 -126 55 -366 -106 151 -238 -179 -99 217 156 -14 -113 -152
4762 -152 463 356 24 -264 167 70 331 -121 -120 322 443 10 -205 -73 -17 253 -23 -50 196 552 288 -213
4784 -213 -80 233 196 5 -163 -18 32 -177 -88 -225 -65 31 94 -239 -103 127 242 -127 -500 -110 107 56
4806 56 -274 -329 -13 133 109 -102 -215 215 289 -127 -211 -57 180 18 -385 -70 -50 431 241 -464 -159 -51
4828 -51 116 81 -267 190 207 115 30 -64 -5 210 31 -45 -95 282 217 37 -153 -60 314 167 -217 -57 44 177
4852 177 57 -32 -13 481 309 178 -436 -97 72 196 -19 -148 -306 31 267 -43 -474 9 96 -15 -22 -63
4874 -63 77 36 -205 -122 65 253 230 -134 -283 -87 183 -96 -498 -222 -5 112 -29 -187 -36 240 45
4895 45 -315 -223 239 246 17 -255 -151 150 259 -8 150 -2 186 122 -26 -118 97 49 -127 -177 -323 109 209
4918 209 270 6 -2 212 105 -246 -286 -63 79 135 -276 -58 87 92 -173 -261 -72 384 243 -327 -404 -302 293
4941 293 20 -263 -164 -160 352 58 -237 57 230 231 -75 -322 -201 394 128 -184 -125 118 147 -60 -196 -89
4963 -89 390 138 81 -159 248 237 235 -542 110 141 286 218 -190 -60 160 69 -48 -202 -48 199 236 225 -181
4986 -181 109 365 76 -79 -230 -12 125 -222 -437 -207 77 23 2 -332 54 416 -122 -114 -167 -263 27 -26
5008 -26 -190 -186 -45 -73 -156 -291 -101 186 246 -199 -117 -46 247 -98 -204 -90 451 112 -314 -159 -190 298 130
5031 130 -49 -19 -71 10 -159 -61 -56 191 394 -29 -151 -125 229 472 144 47 193 98 -110 -255 -75 173 45
5054 45 -346 -101 258 25 157 89 -367 44 421 -85 -220 -50 139 224 -29 -376 224 123 205 -367 -426 -44
5076 -44 195 -206 -342 118 17 167 -318 -168 -12 16 192 2 -325 266 267 -22 -49 -35 131 296 -121 -260
5098 -260 89 62 122 -329 17 145 150 185 -14 58 122 188 -28 -101 -44 118 -21 -26 -138 37 -56 -81 -116 -164 168
5123 168 133 -248 -315 -174 132 194 -320 -336 -78 458 93 -159 -225 120 -77 199 -418 -49 -133 54 -272 76
5145 76 -96 -8 -58 -150 -191 -23 186 -95 -78 -295 64 217 287 -148 -55 230 125 -81 95 81 238 300 -429
5168 -429 -112 277 51 -151 -333 227 122 314 -70 -150 -35 342 196 -72 -130 247 262 -311 -175 86 208
5189 208 263 102 -339 167 161 112 -225 -124 182 125 -80 -197 -1 28 140 -249 -346 -176 241 162 -277 -109 -21
5212 -21 96 2 -290 132 32 -180 116 -326 137 153 100 220 -361 -209 64 -84 -267 188 282 162 76 -196
5234 -196 113 173 211 -56 -105 387 502 57 -182 -144 76 355 -191 -217 -161 172 -248 -271 -80 -139 126 143 -273
5257 -273 16 44 20 110 -190 -12 219 239 -358 48 377 50 25 -65 65 332 -339 -46 -100 -26 52 246 -108
5280 -108 -82 16 -25 275 -154 -263 -14 96 74 -257 -33 117 159 -231 -216 98 132 -43 92 204 15 65 -94
5303 -94 34 143 119 117 -58 167 94 -74 -13 -154 -65 -247 -143 13 -206 -242 263 186 -19 -256 -77 137 249
5326 249 -54 -29 -73 234 -192 -298 -137 142 -61 -281 -171 100 31 -60 -284 -386 45 251 -450 -23 -249
5347 -249 261 190 -332 -104 -206 133 92 -49 -124 252 175 126 -208 -9 261 -93 3 -54 7 31 183 -216 -112
5370 -112 178 -179 -190 -1 -12 133 285 -88 198 -79 187 190 53 -165 -233 250 -81 -530 -72 104 66 18
5392 18 -114 -21 204 -45 -167 -368 -7 48 -78 -715 -378 -154 -38 -52 -327 -74 62 43 -255 -125 -25 -76
5414 -76 -49 -294 -97 15 -15 -3 -348 6 -70 -62 -16 -367 20 286 119 -36 72 288 60 26 -172 -63 303
5437 303 162 130 -101 -100 184 206 -209 185 261 74 25 -306 80 81 194 -77 -205 103 144 367 -203 -432 119
5460 119 179 46 -224 140 145 250 -317 255 126 -155 -57 -138 -278 76 77 165 -188 -298 459 160 -161 47 -218
5483 -218 218 126 -116 -104 25 234 169 0 50 150 212 -179 -10 196 128 136 -272 105 -77 200 -46 -153 180
5506 180 53 42 -126 56 113 66 363 -134 -172 167 -92 201 -323 -134 43 91 -115 -215 -74 252 124 -108
5528 -108 -67 164 -116 -217 -196 -528 54 75 -260 -154 -127 142 61 -176 -32 69 51 -131 -100 -234 -13 40 -127
5551 -127 -126 145 -127 487 86 -229 4 340 102 205 -86 153 175 286 18 8 42 285 -66 65 230 309
5573 309 150 -207 -149 -131 309 92 -250 159 166 -113 199 -86 37 257 88 -85 -189 -243 75 12 -137 -364
5595 -364 118 -184 40 -401 -351 -30 118 33 -21 -125 -79 -54 -95 -29 114 69 -290 -94 10 127 131 -151 -185 -138
5619 -138 190 152 -30 95 207 259 -189 -265 -118 61 193 -175 -365 4 149 150 74 -94 171 130 100 226 -80
5642 -80 -6 296 -134 -205 279 -212 102 -143 -57 -39 83 -175 118 -252 121 165 222 -298 -16 64 -134 -60 -52 -38
5666 -38 -14 97 -131 116 -55 72 -40 -205 -166 56 1 -127 -118 121 91 116 -208 -282 663 -17 -23 -182 -251 154
5690 154 -50 -31 -241 69 264 39 -412 -9 271 294 -33 86 -76 206 67 22 86 152 100 172 -81 -350
5712 -350 129 233 -126 -194 -229 164 -69 -152 154 160 -113 117 -83 -471 218 214 -166 -281 -21 216 -115 -194 -329
5735 -329 169 -20 -65 -296 -184 383 -46 28 -225 -110 19 221 139 -357 -214 30 -25 -103 -101 -19 301 -50 -66
5758 -66 102 85 22 70 0 -60 156 80 146 -152 -60 -35 215 23 99 48 74 136 -115 -165 182 128 46 -24 75 -200
5784 -200 91 -48 -256 61 -121 -67 -40 132 274 15 -50 -45 -260 196 -106 86 54 183 76 287 -256 88
5806 88 -10 146 189 -237 95 193 35 -211 -39 -25 9 135 -71 98 19 165 -4 -117 -16 -257 433 143
5828 143 -28 214 55 -122 -89 66 21 130 -127 -138 199 33 -68 -128 -7 72 196 -2 2 -299 289 42
5850 42 -421 -371 -175 159 -249 50 -299 -204 68 -114 -173 -219 -57 71 -196 -83 113 -66 36 -52 -209 18
5872 18 98 64 -150 -99 40 149 -368 -87 153 161 353 -205 -84 -167 127 202 -104 61 145 247 84 -11 -71 -153
5896 -153 123 -75 140 -6 222 70 -158 102 -38 155 68 -182 136 91 -49 -52 -213 59 22 79 -361 -50
5918 -50 71 -20 -18 74 139 210 -28 -292 -114 -270 -152 -76 -335 183 121 271 -25 -132 -97 179 87 -210 -133 231
5942 231 174 53 -257 -35 -85 -104 213 91 142 138 20 77 -69 108 255 -136 -117 -269 252 429 13 -114 -258
5965 -258 77 212 -139 -113 53 -2 198 307 -111 66 244 -178 -30 2 125 -5 -70 -76 -98 259 22 56 -102
5988 -102 -297 48 147 -355 -106 -207 63 -38 -43 -86 -69 55 -29 -17 -28 193 190 -242 -68 98 48 209 -268 -269
6012 -269 -29 -138 -58 -211 84 78 31 -79 3 -11 25 293 -78 -4 143 51 207 376 153 -87 61 39 -85
6035 -85 413 118 155 -243 -180 -147 -123 185 -197 44 306 54 -67 114 -26 17 40 -357 28 -29 -68 -276 -123
6058 -123 139 112 195 -286 -89 173 -93 203 -151 -133 100 -16 -123 1 -52 96 31 18 28 54 230 131 -74
6081 -74 -67 -131 166 -239 144 -135 360 3 -132 -277 135 427 -201 -60 -151 89 116 127 16 85 -179 -43 -103
6104 -103 22 199 -43 -52 114 -132 139 150 33 -233 -123 197 206 37 25 -116 215 -261 210 65 -269 -31
6126 -31 -14 -100 -33 74 -18 -36 -119 -205 -62 295 159 -164 187 52 38 125 -242 81 277 -111 233 -105 191
6149 191 34 16 -83 -21 96 72 78 105 175 273 -14 -45 10 195 78 137 -163 176 4 -189 -27 -144 69 137
6173 137 -30 175 314 50 43 -138 -199 205 102 -8 -43 -197 191 176 165 -239 -62 -161 -262 -190 -305 -96 9
6196 9 -198 -106 475 -115 -1 10 -86 152 -142 81 152 -350 14 88 -77 33 93 23 -26 -105 -90 160 194 110 181
6221 181 -165 -10 176 299 -15 -217 -177 175 344 -44 111 186 72 175 -107 -145 -210 -11 -233 -386 73
6242 73 113 220 -166 -472 38 -214 -180 -411 -124 -24 51 -260 -87 445 -67 -8 -121 -132 49 -67 -183 -260
6264 -260 -73 175 162 -69 -203 245 63 98 14 -114 -24 72 -159 51 64 51 53 -5 -272 111 323 257 47 -111
6288 -111 -95 242 -5 -34 14 68 41 183 -56 203 127 234 -227 8 -104 79 68 -111 -72 -196 83 -280 -92
6311 -92 -341 -37 56 -436 175 24 -69 -22 -245 173 95 137 -216 -42 196 70 -149 -56 -260 -144 108 -76
6333 -76 -245 284 264 -19 95 -52 -76 -26 64 -95 -67 434 144 257 51 -336 457 253 -57 -205 -70 169
6355 169 42 -30 -193 9 207 210 -130 33 -92 -45 -233 45 -215 234 -134 -4 84 -16 202 -101 -143 -308
6377 -308 43 22 -90 -80 135 105 -18 -110 -70 217 25 -138 70 -559 217 76 -186 -137 49 -42 -126 -260 -158
6400 -158 125 164 154 185 -163 280 228 76 -11 180 262 82 111 111 -38 -40 -91 40 127 -153 306 254 -22 -123 147
6425 147 26 -48 -200 -106 -27 153 -110 -95 96 29 170 -177 -185 105 132 289 -51 370 98 -82 -81 -298 8
6448 8 21 142 -3 -1 204 82 -12 -342 137 6 -148 -235 -91 -239 87 -61 -294 -158 2 113 168 -37 16
6471 16 329 77 4 -33 152 158 28 6 6 151 -10 -265 70 -56 336 -100 -31 74 39 242 -324 -239 -15 -17
6495 -17 174 72 -268 -35 -309 50 -185 -325 -82 131 -212 -54 -147 -150 -27 -53 -152 -44 45 213 316 -90
6517 -90 146 186 0 2 -433 -80 41 28 -89 108 69 -95 63 -112 -2 222 58 8 -171 -240 76 39 -382
6540 -382 -23 180 22 -1 -99 -38 155 114 -33 77 286 296 136 -227 66 -49 58 -240 -129 -183 62 7
6562 7 -178 -259 283 23 17 -88 18 56 277 -103 2 4 126 -130 -92 -77 -224 -21 -54 -252 -225 281 91 -131
6586 -131 -25 -54 -77 -97 -296 41 204 78 -86 -201 68 93 79 -48 -25 -112 24 -152 23 -253 140 135 106
6609 106 -197 18 236 118 192 -34 -85 -20 322 -145 6 -14 206 287 -203 -73 242 5 168 -26 89 154
6631 154 310 222 -41 -3 120 145 84 -173 -204 143 -249 -273 0 -143 -147 -61 -202 -152 -110 -36 -259 -145 -116 222
6655 222 -85 -88 -178 249 -1 169 -402 -85 284 -120 -301 -163 138 321 260 -198 111 35 308 294 77 74 254
6678 254 -87 27 -154 -76 188 88 -53 -196 251 143 -28 300 -34 170 218 -72 33 107 -139 -84 -141 -94
6700 -94 -20 104 -63 -250 -476 -39 -139 -54 -211 -138 110 29 -136 -333 126 85 -73 -80 -77 32 82 -24 -176 -177
6724 -177 66 -161 -215 -194 42 182 -44 -33 -182 129 128 -244 -173 -56 161 170 -79 -200 40 274 58 -313 -103
6747 -103 220 404 333 -166 -98 217 -32 82 -209 -174 80 -84 123 118 -51 163 -49 -166 95 185 0 -328
6769 -328 -197 -6 52 -92 14 -87 -158 90 -243 39 -252 142 97 -123 -339 -164 -204 -101 -295 -349 78 179
6791 179 103 -252 -140 259 96 209 -118 -102 -108 125 171 99 459 238 71 -115 -34 91 -17 259 -114 120
6813 120 76 125 246 -346 23 217 -131 33 -114 12 276 -69 -49 55 177 107 -246 -24 -186 202 131 -111
6835 -111 -419 88 146 -109 -81 -293 -90 150 -2 -230 -104 -78 -126 -227 -127 218 -49 120 -120 56 164
6856 164 145 -335 -47 -71 178 139 -366 10 26 215 -88 1 32 113 174 -19 -107 139 176 80 -277 -283 129 177 130
6881 130 -85 -67 267 147 -52 -300 -158 -44 187 -187 -108 165 -49 8 -102 -83 120 -97 -86 -124 -43 -19 -11
6904 -11 -375 -150 33 175 -67 -31 -113 281 -82 16 -42 -132 210 145 17 -373 118 -32 119 -233 219 152 288
6927 288 48 -51 99 -67 5 -60 -137 -88 97 -8 -82 174 134 -28 -81 -456 -192 240 313 -120 -28 192 -2
6950 -2 -76 -269 -79 -155 86 -112 -121 -85 330 72 153 -100 -117 86 42 50 28 -11 113 -244 -183 -117 -240 176 85 -163
6976 -163 -72 175 5 55 -53 -15 -59 22 -339 -31 -126 185 -39 -84 -68 9 268 164 -71 205 140 121 -35 154
7000 154 93 65 -99 113 -131 177 253 -286 -36 -125 85 -211 -28 -43 219 81 -7 3 -79 52 72 -197 -320
7023 -320 -168 48 215 -179 -335 -71 -29 -158 -10 -268 -58 200 -58 -189 -110 -27 74 -88 -115 21 415
7044 415 -154 -286 -12 80 -279 85 -612 -23 -235 -177 -80 -51 156 41 -70 -162 283 65 88 104 123 -48 351
7067 351 -6 37 -90 -10 301 65 -146 54 101 393 57 20 -44 121 189 -262 180 -233 122 -171 -173 -179 -198 208
7091 208 -19 -104 46 312 56 -79 -210 165 2 179 -200 -134 -121 -98 80 -265 -61 205 105 24 -361 2
7113 2 146 238 11 71 2 -15 100 -201 -136 -199 259 -96 -103 -168 31 -30 0 -23 159 166 -138 -160 40 194 90 86
7139 86 103 78 155 24 -200 34 175 289 -50 -105 -51 117 114 55 -208 -44 -25 72 -119 19 -123 -117 34 32 -53
7164 -53 179 14 -220 62 -134 106 -128 -9 -265 -228 51 139 -231 -227 -333 -3 84 -196 33 93 321 6
7186 6 -150 151 180 -52 -89 -297 50 63 -33 82 -202 414 72 232 99 101 41 119 65 -17 32 -112 80 94 17
7211 17 91 79 -198 -62 47 -262 -271 -10 73 -157 41 0 -328 -139 166 122 -84 -428 -174 182 61 27 -175
7234 -175 1 -19 -50 -42 144 29 142 166 -122 -133 54 168 -117 -49 -42 19 156 47 -73 49 293 182 -43
7257 -43 -44 143 182 116 -13 35 191 -165 185 -143 115 84 175 35 213 -49 -17 181 -108 -32 153 223 250 178
7281 178 -231 -82 58 -171 -457 197 66 -53 -120 -428 72 -61 -79 51 56 229 -207 75 -115 -201 32 264
7303 264 -129 -45 -77 252 -73 -187 -101 -30 12 -210 -236 258 -6 -167 92 -56 151 -50 7 26 -1 85 -31
7326 -31 -171 14 -114 -25 105 170 111 -8 54 90 -25 188 122 103 188 -309 4 338 112 -276 -184 -184 135 -83
7350 -83 -185 104 105 -209 37 -193 -274 128 72 -131 122 92 83 -166 -82 131 331 136 -72 -200 16 286 59
7373 59 -61 -131 109 31 -213 -255 216 184 275 87 -170 -43 41 115 34 51 158 34 118 -18 63 419 -143 99
7397 99 -129 -80 -31 -14 -188 -80 332 195 88 -20 41 278 166 5 37 387 260 -81 43 -93 238 46
7419 46 34 264 -68 150 154 -328 -31 81 -46 -138 -147 -63 114 40 17 -387 40 167 134 36 -131 -109 13 -130
7443 -130 -69 -17 -177 -75 75 -139 -158 28 263 -125 -163 130 110 -18 27 -168 -20 258 -117 78 -226 246
7465 246 96 -142 -236 -56 63 49 5 78 -41 357 283 -190 8 153 333 -73 30 -154 -228 -183 -320 24
7487 24 -74 386 -18 -268 -72 29 -75 -220 -392 146 376 -82 -34 -214 -133 -25 133 -2 67 -47 66 -72
7509 -72 -178 184 -87 123 -47 129 259 302 106 -160 -134 -31 34 -145 155 243 178 42 65 85 -143 -39 59
7532 59 -127 -97 -44 294 117 26 -89 57 2 -198 186 176 137 67 51 -87 191 293 -2 -176 16 20 46 -210
7556 -210 -313 101 125 -14 -76 34 -1 104 -200 17 -25 13 133 153 147 26 60 -91 204 92 -30 52 -168
7579 -168 -6 -179 -28 221 145 84 243 -26 19 -293 -105 299 151 23 0 74 -197 229 -247 -171 -78 313
7601 313 251 443 -32 -127 -171 -100 -131 -11 81 -48 -165 -249 56 68 -56 -140 -155 -13 82 100 -198 -7 32 156
7625 156 -12 -193 -34 -54 -21 -134 -105 -162 340 85 -299 -46 -39 47 107 -68 -270 64 -113 170 210 120 278
7648 278 -85 -175 -26 85 44 96 -5 -133 -114 39 -60 -9 -177 -70 180 -2 -211 276 475 -22 7 32 158
7671 158 198 -136 -73 -54 88 195 -57 -4 -112 216 43 -211 135 -117 117 -53 -89 -188 11 -39 -144 24
7693 24 -70 212 112 -167 -243 -154 -78 158 -83 98 13 124 -146 -98 -131 23 97 -57 -71 -21 105 16 89 68 244
7718 244 200 8 -147 6 147 135 -251 2 139 48 90 -101 -117 74 197 -124 103 158 287 73 -249 -171
7740 -171 134 149 124 -192 -197 225 -23 -9 -48 -107 92 295 -228 -246 92 16 59 -159 -157 170 -39 72 -199 -34
7764 -34 -46 -12 -107 -175 58 160 41 218 360 114 100 110 -279 -230 149 -126 6 -272 -113 243 -95 -105 137
7787 137 23 -50 -116 15 -63 145 -31 15 -28 57 5 -89 96 -204 -136 221 -35 -51 -59 88 121 -15 142 -33
7811 -33 73 201 1 -164 34 -47 128 -116 62 -49 327 -20 -208 -56 -66 -33 -66 -201 -247 222 -99 160
7833 160 -5 304 52 -167 -378 -122 448 42 -39 -219 -90 40 -30 -43 -213 238 282 -91 -102 -213 71 205
7855 205 -20 190 -105 198 43 -28 54 181 -92 -16 -227 108 -84 -85 -193 -317 -65 286 170 58 -130 -177
7877 -177 168 -143 -281 -79 -168 8 76 4 34 41 -59 -30 -200 83 -22 -102 104 -150 177 4 -40 -64 -182
7900 -182 -23 59 -153 -111 213 102 178 -85 46 27 305 56 192 220 62 128 43 163 117 110 -34 -58 62 -67
7924 -67 112 157 -138 -18 -98 50 16 -156 57 115 -28 -225 -166 51 -129 -68 -317 -148 -145 143 -284 -15 -16 97
7948 97 -144 -180 -117 -122 -29 -159 -31 22 319 104 128 -3 143 191 42 46 57 -7 156 114 120 -108 163 228 188 55
7974 55 -86 29 -134 0 -213 6 -55 12 -351 -2 46 133 34 -316 -149 -237 -236 -336 -45 -50 289 221 -105 84
7998 84 23 177 220 -139 -171 101 115 -57 -155 -12 -307 76 48 -122 211 -79 -12 -213 10 -149 4 -45 6
8021 6 -101 90 112 -110 154 175 61 166 -353 33 -66 168 101 107 40 92 100 -6 46 -294 123 48 20 118 27 198
8047 198 95 -128 -181 181 -53 -52 47 25 34 41 -196 -189 32 280 -51 -155 -159 258 147 76 -67 -108 66 -121 -121 34
8073 34 -85 266 -49 -156 39 -53 -63 -175 -170 -81 -121 -44 -311 -496 -10 -86 -27 -360 -166 135 20 -40 57 112
8097 112 195 -33 -142 67 44 186 11 80 242 241 -259 -164 118 -34 270 -41 -29 30 -92 310 79 3 238
8120 238 280 128 192 -22 66 190 103 -482 -29 8 -122 252 -209 205 -172 -8 71 42 -18 -133 57 18 141
8143 141 -143 -17 -345 -235 -88 48 3 -43 -148 -93 379 152 59 -213 -5 -167 48 -202 96 -9 248
8164 248 199 82 -81 8 164 87 -122 158 -1 19 -41 81 46 -197 30 -3 35 64 211 164 -189 21 27 133
8188 133 -120 -77 106
8191A06
##END NTUPLES=NMR FID
##END=
