##TITLE=1H_Pr Am-2-2
 CDCl3, 8 sc, 
 14.12.2020
##JCAMPDX= 6.0         $$ Bruker NMR JCAMP-DX V2.0
##DATA TYPE= NMR FID
##DATA CLASS= NTUPLES
##ORIGIN= UXNMR, Bruker Analytische Messtechnik GmbH
##OWNER= root
$$ XWIN-NMR		Version 3.5
$$ Mon Dec 14 11:49:27 2020 Russian Standard Time (UT+4h)  she@DPX200
##.OBSERVE FREQUENCY= 200.1315066352
##.OBSERVE NUCLEUS= ^1H
##.DELAY= (6, 6)
##.ACQUISITION MODE= SIMULTANEOUS
##.ACQUISITION SCHEME= undefined
##.AVERAGES= 8
##.DIGITISER RES= 18
##SPECTROMETER/DATA SYSTEM= spect
##.PULSE SEQUENCE= zg30
##.SOLVENT NAME= CDCl3
##.SHIFT REFERENCE= (INTERNAL, CDCl3, 0, 15.7039)
##AUDIT TRAIL= $$ (NUMBER, WHEN, WHO, WHERE, WHAT)
$$ ##TITLE= Audit trail, XWIN-NMR		Version 3.5
$$ ##JCAMPDX= 5.01
$$ ##ORIGIN= Bruker BioSpin GmbH
$$ ##OWNER= she
$$ F:/spectra/data/she/nmr/H-F/1/audita.txt
$$ ##AUDIT TRAIL=  $$ (NUMBER, WHEN, WHO, WHERE, WHAT)
(   1,<2020-12-14 11:48:06.37 +0400>,<she>,<DPX200>,
      <created by zg, POWCHK disabled, PULCHK disabled
       configuration hash MD5:
       00 E9 B6 7A A2 85 ED C7 34 08 36 98 17 FE 4E 26
       data hash MD5: 16K
       05 6D 93 D4 BC 05 00 85 2E 4F D9 66 AD B1 4A 15>)
$$ ##END=
$$ 
$$ hash MD5
$$ 57 A8 BD 3A D2 F7 21 1A 71 99 7C F9 51 91 AD 19
##$RELAX= 
##$RELAX= 
##$RELAX= 
##$RELAX= 
##$RELAX= 
##$RELAX= 
$$ Bruker specific parameters
$$ --------------------------
##$DU= <F:/spectra>
##$EXPNO= 1
##$NAME= <H-F>
##$PROCNO= 1
##$TYPE= <nmr>
##$USER= <she>
##$AMP= (0..31)
100 100 100 100 100 100 100 100 100 100 100 100 100 100 100 100 100 100 
100 100 100 100 100 100 100 100 100 100 100 100 100 100 
##$AQSEQ= 0
##$AQ_mod= 1
##$AUNM= <au_zg>
##$AUTOPOS= <>
##$BF1= 200.13
##$BF2= 200.13
##$BF3= 200.13
##$BF4= 200.13
##$BF5= 200.13
##$BF6= 200.13
##$BF7= 200.13
##$BF8= 200.13
##$BYTORDA= 1
##$CFDGTYP= 0
##$CFRGTYP= 5
##$CHEMSTR= <none>
##$CNST= (0..31)
1 1 145 1 1 1 1 1 1 1 1 1 1 1 1 1 1 1 1 1 1 1 1 1 1 1 1 1 1 1 1 1 
##$CPDPRG= <>
##$CPDPRG1= <>
##$CPDPRG2= <>
##$CPDPRG3= <>
##$CPDPRG4= <mlev>
##$CPDPRG5= <mlev>
##$CPDPRG6= <mlev>
##$CPDPRG7= <mlev>
##$CPDPRG8= <mlev>
##$CPDPRGB= <>
##$CPDPRGT= <>
##$D= (0..31)
0 1.2 0 0 0 0 0 0 0 0.06 0 0.03 0 0 0 0 0.0002 0 0 0 0 0 0 0 0 0 0 0 0 
0 0 0 
##$DATE= 1607932085
##$DBL= (0..7)
120 120 120 120 120 120 120 120 
##$DBP= (0..7)
150 150 150 150 150 150 150 150 
##$DBP07= 0
##$DBPNAM0= <>
##$DBPNAM1= <>
##$DBPNAM2= <>
##$DBPNAM3= <>
##$DBPNAM4= <>
##$DBPNAM5= <>
##$DBPNAM6= <>
##$DBPNAM7= <>
##$DBPOAL= (0..7)
0.5 0.5 0.5 0.5 0.5 0.5 0.5 0.5 
##$DBPOFFS= (0..7)
0 0 0 0 0 0 0 0 
##$DE= 6
##$DECBNUC= <off>
##$DECIM= 32
##$DECNUC= <off>
##$DECSTAT= 4
##$DIGMOD= 1
##$DIGTYP= 9
##$DL= (0..7)
0 120 120 120 120 120 120 120 
##$DP= (0..7)
150 150 150 150 150 150 150 150 
##$DP07= 0
##$DPNAME0= <>
##$DPNAME1= <>
##$DPNAME2= <>
##$DPNAME3= <>
##$DPNAME4= <>
##$DPNAME5= <>
##$DPNAME6= <>
##$DPNAME7= <>
##$DPOAL= (0..7)
0.5 0.5 0.5 0.5 0.5 0.5 0.5 0.5 
##$DPOFFS= (0..7)
0 0 0 0 0 0 0 0 
##$DQDMODE= 0
##$DR= 18
##$DS= 0
##$DSLIST= <SSSSSSSSSSSSSSS>
$$ [...]
##$SUBNAM2= <"">
##$SUBNAM3= <"">
##$SUBNAM4= <"">
##$SUBNAM5= <"">
##$SUBNAM6= <"">
##$SUBNAM7= <"">
##$SUBNAM8= <"">
##$SUBNAM9= <"">
##$SW= 16.9725356469052
##$SWIBOX= (0..15)
0 0 2 0 0 0 0 0 0 0 0 0 0 0 0 0 
##$SW_h= 3396.73913043478
##$TD= 16384
##$TD0= 1
##$TE= 0
##$TE2= 300
##$TE3= 300
##$TEG= 300
##$TL= (0..7)
0 120 120 120 120 120 120 120 
##$TP= (0..7)
150 150 150 150 150 150 150 150 
##$TP07= 0
##$TPNAME0= <>
##$TPNAME1= <>
##$TPNAME2= <>
##$TPNAME3= <>
##$TPNAME4= <>
##$TPNAME5= <>
##$TPNAME6= <>
##$TPNAME7= <>
##$TPOAL= (0..7)
0.5 0.5 0.5 0.5 0.5 0.5 0.5 0.5 
##$TPOFFS= (0..7)
0 0 0 0 0 0 0 0 
##$TUNHIN= 0
##$TUNHOUT= 0
##$TUNXOUT= 0
##$USERA1= <user>
##$USERA2= <user>
##$USERA3= <user>
##$USERA4= <user>
##$USERA5= <user>
##$V9= 5
##$VALIST= <valist>
##$VCLIST= <CCCCCCCCCCCCCCC>
##$VD= 0
##$VDLIST= <DDDDDDDDDDDDDDD>
##$VPLIST= <PPPPPPPPPPPPPPP>
##$VTLIST= <TTTTTTTTTTTTTTT>
##$WBST= 1024
##$WBSW= 4
##$XGAIN= (0..3)
0 0 0 0 
##$XL= 0
##$YL= 0
##$YMAX_a= 80321
##$YMIN_a= -95190
##$ZGOPTNS= <>
##$ZL1= 120
##$ZL2= 120
##$ZL3= 120
##$ZL4= 120
##$ABSF1= 10
##$ABSF2= 0
##$ABSG= 5
##$ABSL= 3
##$ALPHA= 0
##$AQORDER= 0
##$ASSFAC= 0
##$ASSFACI= 0
##$ASSFACX= 0
##$ASSWID= 0
##$AUNMP= <proc_1d>
##$AZFE= 0.1
##$AZFW= 0.1
##$BCFW= 1
##$BC_mod= 2
##$BYTORDP= 1
##$COROFFS= 0
##$CY= 11.3945322036743
##$DATMOD= 1
##$DC= 2
##$DFILT= <>
##$DTYPP= 0
##$F1P= 15.9154993809931
##$F2P= -4.1035820241983
##$FCOR= 0.5
##$FTSIZE= 0
##$FT_mod= 4
##$GAMMA= 1
##$GB= 0.15
##$INTBC= 1
##$INTSCL= 1
##$ISEN= 128
##$LB= 0.24
##$LEV0= 0
##$LPBIN= 0
##$MAXI= 10000
##$MC2= 0
##$MEAN= 0
##$ME_mod= 0
##$MI= 1.114404
##$NCOEF= 0
##$NC_proc= 0
##$NLEV= 6
##$NOISF1= 3.799351
##$NOISF2= 2.8
##$NSP= 1
##$NTH_PI= 0
##$NZP= 0
##$OFFSET= 15.70392
##$PC= 1
##$PHC0= -10755.97
##$PHC1= 7.000891
##$PH_mod= 1
##$PKNL= yes
##$PPARMOD= 0
##$PSCAL= 0
##$PSIGN= 0
##$REVERSE= no
##$SF= 200.130013532006
##$SI= 16384
##$SIGF1= 3
##$SIGF2= 2
##$SINO= 400
##$SIOLD= 16384
##$SREGLST= <1H.CDCl3>
##$SSB= 0
##$STSI= 0
##$STSR= 0
##$SW_p= 3612.71676300578
##$SYMM= 0
##$S_DEV= 0
##$TDeff= 0
##$TDoff= 0
##$TI= <>
##$TILT= no
##$TM1= 0
##$TM2= 0
##$TOPLEV= 0
##$USERP1= <user>
##$USERP2= <user>
##$USERP3= <user>
##$USERP4= <user>
##$USERP5= <user>
##$WDW= 1
##$XDIM= 8192
##$YMAX_p= 0
##$YMIN_p= 0
$$ End of Bruker specific parameters
$$ ---------------------------------
##NTUPLES= NMR FID
##VAR_NAME=  TIME,          FID/REAL,        FID/IMAG
##SYMBOL=    X,             R,               I
##VAR_TYPE=  INDEPENDENT,   DEPENDENT,       DEPENDENT
##VAR_FORM=  AFFN,          ASDF,            ASDF
##VAR_DIM=   8192,          8192,            8192
##UNITS=     SECONDS,       ARBITRARY UNITS, ARBITRARY UNITS
##FACTOR=    0.0002944,     1,               1
##FIRST=     0,             0,               0
##LAST=      2.4114304,     0,               0
##MIN=       0,             -95190,          0
##MAX=       2.4114304,     80321,           0
$$ Real data points
##PAGE= N=1
##DATA TABLE= (X++(R..R)), XYDATA
$$ plain form
0 0 0 0 0 0 0 0 0 0 0 0 0 0 0 1 -8 8 -8 8 -8 16 -16 16 -24 24 -32 39 -40 48 -56 64 -72 81 -95 105 -119 135
36 135 -151 168 -185 208 -232 256 -281 312 -344 382 -421 464 -511 561 -617 682 -749 827 -914
55 -914 1013 -1127 1257 -1408 1590 -1809 2078 -2421 2874 -3497 4412 -5883 8619 -15371 63592
70 63592 77020 -95190 4498 54202 -10313 -34317 51719 -19747 -4391 12706 4391 20748
82 20748 -24849 -4354 25181 30923 -54144 9835 45495 -27555 1315 8733 5398 -17427 25146
95 25146 -9928 737 969 -17073 36855 -14146 -23621 6499 32163 -29790 -8819 19793 -18220
108 -18220 11149 -10978 4448 -11854 1571 -544 3336 -7834 -26216 35104 -13113 -17869 3674
121 3674 8547 -19739 8497 10404 -42949 31893 1740 -23827 4350 15939 -24747 1883 30724
$$ packed form
0@%%%%%%%%%%%%%JrJ6j6J6j6K4l2L2m0M8n6P1p9Q8j04J20j36J53j76K00k24K54
36A35k86L19l53L93m40M88n37N93o56P26q03Q85r75J072j178J299j431J576j741
55i14J927k140K384k665K998l399L887m499N295o371P909j0295J4502k3990P8963
70F3592J3428j72210R9688M9704o4515k4004Q6036p1466J5356J7097q315J6357
82B0748m5597K0495K9535N742q5067O3979L5660p3050K8870P418l335k2825M2573
95B5146l5074J0665K32j8042N3928n1001r475L0120K5664o1953K0971K8612l8013
108a8220K9369k2127J5426j6302J3425k115L880j1170j8382O1320m8217m756K1543
121C674M873k8286K8236J907n3353P4842l0153k5567K8177J1589m0686K6630K8841
$$ plain form
134 30724 -40217 8082 15535 -2060 -14110 6735 5544 -6034 13730 -17544 15784 -3300
146 -3300 -831 9168 1708 -8874 2647 27612 -27467 9553 10274 -3303 3677 4828 -1024 -4840
160 -4840 22567 -15672 9379 371 -2190 9562 -1725 1750 -6513 17092 -11230 6982 -2600
173 -2600 -4506 10309 -4680 1184 -7878 11834 -13235 10677 -3484 -15089 15634 -4492 -7656
186 -7656 -4741 14683 -23136 7799 8446 -21893 4476 3416 1269 -19269 11133 -4569 -2504
199 -2504 -1145 -6778 8339 -12953 5861 -2629 3284 -14927 8633 10701 -21235 8488 2011
212 2011 1541 -9126 11824 -6552 -1195 10251 -9606 10910 -7518 5575 978 7059 -6946
225 -6946 811 14673 -10276 8101 -3334 9155 -3905 4673 2420 -1941 8595 -8491 15108
$$ packed form
134C0724p0941M8299P453j7595j2050K0845j191j1578J9764l1274L3328j9084
146c300K469R999p460j0582J1521K4965n5079L7020P21j3577O980J151n852l816
160d840K7407l8239K5051r008k561J1752j1287L475q263K3605k8322J8212r582
173b600j906J4815j4989N864r062J9712k5069K3912j4161j1605L0723k0126l164
186g656K915J9424l7819L0935O47l0339K6369j060k147k0538L0402j5702K065
199b504J359n633J5117k1292J8814q490N913j8211K3560K068l1936K9723o477
212B011m70j0667K0950j8376N357J1446j9857K0516j8428J3093m597O081j4005
225f946P757J3862k4949J8377j1435J2489j3060Q578k253m361J0536j7086K3599
$$ plain form
238 15108 -7253 -247 4239 7121 -6048 -3568 15798 -14202 9057 -1520 497 -2693 2888
251 2888 2168 -7943 7634 -10042 9616 -6761 -1418 -784 -1235 1955 -9333 7909 -11785 6101
265 6101 -4691 -3229 -416 -3479 1345 -7298 7577 -14690 7015 -831 -7040 922 -1760 2256
279 2256 -9473 9422 -9570 2924 -960 -667 2262 -7305 7629 -5844 7046 -7768 5417
292 5417 1574 -3561 6401 -3248 5423 -5949 11652 -6702 2793 5071 -2938 7396 -4551 7020
306 7020 -3664 8872 -4296 3028 4086 -3913 8288 -5016 7450 -5401 7286 -1170 -302
319 -302 3720 -4247 7341 -5992 5527 -5346 4881 -2679 -1368 4599 -8634 7023 -5370
332 -5370 2918 -5784 3233 -1967 -3695 3660 -8678 5689 -7936 3686 -5302 -734 -158 -4404
$$ packed form
238A5108k2361P006M486K882j3169K480J9366l0000K3259j0577K017l190N581
251B888p20j0111J5577j7676J9658j6377N343O34m51L190j1288J7242j9694J7886
265F101j0792J462K813l063M824q643J4875k2267K1705p846o209P962k682M016
279B256j1729J8895j8992J2494l884K93K929r567J4934j3473J2890j4814J3185
292E417l843n135R962r649Q671j1372J7601j8354R495K278q009J0334j1947J1571
306G020j0684J2536j3168P324J058p999J2201j3304J2466j2851J2687q456Q68
319c02M022p967J1588j3333J1519j0873J0227p560J311N967j3233J5657j2393
332e370Q288q702R017n200j728P355j2338J4367j3625J1622q988M568N76m246
$$ plain form
346 -4404 3641 -8971 5086 -6448 2805 -4554 98 581 -6067 6382 -8071 5172 -5422 2690
360 2690 -839 -1008 1398 -3789 7576 -8051 6432 -2791 3170 -126 -1201 6003 -5153 6357
374 6357 -3326 7149 -4308 3054 4601 -2368 4028 -3396 10228 -6473 4567 1800 887 978 -676
389 -676 7335 -6451 6207 -3152 5530 -2526 -1192 5695 -4156 4212 -5790 7120 -4976 1249
403 1249 212 -833 1004 -6002 7525 -7845 2912 -3937 814 -1026 -4588 3287 -6040 4634
417 4634 -7897 3439 -3501 -869 -1127 -3938 4662 -8583 4085 -4244 1969 -4018 -804 1863
431 1863 -4975 4014 -6655 6535 -4672 561 -910 1468 947 -6935 9518 -4410 162 -1205
445 -1205 7821 -3466 -3870 10301 -3616 2587 -3071 8604 -3240 -142 4334 681 3803 -5952
$$ packed form
346d404Q045j2612J4057j1534R253p359M652M83o648J2449j4453J3243j0594Q112
360B690l529j69K406n187J1365j5627J4483r223N961l296j075P204j1156J1510
374F357r683J0475j1457P362J547o969O396p424J3624j6701J1040k767r13R1j654
389f76Q011j3786J2658r359Q682q056J334O887r851Q368j0002J2910j2096O225
403A249j037j045J837p006J3527j5370J0757o849M751j840l562P875r327J0674
417D634j2531J1336o940K632k58k811Q600j3245J2668q329O213n987L214K667
431A863o838Q989j0669J3190j1207N233j471K378n21p882J6453j3928M572j367
445a205R026j1287m04J4171j3917O203n658J1675j1844L098M476l653L122r755
$$ plain form
459 -5952 9225 -1960 1744 -2281 5950 2770 -7934 8862 -655 966 -5036 8830 -2050 -4232
473 -4232 5369 -1913 2762 -6911 6870 -3681 -117 -832 -1432 3613 -6580 3002 -4144 3915 -7548
488 -7548 1714 1964 -6972 2344 -2743 2520 -8254 4827 -3473 -3418 2331 -4133 167 -3896 5444
503 5444 -8877 3813 1408 -5840 1209 161 2116 -7901 7985 -3357 56 81 418 3046 -4530
518 -4530 5107 -3526 6422 -5018 1560 5737 -2476 4 671 8578 -9240 5915 3704 -1267 -844
533 -844 1931 7140 -7069 5524 -460 3698 -3082 1562 4740 -3143 3103 -3921 7942 -4782
547 -4782 -195 2645 780 -1729 -3782 8666 -7636 989 421 1815 -4575 -942 5094 -8450 4000
562 4000 -2992 415 -3344 1675 -2530 -3259 4746 -7993 2955 -3130 1144 -4221 123 1026 -4992
$$ packed form
459e952J5177j1185L704m025Q231l180j0704J6796r517J621o002J3866j0880k182
473d232R601p282M675r673J3781j0551L564p15o00N045j0193R582p146Q059j1463
488g548R262K50q936R316n087N263j0774J3081q300N5N749o464M300m063R340
503E444j4321J2690k405p248P049j048J955j0017J5886j1342L413K5L37K628p576
518d530R637q633R948j1440O578M177q213K480O67P907j7818J5155k211m971M23
533h44K775N209j4209J2593n984M158o780M644L178p883O246p024J1863j2724
547d782M587K840j865k509k053J2448j6302Q625n68J394o390L633O036j3544J2450
562D000o992L407l759N019m205p29Q005j2739J0948o085M274n365M344R03o018
$$ plain form
577 -4992 3620 -5434 3910 -4075 780 -1721 949 224 -6001 7661 -4886 902 -1144 3859 -2582
592 -2582 -1878 5540 -3501 3305 -3804 6424 -2290 -231 2977 164 3078 -4264 7331 -1951 2177
607 2177 -1489 4153 2257 -4788 6435 -1029 3397 -4563 6683 369 -3432 3932 169 1667 -5156
622 -5156 7447 -3887 454 400 -643 2278 -4161 4441 -3782 2811 -3723 1383 194 -4002 2293
637 2293 -3917 3241 -5904 3364 -3043 -1379 304 -3717 2386 -5183 2633 -5159 2672 -3154 -1150
652 -1150 2117 -4585 2798 -4297 3135 -4031 1917 -1110 -1510 1462 -3506 4647 -4647 3931 -2526
667 -2526 1678 595 -1197 3738 -2997 5204 -2642 3368 -1686 1939 1186 -1858 4795 -3333 5102
682 5102 -1621 3005 -547 2093 2345 -2622 4739 -3234 4181 -3076 2146 -407 -795 2784 -3078 3902
$$ packed form
577d992Q612r054R344p985M855k501K670p25o225J3662j2547N788k046N003o441
592b582P04P418r041O806p109J0228q714K059L208k813K914p342J1595r282M128
607B177l666N642j896p045J1223p464M426p960J1246o314l801P364l763J498o823
622e156J2603j1334M341n4j043K921o439Q602q223O593o534N106j189m196O295
637B293o210P158r145R268o407J664J683m021O103p569P816p792P831n826K004
652a150L267o702P383p095P432p166N948l027m00K972m968Q153r294Q578o457
667b526M204j083j792M935o735Q201p846O010n054L625p53l044O653q128Q435
682E102o723M626l552K640K52m967P361p973P415p257N222k553l88L579n862O980
$$ plain form
698 3902 -3433 4201 -3193 1092 249 -1013 1554 -4028 4580 -4877 2345 -1872 -248 -664 -2299 2292
714 2292 -4810 2833 -4715 1956 -2612 -845 440 -3624 2499 -4801 2670 -3864 1151 -1669 -1175
729 -1175 1227 -3523 2943 -4528 3695 -3654 1402 258 -1715 2061 -2932 3720 -3802 3678 -1973
744 -1973 1757 1020 -1232 3755 -2972 4434 -2690 3721 -761 1229 1946 -1150 3744 -2812 4891 -2353
760 -2353 3427 -210 391 2704 -2490 4375 -2578 3608 -2438 2838 -481 -826 2928 -3488 3839 -3582
776 -3582 3360 -2625 1308 341 -1759 1661 -3474 3634 -3906 2177 -2581 365 -138 -3163 3179 -4769
792 -4769 2196 -3488 1508 -2594 -452 527 -3543 2585 -4648 3097 -3496 938 -723 -988 949 -3293
808 -3293 3596 -3961 2717 -2352 1607 -80 -1396 2882 -3100 3522 -3108 3489 -923 772 999
$$ packed form
698C902p335P634p394M285q43j262K567n582Q608r457P222m217J624m16j635M591
714B292p102P643p548O671m568J767J285m064O123p300P471o534N015k820M94
729a175K402m750O466p471Q223p349N056j144j973L776m993O652p522P480n651
744a973L730p37k252M987o727P406p124O411m482J990P17l096M894o556P703p244
760b353N780l637O01K313n194O865o953O186o046N276l319l45L754o416P327p421
776c582O942n985L933r67k100L420n135P108p540O083m758K946n03l025O342p948
792d769O965n684M996m102K142R79m070O128p233P745o593M434j661k65J937m242
808c293O889p557O678n069L959j687j316M278n982O622o630O597m412J695K27
$$ plain form
823 999 -636 3216 -2814 4818 -2840 3248 -182 650 2207 -1438 3468 -2453 4561 -2599 2738 539
839 539 203 1992 -1431 4166 -3448 3682 -1865 1599 17 -995 2612 -2700 3017 -3913 3805 -2671
855 -2671 -16 1177 -2007 1816 -3539 3365 -3778 1481 -2430 195 321 -3506 2776 -3704 1735
870 1735 -3658 1971 -2107 -1123 950 -3947 1952 -4136 1557 -2772 2604 -1173 -1652 2815 -4109 2332
886 2332 -2321 2051 -1877 2167 185 -1378 2499 -3198 3793 -2410 2825 -1975 2363 1009 -2148
901 -2148 5352 -2136 2249 -1000 4484 -1453 419 2648 -1577 3851 -3755 3667 -945 1180 409
916 409 645 2230 -2772 3413 -2451 2663 -2399 1934 645 -1004 1879 -1161 3251 -4712 2588 -776
932 -776 -1062 -385 -278 1354 -4529 3535 -3863 700 -877 -1302 475 -2172 532 -3565 4212 -4928
$$ packed form
823I99j635L852o030P632p658O088l430Q32J557l645M906n921P014p160N337k199
839E39l36J789l423N597p614P130n547L464j582j012L607n312N717o930P718o476
855b671K655J193l184L823n355O904p143N259l911K625J26l827O282o480N439
870A735n393N629m078R84K073m897N899o088N693m329N376l777m79M467o924O441
886B332m653M372l928M044j982j563L877n697O991o203N235m800M338j354l157
901b148P500p488M385l249N484n937J872K229m225N428p606P422m612K125p71
916D09K36J585n002O185n864N114n062M333j289j649K883l040M412p963P300l364
932g76k86O77J07J632n883Q064p398M563j577m25J777k647K704m097P777r140
$$ plain form
948 -4928 -111 66 -2352 -599 -1650 2809 -4705 3136 -2347 -179 1210 -1457 329 -2565 2626
963 2626 -4757 3558 -1353 -938 1238 -612 1585 -2407 3868 -2893 2712 -988 981 2061 -1303
978 -1303 3287 -1740 3494 -2409 2839 758 1373 1844 -2101 4589 -2517 2548 -383 2459 -1092 74
994 74 3955 -3370 3069 -940 1756 -2916 2740 -135 -1907 2767 -4252 2506 -1827 755 -2258 2471
1010 2471 -628 -2946 3929 -4203 652 -1286 1321 -3464 141 547 -4414 2610 -3536 1270 -1892
1025 -1892 619 -2028 206 577 -3928 3263 -3387 1218 -1529 827 -791 -818 2136 -3091 3277 -2925
1041 -2925 2085 -1088 554 777 -1073 2356 -2602 3881 -2413 2523 589 113 1565 -87 2449
1056 2449 -2867 4772 -2171 1596 1192 -375 1647 -704 2802 -2790 3793 -1955 1071 1329 -1357
$$ packed form
948d928M817J77k418J753j051M459p514P841n483K168J389k667J786k894N191
963B626p383Q315m911M15K176j850K197l992O275o761N605l700J969J080l364
978a303M590n027N234n903N248k081O15M71l945O690p106N065k931K842l551J166
994G4L881p325O439m009K696m672N656k875j772M674p019O758m333K582l013M729
1010B471l099k318O875q132M855j938K607m785L605M06m961P024o146M806l162
1025a892K511k647K234L71m505P191o650M605k747K356j618k7K954n227O368o202
1041b925N010l173J642K23j850L429m958O483o294M936j934m76J452j652K536
1056B449n316P639o943L767m04j567K022k351L506n592O583n748L026K58k686
$$ plain form
1071 -1357 1681 -1149 2702 -3580 3725 -1437 -425 1439 -1344 1091 -1980 2366 -3816 2472 -1753
1086 -1753 -1149 1418 -2600 1146 -2354 1839 -3735 1952 -1406 -1461 1407 -2696 1578 -2703 1933 -3089
1102 -3089 1314 -1014 -1852 1755 -2905 1863 -2259 1810 -2559 1551 -183 -2056 3097 -2641 1925
1117 1925 -1680 2379 -1545 1367 629 -1527 3472 -2628 2507 -1283 1888 -666 1070 1490 -1909
1132 -1909 3673 -1964 2479 -511 1590 -390 819 1729 -2062 4103 -2520 2056 -189 1112 -285
1147 -285 40 1982 -2799 3328 -2555 1732 -751 118 -141 -996 1635 -3403 2868 -2797 585 -688
1163 -688 -435 -437 -1464 1610 -3660 2414 -2785 250 -141 -842 -14 -1931 1701 -3616 2374 -2094 128
1180 128 113 -1304 816 -2112 1963 -3006 2381 -1716 133 585 -1290 1623 -1613 2616 -2553 2706
$$ packed form
1071a357L038k830L851o282P305n162J012J864k783K435l071M346o182O288m225
1086a753O04K567m018L746l500M193n574N687l358n5K868m103M274m281M636n022
1102c089M403k328q38L607m660M768m122M069m369M110j734j873N153n738M566
1117A925l605M059l924K912p38k156M999o100N135l790L171k554J736M20l399
1132a909N582n637M443k990K101j980J209R10l791O165o623M576k245J301j397
1147b85L25J942m781O127n883M287k483Q69k59q55K631n038O271n665L382j273
1163f88K53kj027L074n270O074n199L035l91p01Q28j917L632n317N990m468K222
1180A28j5j417K120k928M075m969N387m097J849M52j875K913l236M229n169N259
$$ plain form
1196 2706 -783 -164 1907 -1145 2157 -1400 2727 -2001 2557 -118 -299 2266 -1266 2135 -1376
1211 -1376 2765 -1530 2004 269 -351 2306 -1397 2090 -1552 2467 -1643 1524 355 -1552 2382
1226 2382 -2183 1919 -1733 1693 -1493 499 455 -2269 2271 -2708 1573 -2061 763 -1303 -369 529
1242 529 -2570 1896 -2643 1052 -1999 576 -1050 -766 1109 -2847 2194 -2510 949 -1638 192
1257 192 -546 -857 1594 -2503 2531 -2275 1163 -766 408 619 -936 1989 -2215 2844 -1590 1453
1273 1453 -138 100 1107 -788 2501 -1958 3064 -1471 1242 394 161 1489 -866 2831 -2324 2737
1289 2737 -859 767 502 -273 1462 -1312 2530 -2281 2240 -701 302 758 -1082 1431 -1959 2238
1305 2238 -2128 1326 -685 -471 723 -1733 1094 -2482 2033 -2423 847 -755 -1036 599 -2132
$$ packed form
1196B706l489O19K071l052L302l557M127m728M558k675j81K565l532L401l511
1211a376M141m295L534j735o20K657l703L487l642M019m110L167j169j907L934
1226B382m565M102l652L426l186J992m4k724M540m979M281l634K824k066R34Q98
1242E29l099M466m539L695l051K575j626K84J875l956N041m704L459k587J830
1257A92p38l11K451m097N034m806L438j929J174K11j555K925m204N059m434L043
1273A453j591K38J007j895L289m459N022m535K713q48k33J328k355L697n155N061
1289B737l596J626k65p75J735k774L842m811M521k941J003M56j840K513l390M197
1305B238m366L454k011K14J194k456K827l576M515m456L270j602k81J635k731
$$ plain form
1320 -2132 1256 -2427 936 -1894 485 -456 -1226 842 -2474 1510 -2396 1262 -1463 174 -66 -1391
1336 -1391 1695 -2158 1802 -1605 1713 -1173 657 968 -1443 2185 -1258 2038 -1370 1837 -102
1351 -102 -147 1431 -1148 2104 -1342 2197 -1202 1629 403 -281 1739 -1065 2320 -1726 2519 -893
1367 -893 956 971 -768 1665 -1683 2264 -1641 1619 -530 144 500 -869 1426 -1905 1868 -2213
1383 -2213 1361 -579 -415 397 -1445 1137 -2496 1489 -1938 19 -467 -697 249 -2198 1586 -2984
1399 -2984 770 -1218 -83 -136 -693 649 -2112 1737 -2080 1136 -822 303 -332 -1302 1157 -2390
1415 -2390 1601 -1284 804 -612 538 682 -1179 2115 -1992 1534 -871 731 -84 508 1058 -1144
1431 -1144 2564 -1484 1585 -723 2058 709 567 1470 -859 2526 -976 1453 -656 270 -120 -647
$$ packed form
1320b132L388l683L363k830K379r41p70K068l316L984l906L658k725J637k40j325
1336a391L086l853L960l407L318k886J830L11k411L628l443L296l408L207j939
1351a02m5J578k579L252l446L539l399K831j226o84K020k804L385m046M245l412
1367h93J849J5j739K433l348L947l905L260k149O74L56j369K295l331L773m081
1383b213L574j940J64Q12j842K582l633L985l427J957m86k30R46k447L784m570
1399b984L754j988J135n3n57J342k761L849l817L216j958J125o35r70K459l547
1415b390L991k885K088j416J150J44j861L294m107L526k405J602q15N92N50k202
1431a144L708m048L069k308K781j349j42R03k329L385l502K429k109R26l90n27
$$ plain form
1447 -647 1743 -1798 1861 -1030 1016 -585 255 811 -1800 1016 -1549 1521 -1543 806 -757 -834
1463 -834 247 -2033 735 -2362 1114 -1995 382 -440 -603 518 -2299 1386 -1836 553 -1936 -673
1479 -673 -66 -1476 532 -1176 422 -1592 1051 -1727 -295 829 -1062 1393 -1340 1574 -1355
1494 -1355 1125 -56 -75 1169 -880 1141 -1120 2008 -1156 1347 310 -138 1416 -830 2062 -1063
1510 -1063 1917 -682 1211 437 171 1401 -893 2014 -1092 1810 -602 351 477 -541 1177 -1515
1526 -1515 1705 -1281 959 -548 -83 587 -1208 1220 -1978 1329 -1362 292 -596 -475 88 -1653
1542 -1653 1216 -2230 1017 -1402 -221 -494 -899 619 -1860 1224 -2054 825 -1221 254 -400 -936
1558 -936 850 -2084 1727 -1517 708 -498 141 439 -908 1497 -1564 1583 -1076 1185 29 119
$$ packed form
1447f47K390l541L659k891K046j601Q40N56k611K816k565L070l064K349j563p7
1463h34J081k280K768l097L476l109K377q22j63J121k817L685l222K389k489J263
1479f73O07j410K008j708J598k014K643k778J432J124j891K455k733K914k929
1494a355K480j181j9J244k049K021k261L128l164K503j037m48J554k246K892l125
1510a063K980k599J893p74k66J230k294K907l106K902k412R53J26j018J718k692
1526a515L220k986K240j507M65O70j795K428l198L307k691J654q88J21N63j741
1542a653K869l446L247k419J181k73m05J518k479L084l278K879k046J475o54n36
1558i36J786k934L811l244K225j206O39K98j347K405l061L147k659K261j156R0
$$ plain form
1574 119 1150 -856 1846 -1406 1781 -738 1002 262 2 1322 -904 2035 -1032 1836 -387 644
1590 644 565 -612 1269 -692 1449 -1399 1470 -792 261 674 -1152 1178 -1198 1391 -1356 1082
1606 1082 -666 -262 496 -1385 788 -1706 1424 -1742 516 -283 -670 557 -1775 828 -1709 831
1622 831 -1478 275 -454 -878 439 -1568 1038 -1562 1016 -1083 -33 344 -957 881 -1659 1302
1638 1302 -1554 815 -513 88 452 -1033 1424 -1391 1585 -817 1005 98 208 913 -727 1982
1654 1982 -1228 1546 -498 1021 414 213 1233 -1070 1852 -865 1223 -547 780 155 -283 1292
1670 1292 -1271 1557 -1015 1033 -280 196 142 -879 1058 -1489 1427 -1424 542 -656 -172 360
1686 360 -1308 956 -1851 851 -1517 453 -398 -676 522 -1632 896 -1583 719 -1424 384 54
$$ packed form
1574A19J031k006K702l252L187k519J740p40k60J320k226K939l067K868k223J031
1590F44p9j177J881j961K141k848K869k262J053M13j826K330k376K589k747K438
1606A082j748M04P58j881K173k494L130l166K258p99l87J227k332K603k537K540
1622H31k309J753p29m24J317k007K606k600K578k099J050L77j301J838k540K961
1638A302k856K369j328O01L64j485K457k815K976k402J822r07J10P05j640K709
1654A982l210K774k044J519o07k01J020k303K922k717K088j770J327o25m38J575
1670A292k563K828k572K048j313M76n4j021J937k547K916k851J966j198M84N32
1686C60j668K264k807K702k368J970q51k78J198k154K528k479K302k143J808l30
$$ plain form
1702 54 -899 577 -956 1069 -1864 737 -1072 231 209 -817 862 -1627 734 -1469 858 -447
1718 -447 302 605 -576 1976 -1240 1474 -703 838 155 -82 883 -517 1569 -1470 2133 -68
1734 -68 703 422 196 2097 -1084 1902 -1424 722 161 555 288 -777 1570 -1175 1474 -498 755
1751 755 -333 -125 293 -876 1615 -1660 1025 -1142 529 -579 -251 254 -1540 1146 -1753 820
1767 820 -1127 301 -458 -748 485 -1407 1000 -1605 830 -1178 292 -196 -1082 1004 -1685 1043
1783 1043 -1207 874 -839 299 220 -962 976 -1251 1195 -938 1022 -259 44 619 -917 1520
1799 1520 -994 1699 -900 1033 87 -237 1221 -726 1520 -1101 1543 -326 563 538 -220 1176
1815 1176 -1152 1487 -1210 1488 -247 51 707 -555 1054 -1151 1542 -1321 657 -438 -161 542
$$ packed form
1702E4r53J476j533K025k933K601j809J303k2j026J679k489K361k203K327j305
1718d47P49L03j181K552l216K714k177J541o83k37R65j400K086l039L603k201
1734f8P71k81k26J901l181K986l326K146n61L94k67j065K347k745K649j972J253
1751G55j088K08M18j169K491l275K685k167J671j108L28N05j794K686k899K573
1767H20j947J428p59k90J233j892K407k605K435k008J470m88q86K086k689K728
1783A043k250K081j713J138p9j182J938k227K446k133J960j281L03N75j536K437
1799A520k514K693k599J933r46l24J458j947K246k621K644j869Q89k5p58J396
1815A176k328K639k697K698j735K98O56j262J609k205K693k863J978j095K77P03
$$ plain form
1831 542 -901 1286 -1595 1286 -1211 412 -374 -723 256 -1264 1124 -1985 938 -1171 -101 -418
1847 -418 -983 561 -1440 1131 -1604 847 -885 64 -103 -756 737 -1651 1227 -1322 735 -581
1863 -581 18 305 -1055 1034 -1162 1374 -995 861 -80 223 968 -1164 1414 -848 983 -440
1879 -440 912 130 -104 1263 -829 1445 -1113 1509 -676 344 318 -282 1326 -977 1158 -835
1895 -835 1323 -635 219 573 -812 1207 -1123 803 -968 865 -413 18 869 -1149 991 -1094
1911 -1094 867 -1106 310 -344 -536 567 -1676 900 -1391 814 -1239 288 -46 -971 416 -1322
1927 -1322 1001 -1497 553 -901 -104 174 -761 702 -1328 1188 -1235 691 -300 -150 235 -895
1943 -895 1065 -1249 1481 -899 769 141 117 751 -815 1743 -1108 1236 -495 571 374 -59 1258
$$ packed form
1831E42j443K187k881K881k497J623p86l49R79j520K388l109K923k109J070l17
1847d18n65J544k001K571k735K451j732R49j67o53J493k388K878k549K057j316
1863e81N99K87j360K089k196K536k369J856r41L03P45k132K578k262J831j423
1879d40J352p82k34J367k092K274k558K622k185J020k6o00J608k303K135j993
1895h35K158j958Q54L54j385K019k330J926j771J833j278M31Q51k018K140k085
1911a094J961j973J416o54j92J103k243K576k291K205k053J527l34r25J387j738
1927a322K323k498K050j454P97K78r35J463k030K516k423J926r91J50L85j130
1943h95J960k314K730k380J668o28k4O34j566K558k851K344j731J066j97m33J317
$$ plain form
1960 1258 -635 1610 -979 1470 -21 359 488 -200 1132 -1017 1415 -946 962 -151 -82 436
1976 436 -476 827 -1174 1039 -1021 639 -234 -531 410 -1098 925 -1509 718 -1265 472 -146
1992 -146 -779 530 -1246 946 -1200 435 -975 152 -114 -1041 539 -1271 756 -1238 858 -713
2008 -713 117 265 -1057 952 -1149 599 -1014 777 -637 -19 498 -730 1414 -973 1173 -766
2024 -766 798 160 24 834 -757 1468 -586 1033 -405 801 236 -334 1169 -702 1534 -713
2040 -713 920 -245 328 439 -568 1186 -1058 1388 -678 521 -96 126 242 -575 882 -1295 996
2057 996 -876 57 -121 -203 314 -1163 1021 -1710 674 -921 -45 -256 -360 386 -1308 1072 -1373
2074 -1373 552 -808 -196 167 -685 599 -1390 1167 -1185 751 -244 -129 217 -816 969 -1072
$$ packed form
1960A258j893K245k589K449j491L80J29o88J332k149K432k361J908j113O9N18
1976D36r12J303k001K213k060J660q73k97R41j508K023k434K227j983J737o18
1992a46o33J309j776K192k146J635j410J127k66r27J580j810K027j994K096j571
2008g13Q30J48j322K009k101J748j613J791j414O18N17j228K144k387K146j939
2024g66J564o38j36Q10j591K225k054J619j438J206n65n70J503j871K236k247
2040g13J633j165N73J11j007J754k244K446k066J199o17K22J16q17J457k177K291
2057I96j872R33j78q2N17j477K184k731K384j595Q76k11j04P46j694K380k445
2074a373J925j360O12L63q52J284j989K557k352J936r95J15L46j033J785k041
$$ plain form
2090 -1072 1101 -963 575 -126 -309 623 -595 812 -1049 1473 -854 569 188 -171 904 -667
2106 -667 1225 -698 1336 -578 1045 472 -259 1250 -612 1066 -936 1190 -331 327 389 -723
2122 -723 1064 -858 1094 -721 712 -547 -8 674 -1015 966 -950 678 -967 598 -282 -513
2138 -513 515 -1326 866 -1090 812 -1080 31 -150 -716 564 -1279 938 -951 332 -773 3
2154 3 -262 -604 985 -1301 848 -928 347 -541 151 -1 -867 1122 -1058 981 -727 502 176
2171 176 76 647 -644 1107 -1216 1096 -332 578 319 240 841 -647 1516 -718 1028 -229 316
2188 316 576 -125 642 -840 1585 -1123 1011 -217 162 615 -618 925 -1159 1288 -945 435
2204 435 -388 -282 363 -914 809 -1355 806 -980 137 -136 -671 403 -985 504 -1115 638
$$ packed form
2090a072K173k064J538p01j83R32j218J407j861K522k327J423l81l59J075j571
2106f67J892j923K034j914J623n73p31J509j862J678k002K126j521O58O2j112
2122g23J787j922J952j815J433j259N39O82j689J981j916J628j645J565q80k31
2138e13J028j841K192j956J902j892J111j81n66J280j843K217j889J283j105P76
2154Ck65l42J589k286K149j776J275q88O92j52q66J989k180K039j708J229l26
2171A76j00N71j291J751k323K312j428R10k59p9O01j488K163k234J746j257N45
2188C16K60p01P67j482K425k708K134j228L79M53j233J543k084K447k233J380
2204D35q23J06O45j277J723k164K161j786J117k73n35J074j388J489j619J753
$$ plain form
2220 638 -937 18 -146 -836 513 -1259 527 -1136 637 -725 -118 234 -858 781 -811 796
2236 796 -1076 688 -446 -372 565 -1079 929 -761 1217 -732 847 -26 -9 825 -805 1390 -455
2253 -455 1047 -531 649 207 -147 895 -644 1404 -623 977 -356 569 218 -220 960 -777
2269 -777 1124 -761 638 -234 -156 169 -506 882 -1318 1202 -622 324 -225 -248 503 -971 956 -1281
2287 -1281 693 -685 150 -443 -172 130 -1123 644 -1376 220 -208 -175 -270 -657 112 -815 583 -483
2305 -483 893 -343 -282 134 -815 805 -1172 1067 -117 421 -277 -313 424 -888 988 -703 839
2322 839 -723 585 159 31 1254 -823 901 -585 1025 -532 652 214 -292 1244 -514 1397
2338 1397 -355 987 -186 302 603 -375 938 -658 907 -642 782 -163 186 436 -623 559
$$ packed form
2220F38j575R55j64o90J349j772J786j663J773j362O07L52j092J639j592J607
2236G96j872J764j134P4R37j644K008j690J978j949J579q73J7Q34j630K195j845
2253d55J502j578J180m42l54J042j539K048k027J600j333R25l51m38J180j737
2269g77J901j885J399q72P8L25o75J388k200K520j824R46n49k3P51j474J927k237
2287a281J974j378Q35n93K71L02j253J767k020J596m28L3r5l87P69r27J398j066
2305d83J376j236O1M16r49J620j977K239j184N38o98l6P37j312J876j691J542
2322H39j562J308m26j28J223k077J724j486J610j557J184m38n06J536j758J911
2338A397j752J342j173M88L01r78J313j596J565j549J424r45L49K50j059J182
$$ plain form
2354 559 -932 825 -526 320 -116 -357 742 -865 924 -794 271 -762 217 -58 -225 911 -1016
2371 -1016 930 -780 627 -798 -59 83 -717 785 -965 872 -872 127 -226 -426 470 -813 914
2388 914 -562 589 -735 545 -145 -249 646 -428 658 -650 937 -636 434 359 72 687 -726
2405 -726 1134 -503 838 -118 219 268 -482 1122 -692 1161 -580 1008 308 114 479 -570 844
2422 844 -664 525 -1029 601 291 -185 659 -265 435 -624 665 -339 -133 31 -456 254 -1101
2439 -1101 283 -976 133 -594 -94 -163 -622 311 -1213 323 -1346 289 -20 -137 -160 -1178 -129
2456 -129 -887 568 -849 -121 -136 -783 485 -844 570 -120 372 -376 182 851 -17 691 -1083 1676
2474 1676 95 460 -345 510 103 148 890 -1009 1064 -549 900 56 261 938 247 278 -44 1826
$$ packed form
2354E59j491J757j351Q46m36k41J099j607J789j718J065j033R79k75j67J136j927
2371a016J946j710J407j425P39J42q00J502j750J837j744R99l53k00Q96j283J727
2388I14j476J151j324J280o90j04Q95j074J086j308J587j573J070p5k87O15j413
2405g26J860j637J341r56L37M9p50J604j814J853j741J588p00j94L65j049J414
2422H44j508J189j554J630l10m76Q44r24P00j059J289j004K06J64m87P10j355
2439a101J384j259J109p27N00o9m59R33j524J536j669J635l09j17k3j018J049
2456a29p58J455j417P28j5o47J268j329J414o90M92p48N58O69q68P08j774K759
2474A676j581L65q05Q55m07M5P42j899K073j613J449q44K05O77o91L1l22J870
$$ plain form
2492 1826 -676 356 266 377 1142 -405 673 -315 548 -828 181 -516 442 650 -418 904 -643
2509 -643 1404 -1054 -161 -325 -1070 99 -773 677 -775 138 -561 -386 239 -1142 277 -1131 883
2526 883 -505 -45 -432 -302 294 -687 563 -308 436 -944 478 -193 -549 341 -621 184 -1000 425
2544 425 -674 158 49 -284 1030 -373 1285 -545 534 31 -71 395 114 835 -389 957 -554
2561 -554 690 -80 675 328 -535 460 -1108 725 61 348 120 -357 -1 -390 876 -574 772 -364
2579 -364 217 107 -731 415 -370 318 -918 505 -325 130 -215 -339 370 -921 473 -967 60 -469
2597 -469 -199 -419 -768 345 -931 657 -706 272 -168 20 95 -199 460 -660 524 -865 514 -318
2615 -318 -256 464 -350 558 -576 426 -295 286 12 -65 738 -650 653 -472 602 -354 277 244 -352
$$ packed form
2492A826k502J032r0J11P65j547J078r88Q63j376J009o97R58K08j068J322j547
2509f43K047k458Q93j64p45J169q72J450j452R13o99J75O25j381J419j408K014
2526H83j388M60l87J30N96r81J250q71P44j380J422o71l56Q90r62Q05j184J425
2544D25j099Q32j09l33J314j403J658j830J079n03j02M66k81P21j224J346j511
2561e54J244p70P55l47q63R95j568J833o64K87k28m77L56l89J266j450J346j136
2579c64N81j10q38J146p85O88j236J423q30M55l45j24P09j291J394j440J027n29
2597d69K70k20l49J113j276J588j363R78m40J88P5k94O59j120J184j389J379q32
2615c18O2P20q14R08j134J002p21N81k74p7Q03j388J303j125J074r56O31l3n96
$$ plain form
2634 -352 810 -637 653 -240 630 -51 233 482 -438 922 -258 776 -347 474 -66 -102 391 -447
2652 -447 679 -754 495 -870 387 -23 -311 363 -797 581 -797 267 -711 -147 60 -241 -113
2669 -113 -777 -31 -393 302 -615 152 43 -634 298 -894 347 -763 243 -182 65 190 -642 772
2687 772 -598 892 -586 411 167 458 607 -933 569 -1011 73 -348 -455 600 -167 413 -161
2704 -161 1110 -378 230 -26 239 111 -535 810 -711 1043 -507 433 280 -200 105 -366 85 -734
2722 -734 -39 -423 163 572 71 483 -673 607 -735 466 -391 458 234 -221 389 -1074 488 -259
2740 -259 -141 -646 -126 84 -495 565 -1285 289 -603 -561 -436 -330 818 -506 580 -899 137 -769
2758 -769 772 -179 -549 130 -471 1275 -671 46 -452 468 470 -130 201 -1092 597 -721 560 -334
$$ packed form
2634c52J162j447J290q93Q70o81K84K49r20J360j180J034j123Q21n40l6M93q38
2652d47J126j433J249j365J257m10k88O74j160J378j378J064r78N64K07l01J28
2669a13o64P46l62O95r17P67j09o77R32j192J241j110J006m25K47J25q32J414
2687G72j370J490j478R97k44K91J49j540J502j580J084m21j07J055p67N80n74
2704a61J271j488O08k56K65j28o46J345j521J754j550R40j53m80L05m71M51q19
2722g34O95l84N86M09n01M12j156J280j342J201q57Q49k24m55O10j463J562p47
2740b59J18n05N20K10n79J060j850J574q92M2J25J06J148j324J086j479J036r06
2758g69J541r51l70O79o01J746j946P17m98R20Ko00L31j293J689j318J281q94
$$ plain form
2776 -334 371 41 -36 154 -78 839 -199 123 -383 0 618 -215 1056 -652 639 -423 570 20 -54
2795 -54 356 -511 475 -577 735 -790 688 188 -402 238 -728 874 -639 592 -404 127 221 -283
2813 -283 783 -922 414 -976 627 -470 -13 -28 -451 566 -1060 -87 -590 -133 -527 -377 -88 -961
2831 -961 -73 -1168 251 -443 244 -250 -371 393 23 542 -1188 308 -870 341 132 -206 741 -349
2849 -349 1045 -119 368 -243 -119 82 -150 284 -446 1083 -346 60 -470 -100 624 112 858 -440
2867 -440 988 -708 403 -209 404 224 -763 710 -829 525 -441 182 199 17 67 -674 473 -662
2885 -662 -73 -102 115 2 -308 367 -610 267 -509 128 -250 -97 139 -328 601 -327 200 -305 -17 269
2905 269 -454 -328 -219 448 -834 468 -572 347 -45 371 525 -1204 269 -983 603 -675 69
$$ packed form
2776c34P05l30p7J90k32R17j038L22n06L83O18q33J271j708J291j062R93n50p4
2795e4M10q67R86j052J312j525J478n00n90O40r66J602j513J231r96N31R4n04
2813b83J066j705J336j390J603j097M57j5m23J017j626R73n03M57l94J50K89q73
2831i61Q88j095J419o94O87m94j21P64l70N19j730J496j178J211k09l38R47j090
2849c49J394j164M87o11J24K01k32M34p30J529j429M06n30L70P24n12P46j298
2867d40J428j696J111o12O13j80r87J473j539J354r66O23J7j82N0p41J147j135
2885f62N89k9K17j13l10O75r77Q77p76O37l78J53K36m67R29r28N27n05K88K86
2905B69p23J26J09O67j282J302j040R19l92M16J54j729J473j252J586j278P44
$$ plain form
2922 69 161 -1286 433 -838 1019 -528 527 -1046 589 503 370 771 -7 207 -441 490 -723 66
2940 66 1569 -168 1315 -161 1134 -603 -148 82 -502 -263 -975 565 191 1063 -440 38 -214 405
2958 405 311 -957 790 -223 -45 -253 -245 603 -646 -171 -246 -188 -848 -398 402 196 -359 430 570 -373
2978 -373 296 -321 190 -38 -665 -336 -136 83 -984 272 -476 -98 -301 -861 359 -634 93 -437 168
2997 168 -419 487 596 -127 1194 -1353 739 -227 971 304 839 827 -224 782 96 503 -227 502
3015 502 -338 -54 80 -365 706 -438 417 -330 316 11 -306 272 -335 571 -515 659 -499 218
3033 218 -82 -632 282 -624 482 -689 202 -302 -34 -88 -320 202 -363 345 -509 311 -351 -218 257 -528
3053 -528 462 -773 339 -354 376 -243 -251 219 -830 642 -891 411 -330 155 -66 -123 216 -464 583
$$ packed form
2922F9R2j447J719j271J857j547J055j573J635q6j33M01p78K14o48R31j213P89
2940F6J503j737J483j476J295j737M55K30n84K39p12J540l74Q72j503M78k52O19
2958D05r4j268J747j013J78k08QQ48j249M75p5N8o60M50Q00k06n55P89J40r43
2978c73O69o17N11k28o27L29K00K19j067J256p48L78k03n60J220r93P27n30O05
2997A68n87R06J09p23J321k547K092r66J198o67N35j2j051J006o86M07p30P29
3015E02q40K84J34m45J071j144Q55p47O46l05l17N78o07R06j086J174j158P17
3033B18l00n50R14r06J106j171Q91n04K68n4k32N22n65P08q54Q20o62J33M75p85
3053e28R90j235J112o93P30o19qM70j049J472j533J302p41M85k21n7L39o80J047
$$ plain form
3072 583 -603 582 -240 121 298 42 631 -503 630 -478 302 -82 9 336 -49 380 -265 977
3090 977 -519 399 -91 -602 1034 -561 -438 -884 505 741 -240 -185 -465 458 245 411 -434 60 -439
3109 -439 437 -87 -422 -152 -712 394 -992 293 -231 -49 356 -873 755 -264 -34 -1109 267
3126 267 -406 470 -145 -76 -419 -503 341 -347 35 -66 -84 199 -875 440 -576 926 -55 39 62 -380
3146 -380 586 -1092 1320 236 429 170 -408 -107 -1 548 278 516 -166 413 -159 -61 398 -389 251
3165 251 -578 416 -478 300 401 502 146 -607 557 -1063 20 -140 221 -373 -648 113 -822 163 -669
3184 -669 219 -29 -9 -142 -470 475 -678 323 -718 427 -250 40 9 -678 377 -274 550 -557 -76
3203 -76 -183 -120 -67 -253 283 -243 234 -304 379 -113 -61 300 -680 414 -748 332 -331 -3 -173 -175 137
$$ packed form
3072E83j186J185q22L61J77k56N89j134J133j108P80l84R1L27l85M29o45J242
3090I77j496R18m90n11J636j595J23m46J389K36r81N5k80R23k13J66q45M94m99
3109d39Q76n24l35K70n60J106j386J285n24J82M05j229J628j019K30j075J376
3126B67o73Q76o15O9l43q4Q44o88L82j01j8K83j074J315j016J502r81R4K3m42
3146c80R66j678K412j084J93k59n78L01J06N49k70K38o82N79n72R8M59p87O40
3165B51q29R94q94P78J01J01l56p53J164j620J083j60L61n94k75P61r35R85q32
3184f69Q88k48K0j33l28R45j153J001j041J145o77K90l1o87J055o51Q24j107M81
3203g6j07O3N3j86N36n26M77n38O83m92N2L61r80J094j162J080o63L28j70kL12
$$ plain form
3224 137 -916 564 -799 123 -265 183 999 58 560 -606 393 220 -71 -313 271 1109 -570 967
3242 967 -234 179 -670 623 -176 245 81 -626 266 -412 663 -236 -789 -492 47 131 -407 215 -518
3261 -518 357 -406 81 -50 -349 342 -593 489 -718 43 -306 37 194 -465 241 -678 311 -176 124
3280 124 -60 -206 5 -502 412 -651 403 -247 -2 183 42 279 -596 510 -416 382 -216 126 265
3299 265 48 275 -411 395 -64 318 -102 23 135 -177 489 -161 583 -362 185 71 177 289 -542 591
3319 591 -363 610 -274 347 43 18 381 -314 477 -434 269 -275 217 90 -372 347 -456 437 -561 193
3339 193 -444 55 2 -375 292 -279 423 -284 281 -416 -9 -15 -265 293 -510 454 -562 329 -102 -210 392
3360 392 -302 311 -625 280 -354 388 -3 -242 152 -522 214 -203 466 -142 147 410 -147 533 -244 395
$$ packed form
3224A37j053J480j363R22l88M48Q16r41N02j166R99j73k91k42N84Q38j679J537
3242I67j201M13q49J293p99M21j64p07Q92o78J075q99n53K97N39Q4n38O22p33
3261e18Q75p63M87j31k99O91r35J082j207P61l49L43J57o59P06r19R89m87L00
3280A24j84j46K11n07R14j063J054o50K45J85j41K37q75J106r26P98n98L42J39
3299B65k17K27o86Q06m59L82m20J25J12l12O66o50P44r45N47j14J06J12q31J133
3319E91r54R73q84O21l04k5L63o95P91r11P03n44M92j27m62P19q03Q93r98P54
3339A93o37M99n3l77O67n71P02p07N65o97M07ok50N58q03R64j016Q91m31j08O02
3360C92o94O13r36R05o34P42l91k39L94o74P36m17O69o08K89K63n57O80p77O39
$$ plain form
3380 395 -294 186 -165 20 298 -224 629 -186 709 -227 282 -176 74 281 -61 566 -457 429 -173 352
3400 352 -14 14 -102 -378 193 -447 330 -170 -8 -45 -223 97 -619 443 -425 141 -305 -24 45 -287 150
3421 150 -418 220 -465 -30 -377 -43 124 -255 344 -517 274 -333 271 -164 84 227 -332 554 -467 587
3441 587 -214 17 -60 22 567 -386 477 0 288 -274 264 -5 -342 390 -58 690 -289 544 2 140 303
3462 303 -228 565 -382 264 -105 272 133 141 172 -342 357 -123 448 -319 84 26 -405 194 -394 186 -351
3483 -351 359 -269 35 -187 -259 381 -369 332 -647 266 -29 -120 -21 -253 50 -478 295 -515 81 -142 -103
3504 -103 -50 -136 23 -498 300 -182 -61 -4 -194 179 -228 233 -395 556 -305 295 -122 -155 223 -361 504
3525 504 -327 643 -105 191 426 -311 276 -306 588 -165 555 -95 43 515 -377 656 108 467 -176 484
$$ packed form
3380C95o89M80l51J85K78n22Q53q15Q95r36N09m58K50K07l42O27j023Q86o02N25
3400C52l66K8j16k76N71o40P77n00J62l7j78L20p16J062q68N66m46K81O9l32M37
3421A50n68O38o85M35l47L34J67l79N99q61P91o07O04m35K48J43n59Q86j021J054
3441E87q01K31p7Q2N45r53Q63m77K88n62N38k69l37P32m48P48r79Q33n42J38J63
3462C03n31P93r47O46l69L77j39QL1n14O99m80N71p67M03n8m31N99n88N80n37
3483c51P10o28L04k22p2O40p50P01r79R13k95r1R9k32L03n28P73q10N96k23L9
3504a03N3q6J59n21P98m82J21N7j90L73m07M61o28R51q61O00m17l3L78n84Q65
3525E04q31R70p48K96K35p37N87n82Q94p53P20o50J38M72q92J033n48L59o43O60
$$ plain form
3545 484 -52 52 494 -238 475 -562 261 -426 81 67 -4 170 -324 215 -476 422 -58 182 -40 -70 113
3566 113 -363 193 -386 48 -108 -175 -265 -515 153 -268 247 -238 111 -341 -264 136 -343 151 -437 301 -200
3587 -200 -27 -58 59 157 -256 262 -136 480 113 104 479 -243 468 -326 198 -428 249 31 195 47 -154
3608 -154 391 -40 373 -287 335 -97 104 292 -96 447 -201 352 -355 16 340 -186 126 120 305 -466 169
3629 169 -287 -121 72 -308 -202 -482 419 -350 326 -470 -219 31 -331 352 -495 126 -568 75 -247 -17
3649 -17 75 -278 151 -292 167 -360 203 -184 -329 -75 -221 335 -409 256 -328 20 -40 128 232 -38 336
3670 336 -248 249 -331 228 -174 -308 488 -251 471 -151 173 -69 293 240 -94 442 -241 304 -335 306
3690 306 47 -57 359 -252 388 -441 492 -183 295 134 88 156 -201 561 -301 348 -123 -14 -278 -99 23
$$ packed form
3545D84n36J04M42p32P13j037Q23o87N07j4p1J74m94N39o91Q98m80K40k22l0J83
3566A13m76N56n79M34j56o7r0k50O68m21N15m85L49m52P7M00m79M94n88P38n01
3587b00J73l1J17R8m13N18l98O16l67rL75p22P11p94N24o26O77k18J64j48k01
3608a54N45m31M13o60O22m32K01J88l88N43o48N53p07L71L24n26L12oJ85p71O35
3629A69m56J66J93l80J06k80R01p69O76p96K51K50l62O83q47O21o94O43l22K30
3649a7R2l53M29m43M59n27N63l87j45K54j46N56p44O65n84L48o0J68J04k70L74
3670C36n84M97n80N59m02j34P96p39P22o22L24k42L62n3l34N36o83N45o39O41
3690C06k59j04M16o11O40q29R33o75M78j61m6O8l57P62q62O49m71J09k64J79J22
$$ plain form
3711 23 -165 300 -376 292 -191 -76 -254 -410 -124 -447 87 -322 50 -373 -110 104 -99 280 -68 363
3731 363 -352 285 -117 -118 218 -308 303 -469 296 -410 275 10 -170 274 -20 270 -233 386 -202 -159 -130
3752 -130 -148 431 -237 398 -191 453 -231 192 364 -320 225 -178 346 -218 257 268 43 273 -74 457 -221
3773 -221 252 -235 256 -54 -280 245 -317 75 -252 89 -239 199 -2 -358 396 -245 258 -650 134 -55
3793 -55 -157 -107 -152 -171 -538 199 -617 -142 79 -2 216 -371 164 -59 503 -248 -345 -689 -341 -21 -805 185
3815 185 -144 128 -531 178 -192 -52 167 -645 123 -121 400 -512 226 -28 138 268 -269 601 -541 192
3835 192 200 -149 178 -241 253 -238 750 -128 -38 -213 166 736 -295 571 -105 326 -551 2 -21 35 -190
3856 -190 -100 317 -106 611 -23 377 23 -578 -186 -429 771 -435 -105 -239 -202 13 -480 106 -443 -359
$$ packed form
3711B3j88M65o76O68m83J15j78j56K86l23N34m09L72m23K63K14k03L79l48M31
3731C63p15O37m02jL36n26O11p72P65p06O85k65j80M44k94K90n03O19n88M3K9
3752a30j8N79o68O35n89O44o84M23J72o84N45m03N24n64M75J1k25K30l47N31o78
3773b21M73m87M91l10k26N25n62L92l27L41l28M38k01l56P54o41N03r08P84j89
3793e5j02N0m5j9l67P37q16M75K21q1K18n87N35k23N62p51r7l44L48L20p84R90
3815A85l29K72o59P09l70J40K19q12P68k44N21r12P38k54J66J30n37Q70j142P33
3835A92Ql49L27m19M94m91R88q78R0j75L79N70j031Q66o76M31q77N53k3N6k25
3856a90R0M17m23P17o34M00l54o01L92k43J200j206L30j34L7K15m93N86n49Q4
$$ plain form
3876 -359 31 147 -206 555 274 536 740 -482 129 -164 501 291 -315 554 5 250 -701 -288 -22 674
3896 674 27 -384 286 -571 212 -311 801 -100 543 -161 549 247 -473 -189 -43 708 -549 827 -525
3915 -525 -628 64 267 718 201 -124 -34 219 158 -460 416 -117 20 -356 124 -325 -160 232 -502 242 -696
3936 -696 -79 -89 153 -35 -222 -183 -526 159 -390 238 -368 -286 225 -273 317 -504 336 -482 37 -382 -43
3957 -43 228 -304 232 -359 326 -254 74 -10 -2 265 -460 481 -381 191 -189 105 415 -241 376 -318 100
3978 100 -375 842 -382 -198 179 -301 295 -174 658 -94 500 144 221 343 -393 256 -340 354 -75 190
3998 190 124 3 527 -255 79 -317 24 -21 -124 64 74 145 -92 247 -488 101 -181 104 205 -341 -78
4019 -78 -139 346 -341 -505 -346 -141 135 -891 265 -241 10 18 277 -55 -641 -91 -99 -327 532 -62 50
$$ packed form
3876c59L90J16l53P61k81K62K04j222O11k93O65k10o06Q69n49K45r51M13K66O96
3896F74o47m11O70q57P83n23J112r01O43p04P10l02p20K84J46P51j257J376j352
3915e25j03O92K03M51n17l25R0K53o1o18Q76n33J37l76M80m49J65L92p34P44r38
3936f96O17j0K42j88j87L9l43O85n49O28o06Q2N11m98N90q21Q40q18N19m19L39
3957d3K71n32N36n91O85n80L28q4QK67p25R41q62N72l80K94L10o56O17o94M18
3978A00m75J217j224J84L77m80N96m69Q32p52N94l56P7J22p36O49n96O94m29K65
3998A90o6j21N24p82L34l96L41m5j03J88J0P1k37L39p35N89k82K85J01n46K63
4019g8o1M85o87j64J59K05K76j026J156n06K51QK59l32n86N50qk28Q59n94J12
$$ plain form
4040 50 -276 -392 -368 212 -214 183 -422 361 898 208 -130 19 163 -240 -264 -202 84 -221 -316 210 120 421
4062 421 -307 641 -90 242 -104 183 340 -275 163 -259 69 -333 177 -82 31 119 -188 214 -263 -44
4082 -44 -238 159 215 -355 68 -314 399 -349 -237 3 -35 155 -209 61 -346 -16 -168 45 -11 -22 8 -99
4104 -99 183 -590 221 -100 138 179 -188 248 -396 237 -392 272 -96 50 80 19 306 -224 404 -152 358
4125 358 -17 -8 155 91 230 -360 -93 -436 103 -24 -115 223 -310 227 -291 316 -7 111 88 -27 88 -114
4147 -114 90 -47 239 -313 351 -219 -262 228 -171 161 -257 201 -238 172 245 -25 185 -136 293 -407 46
4168 46 -300 -138 -46 -260 -36 -409 266 -321 57 -318 -64 -65 -465 119 -142 466 -85 81 44 -222 -8 -192
4190 -192 252 -138 -3 18 145 -45 10 143 -108 116 -238 214 148 155 55 14 288 -201 333 -156 271 -41
$$ packed form
4040E0l26j16K4N80m26L97o05P83N37o90l38J49J44m03k4O2K86l05r5N26r0L01
4062D21p28R48p31L32l46K87J57o15M38m22L28m02N10k59J13Q8l07M02m77K19
4082d4j94L97N6n70M23l82P13p48J12K40l8J90l64K70m07L30j52K13n6j1L0j07
4104i9K82p73Q11l21K38M1l67M36o44O33o29O64l68J46L0o1K87n30O28n56N10
4125C58l75RJ63o4J39n90K67l43N39j27r1L38n33N37n18O07l23J18k3j15J15k02
4147a14K04j37K86n52O64n70m3M90l99L32m18M58m39M10P3k70K10l21M29p00M53
4168D6l46J62R2k14K24l73O75n87L78l75K54jm00N84k61O08n51J66l7k66K14j84
4190a92M44l90J35K1J27j90N5J33k51K24l54M52o6Pj00m1K74m89N34m89M27l12
$$ plain form
4212 -41 -38 161 -166 444 -229 126 11 -2 -149 47 -30 -262 315 -235 155 -51 -68 -111 36 160 -262 190
4234 190 -256 152 -401 -59 182 -221 215 -373 221 -426 0 -248 -20 73 -269 213 -719 231 -431 -13
4254 -13 -68 -156 54 -428 14 -292 215 -266 -144 -97 -397 144 -235 289 53 319 -367 70 251 161 172 -181
4276 -181 518 -209 449 172 78 103 -154 463 -128 261 -229 247 20 -35 444 -168 169 -149 372 -72 193
4297 193 -87 -87 419 -144 153 -30 351 67 -16 86 -128 335 -193 331 -379 157 -295 -264 -186 -250 55 -489
4319 -489 192 -111 43 -83 -131 192 -249 300 -359 75 -222 257 -47 15 -84 -330 72 -365 395 -196 357
4340 357 -262 -168 57 -202 406 -170 131 -74 276 -155 250 334 -65 116 -88 179 -499 -216 140 -303 123
4361 123 -188 10 119 109 327 -82 257 -751 -211 -34 631 7 435 311 256 -383 -486 -239 -416 257
$$ packed form
4212d1LJ99l27O10o73L55j15j3j47J96p7k32N77n50L90k06j7m3J47J24m22M52
4234A90m46M08n53L42K41m03M36n88N94o47M26k48K28R3l42M82r32R50o62M18
4254a3n5q8K10m82M42l06N07m81J22M7l00N41l79N24k36K66o86M37J81r0J1l53
4276a81O99p27O58k77r4K5k57O17n91L89m90M76k27n5M79o12L37l18N21m44K65
4297A93k80%N06n63K97j83L81k84q3J02k14M63n28N24p10N36m52L1P8o4L05n44
4319d89O81l03J54j26m8L23m41N49o59M34k97M79l04O2r9k46M02m37P60n91N53
4340C57o19R4K25k59O08n76L01k05L50m31M05Q4l99J81k04K67o78K83L56m43M26
4361A23l11J98J09j0K18m09L39j008N40J77O65o24M28j24n5o39j03K47j77O73
$$ plain form
4381 257 -692 691 -457 -429 -399 -367 344 -748 316 332 506 742 -571 63 -506 414 -294 -271 -58 -52 -153
4402 -153 -252 203 -232 246 -165 18 -21 -375 -65 -242 132 -28 224 -251 -30 -99 -293 291 -253 263 -265
4423 -265 461 -139 -66 188 5 270 -208 102 -288 120 -14 60 176 -189 474 -352 349 5 70 335 -106
4444 -106 104 -135 305 -243 164 75 -223 -76 -108 298 -326 175 -300 249 -148 150 84 -160 60 -321 372
4465 372 -23 47 -84 -60 101 -339 -3 -463 -174 -259 -204 -29 -63 -378 -424 38 -48 183 -65 13 -55 -63 -100 -225
4489 -225 438 -250 102 -355 109 -84 -601 266 -239 256 -20 619 -51 163 337 64 97 -119 296 -453
4509 -453 211 221 122 477 -308 482 -124 277 -343 -66 312 -259 107 -421 342 -277 323 -708 -155 0
4529 0 160 332 -227 165 -209 -284 28 -766 87 -706 681 -49 -89 -300 -624 -256 716 -398 -409 -74 -264
$$ packed form
4381B57r49J383j148K8L0L2P11j092J064J6J74K36j313O34n69R20p08K3K13Oj01
4402a53r9M55m35M78m11J83l9l54L10j77L74j60K52m75K21o9j94N84n44N16n28
4423b65P26o00P3K54j83K65m78L10l90M08j34P4J16l65O63q26P01l44O5K65m41
4444a06K10k39M40n48M07q9k98J47l2M06o24N01m75N49l97K98o6k44K20l81O93
4465C72l95P0j31K4J61m40L36m60K89q5N5J75l4l15m6M62q6K31k48P8o8ql7j25
4489b25O63o88L52m57M64j93n17Q67n05M95k76O39o70K14J74k73L3k16M15p49
4509d53O64J0r9L55p85P90o06M01o20K77L78n71L66n28P63o19O00j031N53J55
4529@J60J72n59L92l74p5L12p94Q53p93J387p30m0k11l24L68R72j114j1L35j90
$$ plain form
4550 -264 -393 -638 274 445 -335 -620 -250 192 -501 278 -552 193 -271 -93 714 -1035 -24 -215 374
4569 374 -248 -84 -3 -392 -176 85 491 -251 330 -106 35 304 -340 262 249 216 -251 42 54 -115 272
4590 272 -167 354 -63 -31 29 92 -3 198 440 46 110 -170 -93 -314 182 253 -277 204 -177 357 -348 228
4612 228 378 48 196 -4 281 -283 -27 -404 279 -163 19 -14 -130 248 -51 -66 -160 -21 -269 -83 89
4633 89 -217 322 -167 -45 -333 35 -85 -23 65 -199 124 -44 447 53 13 157 -10 235 -163 98 -14
4654 -14 75 43 199 560 -34 150 8 287 -73 195 20 86 -26 -155 345 -360 320 -69 -139 -136 -106 243 -93
4677 -93 325 -342 -57 -162 449 25 -123 48 -368 -88 -155 179 -51 -222 162 -127 -26 -175 150 -270 -169
4698 -169 -58 -217 -21 -232 181 -338 214 -419 -33 -101 -113 -27 -470 -2 -373 -149 27 -27 -61 24 140 -111
$$ packed form
4550b64j29k45R12J71p80k85L70M42o93P79q30P45m64J78Q07j749J011j91N89
4569C74o22J64Q1l89K16K61M06p42N81m36J41K69o44O02j3l3m67K93J2j69L87
4590B72m39N21m17L2O0O3r5K01K42l94O4k80P7k21M96P1n30M81l81N34p05N76
4612B28J50l30J48k00K85n64K56l77O83m42J82l3j16L78k99j5r4J39k48J86J72
4633H9l06N39m89J22k88L68j20O2Q8k64L23j68M91l94m0J44j67K45l98K61j12
4654a4Q9l2J56L61n94J84j42K79l60K68j75O6j12j29N00p05O80l89p0LL0L49l36
4677i3M18o67K85j05O11m24j48J71m16K80o7L34k30j71L84k89J01j49L25m20J01
4698a69J11j59J96k11M13n19N52o33L86o8j2Q6m43M68l71K24J76n4l4Q5J16k51
$$ plain form
4720 -111 121 -405 270 97 -32 249 -89 166 -191 40 -307 239 152 -345 214 -85 44 -232 332 -293
4740 -293 -9 6 -158 50 -29 244 -199 45 -83 157 233 -120 334 -265 80 -185 304 -131 -105 -84 -80 183
4762 183 -215 169 -290 176 -57 47 14 -135 293 -61 174 -173 106 93 -57 118 35 77 -139 163 -157
4783 -157 229 12 82 20 -257 125 -237 83 -78 -35 -41 -188 371 -314 237 -98 103 83 35 143 -162 399
4805 399 -460 -93 -351 65 -93 26 2 -98 359 -40 40 69 107 37 -136 279 -119 169 -197 85 -199 46
4827 46 4 -5 134 -339 97 -455 9 152 -107 -207 -125 79 -286 262 -396 43 -158 12 364 -164 -48 -272
4849 -272 327 -260 46 -220 156 24 -298 392 104 35 339 319 258 -122 -186 188 351 -394 -93 -682 -143
4870 -143 -364 52 51 -793 784 -491 -248 238 450 -161 -21 463 -259 701 -84 483 435 636 416 -359
$$ packed form
4720a11K32n26O75j73j29K81l38K55l57K31l47N46q7m97N59k99J29k76N64o25
4740b93K84J5j64K08p9K73m43K44j28K40P6l53M54n99L45k65M89m35K6K1MK63
4762A83l98L84m59M66k33J04l3j49M28l54K35l47K79j3j50J75q3M2k16L02l20
4783a57L86k17P0o2k77L82l62L20j61M3oj47N59o85N51l35K01k0m8J08l05N61
4805C99q59L67k58M16j58J19k4j00M57l99Q0K9L8p0j73M15l98K88l66K82k84K45
4827D6m2rJ39m73M36n52M64J43k59j00Q2K04l65N48o58M39k01J70L52n28J16k24
4849b72N99n87L06k66L76j32l22O90k88o9L04k0o1l80o4L74J63p45L01n89N39
4870a43k21M16jq44J577j275K43M86K12o11J40M84p22R60p85N67m8K01k20p75
$$ plain form
4890 -359 50 -356 -401 -893 -3 -481 -592 768 -42 -179 -487 147 -438 204 338 -121 609 -414 -728 -89
4910 -89 -126 -251 128 556 -300 -109 -547 173 -296 435 127 59 96 -635 -2 49 -38 -77 140 -152 167 -49
4932 -49 -436 340 -107 -321 145 -313 38 -138 240 -725 244 -425 -276 -139 86 180 111 267 -294 285 -309
4953 -309 -22 100 -73 224 -119 309 -320 132 -14 -152 183 -125 463 409 -179 -95 -150 -148 6 7 -94 -423
4975 -423 36 444 -176 297 197 303 -173 -554 -433 283 649 -91 75 -45 -325 138 464 85 -495 -4
4995 -4 -871 -475 -153 164 -110 -680 669 119 66 -915 7 89 -221 -180 -386 -167 -1161 1005 -542 -315 116
5016 116 -326 244 29 -149 331 -16 116 -160 280 102 275 37 87 -223 209 214 47 179 8 228 -398
5037 -398 255 253 -98 88 -8 111 -33 51 -599 -348 161 -219 -121 -127 202 -501 -63 71 149 -497 -45 -283 611
$$ packed form
4890c59M09m06m5m92Q90m78j11J360q10j37l08O34n85O42J34m59P30j023l14O39
4910h9l7j25L79M28q56J91m38P20m69P31l08o8L7p31O33N1q7l9K17k92L19k16
4932d9l87P76m47k14M66m58L51j76L78r65R69o69J49J37K25R4o9J56n61N79n94
4953c09K87J22j73K97l43M28o29M52j46j38L35l08N88n4n88Q4n5KJ54Jj01l29
4975d23M59M08o20M73j00J06m76l81J21P16L66p40J66j20k80M63L26l79n80M91
4995dq67L96L22L17k74n70J349n50n3r81R22Q2l10M1k06K19r94K166j547K27M31
5016A16m42N70k15j78M80l47J32k76M40j78J73k38N0l10M32Nj67J32j71K20o26
5037c98O53kl51J86r6J19j44Q4o50K51N09l80R8oL29p03M38J34P8o46M52k38Q94
$$ plain form
5060 611 -467 233 -100 -30 625 686 141 -224 -314 -25 -154 -162 -52 -413 203 96 -5 -122 71 -164 520
5081 520 33 -224 -18 -276 94 -163 115 78 286 34 -105 250 -511 290 35 125 134 497 -194 -231 -116 -162
5103 -162 211 62 344 -86 259 196 -215 -11 -261 104 -257 173 -26 -83 448 -90 102 -9 161 -75 375
5124 375 153 186 -121 -33 106 276 -37 -161 581 -315 187 -21 83 278 -344 -180 -463 53 -116 -391 106
5145 106 -184 96 12 174 -230 88 -89 -144 330 -275 506 357 475 -265 -194 55 -202 618 -264 -58 -154
5166 -154 106 -37 50 121 -124 257 -260 93 -58 225 -249 161 120 -124 215 7 211 -203 357 -13 -55
5187 -55 331 62 8 -206 430 -96 78 215 88 340 72 131 -202 109 -74 -223 103 -119 -137 -222 168 110
5209 110 -45 25 167 101 -324 -63 -175 280 -123 93 -53 23 -37 -145 -100 -190 166 -124 -56 192 -180 79
$$ packed form
5060F11j078P00l33P0O55O1n45l65r0K89j29qJ10l61O16j07j01j17J93k35O84
5081E20m87k57K06k58L70k57K78l7K08k52j39L55p61Q01k55R0RL63o91l7J15m6
5103a62L73j49K82m30L45o3m11K04k50L65l61M30j99n7N31n38J92j11J70k36M50
5124C75k22L3l07Q8J39J70l13j24P42q96N02k08J04J95o22J64k83N16j69k75M97
5145A06k90K80q4J62m04L18j77n5M74o05P81j49J18p40P1K49k57Q20q82K06r6
5166a54K60j43Q7P1k45L81n17L53j51K83m74M10m1k44L39k08K04m14N60l70m2
5187e5L86k69n4k14O36n26J74J37j27K52k68N9l33L11j83j49L26k22j8q5L90n8
5209A10j55P0J42o6m25K61j12M55m03K16j46P6o0j08M5r0L56k90O8K48l72K59
$$ plain form
5231 79 27 170 -114 -9 -110 159 -98 -90 132 -63 15 41 110 -224 16 -37 -97 139 -139 -97 -132 -147 4 151
5255 151 339 -143 209 -78 113 65 114 69 -126 -171 -116 203 -95 211 -11 176 -117 44 343 -275 93 -127
5277 -127 321 -134 -34 172 -252 32 -92 166 -194 84 -277 -21 -43 -38 128 -236 72 -173 148 -92 -167
5298 -167 -273 -187 143 -129 -31 -195 152 -49 -55 63 -224 151 -139 222 -234 93 123 44 143 -92 103 31 162
5321 162 -111 126 71 -178 65 -156 379 -151 -25 -10 210 204 -226 104 -212 46 -97 204 -45 80 -159
5342 -159 -109 193 -105 29 -118 -93 -11 -261 145 -137 -41 -222 31 -153 148 311 -85 33 -181 -23 -207
5363 -207 -104 158 -99 -181 19 368 -107 315 -307 -47 27 -181 -223 -293 84 -197 -30 -36 219 152 -194 136
5385 136 37 15 -177 97 -78 187 -153 -23 344 -99 56 252 135 29 14 244 107 279 -68 197 30
$$ packed form
5231G9n2J43k84J05j01K69k57QK22j95P8K6O9l34K40n3o0K36k78M2l5j5J51J47
5255A51J88m82L52k87J91m8M9m5j95m5N5L19k98L06k22J87k93J61K99o18L68k20
5277a27M48m55J00K06m24K84j24K58l60K78l61K56k2NJ66l64L08k45L21k40p5
5298a67j06Q6L30k72R8j64L47k01oJ18k87L75k90L61m56L27L0p9R9k35J95p2J31
5321A62k73K37n5k49K43k21N35n30J26J5K20om30L30l16K58j43L01k49J25k39
5342a59N0L02k98J34j47K5Q2k50M06k82R6j81K53j84L01J63l96J18k14J58j84
5363b07J03K62k57q2K00L49m75M22o22K60P4k08m2p0L77k81J67oK55o7l46L30
5385A36r9k2j92K74j75K65l40J30L67m43J55J96j17j06j5K30j37J72l47K65j67
$$ plain form
5406 30 67 176 39 256 -76 -29 -75 76 16 47 168 228 238 -58 105 -7 237 26 98 114 -47 130 -355
5429 -355 140 -127 133 135 98 -141 -115 -110 -112 31 -275 75 -331 -55 28 -178 -58 -294 -9 -256 -5 98 -61
5452 -61 -111 -40 -71 -168 200 -38 -100 98 -272 -139 -285 -8 -167 143 -60 260 47 -146 279 -289 207 -34
5474 -34 354 -98 33 -150 -112 183 192 201 48 119 25 131 245 -207 145 218 7 -4 136 71 58 -31 -56 109 -98
5499 -98 335 -176 135 -107 -58 253 -81 81 -111 -171 -131 -122 168 -95 411 -218 456 153 -109 24 -211 103
5521 103 -113 87 14 318 -352 -139 291 291 -139 236 -76 242 122 -655 291 -75 390 -121 80 103 -153
5542 -153 -106 -248 50 -108 44 -80 45 224 -129 78 304 38 56 -17 57 -200 289 -106 175 236 -174 144
5564 144 -148 271 -169 14 78 58 99 8 264 -121 18 -221 295 -153 -148 81 -59 132 -217 31 95 51 137
$$ packed form
5406C0L7J09j37K17l32M7m6J51o0L1J21O0J0k96J63j12K44k11P2J6j61J77m85
5429c55M95k67K60Kl7k39K6NkJ43l06L50m06K76Q3k06J20k36K85k47K51J03j59
5452f1n0P1l1r7L68k38o2J98l70J33j46K77j59L10k03L20k13j93M25n68M96k41
5474c4L88m52J31j83L8K95RRj53P1r4J06J14m52L52P3k11j1J40o5j3q9k5J65k07
5499i8M33n11L11k42M9L11l34J62j92o0M0RK90k63N06o29O74l03k62J33k35L14
5521A03k16K00p3L04o70K13M30%m30L75l12L18j20p77R46l66M65n11K01K3k56
5542a53M7j42K98j58J52j24J25J79l53K07K26k66J8p3P4k57M89l95K81O1m10L18
5564A44k92M19m40J83O4k0M1r1K56l85J39k39N16m48NK29j40J91l49K48O4m4Q6
$$ plain form
5587 137 -174 36 -215 185 -385 96 -109 -6 -88 -72 -240 -181 294 -110 197 -220 76 158 214 76 -98 148
5609 148 -276 -34 -96 180 112 127 -15 -24 97 -11 61 -67 -80 -73 152 17 286 -22 -113 -190 202 -401 99 -65
5633 -65 96 -35 -120 -191 9 -174 -67 425 -85 339 -167 243 -236 -237 -77 -331 262 732 84 5 83 229
5655 229 -568 91 -1116 1135 672 -351 -15 179 193 326 290 -364 194 499 671 84 199 -118 -186 -301
5675 -301 -268 512 59 39 47 -317 172 -72 -69 -372 390 29 39 -59 10 -358 85 3 -237 -215 140 -130 127 15
5699 15 243 367 233 -209 321 323 219 379 -556 -182 -68 156 -382 46 350 118 -1137 163 105 108 66 -742
5721 -742 -25 356 411 -294 -415 -529 -311 683 -291 550 -410 -167 -97 -143 -35 -176 390 -277 -153 8 -149
5742 -149 63 152 -88 -308 138 -163 48 75 -28 -107 -100 -174 135 114 -366 107 173 169 7 -157 137 81 -238 -6
$$ packed form
5587A37l11K10k51M00n70M81k05J03q2J6j68N9M75m04L07m17K96Q2N6j38j74K46
5609A48m24K42o2K76o8J5j42rJ21j08P2j28j3PK25j35K69l08r1p7L92o03N00j64
5633f5J61j31q5p1K00j83J07M92n10M24n06M10m79jJ60k54N93M70o48p9P8J46
5655B29p97O59j207K251m63j023L36J94J4J33l6o54N58L05J72n87J15l17o8j15
5675c01L3P80m53k0Ql64M89k44Ll03P62l61J0r8O9l68M43q2k40K2L55k70K57j12
5699A5K28J24j34m42N30Kj04J60r35L74J14K24n38M28L04k32j255J300n8Lm2q08
5721g42P17L81N5p05j21j14K18R94r74Q41r60K43P0m6J08j41N66o67J24J61j57
5742a49K12Q9k40k20M46l01K11K7j03p9Pp4L09k1m80M73O6mj62j64K94n6l19K32
$$ plain form
5766 -6 384 197 -325 123 -188 34 1 221 272 -25 -16 -158 84 -137 200 3 135 26 -18 95 -102 -188 -22
5789 -22 200 105 141 -6 -146 375 -242 95 149 234 -185 -5 -17 3 148 -224 11 -331 297 28 -133 35
5811 35 -128 237 -160 234 -252 405 -208 -141 319 -51 398 -115 251 -95 181 -203 93 21 -169 -45 -98
5832 -98 125 -5 70 118 16 98 -58 45 -47 28 157 16 31 72 192 42 229 9 -40 53 70 185 -93 100
5856 100 54 83 75 113 375 -1 -25 -167 0 26 291 66 -21 -61 -16 163 17 256 66 -86 -120 114 117 -121
5880 -121 105 -195 -46 -119 268 -48 -28 130 -188 -133 -132 106 -256 -134 130 57 31 31 -42 -232 -33 -425 -48
5903 -48 112 -128 -50 52 200 -36 -13 -28 -252 153 -25 -20 47 101 -146 -124 -27 -298 30 -93 74 -236 -51
5926 -51 257 -171 136 -142 252 -13 257 51 213 -47 -148 120 -99 277 75 285 -67 30 62 197 54
$$ packed form
5766fL90j87n22M48l11K22l3K20N1k97Rj42K42k21L37j97J32j09m4J13j97q6J66
5789b2K22r5L6j47j40N21o17L37N4Q5m19J80j2K0J45l72K35l42O28k69j61J68
5811C5j63L65l97L94m86O57o13O7M60l70M49n13L66l46K76l84K96p2j90J24n3
5832i8K23j30P5M8j02Q2j56J03r2P5J29j41J5M1J20j50J87k20m9R3J7J15k78J93
5856A00m6K9qL8K62l76k4j42J67K6K65k25q7m0M5J79j46K39j90j52l4K34Lk38
5880a21K26l00J49p3L87l16K0J58l18N5JK38l62J22K64p3k6%p3j90J99l92L77
5903d8J60k40P8J02J48k36K3j5k24M05j78NO7N4k47K2R7k71L28j23J67l10J85
5926e1L08m28L07k78L94k65K70k06J62k60j01K68k19L76k02K10l52R7L2J35j43
$$ plain form
5947 54 1 98 -3 53 -31 80 -144 -210 8 -279 41 -74 -75 -214 9 -150 158 45 -168 209 -194 -14 -113
5970 -113 -128 -103 144 178 -51 142 -24 -63 46 201 67 -215 -55 50 -60 87 171 -50 111 -61 -3 114
5992 114 -222 -161 -47 108 47 106 23 -152 339 -100 -68 152 217 -162 -33 130 -89 -60 -115 90 44 218 -156
6015 -156 -150 28 111 151 -40 256 8 -139 75 -25 13 -206 358 -155 -200 -31 111 46 -91 122 -270 69
6037 69 173 8 -89 -171 172 -277 39 -39 -133 -80 -71 -20 177 -47 -276 -44 89 163 -88 230 -153 -379 42
6060 42 -257 82 -261 100 -16 -197 -187 -97 62 -49 113 -125 81 -167 -8 53 23 2 42 306 -350 -238
6082 -238 -20 157 3 -10 254 -169 301 11 165 360 138 -6 -178 95 -213 208 132 45 -126 -232 -21
6103 -21 64 115 19 -79 150 -154 -76 -71 -60 -90 265 103 14 87 -171 -148 52 396 -217 188 -460 -54 123 -35
$$ packed form
5947E4n3R7j01N6q4J11k24o6K18k87L20j15jj39K23j59L08j13k13L77m03J80r9
5970a13j5K5K47L4k29J93j66l9J09J55j34k82J60J05j10J47Q4k21J61j72N8J17
5992A14l36O1J14J55o1N9q3j75M91m39L2K20O5l79J29J63k19K9n5K05m6J74l74
6015a56OJ78Q3M0j91K96k48j47K14j00L8k19N64n13m5J69J42o5j37K13l92L39
6037F9J04j65r7q2L43m49L16p8r4N3RN1J97k24k29K32J33P4k51L18l83k26M21
6060D2k99L39l43L61j16j81J0R0J59j11J62k38K06k48J59O1l0k1M0K64o56J12
6082b38K18J77j54j3K64m23M70k90J54J95k22j44j72K73l08M21p6q7j71j06K11
6103b1Q5N1r6r8K29l04P8NJ1l0L55j62q9P3k58K3K00L44o13M05o48M06J77j58
$$ plain form
6127 -35 217 -163 57 -77 -7 -113 43 142 -19 13 -272 -93 7 272 10 -43 -168 -163 -48 -290 163 47
6149 47 78 60 -32 110 -283 215 -82 323 48 6 -99 82 -7 -168 68 -192 124 8 -151 74 -140 81
6171 81 -115 155 -343 3 -86 18 39 198 -41 29 126 -286 -172 -149 185 47 31 132 -132 -58 -66 -134 37 -165
6195 -165 51 -198 -8 -70 -97 10 -126 -22 -187 143 -122 144 -54 29 -234 57 -266 -40 173 3 215
6216 215 -89 348 -100 133 132 -83 60 -162 52 33 -24 51 96 -106 -23 -9 -113 140 -8 40 -73 -66 140 -271
6240 -271 271 118 121 216 58 38 -296 77 -140 229 -67 268 68 -107 -19 -223 451 -113 42 10 -94 -29
6262 -29 202 79 86 361 -256 190 -150 330 -54 -198 -33 64 109 -87 -13 132 -127 115 -33 -55 -80 81 41
6285 41 79 184 -51 107 -199 -78 -250 349 -135 127 103 56 166 -225 299 51 133 -160 143 83 -77 -8
$$ packed form
6127c5K52l80K20j34P0j06J56R9j61L2k85J79J00K65k62n3j25NJ15k42M53j16
6149D7L1j8r2J42l93M98k97M05k75m2j05J81q9j61K36k60L16j16j59K25k14K21
6171H1j96K70m98L46q9J04K1J59k39P0R7m12J14K3L34j38j6J01k64P4qo8J71k02
6195a65K16k49J90o2k7J07j36J04j65L30k65K66j98Q3k63K91l23K26K13j70K12
6216B15l04M37m48K33jk15J43k22K14j9n7P5M5k02Q3J4j04K53j48M8j13PK06m11
6240b71N42j53LR5j58k0l34L73k17L69k96L35k00j75Q8k04O74n64J55l2j04O5
6262b9K31j23PK75o17M46l40M80l84j44J65R7M5j96P4J45k59K42j48k2k5J61m0
6285D1L8J05k35J58l06J21j72N99m84K62k4m7J10l91N24k48Q2k93L03o0j60O9
$$ plain form
6307 -8 -105 104 -4 57 -87 146 -44 -166 -85 -170 369 37 196 -20 41 120 17 -25 -143 84 133 -226 -129 -132
6331 -132 27 155 100 -43 235 -192 -310 -178 172 -65 -265 139 -187 222 100 -135 -99 24 201 100 100
6352 100 -31 187 66 138 -1 -190 -51 -83 152 25 194 -208 42 146 -10 169 13 342 62 153 -22
6373 -22 375 183 52 238 89 88 -202 120 53 35 33 96 229 -276 -62 138 -114 65 0 104 -156 17 -324
6396 -324 266 33 -127 -79 55 -4 -316 298 -34 127 -24 -12 116 -246 1 -23 63 71 158 101 22 104 -81 -25
6420 -25 226 69 -125 135 112 -232 151 -285 115 -82 35 -306 57 116 -96 -349 -464 265 -415 101 193
6441 193 316 486 94 -37 -20 558 -261 -121 -91 113 -158 209 101 -235 220 -220 671 -213 58 -69 -4
6462 -4 222 -223 677 482 -538 -136 -138 380 222 622 -183 -650 183 -1015 -12 -269 -86 -176 392 -71 160
$$ packed form
6307hr7K09j08O1j44K33j90j22Q1q5N39l32J59k16O1P9j03m2j18K27M9l59R7l
6331a32J59J28n5j43K78m27j18J32L50k37k00M04l26M09j22k35L6J23J77j01%
6352A00j31K18j21P2j39j89J39l2K35j27J69m02K50J04j56J79j56L29k80R1j75
6373b2L97j92j31J86j49jk90L22o7j8kO3J33n05K14K00k52J79o5J04k60J73l41
6396c24N90k33j60M8J34n9l12O14l32J61j51J2J28l62K47k4Q6QQ7n7p9Q2j85N6
6420b5K51j57j94K60k3l44L83m36M00j97J17l41L63N9k12k53j15P29o80N16R2
6441A93J23J70l92j31J7N78q19J40L0K04k71L67j08l36M55m40Q91q84K71j27O5
6462dK26m45R00j95j020M02kN18j58M00q05m67Q33j198J003k57J83r0N68m63K31
$$ plain form
6483 160 -399 464 472 9 363 -544 -434 251 91 138 -471 -20 -434 375 -65 161 141 104 191 -110 -53 -186
6505 -186 -17 -184 146 82 442 -143 -105 -75 104 92 -101 187 -77 223 -30 -105 38 -133 123 -75 -208 -210
6527 -210 115 237 -99 -54 12 77 -230 -382 -42 -132 8 118 -57 -74 -409 -146 603 -99 -344 -515 -421 207
6549 207 -683 -82 -358 -114 -21 -61 69 -184 163 321 -96 -48 -19 193 -151 66 -105 107 -124 7 -4 -103
6571 -103 302 -32 107 -178 4 -94 4 103 -53 29 -92 57 -219 -2 -75 68 84 20 33 -24 21 7 -52 -134
6595 -134 -64 -101 -54 232 -341 159 -17 184 16 -117 -82 218 -54 311 -181 62 -6 45 45 -89 79 -104 -55
6618 -55 118 -214 12 -162 37 -60 -112 240 -73 45 -73 -4 -118 64 -178 -33 34 -12 103 33 -135 -66 -41
6641 -41 -46 -204 106 -110 46 27 -141 -123 -124 224 -191 1 -24 -42 26 -111 169 -31 38 -284 49 -67 -150 74
$$ packed form
6483A60n59Q63Qm63L54r07J10O85j60M7o09M51m14Q09m40K26k0l7Q7l01N7j33
6505a86J69j67L30o4L60n85L8L0J79j2j93K88k64L00k53p5J43j71K56j98j33k
6527b10L25J22l36M5O6O5l07j52L40r0J40J10j75j7l35K63P49p02k45j71R4O28
6549B07q90O01k76K44R3m0J30k53L47J58m17M8K9K12l44K17j71K12k31J31j1r9
6571a03M05l34J39k85J82r8R8R9j56Q2j21J49k76K17p3J43J6o4J3n7M5j4n9q2
6595a34P0l7M7K86n73N00j76K01j68j33L5L00k72L65m92K43o8N1%j34J68j83M9
6618e5J73l32K26j74J99r7n2L52l13J18j18O9j14J82k42J45O7m6J15p0j68O9K5
6641d1nj58L10k16J56j9j68J8jL48m15J92k5j8O8j37K80k00O9l22L33j16q3K24
$$ plain form
6665 74 -18 103 -3 276 -8 -39 -31 -319 180 -243 259 154 226 -21 71 -204 105 171 21 51 -23 77 -30
6688 -30 -126 -3 44 252 -50 348 26 35 109 164 136 -57 -52 -64 352 42 177 81 -228 -36 54 20 -63 -48 3 -255
6714 -255 56 -149 -22 -43 -103 -68 117 -188 -129 -56 -56 -85 -30 -4 86 173 -42 -209 254 -116 123 -210 301 48
6738 48 92 22 171 -53 74 -161 -223 133 -19 144 -152 -2 -62 -168 68 31 164 27 206 226 22 211
6760 211 -272 182 -42 -141 67 -164 -9 -210 -71 66 51 -318 -94 -11 -105 232 -86 122 -170 160 123 -134
6782 -134 108 7 160 -43 -187 -157 73 -19 43 159 -169 277 -96 -4 -269 199 -319 20 7 -263 28 -294
6804 -294 -145 -19 208 200 -94 -4 -19 103 -150 44 -121 -107 34 -70 -81 -34 -20 -383 158 -142 -78 6 108
6827 108 127 -116 139 23 341 237 11 138 -133 -22 -171 -3 -58 -114 14 235 -126 196 65 -251 109
$$ packed form
6665G4r2J21j06K79k84l1Qk88M99m23N02j05P2k47R2k75L09O6j50L0p4J00j07
6688c0r6J23M7K08l02L98l22RP4N5k8j93Nj2M16l10J35r6l09J92R0l4q3J5N1k58
6714b55L11k05J27k1o0L5J85l05N9P3%k9N5K6R0Q7k15j67M63l70K39l33N11k53
6738D8M4p0J49k24J27k35o2L56j52J63k96J50o0j06K36l7J33j37J79K0k04J89
6760B11m83M54k24r9K08k31J55k01J39J37j5l69K24Q3r4L37l18K08k92L30l7k57
6782a34K42j01J53k03j44L0K30r2O2J16l28M46l73R2k65M68n18L39j3k70K91l22
6804b94J49J26K27qk94R0j5J22k53J94j65J4J41j04j1M7J4l63N41l00O4Q4J02
6827A08J9k43K55j16L18j04k26J27k71J11j49J68n5n6J28K21l61L22j31l16L60
$$ plain form
6848 109 57 102 -158 -79 36 -57 102 -148 153 297 370 -67 443 245 -303 277 451 -1 -300 -252 -29 300
6870 300 166 103 335 -136 557 31 487 -59 142 153 -211 544 -72 -67 -179 -226 298 -187 -108 8 96 -89
6892 -89 -1 184 158 -294 -64 -56 -59 33 78 -109 204 -10 -140 153 75 -80 194 -64 114 209 15 -133 260 149
6916 149 -42 379 -110 227 -58 -128 -85 93 37 84 110 38 -64 -42 168 -110 -51 -124 -151 -47 104 -181 22
6939 22 -174 -13 -137 106 13 -201 85 509 63 -38 -54 -306 -8 45 -171 78 -139 -155 -347 -149 207 13
6961 13 4 38 -203 47 6 -137 -45 159 39 -17 -176 131 18 -12 -207 173 -174 -240 179 95 67 -233 187 -153
6985 -153 52 -50 161 -187 21 -201 -8 36 189 -382 2 305 193 24 485 -555 -493 163 -230 -295 46
7006 46 29 -344 125 -75 203 -53 64 1 -37 217 -264 -53 -55 43 -24 68 -14 -368 316 -129 -63 -6 90 -257
$$ packed form
6848A09n2M5k60P9J15r3J59k50L01J44P3m37N10j98n48N80J74m52k99M8K23L29
6870C00j34o3K32m71O93n26M56n46K01J1l64P55o16Nj12m7N24m85P9J16Q8j85
6892h9Q8J85k6m52K30QlR2M5j87L13k14j30K93p8j55K74k58J78R5j94j48L93j11
6916A49j91M21m89L37k85p0M3J78n6M7K6p2j02K2K10k78N9p3k7J04J51k85K03
6939B2j96J61j24K43r3k14K86M24m46j01j6k52K98N3k16K49k17j6j92J98L56j94
6961A3rL4k41K50m1j43R2K04j20n6j59L07j13l0j95L80l47o6M19q4k8l00M20l40
6985a53K05j02K11l48K08k22J93M4J53n71L84L03j12j69M61j040O2O56l93o5L41
7006D6j7l73M69k00K78k56J17o3l8K54m81K11kR8o7R2q2l54O84m45O6N7R6l47
$$ plain form
7030 -257 -241 146 -112 254 118 429 55 86 12 -116 -2 40 -179 13 133 -117 62 -154 -12 30 -334 176
7052 176 -62 -155 -191 -100 232 -187 139 -42 197 48 194 -28 57 -195 408 291 -88 429 371 -403 -118 127
7074 127 -846 -68 -770 -857 -190 -117 -154 -276 -164 124 88 573 373 293 74 -474 337 230 583 114 -52 -373
7096 -373 9 82 -689 641 406 -24 -75 -195 -107 427 459 -283 399 113 79 -25 -256 -40 119 130 297 293
7118 293 -192 -159 -400 -516 -95 229 -42 -47 204 -7 184 -409 139 -199 -9 94 -65 -281 -151 344 302
7139 302 -290 -755 -311 451 -173 112 -66 147 361 41 55 227 169 -324 -287 -28 -4 172 49 95 -122 -101
7161 -101 -334 294 237 2 64 100 -462 -101 6 78 -39 -139 108 652 -28 -229 324 -7 343 74 -35
7182 -35 -128 41 278 -128 -93 -40 -283 247 350 -132 255 -256 339 -191 387 98 -293 531 1063 -209 -83
$$ packed form
7030b57J6L87k58L66j36L11l74L1p4j28J14M2k19J92J20k50J79k16J42M2l64N10
7052A76k38r3l6R1L32m19L26j81K39j49J46k22Q5k52O03j17l79N17n8p74K85K45
7074A27r73P78p02q7O67P3l7j22J12K88l6M85k00q0k19n48Q11j07L53m69j66l21
7096c73L82P3p71J330k35m30n1j20Q8N34L2p42O82k86l4j04k31K16J59J1J67m
7118B93m85L3k41j16M21L24k71nK51k11J91n93N48l38J90J03j59k16J30M95m2
7139C02n92m65M44P62o24K85j78K13K14l20J4J72n8m93L7K59K4J76j23M6k17K1
7161a01k33O28n7k35O2L6n62L61J07P2j17j00K47N44o80k01N53l31L50k69j09
7182c5r3J69K37m06L5N3k43N30J03m82L87n11N95n30N78k89l91Q24N32j272J26
$$ plain form
7203 -83 -31 -397 -59 -240 425 -280 427 -26 -124 197 -666 238 250 245 557 261 410 261 412 -42 -142 -284
7225 -284 326 259 24 -141 154 676 80 535 -286 -377 121 -521 -762 -260 268 -119 507 -157 -118 -14 -43
7246 -43 485 -387 -33 -413 411 -567 14 342 37 -295 33 -458 -491 436 23 -142 -143 103 -100 149 138 -309
7268 -309 153 93 -325 385 47 -122 229 104 173 19 43 -144 -20 320 27 293 -206 -76 -378 300 -376
7289 -376 -112 -93 607 -127 227 333 -190 891 141 -209 124 12 108 -145 286 -70 139 -364 -167 47
7309 47 400 32 -11 -137 479 -185 -65 302 -295 629 1 -791 73 -530 -302 -61 27 -117 -429 -229 -52
7330 -52 182 -275 48 -65 96 -307 169 21 -53 28 -145 -104 134 -46 -156 -33 92 91 74 -29 -43 4 331
7353 331 -71 0 253 -145 -112 -313 64 -147 -34 -247 -11 -21 17 182 -1 69 167 -128 21 -225 164 -168
$$ packed form
7203h3N2l66L38j81O65p05P07m53r8L21q63R04J2nL12k96J49j49J51m54j00j42
7225b84O10o7k35j65K95N22n96M55q21r1M98o42k41N02N28l87O26o64L9J04k9
7246d3N28q72L54l80Q24r78N81L28l05l32L28m91l3R27m13j65jK46k03K49j1m47
7268c09M62o0m18P10l38j69L51j25O9j54K4j87J24L40k93K66m99J30l02O78o76
7289c76K64J9P00p34L54J06n23J081p50l50L33j12R6k53M31l56K09n03J97K14
7309D7L53l68m3j26O16o64J20L67n97R24o28p92Q64o03K28K41Q8j44l12K00J77
7330e2K34m57L23j13J61m03M76j48p4Q1j73M1K38j80j10J23J25jj7j03j4M7L27
7353C31m02P1K53l98L3k01L77k11J13k13K36j0L8J65j83P0R8k95J49k46L89l32
$$ plain form
7375 -168 -27 89 181 -27 24 50 -154 199 -17 -7 75 -165 -282 -52 118 -112 -72 5 157 14 -76 -102 -409
7398 -409 -68 -153 -40 101 104 -311 -47 49 -32 36 90 70 102 290 -3 141 -26 -21 115 -128 90 37 238 -51
7422 -51 106 -84 -93 -168 105 207 -58 42 -1 22 153 229 -40 -139 123 -122 32 -56 -2 -48 -70 69 -61 177
7446 177 90 70 144 -3 19 -45 191 251 -68 70 194 5 -85 205 -90 98 117 67 -21 5 -12 -147 183 43
7470 43 -46 87 -72 -143 186 -137 -77 -5 -88 -169 120 -90 -82 92 -262 -292 56 -109 -2 94 7 116 -21 85
7494 85 111 -48 -308 202 -89 -50 -26 -217 88 -159 51 -191 81 -174 -131 119 89 -94 100 242 -3 -82
7516 -82 -16 -97 -171 -38 285 -48 -42 -110 -71 -70 -373 -80 150 79 -33 27 93 -58 -74 -144 -109 36 264 57 99 -36
7542 -36 258 147 -121 301 -98 -214 -98 -12 274 251 48 47 -195 -238 185 163 -158 2 13 -51 -43 101 19 337
$$ packed form
7375a68J41J16R2k08N1K6k04L53k16J0Q2k40j17K30J70k30M0P7J52j43r0k6l07
7398d09L41q5J13J41Lm15K64R6q1O8N4k0L2J88k93J44j67NJ36k43K18n3K01k89
7422e1J57j90rp5K73J02k65J00m3K3J31P6k69r9K62k45J54q8N4m6k2J39j30K38
7446A77q7k0P4j47K2o4K36O0l19J38J24j89r0K90k95J88J9n0q8K6j7j35L30j40
7470D3q9J33j59p1L29l23O0P2q3q1K89k10QJ74l54l0L48j65J07R6q7J09j37J06
7494H5K6j59k60N10k91L9K4j91L05k47K10k42K72k55M3K50l0j83J94J42k45p9
7516h2O6q1p4J33L23l33Oo8L9Jl03K93K30p1j12O0O6j51j6p0L5J45K28k07M2j35
7542c6K94j11k68M22l99j16J16Q6K86k3k03jk42m3M23k2l21J60J1o4QJ44q2L18
$$ plain form
7566 337 55 -162 92 -150 3 -364 122 -75 -14 19 -138 72 246 117 153 -212 17 133 352 163 424
7587 424 -258 310 -454 141 -166 -701 -476 282 -209 -531 -216 -58 -221 42 199 -532 -262 92 -92 -247
7607 -247 134 -107 457 220 -468 -340 318 -799 442 -403 114 29 129 644 -213 264 -104 237 -417 62
7627 62 -52 300 -127 -210 -520 301 622 31 216 717 -296 494 -59 435 184 45 -349 168 -316 -835
7647 -835 -23 -318 -126 38 485 0 128 -71 112 477 -498 -164 106 481 -89 76 -223 98 -47 -267
7667 -267 169 -121 171 -191 366 -47 702 239 391 358 -514 587 -44 -4 63 -9 451 -422 -74 -169 79
7688 79 648 332 250 334 494 337 -77 400 477 175 236 63 -1490 -264 -437 278 918 -8 -143 51 58 -5
7710 -5 1047 -389 -51 909 -688 -133 204 233 -196 105 -99 -22 -51 125 -53 -20 46 -10 -90 -26 -164 25
$$ packed form
7566C37k82k17K54k42J53l67M86j97O1L3j57K10J74j29L6l65K29J16K19j89K61
7587D24o82N68p64N95l07n35K25P58m91l22L15J58j63K63J57p31K70L54j84j55
7607b47L81k41N64k37o88J28O58j117J241q45N17q5J00N15q57M77l68L41o54M79
7627F2j14L52m27q3l10Q21L21n91J85N01j013P90n53M94k51j39l94N17m84n19
7647h35Q12k95J92J64M47m85J28j99J83L65r75L34K70L75n70J65k99L21j45k20
7667b67M36k90K92l62N57m13P49m63J52l3q72J101o31M0O7p2M60q73L48r5K48
7688G9N69l16q2Q4J60j57m14M77P7l02O1j73j553J226j73P15O40r26j35J94Po3
7710eJ052j436L38R60j597N55L37K9m29L01k04P7k9J76j78L3O6n6q0O4j38J89
$$ plain form
7732 25 -67 216 135 160 146 -115 67 -145 17 23 -188 28 162 -49 -209 112 0 40 17 75 -90 -38 -147 34
7756 34 -191 -161 109 -162 123 -182 78 -126 5 65 -63 9 -221 129 -54 -106 -143 93 85 -76 258 -298 -7
7779 -7 -63 178 -716 -394 167 -976 -668 -285 16 -214 -133 -41 -105 -527 -12 -162 132 18 173 -235 60 -207
7801 -207 -34 -36 99 -79 -259 -128 231 148 72 -35 -185 40 26 -383 -72 -12 107 -126 308 -163 18 67
7823 67 183 1 -79 -102 -260 67 -77 -85 -109 -75 134 134 -177 -272 429 -279 -37 -106 6 -152 -139 -38 29 -212
7847 -212 -93 110 -167 -216 193 94 -173 -37 77 204 60 -17 45 181 207 1 -62 195 -43 151 -107 -16
7869 -16 172 295 -27 360 41 88 261 -281 -114 171 22 -320 46 139 306 -113 -599 344 381 -51 96
7890 96 -108 -22 50 43 388 -294 117 335 209 -169 48 -46 140 -82 -105 6 -234 129 -57 43 166 -166
$$ packed form
7732B5r2K83q1K5j4k61J82k12J62Ok11K16J34k11j60L21j12M0k3N8j65N2j09J81
7756C4k25L0K70k71K85l05K60k04J31O0j28P2k30L50j83n2l7K36qj61L34n56K91
7779gn6K41q94L22N61j143L08L83L01k30Q1R2o4m22N15j50K94j14J55m08K95k67
7801b07J73kJ35j78j80J31L59q3p6j07j50K25j4m09L11O0J19k33M34m71J81M9
7823F7J16j82q0k3j58L27j44qk4L4K09%l11r5P01p08K42o9J12j58J3J01O7k41
7847b12J19K03k77m9M09r9k67J36J14J27j44p7O2J36K6k06o3K57k38J94k58R1
7869a6J88J23l22L87l19M7J73n42J67K85j49l42L66R3J67m19m86R43L7m32J47
7890I6k04Q6P2pL45o82M11K18j26l78K17r4J86k22k3J11k40L63j86J00J23l32
$$ plain form
7912 -166 13 -29 14 -16 -120 146 -2 115 -255 -54 -173 73 239 -103 -247 -132 -52 5 85 75 73 -135 -3
7935 -3 -1 18 -26 -56 89 -35 51 -201 116 232 43 99 -5 -10 -48 -54 24 -104 -80 138 35 -12 48 2 165 6
7961 6 9 53 -157 -44 -54 -142 -169 97 54 -39 18 -52 -143 -198 251 247 -6 -121 184 120 -62 103 24 -116 222 -53
7987 -53 120 -124 -156 -311 76 -169 173 -162 17 255 -98 37 82 209 68 -92 -398 65 140 83 -89 57
8009 57 -18 117 -41 127 -20 74 -63 86 -69 343 -146 155 649 141 -36 -163 -351 -634 641 417 989
8030 989 -538 455 -180 -365 4 -790 60 -91 -44 -387 -563 339 -285 54 136 -154 -89 291 68 -11 -318
8051 -318 -102 -529 639 -205 258 -132 217 440 509 -122 63 623 416 -262 467 147 -263 117 57 235
8071 235 -127 425 214 -139 850 -103 162 -216 430 -189 162 926 270 222 393 -399 182 -519 -101 90
$$ packed form
7912a66J79m2M3l0j04K66j48J17l70K01j19K46J66l42j44J15Q0N7Q0j0kk08J32
7935cKJ9m4l0J45j24Q6k52L17J16j89N6j04nl8oP8j28K4K18j03m7O0m6J63j59
7961FLM4k10J13j0q8k7K66m3r3N7p0r1n5M49mk53j15L05o4j82J65p9j40L38k75
7987e3J73k44l2j55L87k45L42l35J79K38l53J35M5J27j41j60l06M63P5n7j72J46
8009E7p5J35j58J68j47R4j37J49j55M12m89L01M94n08j77j27j88k83J275k24N72
8030I89j527R93o35j85L69p94Q50j51M7l43j76R02o24L39Q2k90O5L80k23p9l07
8051c18K16m27J168q44M63l90L49K23O9o31J85N60k07o78P29l20m10L80o0J78
8071B35l62N52k11l53R89r53K65l78O46o19L51P64o56m8J71p92N81p01M18J91
$$ plain form
8091 90 50 474 350 39 -111 74 108 1333 350 921 223 499 -60 -205 749 884 115 155 -213 -2 74
8112 74 -390 -209 330 -654 205 140 -9 -119 356 153 255 19 521 50 247 -111 -169 202 363 -120 -246
8133 -246 77 54 -87 -36 -134 241 -63 51 73 43 255 -276 92 68 341 -106 520 -164 -10 648 6 629
8155 629 -8 764 291 254 194 -151 6 -60 -118 238 -73 -25 -132 283 -140 29 40 92 27 -108 123 49 73
8178 73 55 164 46 -84 147 -23 124 95 186 -66 67 94 62
$$ packed form
8091I0m0M24j24l11j50J85L4J225r83N71o98K76n59j45R54J35p69M0l68K11P6
8112G4m64J81N39r84Q59o5j49j10M75k03J02k36N02m71J97l58n8L71J61m83j26
8133b46L23k3j41N1r8L75l04J14K2l0K12n31L68k4K73m47O26o84J54O58o42O23
8155F29o37P72m73l7o0l45J57o6n8L56l11M8j07M15m23J69J1N2o5j35K31p4K4
8178G3j8J09j18j30K31j70J47k9R1k52J33K7l2
8191F2
$$ Imaginary data points
##PAGE= N=2
##DATA TABLE= (X++(I..I)), XYDATA
$$ plain form
0 0 0 0 0 0 0 0 0 0 0 0 0 0 0 0 -8 8 -8 8 -8 16 -16 16 -24 24 -32 40 -42 48 -57 67 -79 88 -101 114 -130 147
36 147 -165 186 -209 234 -260 289 -322 358 -396 438 -483 533 -587 648 -713 785 -866 953
54 953 -1051 1162 -1285 1428 -1587 1775 -1994 2261 -2584 2989 -3519 4250 -5321 7086 -10752
69 -10752 38922 -79850 -32726 80321 -8834 -41932 32242 11754 -38058 31865 -9301 14447
81 14447 -21457 -8526 21593 18089 -38616 -20104 59446 -31014 -17592 13713 90 -15099
93 -15099 5611 6174 -24738 14649 -22466 22156 -3640 -34215 9470 22748 -16166 -31321 32462
106 32462 -16324 -617 -59 -7328 1811 -7700 11319 -8339 3978 -23353 25837 6599 -30273
119 -30273 13513 9182 -5444 -7007 25708 -32884 14880 27076 -32315 8667 17622 -7055 -12393
$$ packed form
0@%%%%%%%%%%%%%%qJ6j6J6j6K4l2L2m0M8n6P2q2R0j05J24j46J67j89K15k44K77
36A47l12L51l95M43m94N49o11O80p54Q34r21J016j120J235j361J498j651J819
54I53k004K213k447K713l015L362l769M255m845N573o508P769r571J2407j7838
69a0752M9674j18772M7124J13047q9155l3098P4174k0488m9812O9923m1166K3748
81A4447l5904J2931L0119l504n6705J8512P9550r0460J3422L1305j3623j5189
93a5099K0710N63l0912L9387l7115M4622k5796l0575M3685J3278l8914j5155O3783
106C2462m8786J5707N58p269R139r511J9019j9658J2317k7331M9190j9238l6872
119c0273M3786m331j4626j563L2715n8592M7764J2196n9391M0982Q955k4677n338
$$ plain form
132 -12393 38661 -24964 -8146 33887 -8080 -6640 1266 18683 -11107 12722 -7278 2522 12643
145 12643 -11978 13703 -3613 -1461 -4195 24572 -16916 -10098 24603 -13034 3218 -1118 1852
158 1852 -10628 15406 -7507 -10015 12184 -13642 9964 -7705 -1066 -8322 6948 -3778 -10594
171 -10594 8085 -14962 10636 -8387 -2446 -6146 4203 -3727 -6630 9869 -22578 14188 -66
184 -66 -10542 -3018 11102 -8384 -9203 22548 -23144 3253 9416 393 -11956 4270 10969 -11847
198 -11847 8976 -7480 10992 -5354 1598 7101 -1881 -354 -1444 21439 -19324 5100 12160
211 12160 -1559 -2647 4767 7258 -10897 17226 -8303 5267 1485 -1867 8047 -1986 1895
224 1895 -7933 17748 -9717 -148 3394 -1025 3164 -6929 8271 -9520 8026 -8024 4072
$$ packed form
132a2393N1054o3625J6818M2033m1967J440P906J7417k9790K3829k0000R800J0121
145A2643k4621K5681j7316K152k734K8767m1488O818L4701l7637J6252m336K970
158A852j2480K6034k2913k508K2199k5826K3606j7669O639p256J5270j0726o816
171a0594J8679k3047K5598j9023N941l700J0349p930k903J6499l2447L6766j4254
184f6j0476P524J4120j9486q19L1751m5692K6397O163r023j2349J6226O699k2816
198a1847K0823j6456J8472j6346O952N503q982J527j090K2883m0763K4424P060
211A2160j3719j088P414K491j8155K8123k5529J3570l782l352R914j0033L881
224A895r828K5681k7465R569L542m419M189j0093J5200j7791J7546j6050J2096
$$ plain form
237 4072 590 -11166 8318 -2188 -1617 -12439 14737 -10401 -4874 6545 -9571 2142 -5407
250 -5407 5890 -11856 4642 -4767 -866 2481 -10790 6575 -6547 4920 -9697 4904 -3047
263 -3047 -2837 6273 -9900 6368 -5124 5193 -5388 5570 -3721 -2038 11783 -11326 6977
276 6977 -946 5531 -5237 6141 1973 -4495 9987 -5268 8632 -6063 7710 569 1559 2200
290 2200 -2860 10963 -8425 8695 -2326 3775 -1182 4126 2921 -7917 11587 -7194 6134
303 6134 -3446 1732 231 -298 2627 -7431 8580 -8891 5553 -3843 -183 -377 -3602 4958 -9388
318 -9388 5900 -7948 3672 -4122 -2198 228 -4212 3882 -9687 6892 -9251 2072 -369
331 -369 -3914 664 -4294 4810 -8781 6329 -6894 2522 -694 -2784 3614 -6365 6806 -6112
$$ packed form
237D072l482j1756J9484j0506N71j0822K7176k5138N527J1419j6116J1713p549
250e407J1297j7746J6498r409L901L347j3271J7365j3122J1467j4617J4601p951
263c047K10R110j6173J6268j1492J0317j0581J0958r291J683J3821k3109J8303
276F977p923O477j0768J1378m168o468J4482j5255J3900j4695J3773p141R90O41
290B200n060J3823j9388J7120j1021O101m957N308j205j0838J9504j8781J3328
303F134r580N178j501n29K925j0058J6011j7471J4444r396L660j94l225Q560j4346
318i388J5288j3848J1620p794J924K426m440Q094j3569J6579j6143J1323k441
331c69l545M578m958R104j3591J5110j3223R416l216k090O398r979J3171j2918
$$ plain form
345 -6112 6031 -4555 2468 2043 -2189 4770 -4617 8101 -6100 7361 -1977 1148 4035 -2520
359 -2520 7071 -4713 6727 -3619 7429 -2223 544 5844 -3414 6607 -4991 8278 -4308
372 -4308 3331 1330 108 2294 -4376 8709 -6469 3699 -3070 4475 -1383 -4598 6604 -5830
386 -5830 2775 -5142 5657 -5695 -710 1337 -3602 2428 -8644 6867 -6468 594 -3565 265
400 265 60 -6774 4834 -6316 2891 -6954 4326 -3001 -3773 3246 -5019 4040 -7496 5024 -3839
415 -3839 1975 -1049 -1950 4377 -5303 5542 -5647 6615 -4066 1211 3682 -2166 3573 -3371
429 -3371 7724 -4160 5010 -1620 3129 3419 -4400 6520 -1740 5738 -5823 7319 1419 -3452
443 -3452 4289 2530 3210 -8555 11278 -2212 -1655 779 2509 2553 -6635 7181 -3270 2764 -5223
$$ packed form
345f112J2143j0586P023m25m232O959r387J2718j4201J3461r338L125K887o555
359b520R591j1784J1440j0346J1048r652K767N300r258J0021j1598J3269j2586
372d308P639k001j222K186o670J3085j5178J0168o769P545n858l215J1202j2434
386e830Q605p917J0799j1352M985K047m939O030j1072J5511j3335P062m159L830
400B65k05o834J1608j1150R207r845J1280p327p72P019q265R059j1536J2520q863
415c839N814l024r01O327r680J0845j1189J2262j0681N277K471n848N739o944
429c371J1095j1884R170o630M749K90p819J0920q260P478j1561J3142n900m871
443c452P741j759O80j1765J9833j3490N57K434J730M4r188J3816j0451O034p987
$$ plain form
458 -5223 3733 2032 -5621 2270 -1838 5292 -11130 4671 1558 -4735 -2567 1000 3289 -11129
472 -11129 6332 -2976 -250 -4871 833 1881 -7363 3462 -5583 4468 -6002 390 -5 -727
486 -727 -763 -4629 7723 -8488 2824 -369 916 -2522 313 4896 -7161 6547 -3044 1990 -1091
501 -1091 3651 -2167 -1751 9404 -6936 4271 1618 3258 -4825 4124 4808 -4986 5947 -2031 5902
516 5902 -3796 3781 1116 1101 1801 -4032 9485 -4254 806 -199 6062 -5266 -2150 8985 -6516
531 -6516 898 -1570 6202 -6681 -291 3510 -2901 614 -4689 6146 -5883 813 -2756 1627
545 1627 -196 -7529 5580 -3435 -453 -5938 5997 -4019 -5415 4624 -3150 -577 -5304 6887
559 6887 -6999 -164 2302 -3427 1063 -2244 2889 -5696 6315 -4568 -286 2926 -2301 2057
$$ packed form
458e223Q956j701p653P891m108P130j6422J5801l113o293K168L567K289j4418
472a1129J7461r308K726m621N704J048r244J0825r045J0051j0470O392l95p22
486g27l6l866J2352j6211J1312l193J285l438K835M583j2057J3708r591N034l081
501a091M742n818M16J1155j6340J1207k653J640q083Q949O84r794J0933p978P933
516E902r698P577k665j5P00n833J3517j3739N060j005O261j1328L116J1135j5501
531f516P414k468P772j2883O390L801o411L515n303J0835j2029O696l569M383
545A627j823p333J3109r015K982n485J1935j0016j396J0039p774K573m727J2191
559F887j3886O835K466n729M490l307N133q585J2011j0883M282L212n227M358
$$ plain form
573 2057 -2875 5895 -5140 4373 -713 1204 2595 -2364 4290 -1978 5036 -5282 6482 531
587 531 -2791 4181 455 3269 -4645 7996 -2282 1044 536 1714 2970 -5042 6397 -2323 3077
602 3077 -3570 3278 1610 -3293 2182 -1583 4734 -7638 4208 157 -1516 -1342 -579 4138 -8415
617 -8415 3470 -1282 -407 -4309 1598 621 -6310 4031 -4241 2086 -4934 1421 -1141 -1865 273
632 273 -3695 4321 -6139 2706 -2550 896 -1655 -1267 2777 -5144 4379 -4013 3100 -1978 1060
647 1060 732 -675 3435 -4351 5949 -3623 3058 86 1371 1624 -1599 4853 -3337 4316 -2280
662 -2280 3822 358 240 3586 -2349 4614 -3203 4775 -2335 1793 123 -1099 2865 -2813 4593
677 4593 -3953 4900 -2865 1255 1573 -2213 2468 -3480 3505 -4588 2884 -2207 -605 258 -3039 2826
$$ packed form
573B057m932Q770j1035R513n086J917J391m959O654o268P014j0318J1764n951
587E31l322O972l726K814p914J2641j0278L326n08J178J256q012J1439q720N400
602C077o647O848j668m903N475l765O317j2372J1846m051j673J74P63M717j2553
617h415J1885m752Q75l902N907r77o931J0341q272O327p020O355k562p24K138
632B73l968Q016j0460Q845n256L446k551L88M044p921R523q392P113n078L038
647A060l28j407M110p786J0300r572O681k972J285K53l223O452q190P653o596
662b280O102l464j18L346n935O963p817P978p110M128j670j222L964n678P406
677D593q546Q853p765M120L18l786M681n948O985q093P472n091J602Q63l297N865
$$ plain form
693 2826 -5203 3251 -3627 1166 -2490 -850 1442 -4258 2858 -4336 2425 -4352 2049 -1521 -2747
708 -2747 2501 -3995 2418 -4315 3059 -3204 900 -29 -1807 2592 -3894 4403 -3842 3116 -1383
723 -1383 608 1260 -1871 3645 -3196 4537 -2801 3383 -597 814 2175 -2207 5199 -3205 4280
738 4280 -1262 2910 -49 533 3001 -2283 4937 -3447 4456 -1864 1744 724 -738 3155 -2886
753 -2886 3882 -3149 3108 -1947 1029 112 -2235 3225 -4121 3488 -3851 1974 -1523 -1059 227 -2668
769 -2668 2306 -4808 3235 -4012 342 -1866 -1366 1073 -4226 3284 -4483 1971 -2979 953 -1518
784 -1518 -2043 2250 -3948 3032 -4349 3554 -2250 -69 795 -1773 2160 -3053 4228 -3500 2959 -1406
800 -1406 407 1603 -2247 3918 -2609 4068 -2276 3347 -280 356 2649 -1413 3820 -2959 4793
$$ packed form
693B826q029Q454o878M793l656J640K292n700P116p194O761o777O401l570j226
708b747N248o496O413o733P374o263M104r29j778M399o486Q297q245O958m499
723a383J991O52l131N516o841P733p338O184l980J411J361m382P406q404P485
738D280n542M172k959N82K468n284P220q384P903o320L608j020j462L893o041
753b886O768p031O257n055K976r17k347N460p346P609p339N825l497M64J286k895
769b668M974p114Q043p247M354k208N00K439n299P510p767O454m950L932k471
784a518n25M293o198O980p381P903n804K181Q64k568L933n213P281p728O459m365
800a406J813J196l850O165o527O677o344N623l627O36K293m062N233o779P752
$$ plain form
815 4793 -1859 2282 522 -184 3321 -2493 3987 -2451 3534 -2216 2119 867 -1828 3168 -3292
830 -3292 3703 -3142 2191 -1701 617 338 -2575 3189 -3821 2486 -3030 2151 -2267 -1138 1261
845 1261 -3271 2454 -4406 2428 -2832 259 -1841 -587 762 -4565 3281 -4229 1524 -2632 633
860 633 -706 -2368 1756 -3300 3136 -4318 3126 -1544 1 495 -1217 2755 -4154 4045 -2846 1674
876 1674 -687 342 1391 -1308 3088 -3599 4673 -2634 1351 1543 -385 1236 -1208 4260 -3203
891 -3203 4134 -1926 2011 1206 -1024 2082 -1215 4202 -3464 4160 -292 -460 994 191 1324 -4111
907 -4111 4587 -2476 1675 -1359 -110 1099 -3604 2294 -2030 2199 -3668 1955 -1013 -858 639
922 639 -3561 2979 -4135 1077 -2860 830 -2702 -1441 2912 -4970 1399 -1685 2052 -4154 816
$$ packed form
815D793o652M141j760p06L505n814O480o438N985n750M335j252k695M996o460
830c292O995o845N333l892K318k79k913N764p010O307n516N181m418J129K399
845A261m532N725o860O834n260L091k100J254J349n327P846p510N753m156L265
860F33j339j662M124n056O436p454P444m670J545M94j712L972o909Q199o891M520
876A674k361J029J049k699M396o687Q272p307L985J92j928J621k444N468p463
891c203P337o060L937q05k230L106l297N417p666P624m452j68J454q03J133n435
907d111Q698p063M151l034J249J209m703N898m324M229n867N623k968J55J497
922F39m200O540p114N212l937L690l532J261M353p882O369l084L737o206M970
$$ plain form
937 816 677 -3501 2472 -2856 2635 -2625 1439 -2087 1810 -99 -2811 4440 -3187 1255 -917 2780
953 2780 -1863 910 2343 -2567 3789 -1797 2707 -834 2607 -1292 673 3352 -3284 3868 -1610
968 -1610 2461 -1324 2034 289 -873 2990 -2316 3573 -2911 2243 -359 737 593 -1319 2805
983 2805 -2369 2209 -2724 2568 -978 -1787 1667 -1650 1383 -3878 3786 -4069 -224 246 -1495 -561
999 -561 -1765 2464 -4757 2498 -2538 -146 531 -2346 506 -1152 1989 -4739 3981 -1781 -1397 1821
1015 1821 -983 -282 -2337 3979 -4111 2557 -318 -995 1570 -905 1511 -1860 3708 -3351 2575
1030 2575 463 -650 2095 -1199 2833 -2431 3830 -2149 1955 611 -299 2758 -1558 3122 -2087
1045 -2087 3164 -1443 1782 424 -1359 3277 -2883 2855 -1449 2319 -1911 1547 665 -2972 3331
$$ packed form
937H16j39m178N973n328N491n260M064l526L897j909k712P251p627M442k172L697
953B780m643K773J433m910O356n586M504l541L441l899J965K679o636P152n478
968a610M071l785L358j745j162L863n306N889o484N154k602J096j44j912M124
983B805n174M578m933N292l546q09L454l317L033n261P664p855L845M70j741R34
999e61j204M229p221P255n036K392O77k877K852j658L141o728Q720n762L84L218
1015A821k804P01k055O316q090O668k875o77K565k475K416l371N568p059N926
1030B575k112j113K745l294M032n264O261n979M104j344r10L057m316M680n209
1045b087N251m607L225j358j783M636o160N738m304L768m230L458q82l637O303
$$ plain form
1060 3331 -2668 1839 -1736 1478 -1727 124 468 -3310 2939 -3901 1331 -1680 726 -2232 -473
1075 -473 1623 -4308 2697 -2772 613 -1901 523 -1434 -1096 1879 -4063 2836 -2831 903 -1102
1090 -1102 252 -483 -981 2398 -3945 3054 -1823 1200 -505 499 788 -1283 3085 -2983 3480 -1549
1106 -1549 1216 578 356 1231 -877 3502 -3009 3798 -922 651 1077 -199 1652 -1325 3193 -2806
1122 -2806 3038 -1155 446 1313 -868 1671 -1649 2837 -2909 2547 -712 -808 1224 -1502 1268 -2288
1138 -2288 2544 -3176 1827 -801 -1960 1531 -2386 964 -2449 2016 -3351 1133 -522 -2052 1575
1153 1575 -2465 1379 -2818 1489 -2555 737 99 -2253 1845 -2564 1612 -2632 2050 -2001 345
1168 345 1041 -2337 2452 -2172 1799 -1373 1849 -1271 409 1841 -2282 3207 -1884 2317 -1133
$$ packed form
1060C331n999M507l575L214l205J851L44l778O249o840N232l011K406k958J759
1075d73K096n931P005n469L385k514K424j957L38K975n942O899n667L734k005
1090a102J354p35m98L379o343O999m877L023j705J004K89k071M368o068O463n029
1106a549K765o38k22Q75k108M379o511O807m720J573M26j276J851k977M518n999
1122b806N844m193J601Q67k181K539l320M486n746N456l259r6K032k726K770l556
1138b288M832n720N003k628j159L491l917L350l413M465n367M484j655j530L627
1153A575m040L844m197M307m044L292o38k352M098m409M176m244M682m051K346
1168C45O96l378M789m624L971l172L222l120J680J432m123N489n091M201l450
$$ plain form
1183 -1133 1667 -99 189 2256 -1742 3384 -1672 2198 -815 1603 -100 31 2813 -2244 3272
1198 3272 -1594 1562 -250 788 264 -735 2467 -2908 2828 -1838 1020 -551 -64 623 -1630 2230
1214 2230 -3016 2321 -2107 487 -422 -895 432 -2208 1748 -3632 1846 -1567 -467 -346 -1293 578
1230 578 -2433 2100 -3499 1653 -1473 -541 419 -1678 1058 -2193 2325 -2622 1531 -779 -252 958
1246 958 -1293 1603 -2119 2608 -2013 1601 162 -532 1691 -1350 2243 -1633 2677 -1673 1458
1261 1458 650 -869 2310 -1314 2509 -1460 2305 -795 1312 759 -875 2494 -1645 2399 -1510
1276 -1510 1687 -1033 504 1185 -1520 2130 -1823 1972 -1719 1743 -999 -311 1100 -2513 1821
1291 1821 -2418 1229 -1916 868 -831 -951 1076 -2603 1611 -2484 878 -1931 139 -480 -1821
$$ packed form
1183a133K800j766K88K067l998N126n056L870l013K418j703J31K782n057N516
1198C272m866L156j812J038n24r99L202n375N736m666K858j571M87O87k253L860
1214B230n246N337m428K594r09m73J327k640L956n380N478l413J100J21r47J871
1230E78l011M533n599N152l126R32R60k097K736l251M518m947M153k310N27J210
1246I58k251K896l722M727m621L614j439o94K223l041L593l876M310m350L131
1261A458q08j519L179l624L823l969L765l100K107n53j634L369m139M044l909
1276a510L197k720J537O81k705L650l953L795l691L462k742O88J411l613M334
1291A821m239L647l145K784j699j20K027l679M214m095L362k809K070o19j341
$$ plain form
1306 -1821 1168 -2468 1496 -2151 876 -1370 57 138 -1616 1521 -2327 1921 -1982 955 -567
1321 -567 -279 745 -1346 1827 -2116 2623 -1292 1159 -1 13 1533 -1272 2524 -1596 2445 -859
1337 -859 781 817 -151 1707 -1050 2890 -1805 2119 -131 543 881 -453 1987 -1628 2419 -1720
1353 -1720 1642 -496 211 925 -1234 2093 -2155 1983 -1511 770 -552 -359 440 -1935 2045 -2289
1369 -2289 963 -1696 143 -340 -1250 1061 -2188 1538 -2408 985 -1293 202 -386 -1556 1483 -2568
1385 -2568 1286 -1853 1011 -1292 -185 349 -1605 1450 -2132 1448 -1204 1288 -550 -236 1409
1400 1409 -1366 1950 -1264 1614 -856 1805 234 -534 1482 -957 1926 -1201 1991 -435 1301
1415 1301 1013 -1011 1732 -564 2256 -1405 1827 -489 571 1481 -551 1697 -1445 1786 -714
$$ packed form
1306a821K989l636L964l647L027k246J427Q1j754L137l848M248l903K937j522
1321e67K88J024k091L173l943M739l915K451j160J4J520k805L796m120M041l304
1337h59J640L6r68J858k757L940m695L924k250O74L38j334K440l615M047m139
1353a720L362k138P07P14k159L327m248M138l494K281j322J93P99k375L980m334
1369b289L252k659J839m83r10K311l249L726l946L393k278J495n88j170L039m051
1385b568L854l139K864k303J107N34j954L055l582L580k652K492j838L14J645
1400A409k775L316l214K878k470K661j571p68K016k439K883l127L192k426J736
1415A301k88k024K743k296K820l661L232k316J060R10k032K248l142L231k500
$$ plain form
1430 -714 1753 -162 -767 1212 -1015 1313 -2175 2041 -1652 1038 -44 -1030 931 -1702 1595 -2441
1446 -2441 1789 -1239 -307 -477 -343 792 -2351 1248 -2128 710 -1547 -600 5 -1141 830 -2413
1462 -2413 1735 -1991 1054 -891 -789 367 -1080 1948 -1792 2023 -1028 682 -348 -15 1072
1477 1072 -800 2220 -1728 1432 -764 1339 -60 52 745 -2018 2888 -1309 1911 -737 923
1492 923 543 -375 1448 -1051 2123 -727 1145 -412 694 619 -857 1892 -1655 1690 -1179 1026
1508 1026 -470 -196 537 -1283 1369 -1795 1317 -1552 622 -452 -1083 863 -1912 1083 -1709 834
1524 834 -1419 59 -393 -1194 761 -1792 1116 -1869 1168 -1239 -211 104 -1219 1057 -1709 969
1540 969 -1511 922 -446 -324 764 -1424 1441 -1261 1466 -1202 1085 -248 -315 1172 -998 1787
$$ packed form
1430g14K467j915o05J979k227K328l488M216l693K690j082r86J961k633L297m036
1446b441M230l028R32j70J34J135l143L599l376K838k257R47O05j146J971l243
1462b413M148l726L045j945J02J156j447L028l740L815l051J710j030L33J087
1477A072j872L020l948L160k196K103j399J12O93k763M906m197L220k648J660
1492I23l80r18J823k499L174k850J872j557J106p5j476K749l547L345k869K205
1508A026j496K74P33j820K652l164L112k869K174j074o31J946k775K995k792K543
1524H34k253J478m52q01J955k553K908k985L037k407J028L15j323K276k766K678
1540I69k480K433j368J22J088k188K865k702K727k668K287j333o7J487k170K785
$$ plain form
1556 1787 -1147 1658 -514 895 616 -391 1777 -1201 1941 -895 1798 -495 481 752 -403 1765
1572 1765 -1329 2013 -1064 1318 -260 351 510 -1007 1569 -1407 1265 -1345 764 -417 -353 661
1588 661 -1593 1444 -1875 1088 -1199 136 -418 -748 572 -1864 1088 -1835 625 -1133 -212 -436
1604 -436 -939 770 -1950 1172 -1809 574 -927 -122 287 -1146 1256 -1779 1390 -1090 374 -536
1620 -536 -109 490 -923 1646 -1563 1417 -930 712 -136 37 1188 -1169 1651 -1182 1767 -548
1636 -548 909 486 -463 1423 -870 2185 -1195 1700 -223 660 650 -519 1517 -1093 1387 -1159
1652 -1159 1183 -142 87 826 -1029 1032 -1136 1323 -1554 916 -370 -752 1006 -1350 1059 -1573
1668 -1573 1166 -1401 308 -185 -864 849 -1620 849 -1733 939 -1028 -179 -145 -1070 643 -1760
$$ packed form
1556A787k934K805k172J409k79j007K168k978L142k836K693k293R76K71j155K168
1572A765l094L342l077K382j578O11J59j517K576k976K672k610K109j181O4J014
1588F61k254L037l319K963k287J335n54l30J320k436K952k923K460j758R21k24
1604d36n03J709k720L122k981K383j501Q05M09j433K402l035L169k480J464r10
1620e36M27N99j413K569l209K980k347J642q48J73J151k357K820k833K949k315
1636e48J457m23r49J886k293L055l380K895j923Q83j0j169K036k610K480k546
1652a159K342j325K29P39j855K061k168K459k877K470j286l82J758k356K409k632
1668a573K739k567J709m93o79J713k469K469k582K672j967Q49L4r25J713k403
$$ plain form
1684 -1760 1235 -1442 520 -762 -66 230 -1133 1249 -1392 1125 -1143 708 -324 28 1056 -1359
1700 -1359 1531 -1459 1239 -682 271 7 -240 1640 -1312 1855 -731 1166 -352 791 778 -363
1716 -363 1766 -1095 1717 -1103 1240 -346 598 160 -1015 2101 -732 1489 -72 561 -338 641
1732 641 1175 -978 1401 -1739 1928 -1222 398 -393 -299 766 -1862 1115 -1581 1100 -863 -85
1748 -85 -319 -966 675 -1647 1016 -1702 784 -1119 -294 -41 -1152 765 -1533 1124 -1450 618
1764 618 -497 -338 381 -847 977 -1569 1245 -992 549 10 -21 795 -892 1632 -1257 1570 -560
1781 -560 468 494 -295 1182 -901 1630 -1104 1331 -73 437 522 -82 1326 -1113 1760 -802 1300
1798 1300 -375 452 383 -406 1559 -1104 1303 -773 570 -231 -88 578 -1114 1314 -955 1006 -1165
$$ packed form
1684a760K995k677J962j282O96K96j363K382k641K517k268J851j032L52J028k415
1700a359K890k990K698j921R53k64k47J880k952L167k586J897j518J143j3j141
1716c63K129k861K812k820K343j586R44m38j175L116k833K221j561O33q99R79
1732F41N34k153K379l140L667l150J620p91R4J065k628K977k696K681j963P78
1748h5k34o47J641k322K663k718K486j903Q25K53j111J917k298K657k574K068
1764F18j115J59P19j228J824k546K814k237J541n39l1Q16j687K524k889K827k130
1781e60J028K6p89J477k083K531k734K435j404N10Q5o04J408k439K873k562K102
1798A300j675Q27o9p89J965k663K407k076J343q01J43O66j692K428k269J961k171
$$ plain form
1815 -1165 576 -284 -636 612 -1638 1154 -1487 593 -1390 225 -171 -821 879 -1643 1020 -1537
1831 -1537 706 -1112 -93 181 -1236 662 -1397 731 -1429 566 -698 -211 544 -1166 879 -1255
1847 -1255 988 -711 732 -48 -325 809 -803 1571 -1032 1446 -676 616 777 -306 973 -579
1863 -579 1706 -1052 1486 -414 378 582 -416 1233 -1048 1466 -682 1079 -136 93 541 -781
1879 -781 1197 -1411 1396 -971 601 40 -410 273 -987 1342 -1398 832 -864 -82 -29 -730 616
1896 616 -1203 1167 -1514 780 -774 -363 -118 -791 508 -1610 1064 -1310 300 -605 -55 187 -1049
1913 -1049 790 -1370 1191 -1151 398 -354 -335 515 -807 1114 -1136 1241 -680 566 244 47
1929 47 747 -1037 1572 -996 1231 -431 596 450 -561 1481 -660 1265 -849 1117 -86 462
$$ packed form
1815a165J741q60l52J248k250K792k641K080j983J615l96o50J700k522K663k557
1831a537K243j818J019K74j417J898k059K128k160J995j264M87P55j710K045k134
1847a255K243j699J443p80k77J134j612K374k603K478k122J292J61j083J279j552
1863e79K285k758K538j900P92K04r98J649k281K514k148J761j215K29M48j322
1879g81J978k608K807k367J572n61m50O83j260K329k740K230j696P82N3p01J346
1896F16j819K370k681K294j554M11K45o73J299k118K674k374J610r05N50K42j236
1913a049J839k160K561k342J549p52J9Q50j322J921k250K377j921J246l22j97
1929D7P00j784K609k568K227j662J027j46j011K042k141J925k114J966j203N48
$$ plain form
1945 462 700 -655 1005 -860 1405 -846 1014 -365 -209 890 -1041 1335 -1186 1288 -958 896
1961 896 -152 -612 905 -1306 780 -1207 724 -1095 274 -182 -877 779 -1462 651 -1449 598
1977 598 -1243 -63 80 -1055 654 -1695 837 -1213 556 -766 -210 181 -1115 906 -1470 1323
1993 1323 -878 280 -197 -181 649 -1057 1286 -1276 966 -552 335 -4 -32 627 -1048 1509 -1074
2010 -1074 1165 -105 431 487 -85 1120 -873 1422 -635 1188 -53 138 526 -189 1216 -1235 1481
2027 1481 -781 747 -119 45 825 -758 1273 -1068 1117 -801 174 -4 -515 557 -981 1055
2043 1055 -1423 916 -1068 74 218 -1159 521 -1277 763 -1154 758 -794 -135 239 -706 1096
2059 1096 -1182 689 -1264 566 -640 -362 630 -1185 748 -1104 1000 -1161 808 -235 -441 1104
$$ packed form
1945D62K38j355J660j865K265k251J860j379J56J099j931K376k521K474k246J854
1961H96j048m60J517k211K086j987J931j819J369m56o95J656k241K113k100K047
1977E98j841J180J43j135J709k349K532k050J769j322N56L91j296K021k376K793
1993A323k201J158m77J6Q30j706K343k562K242j518Q87l39k8O59j675K557k583
2010a074K239j270N36N6n72J205j993K295k057J823j241J91L88p15J405k451K716
2027A481k262J528q66J64P80j583K031k341K185j918R75j78n11J072j538K036
2043A055k478K339j984J142J44j377J680j798K040j917J912j552O59L74r45J802
2059A096k278J871j953J830j206K78R92j815J933j852K104k161J969j043k06J545
$$ plain form
2075 1104 -1082 1436 -866 812 -502 543 194 -349 1001 -578 1391 -586 1133 -500 564
2090 564 488 -307 1228 -798 1348 -636 940 -184 156 603 -795 1308 -1142 1105 -629 707
2106 707 53 31 464 -927 1126 -1309 888 -904 -33 -104 -480 645 -1156 923 -1312 568 -599
2123 -599 -171 -116 -776 630 -1350 748 -1368 300 -440 -418 -156 -857 749 -1428 1039 -1179 128
2140 128 -182 -199 372 -1018 879 -1169 1262 -539 455 32 -441 600 -491 1315 -788 998 -460
2157 -460 709 487 -288 870 -592 1353 -840 1251 -263 262 703 -459 1326 -682 1179 -475
2173 -475 873 -105 -130 867 -1111 1041 -785 1050 -782 588 141 -468 638 -770 933 -1048 780
2190 780 -950 321 -322 -700 460 -862 775 -1372 629 -403 -235 -163 -756 740 -1704 937 -1087
$$ packed form
2075A104k186K518k302J678j314J045l49n43J350j579J969j977J719j633J064
2090E64p6p95J535k026K146j984J576j124L40M47j398K103k450K247j734J336
2106G07o54k2M33j391K053k435K197j792Q71p1l76J125j801K079k235J880j167
2123e99M28N5o60J406j980K098k116J668p40K2K62p01J606k177K467k218J307
2140A28l10j7N71j390J897k048K431j801R94m23m73J041j091J806k103J786j458
2157d60J169k22p75J158j462J945k193K091j514N25M41j162J785k008J861j654
2173d75J348r78k5R97j978K152j826J835j832J370m47o09J106j408J703j981J828
2190G80j730J271o43l78J160j322J637k147K001j032J68P2n93J496k444K641k024
$$ plain form
2207 -1087 309 -400 -236 168 -775 861 -1299 787 -636 231 -533 62 325 -795 1434 -1213 1016
2224 1016 -264 210 318 119 705 -890 1203 -856 888 -218 201 323 -200 956 -765 1278 -781
2241 -781 813 -328 292 450 -152 1110 -735 1185 -651 700 -27 -112 376 -592 1038 -887 792
2258 792 -855 117 -66 -430 664 -1158 928 -1109 579 -659 -26 211 -636 416 -952 814 -1318
2275 -1318 331 -743 -141 -12 -974 266 -1222 657 -845 510 -448 -237 498 -1002 1028 -959
2291 -959 624 -897 745 24 -31 524 -520 1109 -632 942 -781 748 -555 -61 1284 -441
2307 -441 928 -520 1022 -290 153 454 -673 569 -489 1041 -766 564 -175 733 905 -37 986
2324 986 -904 884 -542 480 -136 1 573 -537 1031 -933 512 -297 134 55 -438 307 -1065
$$ packed form
2207a087J396p09J64M04r43J636k160K086j423Q67p64N95K63j120K229k647K229
2224A016j280M74J08j99N86j595K093k059J744j106M19J22n23J156j721K043k059
2241g81J594j141O20J58o02J262j845J920j836J351p27q5M88r68J630j925J679
2258G92j647R72j83l64J094j822K086k037J688j238O33K37q47J052j368J766k132
2275a318J649j074O02J29r62J240j488J879j502J355r58K11P35j500K030j987
2291i59J583j521J642p21n5N55j044J629j741J574j723J529j303M94J345j725
2307d41J369j448J542j312M43L01j127J242j058J530j807J330p39R08J72r42J023
2324I86j890J788j426J022o16J37N72j110J568j964J445q09M31p9m93P45j372
$$ plain form
2341 -1065 879 -966 254 -294 -26 -223 -911 459 -1377 677 -979 298 -538 -298 -28 -982 625
2358 625 -1110 693 -1096 154 -55 -160 221 -469 474 -666 1056 -1017 350 -110 -176 414 -655
2375 -655 1085 -868 765 -341 310 418 -230 825 -1000 859 -647 1065 99 449 470 16 1196
2392 1196 -515 906 -693 811 -153 33 1246 -872 1001 -1091 856 -397 87 223 -145 503
$$ packed form
2341a065J944j845J220n48K68j97o88J370j836K054j656J277q36K40K70r54J607
2358F25j735J803j789J250k09j05L81o90R43j140J722k073J367m60o6N90j069
2375f55J740j953J633j106O51J08o48J055j825J859j506J712r66L50K1m54J180
2392A196j711J421j599J504r64J86J213k118J873k092J947j253M84J36l68O48
$$ [...]
8191d8
##END NTUPLES=NMR FID
##END=
