##TITLE=1H_Pr Am-1
 CDCl3, 8 sc, 
 5.3.2019
##JCAMPDX= 6.0         $$ Bruker NMR JCAMP-DX V2.0
##DATA TYPE= NMR FID
##DATA CLASS= NTUPLES
##ORIGIN= UXNMR, Bruker Analytische Messtechnik GmbH
##OWNER= root
$$ XWIN-NMR		Version 3.5
$$ Tue Mar  5 15:05:00 2019 Russian Standard Time (UT+4h)  she@DPX200
##.OBSERVE FREQUENCY= 200.1316
##.OBSERVE NUCLEUS= ^1H
##.DELAY= (6, 6)
##.ACQUISITION MODE= SIMULTANEOUS
##.ACQUISITION SCHEME= undefined
##.AVERAGES= 8
##.DIGITISER RES= 18
##SPECTROMETER/DATA SYSTEM= spect
##.PULSE SEQUENCE= zg30
##.SOLVENT NAME= CDCl3
##.SHIFT REFERENCE= (INTERNAL, CDCl3, 0, 15.7039)
##AUDIT TRAIL= $$ (NUMBER, WHEN, WHO, WHERE, WHAT)
$$ ##TITLE= Audit trail, XWIN-NMR		Version 3.5
$$ ##JCAMPDX= 5.01
$$ ##ORIGIN= Bruker BioSpin GmbH
$$ ##OWNER= she
$$ F:/spectra/data/she/nmr/H-F/1/audita.txt
$$ ##AUDIT TRAIL=  $$ (NUMBER, WHEN, WHO, WHERE, WHAT)
(   1,<2019-03-05 15:03:58.03 +0400>,<she>,<DPX200>,
      <created by zg, POWCHK disabled, PULCHK disabled
       configuration hash MD5:
       00 E9 B6 7A A2 85 ED C7 34 08 36 98 17 FE 4E 26
       data hash MD5: 16K
       D9 5C D7 CA 42 58 6C 8E 78 B1 73 43 A2 64 24 81>)
$$ ##END=
$$ 
$$ hash MD5
$$ BA C9 0D FF 1E A6 14 70 EE 99 22 6A 82 28 40 F2
##$RELAX= 
##$RELAX= 
##$RELAX= 
##$RELAX= 
##$RELAX= 
##$RELAX= 
$$ Bruker specific parameters
$$ --------------------------
##$DU= <F:/spectra>
##$EXPNO= 1
##$NAME= <H-F>
##$PROCNO= 1
##$TYPE= <nmr>
##$USER= <she>
##$AMP= (0..31)
100 100 100 100 100 100 100 100 100 100 100 100 100 100 100 100 100 100 
100 100 100 100 100 100 100 100 100 100 100 100 100 100 
##$AQSEQ= 0
##$AQ_mod= 1
##$AUNM= <au_zg>
##$AUTOPOS= <>
##$BF1= 200.13
##$BF2= 200.13
##$BF3= 200.13
##$BF4= 200.13
##$BF5= 200.13
##$BF6= 200.13
##$BF7= 200.13
##$BF8= 200.13
##$BYTORDA= 1
##$CFDGTYP= 0
##$CFRGTYP= 5
##$CHEMSTR= <none>
##$CNST= (0..31)
1 1 145 1 1 1 1 1 1 1 1 1 1 1 1 1 1 1 1 1 1 1 1 1 1 1 1 1 1 1 1 1 
##$CPDPRG= <>
##$CPDPRG1= <>
##$CPDPRG2= <>
##$CPDPRG3= <>
##$CPDPRG4= <mlev>
##$CPDPRG5= <mlev>
##$CPDPRG6= <mlev>
##$CPDPRG7= <mlev>
##$CPDPRG8= <mlev>
##$CPDPRGB= <>
##$CPDPRGT= <>
##$D= (0..31)
0 1.2 0 0 0 0 0 0 0 0 0 0.03 0 0 0 0 0 0 0 0 0 0 0 0 0 0 0 0 0 0 0 0 
##$DATE= 1551783837
##$DBL= (0..7)
120 120 120 120 120 120 120 120 
##$DBP= (0..7)
150 150 150 150 150 150 150 150 
##$DBP07= 0
##$DBPNAM0= <>
##$DBPNAM1= <>
##$DBPNAM2= <>
##$DBPNAM3= <>
##$DBPNAM4= <>
##$DBPNAM5= <>
##$DBPNAM6= <>
##$DBPNAM7= <>
##$DBPOAL= (0..7)
0.5 0.5 0.5 0.5 0.5 0.5 0.5 0.5 
##$DBPOFFS= (0..7)
0 0 0 0 0 0 0 0 
##$DE= 6
##$DECBNUC= <off>
##$DECIM= 24
##$DECNUC= <off>
##$DECSTAT= 4
##$DIGMOD= 1
##$DIGTYP= 9
##$DL= (0..7)
0 120 120 120 120 120 120 120 
##$DP= (0..7)
150 150 150 150 150 150 150 150 
##$DP07= 0
##$DPNAME0= <>
##$DPNAME1= <>
##$DPNAME2= <>
##$DPNAME3= <>
##$DPNAME4= <>
##$DPNAME5= <>
##$DPNAME6= <>
##$DPNAME7= <>
##$DPOAL= (0..7)
0.5 0.5 0.5 0.5 0.5 0.5 0.5 0.5 
##$DPOFFS= (0..7)
0 0 0 0 0 0 0 0 
##$DQDMODE= 0
##$DR= 18
##$DS= 0
##$DSLIST= <SSSSSSSSSSSSSSS>
##$DSPFIRM= 0
$$ [...]
##$SUBNAM2= <"">
##$SUBNAM3= <"">
##$SUBNAM4= <"">
##$SUBNAM5= <"">
##$SUBNAM6= <"">
##$SUBNAM7= <"">
##$SUBNAM8= <"">
##$SUBNAM9= <"">
##$SW= 24.9336934301222
##$SWIBOX= (0..15)
0 0 2 0 0 0 0 0 0 0 0 0 0 0 0 0 
##$SW_h= 4990.01996007984
##$TD= 16384
##$TD0= 1
##$TE= 0
##$TE2= 300
##$TE3= 300
##$TEG= 300
##$TL= (0..7)
0 120 120 120 120 120 120 120 
##$TP= (0..7)
150 150 150 150 150 150 150 150 
##$TP07= 0
##$TPNAME0= <>
##$TPNAME1= <>
##$TPNAME2= <>
##$TPNAME3= <>
##$TPNAME4= <>
##$TPNAME5= <>
##$TPNAME6= <>
##$TPNAME7= <>
##$TPOAL= (0..7)
0.5 0.5 0.5 0.5 0.5 0.5 0.5 0.5 
##$TPOFFS= (0..7)
0 0 0 0 0 0 0 0 
##$TUNHIN= 0
##$TUNHOUT= 0
##$TUNXOUT= 0
##$USERA1= <user>
##$USERA2= <user>
##$USERA3= <user>
##$USERA4= <user>
##$USERA5= <user>
##$V9= 5
##$VALIST= <valist>
##$VCLIST= <CCCCCCCCCCCCCCC>
##$VD= 0
##$VDLIST= <DDDDDDDDDDDDDDD>
##$VPLIST= <PPPPPPPPPPPPPPP>
##$VTLIST= <TTTTTTTTTTTTTTT>
##$WBST= 1024
##$WBSW= 4
##$XGAIN= (0..3)
0 0 0 0 
##$XL= 0
##$YL= 0
##$YMAX_a= 507993
##$YMIN_a= -727872
##$ZGOPTNS= <>
##$ZL1= 120
##$ZL2= 120
##$ZL3= 120
##$ZL4= 120
##$ABSF1= 10
##$ABSF2= 0
##$ABSG= 5
##$ABSL= 3
##$ALPHA= 0
##$AQORDER= 0
##$ASSFAC= 0
##$ASSFACI= 0
##$ASSFACX= 0
##$ASSWID= 0
##$AUNMP= <proc_1d>
##$AZFE= 0.1
##$AZFW= 0.1
##$BCFW= 1
##$BC_mod= 2
##$BYTORDP= 1
##$COROFFS= 0
##$CY= 11.3945322036743
##$DATMOD= 1
##$DC= 2
##$DFILT= <>
##$DTYPP= 0
##$F1P= 18.9103706918063
##$F2P= -1.10871071338519
##$FCOR= 0.5
##$FTSIZE= 0
##$FT_mod= 4
##$GAMMA= 1
##$GB= 0.15
##$INTBC= 1
##$INTSCL= 1
##$ISEN= 128
##$LB= 0.24
##$LEV0= 0
##$LPBIN= 0
##$MAXI= 10000
##$MC2= 0
##$MEAN= 0
##$ME_mod= 0
##$MI= 1.114404
##$NCOEF= 0
##$NC_proc= 0
##$NLEV= 6
##$NOISF1= 3.799351
##$NOISF2= 2.8
##$NSP= 1
##$NTH_PI= 0
##$NZP= 0
##$OFFSET= 15.70392
##$PC= 1
##$PHC0= -8873.513
##$PHC1= 28.80013
##$PH_mod= 1
##$PKNL= yes
##$PPARMOD= 0
##$PSCAL= 0
##$PSIGN= 0
##$REVERSE= no
##$SF= 200.130013532006
##$SI= 16384
##$SIGF1= 3
##$SIGF2= 2
##$SINO= 400
##$SIOLD= 16384
##$SREGLST= <1H.CDCl3>
##$SSB= 0
##$STSI= 0
##$STSR= 0
##$SW_p= 3612.71676300578
##$SYMM= 0
##$S_DEV= 0
##$TDeff= 0
##$TDoff= 0
##$TI= <>
##$TILT= no
##$TM1= 0
##$TM2= 0
##$TOPLEV= 0
##$USERP1= <user>
##$USERP2= <user>
##$USERP3= <user>
##$USERP4= <user>
##$USERP5= <user>
##$WDW= 1
##$XDIM= 8192
##$YMAX_p= 0
##$YMIN_p= 0
$$ End of Bruker specific parameters
$$ ---------------------------------
##NTUPLES= NMR FID
##VAR_NAME=  TIME,          FID/REAL,        FID/IMAG
##SYMBOL=    X,             R,               I
##VAR_TYPE=  INDEPENDENT,   DEPENDENT,       DEPENDENT
##VAR_FORM=  AFFN,          ASDF,            ASDF
##VAR_DIM=   8192,          8192,            8192
##UNITS=     SECONDS,       ARBITRARY UNITS, ARBITRARY UNITS
##FACTOR=    0.0002004,     1,               1
##FIRST=     0,             0,               0
##LAST=      1.6414764,     0,               0
##MIN=       0,             -727872,         0
##MAX=       1.6414764,     507993,          0
$$ Real data points
##PAGE= N=1
##DATA TABLE= (X++(R..R)), XYDATA
$$ plain form
0 0 0 0 0 -6 8 -8 8 -16 24 -24 32 -41 48 -62 78 -93 111 -132 157 -185 215 -253 294 -335 387 -447 505
27 505 -575 657 -741 829 -937 1054 -1175 1311 -1464 1628 -1806 2009 -2227 2463 -2729 3022
43 3022 -3343 3705 -4110 4562 -5079 5673 -6360 7168 -8132 9312 -10789 12704 -15297
56 -15297 19027 -24870 35407 -60362 239820 -70033 -665741 -132089 373036 422767 -65918
67 -65918 -426305 -178342 318632 190489 -142872 -157542 -9339 79628 85516 -140024 -145904
78 -145904 199637 220760 -184954 -264206 28445 282212 235631 -180364 -439915 25928 488143
89 488143 182403 -312917 -318753 22685 344796 218780 -266040 -315610 118324 243822 28393
100 28393 -100073 -126183 -3669 176458 32282 -168913 10159 165246 9942 -111434
$$ packed form
0@%%%oJ4j6J6k4M0m8N6p3Q9j10J40j71K04k43K89l42M00m68N47o29P22q34R52
27E05j080J232j398J570j766J991k229K486k775L092l434L815m236M690n192N751
43C022o365P048p815Q672r641J0752j2033J3528j5300J7444k0101K3493k8001
56a5297L4324m3897O0277r5769L00182l09853n95708N33652N05125M9731m88685
67f5918l60387K47963M96974j28143l33361j4670J48203Q8967N888k25540n880
78a45904L45541K1123m05714p9252K92651K53767m6581m15995k59551M65843M62215
89D88143l05740m95320n836L41438L22111j26016m84820m9570M33934J25498k15429
100B8393j28466k6110J22514J80127j44176k01195J79072J55087j55304j21376
$$ plain form
110 -111434 -84363 49268 218046 50431 -289907 -142511 230913 186962 -58734 -174464
120 -174464 -155663 84092 256589 6545 -223009 -82503 76986 118547 80636 -114017
130 -114017 -145675 110693 128310 -84452 -51595 60177 18624 -5398 -48200 -69450 97758
141 97758 112299 -142131 -146810 75056 91343 13984 -45306 -144561 -42574 161432 67585
152 67585 -100651 -70276 -35766 39647 155871 4215 -176246 -17416 119441 31046 -4374
163 -4374 -18330 -49835 36737 37181 -66614 28774 99598 -74344 -104785 44606 52736 32438
175 32438 23708 -105330 -91752 98989 95205 -16570 -37117 -90731 -46487 144063 89468 -116152
187 -116152 -79397 14713 11603 63515 27791 -100858 -41326 44143 -14604 20323 55128 -73003
$$ packed form
110a11434K7071J33631J68778j67615l40338J47396L73424m3951k45696j15730
120a74464J8801K39755J72497k50044k29554J40506J59489M1561l7911j94653
130a14017l1658K56368J7617k12762L2857J11772m1553k4022m2802k1250J67208
141I7758J4541k54430m679K21866J6287p7359n9290r9255J01987K04006r3847
152F7585j68236L0375L4510P5413J16224j51656j80461J58830J36857q8395l5420
163d374j3956l1505Q6572M44j03795R5388P0824j73942l0441J49391Q130k0298
175C2438q730j29038J3578J90741l784j11775k0547n3614M4244J90550n4595k05620
187a16152L6755R4110l110N1912l5724j28649N9532Q5469n8747L4927L4805j28131
$$ plain form
199 -73003 -68734 56791 27737 6397 42080 -56102 -71852 74198 64287 -14002 13779 -43080
211 -43080 -73845 79427 96644 -46107 -48980 -27332 -38637 75752 90802 -74129 -86104
222 -86104 -1008 4131 77606 84366 -106777 -117456 75701 91701 17957 352 -71446 -44400
234 -44400 98570 56825 -41012 8313 -12827 -55569 53088 59202 -46484 -6397 6586 -72961
246 -72961 10959 94998 -8457 -58972 -37356 -39900 69548 119454 -70875 -136160 24106
257 24106 77851 48422 18822 -98427 -84389 101185 86096 -53940 -31700 -9754 -27625
268 -27625 51023 41557 -51637 1805 31053 -50693 138 72422 6645 -6799 -6006 -71750 25197
281 25197 147541 856 -124484 -27110 43309 62428 58948 -74345 -115520 46892 78879
$$ packed form
199g3003M269J25525k9054k1340L5683r8182j5750J46050r911p8289K7781n6859
211d3080l0765J53272J7217j42751k873K1648j1305J14389J5050j64931j1975
222h6104Q5096N139P3475O760j91143j0679J93157J6000p3744j7605p1798K7046
234d4400J42970m1745r7837M9325k1140m2742J08657O114j05686M0087J2983p9547
246g2961Q3920Q4039j03455n0515K1616k544J09448M9906j90329o5285J60266
257B4106N3745k9429k9600j17249J4038J85574j5089j40036K2240K1946j7871
268b7625P8648r466r3194N3442K9248q1746N0831P2284o5777j3444P93o5744R6947
281B5197J22344j46685j25340R7374P0419J9119l480j33293m1175J62412L1987
$$ plain form
292 78879 -17866 -16551 -36228 -56539 50870 50132 -67934 -13959 49496 -36163 -27128 39115
304 39115 1249 10841 22497 -67427 -24335 98804 24325 -62101 -16439 -13102 15687 82223
316 82223 -24194 -109969 19174 67011 -12393 -5338 -20644 -54881 42978 60901 -55058 -31646
328 -31646 36425 -6665 4848 19984 -44460 5815 71026 -38517 -61530 53484 32491 -24293
340 -24293 4697 -28491 -25429 70440 23898 -69777 -6980 24775 -4949 35778 269 -72641
352 -72641 20235 68270 -36140 -31155 28297 -12100 1688 24761 -47560 -18779 62429 -14148
364 -14148 -58062 15769 6334 -7620 31366 -35036 -61043 54966 46831 -47934 -12283 8608
376 8608 -14463 49591 32984 -66428 -9058 61313 -13 -2689 18027 -33390 6671 56907
$$ packed form
292G8879r6745J315j9677k0311J07409p38j18066N3975O3455q5659R035O6243
304C9115l7866R592J1656q9924M3092J23139p4479q6426M5662L337K8789O6536
316H2223j06417q5775J29143M7837p9404P055j5306l4237R7859J7923j15959K3412
328c1646O8071m3090J1513J5136o4444N0275O5211j09543k3013J15014k0993n6784
340b4293K8990l3188L062R5869m6542r3675O2797L1755k9724M0727l5509p2910
352g2641R2876M8035j04410M985N9452m0397J3788K3073p2321K8781Q1208p6577
364a4148m3914P3831r435j3954L8986o6402k6007J16009q135r4765L5651K0891
376H608k3071O4054j6607r9412N7370P0371o1326k676K0716n1417M0061N0236
$$ plain form
388 56907 -28523 -30071 50822 -6183 -42651 28400 7065 -21307 31301 -12887 -55374 35278
400 35278 39885 -32192 -3138 -3969 -35596 44762 48664 -61637 -29400 41965 -2725 3090 24391
413 24391 -42154 -17282 51934 -10030 -27837 34147 -9497 -31752 34308 3181 -27480 35484
425 35484 1181 -51642 27767 38789 -30972 624 9401 -34774 23781 42751 -43250 -21875
437 -21875 30238 -14366 3435 33220 -39094 -26100 48902 -3381 -26948 33676 -6267 -34700
449 -34700 36061 17493 -26607 22332 5086 -35089 31449 29767 -36376 5202 18075 -35998
461 -35998 17011 41614 -46736 -28077 35942 -10564 -12533 20942 -34757 -25487 41462 -7269
473 -7269 -33374 22079 -11542 -30786 38311 6371 -44526 20756 16886 -36242 21147 29113 -38096
$$ packed form
388E6907q5430j548Q0893n7005l6468P1051k1335k8372N2608m4188m2487R0652
400C5278M607p2077K9054q31l1627Q0358L902j10301L2237P1365m4690N815K1301
413B4391o6545K4872O9216o1964j7807O1984m3644k2255O6060l1127l0661O2964
425C5484l4303n2823P9409J1022o9761L1596Q777m4175N8555J8970q6001K1375
437b1875N2113m4604J7801K9785p2314J2994P5002n2283k3567O0624l9943k8433
449c4700P0761j8568m4100M8939j7246m0175O6538j682o6143M1578J2873n4073
461c5998N3009K4603q8350J8659O4019m6506j969L3475n5699R270O6949m8731
473g269k6105N5453l3621j9244O9097l1940n0897O5282l870n3128N7389P966o7209
$$ plain form
486 -38096 -473 29270 -21026 9587 31007 -36276 -10996 42371 -10465 -9691 27491 -30895
498 -30895 -20621 56994 1594 -46902 15622 6764 -19852 30688 2323 -47071 13470 22083
510 22083 -25652 12829 10243 -43969 8926 35506 -32206 -6247 32188 -31251 -16875 42930
522 42930 -7097 -22433 21620 -13819 -14661 42879 -2528 -37367 20888 5503 -20891 32998
534 32998 3922 -50383 17094 32645 -29893 2034 17596 -35297 2999 36311 -25495 -12939
546 -12939 25567 -20661 -7773 35372 -17175 -17183 35535 -14783 -27068 46296 11908 -39043 15529
559 15529 14001 -15819 30464 10754 -43134 13670 33863 -19330 5942 13611 -37120 9414
571 9414 42958 -30878 -21943 29614 -16139 -14870 30949 -18486 -29444 29254 -3374 -29412 22484
$$ packed form
486c8096L7623K9743n0296L0613K1420o7283K5280N3367n2836P74L7182n8386
498c0895J0274P7615n5400m8496O2524q858k6616N0540k8365m9394O0541Q613
510B2083m7735L8481k586n4212N2895K6580o7712K5959L8435o3439J4376N9805
522D2930n0027j5336M4053l5439q42N7540m5407l4839N8255j5385k6394N3889
534C2998k9076n4305O7477J5551o2538L1927J5562n2893L8296L3312o1806J2556
546a2939L8506m6228J2888M3145n2547qN2718n0318j2285P3364l4388n0951N4572
559A5529j528k9820M6283j9710n3888N6804K0193n3193K5272P669n0731M6534
571I414L3544p3836Q935N1557m5753J269M5819m9435j0958N8698l2628k6038N1896
$$ plain form
584 22484 644 -28663 21421 3534 -30440 28978 19043 -44344 6600 36731 -17554 1777
596 1777 18562 -28253 6155 43419 -19099 -19278 25012 -10260 -4184 36623 -19057 -33352 33347
609 33347 7672 -24538 20925 -3121 -33728 27410 19531 -35707 4104 16473 -24837 10771
621 10771 19002 -33576 1507 27786 -27938 -5136 34515 -24323 -22124 33671 -4587 -18371
633 -18371 22966 -11584 -21618 34517 2349 -31529 20778 7073 -29295 21574 14506 -35494
645 -35494 8768 18768 -32377 5747 27077 -32099 -12135 24130 -19352 -5587 27956 -24222
657 -24222 -21427 30676 -4444 -13242 28423 -15115 -29056 42435 18991 -35605 7585 14869 -12692
670 -12692 22553 8236 -37033 14539 30610 -27388 -4302 20180 -24287 -41 28584 -29174
$$ packed form
584B2484k1840k9307N0084j7887l3974N9418r935o3387N0944L0131n4285J9331
596A777J6785m6815L4408L7264o2518j79M4290l5272O076M0807n5680j4295O6699
609C3347k5675l2210M5463k4046l0607O1138p879n5238L9811J2369m1310L5608
621A0771Q231n2578L5083K6279n5724K2802L9651n8838K199N5795l8258j3784
633a8371M1337l4550j0034N6135l2168l3878N2307j3705l6368N0869p068n0000
645c5494M4262J0000n1145L8124K1330n9176J9964L6265m3482J3765L3543n2178
657b4222K795N2103l5120q798M1665m3538j3941P1491k3444n4596M3190P284k7561
670a2692L5245j4317m5269N1572J6071n7998K3086K4482m4467K4246K8625n7758
$$ plain form
682 -29174 -18687 32478 -9828 -22212 20326 -11890 -21040 31435 -728 -35591 13960 10696
694 10696 -16140 17671 -4704 -36352 28566 30130 -40667 -7668 30662 -11476 -151 16572
706 16572 -24423 1950 38348 -16336 -19308 26082 -3028 -5239 30041 -17955 -29997 39074
718 39074 16480 -31740 5449 1981 -19003 29645 12749 -47540 -2282 30590 -10244 135
730 135 2920 -30897 14014 37773 -30931 -18249 37858 -4828 -18374 22898 -5156 -10047 32424
743 32424 -8274 -34127 26242 19662 -18312 5627 -10149 -26827 35414 25254 -45999 -14908
755 -14908 19247 -8271 16121 16254 -48706 -16132 47450 4864 -18326 4928 -16279 -311
767 -311 36618 -10031 -21570 29865 -5269 -33604 30253 27196 -21866 -881 -5367 -21898 37378
$$ packed form
682b9174J0487N1165m2306j2384M2538l2216r150N2475l2163l4863M9551l264
694A0696k6836L3811k2375l1648O4918J564p0797L2999L8330m2138J1325J6723
706A6572m0995K6373L6398n4684k972M5390k9110k211L5280m7996j2042O9071
718C9074k2594m8220L7189l468k0984M8648j6896o0289M5258L2872m0834J0379
730A35K785l3817M4911K3759o8704J2682N6107m2686j3546M1272k8054m891M2471
743C2424m0698k5853O0369o580l7974K3939j5776j6678O2241j0160p1253L1091
755a4908L4155k7518K4392J33o4960L2574O3582m2586k3190K3254k1207J5968
767c11L6929m6649j1539N1435l5134k8335O3857l057m9062K0985m486j6531N9276
$$ plain form
780 37378 36197 -40020 -26311 13211 4607 30942 20423 -55015 -27496 44878 17053 -4984
792 -4984 1801 -40525 -16980 54180 9051 -43066 -1511 737 -15824 20567 4020 -28270 10444
805 10444 1288 -33804 21700 37671 -26418 -17436 8399 -11253 27911 43646 -38592 -42346 28773
818 28773 26992 13637 7789 -48242 -30095 55689 28007 -30954 -12244 -16896 -13452 44157 14388
831 14388 -49070 -4568 20819 -16506 7489 21367 -17795 -1485 7665 -29172 13662 54580
843 54580 -16912 -45490 2053 8831 26594 37317 -44096 -62512 33147 48658 -806 -11348
855 -11348 -36499 -28152 51921 40463 -39205 -23601 6182 -4739 25012 17908 -39052 -6614
867 -6614 30426 -21544 -15115 33763 771 -22225 -4470 -18895 10727 55415 -14243 -63033
$$ packed form
780C7378j181p6217J3709L9522q604K6335j0519p5438K7519P2374k7825k2037
792d984O785m2326K3545P1160m5129n2117M1555K248j6561L6391j6547l2290L8714
805A0444r156l5092N5504J5971o4089Q982K5835j9652L9164J5735q2238l754P1119
818B8773j781j3355n848n6031J8147Q5784k7682n8961J8710m652L444N7609k9769
831A4388o3458M4502K5387l7325K3995J3878l9162J6310R150l6837M2834M0918
843E4580p1492k8578M7543O778J7763J0723q1413j8416R5659J5511m9464j0542
855a1348k5151Q347Q0073j1458p9668J5604K9783j0921K9751p104n6960L2438
867f614L7040n1970O429M8878l2992k2996J7755j4425K9622M4688o9658m8790
$$ plain form
879 -63033 4077 33464 19432 23520 -29865 -57506 34149 65149 -6879 -22437 -12748 -15419 35177
892 35177 38654 -32102 -19483 21091 -14030 -8007 28942 -6810 -16228 8346 -28611 -18449 51685
905 51685 17452 -46658 -21021 -478 13676 49929 -3207 -68661 -6430 45817 16452 8668
917 8668 -15277 -49241 17160 58971 -11836 -28877 7888 -8904 208 29176 -9255 -16098 18584
930 18584 -14096 -22498 34672 18510 -22621 -4693 -15129 -13204 53456 29585 -59594 -34950
942 -34950 24991 26543 28317 -10483 -67542 -8706 61133 15548 -19651 -14485 -31199 7697 54584
955 54584 -5440 -37474 11025 2436 -13772 27559 13836 -19937 3977 -8296 -22906 37220
967 37220 36286 -36904 -33323 -1070 6822 43295 16667 -73750 -40127 50649 31828 -6758 -18767
$$ packed form
879f3033O7110K9387j4032M088n3385k7641R1655L1000p2028j5558R689k671N0596
892C5177L477p0756J2619M0574l5121O023L6949l5752r418K4574l6957J0162P0134
905E1685l4233o4110K5637K0543J4154L6253n3136o5454O2231N2247k9365p784
917H668k3945l3964O6401M1811p0807j7041L6765j6792R112K8968l8431o843L4682
930A8584l2680q402N7170j6162m1131J7928j0436J925O6660k3871q9179K4644
942c4950N9941J552J774l8800n7059N8836O9839m5585l5199N166j6714L8896M6887
955E4584o0024l2034M8499q589j6208M1331j3723l3773K3914j2273j4610O0126
967C7220r34p3190L581L2253P892L6473k6628r0417L3623R0776j8821l8586j2009
$$ plain form
980 -18767 -46917 -4764 63909 15459 -40318 -11889 -2851 7499 42010 424 -38745 12245
992 12245 15608 -21802 19534 32341 -22647 -20048 -562 -7000 34878 35942 -49305 -49927 22726
1005 22726 32611 23569 -42 -65128 -33427 65565 41374 -29066 -25609 -22553 -2458 52350 16784
1018 16784 -47942 -12975 13327 -6403 16154 13888 -27454 -3712 10073 -22158 13894 43109
1030 43109 -22408 -38112 10224 12825 22267 28540 -38997 -48504 36098 46548 532 -15179 -40340
1043 -40340 -19294 59816 34662 -48208 -28629 6217 1195 26613 13675 -42496 -13417 26265
1055 26265 -7122 -320 25452 -12035 -16600 10512 -8437 10439 47035 -14091 -52789 8618
1067 8618 31053 16693 17123 -33195 -53329 31012 54926 -10855 -25856 -20651 -16945 36205 33846
$$ packed form
980a8767k8150M2153O8673m8450n5777K8429R038J0350L4511m1586l9169N0990
992A2245L363l7410M1336J2807n4988K599J9486o438M1878J064q5247o22P2653
1005B2726R885r042k3611o5086L1701R8992k4191p0440L457L056K0095N4808l5566
1018A6784o4726L4967K6302j9730K2557k266m1342K3742J3785l2231L6052K9215
1030D3109o5517j5704M8336K601R442O273o7537r507Q4602J0450m6016j5711k5161
1043d0340K1046P9110k5154q2870J9579L4846n022K5418j2938n6171K9079L9682
1055B6265l3387O802K5772l7487m565K7112j8949J8876L6596o1126l8698O1407
1067H618K2435j4360M30n0318k0134Q4341K3914o5781j5001N205L706N3150k359
$$ plain form
1080 33846 -38144 -24969 18243 -6310 893 23786 -14726 -16283 16299 -13415 -11025 40221
1092 40221 9088 -36636 -10015 2647 14428 43981 -10306 -65155 1474 49849 15601 767
1104 767 -22679 -44528 23824 61060 -8374 -33242 -5433 -6684 17755 34135 -20543 -26758 16914
1117 16914 -6883 -15631 29524 7960 -28528 -5505 -10050 -9480 42055 17310 -52833 -26096 20082
1130 20082 20601 28520 -6978 -60668 -4161 57037 13209 -14913 -9444 -27105 8566 50310 -4949
1143 -4949 -35583 7225 3541 -6370 20369 -2715 -22610 12214 -2883 -24846 24176 22719 -30418
1156 -30418 -13955 5910 -5047 27955 21019 -47821 -27385 37132 23078 3007 -9341 -41571
1168 -41571 -1833 57522 9597 -35251 -7016 -4428 3675 37897 -2093 -41290 7325 18961
$$ packed form
1080C3846p1990J3175M3212k4553P203K2893l8512j557L2582k9714K390N1246
1092D0221l1133m5724K6621J2662J1781K9553n4287n4849O6629M8375l4248j4834
1104G67k3446k1849O8352L7236o9434k4868K7809j251K4439J6380n4678o215M3672
1117A6914k3797q748M5155k1564l6488K3023m545N70N1535k4745p0143K6737M6178
1130B0082N19P919l5498n3690N6507O1198m3828k8122N469j7661L5671M1744n5259
1143d949l0634M2808l684r911K6739k3084j9895L4824j5097k1963M9022j457n3137
1156c0418J6463J9865j0957L3002o936o8840K0436O4517j4054k0071j2348l2230
1168d1571L9738N9355m7925m4848K8235K588Q103L4222l9990l9197M8615J1636
$$ plain form
1180 18961 -12926 10060 12089 -21867 -888 8101 -16206 15407 25882 -31257 -24538 18880
1192 18880 5002 8119 12836 -39626 -29032 42198 24366 -22169 -13193 -15741 -981 43697 8558
1205 8558 -40977 -2632 17990 -121 19904 6330 -32716 5606 29364 -13033 -2532 21526
1217 21526 -15581 -12983 16293 -5191 324 21423 -21870 -28846 21892 13052 -7348 7255 -21523
1230 -21523 -27799 35503 27155 -30114 -12312 5564 -6040 21614 14588 -30992 -4636 23242
1242 23242 -9207 263 18028 -16455 -6095 21124 -13220 -9777 29999 -4159 -27097 11874
1254 11874 6653 -7136 18156 -5713 -30229 15100 20038 -14047 1688 -1146 -23196 16952
1266 16952 25276 -27108 -13165 18981 -7719 -1526 17216 -16738 -10717 23498 -6313 -13917 20876
$$ packed form
1180A8961l1887K2986K029l3956K0979Q989k4307L1613J0475n7139O719M3418
1192A8880j3878L117M717n2462J0594P1230j7832m6535Q976k548J4760M4678l5139
1205H558m9535L8345K0622j8111K0025j3574l9046L8322K3758m2397J0501K4058
1217B1526l7107K598K9276k1484N515K1099m3293o976N0738q840k0400J4603k8778
1230b1523o276O3302q348n7269J7802J7876j1604K7654p026m5580K6356K7878
1242B3242l2449R470J7765l4483J0360K7219l4344L443L9776l4158k2938L8971
1254A1874n221j3789K5292k3869k4516M5329M938l4085J5735k834k2050M0148
1266A6952Q324n2384J3943L2146k6700O193J8742l3954O021L4215k9811p604L4793
$$ plain form
1279 20876 -416 -15513 15018 -927 -13169 25000 6133 -30143 7462 18561 -11825 6610
1291 6610 6816 -26473 2714 23926 -13429 -8590 8490 -17825 -927 23785 -16947 -17708 21240
1304 21240 -5091 -17705 18141 1528 -15901 14326 -965 -18480 20665 13168 -22741 3712
1316 3712 11180 -12067 14562 14037 -28069 -1650 25922 -9060 -4012 14171 -18990 -7814 27588
1329 27588 -4520 -17511 11084 -6531 -9684 22637 -4646 -24166 15221 5672 -20316 13407
1341 13407 10359 -23353 4565 13186 -16572 5764 16027 -20464 -3151 20076 -9895 -1759
1353 -1759 17262 -16375 -8537 27100 -3827 -15395 16948 -3486 -15797 21392 5207 -22763
1365 -22763 7943 6693 -14181 11680 4577 -24781 7396 16736 -19826 -189 15096 -19178
$$ packed form
1279B0876k1292j5097L0531j5945j2242L8169j8867l6276L7605J1099l0386J8435
1291F610K06l3289K9187K1212l7355M839J7080k6315J6898K4712m0732p61L8948
1304B1240k6331j2614L5846j6613j7429L0227j5291j7515L9145p497l5909K6453
1316C712P468k3247K6629n25m2106K6419K7572l4982N048J8183l3161J1176L5402
1329B7588l2108j2991K8595j7615l153L2321k7283j9520L9387r549k5988L3723
1341A3407l048l3712K7918Q621k9758K2336J0263l6491J7313K3227k9971Q136
1353a759J9021l3637P838L5637l0927j1568L2343k0434j2311L7189j6185k7970
1365b2763L0706j250k0874K5861p103k9358L2177R340l6562J9637J5285l4274
$$ plain form
1377 -19178 -2687 22771 -12759 -10930 17909 -6490 -7614 20345 -6495 -14806 20608 2088
1389 2088 -14901 16335 3060 -17901 16128 8002 -21552 11088 14783 -22582 480 18084
1401 18084 -13960 -2942 11811 -16236 -1481 19491 -15548 -10969 17911 -9936 -10323 22476
1413 22476 -7681 -23669 18185 8941 -14948 9403 -358 -17459 18409 13990 -21536 2562
1425 2562 12485 -12881 9903 15659 -22056 -2181 22382 -11963 -5916 20893 -11243 -14335 17436
1438 17436 -2508 -10769 16112 -6845 -20037 15565 5014 -13917 11783 -3254 -26137 16337
1450 16337 21514 -19837 -5338 7668 -13603 10717 22134 -20541 -12512 16951 -3180 1281
1462 1281 17703 -15962 -13687 22148 -869 -11029 18991 -5365 -24589 15852 12042 -15535
$$ packed form
1377a9178J6491K5458l5530J829K8839k4399j124K7959k6840q311L5414j8520
1389B088j6989L1236j3275k0961L4029q126k9554L2640L695l7365K3062J7604
1401A8084l2044J1018J4753k8047J4755K0972l5039M579K8880k7847l87L2799
1413B2476l0157j5988M1854r244k3889K4351r761j7101L5868m419l5526K4098
1425B562R923k5366K2784N756l7715J9875K4563l4345O047K6809l2136l092L1771
1438A7436j9944q261K6881k2957j3192L5602j0551j8931K5700j5037k2883M2474
1450A6337N177m1351J4499J3006k1271K4320J1417m2675Q029K9463k0131M461
1462A281J6422l3665K275L5835k3017j0160L0020k4356j9224M0441l810k7577
$$ plain form
1474 -15535 6241 685 -22079 10229 16851 -16037 -1544 4594 -19989 8657 25968 -19720
1486 -19720 -16435 15442 -3626 -742 19921 -14387 -18361 22232 5870 -12411 12810 -2077
1498 -2077 -15766 17407 6959 -16994 12220 7631 -22450 7831 17627 -16666 -208 13065
1510 13065 -18425 -2877 20694 -10319 -10739 11213 -10969 -5106 21107 -10686 -19363 17335 1420
1523 1420 -14958 14632 1319 -19013 13328 9685 -17548 7875 12015 -15780 4967 13372 -14677
1536 -14677 4815 17158 -17867 -4175 21269 -8126 -8350 15414 -10421 -11037 21362 -2315 -18942
1549 -18942 10886 861 -12299 14460 -637 -21717 11642 10105 -18443 5937 10527 -18510
1561 -18510 4591 16249 -16972 -964 19221 -11674 -6666 16176 -6940 -3777 18479 -10852
$$ packed form
1474a5535K1776n556k2764L2308O622l2888J4493O138k4583K8646J7311m5688
1486a9720L285L1877j9068K884K0663l4308l974M0593j6362j8281K5221j4887
1498b077j3689L3173j0448k3953K9214m589l0081L0281R796l4293J6458J3273
1510A3065l1490J5548K3571l1013m20K1952k2182N863K6213l1793q677L6698j5915
1523A420j6378K9590j3313k0332L2341l643k7233K5423M140k7795K0747Q405k8049
1536a4677J9492J2343l5025J3692K5444k9395k24K3764k5835o16L2399k3677j6627
1549a8942K9828j0025j3160K6759j5097k1080L3359j537k8548K4380M590k9037
1561a8510K3101J1658l3221J6008K0185l0895N008K2842k3116L163K2256k9331
$$ plain form
1573 -10852 -13359 21364 849 -14893 13624 -1031 -17828 15535 8538 -20222 4496 7522
1585 7522 -15503 7134 10628 -19249 394 13922 -15782 -1006 18043 -14551 -8743 19022
1597 19022 -7105 -9430 18573 -5213 -15331 16481 3903 -11064 12565 -855 -16486 17000
1609 17000 11071 -18629 4395 8915 -15062 8695 14904 -20853 -4649 17381 -9764 -4407 13878
1622 13878 -13332 -9782 16422 -5638 -9822 14099 -9127 -14752 19395 2097 -18344 11436
1634 11436 5029 -17414 11169 12469 -15933 3404 9876 -12297 7675 14618 -16924 -2159 16914
1647 16914 -10525 -2791 17722 -13160 -11868 20078 -2071 -13861 11762 -4567 -14328 16382
1659 16382 3052 -18811 6850 3979 -13193 12256 6401 -22323 5036 16331 -13976 945
$$ packed form
1573a0852k507L4723k0515j5742K8517j4655j6797L3363o997k8760K4718L026
1585G522k3025K2637L494k9877J9643J3528k9704J4776J9049l2594N808K7765
1597A9022k6127k325K8003k3786j0118L1812j2578j4967K3629j3420j5631L3486
1609A7000n929k9700K3024M520k3977K3757O209l5757J6204K2030k7145N357J8285
1622A3878k7210L550K6204k2060m184K3921k3226n625L4147j7298k0441K9780
1634A1436o407k2443K8583J300k8402J9337O472k2173J9972O943l1542J4765J9073
1647A6914k7439P734K0513l0882J292L1946k2149j1790K5623j6329r761L0710
1659A6382j3330k1863K5661k871j7172K5449n855k8724K7359J1295l0307J4921
$$ plain form
1671 945 14000 -15528 -2970 20345 -7775 -7647 14164 -6883 -6475 18123 -4277 -12366 14604
1684 14604 -2626 -14037 17832 4219 -21437 7002 9330 -13722 7686 8101 -20738 -25
1696 -25 15090 -9351 -618 6737 -18727 -191 23739 -9449 -13532 12416 -4837 -5952 20403
1709 20403 -3670 -18142 13473 5671 -10737 12981 4745 -16260 7825 8554 -12100 10888 10271
1722 10271 -22309 -1382 17848 -7830 -615 9487 -20378 -7536 24316 -1315 -14249 3361
1734 3361 -9504 -3263 23644 -3588 -22928 8375 5683 -7978 15332 2340 -23020 8095
1746 8095 16337 -11453 3146 10488 -14688 747 15076 -8637 1616 13824 -17709 -8936 22754
1759 22754 389 -11414 6796 -10612 -9364 24879 3972 -24680 107 5090 -4218 15106
$$ packed form
1671I45J3055k9528J2558K3315k8120J28K1811k1047M08K4598k2400q089K6970
1684A4604j7230j1411L1869j3613k5656K8439K328k3052K1408M15k8839K0713
1696b5J5115k4441Q733P355k5464J8536K3930l3188m083K5948j7253j115K6355
1709B0403k4073j4472L1615p802j6408K3718q236k1005K4085P29k0654K2988o17
1722A0271l2580K0927J9230k5678P215J0102k9865J2842L1852k5631j2934J7610
1734C361j2865O241K6907k7232j9340L1303k692j3661K3310j2992k5360L1115
1746H095Q242k7790J4599P342k5176J5435J4329k3713J0253J2208l1533Q773L1690
1759B2754k2365j1803J8210j7408J248L4243k0907k8652K4787M983r308J9324
$$ plain form
1771 15106 -386 -26596 5007 17809 -9491 1165 6347 -16641 2829 19322 -11425 -5970
1783 -5970 17242 -7630 -10964 14744 876 -3830 11977 -10862 -15184 22009 10818 -16219 645
1796 645 -2432 -10594 20306 11547 -27253 -7438 14260 -2713 4199 4251 -21874 -1989 20101 -7801
1810 -7801 -7362 12380 -9526 -8149 16366 -2952 -8549 17213 -2716 -20365 12562 14658 -5288
1823 -5288 3770 -7321 -17349 20942 21930 -19178 -11892 4275 -3729 15369 14501 -27350 -14629
1836 -14629 21013 2576 -5506 7019 -12715 -9918 16481 -1108 -10766 13458 -2653 -18386
1848 -18386 9544 8360 -6185 12508 -1652 -26967 9153 28235 -4391 -9390 -4382 -12138 16792
1861 16792 26946 -16918 -21385 8314 4022 7596 14187 -19942 -19798 20597 8322 -12762 5977
$$ packed form
1771A5106j5492k6210L1603J2802k7300J0656N182k2988J9470J6493l0747N455
1783e970K3212k4872l334K5708j3868m706J5807k2839m322L7193j1191k7037J6864
1796F45l077q162L0900q759l8800J9815K1698j6973O912N2k6125J9885K2090k7902
1810g801M39J9742k1906J377K4515j9318n597K5762j9929j7649L2927K096j9946
1823e288R058j1091j0028L8291R88m1108P286J6167q004J9098q68m1851J2721
1836a4629L5642j8437q082J2525j9734K797K6399j7589r658K4224j6111j5733
1848a8386K7930j184j4545J8693j4160k5315L6120J9082l2626m999N008p756K8930
1861A6792J0154m3864m467K9699m292L574O591l4129J44M0395j2275k1084J8739
$$ plain form
1874 5977 -1587 -15624 8212 6827 -9593 9547 2170 -23998 1826 20217 -1266 -324 -3773
1887 -3773 -24445 8746 37572 -3990 -25283 -3303 669 14339 25956 -15013 -30852 9987
1899 9987 16413 3139 7812 -12638 -21626 15972 15042 -13463 3025 5352 -20190 -985 16503
1912 16503 -3103 1253 1926 -23765 -3767 29288 4793 -13738 -7315 -14407 7699 36803 -3463
1925 -3463 -34742 -1293 13454 8788 16049 -9786 -29284 9921 23821 -3725 -1891 -1684 -14854
1938 -14854 7814 15885 -11899 -1171 12532 -17096 -11449 19012 4675 -5589 620 -18627
1950 -18627 -9322 29900 10965 -23183 -10379 -2739 5520 27323 -631 -34214 -1162 21604
1962 21604 2708 4817 -948 -21069 4503 23659 -5991 -7803 8662 -7237 -4033 12861 -4904
$$ packed form
1874E977p564j4037K3836j385j6420J9140p377k6168K5824J8391k1483R42l449
1887c773k0672L3191K8826m1562k1293K1980L972J3670J1617m0969j5839M0839
1899I987O426j3274M673k0450q988L7598r30k8505J6488K327k5542J9205J7488
1912A6503j9606M356O73k5691J9998L3055k4495j8531O423p092K2106K9104m0266
1925c463l1279L3449J4747m666P261k5835j9498L9205J3900k7546J834K07j3170
1938a4854K2668Q071k7784J0728J3703k9628N647L0461j4337j0264O209j9247
1950a8627R305L9222j8935l4148J2804P640Q259K1803k7954l3583L3052K2766
1962B1604j8896K109n765k0121K5572J9156k9650j812J6465j5899L204J6894j7765
$$ plain form
1975 -4904 -3256 13857 -12032 -18827 17787 12823 -11239 -3526 -9552 -9621 24382 13643 -26660 -12578
1989 -12578 9958 5504 13066 284 -28614 -1433 26741 -440 -8263 3470 -10522 -1137 21040
2002 21040 -3292 -12538 11782 -200 -12014 9901 6040 -5256 7600 -7719 -19400 17309
2014 17309 21078 -15568 -12305 -1111 -4546 16889 14546 -26304 -17444 16054 7473 1613 2429 -18317
2028 -18317 -6828 22656 2216 -12271 7279 -2130 -9540 13561 5828 -10577 8985 3031 -18025
2041 -18025 6460 18329 -4122 -4063 -5155 -14206 15298 25140 -16734 -22003 5082 3805 10002 12764
2055 12764 -21894 -22170 17781 13385 -5752 564 -9909 -11701 16404 8116 -12376 5398 2452
2068 2452 -15870 6979 15913 -6073 336 2270 -17404 4488 27121 -2758 -16424 -2533 -3835
$$ packed form
1975d904J648J7113k5889o795L6614m964k4062P713o026o9L4003j0739m0303J4082
1989a2578K2536m454P562j2782k8898K7181K8174k7181p823J1733j3992R385K2177
2002B1040k4332r246K4320j1982j1814K1915l861j1296J2856j5319j1681L6709
2014A7309L769l6646L263J1194l435K1435k343m0850Q860L3498q581n860Q16k0746
2028a8317J1489K9484k0440j4487J9550r409p410K3101p733j6405J9562n954k1056
2041a8025K4485J1869k2451N9j092r051K9504R842m1874n269K7085j277O197K762
2055A2764l4658k76L9951m396j9137O316j0473j792K8105q288k0492J7774k946
2068B452j8322K2849Q934k1986O409J934j9674K1892K2633k9879j3666J3891j302
$$ plain form
2081 -3835 11392 22297 -14376 -25130 9163 10576 1034 7799 -12328 -21090 14726 15510 -11478
2094 -11478 -2495 1184 -11311 6282 11552 -10133 -305 6807 -13938 302 19367 -3109 -8162
2107 -8162 3997 -9590 971 25740 -1056 -23413 749 8619 5356 12740 -8555 -23654 9111
2120 9111 16407 -5073 341 -3336 -16629 8154 17043 -12170 -6749 7780 -9676 -3492 14048
2133 14048 -3145 -6418 6089 -9197 -5737 19281 2514 -14203 2248 -1065 -2571 19485 2660
2146 2660 -23248 1422 15306 -1988 3689 582 -16046 4016 16614 -7018 -4853 5269 -10089
2159 -10089 -994 14635 -7800 -8834 11017 -5021 -10953 12638 3077 -11004 4207 -1855 -9346
2172 -9346 13373 6843 -15542 -177 6333 -5124 9323 6975 -17577 -605 17166 -4788 -4223
$$ packed form
2081c835J5227J0905l6673j0754L4293J413r542O765k0127q762L5816P84k6988
2094a1478Q983L679j2495J7593N270k1685R828P112k0745J4240J9065k2476n053
2107h162J2159j3587J0561K4769k6796k2357K4162P870l263P384k1295j5099L2765
2120I111P296k1480N414l677j3293K4783Q889k9213N421J4529j7456O184J7540
2133A4048j7193l273J2507j5286L460K5018j6767j6717J6451l313j506K2056j6825
2146B660k5908K4670J3884j7294N677l107j6628K0062J2598k3632K165J0122j5358
2159a0089R095J5629k2435j034J9851j6038n932K3591r561j4081J5211o062p491
2172i346K2719o530k2385J5365O510j1457J4447k348k4552J6972J7771k1954N65
$$ plain form
2185 -4223 8582 -6941 -3153 13136 -4557 -7709 10834 -2556 -9770 9184 -67 -9222 9425
2198 9425 -86 -15597 7375 9079 -11609 164 4719 -10612 4346 11287 -10936 -4028 9348
2211 9348 -5153 215 11086 -9161 -5946 15007 -2008 -8479 11179 -349 -9887 9521 2914
2224 2914 -9345 7665 2413 -12391 5996 7359 -10286 2260 4683 -12099 3141 12589 -11542
2237 -11542 -6489 9687 -5744 -2852 11021 -7084 -8721 10598 -529 -6451 9308 -2249 -9474
2250 -9474 11034 3378 -10829 8243 5392 -12125 5124 9583 -9161 1819 7501 -9970 729
2263 729 10963 -8521 -3890 9053 -7265 -3813 11892 -6308 -9867 10096 -1610 -9532 9885
2276 9885 569 -12180 6308 4941 -8509 6098 3969 -11685 4747 8960 -8775 2644 8941
$$ packed form
2185d223J2805j5523L788J6289j7693l152J8543j3390p214J8954r251r155J8647
2198I425r511j5511K2972J704k0688J1773M555j5331J4958O941k2223O908J3376
2211I348j4501N368J0871k0247L215K0953j7015o471J9658j1528r538J9408o607
2224B914j2259J7010n252j4804J8387J363j7645J2546K423j6782J5240R448k4131
2237a1542N053J6176j5431K892J3873j8105j637J9319j1127n922J5759j1557p225
2250i474K0508p656j4207J9072k851j7517J7249M459j8744J0980N682j7471J0699
2263G29J0234j9484M631J2943j6318L452J5705j8200l559J9963j1706p922J9417
2276I885r316j2749J8488j367j3450J4607k129j5654J6432M213j7735J1419O297
$$ plain form
2289 8941 -10719 -39 13524 -7046 -5438 10312 -3670 -5327 10149 -3659 -7962 10048 -1196
2302 -1196 -9399 8127 504 -10114 8182 2489 -13884 4893 8459 -10955 346 7107 -9422
2315 -9422 359 9855 -7775 -1893 9742 -6826 -3328 11959 -3867 -5684 10441 -3636 -8187
2328 -8187 13670 2886 -12559 4823 3898 -5923 8272 2402 -14572 2547 9104 -6745 1876
2341 1876 3751 -13682 1050 14211 -7855 -6750 7852 -6616 -4879 12281 -2768 -8545 7476
2354 7476 -2134 -7039 11908 2999 -10105 4693 1509 -7255 12493 7337 -16542 -1196 11395
2367 11395 -2823 2624 4853 -13698 -2686 14781 -2289 -5743 3429 -8600 -3063 14118 -3650
2380 -3650 -12272 7452 -578 -8991 9331 3079 -11492 3506 3186 -8680 7972 8509 -11918 -1966
$$ packed form
2289H941j9660J0680J3563k0570J608J5750j3982j657J5476j3808m303J8010j1244
2302a196q203J7526p623j0618J8296n693j6373J8777L566j9414J1301O761j6529
2315i422R781R496j7630N882J1635j6568L498J5287j5826j817J6125j4077m551
2328h187K1857j0784j5445J7382r25r821J4195n870j6974J7119O557j5849Q621
2341A876J875j7433J4732J3161k2066J105J4602j4468J737J7160j5049n777J6021
2354G476r610m905J8947q909j3104J4798l184q764J9748n156k3879J5346J2591
2367A1395j4218N447K229j8551J1012J7467j7070l454R172j2029N537J7181j7768
2380c650q622J9724q030q413J8322o252j4571J4998l20j1866J6652N37k0427R952
$$ plain form
2394 -1966 6971 -3247 6757 7981 -15622 -4945 16808 403 -5265 5255 -7706 -4960 15298
2407 15298 898 -11625 3867 -288 -5632 10010 371 -13350 5592 4893 -11478 4048 8130
2420 8130 -10731 -1962 6663 -7758 2541 11964 -9788 -8295 9721 1435 178 7282 -10414
2433 -10414 -7203 17315 4499 -11441 2989 225 -5649 11957 4019 -15271 1182 7879 -5843
2446 -5843 2849 4159 -11449 1006 8117 -9126 -959 11433 -8356 -8531 8711 -1388 -2151 9652
2460 9652 -6982 -12644 11066 7624 -5534 2600 -3820 -8113 13820 8996 -13058 -841 6484
2473 6484 -5683 5700 7993 -11777 -1819 10699 -5904 -3797 9207 -4512 -5402 5749 -5917
2486 -5917 -3009 13613 -4359 -15168 5492 4302 -3508 7583 -3214 -16441 7501 13752 -6061
$$ packed form
2394a966Q937j0218J0004J224k3603J0677K1753j6405n668J0520j2961K746K0258
2407A5298j4400j2523J5492m155n344J5642r639j3721J8942o99j6371J5526M082
2420H130j8861Q769Q625j4421J0299R423k1752J493J8016q286j257P104j7696
2433a0414L211K4518j2816j5940J4430k764n874J7606p938j9290J6453O697j3722
2446e843Q692J310j5608J2455P111j7243Q167J2392j9789j75J7242j0099p63J1803
2460I652j6634n662K3710l442j3158Q134o420m293K1933m824k2054J2217P325
2473F484j2167J1383K293j9770R958J2518j6603K107J3004j3719q90J1151j1666
2486e917K908J6622j7972j0809K0660j190p810J1091j0797j3227K3942O251j9813
$$ plain form
2499 -6061 -2214 -72 -7812 8434 12482 -10546 -4679 8709 -4889 -512 11791 -5690 -7113
2512 -7113 8977 -3247 -6529 12378 1285 -12421 1619 1116 -2883 11048 -507 -18378 2113
2525 2113 11278 -4033 1369 837 -14199 2708 16298 -5595 -7811 4665 -3930 874 11811
2538 11811 -5292 -7936 9456 -928 -5645 10274 890 -9075 6805 1791 -8940 9537 6918
2551 6918 -13689 -1955 7466 -2799 3746 2234 -14936 -465 14166 -3743 -5798 3126 -8487
2564 -8487 -1147 15619 -4062 -13032 5930 2435 -4060 8357 -500 -9921 6507 4223 -7294
2577 -7294 7094 5212 -10544 2036 7405 -6497 4118 8472 -12560 -5416 12422 -712 -4099
2590 -4099 3727 -8540 -3677 14154 -1161 -11327 3467 -1467 -4050 11455 -1011 -15099 5458
$$ packed form
2499f061L847K142p740J6246M048k3028N867J3388j3598M377J2303j7481j423
2512g113J6090j2224l282J8907j1093j3706J4040n03l999J3931j1555j7871K0491
2525B113R165j5311N402n32j5036J6907J3590k1893k216J2476q595M804J0937
2538A1811j7103k644J7392j0384m717J5919r384r965J5880n014j0731J8477k619
2551F918k0607J1734R421j0265O545j512j7170J4471J4631j7909k055Q924j1613
2564h487P340J6766j9681q970J8962l495o495J2417q857r421J6428k284j1517
2577g294J4388j882j5756J2580N369j3902J0615M354k1032P144J7838j3134l387
2590d099P826j2267M863J7831j5315j0166J4794m934k583J5505j2466j4088K0557
$$ plain form
2603 5458 8170 -7227 2906 4241 -9875 2378 9023 -6505 204 7861 -7444 -1531 10405
2616 10405 -4147 -2646 9216 -6501 -7116 12888 1973 -9531 3525 -735 -5655 10107 1957
2629 1957 -13085 2064 5632 -6572 3736 2945 -12269 2015 10603 -8260 -2657 8135 -6213
2642 -6213 -2830 9920 -3830 -5160 9268 -1916 -5282 9245 -203 -6610 8576 347 -8883
2655 -8883 8338 5205 -11150 1962 5670 -7386 3408 5644 -11359 -1499 9386 -5562 -2311
2668 -2311 5486 -8309 -2162 11411 -4798 -7233 8591 -1916 -6913 9294 922 -8854 6251
2681 6251 2628 -7788 6236 4306 -8391 3780 5032 -8561 4482 9148 -9330 -1877 8916
2694 8916 -5389 -1377 9107 -7096 -6248 9659 -1491 -6252 6082 -2942 -7145 8840 179
$$ packed form
2603E458K712j5397J0133J335j4116J2253O645j5528O709P657j5305N913J1936
2616A0405j4552J501J1862j5717o15K0004j0915j1504J3056m260m920J5762q150
2629A957j5042J5149L568j2204J0308p91j5214J4284Q588j8863N603J0792j4348
2642f213L383J2750j3750j330J4428j1184l366J4527r448o407J5186q229r230
2655h883J7221l133j6355J3112L708j3056J0794K236j7003R860J0885j4948L251
2668b311P797j3795O147J3573j6209k435J5824j0507m997J6207q372r776J5105
2681F251l623j0416J4024j930j2697J2171J252j3593J3043M666j8478P453J0793
2694H916j4305M012J0484j6203Q48J5907j1150m761J2334r024m203J5985q661
$$ plain form
2707 179 -9901 5870 2660 -9338 4902 4866 -9934 2614 7911 -7724 286 8319 -5758 -414
2721 -414 7886 -6226 -1149 10854 -4903 -5875 9544 -1311 -5941 8313 -2188 -9808 8048
2734 8048 3713 -9371 2967 1673 -8164 5381 4240 -10385 1261 6690 -8078 775 7780
2747 7780 -8656 -2273 10182 -4889 -5095 9030 -2103 -5420 8107 -1183 -5225 8606 -478
2760 -478 -8616 8048 4291 -7999 4696 2513 -9610 5926 9203 -10365 -3274 6603 -4246
2773 -4246 1586 6440 -10415 -4642 10030 -2505 -4201 6326 -6362 -6636 11366 171 -9365
2786 -9365 6489 1395 -8637 6676 5490 -7141 3037 3017 -7874 5789 9435 -8083 -1841
2799 -1841 5650 -6099 2699 11326 -9719 -8828 9220 952 -3756 5345 -6616 -8237 10284 2682
$$ packed form
2707A79j0080J5771l210j1998J4240l6j4800J2548N297j5635Q010Q033j4077N344
2721d14Q300j4112N077J2003j5757r72J5419j0855m630J4254j0501p620J7856
2734H048m335j3084J2338j294r837J3545j141j4625J1646N429j4768Q853P005
2747G780j6436O383J2455j5071k06J4125j1133l317J3527r290m042J3831r084
2760d78q138J6664l757j2290J2695k183j2123J5536L277j9568P091R877j0849
2773d246N832M854j6855N773J4672j2535j696J0527j2688k74J8002j1195r536
2786i365J5854n094j0032J5313j186j2631J0178k0j0891J3663L646j7518O242
2799a841P491j1749Q798Q627k1045Q91J8048q268m708R101j1961j621J8521p602
$$ plain form
2813 2682 -8653 2749 -1032 -6895 8493 4116 -10873 2775 6068 -8799 2222 9315 -7178
2826 -7178 -2544 6121 -4890 1440 10721 -6334 -7699 7386 -493 -901 8606 -7156 -11576 11220
2840 11220 6475 -7584 1378 -1917 -8285 8698 7281 -11125 -1762 3852 -6054 3904 6565 -9922
2854 -9922 -2384 7782 -6452 -1462 11189 -4806 -8338 6459 -19 -1624 9800 -3219 -11266
2867 -11266 7234 6454 -3279 4623 -2899 -11171 9130 11245 -8881 -3432 3034 -6252 4274 9221
2881 9221 -9539 -6365 7082 -3044 -2232 7717 -5186 -6518 6638 -2486 -4205 11231 -597
2894 -597 -12571 4230 5976 -3038 6636 624 -12676 3904 11483 -3989 -1034 1176 -8820 4293
2908 4293 12096 -7561 -6621 6736 -3418 -2318 9509 -4068 -7803 7311 -776 -7034 7326
$$ packed form
2813B682j1335J1402l781n863J5388m377j4989J3648L293j4867J1021P093j6493
2826g178M634Q665j1011O330R281j7055j365J5085p879m08R507j5762m420K2796
2840A1220m745j4059Q962l295o368J6983j417j8406R363N614r906R958K661j6487
2854i922P538J0166j4234M990J2651j5995l532J4797o478j605J1424j3019q047
2867a1266J8500p80r733P902p522q272K0301K115k0126N449O466r286J0526M947
2881I221j8760L174J3447j0126Q12R949j2903j332J3156r124j719J5436j1828
2894e97j1974J6801J746r014R674o012j3300J6580P579j5472K955K210r996J3113
2908D293P803j9657R40J3357j0154J100J1827j3577l735J5114q087o258J4360
$$ plain form
2921 7326 2125 -8631 2942 690 -5852 8652 4160 -13622 -98 9112 -2635 1896 3687
2934 3687 -10960 -541 13897 -1778 -5472 3636 -4171 -86 11396 -3311 -8690 6627 398
2947 398 -6329 7931 1874 -9624 3172 2588 -7665 5483 6050 -11074 -3178 5313 -3343 4237
2961 4237 4899 -12901 -3799 12781 79 -4046 3643 -6339 -3287 13727 1381 -9508 3472
2974 3472 1383 -3656 7998 1215 -9082 4175 3650 -7827 4663 6852 -9318 -1659 6084 -5747
2988 -5747 1807 8782 -9249 -7764 7693 1061 -666 4168 -9292 -6508 12806 3421 -8543 1572
3002 1572 -1466 -5268 10590 4837 -11611 500 5586 -4781 4067 6501 -7363 -540 5344 -5480
3016 -5480 2259 9613 -7798 -6970 7622 -695 -1609 7429 -6506 -10335 8639 5438 -6212 1239
$$ packed form
2921G326n201j0756J1573k252o542J4504m492j7782J3524R210j1747M531J791
2934C687j4647J0419J4438j5675l694R108p807M085J1482j4707n379J5317o229
2947C98o727J4260o057j1498J2796n84j0253J3148N67j7124P896Q491q656P580
2961D237O62j7800R102J6580j2702m125P689r982L052J7014j2346j0889J2980
2974C472k089n039J1654o783j0297J3257n25j1477J2490K189j6170P659P743j1831
2988e747P554O975j8031J485J5457o632j727M834j3460K784J9314r385j1964J0115
3002A572l038l802J5858n753j6448J2111N086j0367Q848K434j3864O823N884j0824
3016e480P739P354j7411Q28J4592q317r14R038j3935l829J8974l201j1650P451
$$ plain form
3030 1239 -3168 -7141 9195 5672 -10291 -331 3909 -5325 4950 6617 -10200 -1737 9229 -3858
3044 -3858 -1645 8408 -4002 -4779 6778 -1703 -2526 8660 -3757 -9189 6996 3275 -4845 4722
3058 4722 -2040 -10475 6579 8440 -8588 -2385 2391 -5587 3802 6970 -8711 -3358 7007 -3586
3072 -3586 -762 7558 -5590 -5146 8665 -1691 -5403 8659 363 -8179 5124 2918 -4211 6058
3086 6058 1167 -9386 4429 7106 -5958 965 2920 -8367 2342 9111 -7210 -4721 6776
3099 6776 -3701 -2663 6585 -3816 -5781 6766 -1635 -5920 6930 -18 -6949 5837 1756 -6848
3113 -6848 6708 4739 -9143 1370 6729 -4176 2269 4765 -7804 -369 9134 -3828 -2426
3126 -2426 5304 -5292 -2801 8887 -3250 -6716 6918 -1047 -7479 6011 1653 -7160 3602
$$ packed form
3030A239m407l973J6336l523j5963R960M240r234J0275J667j6817Q463J0966j3087
3044c858K213J0053j2410p77J1557q481q23J1186j2417n432J6185l721q120R567
3058D722o762q435J7054J861j7028O203M776p978R389L168j5681N353J0365j0593
3072c586K824Q320j3148M44J3811j0356l712J4062q296q542J3303k206p129J0269
3086F058m891j0553J3815K677j3064O923J955j1287J0709O769j6321K489J1497
3099F776j0477J038R248j0401j965J2547q401m285J2850o948o931J2786m081q604
3113f848J3556j969j3882J0513N359j0905O445K496j2569P435R503j2962J402
3126b426P730j0596K491J1688j2137l466J3634p965o432J3490m358q813J0762
$$ plain form
3139 3602 1347 -7344 4891 4644 -7848 1613 4769 -6444 2393 7012 -7570 -2539 8697 -2989
3153 -2989 -2535 7257 -3809 -4435 7996 -818 -5192 6248 -595 -6480 6442 1567 -7275 4622
3167 4622 2415 -8908 3316 6016 -7280 -811 4258 -6267 657 6428 -6858 -3215 6892
3180 6892 -3474 -1999 7580 -4329 -5218 8705 216 -5723 6457 819 -6642 5816 3631 -6520
3194 -6520 3839 3023 -7098 3078 5637 -6610 548 4637 -7180 -160 8062 -6208 -4557 6904
3208 6904 -2701 -4381 6251 -2066 -5473 6205 -902 -5775 6079 903 -6551 5086 2116 -7135
3222 -7135 4512 5751 -7812 1110 6369 -5020 370 5783 -5876 -1331 7575 -3192 -2488 5769
3236 5769 -3877 -3723 7735 -2001 -6656 6185 -555 -7422 5042 2659 -7021 2640 1789 -7140 3467
$$ packed form
3139C602k255q691J2235k47j2492R461L156j1213Q837M619j4582N031J1236j1686
3153b989M54R792j1066o26J2431q814m374J1440o843n885J2922m875q842J1897
3167D622k207j1323J2224K700j3296O469N069j0525O924N771j3286L643J0107
3180F892j0366J475R579j1909q89J3923q489n939J2180n638p461J2458k185j0151
3194f520J0359q16j0121J0176K559j2247P158M089j1817P020Q222j4270J651J1461
3208F904r605j680J0632q317l407J1678p107m873J1854n176p454J1637k970r251
3222g135J1647J239j3563Q922N259j1389N390N413j1659M545Q906j0767P04Q257
3236E769r646J54J1458r736m655J2841o740o867J2464k383r680R661q51q929J0607
$$ plain form
3251 3467 5565 -6608 -78 4354 -4932 2634 7766 -7125 -3374 8471 -1376 -2911 5973 -3031
3265 -3031 -4839 7391 516 -5299 5045 -126 -6615 5211 2629 -6669 3358 2033 -9167 2644
3279 2644 7067 -6208 -2056 3554 -5427 1036 8269 -5631 -5481 5314 -1265 -499 6707 -5078
3293 -5078 -6965 7922 2735 -5227 4589 238 -6792 5371 4573 -5623 2371 3054 -6982 2058
3307 2058 6707 -4542 -737 3282 -6826 341 9526 -4786 -7026 4038 -1879 -1305 7683 -3440
3321 -3440 -9258 4941 3391 -3242 3678 -1597 -7561 6553 5718 -6603 1649 4088 -6435 1475
3335 1475 7356 -4392 -996 5136 -5496 -1530 8252 -2063 -4489 3214 -3336 -1886 8907 -2070
3349 -2070 -9833 3664 2870 -3612 4792 93 -9788 3335 6699 -4146 162 2126 -5817 2450
$$ packed form
3251C467K098j2173O530M432r286P566N132j4891L751J1845r847j535Q884r004
3265c031j808J2230o875n815J0344n171o489J1826k582r298J0027j325j1200J1811
3279B644M423j3275M152N610q981O463P233j3900J50J0795o579P66P206j1785
3293e078j887J4887n187p962R816m351p030J2163p98j0196P994O83j0036R040
3307B058M649j1249L805M019j0108P167R185j4312k240J1064n917N74Q988j1123
3321c440n818J4199j550o633O920n275n964J4114q35j2321Q252K439j0523P910
3335A475N881j1748L396O132j0632L966R782j0315k426P703o550J450J0793j0977
3349b070p763J3497p94o482Q404m699r881J3123L364j0845M308J964p943Q267
$$ plain form
3363 2450 7081 -5061 -1207 6097 -4391 -2290 7837 -1381 -3911 5056 -2748 -4313 8249 2082
3377 2082 -7023 1237 497 -2801 6598 1359 -10167 1357 6284 -4191 758 2355 -7939 58
3391 58 7891 -4395 -3457 4201 -3551 -2259 6343 -2405 -3523 5331 -2028 -5326 7417 3083 -5791
3406 -5791 2831 822 -4666 6594 5305 -8379 -1569 4675 -1960 2905 3036 -8663 -1717 7862
3420 7862 -2573 -2963 4032 -5149 -3562 7520 -1085 -5634 4690 -569 -5697 5020 2416 -4105
3434 -4105 3103 146 -6356 5395 6081 -6310 -1148 3233 -3954 3596 6757 -7546 -4621 6872
3448 6872 262 -913 3511 -5165 -3596 7695 282 -5083 4080 -1383 -5474 5456 2421 -6407
3462 -6407 2122 1841 -6814 2663 5968 -4954 -1359 1928 -4303 2998 7432 -5836 -4410 5479 -425
$$ packed form
3363B450M631j2142L854P304j0488K101J0127r218k530Q967p804j565J2562o167
3377B082r105Q260p40l298R399n239j1526J1524M927j0475M949J597j0294P997
3391E8P833j2286R38P658p752J292Q602q748j118Q854p359l298J2743m334q874
3406e791Q622k009n488J1260j289j3684O810O244o635M865J31j1699O946R579
3420G862j0435l90O995r181J587J1082q605m549J0324n259n128J0717k604o521
3434d105P208k957o502J1751O86j2391N162M381p187P550L161j4303K925J1493
3448F872o610j175M424q676J569J1291p413n365R163n463m091J0930l035q828
3462f407Q529k81q655R477L305j0922L595L287o231P301M434j3268J426R889n904
$$ plain form
3477 -425 880 6562 -5170 -6502 7792 3149 -4145 2625 -1359 -4915 5670 2917 -6256 1198
3491 1198 1503 -6117 2767 4725 -5874 -976 3315 -5838 88 7812 -3989 -5384 3453 -820 447
3506 447 6561 -4251 -6850 5549 2823 -2425 4022 -2195 -6925 6351 5422 -5628 258 2397
3520 2397 -4777 2629 5664 -4892 -1070 3779 -4121 53 6445 -3622 -3756 3979 -2635 -2186 7372
3535 7372 -1546 -7779 2979 2235 -2625 4076 -872 -7481 3650 4875 -3749 1386 1887 -5682 3119
3550 3119 6784 -5052 -1774 5303 -3136 -914 5938 -2707 -3484 4499 -1886 -3586 5352 -747 -5546
3565 -5546 2796 -218 -4426 4804 914 -8388 1520 4936 -3590 1159 2397 -5662 1207 6217 -3248
3580 -3248 -1806 4473 -2945 -702 6450 -2737 -3823 5710 -837 -4032 5343 257 -4994 3604 1433
$$ packed form
3477d25J305N682j1732j332J4294m643p294O770l984l556J0585k753r173P454
3491A198L05p620Q884J958j0599M898M291r153N926P724j1801j395Q837m273J267
3506D47O114j0812k599J2399k726n248O447o217m730J3276r29j1050N886K139
3520B397p174P406L035j0556L822M849p900M174O392j0067j34P735o614M49R558
3535G372q918o233J0758p44m860O701m948o609J1131J225q624N135N01p569Q801
3550C119L665j1836L278P077q439K222O852q645p77P983o385j700Q938o099m799
3565e546Q342l014m208R230l890r302R908L416q526M749J238q059O869N010r465
3580c248J442O279p418K243P152r187j086R533o547l195R375n086n251Q598k171
$$ plain form
3595 1433 -4998 2959 2636 -5342 1031 2870 -4004 2149 3617 -6635 -628 6096 -3593 -2242 4221
3610 4221 -3454 -2226 6242 -1841 -4621 4099 -535 -3170 4564 108 -4874 4411 2174 -4693 3668
3625 3668 3417 -5514 1352 4489 -4230 811 4627 -4515 -1699 4438 -2820 -1062 4116 -4174 -3406
3640 -3406 5673 -1042 -5065 3604 -1058 -4306 4793 1544 -5664 1959 2725 -3859 2832 2790 -5075 1397
3656 1397 4309 -4215 717 5071 -4335 -1369 5569 -2980 -2646 5038 -2357 -3639 4431 -370 -3995
3671 -3995 3430 -812 -4172 4927 964 -5926 2336 2496 -4626 2470 3191 -5954 -32 5440 -3047
3686 -3047 -1162 3558 -3672 -945 5452 -2234 -2556 4767 -1777 -2696 5768 -544 -4564 4864 1436
3701 1436 -4603 3530 2578 -4576 1637 2497 -4351 2185 3419 -5749 -655 4158 -3762 -895 3638
$$ packed form
3595A433o431P957l23p978O373J839o874O153J468j0252O007O724r689J351O463
3610D221p675J228Q468q083k780Q720m634k635P734m456m982R285k237o867Q361
3625C668k51q931O866L137q719N041L816r142K816O137p258J758N178q290P68
3640c406R079o715m023Q669m662l248R099l249p208P623P66o584O691m2p865O472
3656A397K912q524M932M354r406K966O938q549L34P684p395j282Q070m801l625
3671c995P425m242l360R099l963o890Q262J60p122P096P21r145N922N472q487
3686c047J885M720p230K727O397p686l22P323o544r19Q464o312m020R428l428
3701A436o039Q133r52p154O213Q60o848O536J234r168N094M813p920K867M533
$$ plain form
3716 3638 -5288 -2690 6436 -933 -4244 3139 -1257 -2417 5735 234 -4984 2975 1838 -2871 4216
3731 4216 1466 -5716 2171 4233 -4152 1087 3805 -5035 -1145 4554 -2408 -1311 3468 -4214 -2923
3746 -2923 5218 -975 -2939 2808 -2751 -3157 6495 1563 -6772 1543 2153 -2788 3390 1536 -6225
3761 -6225 659 4799 -2865 740 2723 -4644 213 5708 -2999 -1484 4628 -2746 -3347 5398 5
3776 5 -3134 3387 -1589 -3839 5097 1881 -5040 362 211 -3494 4413 2392 -7633 -886 4700 -2126
3792 -2126 567 2844 -5021 -1190 6183 -993 -1880 3901 -2229 -2039 5676 -113 -3031 4095 -489
3807 -489 -4913 4413 3235 -4545 1181 947 -4911 3290 4241 -5498 -2160 2087 -2125 1624 3368 -6077
3823 -6077 -2862 6130 -708 -2461 3215 -2892 -3098 5418 355 -3845 2938 1055 -4042 3197 2385
$$ packed form
3716C638q926K598R126p369l311P383m396j160Q152n501n218P959j137m709P087
3731D216k750p182P887K062q385N239K718q840L890N699o962J097M779p682J291
3746b923Q141o193j964N747n559m06R652m932q335Q315O10m941O178j854p761
3761f225O884M140p664L605J983p367M857N495q707J515O112p374o01Q745n393
3776El139O521m976k250Q936l216o921N402j51l705P907k021j0025O747N586o826
3792b126K693K277p865L831P373p176q87N781o130J90P715n789k918P126m584
3807d89m424R326j178p780N726k34n858Q201R51r739L338M247m212L749J744r445
3823f077L215Q992o838j753N676o107k06Q516n063m200O783j883n097P239q12
$$ plain form
3838 2385 -3180 2338 1223 -5405 2442 5826 -3825 -1427 2423 -3308 1027 5849 -4202 -4493 3578
3853 3578 -32 -790 3218 -3571 -4417 5230 870 -4367 2254 38 -4696 3252 2473 -4507 1157 2662
3869 2662 -4482 758 4411 -2358 -154 2673 -3959 738 7036 -2550 -4237 2999 -625 -909 5175
3884 5175 -2748 -6497 3376 2661 -2659 1326 -1244 -5081 3106 3256 -4755 502 2170 -4852 868
3899 868 4948 -3242 -986 3493 -3524 -1198 6363 -302 -3477 1772 -1511 -259 6841 -1057 -6732
3914 -6732 2394 2321 -1282 3720 -227 -6744 2147 5236 -2644 -281 1122 -4442 786 4705 -3077
3929 -3077 -1386 2904 -3723 -1683 5637 -1356 -3407 2585 -2010 -2688 6036 1724 -5492 427 1377
3944 1377 -827 4583 959 -6740 938 4850 -1698 1173 1425 -5574 1 5553 -2070 -2324 2701
$$ packed form
3838B385n565N518j115o628P847L384r651K398L850n731M335M822j0051k91Q071
3853C578l610p58M008o789q46R647m360n237O621k216m734P948p79o980N664J505
3869B662p144N240L653o769K204K827o632M697O298r586j687P236l624k84O084
3884E175p923l749R873p15n320L985k570l837Q187J50q011N257J668p022N720
3899H68M080q190K256M479p017K326P561o665l175N249l283J252P100p898n675
3914f732R126p3l603N002l947o517Q891L089p880K363J403n564N228L919p782
3929c077J691M290o627K040P320o993k051N992m595o78Q724m312p216N919R50
3944A377k204N410l624p699P678L912o548K871K52o999N575N552p623k54N025
$$ plain form
3959 2701 -3053 -2532 4667 -926 -3358 2578 -2022 -3399 4960 1119 -4880 1425 478 -3201 4384
3974 4384 3411 -5894 -898 3841 -1185 1065 2387 -4625 -810 5488 -910 -1498 3012 -2572 -1628 5360
3990 5360 -957 -3709 3362 -66 -4075 3257 1670 -4128 1543 416 -4055 2840 3170 -4918 -485
4005 -485 2393 -2823 1517 3951 -4409 -1912 4968 -349 -1669 3145 -1818 -2590 4635 218 -3276
4020 -3276 2978 6 -3302 3809 1447 -3963 2376 1709 -4766 1585 3867 -3684 -895 2319 -2985
4035 -2985 319 3877 -3437 -2495 3404 -1290 -1340 3767 -2488 -3722 4394 737 -3671 2913 639 -3708
4051 -3708 2996 1905 -3527 1561 2337 -3618 1006 3273 -3120 357 3144 -4172 -306 4951 -2320
4066 -2320 -2851 2767 -1392 -1676 3743 -1737 -4035 3118 561 -3117 2699 -138 -4272 2510 2187 -3779
$$ packed form
3959B701n754N21P199n593k432N936m600j377Q359l841n999O305r47l679P585
3974D384r73r305M996M739n026K250J322p012L815O298o398n88M510n584R44O988
3990E360o317k752P071l428m009P332j587n798N671j127m471O895L30q088M433
4005d85K878n216M340K434q360K497O880n317j320M814m963p72P225m417l494
4020c276O254k972l308P111k362n410O339o67o475O351K282p551K789L214n304
4035b985L304L558p314R42N899m694n0N107o255j234Q116l657m408O584k274m347
4051c708O704j091n432N088P76n955M624K267o393L477K787p316L866N257p271
4066b320n31N618m159k84N419n480k298P153k557l678N816k837m134O782l23n966
$$ plain form
4082 -3779 1696 2578 -3921 674 4184 -2497 -265 3191 -2920 -1028 4479 -1775 -1783 3400 -1967 -2030
4098 -2030 4622 -678 -4102 2838 622 -3407 2494 587 -4359 1513 2264 -3667 510 1717 -3881
4113 -3881 487 3492 -2912 -384 3709 -2850 -1619 4636 -1342 -2189 3631 -896 -2528 3836 368
4128 368 -3670 2636 623 -2924 3147 1474 -4562 1965 2855 -3666 544 2817 -3761 -389 3665
4143 3665 -2707 -1094 3428 -2622 -2153 3420 -1465 -2313 3383 -1345 -3254 4060 952 -3873 2522
4158 2522 1429 -3668 2121 2154 -3300 1361 2634 -3152 896 3254 -3210 72 3366 -3023 -1175
4173 -1175 4413 -2268 -2603 3302 -1158 -2755 3396 -432 -3814 2227 486 -2945 2536 789 -3806
4188 -3806 2454 2307 -3827 1231 2878 -3813 77 3672 -2093 -382 3864 -2447 -1610 4039 -746
$$ packed form
4082c779N475Q82o499M595L510o681K232L456o111J892N507o254qN183n367o3
4098b030O652n300l424O940k216m029N901j907m946N872P51n931M177J207n598
4113c881M368L005o404K528M093o559J231O255n978q47N820m527j632O364l468
4128C68m038O306k013l547O071j673o036O527Q90o521M210K273o578L372M054
4143C665o372J613M522o050M69N573m885q48N696m728j909P314l108m825O395
4158B522j093n097N789L3n454M661J273n786M048K358o464L282L294o389J848
4173a175N588o681l35N905m460j597O151l828l382O041j741l431N481j747m595
4188c806O260j47o134N058J647o691L890L595n765J711M246o311Q37N649m785
$$ plain form
4203 -746 -2274 2648 -1529 -2184 4820 226 -4492 1839 911 -3365 2535 1501 -4413 450 2473 -3135
4219 -3135 502 2407 -3678 -326 3441 -2732 -437 3652 -2507 -2441 4436 24 -2077 3289 -1049
4234 -1049 -2835 4058 1570 -3596 1307 627 -2710 3344 2010 -4674 701 3044 -2979 535 2640
4249 2640 -3277 -1393 3411 -1973 -1326 3240 -1878 -2259 3470 23 -1912 3217 -1288 -3913 3665
4264 3665 1918 -3070 1375 657 -3186 2866 3522 -3919 -878 2369 -2167 1078 2783 -3693 -1043
4279 -1043 4001 -1425 -1452 3374 -2118 -2975 3427 126 -2654 2956 -579 -3919 1902 1704 -2687 1281
4295 1281 108 -4191 2100 3966 -3293 -711 2291 -2211 1059 4443 -3271 -2071 3559 -565 -791
4310 -791 3087 -1678 -2494 3765 -206 -2670 3062 208 -4067 1999 1316 -3028 1274 1124 -4692 386
$$ packed form
4203g46j528M922m177o55P004m594m718O331r28m276N900j034n914M863K023n608
4219c135L637J905o085L352L767o173K295M089o159O6O877m412k101N366m338
4234a049j786O893k488n166M903o80l337O054j334o684N375K343o023L514K105
4249B640n917J884M804n384O47M566n118l81N729l447j935N129m505k625P578
4264C665j747m988M445p18l843O052O56p441L041L247m536L245J705o476K650
4279a043N044n426k7M826n492q57O402l301k780N610l535l340N821j98m391L968
4295A281j173m299O291J866p259K582L002m502L270L384p714J200N630m124k26
4310g91L878m765q16O259l971k464N732k854m275O066o83m344M302j50n816N078
$$ plain form
4326 386 3538 -2304 -679 1401 -3368 724 4375 -2587 -2322 2880 -991 -976 3922 -1246 -3417 3298
4342 3298 1387 -2315 2161 611 -3296 1716 1453 -2589 2093 1882 -4468 160 3456 -1898 -46
4357 -46 2066 -3818 -1233 4912 -789 -2982 1304 -1362 -732 3845 -1041 -4110 2387 322 -1945 2824
4373 2824 350 -4182 1856 2948 -2742 1294 2594 -3345 -423 3242 -1504 323 2562 -3526 -1343
4388 -1343 4287 -249 -2007 1892 -2112 -2218 4670 122 -4932 781 847 -2151 2555 683 -4342 969
4404 969 2314 -2164 1010 2144 -3709 55 3588 -1891 -286 3199 -2285 -2211 3908 610 -1697 2254
4420 2254 -1793 -2888 3911 1278 -3484 486 -120 -2520 3334 1737 -4742 -341 2789 -1883 658
4435 658 2036 -3326 -798 3263 -1687 -666 2716 -2556 -2125 3323 -505 -1833 2993 -967 -3533
$$ packed form
4326C86L152n842J625K080m769M092L651o962K65N202l871J5M898n168k171O715
4342C298j911l702M476j550l907N012k63m042M682k11o350M628L296n354J852
4357d6K112n884K585O145n701k193M286k666O30M577m886l069O497k065k267M769
4373B824k474m532O038J092n690M036J300n939K922L665m746J827K239o088K183
4388a343N630m536j758L899m004j06O888m548n054N713O6k998M706j872n025N311
4404I69J345m478L174J134n853L764L533n479J605L485n484P4O119l298k307L951
4420B254m047j095O799k633m762L970o06k400N854j597o479M401L130m672K541
4435F58J378n362K528M061m950J021L382n272M31N448l828j328M826l960k566
$$ plain form
4450 -3533 3504 2251 -2486 1143 322 -2626 2921 2918 -3401 -88 1953 -1800 1464 2354 -4160 -1430
4466 -1430 3509 -1167 -1419 2480 -1894 -2212 3244 -382 -2325 2506 -462 -3041 2615 1350 -2412
4481 -2412 2213 816 -3548 2331 3574 -2691 -738 1943 -2292 1208 3613 -2726 -2000 2787 -1021
4496 -1021 -592 2557 -2217 -2579 3169 -100 -3075 2050 287 -3264 1711 1254 -2831 1656 1352 -3593
4512 -3593 1072 2687 -2387 66 1682 -2815 298 3700 -2492 -1984 2927 -414 -1056 3283 -945
4527 -945 -2744 2661 530 -2039 2198 0 -2874 2172 1401 -3064 1313 1586 -3392 130 2580 -2493
4543 -2493 -439 2281 -2648 -949 3341 -1463 -1726 1948 -1511 -1186 3789 -845 -2807 2361 844
4558 844 -1879 2415 820 -3131 1562 2130 -2496 648 1502 -2953 581 2669 -2297 -506 2107 -2460
$$ packed form
4450c533P037j253m737L629q21k948N547lo319L313K041l753L264Q90o514K730
4466a430M939m676k52L899m374l18N456l626j943M831k968k579N656j265l762
4481b412M625j397m364N879J243o265J953K681m235L500K405o339P26M787l808
4496a021M29L149m774l62N748l269k975N125j763l551M975m57m085M487l04m945
4512c593M665J615n074K453J616m497L113L402o192N08M911l341o42M339m228
4527i45j799N405k131k569M237k198k874N046p71m465M377K73m978L522K450n073
4543b493K054K720m929J699M290m804k63L674l459L25M975m634j962N168j517
4558H44k723M294j595l951M693N68m626L144Q54m455L534K088m966J791K613m567
$$ plain form
4574 -2460 -842 3158 -1709 -1767 2526 -1266 -1796 2749 -44 -2483 1541 105 -2134 2369 599 -3420
4590 -3420 1534 2303 -2421 902 2051 -2842 75 3032 -1882 -711 2546 -1747 -886 2550 -1111
4605 -1111 -1735 2327 -968 -2036 2457 -34 -2942 1810 186 -2916 2228 1217 -3238 445 1757
4620 1757 -2114 337 1646 -2789 343 3066 -1696 -811 2616 -1392 -742 3595 -996 -2284 2406
4635 2406 89 -1911 2347 207 -2650 1827 669 -2658 1330 1081 -3103 801 2147 -2644 -102
4650 -102 2263 -2410 -933 2947 -1489 -1541 2246 -1551 -1048 2898 -733 -2512 1959 221 -1910 2699
4666 2699 355 -3395 1758 1831 -2503 938 1521 -2747 611 2416 -2297 -242 1984 -2372 -176 2747
4682 2747 -1913 -1350 2365 -1348 -1884 3049 -288 -2789 1694 -13 -1923 2171 712 -2950 1053
$$ packed form
4574b460J618M000m867n8M293l792n30M545k793k439M024j436k239M503j770m019
4590c420M954P69m724L323J149m893K917K957m914J171L257m293Q61L436l661
4605a111o24M062l295j068M493k491k908M752j624l102N144j011m455L683J312
4620A757l871K451J309m435L132K723m762Q85L427m008O50M337m591j288M690
4635B406k317k000M258k140k857M477j158l327L988k49m184L904J346m791K542
4650a02K365m673J477L880m436n2L787l797N03L946l631j779M471j738k131M609
4666B699k344l750N153P3m334L441N83m268L358J805m713K055K226m356K196K923
4682B747m660N63L715l713n36M933l337k501M483j707j910M094j459l662M003
$$ plain form
4697 1053 1610 -1753 1406 1371 -3019 765 2769 -1526 -520 2456 -1543 -617 3130 -861 -1815 2224
4713 2224 -547 -1723 2447 -622 -2659 1783 259 -2925 1688 801 -3187 608 1615 -2102 725
4728 725 1906 -2629 111 2547 -1251 -401 1829 -1674 -411 3349 -882 -1882 2156 -469 -1879
4743 -1879 2663 40 -2647 1206 835 -1795 1680 907 -2563 581 1349 -2293 816 2325 -2767 -660
4759 -660 2526 -1378 -715 2130 -1997 -1541 2699 219 -1690 1732 -937 -1296 2608 263 -2459 1349
4775 1349 1129 -2186 1656 1966 -2422 523 1985 -1911 147 2160 -2140 -1050 1821 -1552 -376
4790 -376 2200 -2098 -2242 2207 -136 -1509 1675 -753 -2441 2248 1376 -2345 457 823 -1615 1970
4806 1970 1416 -2422 309 1979 -1711 435 2549 -1869 -916 2233 -1107 -761 2773 -1030 -2139 1686
$$ packed form
4697A053N57l363L159l5m390L784K004m295J006K976l999R26L747l991r54M039
4713B224k771j176M170l069k037M442j524l184M613q87l988L795J007l717K827
4728G25J181m535K740K436l798Q50K230l503J263L760m231j000M038k625j410
4743a879M542k623k687L853l71k630L475p73l470L144P68l642L109J509n092K107
4759f60L186l904O63K845m127M56M240k480j909L422k669l59L904k345k722L808
4775A349k20l315L842L10m388K945J462l896K058K013m300J090K871l373J176
4790c76K576m298j44M449k343j373L184k428j688M689q72l721K802L66k438L585
4806A970n54l838K731J670l690K146K114m418R53L149l340L46L534l803j109L825
$$ plain form
4822 1686 106 -1421 1525 -1133 -2885 1891 1569 -2061 604 343 -2637 1208 2227 -2613 -552
4837 -552 1728 -1288 188 1962 -1625 -1022 2344 -1233 -909 2402 -561 -1829 2068 574 -1206 2216
4853 2216 202 -2826 1116 1710 -1379 306 264 -2422 994 2267 -1785 -938 1158 -1865 340 2161
4869 2161 -2116 -1774 1850 -181 -709 2079 -729 -1691 1988 395 -1472 1991 342 -2258 1089 1401
4885 1401 -1824 1174 987 -2614 557 2850 -1476 -1013 1092 -1775 -291 2761 -1358 -1795 1506 -548
4901 -548 -1208 2423 -886 -2659 1734 832 -2021 1154 672 -2152 1009 1308 -1456 644 1263 -2223
4917 -2223 11 2174 -1127 -437 1402 -2003 -420 3294 -744 -1935 1291 -207 -882 2086 -223
4932 -223 -2531 1004 972 -1684 1042 130 -2609 580 1624 -1855 325 1389 -1862 -655 1979 -941
$$ packed form
4822A686j580j527K946k658j752M776l22l630K665k61k980L845J019m840K061
4837e52K280l016J476J774l587O03L366l577L24L311k963j268L897j494j780L422
4853B216k014l028L942N94l089J685m2k686L416J273m052Q47K096l023K205J821
4869B161m277L42L624k031n28K788k808r62L679j593j867L463j649k600L347L12
4885A401l225K998j87l601L171K293m326M63K105k867J484L052m119m37L301k054
4901e48o60L631l309j773M393r02k853L175m82k824L161K99k764K100O19l486
4917b223K234K163l301O90J839l405J583L714m038j191L226j498o75K968k309
4932b23k308L535l2k656K726r12k739L189J044l479K180J064l251J207K634k920
$$ plain form
4948 -941 -354 1750 -1545 -828 2377 -123 -1027 1345 -783 -1233 2580 299 -2362 970 1242 -1172
4964 -1172 1209 805 -2430 433 1574 -1532 -148 1300 -1593 -689 1858 -1254 -582 1855 -1382 -1501
4980 -1501 1867 77 -1343 1672 -238 -1936 1812 1360 -1786 526 396 -1316 1675 1607 -2255 -3
4996 -3 1813 -1105 63 1792 -1439 -543 2076 -1116 -982 1615 -883 -1390 1476 -298 -1454 2125
5012 2125 -355 -2226 1647 1235 -1923 463 615 -1776 1202 1660 -1701 -398 1505 -1277 292 1972
5028 1972 -1438 -603 2090 -928 -618 1970 -490 -1398 1645 -44 -1864 1191 -108 -2200 1197 545
5044 545 -1881 636 546 -2089 501 2075 -1740 -611 1584 -1226 -328 2300 -1054 -1062 1659 -242 -685
5061 -685 1878 -412 -1390 1665 382 -1362 1199 605 -1633 742 1508 -1767 622 1259 -1900 -40
$$ packed form
4948i41N87K104l295P17L205k500r04K372k128m50L813k281k661L332K72k414
4964a172K381m04l235K863J141l106J384J448k893R04K547l112O72K437l237j19
4980a501L368j790j420L015j910j698L748m52l146K312j30j712K991o8l862K252
4996cJ816k918J168J729l231Q96K619l192J34K597k498n07K866j774j156L579
5012B125k480j871L873m12l158K386J52k391K978M58l361J303J903k782J569J680
5028A972l410Q35K693l018L10K588k460r08L043j689j820L055j299k092L397o52
5044E45k426K517r0k635K590J574l815J129K195k810Q98K628l354qK721j901m43
5061f85K563k290r78L055j283j744K561n94k238K375P66l275K389O37l159J860
$$ plain form
5077 -40 1317 -1026 -379 1318 -1553 -454 2143 -1277 -1083 1735 -324 -1216 1771 63 -1652 1521
5093 1521 442 -1285 1055 900 -1465 1045 947 -1423 716 1249 -1446 169 1920 -1421 -321 1809
5109 1809 -1191 -990 1837 -395 -1118 1496 -493 -1132 1473 -121 -1749 1094 312 -1798 632 556
5125 556 -1748 505 1042 -1679 -57 1765 -1150 -263 1570 -981 61 1607 -490 -621 1781 -520
5141 -520 -1111 1585 -150 -1758 1264 393 -1611 1128 529 -1666 688 1048 -1311 361 1025 -1679
5157 -1679 -15 1486 -1314 -459 1320 -1128 -874 1877 -697 -1037 1532 -34 -954 1637 88 -1385
5173 -1385 1159 490 -1643 1058 687 -1953 500 1155 -1051 269 1121 -1344 -311 1431 -1004 -180
5189 -180 1030 -975 -994 1294 -573 -993 1236 -378 -1156 1377 342 -1677 993 745 -1332 891
$$ packed form
5077d0J357k343O47J697k871J099K597l420J94K818k059q92K987j708j715L173
5093A521j079j727K340j55k365K510r8k370K139N33k695J615J751l341J100K130
5109A809l000K01K827k232p23K614j989o39K605j594j628K843p82k110K430p6
5125E56k304K253N37k721J622J822k915Q87J833k551J042J546k097j31K402k301
5141e20n91K696j735j608L022q71k004K739n99k195K354L60k359J672O64k704
5157a679J664J501k800Q55J779k448K54K751k574l40K569j566r20K591j549j473
5173a385K544o69k133K701l71k640K453O55k206J320Q52k465J033J742k435Q24
5189a80J210k005j9K288j867m20K229j614p78K533j035k019K670k48k077K223
$$ plain form
5205 891 979 -1536 304 1193 -829 273 1661 -1588 -527 1599 -759 -536 1685 -1013 -948 1652 -67
5222 -67 -1230 1257 -158 -1555 1169 269 -1604 626 541 -1606 803 1067 -1588 377 1368 -1288 -28
5239 -28 1725 -1045 -488 1193 -251 -387 1666 -746 -903 1653 261 -950 1230 -130 -1417 1278
5255 1278 473 -1573 273 715 -1387 -6 960 -1437 -139 825 -1377 -241 1705 -1248 -702 1300
5271 1300 -817 -667 1757 -351 -1349 993 121 -915 940 -108 -1283 1099 905 -1352 715 820
5287 820 -1430 525 1745 -1274 -328 1287 -992 -518 1439 -768 -492 1172 -584 -723 1324 -330
5303 -330 -1567 1331 230 -953 1283 331 -1634 496 1195 -919 438 714 -1319 476 1410 -905
5319 -905 -262 1078 -1049 -463 1743 -554 -1163 1397 -588 -1095 1186 40 -1460 677 111 -1002
$$ packed form
5205H91Q8k515J840Q89k022J102J388l249J061K126k358K23K221k698O5K600j719
5222f7j163K487j415j397K724r00j873K230q5k147K409K64k655J965R91k656J260
5239b8J753k770N57J681j444j36K053k412j57K556j392j211K180j360j287K695
5255A278q05k046J846M42k102J381R66k397J298R64k202J136J946k953N46K002
5271A300k117J50K424k108r98K342q72j036J855j048j175K382j94k257K067J05
5287H20k250J955J220l019R46J615k279M74J957k207K76J664j756j39K047j654
5303c30j237K898j101j183K236r52j965K130O99k114J357K76k033J795R34k315
5319i05O43J340k127N86K206k297o09K560j985n07K281j146j500K137n66j113
$$ plain form
5335 -1002 1160 646 -1780 367 735 -1193 679 1110 -1754 59 1707 -717 -718 1010 -673 -719 1480
5352 1480 46 -726 1159 -9 -773 1549 110 -1550 1024 300 -1345 865 808 -1536 -18 670
5368 670 -1305 251 967 -1469 -631 1058 -353 -118 1042 -1207 -524 1531 -195 -1077 937 108 -916
5385 -916 1285 602 -1195 811 247 -961 931 795 -1451 264 1107 -1245 108 1280 -1481 -421
5401 -421 1346 -936 -497 1021 -1106 -1002 1100 128 -1017 664 -85 -840 1010 599 -1237 483 715
5418 715 -1540 693 1184 -941 83 1106 -715 255 1207 -995 -634 1337 -801 -415 1365 -558
5434 -558 -1172 1175 347 -931 911 132 -1419 705 589 -1303 287 482 -1071 624 915 -1125 68
5451 68 1148 -950 -218 1407 -596 -300 1505 -480 -351 1502 -262 -1036 1032 143 -951 1216 204
$$ packed form
5335a002K162n14k426K147L68j928J872M31k864J813J648k424jJ728j683m6K199
5352A480j434p72J885j168p64K322j439j660K574p24j645K210n7k344J518O88
5368F70j975J556P16k436Q38J689j411K35J160k249O83K055j726q82K014q29j024
5385i16K201o83j797K006n64j208J892j36k246J715Q43k352J353J172k761J060
5401d21J767k282M39J518k127J04K102r72j145J681p49p55J850m11j836J720K32
5418G15k255K233M91k125J024J023j821R70R52k202L61J971k138L86J780j923
5434e58o14K347q28j278J842p79j551K124j16j892J590J95j553J695K91k040J193
5451F8J080k098P32J625k003K96J805j985J29J853j764p74K068q89j094K167j012
$$ plain form
5468 204 -1416 979 807 -1061 318 954 -1386 99 1086 -1143 -179 872 -903 -124 1182 -902
5484 -902 -761 1254 -425 -648 1290 4 -1177 1251 457 -988 911 446 -924 781 671 -985
5500 -985 295 858 -1203 368 836 -1093 -330 854 -830 -624 980 -481 -916 861 -155 -837 1292
5517 1292 -93 -1280 820 -24 -1185 623 512 -1195 687 1125 -1013 304 819 -1028 59 1433
5533 1433 -807 -271 1162 -502 -228 1386 -370 -904 1231 17 -1021 960 120 -1269 538 470
5549 470 -1331 322 328 -1231 478 1015 -1099 120 731 -1282 2 1107 -720 -280 1429 -634 -699
5566 -699 1104 -237 -478 1224 151 -900 1105 524 -1173 471 307 -1159 529 366 -1288 421
5582 421 925 -787 -336 890 -1029 -420 929 -848 -834 1008 -313 -840 1090 -608 -861 1103 259
$$ packed form
5468B04j620K395j72j868J379O36k340J485R87k229R64J051j775P79J306k084
5484i02J41K015j679k23J938j286j181K428p94j445J899m65j370J705j10j656
5500i85J280N63k061J571M68j929P63J184j684K06J604j461m35J777j016o82K129
5517A292j385j187K100q44j161J808j11j707J882M38k138J317N15j847J087J374
5533A433k240N36J433j664K74J614j756n34K135j214j038J981q40j389J807o8
5549D70j801J653Oj559J709N37k114J219O11k013J284J105j827M40J709k063o5
5566f99J803j341k41J702j073j051K005n81j697J644j64j466J688j63j654J709
5582D21N04j712M51J226j919O09J349j777J4J842j321n27J930j698k53J964q44
$$ plain form
5599 259 -1073 836 -98 -1049 640 919 -745 434 756 -985 230 902 -696 -338 1199 -877 -375
5616 -375 1597 -458 -1048 1055 -220 -1031 865 -190 -1367 783 510 -951 627 282 -1131 643
5632 643 710 -1177 183 825 -898 93 1108 -805 -174 1168 -662 -413 1327 -300 -685 919 -244
5649 -244 -912 1261 -137 -1430 634 565 -688 286 189 -1366 397 1298 -864 -193 470 -797 158 1167
5667 1167 -1073 -415 1023 -645 -508 1681 -291 -909 999 69 -874 1112 617 -891 829 395 -770
5684 -770 515 413 -1495 285 1003 -801 -307 650 -1300 -427 1351 -576 -866 960 -350 -778 1085
5701 1085 -195 -892 1017 -41 -977 1216 515 -1058 515 517 -788 524 813 -1079 136 1001 -327
5718 -327 3 867 -1128 -397 1047 -273 -320 746 -426 -806 1132 53 -969 737 41 -824 954
$$ packed form
5599B59j332J909r34r51J689K79j664J179L22j741J215O72j598L58J537k076N02
5616c75J972k055n90K103j275q11J896j055j177K150k73j461J578l45j413J774
5632F43O7j887J360O42j723R91J015j913O31J342j830K49J740j627l85J604j163
5649b44o68K173j398j293K064o9j253R74r7j555J763R01k162O71O63j267R55J009
5667A167k240O58J438j668J37K189j972o18J908r30r43J986m95j508J720m34j165
5684g70J285j02j908J780P18j804M94R57j950Q73J778j927k90J826j310m28J863
5701A085j280o97J909j058r36K193p01j573J573Kj305J312K89j892J215Q65j328
5718c27L30Q64j995P31J444j320m7J066j172l80J938j079j022J706o96q65J778
$$ plain form
5735 954 453 -1025 269 322 -994 403 732 -1053 -300 1080 -204 253 1176 -848 -434 1116 83
5752 83 -496 691 -604 -772 1401 25 -917 720 -233 -878 863 767 -1213 396 581 -1325 265
5769 265 1070 -1028 -281 673 -715 -201 1066 -761 -868 764 -22 -390 909 -696 -1183 1101 846
5786 846 -1229 57 359 -897 796 1107 -656 -73 474 -654 65 1142 -922 -378 742 -893 -54
5803 -54 1166 -335 -951 702 9 -322 925 -455 -1030 752 460 -555 603 -27 -945 756 1143
5820 1143 -875 -27 869 -965 121 1212 -865 -465 977 -338 -325 1171 -621 -1035 470 -462 -700
5837 -700 1081 -101 -1483 309 596 -758 409 379 -1222 13 768 -342 -67 375 -878 199 1633
5854 1633 -581 -674 1027 -414 -419 1350 65 -741 1098 -6 -685 822 431 -1150 380 375 -849 733
$$ packed form
5735I54n01j478J294N3j316J397L29j785P53J380j284M57R23k024M14J550j033
5752H3n79J187j295j68K173j376r42J637r53o45J741r6j980J609J85j906J590
5769B65Q05k098P47R54j388N14J267j827j07J632p86l68J299j605m87K284k55
5786H46k075J286L02j256J693L11j763N83N47j128P19J077k064N44J120j635Q39
5803e4J220j501o16J653o93l31J247j380n75J782k92j015J158o30r18J701L87
5820A143k018Q48Q96j834J086J091k077M00J442j315J3J496j792m14J505r32k38
5837g00J781j182j382J792K87j354J167l0j601J235P55j110K75M42j253J077J434
5854A633k214r3J701j441nJ769j285q06J839j104o79J507l91j581J530nj224J582
$$ plain form
5872 733 393 -1530 228 1171 -588 -139 374 -1029 -206 1345 -353 -877 293 -440 -489 1178 -155
5889 -155 -1042 876 159 -789 1054 331 -914 226 735 -721 564 913 -820 -69 945 -567 143
5906 143 705 -895 -444 1159 -15 -748 737 -509 -986 1115 165 -933 351 215 -782 617 455
5923 455 -1072 528 518 -730 130 1087 -814 -305 1102 -717 -177 1378 -629 -582 1394 -133 -548
5940 -548 612 -552 -1153 968 65 -1258 486 361 -909 695 600 -1388 355 910 -896 104 1093
5957 1093 -718 -182 826 -663 -216 1115 -596 -858 935 150 -398 1069 34 -693 865 378 -986
5974 -986 136 76 -854 586 611 -1162 -120 934 -999 -64 910 -726 -626 993 -747 -646 885
5991 885 -458 -626 734 -157 -505 907 -59 -829 553 754 -846 330 568 -1087 346 1144 -552
$$ packed form
5872G33l40j923J758R43j759M49N13j403Q23J551j698n24J170p33m9J667j333
5889a55q87J918p17r48J843p23j245J140N09j456J285L49j733P51J014j512P10
5906A43N62j600M51J603j174p33J485j246m77K101r50j098J284j36r97J399j62
5923D55j527J600j0j248Q60R57j901N09J407j819N40J555k007M7J976j527m15
5940e48J160j164o01K121r03j323J744j25j270J604r5j988J743N55j806J000R89
5957A093j811N36J008j489M47J331j711k62J793p85n48J467j035p27J558m87j364
5974i86J122o0r30J440K5j773J042J054j933R35R74j636J00J619j740J01J531
5991H85j343j68J360q91l48J412r66p70J382K01j600J176K38j655J433P98j696
$$ plain form
6008 -552 -31 705 -319 134 983 -560 -194 972 -532 -579 855 -319 -817 905 69 -903 785 -17
6026 -17 -1124 589 377 -820 430 358 -856 203 1199 -524 108 1000 -987 -174 1149 -305 -555
6043 -555 964 -297 -610 1149 -424 -987 668 -393 -775 727 43 -974 108 402 -922 106
6059 106 869 -1093 20 1125 -579 53 762 -596 -100 1110 -611 -304 932 187 -479 858 7
6076 7 -717 593 252 -908 521 755 -1131 474 412 -779 175 344 -929 -12 695 -937 -98 985
6094 985 -532 -277 989 -271 -432 845 -307 -485 765 202 -921 636 388 -973 424 547 -979
6111 -979 394 959 -873 217 923 -1049 -393 634 -813 -741 776 -233 -578 855 30 -529 1067
6128 1067 -11 -1047 872 447 -832 465 587 -1074 173 703 -827 578 563 -1047 100 893
$$ packed form
6008e52N21P36j024M53Q49j543L66J166j504m7J434j174m98J722q36r72J688q02
6026a7j107J713k12j197J250p2j214J059R96j723O32Q92j987Q13J323j454k50
6043e55J519j261l13J759j573n63J655j061l82J502o84j017J082K94j324J028
6059A06P63j962J113J105j704O32P09j358M96J210j721L07J236p45o66J337q51
6076Gp24J310l41j160J429K34j886J605o2j191R54J69j273R17P07j632Q39J083
6094I85j517K55J266j260j61J277j152j78J250n63j123J557k48j361J397J23j526
6111i79J373N65j832J090P06j972O56J027j447P2J517j009l45J433q25n59J596
6128A067j078j036J919m25j279J297J22j661J247N30j530J405j5j610J147P93
$$ plain form
6144 893 -575 -116 1352 -170 -390 1024 -348 -741 911 -172 -562 372 41 -869 483 196 -886
6161 -886 523 257 -749 571 706 -810 41 491 -739 -241 919 -509 -56 814 -335 -279 508 -576
6179 -576 -435 950 -162 -714 794 584 -454 570 418 -942 414 781 -855 158 485 -840 -249
6196 -249 786 -438 -42 636 -622 -438 981 -381 -737 729 -232 -774 836 79 -843 326 354 -294
6214 -294 589 422 -717 334 779 -988 -60 910 -879 -333 856 -582 -254 864 -702 -268 846
6231 846 -301 -761 826 -149 -773 922 164 -879 103 485 -1051 187 926 -1024 -73 770 -569
6248 -569 58 602 -1081 -223 994 -264 -281 855 -351 -742 1148 -150 -592 444 13 -722 459
6265 459 184 -720 362 286 -748 268 271 -938 282 882 -907 55 1031 -289 -509 897 -210 -469
$$ packed form
6144H93j468M59J468j522k20J414j372l93J652j083l90R34l31r10J352k87j082
6161h86J409k66j006J320J35j516Q51M50j230M98J160j428M53Q70j149N6P87j084
6179e76J41J385j112n52J508k10j038J024j52j360J356L67j636J013L27j325N91
6196b49J035j224L96O78j258J84J419j362l56J466r61n42J610p57r22J169K8o48
6214b94Q83j67j139J051M45j767R28R70j789N46J189j438L28J118j566M34J114
6231H46j147m60J587r75o24J695p58j043R82L82j536J238P39j950R51Q43j339
6248e69O27N44j683Q58J217j258j7J136j206l91J890j298m42J036m31p35J181
6265D59k75r04J082p6j034J016Lj209J220O00j789R62R76j320k20J406j107k59
$$ plain form
6283 -469 941 -349 -645 844 23 -576 642 207 -707 591 393 -867 207 458 -505 39 501 -949
6301 -949 -75 764 -521 57 804 -436 -476 912 -368 -256 888 -195 -956 764 296 -905 391
6318 391 14 -1116 361 628 -773 125 467 -577 448 996 -632 -153 879 -475 -452 1072 -547
6335 -547 -558 998 -241 -594 393 -34 -928 550 188 -572 451 9 -933 724 497 -922 88 634
6353 634 -479 34 812 -666 -247 671 -480 -350 1001 -177 -313 758 -182 -571 800 -14 -435 700
6371 700 597 -784 527 373 -954 -91 453 -783 -230 530 -827 -181 877 -877 -406 700 -153
6388 -153 -509 793 -297 -685 807 49 -590 1020 478 -777 512 361 -543 486 620 -898 212
6405 212 892 -733 -162 743 -521 -220 764 -467 -417 789 -220 -602 615 -143 -694 511 -99 -844
$$ packed form
6283d69J410j290k96J489q21n99J218m35r14J298j98j260J074K51r63N44M62j450
6301i49Q74Q39j285N78P47j240m0J388j280J12J144j083p61J720m68j201J296
6318C91l77j130J477K67j401Q98L42j044J025N48j628M79J032j354K3J524j619
6335e47j1J556j239l53R87m27q94J478l62p60J023m42r42J657k27j419J010N46
6353F34j113N13P78j478M19R18j151J30J351j178j36J071r40l89J371q14m21J135
6371G00j03j381J311j54j327Q63N44j236N53P60j357O46J058j754M71J106q53
6388a53l56J302j090l88J492p58o39J610n42j255J289j51r04J029J34j518J110
6405B12O80j625N71R05j264L01R84j231N0J206j009l82J217p58n51J205o10p45
$$ plain form
6423 -844 310 129 -658 232 386 -883 426 709 -756 -7 1042 -332 -184 891 -690 -41 770
6440 770 -112 -357 833 -223 -409 785 -103 -698 513 8 -700 557 322 -988 210 544 -806
6457 -806 348 462 -838 18 1097 -789 -114 827 -285 -278 797 -282 -504 958 -194 -228 900 163
6475 163 -570 575 384 -764 431 301 -855 396 482 -831 149 925 -691 -213 297 -608 -162 551
6493 551 -496 -442 641 -292 -975 798 13 -476 727 242 -540 726 620 -762 376 187 -705 537
6511 537 537 -550 -62 933 -884 -147 1128 -488 -560 1119 -264 -363 285 -281 -593 476 -107 -932 538
6530 538 -9 -749 458 543 -737 175 260 -713 163 784 -454 -30 413 -477 -296 809 -731 -518 850
6549 850 -212 -723 635 -80 -854 459 129 -987 442 128 -854 333 272 -874 65 527 -731 57
$$ packed form
6423h44J154j81p87Q90J54j269J309K83j465P49J049j374J48J075j581O49Q11
6440G70q82k45J190j056j86J194q88n95J211n05p08J257k35j310J198L34j350
6457h06J154J14j300Q56J079j886O75R41j112PJ075j079k22J462j152l4J128p37
6475A63p33J145j91j148J195j30j156J251Q6j313R80P76j616M78N10r05M46P13
6493E51j047N4J083r33o83J773p85m89J203m85p82J266j06j382J138j89q92J242
6511E37%j087M88R95j817P37J275j616p2J679j383r9O48n66l12J069n83q25J470
6530E38n47p40J207Q5j280R12Q5r73Q76O21j238M24M43q90J81J105j540K13J368
6549H50j062n11J358p15p74J313l30j116J429l14r82J187o1j146R39M62j258P88
$$ plain form
6567 57 1005 -287 -280 738 -606 -234 1014 -326 -485 560 172 -446 526 -181 -800 588 521 -804 223
6586 223 421 -643 394 643 -730 104 637 -500 -224 676 -506 -215 340 -308 -246 784 -113 -500
6604 -500 665 -103 -401 521 -36 -819 576 355 -489 363 434 -519 283 493 -397 -14 760 -416 -372 782
6624 782 -311 -364 1063 -288 -740 885 -149 -558 351 -132 -776 828 390 -1106 261 406 -779
6641 -779 314 454 -654 422 688 -458 36 628 -630 -61 918 -458 -190 805 -505 -732 907
6658 907 -70 -689 569 -30 -857 521 328 -659 89 225 -581 401 862 -937 -65 716 -921 -16 637
6677 637 -621 -615 1031 -488 -689 911 -440 -630 810 247 -804 553 84 -913 377 582 -687
6694 -687 61 208 -699 336 767 -650 -292 499 -725 -107 743 -604 -452 870 -219 -363 561 -93
$$ packed form
6567E7R48j292PJ018j344L72J248j340j59J045l88o18R72p07o19J388o7j325J027
6586B23J98j064J037K49j373Q34N33j137K76R00j182K91N55o48O2J030q97l87
6604e00J165p68k98R22n57p83J395k21q44Q52P1r53Q02K10q90L83P74j176M4J154
6624G82j093n3J427j351m52J625j034m09R09m83o44J604m38j496J367J45j185
6641g79J093J40j108J076K66j146M94N92j258N69R79j376K68R95j310k27J639
6658I07r77o19J258n99q27J378j93r87P48J36q06R82M61j799Q72P81j637R05O53
6677F37j258OJ646j519k01J600j351j90J440n63j051J357m69r97J290K05j269
6694f87P48J47r07J035M31j417L58P91j224O18Q50j347J52J322j089j44R24o54
$$ plain form
6712 -93 -891 541 187 -828 214 321 -794 409 696 -329 60 137 -687 97 954 -394 -477 624
6730 624 -574 -79 1344 -184 -988 627 137 -511 337 -317 -1075 420 338 -554 275 -5 -1086 400
6748 400 735 -812 172 588 -1032 186 846 -390 -192 372 -553 -362 928 -246 -742 533 -56 -242
6766 -242 834 -16 -1197 534 559 -660 394 118 -749 74 374 -702 82 402 -976 -41 755 -549
6784 -549 -63 738 -465 -513 900 19 -695 381 -228 -770 1052 98 -731 251 262 -256 529 440 -974
6803 -974 102 735 -466 72 426 -829 -113 1005 -315 -488 560 -499 -813 671 -16 -618 298
6820 298 199 -849 677 238 -1032 189 112 -587 779 815 -955 -140 948 -242 -69 556 -638 -252
6838 -252 962 -436 -386 977 -432 -677 395 75 -730 531 84 -848 434 643 -742 166 233 -655
$$ packed form
6712i3p98J432l54j015J042J07j115J203K87j025L89P7q24P84Q57j348q3J101
6730F24j198M95J423j528q04J615m90o48Q48o54p58J495q2q92Q29k80j081J486
6748D00L35j547R84M16j620J218O60j236J98N64r25J91J290j174m96J275n89j86
6766b42J076q50j181J731K5j219J054k76q67Q23L00j076P84L20j378R35P96j304
6784e49M86Q01j203m8J413q81p14J076o09n42J822r54q29R82J1n18P85q9j414
6803i74J076O33j201N38L54j255P16J118j320j73J048j059l14J484o87o02R16
6820B98r9j048J526m39j270J221p7o99J366L6j770Q15J088j190J73O25j194L86
6838b52J214j398N0J363j409k45J072l20q05J261m47r32J282K09j385R08O7q88
$$ plain form
6856 -655 707 729 -982 -474 435 -650 60 917 -496 -403 1001 -45 -557 931 -148 -623 1101 216
6874 216 -853 572 383 -1101 356 422 -514 177 493 -1042 72 1022 -399 -502 772 -291 291
6891 291 752 -639 -613 826 -306 -454 820 -122 -786 676 297 -630 655 338 -739 551 562 -562
6909 -562 326 498 -1046 255 1105 -271 -355 543 -345 -102 987 -340 -642 633 34 -444 471 -349
6927 -349 -712 370 46 -555 602 319 -918 192 689 -772 -29 725 -641 -116 905 -232 -475
6944 -475 435 -503 -324 841 -216 -871 673 152 -361 807 171 -1178 336 275 -456 508 332 -676
6962 -676 264 730 -603 130 790 -643 -348 1053 -459 -583 799 -313 -497 671 -151 -575 710
6979 710 206 -663 894 498 -1009 546 521 -866 280 383 -1369 -170 766 -804 -417 621 -695
$$ packed form
6856f55J362K2j711N08R09j085P10Q57j413R3J404j046n12J488j079m75J724q85
6874B16j069J425j89j484J457O6r36O91L16j535J114R50j421j03J274j063N82
6891B91M61j391K6J439j132j48J274r42o64J462l79r27J285l17j077J290J1j124
6909e62Q88J72j544J301Q50j376q4Q98q88K43J089j327l02J275n99m78R15q20
6927c49l63J082l24o01J157k83j237J110M97j461P43P54j366N25J021j137k43
6944d75R10r38J79J165j057o55J544n21n13J168o36j349J514o1p31R64j76j008
6962f76R40M66j333P33O60j433K95J401j512j24J382j112j84J168q22m24J285
6979G10n04q69J557l96j507J555k5j387J146J03j752J199R36j570L87J038j316
$$ plain form
6996 -695 -226 896 -363 -312 801 -339 -814 647 160 -580 816 204 -586 658 578 -984 297 708
7014 708 -794 350 481 -713 237 966 -614 -199 848 -631 -217 1032 -398 -418 589 -92 -771
7031 -771 615 -20 -609 608 -70 -899 183 496 -727 177 408 -681 249 600 -680 -46 717 -593
7049 -593 47 823 -395 -365 734 -453 -529 696 68 -725 991 -9 -1000 407 473 -825 246 400
7067 400 -726 180 387 -787 -62 668 -629 -375 1161 -726 -311 1133 -372 -489 666 21 -860
7084 -860 555 165 -764 618 -35 -784 405 214 -756 510 604 -975 8 575 -572 -141 686 -707
7102 -707 -526 831 -204 -576 600 -182 -397 983 -83 -556 922 -153 -971 575 431 -1050 347
7119 347 733 -758 451 717 -985 12 777 -622 10 496 -931 -238 789 -310 -527 771 -345
$$ packed form
6996f95M69J122j259N1J113j140m75J461m87p40J396o12p90J244q0j562J281M11
7014G08j502J144J31j194R50P29j580M15J047j479M14J249j430k0J007o81o79
7031g71J386o35n89J217o78q29J082L13j223R04K31j089R30L51j280O34P63j310
7049e93O40P76j218L0J099j187p6J225o28p93J716j000r91J407O6j298J071J54
7067D00j126R06K07j174P25P30j297K54J536j887M15J444j505j17J155o45q81
7084h60J415l90r29J382o53p49J189j91r70J266R4j579R83N67j147M31Q27j393
7102g07J81J357j035l72J176p82k15J380j066m73J478j075q18J546j44j481J397
7119C47L86j491J209K66j702R97P65j399O32M86j427O93J027j099k17J298j116
$$ plain form
7136 -345 -649 878 49 -732 599 -148 -798 314 353 -897 400 297 -862 438 734 -1105 -168 967
7154 967 -530 -199 782 -766 -553 842 -473 -664 1009 -291 -857 1039 126 -463 554 128 -979
7171 -979 583 296 -597 141 559 -1052 70 580 -794 -27 917 -824 55 821 -795 -362 913 -275
7189 -275 -576 555 35 -1051 702 281 -750 530 332 -511 397 431 -478 187 615 -734 72 899
7207 899 -991 -207 983 -364 -289 783 -286 -752 866 -145 -709 679 24 -883 694 363 -723
7224 -723 466 527 -1257 460 785 -1073 -38 645 -738 95 1052 -436 -171 491 -762 -453 1062
7241 1062 -472 -422 721 161 -518 966 -69 -634 497 201 -921 449 292 -923 291 830 -1200
7258 -1200 196 936 -512 -38 1162 -437 -285 821 -524 -297 656 -161 -794 975 -139 -987 642
$$ packed form
7136c45l04J527q29p81J331p47o50J112L9j250J297j03j159J300K96j839R37J135
7154I67j497L31R81j548K13J395j315j91J673j300n66J896r13n89J017m26j107
7171i79J562k87q93P38M18j611J122N10j374P67R44j741Q79P66j616M33J275j188
7189b75l01J131n20j086J753m21j031J280j98q43R08L4r09O65M28j349Q06Q27
7207H99j890P84J190j347P5J072j069m66J618j011n64J388o55r07J577l31j086
7224g23J189O1j784J717L25j858J035O83j383Q33R57j488K65O62j253L09J515
7241A062j534N0J143n60o79J484j035n65J131k96j122J370j57j215J214N39k030
7258a200J396P40j448M74J200j599J52J106j345K27R53q17o33J769j114q48J629
$$ plain form
7275 642 69 -1126 587 640 -659 392 471 -977 25 710 -875 -261 1020 -561 -369 990 -517
7292 -517 -506 743 -486 -596 940 -136 -963 758 281 -954 588 447 -868 303 486 -422 374
7309 374 696 -735 -29 839 -776 -78 695 -726 -429 807 -702 -727 902 -269 -908 1069 50
7326 50 -794 812 156 -711 728 506 -980 259 555 -913 199 725 -889 84 834 -421 -39 948
7344 948 -580 -543 954 -415 -515 990 -96 -939 927 98 -1025 592 339 -910 772 655 -861
7361 -861 117 568 -950 70 600 -951 101 748 -243 -171 873 -677 -674 928 -154 -533 914 82
7379 82 -627 911 187 -1134 457 239 -915 238 509 -1121 -62 682 -743 -44 919 -761 -253
7396 -253 1145 -453 -442 890 -641 -664 949 -223 -583 772 -138 -889 689 522 -759 319 440
$$ packed form
7275F42n73j195J713N3j299J051P9j448J002O85j585O14J281j581J92J359j507
7292e17J1J249j229j10J536j076q27J721m77j235J542j41j315J171J83r08P96
7309C74L22j431P06Q68j615O98P73j421K97J236j509k5J629j171o39J977j019
7326E0q44J606o56q67J439k22j486J239K96j468J112N26j614R73P50j255L82R87
7344I48j528L7J497j369j00J505j086q43J866q29j123J617k53j249J682j17j516
7361h61R78M51j518J020N30j551J052O47r91P2J044j550LJ602j082l79J447q32
7379H2p09J538p24j321J591k18j154J153K71j630J059P44j425O99R63j680N08
7396b53J398j598J1J332j531k3J613j172l60J355r10p51J578j67j281J078J21
$$ plain form
7413 440 -972 503 779 -889 116 886 -633 -201 880 -607 -561 1185 -562 -459 909 -210 -968
7430 -968 810 97 -911 676 31 -1088 733 598 -776 456 183 -1056 293 862 -893 305
7446 305 804 -728 -131 1066 -927 -440 1081 -553 -267 935 -388 -709 1077 5 -970 766 389
7463 389 -826 594 635 -984 569 681 -709 298 665 -708 -70 946 -635 -452 833 -213 -590
7480 -590 1147 -435 -872 938 112 -593 1070 49 -841 671 241 -888 442 508 -1043 254 930
7497 930 -1086 -138 873 -925 -263 1106 -936 -591 994 -565 -838 1091 -384 -921 708 -42 -480
7514 -480 781 45 -1353 697 702 -872 516 788 -925 401 937 -708 42 648 -758 -21 1140
7531 1140 -385 -567 729 -258 -683 763 -246 -994 910 83 -856 788 147 -1064 125 562 -770
$$ packed form
7413D40j412J475K76j668J005P70j519M32J081j487M6J746j747J03J368j119p58
7430i68J778p13j008J587o45j119J821j35j374J232k73j239J349N69j755J198
7446C05M99j532N97J197j993M87J521j634K86J202j323l21J786j072r75J736l77
7463C89j215J420M1j619J553J12j390J007L67j373O38J016j581J83J285j046l77
7480e90J737j582m37J810q26p05J663j021q90J512m30j129J330O6j551J297O76
7497I30k016R48J011j798O62J369k042L45J585j559k73J929j475n37J629p50m38
7514d80J261p36j398K050Nj574J388K72j713J326N36j645P50O06j406P37J161
7531A140j525j82J296r87m25J446j009p48J904q27r39J644o41j211J189M37j332
$$ plain form
7548 -770 643 432 -958 -176 901 -687 -120 745 -737 -414 1547 -465 -455 777 -387 -431 990
7565 990 -159 -1139 727 57 -817 599 510 -1189 191 742 -1173 383 935 -1208 -587 713 -836
7582 -836 -74 974 -966 -408 1024 -210 -673 886 -267 -988 950 201 -1005 761 413 -919 367
7599 367 454 -1037 596 481 -992 454 843 -1175 7 686 -306 101 1014 -542 -555 978 -85 -617
7617 -617 925 -236 -999 934 344 -820 676 -4 -919 810 694 -889 173 691 -1105 -87 1059
7634 1059 -912 -378 825 -65 51 997 -821 -1003 955 -211 -779 916 -415 -1299 1229 530 -1001
7651 -1001 308 595 -887 657 620 -574 330 616 -767 221 1019 -574 -266 1158 -733 -175 1332
7668 1332 -446 -822 589 73 -457 1031 83 -1262 708 251 -838 637 351 -1310 418 1125 -1015
$$ packed form
7548g70J413k11j390P82J077j588N67Q65j482L23J961k012J0J232j164m4J421
7565I90j149r80J866o70q74J416q9j699J380N51j915J556N52k143O21J300j549
7582h36P62J048j940N58J432j234m63J559j153p21J938p49j206J766l48j332J286
7599C67Q7j491J633j15j473J446L89k018J182O79r92M07R13j556j3J533j063n32
7617f17J542j161p63J933n90j164J496o80r15J729j16j583J062N18j796J018J146
7634A059j971N34J203q90J16R46j818j82J958j166n68J695j331q84K528o99j531
7651a001J309K87j482J544l7j194R04K86j383R88P98j593L08J424j891N58J507
7668A332j778l76J411n16n30J488r48j345J970m57j089J475k86j661J728P07k140
$$ plain form
7685 -1015 8 488 -902 -90 1096 -684 -589 897 -367 -388 933 -419 -968 824 167 -932 1123
7702 1123 200 -1285 849 564 -939 242 352 -1032 195 803 -960 133 418 -838 -6 1384
7718 1384 -813 -586 1110 -485 -81 1098 -34 -1064 524 315 -952 862 -9 -1230 1031 510
7734 510 -1035 483 976 -1201 165 1023 -561 17 687 -758 -359 1342 -586 -401 620 -352 -538
7751 -538 1172 -168 -1043 775 135 -1101 678 340 -1093 34 398 -1170 602 535 -1220 53 1070
7768 1070 -734 421 837 -983 -570 970 6 -578 1044 -292 -624 1092 215 -1043 532 119 -782
7785 -782 634 388 -1079 253 215 -1020 413 898 -1188 -286 983 -723 -87 1072 -788 -1173 1114
7802 1114 -207 -270 499 -488 -949 1312 386 -940 896 68 -698 1010 602 -1092 309 728 -736
$$ packed form
7685a015J023M80j390Q12J186j780R5J486j264k1J321j352n49J792o57j099K055
7702A123r23j485K134k85j503J181J10j384J227O08j763J093K85j256Q32J390
7718A384k197K27J696j595M04J179j132j030J588k09j267J814q71j221K261n21
7734E10j545J518M93k177J366Q58j584N78O70j445L99J701j928J85J021r72j86
7751e38J710j340q75J818o40j236J779l38j433J127L64j568J772o7j755J273J017
7768A070j804J155M16j820M13J540r64n84J622j336l32J716q77j258J575m13r01
7785g82J416k46j467J332l8j235J433M85k086R02J269j706O36J159j860l85K287
7802A114j321o3P69r87m61K261r26j326J836q28p66J708m08j694J401M19j464
$$ plain form
7819 -736 222 743 -1019 -279 1171 -720 -301 1044 -897 -819 1141 -325 -624 905 -337 -891 822
7836 822 522 -931 300 359 -1109 762 716 -1165 510 1003 -600 337 1272 -1182 -264 950 -789
7853 -789 -647 992 -439 -769 950 -339 -622 759 -50 -976 726 350 -990 651 308 -1073 468
7870 468 1003 -796 -167 494 -912 139 950 -979 -232 963 -633 -142 1238 -371 -868 797 -398
7887 -398 -883 852 -153 -806 467 377 -808 500 504 -1223 241 944 -962 -60 815 -824 68 1179
7905 1179 -724 -746 877 -339 -416 900 -522 -748 1126 -33 -636 1000 170 -1422 696 488 -907
7922 -907 362 574 -834 152 737 -436 -64 537 -624 -104 1096 -365 -652 1207 -594 -553 1178
7939 1178 -536 -1151 663 -20 -886 665 105 -931 685 535 -717 335 712 -753 134 896 -705
$$ packed form
7819g36R58N21j762P40J450j891M19J345j941P8J960j466k99J529j242n54J713
7836H22l00j453J231N9j468J871m6j881J675M93j603R37R35k454R18J214j739
7853g89J42J639j431l30J719j289k83J381q09r26J702l76j340J641l43j381J541
7870D68N35j799O29O61j406J051Q11j929P47J195j596M91J380j609m97J665j195
7887c98m85J735j005o53J273r0j185J308Mj727J464P03j906R02Q75j639Q92J111
7905A179j903k2J623j216p7J316j422k26J874j159o03J636q30j592K118k08j395
7922i07J269K12j408R86N85j173L72O01j161N20J200j461k87J859j801M1J731
7939A178j714o15J814o83q66J551n60j036J616j50j252J052L77j465Q87P62j601
$$ plain form
7956 -705 373 1222 -519 -503 1459 -583 -530 1369 -501 -660 897 110 -833 685 1 -971 721 99
7974 99 -1222 453 456 -761 301 562 -720 165 911 -961 -186 697 -643 -472 895 -520 -538 868
7992 868 -602 -838 947 235 -941 702 231 -918 587 703 -779 484 469 -1149 206 917 -1031
8009 -1031 -50 1062 -861 -476 1239 -443 -201 525 -2 -635 962 -208 -742 724 -241 -979 1087
8026 1087 242 -1082 515 493 -1080 201 831 -470 -301 1189 -1060 -300 936 -655 -357 899 -571
8043 -571 -774 1073 -92 -864 859 -132 -1009 949 68 -879 658 486 -707 420 668 -865 94
8060 94 894 -871 -71 859 -889 -6 975 -649 -418 800 -187 -732 948 -324 -791 628 -65 -985
8078 -985 730 262 -1156 530 553 -889 318 462 -1254 146 1064 -897 -106 979 -558 -346 926
$$ packed form
7956g05J078Q49j741J6J962k042N3J899j870j59J557p87r43J518o84r72J692o22
7974I9j321J675Lj217J062K61j282Q85P46j872P75Q83j340J71J367j415j8J406
7992H68j470k36J785p12j176J643m71j149J505J16j482J263j5j618J355P11j948
8009a031R81J112j923L85J715j682K42P26n27o33J597j170n34J466r65p38K066
8026A087q45j324J597k2j573J281O30j301J69J490k249P60J236j591K98J256j470
8043e71k03J847j165p72J723r91q77J958q81r47J537j72j193J127K48j533R59
8060I4Q00j765Q00R30j748Q83R81j624K31J218r87n45J680j272m67J419o93r20
8078i85J715m68j418J686K3j442J207J44j716J400R18j961P91J085j537K12J272
$$ plain form
8095 926 -608 -447 1096 -238 -490 1165 -177 -913 817 187 -805 1012 367 -1135 164 192 -1180
8112 -1180 380 435 -652 -241 1089 -901 -327 849 -688 -600 1128 -293 -970 863 -284 -688 780
8129 780 -37 -820 760 671 -911 624 467 -1191 430 671 -756 -27 912 -738 -372 1162 -452
8146 -452 -457 1077 -507 -480 967 -401 -792 1033 21 -937 944 54 -1113 560 606 -867 327 802
8164 802 -886 203 802 -642 251 901 -732 15 1269 -442 -73 1001 -440 -633 1051 -166 -962
8181 -962 543 37 -857 1007 364 -1065 485 223 -916 319
$$ packed form
8095I26j534J61J543j334k52J655j342p36J730o30r92J817o45j502J299K8j372
8112a180J560N5j087M11J330j990N74J176j537Q8J728j421o77J833j147m04J468
8129G80q17p83J580q9j582J535j57j658J621K41j427P29R39j650L66J534j614
8146d52nJ534j584K7J447j368l91J825j012r58J881q90j167J673M6j473J194M75
8164H02j688J089N99j444Q93O50j633P47J254j711L69J074j441j93J684j217p96
8181i62J505n06q94J864o43j429J550k62j139J235
8191C19
$$ Imaginary data points
##PAGE= N=2
##DATA TABLE= (X++(I..I)), XYDATA
$$ plain form
0 0 0 0 0 8 -8 0 -8 12 -8 16 -24 24 -32 40 -48 56 -68 80 -94 110 -131 153 -173 200 -231 263 -298 341 -386
29 -386 431 -488 550 -612 684 -765 850 -941 1050 -1164 1285 -1422 1577 -1745 1934 -2145
45 -2145 2380 -2645 2953 -3308 3721 -4212 4811 -5554 6503 -7769 9545 -12215 16671 -25474
59 -25474 49396 -247294 -727872 -11203 507993 302552 -236125 -448378 -93170 385138
69 385138 192758 -232457 -188358 59067 104485 56209 -100843 -111107 174561 187717 -207452
80 -207452 -240723 125871 286486 99715 -240899 -352733 111596 489118 78801 -426990
90 -426990 -264391 170256 346001 111660 -316368 -288608 198312 298901 -38158 -170739
100 -170739 -80410 42173 162061 32385 -172766 -9483 170894 -9029 -142486 -39501
$$ packed form
0@%%%Qj6QqK0k0K4m0M8n6P2q8J04j24J48j74K04k41K84l26L73m31M94n61O39p27
29c86Q17r19J038j162J296j449J615j791J991k214K449k707K999l322L679m079
45b145M525n025N598o261P029p933R023j0365J2057j4272J7314k1760K8886m2145
59b5474P4870k96690m80578P16669N19196k05441n38677k12253L55208M78308
69C85138j92380m25215M4099K47425M5418m8276j57052j0264K85668J3156l95169
80b07452l3271L66594J60615j86771l40614j11834M64329L77522m10317n05791
90d26990J62599M34647J75745k34341m28028K7760M86920J00589l37059j32581
100a70739R0329J22583J19888j29676k05151J63283J80377j79923j33457J02985
$$ plain form
110 -39501 81600 148280 -4504 -270366 -102285 275686 169763 -157490 -190937 -53699
120 -53699 135426 225847 -35100 -254673 -45739 161341 109315 10589 -116758 -124342 113972
131 113972 146661 -99843 -93250 70803 23061 -41181 -31952 -37409 66514 89174 -131768 -139364
143 -139364 117025 124531 -34049 -68328 -81138 4222 171993 66582 -135694 -66486 42895
154 42895 64039 109964 -11165 -174952 -10063 160126 27405 -61128 -25432 -33631 22087
165 22087 49648 -52777 -9996 81215 -62121 -111500 65841 81755 -12059 -18345 -77209 -65066
177 -65066 111411 100539 -67607 -74856 -42226 -8851 123859 71495 -144346 -95849 65778
188 65778 44716 27097 10545 -93650 -42042 79931 18314 -9849 40181 -49752 -65187 76315
$$ packed form
110c9501J21101O6680j52784k65862J68081L77971j05923l27253l3447J37238
120e3699J89125R0421k60947k19573K08934K07080n2026r8726j27347p584K38314
131A13972L2689k46504O593J64053m7742o4242R229n457J03923K2660k20942p596
143a39364K56389P506j58580l4279j2810Q5360J67771j05411k02276O9208J09381
154D2895K1144M5925j21129j63787J64889J70189j32721q8533L5696q199N5718
165B2087K7561j02425M2781R1211j43336m9379J77341J5914r3814o286n8864J2143
177f5066J76477j0872j68146p249L2630L3375J32710n2364k15841M8497J61627
188F5778k1062j7619j6552j04195N1608J21973o1617k8163N0030q9933j5435J41502
$$ plain form
200 76315 57644 -24507 10345 -32569 -60872 74157 76290 -50163 -30673 -18049 -50243 64450
212 64450 89570 -74617 -84168 7725 3241 55496 70605 -84179 -97786 43401 53477 45203
224 45203 46597 -96435 -105937 103251 116544 -27992 -45174 -48982 -28527 92200 56954 -77748
236 -77748 -31575 9213 -40483 33303 60768 -59313 -42127 24864 -37394 4151 91867 -14255
248 -14255 -84971 -10644 14501 58891 88278 -72898 -134645 55682 118114 15051 -27142
259 -27142 -75790 -56022 109438 96809 -79779 -60194 24502 2152 38752 45842 -51896 -20381
271 -20381 48085 -23444 -8999 73652 3694 -44809 -3233 -30452 17835 116400 -16710 -149493
283 -149493 -15989 86532 42267 6191 -76116 -100530 60832 103621 -35521 -50553 -10001
$$ packed form
200G6315j8671q2151L4852m2914k8303J35029K133j26453J9490J2624l2194J14693
212F4450K5120j64187r551R1893m484N2255J5109j54784j3607J41187J0076q274
224D5203J394j43032r502K09188J3293j44536j7182l808K0455J20727l5246j34702
236g7748M6173M0788m9696P3786K7465j20081J7186O6991o2258M1545Q7716j06122
248a4255p0716P4327K5145M4390K9387j61176o1747J90327O2432j03063m2193
259b7142m8648J9768J65460j2629j76588J9585Q4696k2350L6600P090r7738L1515
271b0381O8466p1529J4445Q2651o9958m8503M1576k7219M8287R8565j33110j32783
283a49493J33504J02521m4265l6076q2307k4414J61362M2789j39142j5032M0552
$$ plain form
294 -10001 -24575 47964 63618 -58852 -31524 65251 -9982 -34444 49032 17527 -15490 15080
306 15080 -38784 -23769 90437 25631 -88096 -21033 26153 13831 50203 -21414 -104813 22414
318 22414 94282 -17727 -36799 -2202 -27563 34456 65866 -50056 -47688 51011 12894 -16163
330 -16163 19228 -24863 -10362 61052 -23202 -70540 49727 47773 -44955 -14321 -2520 -19686
342 -19686 51749 25895 -77912 -17715 49670 -2348 3998 3026 -61243 6735 73190 -33142
354 -33142 -55049 32477 4671 -19451 19710 -28418 -28101 56934 203 -66711 17451 34577
366 34577 -14516 15012 -10888 -47473 50988 61709 -52503 -27040 34918 594 24968 29911
378 29911 -60394 -21788 70177 3997 -35235 10191 -19848 -10880 47049 -20646 -50991 38434
$$ packed form
294a0001j4574P2539J5654j22470K7328R6775p5233k4462Q3476l1505l3017L0570
306A5080n3864J5015J14206o4806j13727O7063M7186j2322L6372p1617q3399J27227
318B2414P1868j12009j9072L4597k5361O2019L1410j15922K368R8699l8117k9057
330a6163L5391m4091J4501P1414q4254m7338J20267j954r2728L0634J1801j7166
342a9686P1435k5854j03807O0197O7385n2018O346r72o4269O7978O6455j06332
354c3142k1907Q7526k7806k4122L9161m8128L17Q5035n6731o6914Q4162J7126
366C4577m9093K9528k5900l6585R8461J0721j14212K5463O1958l4324K4374M943
378B9911r0305L8606R1965o6180l9232M5426l0039Q968N7929o7695l0345Q9425
$$ plain form
390 38434 8487 -54381 17419 24394 -31466 10799 3507 -48130 25956 51243 -38085 -23159
402 -23159 17222 -17267 26362 46715 -57078 -41347 57421 13992 -20547 16916 -24627 -23691
414 -23691 52319 5439 -42334 25290 10461 -35670 25913 21401 -33304 18289 17134 -46223
426 -46223 15844 49710 -32050 -19456 23590 -19305 7933 43570 -35949 -34150 41901 5150
438 5150 -13159 28773 -21241 -30996 50956 15201 -38425 22982 13127 -35560 26214 30502 -34078
451 -34078 3589 17878 -32046 13949 34720 -39631 -16240 28069 -25051 -3414 39603 -37548
463 -37548 -39895 43673 7048 -27908 17457 -12401 -26067 43192 11738 -39320 18571 14817
475 14817 -26369 30308 24168 -42646 10877 36551 -28045 5470 38522 -31149 -14061 39305
$$ packed form
390C8434k9947o2868P1800O975n5860M2265p292n1637P4086K5287q9328J4926
402b3159M0381l4489M3629K0353j03793J5731R8768m3429l4539L7463m1543R36
414b3691P6010m6880m7773O7624j4829m6131O1583m512n4705N1593j155o3357
426d6223O2067L3866q1760J2594M3046m2895K7238L5637p9519J799P6051l6751
438E150j8309M1932n0014r755Q1952l5755n3626O1407r855m8687O1774M288o4580
451c4078L7667J4289m9924M5995K0771p4351K3391M4309n3120K1637M3017p7151
463c7548k347Q3568l6625l4956M5365k9858j3666O9259l1454n1058N7891l754
475A4817m1186N6677o140o6814N3523K5674o4596L3515L3052o9671J7088N3366
$$ plain form
487 39305 -11017 -10407 29329 -24961 -23364 43505 -577 -30304 19347 -12390 -28016 45770 9994
500 9994 -58510 6485 26882 -21942 11508 10517 -45121 4114 36616 -22847 -5880 19301 -32240
513 -32240 -1610 43821 -22190 -23280 35229 -13571 -26211 41460 4891 -36198 16541 4673
$$ packed form
487C9305n0322O10L9736n4290J597O6869m4082k9727M9651l1737j5626P3786l5776
500I994o8504O4995K0397m8824L3450r91n5638M9235L2502n9463J6967K5181n1541
513c2240L0630M5431o6011j090N8509m8800j2640O7671l6569m1089N2739j1868
$$ [...]
8191H87
##END NTUPLES=NMR FID
##END=
