##TITLE=1H_Pr Am Tio
 CDCl3, 8 sc, 
 3.08.2021
##JCAMPDX= 6.0         $$ Bruker NMR JCAMP-DX V2.0
##DATA TYPE= NMR FID
##DATA CLASS= NTUPLES
##ORIGIN= UXNMR, Bruker Analytische Messtechnik GmbH
##OWNER= root
$$ XWIN-NMR		Version 3.5
$$ Tue Aug  3 12:34:42 2021 Russian Standard Time (UT+4h)  she@DPX200
##.OBSERVE FREQUENCY= 200.131506
##.OBSERVE NUCLEUS= ^1H
##.DELAY= (6, 6)
##.ACQUISITION MODE= SIMULTANEOUS
##.ACQUISITION SCHEME= undefined
##.AVERAGES= 8
##.DIGITISER RES= 18
##SPECTROMETER/DATA SYSTEM= spect
##.PULSE SEQUENCE= zg30
##.SOLVENT NAME= CDCl3
##.SHIFT REFERENCE= (INTERNAL, CDCl3, 0, 15.7039)
##AUDIT TRAIL= $$ (NUMBER, WHEN, WHO, WHERE, WHAT)
$$ ##TITLE= Audit trail, XWIN-NMR		Version 3.5
$$ ##JCAMPDX= 5.01
$$ ##ORIGIN= Bruker BioSpin GmbH
$$ ##OWNER= she
$$ F:/spectra/data/she/nmr/H-F/1/audita.txt
$$ ##AUDIT TRAIL=  $$ (NUMBER, WHEN, WHO, WHERE, WHAT)
(   1,<2021-08-03 12:33:45.51 +0400>,<she>,<DPX200>,
      <created by zg, POWCHK disabled, PULCHK disabled
       configuration hash MD5:
       00 E9 B6 7A A2 85 ED C7 34 08 36 98 17 FE 4E 26
       data hash MD5: 16K
       3F 2D FA 39 DB E2 DE 4D EF E7 08 8F 41 CA 69 33>)
$$ ##END=
$$ 
$$ hash MD5
$$ 63 C9 73 AF F7 AE 34 6F 0F 7F C1 FF C6 6D 39 81
##$RELAX= 
##$RELAX= 
##$RELAX= 
##$RELAX= 
##$RELAX= 
##$RELAX= 
$$ Bruker specific parameters
$$ --------------------------
##$DU= <F:/spectra>
##$EXPNO= 1
##$NAME= <H-F>
##$PROCNO= 1
##$TYPE= <nmr>
##$USER= <she>
##$AMP= (0..31)
100 100 100 100 100 100 100 100 100 100 100 100 100 100 100 100 100 100 
100 100 100 100 100 100 100 100 100 100 100 100 100 100 
##$AQSEQ= 0
##$AQ_mod= 1
##$AUNM= <au_zg>
##$AUTOPOS= <>
##$BF1= 200.13
##$BF2= 200.13
##$BF3= 200.13
##$BF4= 200.13
##$BF5= 200.13
##$BF6= 200.13
##$BF7= 200.13
##$BF8= 200.13
##$BYTORDA= 1
##$CFDGTYP= 0
##$CFRGTYP= 5
##$CHEMSTR= <none>
##$CNST= (0..31)
1 1 145 1 1 1 1 1 1 1 1 1 1 1 1 1 1 1 1 1 1 1 1 1 1 1 1 1 1 1 1 1 
##$CPDPRG= <>
##$CPDPRG1= <>
##$CPDPRG2= <>
##$CPDPRG3= <>
##$CPDPRG4= <mlev>
##$CPDPRG5= <mlev>
##$CPDPRG6= <mlev>
##$CPDPRG7= <mlev>
##$CPDPRG8= <mlev>
##$CPDPRGB= <>
##$CPDPRGT= <>
##$D= (0..31)
0 1.2 0 0 0 0 0 0 0 0.06 0 0.03 0 0 0 0 0.0002 0 0 0 0 0 0 0 0 0 0 0 0 
0 0 0 
##$DATE= 1627979625
##$DBL= (0..7)
120 120 120 120 120 120 120 120 
##$DBP= (0..7)
150 150 150 150 150 150 150 150 
##$DBP07= 0
##$DBPNAM0= <>
##$DBPNAM1= <>
##$DBPNAM2= <>
##$DBPNAM3= <>
##$DBPNAM4= <>
##$DBPNAM5= <>
##$DBPNAM6= <>
##$DBPNAM7= <>
##$DBPOAL= (0..7)
0.5 0.5 0.5 0.5 0.5 0.5 0.5 0.5 
##$DBPOFFS= (0..7)
0 0 0 0 0 0 0 0 
##$DE= 6
##$DECBNUC= <off>
##$DECIM= 32
##$DECNUC= <off>
##$DECSTAT= 4
##$DIGMOD= 1
##$DIGTYP= 9
##$DL= (0..7)
0 120 120 120 120 120 120 120 
##$DP= (0..7)
150 150 150 150 150 150 150 150 
##$DP07= 0
##$DPNAME0= <>
##$DPNAME1= <>
##$DPNAME2= <>
##$DPNAME3= <>
##$DPNAME4= <>
##$DPNAME5= <>
##$DPNAME6= <>
##$DPNAME7= <>
##$DPOAL= (0..7)
0.5 0.5 0.5 0.5 0.5 0.5 0.5 0.5 
##$DPOFFS= (0..7)
0 0 0 0 0 0 0 0 
##$DQDMODE= 0
##$DR= 18
##$DS= 0
##$DSLIST= <SSSSSSSSSSSSSSS>
$$ [...]
##$SUBNAM2= <"">
##$SUBNAM3= <"">
##$SUBNAM4= <"">
##$SUBNAM5= <"">
##$SUBNAM6= <"">
##$SUBNAM7= <"">
##$SUBNAM8= <"">
##$SUBNAM9= <"">
##$SW= 20.0188882624521
##$SWIBOX= (0..15)
0 0 2 0 0 0 0 0 0 0 0 0 0 0 0 0 
##$SW_h= 4006.41025641026
##$TD= 16384
##$TD0= 1
##$TE= 0
##$TE2= 300
##$TE3= 300
##$TEG= 300
##$TL= (0..7)
0 120 120 120 120 120 120 120 
##$TP= (0..7)
150 150 150 150 150 150 150 150 
##$TP07= 0
##$TPNAME0= <>
##$TPNAME1= <>
##$TPNAME2= <>
##$TPNAME3= <>
##$TPNAME4= <>
##$TPNAME5= <>
##$TPNAME6= <>
##$TPNAME7= <>
##$TPOAL= (0..7)
0.5 0.5 0.5 0.5 0.5 0.5 0.5 0.5 
##$TPOFFS= (0..7)
0 0 0 0 0 0 0 0 
##$TUNHIN= 0
##$TUNHOUT= 0
##$TUNXOUT= 0
##$USERA1= <user>
##$USERA2= <user>
##$USERA3= <user>
##$USERA4= <user>
##$USERA5= <user>
##$V9= 5
##$VALIST= <valist>
##$VCLIST= <CCCCCCCCCCCCCCC>
##$VD= 0
##$VDLIST= <DDDDDDDDDDDDDDD>
##$VPLIST= <PPPPPPPPPPPPPPP>
##$VTLIST= <TTTTTTTTTTTTTTT>
##$WBST= 1024
##$WBSW= 4
##$XGAIN= (0..3)
0 0 0 0 
##$XL= 0
##$YL= 0
##$YMAX_a= 496325
##$YMIN_a= -681692
##$ZGOPTNS= <>
##$ZL1= 120
##$ZL2= 120
##$ZL3= 120
##$ZL4= 120
##$ABSF1= 10
##$ABSF2= 0
##$ABSG= 5
##$ABSL= 3
##$ALPHA= 0
##$AQORDER= 0
##$ASSFAC= 0
##$ASSFACI= 0
##$ASSFACX= 0
##$ASSWID= 0
##$AUNMP= <proc_1d>
##$AZFE= 0.1
##$AZFW= 0.1
##$BCFW= 1
##$BC_mod= 2
##$BYTORDP= 1
##$COROFFS= 0
##$CY= 11.3945322036743
##$DATMOD= 1
##$DC= 2
##$DFILT= <>
##$DTYPP= 0
##$F1P= 2.36226072786647
##$F2P= -0.459571619588291
##$FCOR= 0.5
##$FTSIZE= 0
##$FT_mod= 4
##$GAMMA= 1
##$GB= 0.15
##$INTBC= 1
##$INTSCL= 1
##$ISEN= 128
##$LB= 0.24
##$LEV0= 0
##$LPBIN= 0
##$MAXI= 10000
##$MC2= 0
##$MEAN= 0
##$ME_mod= 0
##$MI= 1.114404
##$NCOEF= 0
##$NC_proc= 0
##$NLEV= 6
##$NOISF1= 3.799351
##$NOISF2= 2.8
##$NSP= 1
##$NTH_PI= 0
##$NZP= 0
##$OFFSET= 15.70392
##$PC= 1
##$PHC0= -13356.81
##$PHC1= 17.00099
##$PH_mod= 1
##$PKNL= yes
##$PPARMOD= 0
##$PSCAL= 0
##$PSIGN= 0
##$REVERSE= no
##$SF= 200.130013532006
##$SI= 16384
##$SIGF1= 3
##$SIGF2= 2
##$SINO= 400
##$SIOLD= 16384
##$SREGLST= <1H.CDCl3>
##$SSB= 0
##$STSI= 0
##$STSR= 0
##$SW_p= 3612.71676300578
##$SYMM= 0
##$S_DEV= 0
##$TDeff= 0
##$TDoff= 0
##$TI= <>
##$TILT= no
##$TM1= 0
##$TM2= 0
##$TOPLEV= 0
##$USERP1= <user>
##$USERP2= <user>
##$USERP3= <user>
##$USERP4= <user>
##$USERP5= <user>
##$WDW= 1
##$XDIM= 8192
##$YMAX_p= 0
##$YMIN_p= 0
$$ End of Bruker specific parameters
$$ ---------------------------------
##NTUPLES= NMR FID
##VAR_NAME=  TIME,          FID/REAL,        FID/IMAG
##SYMBOL=    X,             R,               I
##VAR_TYPE=  INDEPENDENT,   DEPENDENT,       DEPENDENT
##VAR_FORM=  AFFN,          ASDF,            ASDF
##VAR_DIM=   8192,          8192,            8192
##UNITS=     SECONDS,       ARBITRARY UNITS, ARBITRARY UNITS
##FACTOR=    0.0002496,     1,               1
##FIRST=     0,             0,               0
##LAST=      2.0444736,     0,               0
##MIN=       0,             -681692,         0
##MAX=       2.0444736,     496325,          0
$$ Real data points
##PAGE= N=1
##DATA TABLE= (X++(R..R)), XYDATA
0@%%%%%%%Qj6J6j6J6k4L2m0N6o4P2r6J20j43J75k08K40k80L28l84M48n15N92o80
$$ 0 0 0 0 0 0 0 0 8 -8 8 -8 8 -16 16 -24 32 -32 40 -56 64 -79 96 -112 128 -152 176 -208 240 -275 317 -363
31c63P76q82J002j134J279j440J616j807K017k249K503k780L082l412L772m165
$$ -363 413 -469 533 -601 678 -762 854 -953 1064 -1185 1318 -1462 1620 -1792 1980 -2185
47b185M593n063N579o146O772p463Q230r087J0047j1131J2371j3804J5479j7463
$$ -2185 2408 -2655 2924 -3222 3550 -3913 4317 -4770 5277 -5854 6517 -7287 8192 -9271
61i271J9863k2839K6636l1678L8737m9392O7522j06315L31756m13213m80820Q83796
$$ -9271 10592 -12247 14389 -17289 21448 -27944 39578 -66737 265019 -148194 -629014 254782
73B54782J58465n78730j03800M63074k6111k38547l6610P4425N8533J55004j26863
$$ 254782 413247 -165483 -269283 193791 167680 -70867 -107477 -33052 25481 180485 53622
84E3622k89663J15698L86141j37049l87415J33306L69787j61822l06824J48427
$$ 53622 -236041 -120343 265798 128749 -258666 -125360 244427 82605 -224219 -75792
94g5792K47116j21134j70649M4139R5533M0302k573j31786o9909J87395R9965
$$ -75792 171324 50190 -120459 -76320 19213 59515 56942 -74844 -144753 42642 142607
105A42607k17599o7140K23789J0839k22578L6264J88940n1020j05054N1115j4919
$$ 142607 -74992 -142132 81657 92496 -130082 -93818 95122 44102 -60952 -9837 -24756
116b4756m3656J19514L4191j69885l940J74820m6170j59581J06750J38640j45566
$$ -24756 -68412 51102 85293 -84592 -88532 86288 40118 -119463 -12713 125927 -19639
127a9639r7243J54962K7035j35078O8918J06322j63484o7703K34075K0216k59446
$$ -19639 -116882 38080 65115 -69963 -1045 105277 -58207 -125910 108165 128381 -131065
138a31065M0789K47851j00958k12119J45397J70404j56378j20633J33089O1807
$$ -131065 -90276 157575 56617 -155502 -10105 160299 3921 -116712 16377 78184
148G8184q3883p4L2339m7357R572O8158m3674o2409P6646M4239j09679k6431J23989
$$ 78184 -5699 -5773 26566 -20791 -11219 56939 13265 -49144 27502 71741 -37938 -64369 59620
161E9620J2452j11085J953P4396k3690l3512M3898k892n1190L0452L4423n5305
$$ 59620 72072 -39013 -37060 37336 13646 -19866 24032 21140 -30050 402 34825 -20480
173b0480l804P2766k9723p8739M9604O3035n8615k9537N7645j3457n3450M5835
$$ -20480 -24284 48482 18759 -59980 -10376 52659 -5956 -35493 22152 8695 -44755 1080
185A080M2306o1816k3153O1128m686n4667L0448M4817m5707k9092M4592J183l2370
$$ 1080 43386 -18430 -41583 19545 14859 -39808 -9360 35457 -10250 -39342 5250 6433 -25937
198b5937L4851J7315o7765k949Q8259j4306r2795L8360Q6642o1865p5990P6473
$$ -25937 8914 26229 -41536 -44485 43774 29468 -63327 -24967 61675 -190 -76180 293
210B93O3482p2003m6137N3354K6899k8763n476O322o487J3788Q571l1500p62M9153
$$ 293 63775 -8228 -54365 -1011 25888 -2875 -8351 -2029 -8516 5272 13843 -17657 -18419 30734
224C0734n628o2905J0413O8068j0584n9966J4093M2699j8683k1959K1187N781
$$ 30734 25106 -37799 -27386 40682 30098 -29868 -15775 26924 8241 -13718 7469 13250
236A3250j5196Q633p7k1837J9515L4397l5787l8847M3448L2608m3506j9393M0744
$$ 13250 -1946 6687 6610 -15227 4288 38685 2898 -35949 7499 40107 -3399 -22792 17952
249A7952N532l6753K530K7619m409j3231J881l997m51J6237k09k2456J724K2847
$$ 17952 23484 -13269 -10739 16880 12471 -760 1121 -2876 -3327 12910 12701 -9755 -8031 14816
263A4816r316k2586J9147K0410k7251j7860K8332J0602k5614M00K0322j3932j5339
$$ 14816 5500 -17086 2061 22471 -4780 -22640 5692 16294 -9320 -8920 11402 -2530 -17869
276a7869K2018P769k2230J319J4986j0771q567J7569L113j9146J360J4270p420
$$ -17869 4149 11918 -10312 -8993 5993 -4778 -13345 4224 7337 -11809 -10449 3821 -3599
289c599n810J2333m19j4803L353J3397m860q830R124K787j3849L018J5610n335
$$ -3599 -9409 2924 2505 -12298 -8945 4452 -408 -9238 -114 2673 -11176 -8158 7452 2117
303B117j2510Q347O846j2605J090J7016p082j5537J0870J0128j2237j375J3450
$$ 2117 -10393 -2046 4800 -7805 -6715 10301 3219 -12318 -1448 8680 -3557 -4932 8518
316H518m247j3281P281J0693p269l632O087k416m230N843L329n578q32M662l249
$$ 8518 4271 -9010 -1729 8964 1695 -1937 4150 1734 -2496 3347 6676 1098 266 4928 1679
331A679m840R116M982j1468m470J1542J618j0087K269R878p584q779R607N316
$$ 1679 -3161 5955 10937 -531 -5001 6541 8159 -1928 341 10219 2635 -6144 3463 8779
345H779q230j07M082m729j680P397n55p576K624M553o274j343P775p98p704L19
$$ 8779 549 442 4524 -205 -1885 5512 4957 -2619 5 4558 -1716 -3059 4716 3918 -3786 -3467
361c467N403r34k847K305M49m893L21M607r29l112K064N42m773J062O933k746
$$ -3467 1936 1002 -1845 460 909 -3984 -3663 944 15 -3097 -1033 -491 -5264 -4202 2731 -15
377a5o898M217L500n072m01O065j710n912K326L485j685N3J355k699p49L296P09
$$ -15 -6913 -2696 804 -4268 -4669 1396 -314 -6226 -3900 -415 -2100 -2047 -692 -3391 -4140 -844 -135
394a35k237P75J427j805j521L388K576k965k725K239K116j386K38K041j971j660
$$ -135 -2372 -1597 -170 -1975 -3496 -108 2468 -497 -3222 -983 1133 -253 -15 2026 55 -1605
410a605L072P31l147K676K796m412k223M593L061l702k334J565J484N79q40j763
$$ -1605 1467 2198 -949 1727 4523 111 -2112 2481 5542 1840 -494 1071 2555 3134 2294 531
426E31J411K248k482l153L107M621k585n863N41O233J415o045k212M956J986m615
$$ 531 1942 4190 1708 -1445 1662 6283 3698 -2165 -1624 4609 6024 -21 -2233 2723 4709 94
442I4k340L504L716k385n679k85O963J960p239l990O350L520m991l817L433L860
$$ 94 -2246 1258 4974 2589 -3090 -3375 3588 5548 -1691 -5681 669 4189 -802 -4619 -1186 2674
458B674k008m741q09N728L138o389n043N030O050k982o698J208O657L56p557o57
$$ 2674 666 -4075 -4884 844 3982 -2407 -7450 -2420 3630 648 -6050 -4842 1815 2171 -5386 -6043
474f043P480J647o745k238M117L612r28l946k846M329N513m343n874M223O294
$$ -6043 1437 3084 -3661 -5899 -1782 1830 902 -3044 -5890 -1561 3952 -391 -6265 -2042 4252
489D252k919o813Q72Q605J280p459n048P467P126n989p244M295P451j912p081
$$ 4252 1333 -5480 -4608 3997 5277 -2182 -7230 237 7363 1374 -5870 -1575 5876 3964 -3117
504c117q07P524L951p373o405O153Q808m141r667K272Q895J278q418m484Q334
$$ -3117 -3924 3600 7551 178 -6227 -74 8734 4593 -5074 -2802 6093 7371 -1047 -5531 2803
519B803O835p902q764P648R021n986r134L786P205m96n374l079L494N604k686
$$ 2803 9638 1736 -7028 620 9641 3655 -5479 -1693 5512 5016 -358 -3437 57 5661 2975
534B975o876J081P547R96q470l978Q232N833p192p696N436Q158m670p313K881
$$ 2975 -3901 -2820 4727 5723 -2747 -6725 1507 7340 148 -7548 -2112 6046 1376 -5937 -3056
549c056N229k77l977k602K687M482o13o547j442P332L214o636m847M548P034l146
$$ -3056 2173 1896 -2081 -4683 -1996 2486 1873 -4674 -6116 1216 4430 -2206 -7053 -2505 4529 1383
565A383q536R88J0086J190j0906k658J0520M651r336n581O686O982l866p317J292
$$ 1383 -7153 -6165 3921 5111 -5795 -8453 2067 6718 -2618 -8199 -1513 5469 1603 -5714 -4422
580d422Q069R21p084l339N569O633l679q841J976J1024J63j2520j370J2902K581
$$ -4422 3647 4568 -2516 -5855 -286 6347 2668 -6173 -4197 6827 6990 -5530 -6900 6002 8583
595H583j2040k667R396L712o615l900L722M303k90m894k637M505N677l808p338
$$ 8583 -3457 -6124 3272 6984 369 -3531 191 4494 4204 -690 -3327 1178 6855 3047 -4291
610d291K540Q439j990q403K42Q832M75q029k007O015L773m600m370K321M097k88
$$ -4291 -1751 6688 4698 -3705 -3463 5369 5844 -2185 -4192 1823 5596 996 -3374 -1053 3044 2756
626B756l904j217K895K839k187m213K09M936J503n362l435M704N282m951o709
$$ 2756 -1148 -2365 530 3369 1182 -3031 -2822 2114 3617 -1745 -5180 -476 4806 -145 -6854
641f854L971P985l226q030J733Q017j140p346L50N947Q28m024k293J322L941J144
$$ -6854 -2883 5102 1876 -6154 -4421 3596 2456 -4890 -4540 1407 2235 -1789 -4082 -2760 1181 2325
657B325m440l543N695M751o484n319P474N265o301n782M789N501k398n306K146
$$ 2325 -2115 -5658 37 4788 -1696 -7015 459 5724 -577 -6359 -1570 3931 1533 -3773 -1627
672a627L514j45l621k15L042J663j572k790K56L980L59m222m99M019J316l722
$$ -1627 1887 1742 -1879 -2094 948 2611 1039 -1751 -1495 2485 2844 -1378 -1877 2142 3458 -264
688b64j231K927J614k337j667J854J877j418k038P03K137n36j431O30L43j069
$$ -264 -1495 1432 3046 709 -958 896 2773 1355 -683 20 2157 1621 190 820 1163 94
704I4L65J269o99j103P61Q37r05j848J630J915j778k359J651J878j692j116J549
$$ 94 459 1728 1029 -74 687 1524 619 -1229 401 2316 538 -1821 -170 1708 16 -1100 449
721D49j8j110M81k94o54J400P64k497o17K650K97k795J11K048r2j477K6M60J161
$$ 449 431 -679 -198 -492 -1146 254 1018 -1479 -2096 554 851 -1944 -1833 215 123 -1354 -1328 -868 293
740B93q28j380N55J062J09q22m82J135M83m96j060M22R73j03j219M96J718r67
$$ 293 -535 -1915 -1360 -298 -189 -1011 -1493 -358 125 -371 -1431 -1009 -36 -139 -1358 -862 856 -111
758a11q07O16L14J06J9j65m54N46O01r03K10Q00p25L29J58r4l99R69J2m15l81
$$ -111 -918 -302 12 118 137 -28 -482 64 665 -238 -28 772 47 376 534 440 41 1010 1022 607 226
779B26J095l8j164Q6Q01K73q10n85R28N81j088l38O71L04j71n76N7N89J16m76
$$ 226 1321 1283 119 205 1006 1279 469 -116 812 1393 305 -33 638 942 771 195 252 841 957 481
799D81o22N96N37r27m16R69m4j48q31M1M54M3m86o05P30M66o55n67P32M8P2r60
$$ 481 -141 455 992 65 -351 618 574 426 -405 -364 90 133 -353 -958 -228 238 -417 -984 -252 -204 -132 -1092
821a092J20Q44K79j267k2Q21m8n27j98N02K61o03K68j45L32J89q15M79P20j63
$$ -1092 -972 -128 151 -1116 -1138 -317 -365 -892 -1090 -588 -327 -930 -662 -807 -475 -286 -1101 -622 98 -65
841f5j083N64L55Q2m73J34L77K74n8l60m3N20o7k02K40K39k45pj97K71M77k18
$$ -65 -1148 -584 -229 -147 -620 -486 -109 165 107 -253 -296 224 157 -45 195 434 189 182 -15 256 733 515
863E15k43L23O6j81Q3j42L6J66J15k91L76k9k65l47M49J76l75j00K95J76m55q0
$$ 515 272 595 661 480 563 421 457 623 738 447 823 794 529 182 631 807 432 332 627 803 348 268
885B68k2M88l55m26M04J79m97J22l78L77r8m3j97k60N16M0m20J25K13n68J58j4
$$ 268 246 734 379 -47 357 536 39 161 -217 160 62 19 -178 -438 78 118 -302 -177 36 -532 -374 -388
907c88M9l16qJ40r1K0L2k53K26L12k83n8o0L11J41k96j18K75L2p8j43M10M2j22
$$ -388 -339 -655 -663 -523 -614 -594 -562 -815 -589 -277 -560 -618 -678 -367 -226 -522 -640 -365 -333 -411 -554 -144 -102 -224
931b24M7k26k9M84O7o29M20N72l64n15O63K48o35L4K07J51m7P2j34j25L39N76
$$ -224 -177 -403 -432 52 119 -510 -90 482 118 -397 266 514 -121 -87 120 271 224 296 162 37 376 952
953I52q35O6M43L99p90l28O71J64l26m6J96R6l0j99l76M75J44l80m65L90P57n90
$$ 952 117 183 626 1025 235 -93 578 742 416 370 566 662 632 433 57 532 676 296 -169 221 978 388
975C88o62N18O01o90m40O45K7j93Q4m84m1L16J93p76l9N74L25m27n39N81L29j082
$$ 388 -274 244 845 155 -285 360 387 194 278 -206 -247 69 262 -514 -553 21 346 -81 -620 -39 290 -792
997g92K7O16L9k56kk35m38R48L11j047n10J299M1q48k65J491j73r71j99Q04J69
$$ -792 -765 -149 -110 -366 -368 -603 -1041 -93 218 -829 -1339 -40 1 -847 -1112 379 206 -765 -964 -160 9
1018Ij90k23j20L63K22j95l29K70O69q8j040M9J018m7p30l74J289N36j038m39
$$ 9 -181 -404 -524 -161 61 -134 -463 -193 476 388 -652 -603 415 368 -362 -736 553 1089 51 -388
1038c88P17O91m12j352O76J563p33j426N72J115j44q28N99J00o10N89J34j261
$$ -388 329 1020 608 -744 -68 1495 762 -664 -92 1023 879 51 650 750 140 729 863 -398
1056c98J46J355o20j164O62J725j037j821J002J832j460j155J251L74j135j45
$$ -398 -252 1103 483 -681 -19 1706 669 -1152 -150 1682 222 -933 318 692 -443 -588
1072e88R65k25o55J008P9j521L07J474q46j184N60J566r76j079P81Q32o15q04
$$ -588 377 152 -503 505 584 -937 -630 844 -2 -1186 -626 940 -36 -1115 -334 498 -117 -921
1090i21K02N35l7k33J7j01M34Q0o39k46P59K14n69l59M59L02L71r46l16J074L38
$$ -921 -719 -184 -221 -454 -437 -538 -104 -24 -663 -909 -150 64 -505 -864 -405 -103 268 -678 -994 80 418
1111D18j094o63J726P85j845n57J858J25j473pJ068k53m25P80L6j072J001P55
$$ 418 -676 -1339 387 1172 -673 -1230 628 753 -720 -727 341 88 -337 443 479 -593 408 1163
1129A163j184j034K100L56k287J93K146k13k002P02J411o75j142J017M34j090
$$ 1163 -21 -1055 1045 1401 -886 -693 1453 1240 -762 -60 1351 676 -466 551 985 -105
1145a05L22P85p01n57P25K34r31k12J363j62j174K06M87K28q10L75L70l47r5p7
$$ -105 217 1002 301 -256 469 703 -228 -440 923 761 -413 -207 280 508 -302 73 443 96 1 -76
1165g6m84P48J98o99m36Q09o5l67q3L60n84L20M07p67M3J028j8j609O39J243o73
$$ -76 -560 188 386 -313 -749 60 -5 -372 -455 -95 -679 -359 48 -719 -676 352 334 -1275 -636 607 -66
1186f6j186J087Q95j216l70O91J47o92N84N36m54n98R53l01o97L84J144q17j023
$$ -66 -1252 -165 730 -486 -856 -165 -18 -710 -126 410 -44 -642 311 10 -687 -303 841 24 -999
1205i99O21R80p55l53Q35M28j520P07Q13q87J98P21j65j159P79M67q32l3J066
$$ -999 -378 602 -153 -506 329 757 -763 -56 757 -130 68 789 624 -535 244 711 -121 -154 912
1224I12j23q55K19N38m19k95O75k01k30o0O5l39L56L25j79o01L11K79Qo47O79
$$ 912 789 -66 153 691 272 -23 652 451 221 161 226 -113 243 568 389 -212 99 378 386 -261 418
1245D18j69n90O20K86p96Q0O11n31p33Q15O07j197J34O73j09q76N20N67m98l95
$$ 418 249 -341 279 565 -231 -151 460 -71 -804 11 618 -579 -445 228 119 -757 -237 330 -168 -563
1265e63O19m19m04N02M25o38l63Q44Q3p49K28M76m86n20R72L85j148K17O33l17
$$ -563 56 -363 -767 -265 160 -478 -841 3 86 -663 -435 41 -445 -965 7 392 -756 -539 94 -223
1285b23l72N41J52r07Q2J426q33m79O25M66j134K04Q88l03m80O04L10p08j14O49
$$ -223 -595 -54 98 -809 -727 699 -134 -613 12 478 -656 -452 436 133 -347 257 567 -141 -255 394
1305C94k13o21N97L73n65j27O72k23k61K76M45o11n4P15m85j74L06K81p79K53
$$ 394 181 -440 157 530 -35 -162 510 287 26 302 747 136 82 797 312 138 444 725 -54 199
1325A99L24j41o53P17L16j109K82P63m71n30O64J01o99J4N70j99p03N89L83o21
$$ 199 523 382 -271 446 762 -347 -65 698 227 -303 361 462 -237 -223 347 148 -555 34 417 -204
1345b04k61N85j5o07N98N0k88l42M76kn59L31Q17j020J34J76O2l71K69J24j29
$$ -204 -465 120 105 -502 96 146 -142 -484 -8 -10 -569 -238 579 -441 -307 -131 -69 -440 -171 -47 -176
1366a76l01L05N71p47J16P3j24k61N69j4o06N8R71o79l11K96L53n39J56P00m50
$$ -176 -477 -172 399 -348 -232 -159 -283 -544 25 11 -595 -537 434 -245 -556 -260 93 -446 -290 410 -40
1387d0k36O05rl74o7M09l10l4L53L19m52l28O24k80l86N05K82l48j9M04n53l08
$$ -40 -276 329 320 -54 -121 288 -22 -56 297 616 164 -164 460 180 -206 299 581 233 214 618 65 -243
1409b43M19K48l88J7M39M2o82J24L23k23j37N54n50J3K41J35n15M7N51l31l90
$$ -243 176 424 36 53 492 534 -148 -24 299 76 -61 493 -57 -44 197 332 -183 -136 415 84 -306
1430c06L13L06n95K79J48k07j52K57J18n06l99Q04k08k53K69J57m17j93N41q3
$$ -306 7 313 -282 -3 145 -62 -214 43 161 -345 -744 60 -148 -401 -132 25 -392 -585 -44 -127
1450a27k50r5N36l59k16N05p5j70P2K51l98k47L58J91l44l7N66j73k47K42J14
$$ -127 -377 -472 64 -295 -511 -6 -81 -251 -179 72 -326 -573 -215 -24 -368 -405 161 -12 -259 -17 97
1471I7k89j46M60l01L1M24l05K5k07O10l68l14N04J16l69m5K78K02l62L88j59
$$ 97 -192 -338 122 -179 -148 276 -29 -4 -211 399 31 -283 221 337 -32 -77 201 403 41 429 270
1492B70k89L55r1k84o8K72k07J72k17L30Kr3L9p9J29k02K19q4j18J82j13j88M18
$$ 270 -19 336 245 -39 -107 165 -42 130 -87 243 245 152 191 112 241 39 258 174 56 238 125 -63 355
1515C55l02K66m75M6L09l04lL0L1L2n2j2k46K83k8J5n14M47l5o0M1N4R9l08l7
$$ 355 53 319 -156 -110 199 -105 -108 -78 -47 -15 -67 -79 -325 -42 -70 -55 -569 -122 -157 -217 -176 -122 -23 -331 -368
1540c68M9J4QP5k23q2N3O29l81o2J17J57j86j43K81J05m17K07j47K93L0l81J75
$$ -368 -319 -305 -297 -222 -445 -527 -474 155 -226 -288 -171 -14 -200 -343 -62 43 -374 -167 -314 -21 9 -372 -197
1563a97J74Q5k81K60L5L8k8J23l61L49J01l1k01J07L6l51O5K12L08m75M1j9L36
$$ -197 -23 62 -219 41 76 114 86 209 -152 197 298 267 66 173 209 -142 -77 135 443 -32 9 -10 326
1586C26K17m92K01K56k19j56R6m6o2J11o3j39J20P1o1p9J96k24J86o0j21mN48
$$ 326 543 51 252 508 289 133 229 183 121 232 169 30 150 221 160 81 277 53 239 179 58 54 602
1609F02o52j24J75J51k41k24K93j52n7K3J04m08M0M56k11l42L24K60l80j28J61
$$ 602 -50 -174 1 152 -89 -313 -20 -172 -229 -206 -102 -510 -470 -14 -225 -567 -243 17 -363 -491 -330
1630c30N28n63J2K65J78m84k57M63L42n92J50K56k48Q5J00J86l73L37q3K18o02
$$ -330 198 -365 -353 -88 90 -394 -651 -188 154 -438 -288 -32 -280 -195 -95 91 -282 55 -28 190 -412
1651d12L62N03m65j75Q6K35m5j91m6N62m84j9K92J12l29O3K22k6m7p6RJ10j83
$$ -412 -50 453 -12 -187 -101 134 89 -102 -148 414 -70 -89 203 315 -14 49 271 245 198 122 131 241 58
1674E8K18R1m29j57O23k63j99M41K18m39j99L05M72o63J19L77n02j30L07M4m4
$$ 58 276 367 -62 -219 404 141 -58 383 601 162 -37 268 740 77 196 573 71 -59 248 292 248
1695B48m59L31J29o87M56J77n9n64Q2N30j10n10M42K57m95R8P6N2o7j92K60l11
$$ 248 -211 120 249 -438 18 195 136 -428 -346 184 74 -436 6 263 -232 -134 -58 -6 -73 -265 -5 -316
1717c16J27L91k62k49K09j16K47j72K7o4p3J23j51J66K35l06o4k99M55k3j03M07
$$ -316 -189 202 -60 -309 -100 -216 31 -141 -114 -178 -251 -128 -279 -113 122 -184 -248 -547 -92 -115 -218 189
1739A89k20k51K96J10m04J15K42R7k92K59J84k00k59L8L73j34Q0kj68l2j26J26
$$ 189 -31 -282 14 124 -280 -165 77 174 -118 141 325 125 -134 -96 277 143 223 221 53 21 -105 21
1761B1M22j57j00K25k44M0J3J89l57O0K04m16J73Q3j35j0j7J66j36J74j59J13
$$ 21 443 286 186 411 167 207 220 409 52 112 316 -100 73 156 21 11 -6 160 24 198 39 152
1783A52l1J1rl19j12N57k59l44R4L11O2j40k27K49k48J47o7L34l76K87k25m4K61
$$ 152 121 132 123 -196 -308 249 -10 -354 -260 51 113 -27 -254 -5 -253 -106 -173 161 -215 72 -153 -197 64
1806F4q0l02%K01J6k50L52M5l16RJ12K11k49N8m1j39n2L08O7j85J55j17j33J09
$$ 64 -16 -318 -318 -117 -101 -351 1 46 -270 -261 -149 62 -187 -129 -170 -309 -361 -53 14 -171 -16 -133 -266 -157
1830a57K3J93K05o23N28r3k23J18L29l30M2M94l54l76M28K51o52J77L39P9l27
$$ -157 -134 59 264 -359 169 76 -147 -29 300 -30 12 506 152 -224 204 455 -197 -20 319 398 71
1851G1L76jl92J40j27J67k64L93q1k49mK02k8M0J71J26m92o0o0m4j57L45J58k53
$$ 71 447 446 54 194 67 234 -30 363 282 33 29 231 203 243 414 540 48 -12 -72 -116 -273 72 230 -23
1875b3J11J53k23l33L31J61k67O2L01l59j44N09k12k0l84K94k04L2K95o9l32R
$$ -23 88 241 18 -315 16 177 -90 -28 273 -86 -230 279 67 47 -337 -43 -247 -215 80 11 -321 -312
1897c12K34N5j42j40L10o08L26J4J69k54m4J52k53L22M4J06j46N8K74l73q5J54
$$ -312 -78 -23 -165 -305 5 -603 -277 -263 -94 -348 -392 -240 -493 -171 -127 -21 -167 -109 165 -208 -293 -139
1919a39J46L4j23P8j04j70K90L32m44L67k5j1l83K20Kq3J0J15k40Q7J01J94k69
$$ -139 7 41 -82 -4 -108 -278 12 344 -100 267 242 231 -152 68 70 -13 -3 112 -128 -41 60 254 -15
1942a5kL53k71j69J50J61m6o3M33o67J89J13L01m40k31M92k71J7k01M36K6p3j64
$$ -15 -17 336 65 -104 46 207 161 98 531 -136 53 166 467 27 -204 288 17 34 -167 269 295 222 58
1965E8j14m7M6Q2r3J60k05p4J56L3N8j98k09M70k23j26Q8j43J50O8M7k60j2J19
$$ 58 -56 -103 -57 25 -68 92 -113 -187 -31 2 60 -138 -347 123 -100 -226 -138 -281 -131 -63 -16 -276 -288 -169
1989a69L34l52ok7J52j91jR4J44k38J92k0k58K60N4J62l38P2L8k6J8M1J60k69
$$ -169 165 -187 -193 -220 -68 -259 -260 -166 -22 -260 -68 -88 -346 -86 -32 130 -208 -136 -98 -124 -106 -65 95 -174
2013a74L83k98j23P7K43j01QK61q4j29j45m2J53j5L00j57j05J34mj39P8j28J09
$$ -174 209 -89 -212 -135 108 7 15 276 192 63 -82 -124 29 14 314 157 52 186 182 43 121 -7 102
2036A02J0j08M05l32K93j20j21J31ok39P8K20j54N9r6%R1j29k21J71j16ML13k71
$$ 102 112 4 409 77 370 250 129 260 254 15 93 313 159 218 122 122 213 84 -137 34 -82 -78 235 -36
2060c6j36r5L14K92k27m24L16K11m56k12K21L25j20R4j96n7M60m49Q6j68L01k3
$$ -36 -172 -267 47 339 112 -312 4 215 -241 -453 -232 93 -27 67 -129 -186 274 -175 -89 -257 44 21
2082B1k34K50k18k07J95K01j41n6j03M46k05P7j4j86L5K37m4j03n9qJ30L5K72
$$ 21 -213 37 -181 -388 -193 8 -133 -189 -292 154 -51 26 12 -174 -139 98 54 -49 -108 -116 14 49 321
2105C21k39nj00J85L2l47L80j03j39j07N10q3k64n5R6K27j23r4J39O4j29Pp1J44
$$ 321 82 77 -23 162 194 -153 227 124 -15 -122 388 305 41 -14 82 309 186 92 231 295 166 173 102 246
2129B46J86l77J05O8k6k03P8L4j19J07k2J04k98L50l29R3oJ26j62j67J56J13q2
$$ 246 432 55 160 228 202 -1 77 111 -8 99 77 181 -117 233 -96 -3 -9 117 -45 -212 -56 57 -25
2152b5J58l55K82Jq0j31j37J68M3K54m29j23K43K24n21K67J20K2j72K12j89J86
$$ -25 133 -222 60 61 -19 -150 -287 -119 -76 178 -251 -374 -131 93 -428 -161 -41 -19 -191 21 -168 18
2174A8m90M26r4J89k59K1K52r9j05j66M16j47j4R3R9k37K03j04p3O1j0J39j44
$$ 18 -472 -46 -140 49 -210 -189 63 -36 -141 -307 109 -38 -52 41 140 -97 106 2 -71 -10 -20 119 -25
2197b5j05qL88l64K31o6L7K0l4m4J55j13pl71M37J15k2j32r9J21o9L10p1m5P1
$$ -25 -130 -138 250 -114 117 51 88 108 74 30 185 72 65 -306 131 246 224 92 -7 114 45 355 284 239 310
2222C10l61J33K60j67l06K80l91M73l3k34m9%r2M54m85K51k78N2K28j47j09l8
$$ 310 -51 82 342 175 -131 149 -242 231 198 -36 -85 -85 -177 277 -208 43 -235 -183 45 -102 -211 -249
2244b49M53m02J26J99O6j85j85O6L32n03L00j40o0j11M44j78l63N12m0l81K28
$$ -249 204 -198 -72 127 193 8 -177 -111 221 -282 18 -122 -182 -293 151 -27 -390 122 82 -299 -71
2265g1N0r2K74l23Q2j35j4P0K23k87K12q7l3k62N61J13o37M21l5k2l2J68k04K4
$$ -71 -21 -113 161 -162 -80 -215 -229 -159 64 -223 -11 -98 -131 -393 168 281 -356 65 30 8 -24 144 -60 -36
2289c6J37n8R2k38J91m3R4j30O1KQ4K85l38k97M64j45J83j91k34K51j67m2L34
$$ -36 101 43 135 -103 88 45 139 9 70 72 156 441 103 -194 270 125 308 117 -117 134 -33 -75 259
2312B59k38k08L42M7N0J2J4n05N03jo72K86L55Mk59L4j46J4m0M8K18m22K10j09
$$ 259 21 -187 155 202 252 264 278 -227 276 275 -397 -111 244 248 -11 23 -123 -109 -149 -101 117 -305 -95 -204
2336b04o5L78l51Q0M73o50K89K50m91L0J42O0P3j73j0J0n0J83l89K05M7K3j31
$$ -204 -269 109 -242 -162 311 -339 -50 200 -291 -261 -119 -59 14 -159 -169 -159 -209 -26 -415 -210 -163 -140 -271
2359b71J90k60K03J71O3J39l48J86P7k40p1K50m9j10J15K01k82k08M25k5k55K94
$$ -271 -81 -341 -138 33 96 235 -113 73 150 -90 -161 89 40 -70 45 246 -36 -244 181 156 -99 195
2381A95j50M7J45j02J75l32J21L43l68l49N00O9o0k65J03J12l84M46j9k88q0K18
$$ 195 45 92 237 135 310 -22 99 442 74 -275 225 294 234 -31 72 184 -200 246 227 -61 -141 77
2403G7L86o30K10P4k01K46j13P1k11N7J41l31L34m8M7p8p5J03j8j26Q3M8j39J5
$$ 77 463 -167 43 117 -84 162 49 120 -91 -34 107 -224 110 62 109 31 -44 59 41 -85 -2 46 -93 -78
2427g8l0k48L02R6j54p8J47J15k67n2K38M9jr6J22k19J66O0K91m15J80j20O7j61
$$ -78 -108 -356 -54 42 -112 -190 -43 72 -195 -247 -9 40 39 -57 65 -154 12 72 363 -52 128 8 75 -86
2451h6K6J11j78J56o7j10k6J32J01J40l5q9L3O4j42J1P1L3k26J25j83L10K53m41
$$ -86 -60 51 -127 29 -38 -148 -174 -42 59 199 164 75 108 172 30 41 112 145 -81 44 -139 171 424 -17
2475a7J44j25j58J00L18k6l88K32J57j49K69k40Nl92L51Q1l32L10J26l24M35k09
$$ -17 127 2 -156 -56 262 236 -152 80 237 88 357 117 122 -270 81 162 -170 140 266 -58 377 168
2497A68j35L24j59l3j46K8j89R3K84k68O1J89q1n0j00J7P4N1j80K05j74j13K57
$$ 168 33 357 198 165 19 47 -142 -49 235 -33 28 217 136 86 -14 3 77 128 -52 153 -21 -134 123
2520A23l06K33R4k78o3L04m66J94J6M7j32K30o7Q5j65L3L3J10N4l53J6P0L16m0
$$ 123 -183 50 144 -134 -197 107 -359 -165 -149 -102 -234 -4 -71 14 -151 -118 -85 25 79 -274 -258 -188 128 88
2544H8mk92L39j45p6K46L1J70m03M74l79j35L9P1K46k86q5K03Q7j53J59p9l67
$$ 88 84 -208 131 -14 -90 156 187 357 -46 428 49 -86 -47 24 270 -16 -101 102 189 36 195 116 -251
2567b51L78J29k68J40N4M4m20L01m9r0J05k07J42R4J85k85j26J22K69j23j04q1
$$ -251 127 256 -12 128 182 226 -194 107 58 -32 73 -134 8 102 287 2 -124 -2 267 144 40 -41
2589d1p5K56j97J92m15P8m2K31j31L67l25L10p4k44J90k27N1J43J7j69o5L23j0
$$ -41 -116 140 -57 135 -280 -202 -244 -13 -144 223 -102 208 134 -110 80 -147 -96 47 64 -105 -170 153 143
2612A43l15L24J8l77J22M0Qj14K82j35m2M5j10J83k7k1p4J30j66l3J71l7J16l41
$$ 143 -172 152 170 -207 -85 -45 -37 -151 131 -4 -46 -1 -111 72 45 24 -50 80 -86 -119 52 15 131 -210
2636b10L08P4j40k1K06l52L08j84K9J10J8k02J90j35L9m5r6J99l66O19l04l02
$$ -210 98 172 32 11 217 -135 173 -11 18 128 146 -56 134 -1 38 -7 -103 96 -270 349 45 -257
2658b57K73J61r7j03q8K9j03L55Q3j10j77R0K67k23p9Mk23K27Q8m8J57k14J48
$$ -257 16 177 80 -23 -111 -82 -185 170 253 143 -34 56 323 100 21 25 -198 29 117 69 226 12 160
2681A60K7j78J04P1k28k60J88K06q6j5j45J09m4K91q6J58k43o8J12o6j06K68k58
$$ 160 187 9 113 184 -44 -304 -116 90 4 -11 -156 -47 -91 200 114 272 29 -39 73 7 -99 169 -89
2704h9J84j78k65L75K01n58L26K39l56R1l17K76l5P3O7k3l09M2K92j33R0J91j06
$$ -89 95 -83 -348 27 228 -330 -4 235 -121 -30 -347 -71 -106 -33 34 11 -298 -256 36 -97 -7 184 78
2727G8P1k43L54j65J79j71j85J80Q6j21j26K90k51J53J3k79j15M27l0m73N38M2
$$ 78 149 -94 260 95 274 103 -82 98 184 63 -63 227 -24 129 142 -137 -252 175 145 -328 210 252
2749B52n7n1nm8j11J4K67M7k65R1J27j11NP0k82O7mJ75j93k35L10L06J05n18j30
$$ 252 195 144 139 91 -20 -6 261 308 43 134 261 150 155 225 -57 10 6 181 -12 -247 63 369 474 -44 -174
2774a74K20l05K97j01J60j66l4Jm3r9N1jK98l87M3R2K58k2R8k29Ql50J66L54k53
$$ -174 46 -259 38 -63 97 -69 -103 -102 -145 -244 -193 -194 104 -283 -240 -148 110 88 186 -43 -35 -385 -219 135 -118
2799a18Q3l9%k6r2L19j99k10L13p6l2m2L37m61J25L93m70L36m6j88J10J63l76
$$ -118 -35 -74 -74 -100 -192 127 -72 -282 31 -45 -77 -119 218 -243 -118 275 -195 141 95 -93 17 180 -196
2822a96J22K43k93J11n2K67l71L57n4r3J0J06l7r5J49j46n7r3J11J29l30K31J92
$$ -196 -74 169 -124 -13 -65 202 -169 188 134 41 51 157 120 25 174 28 -29 -122 -11 118 -212 19 211
2845B11l95K32L1L44m65K7J95m52K72q8R9j23J5J97j79Q8J04k27j86oP54o38L07
$$ 211 -184 48 79 423 -42 -15 180 -272 0 -88 11 -112 -97 100 -79 9 113 -114 -300 -306 448 -190 117
2868A17J9q8k15K59k23J81l50J17L90l06R8J90l89J98J79l69J22kK9rr8l44M41
$$ 117 136 48 -167 92 -131 50 -300 -183 207 -99 -1 189 -200 -2 177 -192 -70 -72 -43 -52 -150 -494 -53
2891e3P4l10N8K95n35L43J2J78p1r2J2j6L18lk76j07oL47m65L42k88J18L32P3
$$ -53 21 -289 -231 64 -471 -128 -116 62 -9 -101 -89 -105 213 210 -66 -173 -179 168 -297 45 -243 -125 207 280
2915B80k28j1J00J6k42J44J99j84k09L27k56j1N5L16k19j61J06K27l3r7j99K55
$$ 280 52 41 141 157 -85 59 258 74 -135 192 -64 -75 -20 296 77 -84 22 249 216 119 -80 175
2937A75k42K93j11j26L25l28j04o4K52o6R3N4lj91J35j05K2j74p2M25k21k66K49
$$ 175 -67 226 115 -11 314 -14 -118 -182 70 4 97 151 148 -43 92 -13 9 -165 -237 188 -33 -299 -50
2960e0N0j06k06K81j08J42J09l24JP8K94k17J09l3J09k27Q9J54m24K33j29K85
$$ -50 0 -106 -312 -31 -139 3 112 -212 -211 -133 161 -56 53 20 129 -98 -9 145 -279 -46 -175 110
2982A10mj65j71K97j13j43M27l52j06K90j78j93L85LJ21k01N25m38j49J28Ko3
$$ 110 106 -59 -230 67 -46 -189 238 -114 -220 70 -108 -301 84 87 208 7 532 94 -55 73 75 12
3004A2j03K6J86j63K86P6k53J48r6K06j41R1j56J1k4m50L82K11k63l8L21l22j12
$$ 12 -91 -65 121 -42 244 320 67 215 119 325 184 275 119 130 106 -344 38 249 -14 -52 269 -53 -165
3027a65L12j46K84m65N34m96L1J14r2j67M29k39K25j51l8J5J70l84L29J06n03
$$ -165 147 1 285 -180 354 -142 -111 3 -89 -256 173 -66 159 8 -30 -15 155 -229 100 206 -297
3048b97K91l53K46J86L6l32m1J64n8O4j36J17r6K10J06q1l9R9k4j34j90M63n16
$$ -297 -6 -359 -113 73 109 -223 -264 -100 -158 -94 -230 -113 -209 1 107 26 -13 86 62 -72 -262 201 -315
3071c15j00K83j72j24J96RJ63R6k8J6m1j8nN6j03L18k79J98k07K33L6l71M4K71
$$ -315 -415 -132 -304 -428 -232 -223 -60 36 8 24 -17 -35 -40 16 -87 231 -48 150 -57 176 212 -159 -115 156
3095A56j27Q0Q5J16k16j66J33O6R4j82j23k72P66n38L25k15L04r4l20J97k28K38
$$ 156 29 109 194 310 94 -72 61 127 221 39 -84 -356 410 -128 197 -18 286 192 -128 69 -159 79
3117G9%J41k94p4R8J23j13K72k12j21J37K6L8O4k71K60o6q8J39l07J82NJ21k59
$$ 79 79 220 -74 -148 -50 73 -40 232 20 -101 36 62 100 164 -107 153 87 -1 138 -169 13 18 139 -120
3141a20J35j24O2J3n6l04M76l53K07j57J87n9J19k92K62p8j43J60p3K14P8l53
$$ -120 15 -109 -47 -34 -90 -394 82 -271 -64 -221 -34 -93 26 -266 -4 -82 -225 -65 -138 76 154 -199
3163a99K53J14l11j06K53K4J49m4J4J2k56K13q2J6J80j07J42k18j56K81j73P2
$$ -199 54 168 -143 -249 4 28 177 133 147 159 -97 116 34 50 230 123 265 47 -109 172 -1 71
3185G1J12l41l8K77j55J64n5J71p2k34J39R6m4P4j60J3j47K40p2k44J77M1r5K49
$$ 71 183 -158 -196 81 -74 90 35 206 134 -100 39 135 91 165 5 18 -129 111 39 -205 -28 13 -82 167
3209A67j12j21R4n1J91j18j72J43J71j0j52k22K90l30K99j50O2k2j08Q1o5K23
$$ 167 55 -66 28 -23 168 50 -122 21 192 182 30 -192 98 -232 67 -83 -21 -43 -151 -70 -135 88
3231H8j79K74k23K17L6k57J31J22k44j7J30k24n7J97j72N2J12j22R7M37l69J24
$$ 88 -91 183 -40 177 213 -44 87 209 -35 -52 78 -146 -203 -6 -178 -126 -14 -136 -39 398 29 153
3253A53m59J13K3K14J22l02M62m98j67L09L00k32j65n7M55o9J42j90J81l43q6
$$ 153 -306 -193 -170 44 166 -136 326 -172 -339 -30 270 38 -127 -184 271 202 344 154 335 -8 -94
3274i4j12J4K50N0k3J7Mj35L10m57K51n9L5J25q0n8K20l43J6J22J41k16J22k64
$$ -94 -206 -192 58 108 85 102 106 -29 281 -176 75 16 51 176 96 38 258 -85 -69 53 194 -22 100 -164
3298a64J88j29K25j83j85L68J2m4r9J43n2m2L0l97K34M3k2j39JJ73Qp6K02j11
$$ -164 24 -105 120 -63 -248 120 132 88 -11 132 80 38 68 -329 -95 -52 -74 -213 -212 -39 -31 -107 95 -16
3322a6J20l8o5R2k83K97j06K17j91k76L49n37L74Kj42K60J64l57J88j79J59M7
$$ -16 104 66 1 93 -190 107 1 218 27 -249 100 -437 -63 -61 -203 57 221 -136 52 -127 32 79
3344G9j85K03k22L00m2j66N7lj66L13j78M87m22K15l4R7l71o3K42r2j48J08K98
$$ 79 -106 97 -125 175 133 -33 24 21 -145 168 -10 477 55 270 236 333 -38 -101 141 49 -99 9 307
3367C07k20j3j7m0J71m29N41j80k2l50P5J78L4M0J76q4j06Q2Lk79j29O89p33K64
$$ 307 87 74 57 17 188 -241 300 120 98 -252 -177 1 35 75 251 167 61 143 146 -133 -262 427 -306 -42
3391d2J60j90K65k70P7P5k08J44n0J76k73m5P8M6o4K98k02R9P3m60L30n4M6r0
$$ -42 118 -72 193 -77 0 75 -133 11 -39 137 -136 -181 -103 -57 -121 177 -25 74 147 -313 17 -37 9 -81
3415h1L59m22j27K13P9j54Q5j06r5L05j12J3k6L4K23pm67J04K98k44k04L58n1
$$ -81 278 -144 -271 -58 21 -133 -48 -154 -249 56 -56 -43 -69 -35 188 181 -286 -182 116 -128 -332 26 -25
3438b5J6j34RL95l81J03J42k47K16J49j73J17k24j55J33J87k68L84p0r5o2M2j69
$$ -25 -9 -143 -134 261 -120 -17 125 -122 94 243 70 187 -37 -192 -59 128 -140 244 174 79 17 59 -110
3461a10j09M60j21o1k07j69K30RK68p3P7j18j96N78n12k3n1N11j23l63K34j60
$$ -110 -219 241 120 59 -148 -317 -87 -78 190 117 194 76 -120 458 -54 -77 -128 383 260 -103 131 -29
3483b9J55j42j7p2J08k21L61p5O9j14pl0o6P9J67nk21Mo0p9J43l8J2J92l78L99
$$ -29 126 -16 -33 -105 3 -218 143 68 137 23 16 -14 -80 -1 166 161 -60 -56 -116 -195 -52 -90 -78 114 -264 135
3509A35j27k41L11p9M8j72k92M14R9p8j73J14J49k51J8K6K2JJ33p9J6j7J75l30
$$ 135 8 -233 78 -1 47 -125 -417 -3 96 18 -155 -41 108 -143 -125 -99 -77 -76 57 -22 -6 -23 152 -178
3533a78M13j51j37j74L24P0P3k82K03k58J72N7j50j46K13J41j40J00k81J7J4P
$$ -178 235 84 -53 -227 97 167 240 -42 161 -97 75 132 -18 -164 49 190 50 150 -131 -114 -100 -93
3555i3J3M9L15n26J38N9J25J16k51L00k92J47j40J15k56L04k24J52j08J67n5k51
$$ -93 -80 -31 284 -242 -104 -45 80 196 -55 245 -47 100 -40 75 -181 123 -101 51 -57 110 55 -196
3577a96J97n0j64L31k66j78J29K8J14pR4k85K78J54j65j35L87k93qJ31p0k50K6
$$ -196 1 -49 -213 118 -148 -326 -197 -169 -55 -62 32 -253 25 179 14 -121 266 -27 -35 96 26 -224 -198
3600a98K22Ll9O3j32L18k62k25J21J57j00q3J76jK3o1N1P5j46J05q1K82l60J89
$$ -198 24 27 -12 51 -81 237 -25 -250 -129 28 -72 -155 21 20 43 -18 33 108 -38 67 -14 268 -92 97
3624I7k24J90Pj47K29k48o4j89J70J06K14j57%k29L12O2P5l73K46Nk99N00j54
$$ 97 -127 63 70 -77 152 -96 -160 -349 -179 -73 141 -16 -16 -245 67 129 204 -169 77 82 -217 283 129
3647A29K3j72J06l1p4l0j13L12r1K1k85K97k52J48K33j49j88j23R1K4K44k56k7
$$ 129 152 -20 86 55 -19 -49 -162 150 59 80 -205 92 -160 -12 221 72 -116 -239 -148 -124 120 -136 -163
3670a63R4j24J03K09n54N73l07L2l61N82k02p3L75k11O3k43M53j71o6ql55L74
$$ -163 -69 -193 -90 119 -435 138 -169 -137 -498 84 -118 -191 184 -27 36 -207 246 75 9 1 -354 20
3692B0k37J04J61j7n3L20n61K22P1j22k09K83J73k28K0N0k00J98n3J65k07J30
$$ 20 -217 -113 48 31 -22 298 -263 -41 30 -92 -301 -18 155 -73 -53 -3 -203 -5 -58 107 -100 30
3714C0o7Q3q1K47K0j1k59Ql3J03m9K32j14j01P3M1J17k54k57L03k98J71R5r3L8
$$ 30 -37 46 -35 212 232 221 -38 -30 -63 40 -9 223 109 8 81 122 239 -15 -272 31 -267 -96 -1 -94 -56
3739e6J7J43J14o2M1k11k90j4M46J08l91j20Q4L74l16o3J46M0q6J99j49p8K15
$$ -56 -39 104 218 156 197 -14 -304 -318 128 236 -155 -275 -191 183 -133 -196 -50 -10 -96 103 -46 -124 91
3762I1k79qk4L37m59J63K28nok89J37K9J5j24O9R0K89k16q3J72l87L02k85O76
$$ 91 -188 -196 -220 117 -342 -179 49 44 38 -251 -114 -85 -70 -194 -125 -35 254 38 -45 127 -260 42 -243 433
3786D33l81k91N07j59o5m53M45l9Q8k62K83j24N1J19j4Nr4N9j49p7m7M01l07M
$$ 433 52 -239 268 109 44 -409 36 -3 85 -177 106 -18 33 152 138 143 49 108 -41 -118 -165 236 -71 -67
3810f7r9K62j07j62R2J73l5J88k07L3j12LK13j50J15j50k01J83K3L6l2K79l43
$$ -67 -166 96 -11 -173 -81 92 57 245 38 71 -41 -38 175 25 140 -10 -211 -28 -5 31 -1 278 -65
3833f5r2K9MQ3N1p5N6K12k45K9N9j02QK20j71n4j91j82L89J52m2j99L24l95K58
$$ -65 -157 -128 -124 -41 10 -65 -9 203 -42 -13 46 -56 -48 172 1 -53 -244 -426 -37 115 73 -126 198 -197 61
3858F1O8o0R4P4k66j71K58o3j67K45j71j6P4J19j1J59k76O3K04k35J67j19J10
$$ 61 129 69 163 237 -29 -200 58 -5 -172 73 -98 -114 -40 79 68 227 -49 14 218 -17 150 31 141
3881A41l32J42J43L2k44K40K7k20J85j64j09P8K26n4k84N0K3J49k5j54J47J82
$$ 141 -191 -49 94 126 -118 122 149 -71 114 -50 -159 -81 145 91 -193 -143 -120 29 4 -150 -3 179
3903A79j40p6J41j1j32j23P0j03J78LN7o1J03K3q3p0J95k10J1L6k8J63n9p2R9
$$ 179 39 -37 104 93 -39 -162 -92 -195 -17 -14 43 -18 85 108 25 -45 150 -60 -49 -13 -41 122 63 -9 90
3928I0l38L26m5q2l1M8K00J9n86M50l17r8M7K95p7J34k16K19J52k42L2J7L26o16
$$ 90 -248 78 33 -49 -80 -32 168 187 -399 51 -266 -364 -317 -22 -99 35 -181 38 190 -52 -20 -3 323 -293
3952b93K60M9J57r7N9l9l42J58o8P2J06j06L47l2m50N8L3K33Pj76O6j49J26k10
$$ -293 -33 16 173 76 135 96 -246 -88 -156 -84 22 -84 263 231 -219 -161 -128 105 112 -64 2 -147 -21 -231
3976b31K60M6J63j43j71k7k7M13m22K16j66j33J79j06N77n50J02Rj43L22j87P7
$$ -231 29 75 238 95 -76 -103 -130 283 -139 77 -89 -222 -43 -149 428 -122 -20 -11 -154 168 -19 58
3998E8L2j32p0N9J40j23k92L04J13m16K49K03l58K16J55pj94j61K89R1P7j26j04
$$ 58 90 -42 -112 -53 87 -36 -328 -24 89 -327 -78 125 -233 -17 138 131 -63 -224 65 156 233 107 3
4021CM5j90Q1q4K24k21k2L00k07Q0J32j39j90M25j15k28M8j33Q8K4J8l9J45j57
$$ 3 48 -142 -61 -145 79 -142 -164 136 -71 9 141 2 -188 237 122 -106 -58 -191 -103 -79 -61 -100 45 -112
4045a12o6p6K75J16k09L33m48j19L24K2k35j36K90J15j46J22k05J41R9Q7l11J17
$$ -112 -178 -254 21 137 -72 261 -187 -306 18 40 -195 -331 -41 74 -72 50 -155 -14 85 172 -139 -22
4067b2k3l4L42m24K03j01R3n4j51K05K14j53j45J57j06j50K82j1l80M8L39N5k03
$$ -22 -45 -79 263 -161 42 -59 34 -20 -171 34 248 95 -50 107 1 -149 133 122 -258 -210 129 184 -19
4090a9L34j01m27O0K37P6k12N3J87J5k65M30j47k99K13j57k1j45R5q2K13j86l12
$$ -19 315 214 -213 -153 84 160 -52 1 188 203 -62 368 221 -78 135 -22 -43 -188 -93 -175 38 -148 -460
4113d60Q56j27p6k64rO5L21j08n02J91j63L42p2M2Q6k94K57K01j36j95K91n70
$$ -460 396 269 193 -71 -80 -15 306 198 -304 -113 -276 66 -6 36 122 -172 85 286 150 -45 246 -324
4135c24M99k06k13l7l9L45l31L67o4P3J86m81J12K07o0Q5j78K69j38k46k6J14
$$ -324 175 -31 -244 -281 -320 25 -306 61 -3 70 256 -225 -113 94 34 119 -59 210 72 -174 -200 -86
4157h6N9J99k18N0K07J5K26l53J68N3l01J96j82K4J06k67J89k42J98k74J76P3
$$ -86 -27 172 -46 4 211 226 452 99 267 320 19 215 33 57 163 -104 85 -157 41 -233 -57 16
4179A6q7o7J20J11l4Jl63K94p6Q7O5r9L8J1j35L79k10r4mK0j39J29n2m4J99l26
$$ 16 -71 -138 -18 93 59 60 -303 -9 -85 2 67 -32 6 17 -118 261 51 -43 -47 -27 -166 -37 -89 -133 66 -260
4205b60J25J67j85M34l15P3q8P7o4P3J01l60K91q9K52j25l22J97j08M37m47j93
$$ -260 -135 32 -153 281 -34 39 -49 28 -36 37 138 -222 69 -20 232 107 -215 -18 -126 311 -136 -329
4227c29K45P0J09J5O8p0j47J27j96L15m27J82R3l08J3L72j29j17J47j83J90J5
$$ -329 -84 -14 95 110 178 108 -39 88 -108 207 -220 -38 55 -253 -240 132 3 -114 33 -150 40 55
4249E5K06k19K5j53N3J51J7J62k18j08j06J84J49k94J44J71j92j78K29k7M1J37
$$ 55 261 42 67 -86 -33 118 135 297 79 -29 -135 49 198 -96 48 219 27 -151 78 51 92 229
4271B29k97N2o2k6P3K22k22k53J72K08o4J3K9P5k64K0L49k40m1j24K31l42k9Q1
$$ 229 -68 -16 -78 -104 -31 191 -31 -284 -112 96 32 45 74 149 -115 -95 254 14 -27 -151 80 -262 -291 -210
4295b10J96l41L40J01l4j8k2r7j6o4J54J13j84K18k87K65k6l5O0j67m4Q0J57p5
$$ -210 -14 -355 -15 86 52 34 12 -85 -101 -165 -11 102 -82 136 -151 114 88 53 113 -54 -98 -18 139 64
4319F4K53j42k58K10k45M9n8L62k62J5q7j8m4M4J61k76R3M03r7k36q1L9O8j37
$$ 64 317 175 -83 127 -118 -69 -127 235 -27 -12 -99 -117 -161 -117 44 -232 -139 264 167 -69 -150 -111 -43 -180
4343a80K36NK21N5j77l40L56P6l56Q4k48K53J55k41K27Rq4m8k6k7K23j76J21j4
$$ -180 56 61 282 337 160 -180 176 252 -104 -20 -268 -15 140 -101 126 135 51 3 -23 -50 173 -3 118 104
4367A04l13K54J6j27n3j22J44J86j17n5P6P8K0j16P4j37P6L4p8J97R7k85J61j13
$$ 104 -209 45 61 -66 -119 -241 -97 89 -28 -83 -7 71 91 -25 49 -88 -12 22 -56 141 238 -47 114 1
4391AJ77j07Lp0o2J00k80N14K2k66j40R6J7l7l8N9l97L98p7j02M5K4J40J91j35
$$ 1 178 71 74 4 -58 42 -238 276 298 32 -108 -12 5 -32 -70 -11 -408 -10 -87 -189 -144 -120 20 211 76
4416G6k36n0L19j23P3j64M9J90J03r7k09J79n2p8J35n6J5k2r3N4j37K99j09R4
$$ 76 -160 -210 109 -14 59 -105 -56 134 237 140 -69 110 58 -20 115 59 74 52 -41 13 -124 175 66 160
4440A60r6L2o1k81R7L79j35K8m3l35J07J51k5J60l32Q3R2j7j13K58J51m53o0K74
$$ 160 64 96 35 -246 -149 230 95 123 80 -255 -148 3 -22 138 -194 -111 -19 -36 -149 109 260 -193 -253 21
4464B1k12K07J57o4k92P4J0n7jN7k5K80p1k92J88m5J5j54J87k35N24l82j46J42
$$ 21 -191 16 173 109 -183 -109 -99 -156 -157 -100 -125 155 84 -208 -20 -65 -50 -204 -17 -252 272 -110 -256 -114
4488a14L37k39R0n7k47L66k23O0L29l53k10K38j51Q0Q3j82J12j46L38Kj80K12
$$ -114 223 -16 74 17 -230 136 -87 -27 302 -51 -261 -23 -174 -94 -11 -193 -81 -227 111 113 -67 145
4510A45l0j71o6N87m98Q8m6Q2j31j95M65k64R5j99M09n8Q6j49l68L95p0m1LJ17
$$ 145 115 -56 -122 465 -33 55 9 91 -40 -235 230 -34 61 -138 271 213 299 150 -218 177 107 66 69 186
4534A86r5j14L75n34J30j89K41K8L30l83K62k64J32J77j66q3k1K42k46j89K59
$$ 186 91 -23 352 -182 -52 -241 0 28 358 -25 237 -27 105 282 116 33 12 254 8 -181 78
4555G8O8k40K24n71O17Rk36o6J53k0j09J48j12K09r8j25Q8N8l17L65p2k11o3L29
$$ 78 146 -94 130 -441 176 185 -51 -117 36 16 -93 55 -57 152 54 -71 17 75 -242 123 51 -160 -223 106
4579A06m15q7N42l03j02j04M64k59j4K45j62L98m99L1J73k85L0rL75k04p5M0R9
$$ 106 -309 -396 146 -157 -259 -363 101 -158 -172 73 -89 309 -190 -159 14 -271 -241 -250 125 -79 -154 -114 -15
4602a5R9o0P4j57K41l7m0m8qj46n3J37m2n9R4rL66k85m3O4L8l5j7j07K0J21o5
$$ -15 84 24 98 -59 182 145 105 57 49 -97 -150 -13 -55 -114 -20 -29 337 52 9 73 111 76 59 -48 -28 93 28
4629B8J02l35L56j51k06J42K42j78l4Q4k9K84l44L37o72L50j06J68k81K94J92
$$ 28 130 -205 151 0 -206 -64 178 0 -34 50 21 305 -39 298 -374 -24 -130 38 -243 51 243
4650B43k56J98j5q4j42j78pL47k18j2J19k00J27P2l5J24n9k29L63k54K84q5r3
$$ 243 -13 185 170 86 -56 -234 -241 106 -112 -124 -5 -205 -78 -6 -41 83 24 -205 158 -96 188 103 10
4673A0J37j57J20j91P8M8j69j47K99m5m8ol9J8J12j01P2j12R2k68K16l7m6L55
$$ 10 147 -10 110 -81 -3 45 -124 -271 28 -17 -65 -71 -110 -92 20 -81 -9 -121 -29 -297 -81 -118 -164 191
4697A91j09k12J87l8J40PJ05m45J76j2N1L04j43j08k75K54k59L22k05K52k24L07
$$ 191 82 -130 57 19 159 166 271 -174 2 -10 41 345 202 94 -181 73 -186 136 -69 183 -41 266
4719B66n88K63m6J28pM2j20J22j24J33j39rJ89j02J87j53n0J24O8l09K12j68J58
$$ 266 -322 -59 -105 23 16 58 -62 60 -64 69 -70 -79 110 8 195 42 -8 116 184 -125 87 -81 77
4742G7k38L09k23OR4r4k00M38j75l52K57J50J65k96K15j71j97J37r8K39q9k23
$$ 77 -161 148 -75 -69 25 -69 -269 169 -6 -358 -101 49 214 -82 133 -38 -235 -98 -196 43 -46 -269
4764b69J58J19J33j9r7k64J57l4J98l17J62K23q3k21M19k94J40j05J50j11j04
$$ -269 -111 8 141 122 25 -239 -82 -116 82 -235 -73 150 67 -154 265 -29 111 6 156 45 -59
4785e9K33k10m6l6J02j8n5N1K08l25j06R1K74%o8k28L63p3N9n43L08N7L27k34
$$ -59 174 -36 -82 -118 -16 -34 -89 -38 170 -155 -261 -170 104 104 36 -192 171 98 157 -386 -78 -21 306 72
4809G2m5K0j49L04j11n5k11R8J32J34l39K11Q7k98J31R5p0j95K46k23J95l9J34
$$ 72 27 47 -102 202 91 36 -175 -77 55 189 -150 61 148 -150 -19 76 6 -189 57 -166 29 -10 124
4832A24J91k44Q3n37K48j1J52P0l34J38p2O5j60M09l21JM71j96j83lL00k81J87
$$ 124 315 71 154 -383 -135 -146 6 76 -258 -120 -192 -127 -287 122 -199 -198 273 77 -106 -109 191 -90 97
4855I7r9k35M71k13J24j98J2k42K79k10K33j79M5o8R4Q5N2L7j33O9J04L8k93q4
$$ 97 -2 -237 234 21 145 -53 -41 -283 -4 -214 19 -160 -115 -183 -89 -4 48 85 -48 21 125 163 -130 -214
4879b14K91k05K97l5j64J17K6j01M29l60K04l22Q3J26J2m59J28K59j43p9q8L96
$$ -214 77 -128 169 134 -30 87 113 12 441 81 285 -37 46 172 184 -275 -147 112 -31 -110 -198 198
4901A98j9j6j68j90K46O4j36j07J59p1r6K46j14J09j23P5j55J38k6L07m92J06
$$ 198 179 163 -5 -195 51 115 -21 -128 31 -40 -136 110 -4 105 -18 57 -98 40 14 321 -171 -65
4923f5K14m88M02q0J31j45L9j76J59K51m85L06k65Q5J59L2j49kK19k0J45m64K20
$$ -65 149 -339 63 -17 114 -31 8 -168 -9 242 -243 63 -202 -117 42 74 -75 -77 142 122 267 -197 23
4946B3qMn8j41l4L67N3j79K09k7l30L12n9Q0j92Kmj33M57m65J50j35O2n7k09K83
$$ 23 15 19 -39 -180 -214 153 206 27 236 209 -121 191 132 212 20 22 18 -115 342 -123 27 -108 -46 -103 -312 -29
4972b9m1n7J89j36j7K86j82M9k12J59Q0j41j23J82J36p6k38J72K61j89p8K30k08
$$ -29 -70 -127 62 -74 -91 195 13 62 -150 9 89 -52 -175 7 143 67 -171 1 262 73 -5 225 17
4995A7j4j19O5J03k52n2L97p5j05O4M7L33m35r3J11k33K13J7j98K93r4k21O8J
$$ 17 3 -116 -51 52 -200 -252 145 70 -35 29 76 409 -26 -119 -8 -241 -28 -11 -209 84 -10 -231 -163 -162
5019a62J53J28m61O98l89j03P4O5j92K59j43M12n36P7M5J45j36L1K4n3K53k19
$$ -162 -9 119 -342 356 -33 -136 -62 3 -189 70 -73 339 -197 -120 -75 70 -66 -35 -11 -64 189 -30
5041c0K7J47j27o2O6j49J23p9R1J91n2j64J86l72J04K40k41J09j28K49k1J30j59
$$ -30 -3 144 17 -45 21 -128 -5 -84 7 198 146 -18 168 -204 -100 140 -101 8 -120 129 108 238 79
5064G9j08K13l2j05PJ7K2j01r6J50n7j81L61l54J34Q0J86l68J70J11q8o5j25p8
$$ 79 -29 184 152 47 54 71 93 -8 -104 46 -11 -192 169 -185 -51 29 215 -153 17 128 40 -25 -150 -228
5088b28J03j04L87j93l7J73k67L12k06Q9R6r9k54K18l21N61l17J81q2j25K95k70
$$ -228 -125 -229 158 -35 -72 101 -166 146 -60 29 125 26 -228 -10 -331 230 -87 94 12 -113 182 -88
5110h8LJ71o6j94l2M12n9L4k94J58k02MO3L6j29J27J1j4J49j21J15Rl16M22o0
$$ -88 -85 86 20 -174 -206 206 147 181 -113 45 -157 -153 -90 -54 -183 -56 -45 -59 90 -31 84 93 -223 199 139
5135A39k16N5L23l51K01j78J86k39O0K00k47J23j04J45j97K01l3j02j6L27j54
$$ 139 -77 -22 301 -50 151 -27 159 -80 -20 180 -67 56 -48 97 -100 101 68 -34 -50 277 123
5156A23J33k67K7P4k2q9pk6K93Ll80K44j05%O0q6j21L96j44j79r1J59N6nJ3O7
$$ 123 256 -11 16 90 68 -21 -28 -54 239 242 -138 106 1 1 61 -25 -146 250 106 -73 -164 -5 51 46 59 126
5182A26j47P8P8k25J66qK1l35J8o8M20l1r0L0j20K5j86K06J18j37J59l4j28j7
$$ 126 -21 57 135 -90 76 68 89 -246 -228 -296 124 93 3 33 -87 -62 -248 -42 76 -61 98 64 -64 -81
5206h1J53k44J27J57l45L29m34L92l81M31J75j81k97L9J30P9k80L46j8rr7k94
$$ -81 72 -172 -45 112 -233 96 -338 54 -327 104 279 98 -199 -160 -30 49 -231 115 97 88 -9 -303
5228c03L01j34J10%q3R7k25R4K50j22j26K75K6j82m8q5K54J7R5l22J11k79J85
$$ -303 -2 -136 -26 -26 -109 -12 -237 -143 107 -15 -141 134 160 -22 -70 -155 99 116 211 -111 0 -279 -94
5251i4K08j05K47l08P1P3k23L06r8k50J99K22j65p9q8N4r4L45m72L53J31m18P2
$$ -94 114 9 256 -52 19 92 -131 175 77 -173 26 248 83 4 -84 -30 -124 221 -251 102 233 -185 -113
5274a13M11q2Q5k65j13N1j93J10r6K11jj99N5k1K22j19L7J10k46K11k75L43j65
$$ -113 298 216 301 36 -77 -26 -219 -109 -205 6 5 -194 -139 -160 62 -57 -20 90 -156 55 -220 123 -42
5297d2J28Q3j71j61j7J95p6N9J21k15r8O3J00K12l76K10j59K3P0K64k81J11j05
$$ -42 86 169 -2 -163 -180 15 -61 -2 119 -96 -194 -131 -31 181 -195 15 -144 -121 -51 213 -68 43 -62
5320f2K90m17K23N5j15p7J00j82J91M3L16n70O4K25k84P6J8J5J86O2J05k61o2
$$ -62 228 -189 34 89 -26 -103 -3 -185 6 49 365 -205 -141 84 -200 -124 -106 -91 95 157 262 1 -61
5343f1j92J69m9o7L99r7l9M9k59o1L24R7m07J24K2pk0R1k79K71j74k6J69j51M2
$$ -61 -253 -84 -133 -200 199 102 63 112 -147 -208 116 213 -194 -70 -48 -55 -75 16 -263 8 -166 -192 -23 -174 -132
5368a32K15k92o9K93j37M25k10m9p6J14j08j54J45k89L9K49J74l31L6J94O0j32
$$ -132 83 -209 -278 15 -122 303 93 44 -32 82 -26 -180 -35 -324 -285 -36 138 -193 -157 37 97 -35
5390c5P2o8P5p6J4K22m1j86K6K91M5m14j50P6J88j30J98j05K4l50K80K12k92K80
$$ -35 37 -31 44 -32 -18 204 163 -23 3 294 339 -75 -225 -149 39 -91 107 2 26 -324 -44 168 -124 156
5414A56j75J03j05o2R6m8j59J93j51L04M9j85j90K85k85L81J10j53k20R4k07K05
$$ 156 -19 84 -21 -83 13 -35 -194 -1 -152 152 201 16 -174 111 -174 207 317 164 -56 38 -169 36
5436C6p7L11j21k76K65q0J68k18K0K17k24K15r3l22M5K2M69n54J51K27k35Q6J3
$$ 36 -41 270 149 -127 138 58 226 8 28 245 21 236 143 -179 -134 -112 357 -197 -46 181 -54 32 45
5459D5P0Q4J83m45J95j42N3k6j66J15n0j80M02o3k82J3MO3M2n8j19J59N9O5j50
$$ 45 115 199 382 -63 132 -10 43 17 -149 -34 -84 -264 138 75 -207 -194 -190 -127 -85 -143 -262 -103 -44 21 -129
5484a29K51k01N2m3J60Qr2k07K60j99P9M4n5J89O5m39M59j35l2o6OnJ13P0j0p2
$$ -129 122 -79 -27 -70 90 98 6 -201 59 -140 -61 -17 -72 117 182 -257 202 67 35 -31 -25 -30 83 153 143 71
5510G1o3oLn5MP7p9N0R7j13q3O4K9J33K88k64j46j73J13K99r1k05J2j64K74M0
$$ 71 8 2 5 -50 -46 31 -48 2 99 -14 -97 -33 -4 129 417 153 7 -166 -53 246 155 -50 -38 -202 72 112
5536A12k05n0R9j12K8K36j38j51K54l6k52L39q8N8j51O2j60M02l37j02K77N5j39
$$ 112 -93 -143 -44 -156 -128 108 -30 -181 73 37 -215 124 36 94 -57 5 -155 247 -90 -192 85 140 1
5559Aq0P2L0N7j92J73Mo8l3J46K70j1l23l01K57j26J56Nj06J9l5mJ75j7k89J27
$$ 1 -79 -7 23 80 -112 61 65 -3 -36 110 380 369 46 -255 2 -124 32 37 -69 -50 -85 -89 86 69 -220 -93
5585i3L59k46r3J86K08l80R1p8Q3l87K48J16lL08k12l68N85k51k29k2L23j36j16
$$ -93 266 20 -73 113 321 -59 32 -46 37 -350 -102 14 11 319 107 -261 324 73 -156 -178 145 9 -107
5608a07j5K93K5p6Ll48J84m7L47k25j30J44j85k3J87l04K28k26L43k9j62o9L29
$$ -107 -122 171 196 120 123 -225 -41 -88 259 34 -96 48 -137 -160 27 -277 -49 -275 68 39 -123 -192 137
5631A37j26j66L17m01J13j90L92l1J11k16r0J26n9p4qJ59O0j35J95k42L92m40
$$ 137 11 -155 162 -239 -126 -316 76 45 156 -60 -150 -24 -83 -157 -165 -6 54 -81 114 -128 264 -176
5653a76j9L17j88N7L28l34J66r7K4j07O9l46M59r7m4K39l92R0K6J3O6J51l20k1
$$ -176 -195 122 -66 -9 319 -15 151 54 78 -29 40 -306 153 56 12 251 -141 -51 -25 -12 54 205 -115 -136
5677a36L09k79q2L7L42o5O0l81j4J58J07J6L1k12J20l0J11r2m07M07K03q9J41
$$ -136 173 -106 -188 -151 191 126 186 -195 -209 -51 56 72 103 -109 11 -19 92 0 -407 0 203 114 255
5700B55k45j28J33j6J48l03K88j92R4K26j06l4jJ28j85m4k29O9M5J82j9j98J83
$$ 255 10 -118 15 -1 147 -156 132 -60 34 260 154 120 119 247 62 18 -211 -142 -97 85 66 -132 51
5723E1j50o1K71m4j26J02j82j5j12M27k3j19j51J07J17l13J17K5POj34K71j40
$$ 51 -99 -160 111 67 -59 43 -139 -154 -266 161 138 19 -132 -25 92 -221 -104 -79 -72 -66 -200 71 -69
5746f9L32n57K45O0n0K59k65R2l06L26n6k9j37J53P5m4q4l3J17k83K76L5j13m6
$$ -69 263 -294 -49 11 -39 220 -45 47 -259 67 11 -18 -155 -2 73 29 -55 -88 29 -254 22 57 -56 -102
5770a02J10K14m36O3O9k39L98PK26n6j98j99K07K3J5q9q6j83K10n6J31k8j88M55
$$ -102 8 222 -214 -151 -82 -321 77 84 310 254 56 -143 64 87 102 13 -73 -256 -46 -102 29 1 -187 268
5794B68L6l54K60j14l55J74m1P2K7J7k37L39k60j25J00J74j63M37o9n28L67j40
$$ 268 304 -50 210 96 -259 -85 -126 -54 -27 -10 -247 92 -168 -293 -193 -19 -182 255 186 -342 25 -115
5816a15J29o9o6pJ47j14J07K7k21j31M04k23q6M06k05K74l09P4j86J82k79L35
$$ -115 14 -55 -121 -128 19 -95 12 39 -182 -313 91 -132 -218 188 -17 257 -52 22 -164 18 -261 74
5838G4r4J29k65J34N2j4O0L9j47K41j96m44L50K2O6R3J12j33J20q6P4j51J77l39
$$ 74 -20 109 -156 -22 30 16 76 115 -32 209 13 -431 -81 -59 7 100 212 79 199 113 187 36 213 -126
5862a26J84l08K67oj65M35k40q0K84j41r8J05j8m25L34o5RK6j97J72O3P7Q1J46
$$ -126 58 -250 17 11 -154 281 41 -39 245 104 6 111 93 -332 2 -63 -54 -28 -225 -53 10 87 168 314
5886C14l32J36kr2J65o6j21q2M6j36J45j24L53j05j62J44l4J93j57Q5l22K19n2
$$ 314 -18 118 116 24 189 123 2 -80 -34 -170 -25 -149 204 99 -63 81 47 240 83 168 -154 65 13
5909A3J98j28j80J76J22n57N17k53j93M23j36J1N4j47M16l29j52J26K81j38M17
$$ 13 211 83 -97 79 201 -356 161 -92 -285 138 2 13 67 -80 336 7 -145 -19 262 124 541
5930E41p97M88k17J93j91k19L18q0r3j32L12l29K37j45OL4j37J65K10k2o7q3J23
$$ 541 -256 232 15 208 17 -202 116 36 -57 -189 123 -206 31 -114 -108 -74 -211 -46 164 142 75 -8 115
5953A15k4p2P7N6J45k37K0p8J37j72R7K7j41j2R3O2j63K05j25mO2p7J4j86O7K13
$$ 115 91 19 96 152 297 60 80 2 139 -33 64 91 -50 -62 31 93 -70 135 10 6 68 -9 5 -181 -114 99
5979I9k92L13K2j30L6K40k25k0Oj01K1J01r1MN7k13jj20K07j18M7j7M21j32m4
$$ 99 -193 120 142 12 48 288 63 43 49 -52 -31 70 -21 -17 40 -173 -174 -294 -87 -205 -158 -175 246 114 70
6004G0k33M12j33k62L69m08J5K87N8l12J59N5k42K07Qj57j88L11k03J74K54k58
$$ 70 -163 249 116 -146 223 -185 -170 117 175 -137 22 77 -165 42 50 -107 -295 16 -187 -13 241 -17
6026a7j36J35K50k24N0k86K28M27n19j84o3L30j14n2K74J7J32k49R3p8k85j48
$$ -17 -153 -18 232 8 58 -228 0 427 -92 -276 -339 -9 -123 -175 99 116 248 -1 92 14 -271 -419
6048d19M65j09l9K12j30k00L87m95K71J50k3J11k02K00j26j32J40P8j7N3j08k21
$$ -419 46 -63 -102 110 -20 -220 167 -328 -57 93 70 181 -21 179 53 -79 61 139 122 175 67 -154
6070a54R4K07k71M1j0r9K63J7l60K63O9P7k8j26J2LM7J10j32k32k1k3M27j58j93
$$ -154 -60 147 -124 -83 -93 -192 71 88 -272 -9 60 137 109 -17 -5 -2 45 155 23 -209 -230 -253 174 16 -177
6095a77n0K57r8Q2j43R8J5k7J33q2K09l21q5K99J54l34n7R1j08K02j44L2J82m04
$$ -177 -227 30 -68 14 -129 -31 -16 -43 90 8 217 -104 -189 110 264 -70 -127 -36 -144 58 -86 -54 128 -276
6119b76K15j00Q5l74K34J8L04j82k7L72j00j25K14l24J2k5K80l64J84J10n0J87
$$ -276 -61 -161 -76 -450 -216 -198 106 -76 -103 269 169 44 258 -66 -54 -79 201 -163 21 131 81 268
6141B68k38j21n4K74n3j09n2P0j21L40j8j08J57k40k6j68M82k90k82J49J10J76
$$ 268 30 -91 -145 129 76 -33 -85 -15 -136 204 186 78 235 -5 -31 -199 283 -7 -289 -140 -30 146
6163A46j51K10m46q3N16j16k45j3J27K4oK10k60J84j14n6J78k47lL08j43Q6q0
$$ 146 -5 205 -241 -324 192 76 -169 -182 -55 -31 -37 173 -87 97 -17 -73 105 -142 -145 163 20 106 26
6186B6rj72J01K46k20P0j27J06J98Nn24L71l7nj78O6R3J48l36J41J19p9J17K6
$$ 26 17 -155 -54 192 -28 42 -85 21 219 224 -300 71 34 29 -149 -83 10 158 -178 -37 82 3 120 146
6210A46k28n0M97l98k49M53j22N8q2N2k9j82K83k30k11P2J67J30m50K39K64J6
$$ 146 -82 -132 365 -33 -282 171 49 107 25 77 48 -134 149 -81 -292 -220 -53 77 -373 -134 130 146
6232A46L8j52K02k12j51J23m7J57o8j78K29j25J08J4j04l4Q5l4R8j54J60j62J88
$$ 146 184 32 234 22 -129 -6 -53 104 36 -142 87 -38 70 84 -20 -54 31 -3 95 -59 101 -61 127
6255A27j54J49r0l08J51k5j11M34k58m2Q3n3J54K10l52K4o1k34M69q4j02J82l14
$$ 127 -27 122 32 -276 -125 -150 -261 173 -85 -127 -44 -97 57 267 -85 -61 -122 -356 113 29 -73 109 -205
6278b05K12rP0P9j04k2j9P8j23K19k14R0P5k06J22k48J64O1l6R9o7j05M5j95L92
$$ -205 7 -2 68 147 43 21 2 80 -43 176 -38 52 127 -79 43 -205 -41 20 -16 83 16 -89 -44 -239 153
6303A53j98J05q4p1j61J99J0L06l40M3k09K46j66R7L64k05p0j40J9O8M7j57l7
$$ 153 -45 60 -24 -95 -256 -57 -47 259 -81 -38 -247 -1 -167 -70 294 89 19 -121 -102 -34 13 -144 -181
6326a81K59J11j44k15O3K14j06J09J16k48l5J2J59l62J12J03N9j77J13J61k25
$$ -181 78 189 45 -170 -107 107 1 110 226 -22 -57 -45 114 -248 -136 -33 26 -151 -38 123 -102
6347a02K29L63l53J8j27j80J79l3J7o0O6M4k01L5Q0l1QQ4j73K01K20l10p5O0K85
$$ -102 127 490 137 155 28 -152 27 -6 11 -49 17 61 -140 -105 -25 -56 -48 36 -137 64 284 -26 -101 -41 244
6372B44l05j73kL52k3J3j83K39j36q6M30l34M3j42K71k87Q0rM5j56J4L2K08r7
$$ 244 -61 -234 -236 116 93 106 -77 162 26 -60 370 36 79 -63 208 -79 1 -8 37 -119 -105 -73 135 38
6396C8k96J85lr3R3j17o4K85k60K90J77l39K65l56J8n1K59j86M94k69k52J84r8
$$ 38 -258 -73 -76 -169 -76 -193 -257 28 -232 58 235 -104 161 -195 -177 -228 31 -155 339 70 -182 2 -96
6419i6Q6n3M3qj1L7K38m59K25J33j64o5L55m10K77j65k5J44k62K02K87p4l41K64
$$ -96 -10 -63 -20 -28 -39 -2 236 -223 2 135 -29 -94 261 -149 128 -37 -62 82 -180 22 309 235 -106 158
6443A58m71n3N05k9j06K75k74l3p5L86m80K6l3K96rj40L09m03L22j9j28m38N23
$$ 158 -313 -366 139 110 4 279 5 -28 -103 283 -197 -171 -204 92 83 -57 252 -151 171 152 24 -414 109
6466A09j96P9j40J98n6J14j09j07J60j50N9q9L50l38Q2q2O8J8P9m6r8R2K04j83
$$ 109 -87 -8 -148 50 -6 108 -1 -108 52 -98 -39 -128 222 -116 -34 -116 -48 -30 49 3 -95 -3 201 18
6490A8r7K8P5k56L17j08J39m0r1J56p8P3q5j90J40j51K58Mr4j74J93N6L8l21J84
$$ 18 -79 -51 24 -232 85 -23 116 76 -15 141 63 136 51 -139 1 -150 108 112 18 -156 37 93 131 -190 -6
6515fo9K01m15L90j08l35M05J14R8k83k2J3l70N59pr2o1J40j4m1j35k1q6K30R6
$$ -6 -75 126 -289 101 -7 -342 63 177 275 -8 -30 -17 -387 172 165 73 12 152 138 97 -38 -59 -145 85 181
6540A81k37r8M8K8N0J75l64R9M53n81J44R2M8q3j42j5J19Q8k86J24K67j24J47
$$ 181 -56 -154 -106 -78 -28 147 -217 -118 335 -246 -102 -10 38 -45 -187 -202 -83 5 -281 -157 110 -14 133
6563A33j26j13j02L36j33l7N8L09j11j68P7k5j36K35k30M7J24%r4j22J06Nq3M0
$$ 133 7 -106 -208 128 -5 -42 16 325 214 46 123 98 -38 197 -33 14 138 138 44 -78 28 33 -50 -10
6587a0P6JQ0n9O8j87j30J01K1L5L0j80M46l25P3J3J73j92j22P6J78K6k93J9o6
$$ -10 66 67 147 88 156 -31 -161 -60 -39 -4 26 -154 292 -33 40 53 226 34 -88 -12 166 192 -101 -82 -148
6612a48Q4J81k53J84q3M1Kj17M13k16O2l02M15m01K13m1j28M2l3J18M7R7j98J04
$$ -148 -64 117 -136 48 -35 6 8 -109 304 88 150 -152 263 -138 75 34 -94 -52 -85 33 80 177 -21 83
6636H3O2j66J10j79L8J20j17R1J57l3l39Q5k8l6J73k19K41j75Q3L72j61n78K28
$$ 83 145 -21 89 -90 -52 68 -49 42 199 166 -173 -88 -116 -152 21 -198 43 -132 -49 323 162 -416 -188
6659a88P9N6K71m55K05R0r7J90j29K47k55m2J94q5p4r4j46L44j52j1MR5Qp5K07
$$ -188 -109 -53 218 -237 -32 58 -39 151 22 269 14 -28 166 81 7 -87 -233 111 -41 -52 -48 47 55 -20 187
6684A87k74%K27j87K33k23m9P4J41P6j36k2j21K47k15K11P1k31j84M11r3j83K39
$$ 187 -87 -87 140 -47 186 -37 -86 -12 129 205 69 47 -74 173 -42 169 240 9 -175 236 143 -40 199
6707A99j35NK45n86J81P3n1L82j58m63J31J93k28K88J25l05Oj73J37J33m0k60
$$ 199 64 69 314 -272 -91 -18 -69 313 155 -308 -177 16 -212 76 201 -104 -98 -271 -134 -1 -41 -301
6729c01L40r0J19o3J84Q9m64J43j87J95j71J88J23J54M8j51L3k03K1NK35j66O8
$$ -301 39 -51 68 5 189 278 -186 -43 -230 -35 -206 -18 105 259 307 156 189 -14 7 12 247 81 149
6752A49m3k11j25L21j74J14j27N0j15L0J31m2j43L77k5j32o6J3J57l78N0J97o1
$$ 149 106 -105 -230 91 -83 31 -96 -46 -161 -131 0 -42 -185 192 167 35 -31 -18 139 -239 -189 8 -53
6775e3n6K7j68L39l46K65J98l01J67n9J3n9j51P7L22q9j79j74J43K62k02pJ47
$$ -53 -109 -82 -250 89 -257 8 206 -95 72 13 26 -33 -184 -107 215 126 -53 -227 -84 178 -24 -31 116
6798A16r0r5J91k58j4L3J70o3n1R2M3j32mk44L40r7N8J5j18J52j87K71j01r6k00
$$ 116 26 -69 122 -136 -150 -117 53 -10 -61 31 74 -58 -62 -306 34 -63 -5 10 -108 44 -143 128 27 -69 -269
6823b69J7J83n7M5M75l06k60K10l13K79J0R9k35M09l04l6L7l42L88r2J88l64K90
$$ -269 -252 -69 -126 -81 394 88 -172 38 -275 4 14 113 -122 287 -17 -53 -16 -358 30 -62 126 -238 52
6846E2j22L09j03n5J49l69J60P7l15L10m3M5l8L4k6J51k43n0j31k02M80pk43K88
$$ 52 -70 239 136 81 230 -139 21 98 -217 93 50 95 57 91 65 216 -27 -77 -208 -410 70 63 -180 108
6870A08j6l86N05j88k27L13k77q1O2M5k1j72K58m1J3M94l74J61q4q0k90J03L39
$$ 108 92 -294 211 23 -204 109 -168 -249 -187 -142 -163 -335 -77 -118 -105 389 15 176 92 12 -278 -175 164
6893A64k4j46l4j98Q6J13q7O6oj73K0J76L1o1J21q1R0p3NJ43k64O7j30J37j21
$$ 164 140 -6 -40 -238 -152 -39 -126 -60 -66 -239 -219 -43 -12 -73 48 -33 57 -16 -11 132 -132 -65 -195 -58 -179
6918a79mK05q8o4OP5M6q0L11l20K40j90l9K1J35L2l29K65K07r0k43Q0J5k35K74
$$ -179 -183 22 -66 -130 -124 -49 -3 -83 228 -92 148 -42 -81 -60 75 107 -222 43 250 160 -83 -3 12 -223 51
6943E1o1n8J68j01k9J35J06l12K57j65K37l96K00l3J1k3J45l18J09J18lr3j03
$$ 51 -10 -68 100 -1 -30 105 211 -101 156 -9 228 -168 32 -1 10 -13 132 -186 -77 41 38 -55 -158
6966a58J41j08M28l82R8j98K3L4J98N7r1j48J54j65n9K66o9M2K0n6j47K7L6o4
$$ -158 -17 -125 303 -79 19 -179 -156 -122 76 133 42 -106 48 -117 -176 90 21 63 83 27 -120 -93 -57 -121
6990a21J74j03kK17k14m7Q4k3PL8K95r2j75j49J16J73q8k64J81lo7J39K6j43k9
$$ -121 53 -50 -52 165 -49 -96 -12 -35 -28 10 305 213 38 -111 5 178 90 -174 7 4 -63 76 102 -41 -70
7015g0M3K63n7k02J74q7Ll6K12k56Q7r8J62l19K4K20j19k28K01r6K06p0m3R5L1
$$ -70 -27 236 179 -23 151 64 67 31 243 -13 74 -24 138 -181 -157 63 -56 -284 -83 -179 27 -43 -86 9 40
7040D0j25L6L6J53M8j05j32J17j5j23lJ78J92l63rK6Q6K1J25j77m6J77j68o0J82
$$ 40 -85 -49 -13 140 188 83 -49 68 53 -70 -73 105 297 -66 -75 -49 37 58 183 6 -40 137 -31 -91 91
7065I1M1k88J64K06j93K53j05k71j92L53j75K36%K25n14J05L31k16j51L97k67
$$ 91 132 -156 8 214 21 274 169 -102 -294 59 -116 120 120 345 -169 -64 267 51 -100 297 30
7086C0n0Q2K99l39l03K84j18N3J6K94k63p3J05j62j21M24l47N03k85R9k20J53
$$ 30 -20 62 361 22 -281 3 -115 -62 -46 248 -15 -88 17 -145 -266 158 -189 314 29 128 -92 61
7108F1k2J09k96J32O1lJ60j92J3j70pJ15n4k44L57j88o2J64J69j33k45L55l7j89
$$ 61 39 148 -148 -16 45 42 202 10 23 -147 -154 -39 -93 -337 20 -168 -230 -66 103 -30 -275 80 43 -146
7132a46Q1j11Q1L3K21j23K4K14n8j24P3J54k82J57j98k46J03L64o31J82N21j93
$$ -146 -65 -176 -95 -62 159 36 60 274 216 92 165 319 37 194 -4 -250 -147 217 -414 -232 289 96
7154I6j08P7m6J8l45J19K48j4K70k23j73J67j26Q3j56m9k8L09k24J33J87r5o9
$$ 96 -12 65 19 37 -308 -189 59 45 315 92 -81 86 -40 43 -113 -162 -190 119 -105 28 215 120 51
7177E1j77K42k11K07Jp1oL8q2j47K78M7l70J37M0j60J34L4J35j78R9K66o53K48
$$ 51 -126 116 -95 112 113 42 36 74 -8 -155 123 170 -200 -63 -23 -183 -49 -15 120 -58 41 307 -346 -98
7201i8j23J02L76k75J27l15O18m63MQ3j24J25j4J70m29j05M31j04m08M95r2R8
$$ -98 -221 -119 257 -18 109 -206 412 -51 -47 36 -88 37 23 193 -236 -341 90 -14 -422 73 -19 79
7223G9J04J7l04K60k82J01k78M54k57K72m04L02j99N9N36l72j63j19K57J08l85
$$ 79 183 200 -104 156 -126 -25 -303 151 -106 166 -238 64 -135 -76 460 88 -75 -194 63 171 -214
7244b14L75k04r3k18J28K11L9L66n01j33J63j5J37j77Q4r8M34j68q4k2j80K16
$$ -214 161 -43 -136 -354 -226 -15 24 390 -111 -244 -81 -96 41 -136 -52 -150 284 116 32 10 -170 46
7266D6J80j59j4J65j72m0np3Q2K6j02j6K22j05J79j76k9Q0K8n03M01k95K74K59
$$ 46 226 67 53 218 46 6 1 -72 10 36 -66 -82 140 35 214 38 9 89 117 -386 15 -280 -6 253
7290B53k69m4R6k48K22K1J19l15M1J74j18j45L94k61kJ31P8k65J32Q9Q0r8J58
$$ 253 -16 -60 36 -212 10 31 150 -165 -124 50 -68 -213 181 -80 -82 49 127 -138 -6 83 163 65 223
7313B23l8K5j73p1k7kJ18K27k37MO4K3k00J68O3m48L33k4k1J88k37Kj84J85o5
$$ 223 185 210 37 -34 -61 -63 55 282 45 49 113 136 -64 104 167 -281 52 28 7 195 -42 -40 -224 -39 -104
7338a04J36j78M9J72j7m0l24J78J18J86k78o2j4L44l59R9J06K97l16J33l14K36
$$ -104 32 -146 -97 75 58 18 -306 -128 -10 176 -102 -164 -178 166 -193 -94 12 309 -7 126 -188 48
7360D8R7j36j75k9J04Q0r7K10k05J20j96L54j26j97J66o7Q2r1M8L0P0K62l48j91
$$ 48 145 9 -166 -195 -91 -11 -108 102 -103 17 -179 175 49 -148 18 -49 33 -58 -10 20 90 352 4 -187
7384a87M09j96P7M1l01Q5L00k65N6k8n3m2p2L0M21k65K26m16J44J35M1o4j01K16
$$ -187 222 26 103 144 -157 -72 228 -37 19 -9 -62 -104 -176 -146 275 10 236 -180 -36 99 140 76 -25 191
7408A91j10K7k88L35m6o5O2j07J9K02j99R4j49L6m2K72j60N9l4j20j74K57k44
$$ 191 81 108 -180 155 109 44 106 -1 18 220 21 115 -34 2 -40 232 72 131 97 -23 -197 60 -184
7431a84K96p5j59J69o6K55l42K46o9m57K37pK33j72J26J85k0r9m1P5j08J00l50
$$ -184 112 37 -122 47 -19 236 -106 140 71 -386 -149 -156 77 -95 31 216 196 97 56 131 23 123 -227
7454b27Q4J12R5L8q2Q5n6K36j65k52J92j81p9J86J48Rj50q7K79k11J7K06l28K76
$$ -227 -143 -31 64 102 20 105 49 285 120 -132 60 -121 -200 -14 134 143 -7 -94 185 -26 -9 197 -131 145
7478A45j3Q8j41l51J17K14J03j47j96L52Oq2n2k44M8J23R3j94L09J7m27K12J40
$$ 145 132 220 79 -272 -155 59 162 15 -181 171 177 95 43 -201 -153 -30 63 -131 178 195 -232 -20 120
7501A20n1r7P5n2KQ3j7M4q5j34J48L0q0o2j71K05o7L06m70K32J40m58J47K20j44
$$ 120 69 -28 47 -5 -3 80 63 107 22 -112 36 66 -14 -76 -247 -42 -109 197 -273 -41 99 -359 -212 8 -136
7526a36K76o9m7j1k25L53j41M7l00O38m35R4n8J29M4km04K56%J20m6k17m9L56
$$ -136 140 71 24 13 -212 141 0 47 -253 385 -50 44 -14 115 159 157 -247 9 9 129 83 -134 -183 173
7550A73j92l1J93k31N5K96p3l68J91n5J6K8p9O1J51j10J94k54j78l7L12J04k36
$$ 173 -19 -50 143 -88 -33 263 190 -178 13 -42 -26 2 -77 -16 135 25 219 -35 -213 -250 62 166 -70
7573g0M9m1m1K84r6k62R8J16O5L0n16M75l6m1P6q8n5j11O5L3L2M6J15j44j4j26
$$ -70 -21 -62 -103 181 85 -177 -79 37 102 132 -384 91 55 14 90 2 -53 -164 -99 -66 -34 12 127 -17 -31 -157
7599a57O0J10p4J72J0k88KJ54L5J7q3J56J99l32p0J20J11l42L76j27k14L72k15
$$ -157 -97 13 -61 111 121 -167 -165 -11 24 41 -42 114 313 -19 -89 31 142 -200 176 49 -165 207 -8
7622hJ8j11j32J83J70k82J79pJ66k09j18j8L29j73j48j37L94J08J1j64J49K9l25
$$ -8 10 -101 -233 -50 120 -162 17 10 176 -33 -151 -169 160 -13 -161 -298 96 204 215 51 200 229 -96
7645i6j23J41M33l54K98m83L35l6k75J06J29r4M3j58o5K85l3J19k5j50r2L47j19
$$ -96 -219 -78 355 1 299 -184 151 115 -160 -54 75 -19 24 -134 -199 86 53 172 147 -3 -95 252 133
7668A33k30P0j92K86j85M05l36N9L26m38J15j31O7J72J40l91L8N7j51N6K28l26
$$ 133 -97 -27 -219 67 -118 287 -49 10 336 -102 13 -118 -51 121 261 -130 -92 -35 -186 -130 98 -228
7690b28K90M7j47L3J43j75r5M5L6J49P1k89K95n2n8J55l37J44l09L22j47L13k00
$$ -228 62 109 -38 -5 138 -37 -132 -87 -51 98 169 -120 175 123 65 220 -117 27 -282 40 -107 206 6
7713Fl70K18K07l45K11l0K50J6k23K32k72J23k1j02K9M0K4k18J40L22n51M23Q8
$$ 6 -364 -146 61 -284 -73 -103 147 163 -60 172 -100 23 2 -100 -71 -31 -7 -225 -85 237 -314 109 197
7736A97r6j77J05j98J61PL00m49J45p9L92m89K27Q3k02j03K13L8P8qj5j01r3J96
$$ 197 101 -76 29 -169 -8 -1 299 -150 -5 -84 308 -181 46 129 -73 -176 37 75 153 145 130 29 -64 132
7760A32o2N5o7K1j27J65j16m80M60J65k0l01M92m02R2k9j02J59j76N2K60k22l1
$$ 132 70 125 58 79 -48 117 1 -479 -19 146 126 -175 317 -85 7 -22 -124 35 -141 -89 171 -51 -82
7783h2J1Q2K72j02n16M64j21j8o2J89l55J82K40j15k0j96J09p4J24j17P5m8o5
$$ -82 -71 11 283 181 -335 129 8 -10 -72 117 -238 -56 184 69 49 -147 -38 -112 12 -105 -30 -78 -143
7806a43K9M7j0J5J18r9j20J59P1j47j3N2R1P7L13m25j37J11p8J43k08J41Q3k66
$$ -143 -114 -67 -77 -62 56 -43 -163 -4 67 -80 -93 -41 50 127 440 15 -122 -11 -89 54 -154 -13 70 -196
7830a96p0K15m0J05n6r5j5N69l39k98J97O6J99j62j96J47j55J75N5l98J95J94
$$ -196 -266 -51 -91 14 -42 -137 -152 417 78 -220 -23 43 242 80 -116 31 -124 51 106 -292 -97 97
7852I7k76L10J11Pj91j24K84j44j89K88l01K9K78jk36j37J85J60k12J64j29J17
$$ 97 -179 131 242 249 58 -66 218 74 -115 173 -128 -99 179 178 -58 -195 -10 150 -62 102 -27 90
7874I0k81J89K5J9K3M4k21J08n0J15L00m59J87j00J33j61K3KM0M5n4J15j47j45
$$ 90 -191 -2 23 42 65 109 -112 -4 -54 61 361 -98 89 -11 122 -39 -16 -14 26 71 17 132 -15 -160
7898a60q5L4Q9r3L78j95Q8o5O3j10k30M14j2r9L34o01J50K59qj26O9k10PJ22k6
$$ -160 -245 -211 -122 -215 163 -32 56 -9 54 -56 -286 128 116 17 351 -250 -100 159 151 25 94 -116 -109 13 -13
7923a3j06K3QJ62n8R4k31M19k59j24n3K06J38j74J08k44J33r5j50M6K49K05k48
$$ -13 -119 -96 -88 74 16 110 -121 298 39 -85 -138 68 206 32 140 -104 29 -66 -216 -170 79 284 36
7946C6j0L37m06L58l35J19j33Rj08L28J37l83J61j33QO5nj23J04q8J03J50n40
$$ 36 26 363 -43 315 -20 99 -34 -25 -133 195 332 -51 110 -23 -15 50 45 -78 26 -62 41 191 -349
7969c49K17J77j21K50l46M12q6k13JK76k40N5o4J77l17J50O4k0n3P3L4j72L02
$$ -349 -132 45 -76 174 -172 240 154 -59 -58 218 -22 33 -31 146 -171 -21 43 23 -30 43 77 -95 207
7992B07k64K9Q1R3L7k7k1P6k23q1K35k08J25j2j51P8j20N7M1J24J12j86J33k87
$$ 207 -57 -28 53 146 183 156 135 211 -12 -93 142 -66 59 47 -104 -26 -146 -89 -48 76 188 2 135 -152
8016a52K83k07R5N4l71K74k32K64J15K0l66K27M2k19L12J01M9l17L1j05J54l8
$$ -152 131 -76 19 73 -298 -24 -256 8 123 143 -223 4 46 -173 139 240 289 -28 3 -102 52 14
8038A4J19j46L98m67N0p8J32Q8j23N2j50K36j31RJ41l52PK66j08N9P6J5j45J56
$$ 14 133 -13 385 -82 -32 -110 22 110 -13 39 -111 125 -6 3 144 -208 -201 65 -43 16 92 107 -38 118
8062A18k70n0L64J3j68p0J79J09j88k25Q0K76k29p1K54o1j07J04J01k07K1K5k5
$$ 118 -152 -202 162 175 7 -63 116 225 37 -188 -108 168 -61 -132 122 61 -46 58 159 -48 -27 -2 -27
8085b7M6k54J96R3L3j32l59J09J43J00J89n5j32J32Rl8j77K54J92k32j46l5J38
$$ -27 19 -235 -39 54 87 -45 -404 -295 -152 -52 137 82 -50 82 91 53 -124 130 322 90 -56 -91 47
8108D7q5K58k51J57j01jJ00o1n2j47K26k23P5N2K32k52P5j51o5O4J91Lj63L24
$$ 47 -38 220 -31 126 25 24 124 63 11 -136 90 -133 -58 -6 226 -26 49 -102 -167 -103 88 91 -72 252
8132B52k14J70j65k04J91J02k87J60J78l50K09j01J84j77J14Q5r0k9L8j35P3R1
$$ 252 38 208 43 -161 30 132 -155 5 183 -167 42 -59 125 -52 62 147 57 28 66 -69 4 95
8154I5j58R4J55j14l10J76K46o7j81K23j80k0J81j51j08N4j63L32j19J52j26n4
$$ 95 -63 31 186 72 -238 -62 184 117 -64 159 -21 -41 140 -11 -119 -65 -228 104 -15 137 11 -43
8176d3J26n5K59j80J13j36j19K52r0l41K35O6k29J34K44
$$ -43 83 28 287 107 220 84 -35 217 127 -214 21 87 -142 -8 236
8191B36
$$ Imaginary data points
##PAGE= N=2
##DATA TABLE= (X++(I..I)), XYDATA
0@%%%%%%%%%%Qj6J6j6K4l2L2m0M8n6P2q8J03j19J36j60J86k10K44k83L22l66M15
$$ 0 0 0 0 0 0 0 0 0 0 0 8 -8 8 -8 16 -16 16 -24 24 -32 40 -48 55 -64 72 -88 98 -112 132 -151 171 -195 220
33B20m69N29n94O67p46Q33r29J032j144J268j406J553j714J891k085K297k528
$$ 220 -249 280 -314 353 -393 440 -489 543 -601 667 -739 814 -900 991 -1094 1203 -1325
50a325K785l069L385l736M129m576N087n677O364p178Q163r384J0939j2987J5825
$$ -1325 1460 -1609 1776 -1960 2169 -2407 2680 -2997 3367 -3811 4352 -5032 5907 -7080 8745
65H745k0022K6835l9671P1696k88258m41017R07224K70793p01585j49038N35214
$$ 8745 -11277 15558 -24113 47583 -240675 -681692 225532 496325 -205260 -354298 180916
76A80916J2271l40713p035J67404L9711M9490j02826k25850J19330L51978j29691
$$ 180916 193187 -147526 -154561 12843 52554 102044 -782 -226632 -107302 244676 114985
87A14985l89658J31013L85956j50638l37805J56738K80566j40677k07653Q5565
$$ 114985 -274673 -143660 242296 91658 -246147 -89409 191157 50480 -157173 -71608
97g1608J36469l490m7903q8294l5981J64373R3547k05501q8625K21775M1324k24621
$$ -71608 64861 61371 13468 -74826 -110807 53566 147113 -58388 -147013 74762 116086 -108535
109a08535J6645K11738m6008j53396N3112M7528m7050P2578M1216j51560k1864
$$ -108535 -91890 119848 73840 -79556 -26444 21084 -25966 46612 87828 -63732 -85596
120h5596J76946j8480j67656P7492J50647j29852j21209J54439O6282j47409J9221
$$ -85596 91350 72870 -94786 -17294 133353 3501 -117708 36731 103013 -44396 -25175
131b5175J21601j18172q8292K02950M6161k52939R006K57403p2457k32028J26490
$$ -25175 96426 -21746 -110038 92912 139073 -113866 -104860 152543 80086 -151942 -25452
142b5452J91262j55893j46745J47844R2130j10744l0595N6774k7461r925O0800
$$ -25452 165810 9917 -136828 11016 103146 -7598 -38193 18581 -8880 -18805 41995
153D1995k7276o8277N9075N3228r4583l5114J19489J8680j21470o031R4153j2539
$$ 41995 14719 -53558 5517 58745 -35838 -70952 48537 67217 -54253 -60284 33869 21330
165B1330n4155L4658J3787n0237J6937M5693m3592k0382O5168j4206p7776M1609
$$ 21330 -32825 1833 15620 -34617 -17680 28013 -15579 -35961 29207 15001 -62775 -21166
177b1166P3505n5394m7926N8692Q188n6175L2069M9188n6030l3629O3112J0404
$$ -21166 52339 -3055 -50981 7711 15899 -40276 -8207 40981 -15049 -48678 14434 24838
189B4838n8160J8607N0940l9915l7750M7486J6855l8986J6832K4734n2011r437
$$ 24838 -33322 -14715 36225 -3690 -41440 6046 22901 -16085 747 25481 -26530 -35967
201c5967Q0198m226r2275K5978R0882n0290q1387P1748P0150p6217n5612O4390
$$ -35967 44231 40005 -52270 -26292 64590 14300 -67087 4661 74811 -1406 -57018 7372
213G372L6978m0619j5402J6537j407M748Q366k2670n482M0906l211n6761Q366
$$ 7372 44350 3731 -11671 4866 3459 8207 16573 -6097 -11579 29327 26116 -30645 -22279
226b2279O6559j0384o5729J1947N1888j6576l2405K0521J3076j9643J498P951
$$ -22279 44280 33896 -31833 -19886 32002 15426 -16979 3542 16618 -3025 -1527 6424
238F424j5341R706K8068k8812l7762M0274L6760m4402k6598M1638J1711l9035
$$ 6424 -8917 789 28857 45 -37717 2557 39317 -5085 -31683 9955 21666 -17369
250a7369r76L2532m271k1535L127M369j251J1098n22k0119M31K3305n108k3010
$$ -17369 -18345 14187 9916 -11619 -8492 -4123 -5374 5724 5202 -14917 -14486 8819 3711 -19299
264a9299J3993K1667k3962j9349K8481J5062k7072n698K3186p261j8061J9106
$$ -19299 -5306 16361 -7601 -26950 1531 16593 -10479 -16177 7009 -252 -18313 793
276G93J2233k3346k838J9066o009j1634J5139N730j9132n84J7724m142r906J0119
$$ 793 13026 -10320 -13158 5908 -101 -11735 3404 9134 -9998 -10582 7142 3000 -6906 3213
290C213K462j3984K408J4860l266j1117O479O224j1419M45J5245l977j4469O847
$$ 3213 5675 -8309 -5901 8959 5693 -5424 1055 7279 -4140 -3695 11550 7573 -6896 -49
304d9R831j0144k809J5128m031j6763R065J3375j1706n748J2951j808j3659O131
$$ -49 9782 -362 -3171 11957 7926 -8837 228 13603 1897 -3851 9100 7292 -6367 -236
318b36J2494p947p629O940K03n308M612L723n995k659M980j000n108O362M362
$$ -236 12258 4311 -3318 3622 3825 -1483 3129 6852 857 -1802 3178 2178 -2930 3432 7794
333G794j0445n440J1648L383j0994l78R809m683r763Q343P381r347l228O030k235
$$ 7794 -2651 -8091 3557 6940 -4054 -4432 5377 694 -9069 -726 6655 -2692 -5920 110 -2125
348b125l025O544M07q115J200O709m714k850P156j0q137P08O818m86m133J399
$$ -2125 -5150 1394 1801 -6314 -5114 1595 -3119 -5969 1187 1177 -6960 -6252 566 80 -4053 -2654
364b654J808l606j46N096k56l981J377J830k925J55O417j982p288L865N651m670
$$ -2654 -846 -4452 -4598 498 242 -3739 -2362 -532 -3457 -3302 3115 1133 -6155 -2290 3361 -1309
380a309j836O161r22o015K192N337k416j455J928j335j188L455O98k363J62J375
$$ -1309 -3145 3016 2094 -3921 -1729 3608 1192 -263 1665 330 -858 2597 3295 932 1094 2469
396B469r83j335K695K406l217k887K451K605j408j282J693j133j817K712J375
$$ 2469 1486 151 2846 5252 2035 -852 1599 4204 2796 1514 3207 2074 257 2969 4344
411D344l518M87K987l319k898M815K480m300k779K353J437m39o01j922R30K006
$$ 4344 826 1313 4300 981 -1917 2898 5378 1078 -1701 652 2089 1650 1049 -873 57 2063
427B063k164k870L200L368l026n634J309O374L22o523j724N290K215m891k412
$$ 2063 -101 -2971 229 3597 571 -5063 -3754 2620 2942 -3581 -5305 -15 2200 -2691 -5103
442e103M232K910l186m681Q83O655J245p372l414P537L686n745l452M323L325
$$ -5103 -871 2039 -1147 -5828 -4945 1710 2955 -4417 -7831 -294 3392 -2353 -5805 -1482 1843
457A843l110l555R33N119J987o189m081N926N777m050o105K083O873l23o729n85
$$ 1843 -1267 -4822 -3889 1230 3217 -2972 -7053 -1127 4650 600 -5505 -3422 3451 3128 -3601 -4186
473d186P538J099o561k056N614L440k564l961j077M474M458m581n709M510O249
$$ -4186 3352 4451 -2110 -4166 1448 4888 2324 -1637 -2714 1760 6218 1637 -4072 438 6687
488F687l411o877K545P331K56p905l785P982O203o610p781N131P535l211p022
$$ 6687 3276 -3601 -1056 6275 6531 -1374 -5159 2823 9026 2416 -5365 -234 7301 4090 -2932
503b932M27P448K133p723n550P050P698n518r275L190Q946l59q611k992Q176N566
$$ -2932 -2505 4943 7076 -647 -6197 853 8551 3033 -6242 -3052 5894 5535 -3076 -6068 2108 7674
519G674q430q075Q186Q893p312r258N001Q183k014o616j671M194M933l341o540
$$ 7674 -756 -8831 -645 8248 936 -8322 -3321 4862 2848 -3768 -5439 -1245 3688 347 -6193
534f193J867P330m5q087k399Q226M871p645o858O520Q046n134q074M210O445j748
$$ -6193 -4326 3004 2959 -5128 -7527 699 5570 -2075 -8933 -2413 5633 499 -7575 -3365 3080 1332
550A332m520j288L488L751j206n852m18P170K568p058l841N772N735l382p734
$$ 1332 -3188 -4476 -988 2763 1557 -4295 -4713 2457 5025 -2033 -5874 -102 5633 2251 -5483
565e483J808R848n0j0797j141J0528L682r865n488Q319O384n051p081K238Q031
$$ -5483 -3675 6173 6123 -4674 -5815 4713 8395 -1470 -6958 1361 7745 2694 -4387 -2149 5882
580E882k37p777k088O548N128m788p601K572J0153j010j1686j244J3059J947j2720
$$ 5882 5645 -2132 -4220 2328 7456 2668 -4933 -2361 7792 6782 -4904 -6148 6911 8858 -3862
595c862k723J0621L346q231l746M902M285j905m949j621M833M302m420o708L388
$$ -3862 -6585 4036 7382 -849 -4595 307 4592 2687 -2262 -3883 950 5252 832 -5876 -2488
610b488P656j776q907R06Q835j97q462j444P170L224n590m258L343M257j506m361
$$ -2488 5168 3392 -5515 -4609 4226 4029 -4433 -5877 1293 4517 -1073 -5331 -1988 2269 763 -3598
626c598j54L766J913k580l650J340M425P77m868k666N168M354m629o454M585P729
$$ -3598 -3752 14 1927 -653 -4303 -2963 1462 2239 -2629 -5295 -127 4227 -402 -6856 -2271 5458
642E458l444q452K552Q463j730p404P99P246Q0n614j065K545L400J70m480k313
$$ 5458 2014 -6438 -3886 4577 2847 -4557 -3758 3488 3568 -2046 -3111 -566 2834 3004 -1476 -3789
658c789N463L777o182m388O922N229p032n579N939N843l991n127K197M470j040
$$ -3789 1674 5451 -731 -5119 1803 7032 0 -5579 360 6203 2212 -2915 -718 3752 2712
673B712l795k2L304R94k134k305M99L641L0l971o86M176Q37m113j228L438J338
$$ 2712 -1083 -1105 2199 3193 1059 -1246 -747 2894 2924 -1047 -1733 2443 3280 -833 -2061 1377 2715
690B715k404j744J318J975j048k231P72J858n58j683M03P17p74n8J113l93j178
$$ 2715 311 -1433 -115 1860 812 -1419 -647 1211 653 -1030 -627 90 -684 -742 371 -22 -1200
707a200M54R47j016j222J804J176j808k155J916J966j664j717J752O54j119j21
$$ -1200 -746 201 -815 -2037 -233 943 -865 -3020 -1104 862 -802 -2519 -767 -113 -1232 -1353
723a353R03o99P19Q20k027m31K547P62k910K2K163P0j734j50J200P01o07j035
$$ -1353 -450 -1149 -430 390 -1637 -2068 479 1241 -1669 -1647 516 586 -1148 -1298 -98 603 -4 -1039
741a039N49J286n2j185P0P86L86k57m29j52J404j42j765O86J445n94j210R45L07
$$ -1039 -490 796 744 -441 -371 415 801 544 115 -37 1367 1225 -540 146 1591 997 -213 732 1039
760A039j93o5j26L0K44K69m84k80M55o62j14P05k09k20K57L17j042n1P86M34j298
$$ 1039 846 781 655 685 929 1198 714 434 889 227 113 818 609 389 646 963 -79 -130 656 1090 -208
781b08j80J117m0j104j73O90O19j091l21K90N07o7p82Q3N27J69n64o94N69P30
$$ -208 -388 729 689 -415 -588 102 721 -370 -691 -401 106 39 -743 -660 -133 36 -528 -1222 -653 77
801G7q64l31P58L48q79l22M03L80j07k98l11M68N93l66m88K79P22n11k66Q5O33
$$ 77 -787 -1118 -360 -12 -891 -1213 -810 -430 -537 -835 -1146 -678 -85 -451 -939 -660 62 -449 -715 -630 3
822CJ57j018K70O07N1j65m47P34J54m48j09N54L76j06r31L39R27m24o29L77N75
$$ 3 160 -858 -588 19 70 -95 -542 192 346 -102 -211 343 719 613 -318 21 948 524 -105 272 847
843H47r2p73M37N84m33l2k3p0N25m26MJ89J57k65m3j56J1J35k33j83L23L4l37
$$ 847 755 -18 419 1003 570 538 515 445 970 544 548 737 894 629 586 430 441 576 343 160 483 517 180
866A80q5l1K67j49J23n14K67K63n19k21N81j85k73J09K7q6O0k04O3j9j35k46K17
$$ 180 95 64 331 182 305 -209 58 321 -198 -419 162 -23 -296 -187 -160 -246 -186 -390 -327 -346 -481 -727 -510
889e10J04k81J10J10k5k4j36K60k39R5J38l23R2N24n84o0N61k08N6j47J65J89
$$ -510 -406 -687 -577 -467 -492 -516 -652 -392 -631 -536 -398 -721 -629 -105 -689 -749 -188 -396 -340 -487 -322 -133
911a33n2J67k59k79Q27l17r7J30K5P00o17k76L98J84m39P2K33L57j73m7K52l78
$$ -133 -185 -18 -277 -556 271 -46 -143 -13 12 712 95 -181 217 401 -38 34 267 624 451 404 656 278
933B78O26l46j96j75P50l75n82P85j84l67J66L78l28mj70kK22jK22n10n02P96
$$ 278 904 558 362 187 937 562 -20 765 581 214 380 758 430 426 256 254 476 475 697 187 -315 481
955D81k08o6k68M89J51o67r0J40M99k15n59J06J05L82k32p55L90N71l45r35O54
$$ 481 273 207 -61 428 579 -88 -178 -38 461 246 -313 -207 -102 280 48 -707 -317 254 -91 -1026 -372
976c72N31l11m88J72N27j34n69k55J51Q41j55o57p7M21M53m50p98R41P93p77n70
$$ -372 159 -152 -640 -468 59 -75 -644 -899 -748 93 -62 -719 -796 -375 78 -372 -1170 -229 564 -213 -783
997g83P66Po34K69K63l91M07N23q91J6R75M72j412J9J079K70j159j06P79L58q00
$$ -783 -17 -10 -644 -375 -112 -503 -96 427 -464 -448 527 999 -413 -394 685 955 -204 -310 469 827 27
1018B7r3K97P49l99n90M5j42R25k50r44M12O54K33j109l2P87L14m94p23M44R82
$$ 27 -66 231 980 581 -9 36 -106 819 569 -375 37 691 924 -185 -217 570 884 390 -333 111 1093
1039A093p77p76K59J391n83j291M59R79j84j233O21O62o89K00N9m06k47J091l05
$$ 1093 316 -460 -201 1190 607 -684 -225 754 570 -663 -42 620 -69 131 190 -216 -463 628 323
1058C23j384P11J380r11j944J210J699j326j366J444P35q95p28J080j80p17O56
$$ 323 -1061 -350 1030 119 -1825 -615 1084 -242 -1608 -164 571 -324 -1052 28 -152 -869 -213
1075b13O1r16L84J092o04j440R04J332n26j403R20J461q84j404R46P04m05m83
$$ -213 -152 -1068 -684 408 -196 -1636 -732 600 74 -1329 -409 1052 168 -1236 -290 414 9 -474
1093d74L47L7L66j98k24r1M05N46n12m59L18P37j87p18m34J180P12j417n40J647
$$ -474 -127 -90 276 78 -146 -237 168 714 202 -257 61 798 611 -107 -541 639 1351 -66 -606 1041
1113A041N13j994k16J805J79j621J2J367m73o63N84J23r72M26R70j098q05J641
$$ 1041 1554 -440 -656 1149 1328 -293 -281 1086 613 -50 534 657 -315 111 1081 -17 -822 819
1131H19M98j857l36K193j42k190L52J790n66j475R58O53j041p5Q05m54p73R92
$$ 819 1317 -540 -876 1317 1175 -1015 -663 1127 561 -914 44 697 -344 -419 386 -68 -841 151
1149A51N05j139n96J018M18r62L9O89j48p91J8P35k41j04P6k31J67M16m45k90
$$ 151 656 -483 -1079 -61 357 -605 -566 123 -25 -816 -798 -63 -304 -408 -332 -563 -396 20 -425 -715
1169g15R21M6q01K75K06l43M14l4o28k3J160j54j159L12J595n74j531R73J154
$$ -715 206 252 -549 -274 -68 -411 3 -31 -659 -682 478 324 -835 -523 1072 498 -1033 -60 1094
1188A094j298o68J043L81p88J71N19k97l71P07R4q94N77N49m35j247J347Q19r61
$$ 1094 -204 -872 171 552 -236 -65 454 157 -214 493 587 -307 270 819 384 -863 484 1303 342
1207C42q10J079L81j672N62J195n57o86P25n1p81O11L96p20n29R45k6p07k0J011
$$ 342 -468 611 992 -680 -118 1077 520 -166 559 508 -273 338 734 14 -515 430 404 -303 -323 688
1227F88l75n65M07j40k44J61J14p17M36M51p9p81L86N06k18o21Q42j05o29J69
$$ 688 313 -252 155 15 -229 -68 46 -671 -235 216 137 -644 -258 248 30 -591 251 146 -483 -314
1247c14J15l17K60M57l30n58J03L97l93k71Q44J8p06J06P53l89k69O20J27q21
$$ -314 -199 -516 -256 201 -129 -687 -584 -187 -580 -851 -7 11 -695 -589 164 -225 -494 126 253 -568
1267e68M47M55o17K9N34L0q18J41R26n19n26R04J26q20K82M13n3m39L86K09r19
$$ -568 -121 334 -283 -254 280 310 -508 -367 559 40 -486 418 544 -276 6 419 366 -73 313 522 -397
1288c97J35R43q2q25N78L69p01J67L99m0o63N85L58r07K2N78J9o43N44m9m18k99
$$ -397 -262 681 599 -226 352 721 20 187 586 546 -117 468 826 -81 -59 519 538 -105 439 390 -28 -327
1310c27Q46k21n68M82K77n86j89P63l88k36J95M45q85j52Q87j40q55M55L52o61
$$ -327 519 298 -270 212 489 -97 -286 477 89 -147 48 493 -392 -544 343 203 -652 -197 155 -506
1330e06M6M50o6o91L23O94m91n49P57k3m41K26M89o28k52N79M4p73M42P80p09
$$ -506 -460 -10 -76 -767 -444 250 -241 -790 -33 -56 -497 -271 218 -410 -662 -83 -39 -812 -370 410 -299
1351b99j31M37pn90N05J37q0l77N48J65n72K13L49l47l08K82K94n37J79Q00p14
$$ -299 -430 7 0 -590 -85 52 -28 -405 143 308 -264 -51 298 -49 -357 -75 219 -318 -139 661 -53
1372e3l64J016j48m76ML23K63q41O83J24m18n4P13m46m69N91J15m09o4L42j03
$$ -53 -417 599 451 -25 -21 302 565 -276 407 531 113 59 772 326 -143 448 563 154 90 432 329
1393C29n50M41K58l45l42P01l00l64K40K15j3o91O90J43p67L61R7j74k11L63j63
$$ 329 -221 220 478 133 -209 492 192 -172 68 283 270 -421 269 412 -355 6 103 -71 -282 81 -82
1414h2j82l2M81m3o19N38j36l63K82L42l42j64K78k22l15K96K16l12J7QJ26m61
$$ -82 -264 -296 185 142 -477 61 -75 -438 -156 186 -156 -320 -42 -264 -579 -283 -67 -379 -362 -354 -228 -689
1436f89L36K34l71J07Q7J90o6j22K57J90m62J54J79j4j72J66k84J48K82N6j77
$$ -689 -353 -119 -490 -383 -296 -106 -172 -294 -37 153 -309 -155 24 10 -162 4 -280 -132 150 206 29
1457B9K77K02n17J80k59L38l19R7K37J41l71J40M8j26J35j84K75j84l5K57L8n29
$$ 29 306 508 -9 171 -88 250 -69 28 265 406 35 175 223 97 232 48 323 139 104 361 399 -130
1479a30N36R4k94r8K88k49m95P32j53k09K84j68j53O7J27j36j00m2K39p4l18K67
$$ -130 406 500 206 108 396 147 -348 384 231 22 306 138 -15 52 179 43 -57 -99 140 66 -252 15
1501A5Kr5k3p3M7K41m72M59m64K53j36k13J72J28L8o3j30Q0J10j88J47K45k81
$$ 15 17 -78 -101 -174 -127 114 -358 101 -363 -110 -246 -459 -287 -159 -121 -184 -314 -234 -124 -312 -165 80 -201
1524b01J25J2j96r4K10m9r9R2L64m22j53K03J43k16N15k58k05L01Q9l19L88k34
$$ -201 -76 -64 -260 -354 -144 -193 -292 -200 164 -258 -411 -208 -65 -281 234 -24 -229 72 161 -158 230 -4
1546dJ33l17L06k38L28o5m1l8N4q0J03N5J6qM2j64O28n08j69J30J06N6ok82j9
$$ -4 129 -188 118 -120 208 143 102 64 118 38 141 196 212 204 246 82 710 202 33 163 269 325 319 37 18
1571A8J59O1l03j55L48k4K91k84J14j93J00l49L8M20j1n22J88K49k3m20K00P9
$$ 18 177 238 -65 -220 128 104 395 111 225 32 132 -217 -179 241 230 -292 -104 145 122 -298 -98 -19
1593a9l6m3J93m97L40j85K33p1l84M24j69n4j82K22K09m57j24M23J11l77M1L16
$$ -19 -55 -98 95 -402 -62 -247 -14 -85 -469 -45 -214 -268 -450 -228 -19 -476 -600 -177 -66 -443 -402 -86
1615h6j77oR5K80l54j73K89J67k87L30Q3k92k65N76q4j06j6J27n1j36j78N77o4
$$ -86 -263 -269 -174 106 -248 -421 -132 35 -252 78 161 -131 -396 180 96 -10 -26 101 50 -86 -264 313 249
1638B49k61J8M50j62p8m8n6j2K41k6j74m27P59j13k24j23J08L78l62j37l9L31
$$ 249 -12 6 456 294 216 168 112 100 341 315 141 -286 473 360 136 13 121 499 137 0 -39 292
1660B92j06L5j70J30K2l3l5j26K39k87Q4O5k34L95p8m65o0Q03l98l18K9M50m58
$$ 292 186 221 51 181 203 170 135 9 248 -39 45 110 -124 271 193 -272 -332 471 73 -245 -216 234 -224
1683b24k60N84O2k87k31K38j16r7K1M13m78j01N03j97j11k42P71l54m26J27K37
$$ -224 -484 100 162 -125 -356 -118 -234 -331 -310 103 -375 -476 27 -170 -281 -523 248 -106 -532 -405 -168
1704a68L31o99L87o9Q5l46L54K15k64j19O51m64l11J31M02m66J54L23K42l47j16
$$ -168 163 -536 -149 -218 -133 -479 -125 90 -174 -293 358 -106 -417 -286 116 -350 -196 127 369 22 -94
1725i4K28j87J27p5J57P6N8n56J03O65k28n0lp6j54K85J83m8k12k9Q1n13N43J7
$$ -94 134 -53 74 -1 156 232 290 -266 -163 502 274 224 221 145 -9 276 459 411 199 170 251 -262 281 298
1749B98R6l63J01M18l71j6l6K52l33K58qj81l4K06K3n05L23O0rl87r5N54k68m25
$$ 298 394 31 132 550 179 163 127 379 46 304 296 115 81 287 310 -195 128 188 179 -208 -303 251 -17 -442
1773d42M26p5k11M1K64J01j84K1j25k44K04J86k43N3J02r2j79J9M27m38j0N62
$$ -442 -16 -91 -302 -261 3 104 -80 -59 -184 -428 -224 -38 -281 -228 -126 -218 -397 -378 49 -389 -399 163
1795A63q3k47r5Q2mm3K19k51J04m9J66j99M55O1m92L70l78mk4J61L08l22P5L30
$$ 163 80 -167 -262 -180 -184 -227 -8 -259 -155 -204 -38 -237 218 279 -213 157 -221 -225 -249 -88 220 -102 -27 303
1819C03J4m11J25M09l60p4O4K89l91K34K08j51n5L0Q5M9l33J58L20o16K02J17
$$ 303 317 -94 31 440 80 6 70 359 -32 202 410 259 204 234 319 368 35 193 513 -103 99 216
1841B16J17k68J92J73k29l20J20O7n2R1k85J0J90K10L4k99m7K78n06K24N84o87
$$ 216 333 65 257 430 201 -119 1 68 16 107 -178 -168 22 232 266 -33 -80 198 -308 -84 500 -187
1863a87J52k12J50q2Q1J36j62j07K61j37m05L58r0l2j86M41k52K0J09nP3m01L66
$$ -187 -35 -247 -97 -179 -98 38 -124 -231 30 -107 -512 -154 -244 -276 -462 -21 -273 -253 -144 -149 -76 -477 -111
1886a11p9Q9k38J47J29j38M3J75l65LM76q3J6j03L62m37l0M41k5m15K49P1j11
$$ -111 -190 -101 -339 -192 -63 -201 -158 17 -348 -345 131 48 64 -39 323 -114 -144 297 272 -143 106 177 66
1909F6k59M92k09j6K1K58k56k15L11J53kl32N41l05j29j01M42m75O7M39j67j84
$$ 66 -193 299 90 74 95 353 97 -118 193 346 344 12 553 248 119 18 460 -15 52 491 324 140
1931A40L9j7j4k17M01k91k0J3Kl00J47J29J45k99MK92m46J90J10j58r8J55O2j23
$$ 140 179 162 148 -69 332 41 21 34 36 -264 -117 12 157 -142 -138 154 -292 -102 8 -150 -248 -93 -31 -154
1955a54J42R6J9m18L29J25k17k1p8L51k88j33K08J60m73K66P0l05L35m1n42K72
$$ -154 -12 84 103 -315 14 139 -78 -99 -177 174 -114 -247 -39 121 -352 -86 -16 -321 14 -27 -569 -297
1977b97M0L24l41J69L32m28R5J98j38k62K03J90q9k14J17J62j53R3qq9k39K02
$$ -297 -257 67 -274 -105 227 -201 -106 92 -46 -308 -105 85 -4 -218 -101 61 -92 1 -7 -96 -335 -133
1999a33L95l17J57O3J35k27K22j2q1J0j49K57l23M46j08k60J44M8j68l78M85q3
$$ -133 262 -55 102 165 300 73 295 283 202 212 63 320 -3 443 335 75 219 267 99 -279 206 123
2021A23J83m63L44j32j1J4K4Oj11L15l92L79m28N57n82K75J26k37k21K81J3j41
$$ 123 306 -157 187 55 44 58 82 88 -23 292 -100 279 -149 408 -174 101 227 -10 -231 50 63 -78
2043g8J68k0j56J0K86n27K59j41Q9P1l75M47j08l48K09J50l1j85J38L2k08J79
$$ -78 90 70 -86 -76 210 -317 -58 -199 -110 -39 -414 33 -75 -423 -214 -64 -95 -280 -142 -110 -318 -139
2065a39K10J00l81k7J14l4J69J63l86M0K42J32J5m47J63J67K6j19j73J85j7j03
$$ -139 71 171 -210 -237 -123 -157 12 175 -211 -171 71 203 218 -229 -66 101 127 8 -165 20 3 -100
2087a00K75l52K00R1N5n5L3P4j38K00j08j36N3J52j49K31j49q3NM3j82L60K0k70
$$ -100 175 -177 23 114 169 114 147 221 83 283 175 39 92 244 95 326 177 94 99 142 -40 320 340 70
2111G0P6K06l17L89j33j9m34K12Q6j83N8J15R4n19J16L58j28J18m8k43K80r8j62
$$ 70 146 352 35 424 291 272 -162 50 136 -47 11 126 220 -299 -183 175 47 165 117 -126 154 56 -106
2134a06j80L60m04k0L30op7N7j8j7L7J49j12j53L00n05N86k43kj56M19l54J69
$$ -106 -286 74 -330 -350 -20 -26 -103 -46 -64 -81 -44 105 -7 -160 140 -365 221 -22 -24 -180 239 -115 54
2157E4J59l26r2QK47j82M5R3j57k25J65K27r2n8K20J66k61J62j79K47l09L49K0
$$ 54 213 -113 -205 -197 50 -132 -87 6 -151 -376 -211 16 -76 -134 86 252 -9 153 -26 221 -88 261 281
2180B81j66j05J74j50q0m7O0RJ03L7j68L79k69P4m7K40l90K50j42J52j24J65r1
$$ 281 115 10 184 34 -46 -93 -33 -24 79 116 -52 327 58 132 85 325 -65 185 43 195 71 236 145
2203A45jj52O0Q7j87J40j68j84M28l24J66J45l25K49k27J13j73J05j72j24M43
$$ 145 144 -8 52 139 -48 92 -76 -260 168 -156 10 155 -170 79 -148 -35 -208 -103 -275 -399 44
2224D4j13k13n6K93p8j25N0L89m59J36q4L5O2K13m00J93j29O2L22j72l4o2K42
$$ 44 -69 -282 -338 -45 -123 -248 -198 191 -268 -132 -216 -181 -119 94 -306 -113 -242 -180 142 -30 -64 -126 116
2247A16l59K12l7K30l57J81k03MJ48j20K30L2L1O6j72j57j50K50K48Jj47K21l32
$$ 116 -243 -31 -68 162 -195 -14 -217 -213 -65 -185 45 77 108 174 2 -155 -305 -55 193 194 47 268 -64
2270f4J24N2J75k02K1M0o7J84j28Q8j21j78J33l1k80M49J05k70K39J11l18J96
$$ -64 60 112 287 85 106 146 79 263 135 223 102 -76 57 26 -254 195 300 30 269 380 62 258
2292B58j96J34j99J41P2o4j61K21J17m61JJ8r9Q9J40j52M10n11M09k64k65L27
$$ 258 62 196 -3 138 210 146 -15 206 323 -138 -137 -119 -218 -129 11 -141 269 -242 167 -97 -362 -35
2314c5J22k01O4J55n65J69N18l98j37J28J43j65j37L57j42j25M71k98Q1j81J10
$$ -35 87 -114 -50 105 -460 -291 227 -171 -308 -180 -37 -202 -339 18 -124 -249 222 -76 5 -176 -66
2335f6q6J44J00k22K36l05K24q9p4J94J02N8m28J30J3J12r4K19J14m26J31L06
$$ -66 -152 -8 92 -130 106 -199 25 -64 -138 56 158 216 -212 -82 -69 43 -51 168 282 -144 -13 293
2357B93q8j83l4K29l87J02K12k50K15L1j6j17Q9Q7j45MM43o02L69l3k71J45J28
$$ 293 205 22 -12 217 -170 -68 144 -106 109 140 124 7 96 183 38 42 485 -117 252 219 -52 93 221
2380B21k5l3k33K84r6r7m2J44J42j28K6L5j37k09K63j67q0K8Q3J28k01J58q2j68
$$ 221 196 163 -70 214 118 21 -21 123 265 137 163 198 61 -148 115 -52 -132 -104 -21 107 -94 64 -18 -186
2404a86K19r9o7n3J80j21J04j20pk5l8K91j47LL7k24J73n7K01l02RM6J21J55r6
$$ -186 33 -66 -133 -186 -6 -127 -23 -143 -150 -175 -213 78 -69 -66 -29 -253 -80 -137 64 -238 -229 -183 -62 93 -3
2429ck4j20r3J93Rr4J7M3L15k23J31j2j36M1j0Q8p9k2k84K93J90q8p6K49m23M13
$$ -3 -27 -147 -240 -47 -38 -132 -115 -72 243 20 151 139 3 44 34 122 43 21 -263 30 220 132 56 305 -118 295
2455B95l0n89N09K60l35MK19l47Mj66L69o6L4%ml37M85l24K56L2m09J91p3J1J80
$$ 295 265 -324 185 445 110 114 333 -14 -10 -176 193 127 161 161 157 -180 305 -19 237 269 -140 51 -22 -11 169
2480A69k39J45J15l00L05j63j75k2J49m1j42K2m2R0K0LR4J40l55K47O1l79L59
$$ 169 -70 75 190 -110 195 32 -143 -165 -16 -57 -199 -177 -219 -129 -109 -106 -12 128 -227 20 81 -298 61
2503F1L0k4k33J08R3j74J6m3J85m4OJ02j83J85L7l22M8pk04K54M7K38jL1j88N3
$$ 61 91 67 -166 -58 35 -139 -123 -166 19 -25 -19 83 -100 85 122 -200 -152 -159 -363 -109 -62 176 175 206 18 71
2529G1r7J17K98j17m35J84K38p4k95L26j55K09n19M26k37j48K38L58n01K84m7
$$ 71 -26 91 389 272 -163 21 259 185 -110 216 61 270 -249 177 -60 -208 30 388 -113 171 124
2550A24kj41J49n0k06L11O2q9k11p8K84j56j13J11R1p6J85J02o12M05j36O2J35
$$ 124 122 -19 130 80 -126 185 247 158 -53 -131 153 -3 -116 -5 86 10 195 297 -315 90 -46 16 151
2573A51j94p7j28R9o9M91m87j3L29l12K98j45r3k5J91qk90K10K20l8j95K54k23
$$ 151 -43 -120 -248 -149 -218 273 -214 -227 102 -210 88 -57 -150 -175 16 8 -282 -72 148 110 -85 169 -54
2596e4j18J83j9O9l79K33K17k61M1K21j04k07j3n2L33m24M57j38j41L92k25M6
$$ -54 -172 11 -8 61 -318 -85 132 -129 -88 133 29 -178 -191 -243 90 -334 123 -15 -156 236 11 57
2618E7J15Mk74L22k41L96m95K2j27M36K2l18l3J77p8J72N6k41J87p4J61k16p5
$$ 57 172 176 -98 224 -17 379 -116 -94 -221 215 237 -81 -114 63 -15 157 213 -28 159 85 246 30 -45
2641d5L19o4J46k13j95O8J46j18L05l25J12j74p8J77m6j0q9J42k5j35J84l1j80
$$ -45 274 210 356 143 -52 16 162 44 349 24 136 -38 -116 61 15 5 -84 58 33 -102 82 51 -129
2664a29j40J31n8j15K74r7Q9Q3n4%lj7l3J07j13K8o4k45J55L05l4k63L21j31m0
$$ -129 -269 -138 -196 -311 -37 -134 -45 38 -16 -16 -19 -36 -69 38 -75 -47 -111 -356 -201 104 70 -193 128 -3 -43
2689d3k69N39k55j57J80r1o3J20m2p5J18q3J41R3l76K60J33q0n6m0J52j63J72
$$ -43 -312 227 -28 -185 -5 -96 -159 -39 -81 -156 -38 -121 20 113 -263 -3 130 50 -6 -46 106 -57 115
2712A15r3p4N5k06J05J29R6o7P4N8l35K98L0Qj9j24k8J32l15L73m4k64J41k10
$$ 115 22 -52 3 -203 -98 31 127 60 134 192 -143 155 185 193 174 50 22 154 -161 212 168 -96 45 -165
2736a65L85k3m91K87o4J09Q3l22J81O1j75p7J16K40j48K37m26j04K27K18m02L04
$$ -165 220 197 -294 -7 -71 38 121 -201 -20 41 -134 -211 -95 145 -3 234 -192 -296 -69 149 -253 51
2758E1n0j51J69j39R8J52k51R4J63r2j06K56m90R8L11p3R7l01k5m8J52k27J21
$$ 51 1 -150 19 -120 -22 130 -121 -27 136 44 -62 194 -296 -198 113 40 137 -164 -189 -237 -85 -312 -191
2781a91JL70k98R0n2j37K74l84N21q9j00J42k74j52K43K08n6mm5Nl4N1J75j42
$$ -191 -190 180 -118 -28 -80 -217 57 -327 194 105 5 147 -127 -279 -36 172 116 112 67 72 38 89 264 122
2805A22j37k18J78J54J63p1q8k18J96M2R1j20N0K9J48m4l36M34m12N0n9K43l92
$$ 122 -15 -233 -55 99 262 191 103 -115 81 123 214 94 144 173 321 277 -59 375 -37 13 -46 197 -195
2828a95K77J1j60r4M71l64k52K77J79j66l7K06r0m3j1L8J69j28r1j45r7J92j94
$$ -195 82 93 -67 -161 310 -54 -306 -29 150 -16 -53 153 63 20 9 47 216 88 -3 -148 -245 -53 -247
2851b47J03oj38o2Q7J07J46l8k04L67q9j68J70o5O4j11oJ5l69N54n3k33l9K19
$$ -247 -144 -150 -288 -350 -263 -156 -10 -48 -252 115 26 -142 28 -37 27 -84 -90 -75 -444 110 57 -176 -215 4
2875Dkj88K2P9j70K9ML7M31k98MK26m77N88l24J09l86N91O1m78J86J02r8o2n0
$$ 4 2 -186 -164 -85 -255 -226 -222 -185 246 -52 -48 178 -299 289 -35 74 -312 279 340 -138 48 150 52 -10 -60
2900f0L83k18j21j1J61J18j15o2J9k86K62J05r0j2n9j9n4J68O8j96P1n9j23K82
$$ -60 323 105 -16 -27 134 252 137 75 94 -192 70 175 85 73 14 -5 -59 109 177 -19 52 -7 -130 152
2924A52p4l6rk96Q8J94j34q3J8L74j00R8j83J28l47N4N0K46j56qj34J97j2k49
$$ 152 78 42 33 -263 -175 19 -115 -198 -180 194 94 192 9 137 -210 -156 -106 140 -16 -24 -158 39 27 -222
2948b22J88q6J88l00J33J32k51M88k77l34L97l5j71j5M5J19j8R5o4j5J7l6L9l7
$$ -222 -34 -120 68 -232 -99 33 -218 270 -7 -341 56 21 -150 -165 -120 -1 -19 76 12 -3 14 -22 17 -20
2972b0l1K11q2R7k90P5J25l9R5n9j19L8j20K62j71j36K41J84k14J29j91J7K61
$$ -20 -51 160 78 175 -115 -40 85 46 141 82 -37 1 -119 143 -28 -164 77 261 47 176 -15 2 263
2995B63l88P5J87j8r7J50k97J71m3j39J32M5j7j29K0J50R8k15K72l70J36j96K89
$$ 263 -125 -50 137 119 22 172 -125 46 3 -136 -4 41 24 -105 -85 65 163 -52 220 -150 -14 -210 79
3018G9n2J62l61K30j4j2k91J47J48k03K48M2m9k48L46l95R8pQ0J08j70K40Kr2
$$ 79 27 189 -172 58 44 32 -259 -112 36 -167 81 123 74 -174 172 -223 -125 -132 -52 56 -114 126 128 36
3042C6j10K12J1l28K70k6j75r6QK05J19l21K02R6k78O8m6P4Pk6j17J32NM28j58
$$ 36 -74 138 149 -179 91 65 -110 -206 -198 7 126 -195 7 103 -175 -107 -153 -79 -72 -98 -215 -83 -78 350 192
3067A92j78M4j30MJ10p4R5o0J51j8k09L2J09j6K41j11k30J64J20k46j20K73k62
$$ 192 14 58 -72 -68 42 -32 63 3 154 136 -73 -41 68 52 293 182 -48 116 236 -10 -130 143 -119
3090a19J94KQ7l9N9l44K71n9k89M84j81r3L7J48j54o7j15P9j14L13l28K97k7j64
$$ -119 75 77 164 125 184 -160 111 52 -237 247 66 -27 10 158 4 -63 -178 -99 -213 100 -228 69 42 -122
3114a22L39m20K61j20l1J66Or2K78m74%j07L37l2K70l87M9m2m9n9J02R8J26P1
$$ -122 217 -203 58 -62 -93 73 79 -13 265 -209 -209 -316 21 -11 259 -128 -79 -121 -170 -229 -127 -29 97 168
3138A68j89j88l5J02J85j2j57K63k6p1O8j80M00m57J54K84m38K18j27J74l36L39
$$ 168 -21 -209 -244 -142 43 31 -126 137 111 40 108 -72 328 -129 25 309 -129 89 -38 136 -200 139
3160A39K60m26M5J5p1L9j21L84l98K29J59m82J59K98O4l43l2p9M16j12K3rj54
$$ 139 399 -27 18 33 -38 1 -120 264 -134 95 254 -228 -69 229 293 -50 -82 -161 255 143 166 157 3
3183CJ07k89M42l26o9L57j70j4J82Qj11j65R7O8j08j60J66j07J40J73j21j10r8
$$ 3 110 -179 263 -63 -132 225 55 41 223 231 120 -45 52 120 12 -148 18 -89 51 224 103 -7 -105
3206a05K7j11L26j43j78L07j90L38k68P1k06Q4l9j16L8J0J41J1l19L53mJ00k31
$$ -105 -78 -189 137 -6 -184 123 -67 271 3 74 -132 -48 -87 -203 -165 -155 -14 -3 -322 31 27 127 -104
3229a04k7J75m3l00L33L04m28M6J14P1l86L37j38J40k98L27j27J43j53M0%K62
$$ -104 -131 44 1 -299 34 338 -90 -44 70 141 -245 92 -46 94 -204 123 -4 139 -14 26 26 288
3251B88l09R9n3M3N9k36M5o1p3Q9L23nl77K96J25r6j49J01o7P5Kj9J38k00K01
$$ 288 -21 78 25 68 127 -109 -64 -125 -198 -109 214 209 -168 128 253 157 8 109 42 117 119 100 238 38 239
3276B39l72J69j04J57l30J98M3J0m1n4j14J73k91M19J6k65l9J69j21J75k56L63
$$ 239 -133 36 -68 89 -241 -43 0 10 -31 -85 -199 -26 -317 102 118 -147 -186 -17 -138 37 -219 144
3298A44j76j44O0J36l80L30jnN7m7N7k34J00j84L03l21P8K83M7Q6Pk71K70l33
$$ 144 -32 -176 -116 20 -360 -30 -31 -36 21 -26 31 -203 -103 -287 16 -305 -227 56 103 189 196 -75 195 -138
3322a38J48k42J57K9J89j44j93K54k5J58j01j03R9J25J26l91K03r0J87k88L8P6
$$ -138 10 -232 -75 -46 143 -1 -194 60 35 193 92 -11 88 213 339 -52 151 61 248 -40 -2 74
3344G4J4K26k92p4KJ73o6k23L63l10R0O5k16J77J7m2n0K10j50o3J54J15j3j59
$$ 74 88 314 22 -52 -50 123 57 -166 197 -113 -23 42 -174 3 20 -22 -72 138 -12 -75 79 194 181 22
3368B2K51j90j62L81j8q3r7J40k76M1j70K71j37L20l86j0k5L60j32j82q6O7M9
$$ 22 273 83 -79 302 284 201 104 244 -32 9 -161 110 -27 293 -93 -103 -128 232 100 -82 -168 -101 -52
3391e2Q6J92l20J04J69q3j15J00j58j12J71n6j6K41l0j52K07k32m0L3M1Q5J7n9
$$ -52 34 226 -94 10 179 96 -19 81 -77 -189 -18 -74 -90 151 121 -31 176 -56 -96 -63 -22 63 80 21
3415B1j75n5K8L41l57J07K33p5j88J87J61l50K54q5j01K%k2J16r1NQ0K20k56j9
$$ 21 -154 -209 -181 160 -197 -90 143 68 -120 67 228 -122 132 47 -54 -52 -52 -74 42 -49 -44 36 256 0 -19
3440a9K2J50Lk39Q7J45Oj50o8L42j82P8p5j24Q6m2N8J3k87K8J77o1K13k2k21k0
$$ -19 3 153 156 -83 4 149 155 5 -63 279 97 175 100 -24 62 20 78 91 -196 -168 9 -52 161 139 -82 -102
3466a02o4JK00K0k90K04J69r7k76l31L86K56M4l2l2l09J12J29P2J46l57K30R6
$$ -102 -166 -165 35 55 -235 -31 138 41 -235 -566 -180 76 120 88 56 -253 -141 -12 60 206 -151 79 175
3489A75j75L06m58J07Jj58J74j6j04m2j9L8K79q2l66K47O5l0J25k05J71q3L0j43
$$ 175 0 306 -152 -45 -44 -202 -28 -44 -148 -190 -209 -171 108 26 -340 -93 -28 -58 67 -138 33 -50 -20 -163
3513a63M50j60o7p1M1J90k19J64k22O9O1K52j64M7j01j82K6Q8M0j17K25k97K09
$$ -163 287 127 60 -11 30 220 1 165 -57 12 73 325 161 208 107 -75 -49 39 79 -38 187 -110 99
3536I9L7k37J80j35J77k11J67j36J13n1N6p4m2l5Q4Q2J08l42J51Q6O8p5j14L99
$$ 99 136 -101 79 -56 121 -90 77 -59 54 3 59 -15 -57 -92 -8 74 182 -160 -9 77 145 70 -44 355
3560C55m19o8K5J44J61m03J12j48j03J52K65K49k95J36l12j17J53J50l80J86J82
$$ 355 -64 -132 -107 37 198 -205 -93 -241 -344 -192 73 322 27 163 -149 -266 -113 37 -343 -157 25
3581B5o3l8J03j16M2J63j44j57R3O2j20J7Pj8P4j54L52l32M69m40N44m26j60L66
$$ 25 -38 -76 27 -89 -47 116 -28 -185 -92 -30 -150 -133 -126 -144 -70 -224 128 -204 265 -175 369 -57 -217 149
3605A49n29N37j06K49n19K34J94j85l3P7K80m19q9N7N04m06J72M9j41j06J31j76
$$ 149 -380 157 51 300 -219 15 209 24 -9 68 348 -71 -160 -103 401 -5 167 216 75 -31 100 -76
3627g6J91k32K58m8J46k09K99l24k01L18k32K56j21j01l38M50j60J56k61K91J94
$$ -76 115 -117 141 93 239 30 329 5 -196 122 -110 146 25 -76 -414 36 -124 32 -229 62 256
3648B56p8j52k3L3o4K12k99K01l7j00K3O6k54L44R1j59j02K56k13R7n2j52J37
$$ 256 178 26 3 36 -28 184 -115 86 49 -51 -28 38 -216 128 219 60 -42 214 1 98 46 -106 31
3671C1j26J28nj68j44L53k25J45k6J5r6M23l75L15j47j95K25l59M23k75J44m42
$$ 31 -95 33 28 -140 -284 69 -156 -11 -37 -22 -118 305 -70 245 98 -97 128 -231 192 -83 61 -381
3693c81L02K5K8N4j01r0K07L6j21J99j28j41J39J97r9M6k85L42J8o05N68j18o9
$$ -381 -79 -54 -26 28 -73 -163 44 80 -41 158 30 -111 28 225 126 172 -113 229 247 -358 210 92 23
3716B3j9L50n36J86pk4j07K39J12k66P0J44Pj71j3k36K62j32J09J95K06l87r2
$$ 23 4 354 -182 4 -3 -27 -134 105 217 -49 21 165 172 1 -12 -248 14 -118 -9 186 392 5 -87
3739h7K60l11o6O0L47j15p7K8j85l8J49j61K09M1l37K53n2J51J79m7j90l4Qq3
$$ -87 173 -138 -204 -144 203 88 11 39 -146 -184 -35 -196 13 54 -283 -30 -82 69 248 201 11 -23 -15 -98
3763i8M7J24o6J51k12K6j97J25j02J05P5l7K38l78R1K70RPP3m14L5J30J79j46
$$ -98 -51 73 7 158 -54 -28 -225 -100 -202 -97 -22 -59 179 -199 -108 162 171 178 251 -163 -128 2 181 35
$$ [...]
8191f5
##END NTUPLES=NMR FID
##END=
