##TITLE=1H_Pr AmRyl
 CDCl3,8 sc, 
 5.04.2021
##JCAMPDX= 6.0         $$ Bruker NMR JCAMP-DX V2.0
##DATA TYPE= NMR FID
##DATA CLASS= NTUPLES
##ORIGIN= UXNMR, Bruker Analytische Messtechnik GmbH
##OWNER= root
$$ XWIN-NMR		Version 3.5
$$ Mon Apr  5 14:42:10 2021 Russian Standard Time (UT+4h)  she@DPX200
##.OBSERVE FREQUENCY= 200.131506
##.OBSERVE NUCLEUS= ^1H
##.DELAY= (6, 6)
##.ACQUISITION MODE= SIMULTANEOUS
##.ACQUISITION SCHEME= undefined
##.AVERAGES= 8
##.DIGITISER RES= 18
##SPECTROMETER/DATA SYSTEM= spect
##.PULSE SEQUENCE= zg30
##.SOLVENT NAME= CD3CN
##.SHIFT REFERENCE= (INTERNAL, CD3CN, 0, 15.7039)
##AUDIT TRAIL= $$ (NUMBER, WHEN, WHO, WHERE, WHAT)
$$ ##TITLE= Audit trail, XWIN-NMR		Version 3.5
$$ ##JCAMPDX= 5.01
$$ ##ORIGIN= Bruker BioSpin GmbH
$$ ##OWNER= she
$$ F:/spectra/data/she/nmr/H-F/1/audita.txt
$$ ##AUDIT TRAIL=  $$ (NUMBER, WHEN, WHO, WHERE, WHAT)
(   1,<2021-04-05 14:40:44.35 +0400>,<she>,<DPX200>,
      <created by zg, POWCHK disabled, PULCHK disabled
       configuration hash MD5:
       00 E9 B6 7A A2 85 ED C7 34 08 36 98 17 FE 4E 26
       data hash MD5: 16K
       73 CB DA 3E 66 55 FA 8B C9 C6 12 AB 66 5C 98 78>)
$$ ##END=
$$ 
$$ hash MD5
$$ CF 76 28 A0 99 2A D8 50 79 F2 AC 4A 6A 25 43 FE
##$RELAX= 
##$RELAX= 
##$RELAX= 
##$RELAX= 
##$RELAX= 
##$RELAX= 
$$ Bruker specific parameters
$$ --------------------------
##$DU= <F:/spectra>
##$EXPNO= 1
##$NAME= <H-F>
##$PROCNO= 1
##$TYPE= <nmr>
##$USER= <she>
##$AMP= (0..31)
100 100 100 100 100 100 100 100 100 100 100 100 100 100 100 100 100 100 
100 100 100 100 100 100 100 100 100 100 100 100 100 100 
##$AQSEQ= 0
##$AQ_mod= 1
##$AUNM= <au_zg>
##$AUTOPOS= <>
##$BF1= 200.13
##$BF2= 200.13
##$BF3= 200.13
##$BF4= 200.13
##$BF5= 200.13
##$BF6= 200.13
##$BF7= 200.13
##$BF8= 200.13
##$BYTORDA= 1
##$CFDGTYP= 0
##$CFRGTYP= 5
##$CHEMSTR= <none>
##$CNST= (0..31)
1 1 145 1 1 1 1 1 1 1 1 1 1 1 1 1 1 1 1 1 1 1 1 1 1 1 1 1 1 1 1 1 
##$CPDPRG= <>
##$CPDPRG1= <>
##$CPDPRG2= <>
##$CPDPRG3= <>
##$CPDPRG4= <mlev>
##$CPDPRG5= <mlev>
##$CPDPRG6= <mlev>
##$CPDPRG7= <mlev>
##$CPDPRG8= <mlev>
##$CPDPRGB= <>
##$CPDPRGT= <>
##$D= (0..31)
0 1.2 0 0 0 0 0 0 0 0.06 0 0.03 0 0 0 0 0.0002 0 0 0 0 0 0 0 0 0 0 0 0 
0 0 0 
##$DATE= 1617619243
##$DBL= (0..7)
120 120 120 120 120 120 120 120 
##$DBP= (0..7)
150 150 150 150 150 150 150 150 
##$DBP07= 0
##$DBPNAM0= <>
##$DBPNAM1= <>
##$DBPNAM2= <>
##$DBPNAM3= <>
##$DBPNAM4= <>
##$DBPNAM5= <>
##$DBPNAM6= <>
##$DBPNAM7= <>
##$DBPOAL= (0..7)
0.5 0.5 0.5 0.5 0.5 0.5 0.5 0.5 
##$DBPOFFS= (0..7)
0 0 0 0 0 0 0 0 
##$DE= 6
##$DECBNUC= <off>
##$DECIM= 32
##$DECNUC= <off>
##$DECSTAT= 4
##$DIGMOD= 1
##$DIGTYP= 9
##$DL= (0..7)
0 120 120 120 120 120 120 120 
##$DP= (0..7)
150 150 150 150 150 150 150 150 
##$DP07= 0
##$DPNAME0= <>
##$DPNAME1= <>
##$DPNAME2= <>
##$DPNAME3= <>
##$DPNAME4= <>
##$DPNAME5= <>
##$DPNAME6= <>
##$DPNAME7= <>
##$DPOAL= (0..7)
0.5 0.5 0.5 0.5 0.5 0.5 0.5 0.5 
##$DPOFFS= (0..7)
0 0 0 0 0 0 0 0 
##$DQDMODE= 0
##$DR= 18
##$DS= 0
##$DSLIST= <SSSSSSSSSSSSSSS>
$$ [...]
##$SUBNAM2= <"">
##$SUBNAM3= <"">
##$SUBNAM4= <"">
##$SUBNAM5= <"">
##$SUBNAM6= <"">
##$SUBNAM7= <"">
##$SUBNAM8= <"">
##$SUBNAM9= <"">
##$SW= 16.9725357007746
##$SWIBOX= (0..15)
0 0 2 0 0 0 0 0 0 0 0 0 0 0 0 0 
##$SW_h= 3396.73913043478
##$TD= 16384
##$TD0= 1
##$TE= 0
##$TE2= 300
##$TE3= 300
##$TEG= 300
##$TL= (0..7)
0 120 120 120 120 120 120 120 
##$TP= (0..7)
150 150 150 150 150 150 150 150 
##$TP07= 0
##$TPNAME0= <>
##$TPNAME1= <>
##$TPNAME2= <>
##$TPNAME3= <>
##$TPNAME4= <>
##$TPNAME5= <>
##$TPNAME6= <>
##$TPNAME7= <>
##$TPOAL= (0..7)
0.5 0.5 0.5 0.5 0.5 0.5 0.5 0.5 
##$TPOFFS= (0..7)
0 0 0 0 0 0 0 0 
##$TUNHIN= 0
##$TUNHOUT= 0
##$TUNXOUT= 0
##$USERA1= <user>
##$USERA2= <user>
##$USERA3= <user>
##$USERA4= <user>
##$USERA5= <user>
##$V9= 5
##$VALIST= <valist>
##$VCLIST= <CCCCCCCCCCCCCCC>
##$VD= 0
##$VDLIST= <DDDDDDDDDDDDDDD>
##$VPLIST= <PPPPPPPPPPPPPPP>
##$VTLIST= <TTTTTTTTTTTTTTT>
##$WBST= 1024
##$WBSW= 4
##$XGAIN= (0..3)
0 0 0 0 
##$XL= 0
##$YL= 0
##$YMAX_a= 64552
##$YMIN_a= -148684
##$ZGOPTNS= <>
##$ZL1= 120
##$ZL2= 120
##$ZL3= 120
##$ZL4= 120
##$ABSF1= 10
##$ABSF2= 0
##$ABSG= 5
##$ABSL= 3
##$ALPHA= 0
##$AQORDER= 0
##$ASSFAC= 0
##$ASSFACI= 0
##$ASSFACX= 0
##$ASSWID= 0
##$AUNMP= <proc_1d>
##$AZFE= 0.1
##$AZFW= 0.1
##$BCFW= 1
##$BC_mod= 2
##$BYTORDP= 1
##$COROFFS= 0
##$CY= 11.3945322036743
##$DATMOD= 1
##$DC= 2
##$DFILT= <>
##$DTYPP= 0
##$F1P= 15.9154993809931
##$F2P= -4.1035820241983
##$FCOR= 0.5
##$FTSIZE= 0
##$FT_mod= 4
##$GAMMA= 1
##$GB= 0.15
##$INTBC= 1
##$INTSCL= 1
##$ISEN= 128
##$LB= 0.24
##$LEV0= 0
##$LPBIN= 0
##$MAXI= 10000
##$MC2= 0
##$MEAN= 0
##$ME_mod= 0
##$MI= 1.114404
##$NCOEF= 0
##$NC_proc= 0
##$NLEV= 6
##$NOISF1= 3.799351
##$NOISF2= 2.8
##$NSP= 1
##$NTH_PI= 0
##$NZP= 0
##$OFFSET= 15.70392
##$PC= 1
##$PHC0= -10917.5
##$PHC1= 11.80092
##$PH_mod= 1
##$PKNL= yes
##$PPARMOD= 0
##$PSCAL= 0
##$PSIGN= 0
##$REVERSE= no
##$SF= 200.130013532006
##$SI= 16384
##$SIGF1= 3
##$SIGF2= 2
##$SINO= 400
##$SIOLD= 16384
##$SREGLST= <1H.CDCl3>
##$SSB= 0
##$STSI= 0
##$STSR= 0
##$SW_p= 3612.71676300578
##$SYMM= 0
##$S_DEV= 0
##$TDeff= 0
##$TDoff= 0
##$TI= <>
##$TILT= no
##$TM1= 0
##$TM2= 0
##$TOPLEV= 0
##$USERP1= <user>
##$USERP2= <user>
##$USERP3= <user>
##$USERP4= <user>
##$USERP5= <user>
##$WDW= 1
##$XDIM= 8192
##$YMAX_p= 0
##$YMIN_p= 0
$$ End of Bruker specific parameters
$$ ---------------------------------
##NTUPLES= NMR FID
##VAR_NAME=  TIME,          FID/REAL,        FID/IMAG
##SYMBOL=    X,             R,               I
##VAR_TYPE=  INDEPENDENT,   DEPENDENT,       DEPENDENT
##VAR_FORM=  AFFN,          ASDF,            ASDF
##VAR_DIM=   8192,          8192,            8192
##UNITS=     SECONDS,       ARBITRARY UNITS, ARBITRARY UNITS
##FACTOR=    0.0002944,     1,               1
##FIRST=     0,             0,               0
##LAST=      2.4114304,     0,               0
##MIN=       0,             -148684,         0
##MAX=       2.4114304,     64552,           0
$$ Real data points
##PAGE= N=1
##DATA TABLE= (X++(R..R)), XYDATA
0@%%%%%%%%%%%%%%%%Nj3J6j6J6j6K0k8L2l2M0m8N3o1O9p7Q8j01J13j28J44j61
38h5J78j99K22k45K71k99L32l68M02m42M90n40N93o53P20p95Q80r76J086j214
58f42J365j542J758k027K374k837L480m439O014q999J6449o5498r4140K06135
72E7451l4359j26112R4383K7653p0953L6388L2670M354k4020n7382O2685O1794
84F4552j20478k1707J00783n7789m5217Q7528k2382n7589N3030L4699o312p873
96A245k3773L3705L3402m6920o870K1443l3540K183K4274k1091j2670r554J1903
109b6263N0491l4111m7778O4851J0725n4821M1362J0734o6513K7145M0022l6837
121b0993p302J243l969L8984j2054l2846M1318p017k8796N6538j2388o4625M6672
$$ plain form
0 0 0 0 0 0 0 0 0 0 0 0 0 0 0 0 0 0 5 -8 8 -8 8 -8 12 -16 16 -16 24 -24 29 -32 37 -40 48 -53 60 -68 76 -85
38 -85 93 -106 116 -129 142 -157 175 -193 209 -233 257 -283 310 -343 377 -418 462 -514 572 -642
58 -642 723 -819 939 -1088 1286 -1551 1929 -2510 3504 -5495 10954 -54544 -148684 57451
72 57451 23092 -103020 -8637 19016 -51937 -15549 17121 21475 -2545 -59927 2758 64552
84 64552 -55926 -77633 23150 -34639 -79856 7672 -14710 -72299 -19269 15430 9118 1245
96 1245 -22528 11177 44579 -2341 -9211 12232 -21308 -19125 5149 -15942 -28612 -38166 -26263
109 -26263 24228 -9883 -57661 7190 17915 -36906 4456 15190 -51323 -24178 15844 -20993
121 -20993 -28295 -27052 -31021 7963 -4091 -36937 4381 -2636 -31432 25106 12718 -51907 -5235
134e235K1781m7358K4731M801m2320L9569K8060m0034Q662J9948j3269J7483P649
147B4468k3510K28J932K649J2918k8874k0516L6355j285k5595K3210j245k5241
160b4506K8634K0523k5895r529J1612J0942j538j5764K463M247j3732J5558J5163
173A8178l2335k772L3598o669j0386J1380j0904k381K0384n991j2851J709k652
186a692J0130R008j7237j689J3212l539Q410N648k2186L322J9942j0492o126K147
200H858j4247N488J5031j3623q606O751p00P226P548j2740m040J1298L636j52
214A1728o031r119O353N355n685J673n787j0101J6374R866j8066k682J1218j626
228C470J530L681p924m857M261Q020O01j4361l787J5719P04q823N427k455p432
$$ plain form
134 -5235 16546 -30812 -6081 -1280 -43600 -4031 24029 -16005 -7343 12605 -664 16819 24468
147 24468 958 1186 3118 5767 18685 -10189 -30705 5650 4365 -21230 1980 735 -24506
160 -24506 4128 24651 -1244 -10773 839 11781 10243 -5521 -3058 1189 -12543 3015 18178
173 18178 -14157 -16929 16669 10000 -386 10994 90 -2291 18093 12102 -749 960 -1692
186 -1692 8438 17446 209 -1480 11732 8193 16603 22251 65 3387 23329 12837 6711 8858
200 8858 -5389 99 15130 1507 -7099 -348 -1048 6178 13726 986 -3054 8244 11880 11728
214 11728 5697 -3422 2931 8286 2601 4274 -1513 -11614 4760 14626 -3440 -6122 5096 3470
228 3470 5000 8681 757 -4100 161 8181 8782 -5579 -9366 6353 7057 -1766 3661 1206 -6226
243f226J2228O617j4470n415O389L098P08n936n879L616L025K174K508q110l130
258h803J2182L204n920j655l069J834Q063m063q849J183J367J937M118n546o447
273a0464N544O656L3l332m846K513O678j162k858j674m255M522Q416o483p248
288g960M277L451J660R87n255k680M674L426l48m495n041M058O013k265l724q26
304d048J02N073L774n294l666K695K675K210j703o696k27N492Q21k455l075j794
320f116M025M353j506k843j618K323O110k61n923q19L174J897J228k444m426J571
336a275N075J117k711l352L77N149K078l679k543J02K076L042j169m665r04K911
352A629L116R3m789k201M377K727j938k107j646l55L025J967l425m687J330N282
$$ plain form
243 -6226 6002 12619 -1851 -7266 -877 2221 2929 -3007 -8886 -5270 -2245 -71 2437 -5673 -8803
258 -8803 3379 6583 663 -992 -4061 -2227 5836 1773 -7076 -5893 -4526 -2589 1529 -4017 -10464
273 -10464 -4920 1736 1769 -1563 -6409 -3896 2782 1620 -1238 -2912 -7167 -2645 5771 -712 -7960
288 -7960 -3683 -232 1428 2415 -2840 -5520 -846 2580 2232 -2263 -7304 -3246 2767 502 -3222 -4048
304 -4048 -3946 1127 4901 -393 -4059 -1364 1311 3521 1818 -4878 -5105 387 1208 -1247 -4322 -6116
320 -6116 -2091 2262 756 -2087 -3705 -1382 4728 4467 -1456 -2275 899 2796 4024 1580 -2846 -1275
336 -1275 3800 4917 2206 -1146 -769 4380 6458 2779 236 338 2414 5456 4287 -378 -1282 1629
352 1629 4745 4838 49 -2152 2225 4952 3014 907 -739 -1094 1931 3898 473 -4214 -2884 2398
368B398P09m230j504K234J453J606R75l750k605M449L907k888m328j28L414J537
384C249j660j406j246k96L919K350m875l281L379K996q36k171k261p6L047J121
400A953k410k377n76K373L010j868m041J22K712J624p93k949j618K495K684r97
416f56k097r15N62K972K447l238l664L126L824j116k100p78k88J571J937j006
432E81k821j517K576M003j854n457J443M774j859j506K088k901k411N591J912
447B642o109k200L686K585j337k818J20J916q48O69L004l957m515O743M755p388
463c052k424N691k82j880L053n87l839J691M257L39l856k387L719L504l328k468
479a849K699q39j579M560r7o474J478N698j536k596M11p90J394K422k227j933
$$ plain form
368 2398 3107 -1123 -2627 -393 1060 2666 3641 -109 -2714 1735 5642 2754 -1574 -1702 1712 3249
384 3249 1589 183 -1063 -1359 2560 4910 35 -3246 133 3129 2293 122 -2139 -2215 832 1953
400 1953 -457 -2834 -3410 -1037 1973 105 -3936 -3814 -1102 522 -271 -3220 -4838 -2343 341 -656
416 -656 -2753 -3668 -3106 -134 2313 -925 -4589 -1463 2361 1245 -855 -1633 -1921 -350 1587 581
432 581 -2240 -3757 -1181 2822 968 -4489 -3046 1728 -131 -1637 451 -2450 -4861 730 2642
447 2642 -3467 -5667 -1981 604 -733 -3551 -3431 -1515 -2363 -1694 1310 -2647 -7162 -419 4336 -3052
463 -3052 -5476 215 -67 -1947 1106 519 -3320 -1629 2628 2967 -889 -3276 443 3947 619 -1849
479 -1849 850 11 -1568 2992 2895 -3579 -2101 3597 2061 -535 -124 -914 480 2902 675 -1258
495a258J099j65J149K208l533k826M214K313k620n76l13j53K857M01k923L02N94
512G70l69L126j87n466J292N420j689k858J488m27o62K663j69k882l75R20J748
529B343J273m173k194N206Q86m284J624J423m006J822M770l680m190L012K844
544B676j015j997j011J669Q69j501J641M98m805J516O682l302n814M074K932l346
560b34O01J885k977r93L735J083l168k004J947K772j203k491J004N34j116J698
576A073J213l640j346L909J187l014p33J131j41R65P04k056j075J598J013k5r62
593a99j968R23K687r60j802M10j61M98K071j320k422J195J647j21j88j288r84
610a982K036J033j315n76p14N22K115m86k308N38Q83M9R88n98k320Q24K506m09
$$ plain form
495 -1258 -159 -324 825 3033 -500 -3326 888 3201 581 5 -308 -461 2396 2797 -126 176 770
512 770 401 3527 3340 -2126 -834 4586 2897 39 1527 1100 438 3101 2932 50 -325 595 2343
529 2343 3616 -557 -2751 2455 3341 -943 681 2104 -1902 -80 4690 1010 -3180 -168 2676
544 2676 1661 -336 -1347 322 1191 -310 1331 1829 -2976 -1460 5222 1920 -3894 180 3112 -234
560 -234 367 2252 -725 -1718 2017 3100 -68 -2072 -125 2647 1444 -1047 -43 491 -625 1073
576 1073 2286 -1354 -2700 1209 2396 -618 -1351 -220 -361 604 1308 -748 -1823 -225 788 763 -199
593 -199 -2167 -1244 1443 483 -1319 -909 -1070 -572 1499 179 -2243 -1048 599 478 290 -998 -1982
610 -1982 54 1087 -228 -804 -1518 -996 1119 633 -1675 -1137 -254 -205 783 185 -2135 -1311 1195 786
628G86j644l56O19O80M63j10j102r18J410J881j391j972Q49J262K1j22o49q82
646a175N60J487L61j645j141J450J367p73n45k80l94J163J070j438j120O88P76
663D11N21k15j522j32J498L91n34p53n46R35R64m77p88n35K17J537J40j792m03
682a083J137L50J51l05j227Q9J349L15p39j010k8J311M70r47n77p0M12J093j91
701E00j393j53R27N13R5q42r06P95J019k78o77m68J73R51L57q07p46J66R30O51
721H07q95r56M72N71K62j2q60o71J066R62o63q54j62N75P49j80p37m11J62R48
741A73M49j109q34Q13O68N6l73o88j37R99M49o42o85o5P19O33m37q06n9M74P28
762C26J2q79m03N92O76L4n76p22L96J076L7q00m03J36P11M14m91o88j1P36O18
$$ plain form
628 786 -858 -1214 -595 85 548 438 -664 -1582 -172 1709 318 -1654 -805 457 478 356 -293 -1175
646 -1175 -615 872 1233 -412 -1553 -103 1264 491 -54 -334 -728 435 1505 67 -1053 -365 411
663 411 932 717 -805 -937 561 952 418 -335 -881 54 1018 541 -247 -782 -565 972 1112 -680 -1083
682 -1083 54 404 555 250 -977 -888 461 776 37 -973 -1001 310 780 -167 -744 -814 -402 691 500
701 500 -893 -1046 -119 394 489 -353 -1259 -464 555 277 -400 -868 -695 256 613 -194 -940 -774 156 807
721 807 -88 -1044 -572 -1 261 249 -611 -1282 -216 746 83 -771 -933 -358 391 211 -526 -937 -775 173
741 173 622 -487 -1321 -508 160 216 -157 -845 -982 17 466 -176 -861 -926 -207 426 -11 -817 -876 -402 326
762 326 338 -541 -944 -352 324 358 -218 -940 -544 532 569 -231 -634 -498 213 627 136 -552 -563 173 791
783G91m59p43k2P53L79k68m99l77N05Q04p3q52k65M71O24J30o41m89K96O37K38
804I40n03o08J80O59K88l42n39j43O66N32m32p09O8M49M66p5n67m03M29O23j9
825I60o07n00M44O09j1o09k07J40L72L36l21o81k9P58L09n60n81J46M29L02k98
846D01l56k27K09O88O9q79l75P17M83l32m33l5k7M52L49m18p56K57P12K44n23
867B20n39J90M85J10k20k65k98K61P30k29r34j7P02Q7o8k52n17L08O08k35l90
888b63j45j26N58M61p33n90M67L28L5k2n80j51O95J88m38p8l26J25R20k29j003
909i07J74N63K6K9j43n09K26O12p6l14m31K4P03K39o93l66N24J04k8K12l56n93
931i80O48O76n31o08L00K94J47N4m04k53L70J46K32j05q91K90J103l93p25M66
$$ plain form
783 791 332 -411 -433 320 699 431 -68 -445 60 864 791 -61 -326 145 769 899 258 -231 65 702 940
804 940 437 -171 9 668 956 614 75 -68 598 1130 698 -11 57 506 972 897 330 -73 356 979 960
825 960 353 -147 297 906 895 286 79 219 591 927 606 -75 -104 654 963 403 -178 -32 397 699 401
846 401 45 -182 27 715 784 -95 -470 247 730 398 -35 -70 -97 355 704 286 -470 -213 499 743 220
867 220 -319 -129 356 466 246 -19 -317 -56 674 445 -489 -506 196 283 215 -37 -554 -246 362 127 -263
888 -263 -408 -534 24 485 -248 -838 -371 -43 -8 -30 -610 -761 -66 122 -316 -394 -720 -595 325 96 -907
909 -907 -733 -170 -144 -115 -258 -767 -541 71 -5 -319 -750 -726 -23 216 -477 -843 -319 -215 -243 -31 -387 -980
931 -980 -332 344 -187 -795 -495 -201 -54 0 -404 -657 -287 -141 91 -14 -905 -615 488 95 -630 -164
951a64P3k47P26q1r26K19O69m7j8l81l74P20L51o64L7R2l38O28L42r15j86P02
973B18K0o3o5m65R4O54j14l65l7j71L53M65l48n28R5N28k1r2j86k14K79L97k02
996B32m06Q9J08K45K05l80n10N23M01l33o6j47j64M49L31n22j97J58J19L47j35
1017C47o18J24O09l09KO5n03J33P55k92n10J50J33J95J00m68j58L50M9J00J0n41
1039b77j1O02M5m39r2R3P3K78j11l23j13K75K74q9l92r9L24J93p6k45j21J40J93
1062A02P2k43l12J17M40Kl25j03J2K50K31k42l43J11K29J71o9l77p8M12J36j07
1084H6j98j50P2M32j11l17m0O4K60J62k99k80K36K20Qo5l04M3L62R5k38j06k2
1107i0J91K39j07l32M1P3K60L3l39j06K12K03o6m7l25J55L13Nk65p9n7K73J73
$$ plain form
951 -164 -91 -338 388 307 -619 -400 269 222 204 -177 -551 169 520 -144 -107 -15 -353 275 617 -298 -484 218
973 218 238 175 110 -355 -261 393 279 -86 -123 -294 59 524 176 -352 -257 271 250 158 -28 -242 37 434 232
996 232 -174 -85 23 268 473 93 -417 106 507 174 108 -39 -203 246 577 55 -142 16 135 482 347
1017 347 -271 -147 462 153 155 220 -283 -150 605 313 -197 -47 86 281 381 -87 -245 105 154 254 264 -277
1039 -277 -288 314 359 -80 -172 -79 -6 272 161 -162 -275 0 274 185 -207 -306 18 211 135 -110 -231 -91 102
1062 102 174 -69 -381 -264 176 178 -147 -250 -238 12 243 1 -342 -231 -2 169 100 -277 -355 57 193 86
1084 86 -112 -262 -190 242 131 -186 -226 -162 98 260 -39 -319 -83 137 145 80 -224 -181 181 276 38 -68 -90
1107 -90 101 340 233 -99 -58 15 275 308 -31 -137 75 278 212 165 -160 -5 308 313 48 -31 -88 185 358
1130C58j95l01M8J86J85r0k97m7K65J19m5k17j05K02K44j11k35l8J26J79Q0l40
1152b9j41J45K23J09j88k15P3K04Q5p7k19r9K60J99k15j77l8J27K61o4l12NJ24
1175D1J60K2k07k03J11K45Rj76j82O0K22R6k10j54l5K12K45k95j38jJ20K01k7
1198A16l28n5K03J92j21p5j71Q2K34m3j84o8k3K52L2k45j73J62J23P3q4k10L8
1221b73J34J18q3j89m9J69K02j35j36l2J9K09j3k05l6J38J25n4o0j86J03K28M2
1244C6j67r2%K27J26k35r9K3J11J32Jk75O4J18Q3L0j66j25J54J95j06j64n0J17
1268f2J41L0j93j27J11J42L4j09j84J00J80J3K6j87j5J75R4r0j40o6J52J38l7
1291A26j27p2Q5J47K3j50j70R5K28m6q8j14M5J37L1k0j55n2J24J57j62j37N0J15
$$ plain form
1130 358 163 -138 -90 96 281 191 -106 -153 112 231 186 -31 -136 66 310 199 -36 -74 52 231 311 -29
1152 -29 -170 -25 198 307 119 -96 -23 181 266 189 -30 -129 131 330 115 -62 -100 27 288 224 -88 -83 41
1175 41 201 223 16 -187 -76 169 178 2 -180 -120 102 198 -12 -166 -201 11 256 -39 -177 -178 -58 143 116
1198 116 -212 -267 -64 128 7 -68 -239 -157 77 34 -150 -218 -241 11 43 -202 -375 -213 -90 -17 -101 -311 -273
1221 -273 -139 -21 -104 -293 -342 -173 29 -106 -242 -274 -255 -46 -59 -264 -300 -162 -37 -91 -151 -337 -234 -6 36
1244 36 -131 -223 -223 4 130 -105 -204 -181 -70 62 63 -212 -148 -30 53 83 -83 -208 -54 141 35 -129 -179 -62
1268 -62 79 109 -84 -211 -100 42 76 -33 -217 -117 63 76 102 -85 -100 75 169 79 -61 -127 25 163 126
1291 126 -1 -73 12 159 182 32 -138 -43 185 139 51 -63 -18 119 150 130 -25 -77 47 204 42 -95 -45 70
1315G0J06n1j09o1J38O9m3p0j11J28O9jm2p8M4J19M1r6j16M6M7J12l5k30O6J31
1341A43J0l9j30j5P6J32j6j85m8J40Q7m6j32o9R9R7l3l3r5l0K30j6j32r9P6P4
1367D6N8j4k42K3J65L0j0r9l3O9J42o4j54kL5N8J08j64n7Q1O9j2mj37o6J88P8
1394I2j12p2R8NP1kj98Q4O6O1o8r6mL8J08j1n4n4O0L6P2q9j13Q3J37p9r9Jl1R0
1424B0R0j17q7M9O6L7Op2j08J32O8j13KK3p4J80K6k12J4Q6l2J53j55r6Q3J20m3
1451D6r2j8j4J65K7j24n2P1k0O7k4q5k8Q0O7l4k2n3l7J59K4j37p7N4J28J2j5j31
1479f3K5J24K0j15K1q2J33Q5n2j55N1MP8j9p6o2O3Q2m9k2r9O2J36rj55n3J37M
1507A4Oj3j58M8J46%j26n2K8R8L4n9j13R3rL4L8r1n2J24L6nj02n3R1L1jo0qK1
$$ plain form
1315 70 176 125 16 -45 93 162 119 49 -62 66 135 134 92 14 58 177 218 122 6 52 99 211 176 -54 12 143
1341 143 153 114 -16 -31 45 177 161 -24 -72 68 155 109 -23 -92 7 104 71 38 -57 -87 143 127 -5 -104 -28 46
1367 46 104 90 -152 -129 36 66 56 -43 -76 -7 135 71 -83 -85 -50 8 116 -48 -105 -24 45 33 29 -108 -174 14 92
1394 92 -20 -92 6 11 82 80 -118 -34 32 93 25 -71 -75 -37 71 60 6 -48 12 48 120 31 -82 1 138 59 -40 -39 -70 20
1424 20 110 -7 -94 -45 21 58 64 -8 -116 16 84 -29 -27 -4 -78 102 128 -84 -70 16 -16 137 -18 -114 -31 89 46
1451 46 -46 -64 -78 87 114 -10 -62 9 -11 56 32 -53 -81 -1 66 32 10 -43 -80 79 103 -34 -111 -57 71 83 68 -63
1479 -63 -38 86 106 -9 12 -70 63 148 96 -59 -8 -4 74 55 -21 -83 -20 62 13 -9 -108 -46 90 81 -74 -127 10 14
1507 14 20 7 -151 -103 43 43 -83 -135 -107 -9 25 -34 -147 -54 -63 -29 9 -82 -134 -10 26 21 -81 -134 -43 -12 -13 -73 -81 -60
1537f0N7K1j09qk2R8P1n8j11MR1L3j7o8m8R8P3o9K4n9M9N2j7j57R5K3L7L7p9n4
1567g3J05J4PJ6j63kJ79pr4Jk6N9R3o6p8RK5L2M6q0n0J10mJ7o3k0jJ07o6l5J4
1598Fj0N3K7q2k7J4R9N8o9p6L2QL5k2k3KN2N2k0q0n1K4J45Kj30l9L9O0N6j14l4
1629a3J09N5m6j8k2l0M3M9q0k2l8L8Q8k7o0k9K2J03j04K9m8N2M4k1m5l8J0O5K7
1658I3p8k1n7Q6M5n3n9M9K3L7m7m6o8J30L4r1k4K0J1J0j0k7k2L3rO5r3k3N6J8
1688a8J4O6r8%M4L5p3j0l3O9L1j4r7o5J23j0P0p0k5M2L5j0n2j1N3k2L2n5Mm3R3
1719EpM4j04LN0O1o5n5N5j2Q9p5o6O9jL1k5J5o7L1J2M5n8o6O3L6L0j04K1KM7l
1751Ak6r5N9M7Q5r8J2k6N4O3n0k7k0L5Mj1l5J1j2R9m5l5Kj5M1O3p3L2l5R4m6p1
$$ plain form
1537 -60 -3 18 -91 -99 -121 -23 48 -10 -121 -117 -26 7 -10 -78 -126 -28 45 -24 0 -59 -10 42 25 -132 -37 -14 23 60 -19 -73
1567 -73 32 46 53 69 -94 -96 83 76 -18 -17 -43 16 109 43 -35 -26 -1 31 77 -3 -53 57 53 70 7 -13 -14 93 27 -8 6
1598 6 -4 49 76 -6 -33 -19 80 138 69 -7 25 33 68 46 23 25 77 129 109 29 -22 2 147 149 19 -20 19 79 135 21 -13
1629 -13 96 151 105 87 65 35 78 127 47 25 -13 25 113 86 26 -3 19 122 18 47 -1 51 95 74 29 -9 1 66 93
1658 93 15 -6 -63 23 68 15 -44 5 28 65 18 -28 -96 34 68 -23 -47 -27 -16 -6 -16 -43 -65 -32 -41 24 -69 -92 -36 -18
1688 -18 -4 62 -36 -36 8 43 -30 -40 -73 -4 27 13 -84 -149 -26 -36 34 -36 -61 -19 16 6 -46 -57 -4 -26 6 -49 -45 -88 5
1719 5 -2 42 -62 -59 -9 52 -13 -68 -13 -25 64 -11 -77 -8 -9 22 -3 12 -55 -24 -12 33 -25 -91 -28 8 38 -66 -45 -43 4 1
1751 1 -25 -120 -61 -14 71 -27 -15 -41 13 76 26 -1 -21 14 18 7 -28 -17 -29 70 25 -10 -8 -23 18 81 8 40 5 99 53 -18
1783a8j8k6J02L2j8q4L6N4n8QK4p4L9Jj9J4oK7K7J4j6j8l6R7l7j9m3nL5j8k4r
1815c6KjM9mml3K4k1K4n6N7K3J7pn1k0O8pp2K1OJ4P5n3n8rrR0K9m9n0j3O8P8j00
1850hlM%J4M9m4j02J11Jk5N3p0n4R0L4m1o0M0L5k0j3k2L6m7P3J5o0KL3J7r2K1
1882c3J0M4nN3j28N1j7P0J0m0l9RNL5k2J2n8P4K8n9k5j8L8K4j0K5Rn6RPqlN0j7
1916B5r%k5N2%o9N5PlO1j11L6K8n8J5N7o9J0N5Ok5J4q1RQ2k1j8k6j2J7K2K5q5
1949c6K1L%M2K2k0m5P9k8j9l6j4M7K1j1J3m6PK3m9O6j9l6O7pn0J5%m6J4Lp0Q4
1982ej3P0p4L0n0M6K7Jp3O4n4K7k5L0j8N1j2k8K9j05J18o1N0l4L6l2qJ8j5l6K
2013d4O1Lj0k7k0M3L0o1%L3Jk0k6J1k2L8j2l5M0mm5P8j7j8n8N7J5j8J0j2M7oL3
$$ plain form
1783 -18 -36 -62 40 72 54 -30 6 60 2 10 34 -40 -1 0 -19 -5 -11 16 43 57 41 23 -13 84 47 28 -15 -20 15 -3 -27 -36
1815 -36 -34 -35 14 10 6 -27 -3 -24 0 -56 1 24 41 34 -17 -37 31 24 -48 -27 -21 -7 68 15 -43 -52 -61 29 58 9 -41 -54 14 92 -8
1850 -8 -11 -7 -7 7 56 12 -90 21 22 -3 50 -20 -74 16 50 9 -51 -11 24 4 -9 -31 5 -42 31 46 -14 -12 21 38 -54 -33
1882 -33 -23 21 16 69 -59 -8 -25 45 55 15 -24 -15 -10 25 3 15 -43 31 59 0 -25 -43 -5 19 9 34 43 -13 -4 3 -5 -8 42 25
1916 25 16 16 -9 43 43 -26 29 36 33 94 -17 19 47 -11 4 61 -8 2 57 63 38 52 -29 -20 62 41 23 -3 -15 2 24 49 -36
1949 -36 -15 -12 -12 30 52 32 -13 66 38 19 -17 -31 16 37 26 39 -7 0 23 -26 40 21 -15 52 45 -5 10 10 -36 -22 -19 -89 -5
1982 -5 -18 52 -22 8 -42 4 31 32 -41 23 -31 -4 -29 1 -17 34 22 -6 23 -82 36 -25 25 -9 27 -5 -13 5 -10 -46 -44
2013 -44 17 20 10 -17 -37 6 36 -25 -25 8 9 -11 -37 -26 -48 -10 -22 -57 -17 -21 -66 12 -5 -23 -81 -24 -9 -27 -17 -29 18 12 45
2046D5m9J1m0N5K2o4M0oKj0L0n0l6O2k3j5K4j3M4m4J7j7m2K1P7Ml5Jk6K4J0Nj10
2079h6R0k0L7l3N1K6n3Q4q5nK1l7Rl6L2K8k8j9O0p2J8L7j8M4m0rJ3J3k7k8oP6
2111C7k0O3p9L7n4K7L9k7j1m8P6K3r4M0K4l1P0pr2pQ7o4M3n7j8R4mk4l3K2m0P1
2143D3NlQk9p4P6j4Kl9L6L2J0o0PJ8jL4m1m8mO3oPNml9K6N1o5J3pN5n7n2N5K7
2179C0o7N9kj6m3J8J3k8K9l7L3mmK7M6j4p3K5K3on2J42j40L1mj4Q2n3K9Jl0j1
2211a0J8O1o5L6r5L4K4rNoj0rN5j00Q7J1kJ5o2O9l5ql5J2K1M3jo0M9lL6op3N2
2245C9m%k7l0L6J0KP0k7o0L6l3J5k9L1j9oJ9k4Pk1l4J07p8l3Q1Kp1L9K6Or5O2
2278cJ4n0K1K1J1N1p9M2q1K7K7K2j3p2O1pjj1m1N8l2JQ0k5mn5P1o4N0Rm0l9N5
$$ plain form
2046 45 -4 7 -33 22 44 -20 20 14 16 6 36 -14 -50 12 -11 -26 -2 -15 29 -15 2 -15 -57 -36 41 45 10 11 -15 9 19 24 -86
2079 -86 4 -16 21 -12 39 65 12 96 11 6 27 -10 -1 -37 -5 23 -5 -24 36 -36 -18 19 1 45 5 -4 9 22 -5 -33 -39 37
2111 37 17 80 1 38 -16 11 50 23 12 -36 40 63 -31 9 33 2 72 65 -27 -34 53 -11 32 -25 -43 51 47 23 -10 12 -28 43
2143 43 48 45 53 24 -50 26 12 14 -25 11 43 53 -7 0 18 17 51 10 -38 -42 21 15 22 27 23 -16 10 61 -4 9 2 57 0 -52 3 30
2179 30 -37 22 20 4 -39 -21 -8 -36 -7 -44 -11 -15 -19 8 54 40 -33 -8 15 9 -43 99 -41 -10 -14 -28 54 1 30 31 1 -10
2211 -10 8 69 4 40 -55 -21 3 -6 -1 -7 -17 -26 29 -71 16 27 25 40 -22 47 12 4 -31 -19 2 45 44 -16 33 30 66 60 -13 39
2245 39 35 35 8 -22 14 24 26 96 69 9 45 12 27 -2 29 10 4 23 -1 6 -15 -49 58 -20 -53 28 30 -41 -2 24 30 -65 -3
2278 -3 11 -39 -18 3 14 65 -14 28 -53 -26 1 23 10 -62 -1 -8 -9 -20 -61 -3 -35 -34 46 21 17 -38 33 -31 19 28 -12 -51 4
2311DRRm8L6J8p3MKK7O2l5nj9J3J5j3J0k8JQLoj0L0l3L5k9o0Q6n5j6O8l4L7Rn5
2347c3kk2P1j0RJ0m9J3J4m1K6l8J00K9p6J6k9j7J2N2K6m4m9N0o3K1J4L0l7K6L5
2378D4j8q9J1Q9K2p6J9Rl7L5kL4j8j4J7L1j16N9K3O0l7m3m5N5mRp3J9M8l6K9j5
2410a0K5l2O9Lj03K2k2N2Pk8J4j7O5m7qMM0m6KLK3k3N2k6k7K6KjK2k3K3l9J5L0
2444D7rp3K8Oj3L3k9k2N7k3L5k6L7p0O3n0jJ5rK3p7P8k8J8L9o7Kk1M9L2n6J6p
2477ckl0jJ3J4N3m8n8O0Jk2O4Kj5j8lj5k4J8j1L0o3K9L2Jl6K4N0m7J4m9P1n4J3
2511a0ro3R5m2j7O4l3j1O7p6N0k1rJ9J4J8m9nL3L3m2k6lJM2j6rmj6j6M6K9n0L8
2545B2j3m6N9k8j7j7Q8p7pN1Rl6K7kj9M3m0M2n3m4L9R0p6On8M7M7k0n0K8L7m5
$$ plain form
2311 4 13 22 -26 10 28 -45 -41 -39 -12 50 15 10 -9 4 19 6 16 -12 -11 -3 0 -6 -16 14 -19 16 -13 -73 13 -42 -58 10 -24 13 22 -33
2347 -33 -35 -57 14 4 13 23 -26 -13 1 -40 -14 -52 48 77 1 17 -12 -29 -17 35 61 17 -32 18 -45 -24 -10 20 -17 9 44
2378 44 26 -63 -52 37 59 -17 2 11 -26 9 7 41 23 9 26 57 -59 0 23 83 46 3 -42 13 9 18 -55 -36 12 -24 5 -10
2410 -10 15 -17 52 55 -48 -26 -48 4 11 -17 -3 -20 45 -2 -10 -6 34 -12 -10 -7 16 -7 45 19 -8 18 20 19 41 18 41 2 17 47
2444 47 38 -35 -7 -1 -14 19 -10 -32 25 2 37 11 48 -22 41 -9 -10 5 -4 19 -58 20 -8 10 49 -18 -16 -37 12 44 -12 4 -3
2477 -3 -5 -35 -36 -23 -9 44 -4 -62 -2 -1 -23 41 43 28 10 7 -8 -32 -14 -25 5 -58 -29 3 4 -32 -8 42 -5 9 -40 31 -23 -10
2511 -10 -19 -82 13 -29 -46 18 -15 -26 41 -35 15 -6 -15 4 18 36 -13 -18 15 48 6 -20 -23 -22 20 4 -5 -9 -25 -41 5 34 -16 22
2545 22 9 -37 22 -6 -23 -40 48 -29 -36 15 24 -12 15 13 -6 37 -3 39 -14 -58 -19 71 -5 1 -57 -10 37 17 -33 -5 32 -13
2577a3J2k3N4l3j3QL1J2o7L8J4p7O0J5j9K7j3L4l2m4K8M0j5p4N9QK9l5mn3O5j0
2609IK3j5l6lK0J9Pj0n2j8O6Ok2kK4l6M0Pp8Q4m5l1L4N1k7ll7L2j6M0k6k2K5j7
2643iL7l0K0j8j5Rj0J5j4O8m4K8n3N2J9r2J27j36OK9rlj7K1J2rj3k3P6o3P1ok0
2676FN0J2l8l7RK2rn1P4nl6K2K0m0k7Q4n0l6K7N3n9N8j4l0m5N9k5k6K5K4k0m1
2708d4M6j6L8p6L3m2L9jKK5k6K9Lj1k4L9K2k7Knm2OM4j1N6m7NKm4N4J5m5n8L9
2742b0m2O2Qm6L7NPnNlk7RLL1n2l6R8jK6m7l1J3J3J6k1j2k6K6J2k6K7l7K2oM0
2777B2j8rJ5J0n5J6rL9K6o9j6K4P1o8N4Qk4l2M0Mnk5MM0n5j7K0j8M2j1M0l1n0
2810c7K0N3n2K0J7m1K3m9O5k4J2J0J3p8N2l4K8j6k7M0L4m9K7j5O5m2MK1l7nKl7
$$ plain form
2577 -13 -1 -24 30 -3 -16 -8 23 35 -32 6 20 -57 3 18 -1 26 13 47 15 -29 -1 39 24 -50 9 17 46 11 7 -46 19 9
2609 9 32 17 -19 -22 -2 17 24 14 -38 -56 10 16 -6 -8 16 -20 20 27 -51 33 -12 -43 -9 42 15 12 -25 7 -9 31 5 -17 8 -9
2643 -9 28 -2 18 0 -15 -6 -16 -1 -15 53 9 37 -16 36 55 -37 90 -46 -40 -11 -20 -23 -40 -19 -7 -16 -29 -52 24 -39 32 26 6
2676 6 56 68 30 -7 2 24 15 -36 38 33 -3 19 39 -1 -28 56 6 -30 -3 50 -9 49 35 5 -40 19 -6 -32 -7 17 -3 -44
2708 -44 2 -14 24 -52 -19 -61 -22 -23 -21 4 -22 7 10 -1 -25 14 36 9 11 6 -36 -30 14 3 59 12 17 19 -25 29 44 -1 -59 -20
2742 -20 -62 0 8 -38 -1 4 11 6 11 8 -19 -10 -7 24 -28 -64 34 33 59 12 -19 -6 7 23 2 -10 -36 -10 2 -24 3 -34 -12 -18 22
2777 22 4 -5 10 20 -35 -19 -28 11 37 -32 -48 -24 47 -21 33 41 17 -15 25 29 24 -1 3 43 -12 -29 -9 -27 15 4 44 13 -37
2810 -37 -17 36 -16 4 21 -20 3 -46 19 -5 7 17 30 -48 4 -30 -2 -18 -45 -5 29 -20 7 -8 57 15 19 40 3 -2 0 -37
2842c7N6mJ9k7p6N6k3j6M8QJ5MOj8J8OK4l2o1K9J4K1K3r6M6l1J0M0J8onk4M3j
2876D7k4rlj6N0l4m3L4j9j5PQ4l7pl5NL6m0%N2n8Q6m2k2Pn7Q7n5M0j4k3oJ6j1
2910a9L0k4JK4N3q2N1l2j9O4J8m0m1J6j3L1j0k1j3L8l4j1J8J8Kl0MM3j8m7MO8
2942B9j6k0k3rj9J05n0O2k9j3jJ8j7J7j2k2m6L9mK9l8L7Rl9K8K3q3N0m0M4k9N8
2974C8o7pK0j8J3J9J9j8j6P8r4M9k5oM5l7M6p6L5Rm5Q6k6nK0l5k3K5qj3O4j3l0
3007DOm0NM7M6l7l9jJ3M2l6oqJ2l7NOk1K8O0k4On8mO3j1mOL1l0k8l3K1L5k7J3
3043EJ2Nm1J6k7K2rN4n4k4L2n1P3l7M6K1p4J9K4K0o5j1L1o8P3k6J2P5o1J0L5m9
3075a2J3Q%l8N4l5k3L5J6j0RJm3kP1j9k5nLJ3l1L3K0m3L8m4K8j4n6O8K4k4k7L6
$$ plain form
2842 -37 19 15 34 7 -69 -13 -36 -52 -4 4 19 23 29 11 29 35 59 27 -34 -5 9 30 53 -43 3 -28 -18 22 40 34 29 5 48 47
2876 47 23 14 11 -5 45 11 -32 2 -17 -32 -25 59 22 15 -20 -15 21 -19 -19 33 -25 61 19 -3 4 -53 34 -21 19 5 -18 -24 -8 -19
2910 -19 11 -13 -12 12 65 -17 34 2 -17 47 65 25 -16 0 -13 18 8 -13 -26 12 -22 -33 -15 3 5 -25 -21 22 4 -43 -39 29
2942 29 13 -7 -30 -39 -58 47 -3 59 30 17 16 34 17 34 22 0 -46 -7 -11 18 -20 17 26 -13 15 38 -45 5 -35 9 -20 38
2974 38 -29 -36 -16 -34 -21 -2 17 -1 -17 61 -33 16 -9 -15 30 -7 39 -37 -2 7 -38 48 22 17 37 2 -21 4 -4 -17 47 34 4
3007 4 10 -30 -25 22 68 31 -8 -9 4 46 10 4 -4 8 -29 -24 -18 -39 -11 49 25 31 -27 -31 32 21 17 23 54 24 -4 -37 -16 19 -8 5
3043 5 17 22 -19 -3 -30 -8 -17 37 -17 -41 -9 -60 13 -24 22 43 -31 -12 12 32 -33 -44 -13 -81 -8 -34 -22 53 -8 2 37 -12
3075 -12 1 9 9 -29 25 -10 -33 2 18 8 17 18 -25 -27 44 25 0 -5 -2 11 -20 13 33 -10 28 -16 12 -2 -58 10 34 10 -17 19
3109A9k1k4M3J5n1M9pl6L2J5K1n9L0p8j6R8l4k8j8P1lJ5o4O1p2N0l8K3J8k7K0
3140Dom5N6l9P5Kq5L6J3k9J7J5k4oLoJ3N7m6m6O9j6j8M7o0M9j7kn1nN4M1m8l4
3174c2L1J1j1OK5j9Jm7Ol1Q8j1qJ0j4L6n3N1k2JPr5L5P2Rl1k3K0J5k2lJ1L9o2
3208a0M7l0j1k4M4nK9m5M4o2jJ9J3j6n6J9M9pL7n6qK1L9k0J0Mk0mJ2l3Q0o6R%
3242BoK1k9qM2lk4RL5j0pm8L5Pk2K6j1j9l3K5k3M5Ln8M0M0k9L2n3m5Q7k7k6L6
3276DN2j34Q4Lj4Qk0ll6pL5L0m0M4K1Np0N9Kl6K7J9j6j4J5n7N8j9K0Qm1J9m5K4
3310a5K3m4NJ3M4j2rPnk8qJ1K6l1N0l7N7j07K1N7k9Kk3P2o5L4J1J2j2Qj3kk4J7
3344FK2j2n1K2pM0j9K7r7N5M7j0n3jNO7km1j0K2ppQj9l8P2m1L0Qj6k2K9L2o3O
$$ plain form
3109 19 -2 -26 17 32 -19 30 23 -13 19 34 55 -4 26 -52 -68 30 -4 -32 -50 21 18 33 -31 30 -42 8 -30 -7 11 -16 4
3140 4 -2 -47 9 -30 45 47 -38 -2 11 -18 -1 14 -10 -16 -13 -19 -6 51 5 -41 28 12 -6 41 -19 30 13 11 -40 -45 9 50 2 -32
3174 -32 -1 10 -1 5 30 11 12 -35 -29 -60 28 17 9 19 5 41 -12 39 17 18 25 -70 -35 37 46 15 -8 12 27 5 2 13 52 -10
3208 -10 37 7 -4 -28 16 11 40 -5 39 -23 -24 -5 8 -8 -64 -45 4 -3 34 -22 -30 -9 30 10 20 24 4 0 12 -21 59 -7 2 2
3242 2 -4 17 -12 -20 22 19 -5 4 39 29 22 -26 9 16 -6 20 9 -10 -43 -18 -41 4 7 -51 -11 29 0 32 -21 -66 21 -6 -32 4
3276 4 56 -78 6 9 -5 3 -17 -20 -56 -63 -28 2 -38 6 27 32 -38 21 23 -13 14 33 17 3 18 -39 19 0 20 28 -13 6 -39 -15
3310 -15 8 -36 -31 -18 26 14 5 12 7 -21 -29 -18 8 -23 27 -10 47 -60 -39 18 -11 -9 -32 40 -25 9 20 32 20 28 15 13 -11 6
3344 6 28 16 -35 -13 -20 20 1 28 -69 -14 33 23 -30 -31 -26 41 39 -2 -12 10 3 -4 4 -15 -53 19 -22 8 16 0 -22 7 39 -24 -18
3379a8LJ3%j2k2oM2pO2n0l9K9PL2n%q8Q4rK1k3j0J0j7J0M2n7L9Mompj3j5J6n4
3415d8pM1KJ3K9m6LL1n7M2K1K6l6n0P2j1M0k3j13P2L7j2Mn8M5Pk3j2j3L9K2j6
3447B1k7J1M5n2N8l8n9P2l8J4%k0N1k5nk0lP5j07J14l7l1J7L4l3k1M0k5k8Q5j15
3478d7R7qk1Jl0NrLj0Pk8K9J0k6L2kL7j8pRj5k1KN3Lm9j0KOR1q0kJO2o0JK2K3
3516E3l9m2oM7l1J3j9nL1J2m6L5j9N5q8M4J8K9l8J4j2N6m9Mp3Q2j3J8j2k2n2P7
3548B2l5M0k2k5L0J1j5Pl0k1L6qNl3j5O1J0l5M2M5n7JKJ9l3Pl4k7Q1m5l0P9NJ1
3582D9%l7k3L3o1P8k9j0Mmm1J5m7J19J8o7L0m6Ok5O0RmJ4l0J4n0j7O7J0j3l4L5
3615B3q2K8nJ5J3j9J2K4m5K9j8L4j8j6M0rJm2OM8l0J9LNl3qmk9J16o8J6k3RN4
$$ plain form
3379 -18 -15 -2 -2 -14 -36 -42 0 -7 55 5 -34 -5 2 34 29 29 -59 25 16 37 14 4 14 -3 7 49 -8 31 35 29 25 18 5 -10 6 -48
3415 -48 -55 -14 -12 1 30 -16 -13 18 -39 3 24 50 14 -36 36 25 65 42 -71 1 38 26 30 -28 17 24 1 -11 -24 15 37 21
3447 21 -6 5 50 -2 56 18 -41 31 -7 7 7 -13 38 13 8 -12 -15 60 -47 67 30 -1 16 50 17 -4 36 11 -17 68 -47
3478 -47 50 42 21 22 -8 -3 -12 -9 -19 -12 -40 -11 -1 -27 5 3 40 22 15 24 9 -12 -10 43 46 -3 -13 -11 -5 86 6 4 5 67 7 8 30 53
3516 53 14 -28 -34 13 -18 -5 -24 -29 2 14 -32 3 -16 39 -49 -5 13 42 4 18 6 62 13 17 -56 26 13 31 19 -3 -55 22
3548 22 -13 27 5 -20 10 21 6 13 -17 -38 -2 -10 -5 -38 -53 8 18 -17 25 70 13 14 16 35 2 9 -25 -52 29 -16 -46 33 38 49
3582 49 49 12 -11 22 -39 39 10 0 4 0 -41 -26 -73 46 64 -3 27 -19 -13 -38 22 31 27 41 11 25 -25 -42 25 35 22 -12 23
3615 23 -59 -31 -36 -21 -8 -27 -15 9 -36 -7 -25 9 -9 -25 15 6 7 -35 -29 19 -11 8 11 16 -17 -25 -29 -58 58 -10 6 -17 -8 46
3649D6p6K5j6J2O9l2m9l6Q7nj1j2L1k4n8M2K7Nj6j7N2q6N4j2l2N6o4m4O7L5oJ6
3681B8l4J4Ol8M2Pj3j8RJ0pJ3mJ0k1j1K9j5jK3Oj2k2j9k0N9p4O2L6k5PqMm6P6
3716E3l1j2O5n1m0L2j2j6n3O0pn2M9M1r0P7kj2M4l5m3K1L1l2L1k3lm2R6k0j3J0
3748B1nM7m9l2pM5Jl2M6n7k0M9N4m3J0J6p0N9n5KROj1O5m4QN6j09O5q1P2k1Lj6
3782a8K8K2n2K9m7L8lk0PM2Lk5PK7q1P6j7k4L4LnqL0n7jLm5P2jj3j1M8k1l6M2
3817B6L9m9m0L2QJ5j0L4m2nRL7m2K8m1P0r5J8J4k2j4J8p1N8K9m3K5mL6okJ6K3
3850D9m2MK3j8k1K4j0J2J4oJ6j6l6L3j0M4r7M1K7m9k6R8n1l2L6k8K6nJ8K3o9J6
3882a2J5j3kK8n5M0jj4JM0p6N2k9J4j7J2pL0L4k6J9n1qk6P7j1L7k7om6P8r4j2
$$ plain form
3649 46 -30 -5 -21 -9 60 28 -21 -57 30 25 14 2 33 9 -49 -7 20 25 9 -8 44 -42 12 0 -32 24 -40 -84 -17 18 12 28
3681 28 -6 8 14 -24 18 25 12 -6 3 13 6 19 15 25 4 -7 22 7 6 29 35 23 1 -18 -38 21 -53 9 45 20 27 19 23 -23 53
3716 53 22 10 75 24 -16 16 4 -12 -65 -5 -12 -64 -15 26 -64 13 11 -1 43 8 -35 -14 17 -15 16 -7 -10 -52 44 24 11 21
3748 21 16 63 14 -18 -25 20 21 -11 35 -22 -42 7 61 18 28 44 -26 33 -22 -20 -11 -5 -16 49 5 13 69 -40 25 -56 16 -5 -2 -18
3782 -18 10 32 -20 9 -38 0 -3 -23 -16 26 29 4 11 38 -43 33 16 -8 26 29 24 16 46 -11 -12 -9 -54 18 17 4 -7 41 20 -16 26
3817 26 65 16 -24 8 16 31 21 55 13 8 17 54 12 40 -1 69 -26 -8 6 -16 -30 -12 -83 -25 4 -39 -14 -18 18 12 10 26 49
3850 49 7 11 34 16 -5 19 9 21 35 29 45 29 -7 26 16 60 -37 4 31 -18 -44 54 3 -29 7 -21 5 0 18 41 -28 -12
3882 -12 3 -10 -12 16 -39 1 0 -14 -13 27 -49 3 -26 -12 -29 -17 -24 6 40 14 33 -18 -26 -52 25 14 51 24 18 -28 50 -44 -56
3915e6M0J9Kl8MO8l1j4L5k2k2L3Jn1QL4JN4p1oJ9Ll2J8L3k3j3KM1m6N9l6k1MO1
3950E7o0QK0n3L2j5N9k2j0nJ5k4j4KMK9mL3k3k2k9J1L3l9K1k4K0O1q8N6p1R1k6
3983B3M5m4l0L8L9p9M4o1J8J9l9J17o3o7M7k1Qlj9P5q8L8OL1o3K2L8J2m2K5k4
4014BJK6nm6N9p9Q3m8L7m5J0Pm1J05q8J7j6R3q9K4jN5o5M3j3j5rL3%J4k1l8Qj5
4048a7M1l1M9p3L7k9J3J8k1L0mrm4J5J5J1qM8n6M1l5J6ll9J2P4k9k8l9P7l3N8
4080E7p9QK3l1j1L1OLK6k8l3J8M7o2N5l1k4M7k3Kn6O3k0L5j0pk0M8l3J7n5L1K9
4113B3Lk1L2kp9N4J1M1o7Pl0L8LKk1k3k9L5J3k0j4N4pl8J4N1n2L6m3O3n7M8o6
4146d1L8M0k0j7Pqj6J4k1L6K1j5oJ9l0l6J4J7K6l6k9K5O6k6k9J7m6O6k1o1N6P
$$ plain form
3915 -56 -16 3 5 -33 -29 39 8 -6 29 7 -15 18 19 -32 -24 10 11 65 -6 -12 7 10 -22 -4 29 6 -7 -5 36 -10 49 13 -8 -4 57
3950 57 -3 5 25 -28 4 -11 48 26 16 11 26 2 -12 -10 -6 23 19 52 29 7 -22 -11 22 -17 4 -20 0 61 -27 29 -42 49 23
3983 23 68 24 -6 32 71 -8 36 -25 -7 12 -27 90 27 -40 7 -14 -6 -9 -28 47 -41 -3 3 34 -29 -7 31 43 1 26 2
4014 2 3 29 24 -22 37 -42 41 -7 30 -15 -5 2 -39 66 -22 -5 -21 72 -17 7 6 61 -4 39 26 11 2 35 35 49 28 -10 -2 -17
4048 -17 24 -7 42 -31 6 -23 -10 8 -13 17 13 4 -40 -25 -10 1 -7 41 -15 26 -9 7 4 -35 -23 51 22 -6 -45 32 -1 57
4080 57 -22 -14 9 -22 -33 -2 4 7 33 5 -28 -10 37 -25 30 -1 -25 22 -1 1 -55 8 -12 23 13 6 -14 34 1 18 -37 -6 23
4113 23 26 5 37 35 -44 10 21 62 -5 2 -28 10 13 15 -6 -29 -58 -23 -10 -30 -44 10 3 -35 -21 30 -22 14 -29 34 -23 25 -41
4146 -41 -3 37 17 0 7 -1 -17 -3 -24 12 33 18 12 31 1 -35 -21 -4 22 -14 -43 -18 48 22 -7 10 -36 30 9 -52 4 11
4178A1J5k7k2O0l3j5mJ8K3Jj4k6m3Q3n8Ml7N0K9J0ll2J8jL8n1QJ0j1j7J3K4l2
4211a1L1Jo1P2n4N7o3N5n0P7l8j2M5OJ2n7Lj4J8k1k8J00j18L2N2km7M2j0m2N1
4242B6Pl9j4M7l8qL2LJ0k9k3KN1Jm4j0K4m7J26o1l3L8l7M7j5k9L7MJ2k8j0m9K2
4275b5J00m9k3J5L4J2q2Q7m5n4O2l4j4K4j8%L8n6jJ3M6j27J25m4N5n7lJ7j7L6
4305A5J1oK8n0J4J2j04O0N5k4pjl9L2Jl6oM1L5k6j0j4KJ3k9L3M4j6j1k1O2o9Q
4338cl4N1ql8M3N4r0J6R1q9j3N7q5L6k1qM4j%Ol0K8p6P9N0r0oJ2KK9j4l8K6j9
4372c9M2PrRj7L0k9Lk6K4K8K8qo2J9m0J4oJ2Qj6L3rMOK6o8K9k6J3O2l0j5k9L9
4407Gqj4O5j4o6J1K5kK6j5LL5r4M3L2K3l9l9qML1kM1j7j3rl4PP8n1KkK1Qk2j5
$$ plain form
4178 11 26 -1 -23 37 4 -11 -15 3 26 27 13 -13 -56 27 -31 -27 -64 -14 15 25 22 -10 8 7 45 -6 2 12 1 -16 -3 21 -11
4211 -11 20 21 -40 32 -22 35 -28 27 -23 54 16 4 49 55 67 10 13 -1 17 -4 -32 68 -50 -18 34 32 -15 27 17 -25 26
4242 26 33 -6 -20 27 -11 -19 13 16 26 -3 -26 -24 27 28 -16 -26 -2 -49 77 16 -17 21 -16 31 16 -13 24 28 40 12 2 -47 -25
4275 -25 75 26 3 18 52 64 -18 69 24 -30 32 -2 -16 8 -10 -10 28 -28 -29 -16 30 -97 28 -16 39 -18 -21 -4 -21 15
4305 15 26 20 48 -2 12 24 -80 -20 35 11 4 3 -36 -4 -3 -39 -45 -4 31 5 -5 -19 -17 -4 -33 0 44 28 17 -4 58 -11 -3
4338 -3 -37 14 6 -32 11 65 -25 -9 82 -7 -20 37 -48 -12 -33 -41 3 2 2 8 -22 6 -70 9 59 -31 -37 -25 -23 6 -8 -46 -20 -39
4372 -39 3 10 1 10 -7 23 -6 -3 -29 -5 23 51 43 -19 0 -40 -26 -32 -20 -12 -28 5 -4 0 6 32 -36 -7 -33 -20 42 12 -3 -32 7
4407 7 -1 -15 50 36 -30 -19 6 4 30 15 18 53 -41 2 34 57 18 -21 -29 -25 6 4 45 28 15 6 -28 -21 57 6 8 6 27 35 13 -2
4443bK9p1L7J7m9P3l4k8k0K4QJ4N7k0m1O2p3L8k3o3oR0k9P9n2Qk4J1j3J1j9m9
4475e8K5O6o9R4m8K2k6j1k6K4l5N6j6J1L0l6KK8m2L6J7l5K4J3k3k2J6k0n4P3L2
4506D8l5rp8M6N4J1l1k7K0j1KK5k4mK3l3M5m0P6o9L6j9K3kMl0QJ4Ol7OM6k2m7
4540b5O8j8K1k6j2l3O0j0m7J6k1L2J2m7M5%k0L4n0j9K1M5k5%M0q9M2J2KqJL3n6
4573b2m1J04m7L2k9K3p2O7J0J1K4l4pm5M7k4J6l4J4J2k2J0L9Kn7kj5J9K1K0PJ3
4605D0l1l2K8L3j8j1m2j1M9K2J0o2j1M4k8O0n7m5O6j0j2L4Lo9M5Pk9K2PJ3K7k6
4637A6QL8n9Lm1M7J1l8Nj7M3l9P3m7J2j0j3J3K4n0J9L1n6K9k2K7j8L9m8RM2m4
4669a3j3M9J2m1JnJ2n5j3K1P1p2NR0n9l0J0K8mJ4Nj2nl4J3L4j7J2Kj8MK4n6O8
$$ plain form
4443 -2 27 -44 -7 10 -39 34 0 -28 -48 -24 -16 -2 55 35 -6 56 -17 21 -2 -65 -71 19 -10 69 17 25 1 12 -1 10 -9 -58
4475 -58 -33 33 -36 58 10 32 6 -5 -31 -7 -42 14 -2 9 39 3 5 33 -9 27 44 9 33 46 23 1 17 -3 -57 16 48
4506 48 13 4 -74 -28 26 37 6 -21 -1 -12 -10 15 -9 -13 10 -23 22 -18 58 -11 25 6 29 27 31 1 9 23 29 -8 -2 44 22 -25
4540 -25 43 25 46 20 8 -25 35 25 -22 -6 -27 5 17 -30 15 15 -5 29 -21 -40 -19 26 1 1 41 -48 -6 6 8 0 1 34 -22
4573 -22 -63 41 -6 26 -3 20 -52 15 25 36 60 26 19 -26 21 -3 13 -21 -7 5 -17 -7 32 34 -23 -25 -40 -21 0 20 27 40
4605 40 9 -23 5 38 20 9 -33 -44 5 27 37 -25 -36 8 -20 40 -17 -62 4 -6 -18 16 19 -50 -5 2 -27 -5 2 15 42 16
4637 16 24 62 3 6 -35 12 23 -15 -10 -27 16 -23 50 3 15 5 -8 5 29 -21 -2 29 -27 2 -20 7 -11 28 -20 -11 31 -13
4669 -13 -26 23 35 -6 -5 -10 2 -53 -66 -45 26 -46 -41 49 -10 -40 -30 -2 -6 8 13 1 -4 -38 -25 9 -8 4 6 -12 -8 16 -40 28
4703B8N1o6o5P0j9M3k8m9Q5j02Q9rq1j1L7n9O8m4P8n7N1M8j9m3j2N4m7pK7k1J4
4734DKpQnM5l5k8j1J0M0l8L7k5rk4N4l5J1P1l6l2Qj8Kj1N7m1lK1N0r1K5k4M2%
4769A4O4o4j3l8N0m8P9m5oO5p5K3K6m4K8j1J9%j5L1n0K3L7m6j7mK8l4Pm1O7pj4
4802a1K9r1N6l5P9m5M2J0l5K7k5m1j1P4N6j12J4N5l1K4j8K2km1J1Kn3L9oPPjJ0
4835Fm6L2O1j6o0J6J5J1K2n2L5n1J7QQk2K5j1J8l7K6Kj9j9J0j4L6j6k5J1O0Nj6
4868B0k3N0l3j0L9l5Rl3N3Jm6j0J0J6N4k5o3RM9m1k5J1%K8kk5MO1q4M3O0o9Pj5
4902a5L0o8J28q6O4o4L8nm2k5P5Jm7M3m4L7j4m6K8M0qom9M1%j%k3K2Mk0J1m7P3
4936B5j0J5m7%J5m6M4O3J0n4j0mP2j17Q3l2pl4L5M1Mnn5j4PL4j4M1oj05N9k1P0
$$ plain form
4703 28 79 13 -52 18 -1 42 14 -35 50 -52 37 28 -53 -64 -27 -86 -18 -62 16 -41 10 58 39 -4 -16 38 -9 -16 11 -10 4
4734 4 6 -1 7 2 47 12 -16 -27 -17 23 -15 22 -3 -12 -36 18 -17 -6 65 29 -3 5 -13 -11 -22 35 -6 -9 12 62 -29 -4 -28 14 14
4769 14 78 14 1 -37 13 -35 44 -1 -7 58 -17 6 32 -12 16 5 24 24 9 40 -10 13 50 4 -13 -17 11 -23 -16 -57 10 3 -11
4802 -11 18 -73 -17 -52 27 -18 24 34 -1 26 1 -40 -51 23 79 -33 -19 36 5 29 11 33 31 -10 1 3 -50 -11 -17 -10 -3 -4 6
4835 6 -40 -8 53 37 -23 -7 8 19 41 -11 24 -27 -10 -2 6 -16 9 -2 16 -21 5 7 -12 -31 -21 -35 1 -15 -40 -29 31 36 20
4868 20 -3 47 14 4 43 8 17 -16 37 38 -8 -18 -8 8 62 37 -26 -17 32 -9 -34 -23 -23 5 3 -22 -18 43 -41 2 62 -7 0 -15
4902 -15 15 -53 75 -11 53 -11 27 22 -20 -45 30 31 -16 27 -17 20 6 -40 -12 28 20 14 -35 6 6 5 5 -18 4 8 -12 -1 -48 25
4936 25 15 30 -17 -17 -2 -48 -4 59 69 15 5 1 73 -44 39 7 0 -34 1 42 46 41 -14 -28 -21 13 -1 40 34 -71 -12 -33 37
4969C7n9j1QJ0Jj1P3k8M1p3K9j7L8n9l8J6M3mJ9Kk1K2o5J8OL7J1k3k3QN2kK0k8
5003B9o1M9k8n6M5K0K5l9J4kJN0o7kL0K7n2j0L7p0Q3l1m0nO4j9PN2q7J7L8m3O
5036a8PLJ7ol1l7M0N4n7LM1qmk3MJ9l0O3k3o4N8nlj6N8kl1M5l9l8N2m1rN0m3K1
5072GkJ9j7L3o2Qj6j7N7j9K4m4N2n0QN3%j5m0P9o7On8Q1k2J5l6O8m0j8Kk8nP5
5106C1l9N9j0l1j3l4K6J7Np0J05m7q0J62j15L2L3q5N6K3K9l4k8k3K6m3N9j5l2
5135c6O1j9N7p5KnK2l8J1N8l2N5o1M9m1j9j9k2L1oL0n0Q2k5K7n5jJ2%k6N5ll4
5168a5L9j0l8N7j3n2O3k7l6N5k3oK5J1m1M5Lm4l7O7m8j6L4plK4K2ko0M9NJ4k8
5201Gj8o1P3oJ9PMk0K0m9M6M2k8k4Nj9k0R1n9rl9O1l3J9kj9J23j13npL5k4L7K0
$$ plain form
4969 37 -22 -33 -25 -15 -14 -25 48 20 61 -12 17 0 38 -21 -59 -43 0 -4 15 17 -4 18 -47 -29 -23 14 25 2 -21 -13 39 37 57 29
5003 29 -32 17 -11 -67 -22 -2 23 -16 -2 -4 -3 47 -20 -22 8 35 -17 -27 10 -60 23 -8 -48 -53 11 -8 -1 51 -36 -19 19 -24 -18
5036 -18 -11 -8 9 3 -28 -65 -25 29 -28 -25 16 8 4 -19 -15 4 -26 37 14 -50 8 3 0 -16 42 40 9 54 15 -23 29 -12 -21 29 -14 7
5072 7 5 24 7 40 -22 -14 -30 -47 10 -9 15 -29 23 -27 -19 34 34 19 -21 58 -9 -3 -61 20 -2 13 -23 45 5 -13 -11 -39 -44 31
5106 31 -8 51 41 10 -3 -37 -11 6 11 -59 46 -1 -81 81 -34 -2 31 -54 2 25 54 20 -8 -31 -5 -48 11 -4 -36
5135 -36 25 6 63 -12 -10 -15 7 -31 -20 38 6 61 0 49 8 -11 -30 -52 -21 -27 3 -47 35 10 37 -18 -19 -7 -7 -33 22 19 -15
5168 -15 24 14 -24 33 20 -32 31 4 -32 23 0 -6 19 30 -11 34 37 -7 -44 23 -25 -41 -7 -14 -17 7 29 27 -33 16 21 35 7
5201 7 -11 -72 1 -5 14 21 25 5 25 -24 22 64 36 12 17 -2 -22 69 10 1 -38 23 -10 9 7 -12 111 -2 -7 -14 21 -3 34 54
5235E4o3j8M3mj6K8Jk8Nj4M0pql1K6qQN0pm6%rJ9M9q7Q0m5J9Op4O3ln3K7J6k7
5271a4O1p0J5nQL5j5l3J3k4L6n6K7P8o8M8nj3n1P4o0k8NJ7O7J8r0N7q0N0J3o6
5303e6N8m1M8kk1L4o3L9mM6k6k4qJ9k6N9n2j6Q2p7O6o2K0n6NQ2L6n3n3M8j2j8
5335b8M1L0q6L2M1o2L7M8m9OK0Mk5OJ1j8Pl7K0pL1m0m2k8J02RnK5k2qm5LL4k9
5369b4o8J01k0J3L0k2j4K0J5l2OoK2oN0n8Mkk8N1j5k3OL5k6M0j5n4k1N5j4Pk4
5402a7L0ol5pQ2k8J7j7NJ7l1j0k7N4j3mpJ4k1J4Ql1rN7j8Ll2qL8j5L0lk1J1m6
5437b6K0%J0L0m7J8j3L8p2NN7J7J4qj9Po0K4j0K5L2o7O4k7j7K6J6l8m1J9M0Rn7
5470c1L3j1k4K7k5K2J1lm0L4l6L1m3%O6PK0Pn2K0rk1Mk5M6Rlm0K8j3Rj9J1JqJ8
$$ plain form
5235 54 -9 -27 16 12 -4 24 25 -3 2 -12 28 21 13 -18 8 0 8 58 51 5 5 -4 15 64 -23 57 12 31 37 -37 26 23 -30 -3 13 -14
5271 -14 47 -23 -8 -13 -5 30 15 -18 -5 -29 7 -49 -22 56 -12 36 31 18 -33 41 -19 -47 -42 -25 42 60 -30 27 -53 -3 10 -56
5303 -56 2 -39 9 7 -14 20 -43 -4 -8 38 12 -12 -20 -1 -27 32 -20 -36 46 -31 35 -27 -7 -63 -58 24 60 7 -46 2 -10 -28
5335 -28 13 43 -43 -11 30 -32 5 53 4 10 30 34 9 15 26 8 15 -22 -2 -9 22 -18 -60 -88 14 23 18 43 21 13 -32 -29 5 -24
5369 -24 -92 9 -11 2 32 10 -4 16 31 -1 5 -1 21 15 65 7 11 9 -19 32 17 -6 0 35 9 49 34 -20 -41 14 0 7 -17
5402 -17 13 7 -28 -35 47 19 36 19 24 41 10 0 -27 27 14 10 3 17 -4 10 18 -13 -22 35 17 20 -12 -20 18 3 33 30 9 20 -26
5437 -26 -6 -6 4 34 -13 5 -8 30 -42 -37 20 37 51 43 24 31 -29 -5 -15 10 42 -25 39 12 -5 21 37 -1 -42 -23 17 26 -31
5470 -31 2 -9 -33 -6 -31 -9 2 -1 -41 -7 -43 -12 -55 -55 11 18 38 45 -7 13 4 -17 -13 -38 8 17 14 -26 2 -11 -2 -21 -10 -9 -17 1
5506Aj4k5O1l3O4q9rK2M2n8M4J6n5N3qj3K6l8J2MK7m3J3K6l8NLL0K4o1LmJ6j1
5540gP1q0L3kjk6O3p6OLj5O9m8NM2l0p7O7j8N5m6M3p6L7K4o7P8k3OKm7P0%m8J5
5575BL6l9L3j5n9Q1p9N1o8J5M1Nl0pJ7P3l3l7j0L0l8l2R4m2Pl0J7K1K7o2M1p0
5607f0N7p7P4k2N8j05M4M5lPk9L4o8Q6k7k8l3M1j2J0j1RP6r8O6j0n0M7m0L6Ll4
5639a4k3M6L2j08R2K5k7M4o0N5n1J6k6M4m8l9N9pk1M6m8L1qN3Qp1j9M6Qk6J3l9
5671a7RN7r7L0kk0J8J1mJ2l9KK9KJ3m2K5J6mJ3L8k6l2K8m9M3L0o3M3k7KJ9oj3
5705aoM2q7N2J5n1N5j5J2Jr7R5k2l3L7J4k1lK7K6K1o3l4M0mK2k4J2k4J0Rj3k3
5738c1J0M6J0o1L0j9l3O7l6OJKJ9l3N5rJ9k8J8k7l8L4m1J2Rj0R0o0m3M4Qj0k4
$$ plain form
5506 1 -13 -38 23 -10 54 -35 -44 -22 20 -38 6 22 -33 20 12 -1 25 -13 -1 3 30 -13 0 26 -12 -7 -4 26 50 -11 -8 -12 4 -7
5540 -7 64 -16 17 15 14 -12 51 -25 -19 -16 -31 38 -10 -5 37 7 -70 -3 -21 34 -12 31 -45 -8 16 -51 27 4 10 12 -35 35 35 -13 2
5575 2 38 -1 32 17 -42 39 -40 11 -57 -42 -1 4 -26 -33 -16 57 24 -13 -23 7 -31 -63 31 -11 -4 -34 -17 4 31 -31 10 -60
5607 -60 -3 -80 -6 -28 30 -75 -31 14 11 18 -11 23 -45 41 14 -14 -47 -6 -18 -8 -19 -10 66 -32 34 24 -26 21 -19 17 20 -14
5639 -14 -37 9 41 -67 25 50 23 67 7 62 11 27 1 45 -3 -42 17 10 -11 35 -13 18 10 63 71 0 -19 27 35 9 22 -17
5671 -17 -8 49 -48 -18 -20 -40 -22 -11 -15 -3 -42 -40 -11 -9 4 -38 -13 3 -1 12 50 24 -8 20 -29 14 44 -19 24 -3 -1 18 12 -1
5705 -1 -7 35 -52 0 15 -36 19 4 16 17 -80 15 -7 -40 -3 11 -10 -13 14 40 61 -2 -36 4 0 22 -2 10 -14 -4 5 -8 -31
5738 -31 -21 25 35 -26 4 -15 -48 19 -17 -11 -10 -8 11 -22 33 24 43 15 33 6 -32 2 -39 -27 -18 -28 62 2 -41 3 11 1 -23
5771b3R1m2j4J0o8N7k4M2n1K8K0j1j1k6QjRJ9k9L7l5k9K2ONL2k6j4M5k3L5m1%
5804bN1o7M2k1m6O2l0J1J2Rn6Q0m5J3LK0l7jj5M1k6Jj1K8l6O6n3l6L8L6p4QL9
5837Dj1O4k3l5pL4k6k9M1l6K1l2K1j8K4m0L1L7K9n1Ll3P4q4N2k0l2P9o6j6M8j5
5869a2j4l3O0K6l4Rm8L1J0J9J4Pl5j2N2n2l3O0k8O8ol6%K0rj5n8O7l0K7L0l6M2
5902E1q4K0N7q3M4m3O0K3n8O1l2l0L1Npl6K0K8k5l4J5jk1N9n1N1kj7lj6L9k6L0
5935B5m9k2K2J1N9p1j3KN3o8j7P8RPn9P6l0l0N1l0k4J9K5j5OJ2n1RO6o1J1l4K1
5968a2jJ7k1k0L7j7M2j7nj7Pkpj7Q6m4%K0k7M5j03Q2l6L0m5l8J05m0l5K6L1or
6001Im3M7j7M2Nl2m3J7L9j9M5n6LJ6K9j8J5K6q1N5l3K1m3m8M9mK0rkM6m5M2j8
$$ plain form
5771 -23 68 26 12 22 -46 11 -13 29 -22 6 26 15 4 -22 -14 -15 -6 13 -16 21 -14 -43 -21 -15 -10 22 -4 -18 27 4 39 -2 -2
5804 -2 49 -18 24 3 -43 19 -11 0 12 21 -35 45 0 13 16 36 -1 -2 -17 24 -2 -1 -12 16 -20 46 -7 -43 -5 31 -43 -35 4
5837 4 -7 57 34 -1 -8 26 0 -29 12 -24 -3 -35 -14 -32 -8 -48 -17 20 49 -2 1 -32 42 -42 10 -10 -42 37 -29 -45 3 -12
5869 -12 -26 -59 1 27 -7 2 -46 -15 -5 14 28 35 0 -12 40 -12 -45 15 -13 55 49 13 13 33 24 9 -49 18 -12 15 45 9 51
5902 51 -33 -13 44 -39 5 -38 22 45 -13 48 16 -14 17 22 15 -21 -1 27 2 -32 -17 -18 -39 20 -31 20 18 1 -2 -18 21 -5 25
5935 25 -24 -46 -24 -13 46 -25 -38 -36 17 -51 -68 10 19 26 -33 43 13 -17 34 4 -20 -1 24 9 15 27 -24 -15 51 -10 1 -33 -12
5968 -12 -13 4 -17 -37 0 -17 25 8 3 -14 -7 -9 -16 -33 53 9 9 29 2 47 -56 26 -10 20 -25 -63 42 2 -33 -7 24 18 9
6001 9 -34 13 -4 38 43 11 -32 -15 24 5 50 -6 -3 13 42 24 39 65 -16 39 6 27 -16 -64 -15 -19 1 -8 -10 36 -9 33 15
6034A5J3Jq3M2N4q4LM3n3P3jMk0L0j8p6M7J8K5k5M9p8m7O4j3J4k9Rl8N3N7p7M3
6067A5Rp5L3K4l9jM1L7l0K1m6J7J4j8l5J1j0K8Qo1O9Kqj9K3l6m6P7j5L4k9NJ4
6100A4jJ9Om0Kl4M1m0Q9l6k3jJ3L5K7r1M7l5k2O0m3N2m8oJ4J1o2N3n0P0m6k3J7
6133c1K4J9J6pk4K9J4m6L6m5Om1Q6k6K5Kjj7l8J7OMnJ4j9j4M8q2L3J7m1K0L9L4
6167E2r3N2j2pL4j1l9lk9Q2m8J0K7j7mPK4rn3O3o3N0J1j2n5R0o5j5Q%N5p2M9q2
6201g5P4K5Pkk1j9l2K3Oj0J3L6j6Nk9k0lJ7R4j03O0mJ8o8L8m4M8j3PN0o8k3L3
6234Dm8Q1J5q7j0L5J3%Rm4J0M7rL2m5l2LJ9qK0J6m0j6N9k4k4NK2M6j02R2J0k1
6267B8qm5L6k9M5nJ0qk3j8nL5j3K7q8N4J9n5nR0lk0oj4O%Kk3qRO4m4j5k7O7l6
$$ plain form
6034 15 28 29 -54 -12 42 -42 -39 4 -49 24 23 27 7 37 19 -57 -10 8 33 8 57 -21 -68 -4 -17 -3 -32 -23 -61 -8 49 -28 15
6067 15 24 -51 -18 6 -33 -34 7 44 14 35 -11 6 20 2 -33 -22 -32 -4 4 -57 12 14 6 -13 10 -26 -72 5 -10 24 -5 0 14
6100 14 13 32 38 -2 0 -34 7 -33 56 20 -3 -4 9 44 71 -20 27 -8 -30 30 -13 39 -9 -15 -1 10 -52 1 -49 21 -25 -48 -31
6133 -31 -7 12 28 21 -3 26 40 -6 30 -15 -9 -50 36 10 35 37 36 19 -19 -2 4 8 3 17 -2 -16 32 -50 -17 0 -41 -21 18 52
6167 52 -41 11 -1 -8 26 15 -24 -27 -56 26 -22 -12 15 -2 -6 1 25 16 -37 26 -37 13 24 12 -43 47 -18 -33 -25 -25 30 -42 7 -75
6201 -75 -1 24 31 29 8 -11 -43 -20 -14 -24 -11 25 9 14 -15 -35 -38 -21 73 -30 30 26 44 -24 14 -30 18 5 12 62 -6 -29 4
6234 4 -44 37 52 -35 -45 -10 3 3 12 -32 -22 25 16 48 3 -29 -26 -7 -15 5 21 -19 -35 24 0 -24 -19 3 49 -53 39 49 28
6267 28 20 -25 11 -18 27 22 32 24 1 -17 -22 13 0 27 -61 -7 12 -43 -48 42 39 19 13 -1 5 5 7 -16 -24 -15 49 5 -10 -37 30 -6
6303fk8j1K3J5j9M4k6Qo6Q5l%oK0j4o1O1k7J2J1OK4k4p8N4J8K9n0RJ8jj8k3O0
6337C6m5J7j3l4K7j3M2o0P2m4PJ3j7J9M7J8q9J0k5O3J7j04O6k1M3l8l9Q3q2L1
6367a3L9pLom8K4PJ4n5J9L5l4K1m2K4Lk2rJ9M1L5l6p2P1l1K4j3J4j8M1nJ5j3l5
6401a0Mk6P0q2K7qL3N6n3nK8k2n9P5l2Pk0J9pK1rk3J7L8l4N4k5k2lL1m1jL6k8
6435FJ0lJ0m0J3P8r1M7J7k2j3m6K0Oopj1Q5k5n3LK1k2K9J0l1J0k2K9%l0O2n4L4
6469A4n2K6RK6lNJ4n8MN4pkm6L9k4j0L0l6N7mjk0j3M4q0L9l4M1njnRK3lM2r6k3
6506d7Q9j23O5L0N7r6P1r1O1J7n9K9oK8o9K6oj1O8r2M6K6J9Nm9pK8oj7L6m9M0
6538A3k4N2l5k4J5k2O7n6N4l3%QRk7mj9Pj1k1R2n1J8Nl8L1M5mk4rk0m8N8j3rJ8
$$ plain form
6303 -6 -34 -45 -22 -7 -26 18 -8 0 -66 19 16 16 10 30 16 -45 16 -11 1 12 18 42 18 -60 -6 12 41 -9 0 18 17 -1 -24 36
6337 36 -9 8 -5 -39 -12 -25 17 -43 29 -15 -8 5 -12 7 54 72 -17 -7 -32 31 48 -56 10 -11 32 -6 -45 38 -44 -13
6367 -13 26 19 22 16 -32 -8 -1 13 -42 -23 12 -22 -1 -43 -19 -16 -38 -47 -28 13 48 12 -60 11 -20 4 -9 5 -13 28 23 38 25 -10
6401 -10 -6 -32 38 -44 -17 -25 8 64 11 6 34 12 -47 28 -4 3 -17 2 -5 16 7 -16 1 39 5 59 34 12 9 40 -1 -2 34 6
6435 6 16 13 23 -17 -4 74 -17 30 47 25 12 -34 -14 -8 -14 -21 -32 53 28 -25 -22 -1 -23 6 16 -15 -5 -27 2 2 -28 34 -20 14
6469 14 -38 -12 -3 23 20 25 39 -19 -15 39 32 30 -16 23 -1 -11 19 -17 40 36 35 15 2 46 -34 5 -29 12 7 6 1 10 33 30 72 -24 -47
6506 -47 42 -81 -16 14 71 -25 46 -45 16 33 -26 3 -3 25 -44 -18 -24 -35 33 -59 -13 13 32 37 -12 -19 9 3 -14 22 -27 13
6538 13 -11 41 6 -18 -3 -25 42 -14 40 7 7 15 24 -3 -7 -26 -19 -30 -51 41 -10 8 13 -25 6 51 47 23 14 -6 -54 4 -9 -18 0
6573@Q4r9o0Q4m8N5J6J4k9j1j1k2N1m5N7o2J7J1N0l1JO0q6J5J5l2K1m8N8plk6
6605a1oM3K9k0k0kJ7m6N7qj2p0O7j8L0k8k0M7K7l6j3L5p0J6J4Ro0Q0m7j2kKL1
6638Ck8M5j4J6nj0qmJ7k6j1K4JJ1l8N4l7M1o3nL8ml6J7P3q3jR5j07J0P0m0k3j8
6672d6P3o2O5j7KLj6l0lL0N0p4P2m8j4M1r7P5L0o7N5l1k1K8LL7o8Q0q4R0q8L9
6704Gl7L1J5K8p1N2q6P5oj1K8p4O7%l3O3o6OL7k7j2K0J7n7N1Qk9j7nRL4k4K4m2
6738b5M3m8M1K4j7o0N5Ok2q0J05k2N3l2n0J3jOM3o0J9k4P9j8l7J8J9J6m9J3k3
6769a5J2m4M8j6Lj1L1J0Mk1l0NP3r0M4j8jk8L7L0Pl3l8O7k3N6Llm8kn8R6q2N1
6803A6k8kJ0j7qM9m3M8J1rj8L3k0O4j20J3N1k9jOk0L8J4m7k8J4L1K3k2O0n6L1
$$ plain form
6573 0 84 -15 -75 9 -39 16 32 46 17 6 -5 -27 24 -21 36 -26 -9 2 52 21 22 82 -4 11 26 -6 15 -33 25 18 15 -11
6605 -11 -17 26 55 35 15 13 30 -16 41 33 21 -49 18 0 30 2 -18 29 56 20 7 42 -28 -12 2 11 -49 31 -16 -28 -30 -28 3
6638 3 -25 20 6 22 17 7 -1 -5 12 -14 -25 -1 0 11 -27 27 -10 31 -32 -37 1 -3 -39 -22 51 -32 -33 62 -45 -35 35 -5 -28 -46
6672 -46 27 -35 30 13 15 18 2 -28 -31 -1 49 -25 47 -1 -15 26 -71 4 34 -33 22 -9 -30 -2 1 38 -30 50 -34 56 -32 7
6704 7 -30 1 16 44 -27 25 -61 14 8 -3 25 -49 18 18 -15 48 -18 -12 25 -2 -14 6 23 -34 17 25 -4 -21 -26 -17 17 -7 17 -25
6738 -25 18 -30 11 35 18 -42 13 19 -3 -83 22 0 53 21 -29 -16 -17 -11 32 -28 -9 -33 46 28 -9 9 28 44 -5 8 -15
6769 -15 -3 -47 1 -15 -12 -23 8 18 22 1 -29 -24 49 -41 3 -15 -16 -44 -7 23 30 -3 -41 26 3 59 62 59 11 9 -49 47 -35 16
6803 16 -12 -14 -4 -21 -29 20 -23 25 36 27 9 42 22 86 -34 -21 30 1 0 6 -14 24 38 -9 -37 -23 8 31 9 69 13 44
6835D4m9L0pL%j2rj3L9nN8o8k0KL7m9J3L0pkll1j7J28r2oM0o8O6lq0N3j6m7P0
6870IJ6Pj5Kl2O5k8k9m7M4j5M1j7N5m4Nm9rQ3o0M4j3rj3P9qm4m1K9Mn0j0O4j7
6904cj1J0O3l4K0l9Nm8M9K0m1J2l4J8jk7N8qPL0Ko9Rj3L3k1M4l8M6ql5L6l7M0
6938C5m7LO0p5J7M0n9J9lN7r1P1m5j2M8k6Nl0M5j0k5M6l5J9k7K6M8m7J0j4M9n4
6970bk1N8lm1M6n3P2j9Jm9K0m3L7j1L3l1j5O1k6mm5oK7l2O4k1Mrl5L8Nk0K9k7
7004a8K8OJ1m0K7llj3l4N0J4J0m1J3n5L7O0m0mJ9jk9j2L5K4l3o0N0M5k0m4LK0
7037BQ2j23N9m7O6l9rL5m5L0ojk5M1m1N7k4j0M8m0l1K6K9J7m6l1J2j7J1L0L4l0
7069A4l8Qk0P7o3K6jJ4mk9K4k7J1Lj6RM3l3L5m5J1l5L4j3M0l0lqM1k5J0n1P1l0
$$ plain form
6835 44 -5 25 18 21 21 9 0 -13 26 21 79 11 -9 -7 30 -19 -6 24 17 15 12 -19 -36 92 0 -6 34 -34 32 29 -51 2 -14 -61 9
6870 9 25 32 17 19 -13 52 24 -5 -52 -8 -23 18 1 56 12 17 -32 -41 42 -18 26 13 4 -9 70 62 18 -23 6 10 -40 -50 14 -3
6904 -3 -14 -4 59 25 45 6 11 -37 12 32 -9 3 -31 -13 -14 -41 17 9 16 46 48 -21 -12 -25 8 -13 31 -7 39 31 -4 32 -5 35
6938 35 -12 -9 51 -24 -7 33 -26 -7 -10 47 -44 27 -18 -30 18 -8 -3 -33 12 2 -23 23 -12 7 -20 6 54 7 17 3 52 -2
6970 -2 -23 35 32 -9 37 -16 56 37 38 -11 9 -34 3 -8 25 -6 -21 40 14 10 -35 -41 -14 -46 18 -3 1 -8 -43 -5 0 -20 9 -18
7004 -18 10 16 27 -13 14 11 8 -5 -39 11 25 35 -6 7 -48 -11 49 9 5 24 23 -6 -18 17 41 8 -52 -2 43 23 -21 -18 2
7037 2 84 -39 20 -27 39 0 -9 26 -19 11 5 4 -21 20 -21 36 12 2 50 10 -21 5 34 51 5 -26 -14 -31 -20 10 44 14
7069 14 -24 -16 -36 41 -22 4 3 17 13 -16 8 -19 -8 -5 -21 -12 31 -2 33 -12 -1 -36 -2 -15 25 -5 -8 -16 25 0 10 -41 30 0
7103@p2O4j8K5j4K0l7N5m1KK2k6J8ll5K4J9j1m5N3k5O2kk2J4j7P4p1oJ5n9M1l8
7136c4J7n2M6oL6K5l4j5%J6M1l7o5J10o5K3j8RO1m3j2JL9pm3L5Nm7L1j8K2p0M4
7169eM1p8J8N5l5k5%O1m1Jk1L3lj3OL2rMr4O8J8j7m4N2J9Jj5rM5l6K0j4oK8k6
7204A1L5q1O9j7J6K7p1kRj2qJ5NJ0j6M1J0j9o7O7Pn2K7Ol1O6n6k4K4Oj4jJ1L3
7238B4ml6L9o1P9p1j2P0L3o8j3PJ8J1J0l5onjNK7l5L3J2j8qL0j8k4L6L3KJr5R4
7273E4m6l0j0N9m5O5n7mJ9J1J5m4rK1j2N0p4N3K5q8R6k8k1K2l3l7O8n6P8k9MK0
7305C7o2J9L2n8K7Qr%OK1p5Q8j0k9M0p0L9p9J05j3qJ3pj9q6R2m8P5q1M0K7l2K8
7338A1l2OQk6N1j9k2k8L6N7qj00R7om2K5J0k4J5nk5N6mj9pk1K0L1Pk9p6O1j2m
$$ plain form
7103 0 -72 -8 -26 -1 -15 5 -32 23 -18 -16 6 -20 -2 -5 -40 -16 3 -8 -53 0 -25 37 35 13 27 10 84 13 7 22 -37 4 -34
7136 -34 -17 -69 -23 -29 7 32 -2 -17 -17 -1 40 3 -62 48 -17 6 -12 -3 58 15 3 4 43 36 -7 28 33 -14 17 -1 21 -49 -5
7169 -5 36 -42 -24 31 -4 -29 -29 32 -9 -8 -29 4 1 -12 -6 26 17 21 -73 -5 13 -4 -48 4 23 24 9 0 45 9 29 15 9 37 11
7204 11 46 -35 34 17 33 60 -11 -13 -4 -16 -24 -9 -4 6 -10 31 41 22 -45 22 29 -23 4 10 -21 45 -11 -35 -11 -5 -19 -20 -9 24
7238 24 20 -16 23 -38 41 -30 -42 28 61 -7 -20 -13 5 16 26 -9 -15 -20 -21 -16 11 -24 9 21 3 -5 25 7 -17 19 52 54 55 -40 54
7273 54 8 -22 -32 27 -18 47 -10 -14 5 16 31 -13 -22 -1 -13 37 -37 16 41 -47 49 21 0 22 -11 -48 20 -36 42 13 17 37
7305 37 -25 -6 26 -32 -5 3 -6 -6 0 21 -54 34 24 -5 35 -35 4 -75 30 17 9 22 15 -4 -90 2 -46 29 -52 -12 15 -17 11
7338 11 -21 -15 -7 -33 18 -1 -23 -51 -15 42 34 -66 31 25 -17 8 18 -6 9 4 -21 35 31 12 5 -16 4 35 42 13 -63 -2 -14 -18
7372a8N9o5m0R2j9k2J7L8l6opK4ro3P9p9M6N5n1qKM1n8L7k4J7J8l9P1o5O3l1%
7405A9m5K8Olk5j3J8j1M2ml2Rj4K0k3J3M8q6O3J8L8j09J4P5m2kk3L7PL7o3K6k0
7438CmnJL3l9N5k9%l9K1J6p7J04p9N9o2J7L5K2r8R0m6PO3Ol9j9K2j0k0L2K7k9
7471A8o0O8l3k2K7m0J3K1K0j2MM0j4j2jK8l1ml3J8OQm0jM3Mk5j0mj4K9k2N1Jo7
7506d6J21j11L3QJ2Mk1L9j3m4J4L7p9L3K4l6M2o9O4M5n4J9l3k4M3q1Q8l1M4j2
7536A6j9K7Np1M0j6j1K0k0J0pLnK3K0m3Q3n9%j5J4O1j8m8j0N5l0lO5p7L8Qk9j3
7570fm8M3PK8o9J5L2K7l7J2m0P4pk1N0l3kl2N0m1K6k2K6J9n7O4j9l4O5j19K7K9
7602GL0l1k7Mkk2M7Lpj7N1ql2L9l5M9o7L1j1m3O2qj8M6l4k5%j9M8l6K8j9P6l9
$$ plain form
7372 -18 41 -24 -64 28 9 -13 4 42 6 0 -7 17 8 -55 24 -55 -9 46 -5 -13 -11 30 -28 9 -15 2 20 -19 52 -13 50 19 19
7405 19 -26 2 8 5 -20 -33 -15 -26 16 12 -20 -11 -25 -5 -28 -15 33 -53 10 28 66 -43 -29 46 4 2 -21 16 23 60 -3 23 3
7438 3 -1 -6 -5 28 -11 44 15 15 -24 -3 13 -64 40 -39 20 -42 -25 10 32 -66 24 -22 -15 48 54 15 -4 18 8 -12 20 47 18
7471 18 -42 26 -7 -29 -2 -42 -29 -8 12 0 4 44 30 18 17 45 14 10 -23 -5 1 9 -31 -32 11 15 -10 -20 -24 -38 -9 -31 20 21 -46
7506 -46 75 -36 -3 5 17 21 0 39 26 -18 -4 33 -46 -13 11 -25 17 -52 12 57 3 22 -11 -35 8 -73 15 -16 28 16
7536 16 -3 24 29 -42 -2 -18 -29 -9 -29 -19 -26 -23 -28 -5 15 -28 55 -4 -4 -19 -5 56 38 -10 -20 35 5 2 67 -10 28 36 7 -6
7570 -6 -54 -11 -4 24 -45 -30 2 29 -8 4 -36 38 31 10 60 27 25 -7 43 2 28 6 32 51 -6 58 39 5 70 -49 -22 7
7602 7 37 6 -21 -17 -19 -41 6 9 2 -15 36 28 -4 35 0 49 -18 13 2 -41 21 13 -5 41 7 -18 -18 -37 11 -25 3 -16 60 21
7636B1o0O8J6k4oK9m3K3j5k2K4k6Ml3O2l7P%K2J0J3m2k7L2JJ4Qrk8j2M5nl9K1
7670hM2k0k2mjJ1m3O7m8M0M6o2k2PM7q9O8l5J7LRK3j4M7n3J0o9K2N1l7N8k2p0
7703e1N1l0k8R2K2l4nK5o5M4k0k9L1J1l7J1J2j1L0o1N3K2k5KJ2km7Q5j08Q5q9
7734e4O2J6Pk7k0J0lL2J7J2m1K6m3L7n1K4k0N8p6M7j0k9N1m5K5n4L8K8J8j4m6
7765b5N2l6O3m0nj0k5O9l5n5Q1p7M5J1k9J2K8J1j6k4K2m1OM8n9j5M7j9L2l1K4
7796IqL8k9ml0LL0l3L5mK0j6oL4n6L0L0k8J1k4pO5n7qpM0l1m1K8M7l3L2l1mJ8
7831A3L5n0j1J1j7K5j5J8KMJ4m3k7M8K3p5J4N5k4L3J1k5Qn4J00o4l3M3ml0nK9
7863I%n8O0J7l1%m3K2NJ4L2K8k9J7n3M5pm7kK8qj1oN5k6%Jk5K6k1m2P3p0N4j1
$$ plain form
7636 21 -39 29 45 21 15 44 1 24 9 -13 11 -15 -11 -44 18 -19 -12 -12 10 20 33 -9 -36 -4 -3 11 19 10 -18 -30 15 10 -29 -8
7670 -8 34 14 -8 -12 -13 -2 -45 22 -26 14 60 -2 -24 -17 30 -59 9 -26 -9 -6 3 26 12 59 6 16 -53 -31 20 -17 41 19 -51
7703 -51 0 -30 -58 34 56 22 17 42 -23 21 1 -28 3 14 -23 -12 0 -11 19 -42 11 33 8 10 22 20 -27 58 -50 35 -54
7734 -54 8 24 31 4 -16 -6 -9 23 40 52 11 37 -6 31 -20 4 -16 42 -34 13 3 -26 25 -20 5 -49 -11 17 35 21 -25
7765 -25 27 -9 54 14 9 -1 -26 43 8 -47 34 -43 2 13 -16 -4 24 35 19 -5 17 -24 -18 30 -29 -44 3 -16 16 -15 9
7796 9 1 39 10 6 -24 -21 9 -24 11 7 27 11 5 39 -17 13 43 15 26 2 -5 60 3 -5 -12 28 -3 -44 -16 31 -2 30 -1 -5 13
7831 13 48 -2 -13 -2 -19 6 -9 9 11 15 29 -14 -41 7 30 -45 -31 24 0 33 44 19 27 -27 73 9 -24 19 15 -15 -20 9
7863 9 9 -49 11 28 -3 -3 -46 -24 -19 -5 27 55 26 43 -10 35 28 -19 -21 7 -1 -12 -18 37 11 11 12 -13 13 -8 -50 23 -47 7 -4
7898dM5m0nk3MN3K5n7k2m0Q6k8j1lO0p8j2J09m8k5Rm0j5N5L3Pl1K5Plon5K2Rk9
7933b6oP5n6N6o9L0J6l5kJ1K0k3Q0j00nN2k0k7O0j3l9J0oL6jm7L6jM0m3m4N2j8
7966gM6m8K8l6JL1l2K4Ljj5moj6K4j2M0l6J5J6j8N2m1J3j7rj0L6j8J9m1M8OJ8
8000E3n8O9q2M5m8n1J07l3M0k1k2l3j1j1L1M0k2k2L1J3m6M1jk4Qn1P9%L9k8Ol4
8032Dlm8K5J7kN0k2j9j1j3N7k3K1K%m5L3K1k2o1M4k3J1PK1k0k5L5k1N7m8J1J7
8065B7Jl0M4n5K0kj0l5L6K6l7R2k3l0l6L4qL2k3n3P6m8K9op5O0j0l1K1N3o6M4
8097A7m9J8N2j8m5RKK7o2N5k5M1Km1N6l1Qk4K2nL2l2M1p1M5K0j1j8LOj5oPj4l3
8132c7K3L8On7J2J6k4O0mm8omN3l0N2p0m0M3nJ1K6jK1%o3J1lkj2L8o9J06l5jl
$$ plain form
7898 -4 41 1 -4 -27 -23 30 55 -2 -24 -64 22 -6 -17 -20 40 -38 -50 59 11 -14 -5 -45 -60 -5 28 35 4 29 36 33 27 -28 -6 3 -26
7933 -26 -32 43 -13 43 -26 4 20 -15 -17 -6 14 -9 71 -29 -34 18 -2 -29 31 18 -21 -11 -17 19 18 -29 7 6 46 3 -41 11 -7
7966 -7 39 -9 19 -17 -16 15 -17 7 10 9 -6 -10 -16 -32 -8 -20 20 -16 -1 15 -3 49 8 21 4 -5 -15 21 3 22 -19 29 35 53
8000 53 -5 64 -18 27 -21 -72 35 2 42 21 -1 -34 -45 -56 -25 15 -7 -29 2 15 -31 10 9 -15 -7 -58 21 21 60 32 38 4
8032 4 1 -47 -22 -5 -7 43 21 2 -9 -22 35 12 33 35 35 -10 23 44 22 -39 5 -18 -7 0 21 1 -24 11 -10 47 -1 10 27
8065 27 28 -2 42 -13 7 5 -5 -40 -4 22 -15 77 54 24 -12 22 14 46 23 -30 46 -2 27 21 -54 6 -4 -35 -14 39 -27 17
8097 17 -32 -14 38 20 -25 -16 -14 13 -49 6 -19 22 24 -17 39 8 16 -8 14 9 41 9 50 -21 24 44 33 15 18 24 9 3 10 -4 -37
8132 -37 -14 24 30 -27 -15 1 -23 37 33 -15 -21 -25 28 -2 50 -20 -60 -17 -22 -11 15 14 35 35 -28 -17 -20 -22 -34 4 -65 41 6 5 2
8167BJ9k5k4J6J1LK7k9k6M2rj2J4nk0nQ2q8kN1k6m0K6N8
$$ plain form
8167 2 21 -4 -28 -12 -1 2 29 0 -26 16 7 -5 9 4 -16 -21 61 -27 -29 22 -4 -44 -18 40
8191D0
$$ Imaginary data points
##PAGE= N=2
##DATA TABLE= (X++(I..I)), XYDATA
0@%%%%%%%%%%%%Qj6J6j6J6k4L2l2M0m8N6p2Q7j01J17j35J52j74J98k24K56k94
34a58L34l75M22m73N29n90O60p37Q18r06J002j107J222j348J486j638J804j987
52a042K190k415K667k947L266l631M050m541N123n826O699p814R292j1362J4488
67H197j9812L1273r9752P3266O8763j91448R7752P0050p4340J2817O1131k7588
79A0309j5099l8057M1748O2138r4122n2292J20811k1999p4874P9370J1550p7604
91d8121M8366M4434l2954j8566j1283J6206L3701m5350k2849L7705j4642p986
103b1339L5635j4315j5793J1374J0088L2003k1391n7240M9439K9942o8248J3727
115a6118L3324o0727J1066N9129l5059j8996K6843J834K5997K756l9510L0676
$$ plain form
0 0 0 0 0 0 0 0 0 0 0 0 0 0 8 -8 8 -8 8 -16 16 -16 24 -24 32 -40 47 -54 63 -72 80 -94 104 -120 136 -158
34 -158 176 -199 223 -250 279 -311 349 -388 430 -476 526 -581 641 -707 779 -859 945 -1042
52 -1042 1148 -1267 1400 -1547 1719 -1912 2138 -2403 2720 -3106 3593 -4221 5071 -6291 8197
67 8197 -11615 19658 -80094 -6828 61935 -129513 -31761 38289 -36051 -23234 37897 10309
79 10309 -4790 -42847 -1099 61039 -33083 -85375 35436 13437 -61437 17933 29483 -48121
91 -48121 245 44679 11725 -6841 -18124 -1918 31783 -13567 -36416 1289 -13353 -21339
103 -21339 14296 -19 -15812 -4438 5650 37653 16262 -40978 8461 38403 -29845 -16118
115 -16118 17206 -43521 -32455 26674 -8385 -27381 -538 1296 27293 30049 -9461 21215
127B1215J7099m0912L3392Q292o9414L0451M5339n4410K471K8914l8390K1087
139E134L9737m3891p920L3453j3961L16J1453k5208l169J3902j746O407j5314
152h07j9589L5246J1807l3781J3486J2829k7242J6379K2801l1567j5187J8528
164B903Q595n059j3607J467J3378o237O997J8021k3766q778L6480k622k4239R390
178A2923k803r621J6085m535j9903M328M110L629P673j4431n740J8027q50k810
192F082O119j7090k121K2631q927j4979O761n864J028J6199j1202j2872J1508
205b727L627M4M825j1379o651J3103L200o281m527n420O813R073o293j499J497
220b595o104J2162J1368j8652o965J5045p30n763K045o930m904O480N634j596
$$ plain form
127 21215 38314 -2598 30794 39086 -30328 123 45462 -8948 -6477 22437 -15953 5134
139 5134 44871 980 -6940 26513 12552 12868 24321 -887 -4056 9846 8100 14507 -807
152 -807 -20396 14850 26657 -7124 6362 19191 -8051 8328 31129 -438 -15625 2903
164 2903 11498 6439 -7168 -5701 7677 1440 8437 26458 2692 -6086 30394 27772 3533 12923
178 12923 10120 499 16584 12049 -7854 -3526 584 4213 11886 -2545 -8285 9742 8892 6082
192 6082 12201 -4889 -7010 15621 6694 -8285 -1524 -7388 -6360 9839 -1363 -14235 -2727
205 -2727 900 944 5769 -5610 -12261 842 4042 -2239 -6766 -12186 -5373 3700 -2593 -4092 -2595
220 -2595 -8699 3463 14831 -3821 -10786 4259 3529 -2234 -189 -7119 -12023 -5543 91 -1505
234a505j0963k269J6609L731j2460L076L913o585Q077P096j4929o510J0701L419
248A401l059m732m371N288N272r61O8m980l051J1294L525r747k144J505J725O406
264C439k918r092L403N718N45J941l871n637O118O775l405n335l011K367O364
279C401k063n397O4l02L565P515n253p909O452N847j204r38m063k387N316K676
295E320l301m363l018M355N866l324n113R65K227L474K413n566l759M622L334
310D132l52k147m806P21O743M43m137j866K81L981L457l120l831Q6K528L993j300
327D806o562k92M979J491q29k098k931K458N123l03m052k470J325M135N64n192
343A52l000J604K052J337k016m385K97L977K175j309m106j152M927K695l321k706
$$ plain form
234 -1505 -12468 -14737 1872 5603 -6857 -3781 132 -6453 1624 8720 -6209 -12719 -2018 1401
248 1401 -1658 -6390 -10761 -5473 -201 -1162 -1094 -6074 -9125 2169 5694 -4053 -6197 -4692 -2967 3439
264 3439 521 -8571 -5168 550 1095 3036 -835 -6472 -354 6421 3016 -2319 -5330 -2963 3401
279 3401 1338 -4059 -3995 -4297 -732 6783 1530 -6379 73 5920 4716 3778 -285 -2672 2644 5320
295 5320 2019 -2344 -5362 -1007 4859 1535 -3578 -2613 -386 3088 5501 -65 -3824 798 4132
310 4132 3780 1633 -3173 -2452 4291 4734 597 -1269 -988 2993 6450 3330 -501 -415 2113 6106 4806
327 4806 -1756 -2048 2931 4422 3593 1495 -1436 1022 6145 5842 1790 -680 645 4780 5344 152
343 152 -2848 -1244 808 2145 129 -4256 -3959 18 2193 884 -3222 -4374 553 3248 -73 -2779
359b779K8R81K436J067l531l477K524N234j97m899j269L427J737k87l17k875j811
376d008M486L284l949m203J323M077J086k715j731J34N23K566J187m909l213M129
392a933L043k418k859q43J021K954Q15k755j687J209K743K097k051l715J286L677
408E84O75j794k326n23K979K490j904k378J61J538K259J001l124l188L396M018
424C864k219l188J76Q67J327J196j610k544j67K714K718k251n030J463N384j705
440I95l458J971p55k240M545K376o137j746N216K618k254k621O75K612q3p20J994
457B988k351l895N611M906p347l746O928J143l801J876O49l608J477M182r79l953
473H0j485L683L055l566l367L007Q77k363K783O75n885Q56O369j731m350J051
$$ plain form
359 -2779 -2751 -1770 666 1733 -1798 -5275 -2751 2483 2286 -2613 -3882 -455 1282 995 678 -2197 -4008
376 -4008 478 3762 -187 -4390 -3067 1010 2096 -619 -2350 -2216 -1693 873 2060 -2849 -6062 -1933
392 -1933 1110 -1308 -4167 -5010 -3989 -1035 -220 -2975 -4662 -3453 -710 1387 -664 -4379 -3093 584
408 584 1259 -535 -2861 -3384 -405 2085 181 -2197 -2036 -498 1761 2762 -362 -3550 -154 3864
424 3864 1645 -1543 -1367 -500 827 2023 413 -2131 -2298 416 3134 883 -4147 -2684 2700 995
440 995 -2463 -492 -1247 -3487 1058 3434 -2703 -4449 767 3385 1131 -1490 -815 1797 1714 994 2988
457 2988 637 -3258 2353 7259 -88 -3834 3094 4237 436 2312 2961 -647 830 5012 4033 80
473 80 -1405 2278 5333 1767 -1600 1407 2284 -79 2704 3379 -2506 -1650 4719 2988 -1362 -311
489c11P14O08J922j979k450J903J098k7J361k411k658M203K708l698j457J183
505G09Q2J679K98l329o6J973m89J250R5m534P65N682j564m481J621J240j226J646
523A351Q3l217j04K040Q60J51l019k039M829J740m959K06L047k942L02M650l023
540d4m647L707L671k253k198j35J822J209j600J30J225l320M01N987k543o574
556e162L918M438l928j070K560j952j311L556Q14l434j552K542K481j539k846
571b485R71J602j058N83J118k860j263L987J267l605r62K051M54k1M50j629r10
588b310K076J058q79r42j053R53K554r37k444P62Q45J06J247j042k366J388K150
605A166p89q24n75m99J855J173j874q09M32N16J557m01k479N00J815k71L9l75
$$ plain form
489 -311 403 1011 2933 954 -1496 407 1505 1478 2839 428 -2230 1973 4681 983 -474 709
505 709 791 2470 2768 -561 -627 1346 857 2107 2202 -2332 -1567 4115 2551 -1930 -309 931 -295 1351
523 1351 1434 -1783 -1887 153 1013 1164 -1855 -3894 935 2675 -2284 -2078 969 -1973 -1671 2979 -44
540 -44 -4691 -984 2687 434 -1764 -1899 -77 1132 -468 -338 887 -2433 -2032 3955 1412 -5162
556 -5162 -1244 3194 -734 -1804 756 -1196 -2507 1049 1863 -1571 -3123 -581 1900 361 -2485
571 -2485 -1514 88 -970 -387 731 -2129 -3392 595 1862 -1743 -2705 -654 -200 -221 229 -1400 -2310
588 -2310 -234 824 -55 -997 -2050 -1097 1457 520 -1924 -1162 -317 -211 1036 -6 -2372 -984 1166
605 1166 377 -447 -1022 -1521 334 1507 -367 -1176 -744 -228 1329 928 -1551 -1051 764 493 532 157
623A57j704P34K533o50k125L8J164O48j9n83p47k66J289J425j452k124J265J662
641A245m41o13m61m14O41J269j87j515r48J661J392j262j045K74J48P43P69j408
659a52j168J104J029r7n21j144J9J626L02j194n55q5R14Q44q67r83O1M79J059
678F71J11j849l00J572L90m79l61q12K71J358Q9j074p38M01J181L92j203n57N07
697d30M51O46l11j415J18J327K05l25p25n43R14J054o49q38j18M03Q05J85j008
716b54o30N05R42K68j024q71P30Q81j18k37o70l66J050Q70q70r78K59O97N73m41
736C16p60j28M63P08K13j087o82J032P11k85m77m50J47R47L46q79o11L05P46M76
756A051o56p88K25O85M80l33q18j30P98N43k90o55m17N59R59k49r43j97N45N28
$$ plain form
623 157 -1547 -813 1720 1070 -1055 -1017 147 795 776 193 -554 -820 469 1894 442 -1682 -417 1245
641 1245 804 191 -270 -684 -43 1226 1039 -476 -1424 237 1629 367 -678 -404 -256 487 1256 -152
659 -152 -1320 -216 813 716 195 -949 -930 696 998 -196 -751 -836 78 922 55 -928 -867 -388 671
678 671 782 -1067 -1367 205 595 116 -245 -1057 -786 572 661 -413 -1151 -750 431 823 -380 -937 -430
697 -430 21 667 356 -1059 -941 386 591 266 -459 -1002 -88 966 317 -521 -639 -236 569 754 -254
716 -254 -884 -379 563 831 -193 -1064 -334 547 429 192 -478 -844 206 1076 206 -772 -513 184 757 316
736 316 -444 -572 -109 599 812 -275 -957 75 786 501 24 -426 -279 668 1014 135 -476 -171 575 1051
756 1051 395 -393 -168 517 997 664 -154 -284 514 1057 767 112 -305 254 1213 964 21 -176 369 897
776H97J24n37o62L07P49L26o51p31K42Q01K00m53n90p4N59O42l85q10j37O84M44
797I45j86o27l76M95O11m0o73m06L56O09K1n03n16J01P00L14o37o40K30O36J35
818E49l32n06j66M87N95k85p53k75O59N77l34o39j73L96L64P9m27n81J38Q20J60
839C53p42m18K99N49J26m76k94k7L35M82p6p99k32P96M53n04n03J26J75K99J82
860A04l73o21L28P77n2p11l28M07M57nl55l21P3K57N31k73q59O4Q27O7l73k35
882f14j65K60N98k65n92Q2J15L62L36o23n47O55N21k81j63l22m1P08J50n78p7
903d81J09P0O29j21j016K89P54q7k62m6l27K37O05j71m40k06J89N97J71p86l51
924f44O73K89k67J24k15l89N11P01o43o73M56M88Jk08k47q1M22J67o4j38n55J80
$$ plain form
776 897 1021 484 -178 129 878 1204 553 -178 64 865 1065 612 22 -52 507 1149 764 -46 -183 501 945
797 945 759 132 -244 251 862 822 149 -257 99 708 729 226 -290 -189 511 825 188 -452 -222 414 549
818 549 217 -289 -455 32 627 342 -411 -686 -27 550 216 -423 -596 -200 164 243 -184 -765 -627 193 353
839 353 -389 -807 -508 41 167 -309 -603 -630 -295 187 111 -688 -920 -124 329 -175 -678 -552 -377 -78 104
860 104 -269 -890 -562 215 163 -548 -876 -469 -12 -17 -372 -693 -620 -363 168 -105 -964 -900 -73 -6 -379 -614
882 -614 -779 -519 79 -186 -778 -696 -581 -219 117 -506 -1053 -398 123 -158 -321 -643 -684 24 174 -404 -481
903 -481 -372 -302 327 206 -810 -521 233 146 -116 -162 -489 -252 353 182 -258 -464 -275 322 493 -293 -644
924 -644 29 318 51 175 -40 -429 82 783 140 -533 -77 411 412 204 -43 -124 298 465 401 263 -292 -112
946a12J036k75j073N23M54l97L26O3q25J64Q25j71l19j73k08N85L77p84j30L68
966B54j81K60L89q51l05Q81N9l62q1k39R9O07j32n05QR9K05L08l64m72K49N35
988D61q2k47j59j14L64L27l26l96J12K18J33J04m38l73N29M82m90k11O7m5K73
1009A89K83n44k56L48J53J28j40n60R3P28k60l47K06k73%P48k92o95K95K77K3
1030A04R7l78k34M47J13p9n7l30o8O47j0n45p5L08J02O9j56l08L3L28J99j65m36
1053c94P2L63J57j94k55%J40K62r7j63k26J56M94j43l59l0J11K52J54k95k77J57
1075a15L04kr2k24o5L64J90l20j54L7J01L17j27m38R0L11Q7L8l32j81K85L04j32
1098B46j68k21M3L84L8k91r1N6J59K05j84l71P4L38J28k41k27p9K49J84j80j00
$$ plain form
946 -112 924 649 -424 99 553 156 482 545 -280 -116 709 538 219 46 -162 423 800 16 -114 254
966 254 73 333 722 -129 -434 447 506 144 63 -176 -77 530 398 -107 -99 0 205 513 149 -323 -74 461
988 461 379 132 -27 -141 223 550 224 -172 -60 158 291 395 -43 -416 113 595 105 -106 -39 -84 189
1009 189 472 -72 -328 20 173 301 161 -399 -306 422 162 -185 21 -252 -252 496 204 -491 -196 81 104
1030 104 201 -177 -411 36 149 70 13 -317 -385 262 252 -293 -368 -60 42 111 -45 -353 -320 8 207 42 -394
1053 -394 -322 41 198 4 -251 -251 -111 151 54 -109 -335 -179 315 172 -187 -217 -106 146 300 5 -272 -115
1075 -115 189 187 95 -129 -194 170 360 40 -114 -77 24 341 214 -224 -134 177 264 302 -30 -211 74 378 246
1098 246 78 -143 -100 284 322 31 -60 -4 155 360 176 -195 -121 217 345 104 -123 -202 47 231 51 -49
1120d9j51J65K74n2k58j47J82J45P9k11k27J33J88N4j46k46L9K94J06k05j42n0
1142b25K63J80j65k67J8J35K23Pl33j12K24J40Rj90k27K66K10q0j48r6p4K70J07
1165A35k78j00J9J42J34o6k86oK75N3n2j97j10K13K20p4k11j27O1K57M7k65j14
1188c30J56J00J22j32k63J12K05J24j71j68o0K92N9j43j86j8J61J95q0k15p5J60
1210a55J76K7k51j11J98J64l8q2j35OK96j6j70j03L8K09R2j27j64J08P4J05K5
1233A66k21m7J87J43r7r5j06J10K24k9k37j0K6K23L9k20j57J77Q6O6m7k85N9K40
1257A95M4j03j87n0J81K12j66j08n6J21J54o0k02m9K02Q1J0j40q5Q0J39N1j41
1280A23j41L2J72J00j60j57P5J01J10m8k36j4J87K3J9j79q4J34K02j37n3j03N4
$$ plain form
1120 -49 -200 -35 239 187 -71 -218 -36 109 188 -23 -250 -117 71 125 -21 -267 -228 66 172 -33 -175 -225
1142 -225 38 218 53 -214 -196 -61 162 169 -164 -276 -52 88 97 -93 -320 -54 156 76 -72 -168 -242 28 135
1165 135 -143 -243 -224 -82 52 -14 -300 -306 -31 22 -30 -227 -337 -124 96 22 -189 -316 -255 2 49 -216 -330
1188 -330 -174 -74 48 -84 -347 -235 -30 94 -77 -245 -305 -13 46 -97 -283 -301 -140 55 -25 -240 -315 -155
1210 -155 21 48 -203 -314 -116 48 10 -72 -207 -201 95 79 -91 -194 -156 53 145 18 -146 -38 36 141 166
1233 166 -55 -102 85 228 131 36 -70 40 264 235 -2 -12 14 237 276 56 -101 76 162 228 181 -104 -45 195
1257 195 239 136 -51 -101 80 292 126 18 -38 83 237 177 -25 -74 128 209 219 79 -6 74 213 264 123
1280 123 -18 14 186 286 126 -31 44 145 255 207 -29 -43 144 167 186 7 -77 57 259 122 69 -34 20
1303B0J32k1r2j22J08J07O9j84r8Q3Q6R4o2j21qR7P3l2j28m0N8J69n4k44N1K7
1329c2J70q4j04p1J05P1K0q4j58Q0J65j41L6j12j4R6J35r4k00J14M9J07l1j76
1353a53j3R7O7l6k5n2k1K28o5j72m6J22M0Q2j02j73N5J88L7r2n3o7R1J33j06j45
1379a81P1J39j0J1j62k1J30J13k7q5r8L1J71Jq5m8L9P3k2qj19K6J46J2p0j07J4
1406f6O4Q4m5j33lJ91j9o0qj33J11J41r6j55k9J39O1L4p9j46Q9J13K4n0j17k7
1432a15K05N6j97k0R2pJ2N0j69K5J32j3Op7j40J69R0j11pj3j0L0J04j59r5J33
1458b9k1J25n2j45N4J55K7j32l7KJ02K4Mj68k8R0J21q7J7q6mJ09K2j49QJ04m4
1485a8Q9p6j14N5Q5j7n0nk7N5N2q4j10O6J00l4L6j19KJ01Kl7K2p8PJ46l0r9O3
$$ plain form
1303 20 152 131 39 -83 25 132 201 17 -81 2 88 182 120 -1 -9 88 161 129 1 -39 19 188 134 -110 -59 -32
1329 -32 138 54 -50 -121 -16 55 75 -9 -167 -87 78 -63 -27 -139 -153 -57 78 -16 -216 -102 -53 54 23 -153
1353 -153 -166 -69 -2 -38 -63 -115 -136 92 27 -145 -191 -69 -29 53 -49 -222 -167 21 58 -34 -87 -154 -63 70 -36 -181
1379 -181 -110 29 19 30 -132 -153 -23 90 63 -22 -120 -89 82 83 -2 -50 -11 62 40 32 -87 -61 85 97 27 -80 -66
1406 -66 -2 82 37 -96 -99 92 73 13 5 -128 -17 124 28 -127 -156 -17 44 78 -1 -147 -58 55 79 29 -88 -115
1432 -115 90 146 -51 -71 21 14 26 76 -93 -68 64 51 57 -20 -160 9 99 -12 -19 -32 -42 -12 92 -67 -162 -29
1458 -29 -50 75 23 -122 -68 87 114 -18 -55 -53 49 73 77 -91 -119 -29 92 5 22 -64 -68 41 63 -86 -78 26 -18
1485 -18 71 -5 -119 -64 21 4 -46 -51 -78 -23 29 -55 -165 -99 1 -33 3 -116 -114 -13 -11 -48 -26 -104 -97 49 19 -80 -17
1514a7k4O2N8j32m1LJ35j3k7l0k7P2L3lo5o3P9N1J6j22J1L2O3K4p3o1O9P1j8m6
1544A7p1P6Q5j7m6r3L0P9K7n0k9nrJ14n2o9N4K7L6J7j09l5M9P5m5j4m2l7J50L5
1574A48j75QL6J07j4j01poQ7kk9j9n8R5J9J5r5k7M6N8nk9r5Q4L4L5q5o1R2M1K8
1605A25r9p4J3P4K4l6l5mJ03k0p7J2m9K2R4l0l1k1P5np8k3rO1K1J3o7k1L1K5j6
1636bOr9L6N7K0rp9j3N9N9p8q6J3L7O8l8j5o2N8R2p3m1J2m6J21j4p0n9L2J01l8
1667e1L4j5p0P1M4n1o3K6J21n4n0k6JL2M1pl2o4Q8K4%n5nQ2k0K0k4p1l7J12M9
1698E0p5n1K5O5M8q7p2J05m9K4J4l8L6j1N8n5K7m9M6L2%o8j6L9k9L9Lp4MP7J3
1729C1%J5r2N1M7n3m4j7LN5m2L2pN7pK0m8j6J4M2K7l9l3qO5N6o7Qn7K2O1Kn3J2
$$ plain form
1514 -17 -41 21 79 -53 -94 -91 44 31 4 -26 -53 19 52 49 -16 -79 0 51 67 -55 -44 -12 51 75 2 -59 10 81 63 17
1544 17 -54 22 107 90 44 -49 -19 60 87 37 8 3 -6 108 56 -13 41 68 104 121 12 -23 26 101 56 42 0 -37 113 148
1574 148 -27 -19 17 124 110 9 2 -4 83 81 52 33 -25 70 89 104 9 -18 28 86 81 52 -43 41 75 110 25 -36 56 97 125
1605 125 26 -48 -35 39 63 27 -8 -12 91 71 -6 6 -43 -21 73 43 12 -9 66 61 -17 -40 -49 12 33 46 -21 -42 -11 14 -2
1636 -2 4 -95 -59 -2 18 9 -70 -83 -24 35 -43 -129 -116 -79 -11 -49 -64 -126 -68 24 -49 -90 -78 -124 -3 -17 -87 -146 -114 -13 -51
1667 -51 -17 -32 -102 -31 13 -38 -101 -75 46 -8 -58 -84 -83 -51 -10 -17 -49 -113 -25 -1 -1 -56 -61 21 1 21 -3 -74 -111 1 50
1698 50 -25 -76 -51 14 62 -25 -97 8 -41 -17 -3 -41 -5 -16 42 -13 14 -35 11 43 43 -25 -41 -2 -31 8 11 -63 -59 18 31
1729 31 31 46 -46 5 52 -1 -45 -62 -59 -4 -46 -14 -21 36 29 49 1 -15 -1 41 68 29 -4 -12 53 109 42 50 -7 15 76 78 25 37
1763C7J2K8n4n8L1j6Q5k0%r0L7P2m1o5O8rrL9l4m8J7J05k3j02O8l8QL5Ql1k3L3
1795B2%K0j07J7K6L1J1l8qL9L1k3mq4k7J10j6on7R3J3k0j5p8RP3j7pjm1N4M1j6
1828B5m0n3N7L5J7j2p7NM0K7n5lK7K9l5orj7R4j4j6l9k8J05j2j2n3K2J2k4J3l2
1860b9J1K8J7L7r3K5JK2J2k4j9L5L4l0j8m9K9L0K0Pm5m0P6K1m5k1nPM8j0j0j1
1892A1l1N0k3Lo1Q2K4k0mj2m2R8p3j2L3j9O3Nm7%L0n0O9j8n5o1Q8MMm4rN3K4l9
1926B1j4m4QO0jl6rLNk3M0j6rN0k9j0q0M9N9k5J3q7j6P2J5ok8j8J7M2M7l0p6O4
1960HM7j00NK5k1LK9J0k6l7K1J2N3j12M0k9R0j6k3j2L4lj8kl2K9O3m8m1L5k0N
1992c1P2Lp0k6K1N6k9J4k8K8j2J9l2kJ5MM1q1j4R9pn3l7M8Qk1O5r9K7K0%l9M0
$$ plain form
1763 37 49 77 23 -35 -4 -20 65 45 45 -45 -8 64 23 -42 26 17 8 47 13 -35 -18 87 64 -38 30 -8 0 35 43 12 -11 22
1795 22 22 42 -65 -48 -22 9 20 -18 -26 13 44 21 17 -67 -94 16 0 -6 -63 30 43 23 8 -70 -61 12 -5 -12 -13 -54 0 41 25
1828 25 -15 -68 -11 24 41 29 -48 -43 -3 24 -31 -34 -7 22 -13 -19 -28 -45 49 35 19 -20 -48 57 45 33 -20 2 14 -10 3 -29
1860 -29 -18 10 27 64 -29 -4 -3 19 31 7 -12 23 57 27 9 -40 -11 19 39 46 1 -39 37 58 13 -8 -13 -6 42 32 22 11
1892 11 -20 30 7 10 -51 31 55 35 31 19 -23 75 2 -10 23 4 67 72 25 25 55 5 74 56 1 -60 28 32 36 -8 -17 36 60 21
1926 21 7 -37 -29 31 30 -6 -15 -12 -7 -30 10 -6 -15 35 6 -4 -84 -35 24 -1 12 -75 -91 -19 -4 -10 -38 -56 -39 3 50 20 -56 8
1960 8 55 -45 -40 -15 -36 -33 -4 6 -20 -57 -36 -24 29 -83 -43 -72 18 2 -21 -33 1 -2 -20 -22 -54 -25 38 -10 -51 -16 -36 -31
1992 -31 41 44 -26 -52 -31 25 -4 10 -18 10 -2 17 -15 -17 -2 2 43 -38 -52 47 40 -13 -50 -2 6 -15 50 -49 -22 -2 -2 -41 -1
2025aokoP5n6kQkJ1j9l4L5L0J8n6Jj4J6O3n2j3KM6k1J8k9j8kj0P6j3j8n5R4m5
2060A9J0l0P3m5L5m4kMoPK0rl5j4K8N2o3J4M2n8PlK6n4N6rK0l0k4PKj8LK0k6L1
2096Fk7LJ3m8P6om8m8O1L2lnl6L7k6jk0K1Qj7K5L4n6ML2J9o4J4j4JNP4p4J4k7
2131d1R8rk0j3m6Q7m2ll1M8k5l4J6J0L2Om0m8P8n3P4o2Rj9LP5j2n0PJJ8qKm2j6
2166e0L2j8M2j6k1j8J09l1o7J9K0j7L9m7NK0jl6M0K0Ln3K8j7JK5l9P8l2j7j8R
2198hOM9n7JJ9k5N7j7p4L7rM9k0p3N2nJ8M4p5K0J4j5J4J9KLN8o0K0m6l9L9Ll8
2232c7L0K3j9M3m9k1L4Kj7J1k0m4J10o4J7L2m1j1J3J4n0L3l9Q3j0m2L5l1j6J0
2262b1qrQK6J6j9N6l2J2J0p8L3L9l0m0K5mlKJ9L3k8k9M0k0pl1L7N0p3k8L1J6j0
$$ plain form
2025 -1 -7 -9 -15 60 4 2 10 8 19 0 -34 1 31 49 -7 -6 -20 -4 59 7 -6 -4 42 21 39 10 -8 -10 -20 56 43 25 -30 64 19
2060 19 29 -1 72 27 62 18 16 20 14 21 41 32 -3 -17 11 63 0 14 56 -2 5 2 28 -26 30 21 41 11 -13 -6 -4 -22 -19 1 -25 6
2096 6 -21 -18 -5 -53 23 17 -31 -79 -18 14 11 6 -30 7 -19 -20 -40 -19 -11 -28 -3 31 -25 -21 11 30 -34 -20 -34 -33 -28 46 -28 -14 -41
2131 -41 57 48 28 15 -31 56 14 11 -20 28 3 -31 -15 -5 27 33 -7 -55 23 -30 44 -18 -9 -28 -25 50 38 -12 -5 -4 14 6 8 -34 -50
2166 -50 -18 -36 6 -10 -31 -49 60 29 -38 -19 1 -16 23 -24 -19 1 0 -36 4 24 27 -26 2 -15 -14 11 -28 50 18 1 -17 -8
2198 -8 -2 47 -10 -9 10 -15 42 25 -49 -12 -21 28 8 -65 -13 -18 0 44 -31 -11 3 -12 2 21 23 26 84 24 44 -2 -41 -2 1 -37
2232 -37 -7 16 -3 40 -9 -30 4 6 -11 0 -20 -64 46 -18 -1 31 -10 -21 -8 6 -44 -11 -50 33 23 -19 16 -15 -31 -21
2262 -21 -29 -38 -30 -4 12 -7 49 17 29 39 -39 -6 33 3 -37 -12 -16 -19 -17 2 35 7 -22 18 -2 -9 -40 -3 47 -26 -54 -23 -7 -17
2296a7J3J5m2J1L9k1N6m3m1PK1Qlpj2M8p6N5k9j1P6k5k0J8l4L5k4j0N1k1j3j7
2328a3MQn4j2P4j1ookJ5jP8o5rK7k3JM8l1o5k7M1K0N5m3K6k0K8n2k3LQ0l9O0l8
2363B8m1jQ6o1J5j7K2jm8M0k5L9J4l1n0M1J4oK8L0m2pL1o0KOk3L8k4J5j9O2k8
2396B7mj4Nk4L4j7k7m1Q1K9j3k6j8j1K9j7N4j1o2L5L3k9j0q0O8rL1M3n2l3O0J2
2428D3j3m2J7kK4l3Qrk5M0k0K8j3J1L1l2m0N3pm7L0K5m0K5K3m2j3mO8p9J1K1j3
2461a6L6J2k6J4n7L1K3n1J3L6K1Ro7L6J3k6n0L9nM4l7J6o3K4RMJpL4j5l0M4J1
2494B0l9Rk3k7R8j5qln2K9pK0Jj7K7L2pj3kOm4MJ1j0J1j4J8Ml3K0j5jJ1l9J0M7
2530Il5Kk8N2k7K5M9m8l1J03n7Jj1kL2pn5N9J0pm4O1q2K7M7q5P1%o0nR8o7Jj8
$$ plain form
2296 -17 -4 11 -31 -20 19 -2 54 11 -30 -23 -2 6 3 -4 -16 32 -44 11 -18 -29 47 22 2 20 -14 21 -3 -13 38 17 4 -13
2328 -13 -9 -1 -55 -67 7 -4 -10 -16 -18 -3 -4 74 9 0 27 4 5 53 22 -43 -70 -29 -9 46 3 29 9 37 -15 -38 -35 45 6 66 28
2363 28 -13 -14 72 11 26 9 31 30 -18 22 -3 36 50 19 -31 10 24 18 46 76 34 27 58 -2 0 6 -17 21 -3 12 -7 55 27
2396 27 23 9 14 -10 24 7 -20 -61 20 49 36 10 -8 -19 10 -7 47 36 -26 9 42 13 3 -77 -9 -18 13 56 4 -29 31 43
2428 43 30 -12 5 3 27 -6 2 -7 -32 8 -12 16 3 14 45 13 -27 26 19 -28 2 27 -13 12 35 -7 -20 -24 44 -35 -24 -3 -16
2461 -16 20 32 6 20 -37 -6 17 -34 -21 15 36 45 -22 14 27 1 -49 -10 -15 29 -8 8 -55 -31 -22 -18 -17 -24 10 -5 -35 9 20
2494 20 -19 -10 -33 -60 38 23 15 12 -40 -11 -18 2 3 -14 13 45 38 25 23 29 -15 -11 0 -10 1 -13 5 9 -24 -4 -19 -20 -9 -48 -38 9
2530 9 -26 -24 -52 0 -27 -2 47 -1 -32 71 14 15 4 2 34 27 -28 31 41 34 -10 51 -31 -4 43 -42 29 29 -31 -36 62 -5 -4 -22
2564b2k7R7p6L5J1M4n0l8J4n2O8mm7N0l6O8Mo8J2Kj7j4O9j2%o9O3K5ok1M3ol7
2597CJ9m0J2J1n2J07n1j5K4m1m6K3N4j3J1k2mL6nk1Ok5nO3N6r6j8N8l1j0K2K7
2629C7j07L1R5j09P3PJ8n0M0m2Pn7M3M3jj4k6K4QKoj7M0m0JK4k9j8pM2j7K9m4
2662b0J3j0kJ6N4p5P5mm1l2J2m0M2K5rJ2J6r6L0O3Qq6J5J4Ll1M4mL3m4pJ6NNj0
2697a0J4K8K2l3L8j15J13j00M1Pl0M6j0j1J0K2j4K7m4KQm3M5l8J0kK7k5K6l6L8
2728A3J5n5K3K8l4JL1j1J1j8M9p4N5k1J2Rn1o2R2ll7K4j2L7n1K6R2n4o0K1j7J
2760b0J3L0j5j7rK3J0l4L8m8J7NJJ9Jk2k0J0Q1r6N4j9Jj9l7M8KK2K2n3Jj8oJJ7
2795a7N1p3N3j6pK5l4j1J3K6J8q9P7m7Q6p3K5k3N3n4M6j9K4ok5nL5Rq0M0J3Ql0
$$ plain form
2564 -22 -49 48 -28 7 18 62 12 -26 -12 -64 4 0 -47 3 -33 35 39 -29 -17 -15 -32 -46 23 11 11 -58 5 30 24 3 46 40 3
2597 3 22 -18 -6 5 -47 60 9 -6 18 -23 -69 -46 8 -5 6 -16 -20 16 11 -10 -4 -29 -34 29 85 -11 -29 29 -2 -12 10 37
2629 37 -70 -39 56 -53 20 27 45 -5 35 -7 0 -57 -14 29 28 14 -12 12 20 22 16 -1 39 -1 0 24 -5 -23 -30 12 -5 24 -20
2662 -20 -7 -17 -19 -3 51 -24 51 47 6 -26 -14 -54 -12 13 4 16 32 -64 -34 29 37 -49 -34 -20 -17 -48 -4 -8 25 -19 -26 -10 -5 0 -10
2697 -10 4 32 54 21 59 -56 57 -43 -2 5 -25 21 11 0 10 32 18 45 1 3 11 -32 13 -25 -15 -17 10 -15 11 -25 13
2728 13 28 -27 -4 24 -10 -9 22 11 22 4 53 -21 34 13 25 34 -17 -79 13 10 -27 -3 -15 22 -29 -3 89 35 -25 -4 -21 -20
2760 -20 -7 23 8 -9 -18 5 15 -19 19 -29 -12 -7 -6 13 14 -8 -28 -18 63 -33 21 2 3 -16 -53 -5 -3 19 41 -12 -11 -29 -35 -34 -17
2795 -17 34 -39 14 -2 -9 16 -18 -29 -16 10 28 -61 16 -31 55 -18 7 -16 37 -17 29 10 34 28 3 -2 33 42 -38 2 15 23 -7
2828glK5k2K3j2oM6l9J5kkj5J7K8m1j4N9p1N5j0n9M7j2Mk6L0k1j6L9j4QL9j6m6
2862a9L0KL2Lm5Pm2M8n7J2%J4l2M0N2r4O5L7q8M8qj3L4l1J3Pj3K2o2M2okN3m9
2896@J6k4K1k1nJ6J5n3J7L1J5m6PO4n8J6km5M1l2P5n2k8oO0m2j5j0J1NM7q1N4
2929iKJk2M8Rm9M7J8o4J2JJ2O2n8Mp3K8N5q2M8M8q6N7JL4j9J2p1M3k3OK2KNk1
2964@J2kl3K0j6RM0o1ln1O4N6o6O3q3O4k5j3N3j7K0o5O0No4L7K3n2K5Pl1K2J6
2997A4m9J3rJ1j1j9M6M5j01M7M2jj9m4N7J0m6J3k9PN7k1k0k3M9l7M7k7m2J3K1
3028fm4Q3l6lO3m6k8N1l4K6m4L0M1o5J1J5m3J0Pj8O4k1k0kRJ0Om1M4m0N3l9mQ
3062cK3m2k2O7o5L0O2n8L8m3M4k7M1j10M5PL0l7nK3j0J2kj5L0p7L6L2j3M0K0j13
$$ plain form
2828 -7 -10 15 -7 16 4 -2 44 5 20 18 16 1 18 46 5 -9 50 -21 34 24 -35 12 0 4 -22 8 -13 -29 10 -4 4 43 27 -19
2862 -19 11 13 45 48 3 10 -32 16 -41 -29 -29 -15 -47 -7 45 -49 16 53 -35 13 5 -8 26 -5 8 15 2 24 -38 4 -2 -4 49 0
2896 0 16 -8 13 -8 -13 3 18 -35 -18 13 28 -18 -11 53 -5 11 9 -36 5 -27 48 -4 -32 -38 22 -20 -35 -45 -34 -29 18 -63 -9
2929 -9 -7 -6 -28 20 29 -20 27 45 -19 -7 -6 6 68 10 14 -59 -31 24 -58 -10 38 -48 9 10 44 25 37 -34 9 -14 -8 14 16 21 0
2964 0 12 10 -23 -3 -19 -10 30 -31 -34 -85 -21 35 -31 32 -51 13 -12 -25 28 11 31 -34 26 31 -33 4 27 -25 0 7 -24 -2 14
2997 14 -35 -22 -31 -20 -31 -50 -4 41 -60 -13 29 28 9 -35 22 32 -14 -1 -30 -23 34 13 -7 -30 19 -18 29 2 -40 -27 -6
3028 -6 -50 33 -3 -6 57 11 -17 34 0 26 -18 12 53 -12 -1 14 -29 -19 -12 -30 34 13 -7 -9 0 10 16 -25 19 -21 32 -7 -11 -3
3062 -3 20 -22 -44 23 -42 -12 50 -8 30 -13 31 4 45 -65 -20 -13 17 -20 -25 -2 -12 0 -2 -17 13 -64 -28 4 -9 31 51 -62
3094f2N4oO3j0n0K0L6o4K3kLJ3J0J9J7j05K8J5K0l5K7n6K7J3J8MQn0J8j8J7K4
3126A9p0mO4k3K9m2K6J6l2J2k1J4O1Kq9P5k6k8K6Mj0kk1M2M4o9Q3j01jM2Nm2M6
3159B9m1j0l5N8o1L4KJ1M9n2jM8ko8L3j7PrK8K0k0mJ8j6M7k9j7KKL0m6k1R4j07
3193d4P2k5O3p4K1o8K0L5m5L4OoJ3k1K5Rm0m1L8j8L5k0N2l5j4J8LK9m6J3L0J9
3225C8n0KL0L4q5K4J0l8L9J5K6n1kPl8J2Rk6J6N8q6N4rL8l2J8L6j04J06l9mJ0
3257A8OM2k3l0QJo2N4j1n4L3oQPl0O8n3lk1L8jRnj0Nm2K4O2l0n7N3m4M3J5Mj5
3293Am2PM9l7j8N2k6jK9j2m1L6P2o4qOqMJj4n4N4Qnlm4K3N2Kl0o4M0K9k4J8K0
3329Hm4M4qJJJ8J7o6N3j9rj5K6J4q0O4Km9N1M4q2O0k4j8N7l8rnM4o0P6k6l3jL2
$$ plain form
3094 -62 -8 -14 49 39 -11 9 45 -19 4 2 5 18 28 47 64 -41 -13 2 22 -13 14 -42 -15 -2 16 20 28 -22 -4 -22 -5 19
3126 19 -51 -55 9 -14 15 -27 -1 15 -17 -5 -26 -12 49 51 -38 37 11 -17 9 13 3 1 -20 22 66 -3 80 -21 -22 20 25 -17 29
3159 29 -12 -22 -57 1 -60 -26 -24 -13 36 -16 -17 31 29 -39 -6 -23 -16 -25 3 23 3 -1 17 1 48 19 2 4 6 36 -10 -31 63 -44
3193 -44 28 3 66 -8 13 -55 -35 0 -45 -11 -5 -11 2 -19 6 15 -25 -66 -28 -46 -11 -31 21 -14 -28 -10 -7 22 -24 -11 19 38
3225 38 -12 -10 20 54 -31 -7 3 -35 4 19 45 -6 -8 -1 -39 -27 -18 -44 -28 30 -56 -2 -11 27 -5 13 49 -55 51 12 8 18
3257 18 24 66 43 13 21 22 -40 14 3 -51 -18 -24 -16 -9 -39 29 -24 -27 -48 -10 -11 -2 -7 -17 -12 -54 -30 32 2 -55 -2 -46 -3 12 16 1
3293 1 -41 -34 15 -22 -40 12 -14 -15 14 2 -39 -3 69 5 -3 3 -5 -1 0 -14 -68 -14 -6 -11 -14 -58 -35 17 19 -11 -75 -35 -6 -30 -12 8
3329 8 -36 8 0 1 2 20 37 -29 24 5 -4 -19 7 21 -59 5 7 -42 9 53 -29 31 7 -11 46 8 -1 -6 38 -22 54 28 -5 -6 26
3364B6rm1L9k0QnMj8j4N4m2N0l6L6jo7M4KJ5J0m0l6L9o0O1J7k9K6j3k5N8k1rk1
3398a8m2N5Pn6P3r1M3QRLL8j8jJ4j9pLK0j6j1J0Om0K4JQk7OJ5j0L1j2llJ5l3K6
3435Hk7N1k5j6l3K1O7j08J09m3J1l8qK3n1Q6l5J9Pk8L1l3j4N7lj7L7k2n9K7m4
3466e0P0QqPMq4K8M4l6Q6r2M2k5J4k6J6k5J1M0k8K2k2m4O2M5q3J4nPK4l9Q7o7
3499cOK8oj7Pj3M1o2Q9m9k8L1qn0P1k2J1o2L6j3O6j17J14o7j4M0k4k4K8L9k2k3
3531a7L8m8L6J6mJ5l7Rj1j3m3M1L3K8j5n7O1Ro7RJ4L8k8k5Kj6J3km2O1j2J9om0
3565d1L9K7k4L4n1N9m0jRk2LJ2M6q4O1J7m6l3M4KmkJ4J9r1N3l0M3nk0lmJ1j8J5
3600a1Qmn7N5pL3J8l4k7M6J2n1M8J4q9O6J7Nk4K5k8rNpK1o6NP8k8l4L4j4K8o1
$$ plain form
3364 26 17 -24 15 -5 3 -2 2 -16 -30 24 -18 32 -4 32 31 -36 8 10 25 35 -5 -41 -2 -62 -1 16 -13 13 0 -25 33 12 3 -18
3398 -18 -60 -5 2 -54 19 -72 -29 -21 -12 -9 29 11 10 24 5 -2 1 21 5 -6 4 10 -30 -6 -5 3 -24 -18 -3 -13 18 6 3 0 15 -18 8
3435 8 -19 32 7 -9 -42 -21 46 -62 47 4 15 -23 -31 -8 -59 27 -8 11 18 -10 21 -12 -26 31 28 11 48 26 -33 -6 -50
3466 -50 20 28 20 27 31 -53 -25 19 -17 69 -23 19 -6 8 -18 -2 -27 -16 24 -4 18 -4 -48 14 59 -24 -10 -15 -8 16 -23 64 -3
3499 -3 3 31 25 8 15 2 43 -19 70 21 -7 24 16 -34 37 15 26 -36 0 -13 53 -64 50 -17 -31 9 -15 -39 -11 28 6 -17
3531 -17 21 -27 9 25 21 36 -1 8 -3 -16 -59 -18 15 43 28 -29 32 41 -26 -17 -3 35 7 -18 -16 -32 -19 -21 -63 -2 -14 5 -1 -41
3565 -41 -2 25 1 35 -16 43 3 2 11 -11 -8 4 50 -34 27 44 -2 -35 9 11 7 5 19 38 -53 0 -30 13 8 -12 -15 -19 -8 -26 -11
3600 -11 -3 -7 -64 -9 -16 17 35 1 -26 20 32 -19 29 43 -46 20 37 42 18 43 15 6 11 4 25 -41 -36 42 14 -20 14 0 28 -33
3634c3M0m0k3L8M4n5M9j8J2k6rJ6O2l3K7p6P6k9m1M7l8J6j7M8l7L6l0N5r5L3j
3665bJ5j9L4k9j2J3j8J5j0rm5P4k7K2K7n2M4p5N3j5K1ml0L4J4Po2N9JL9p8nJN0
3699C1q1N7n2J9RM1Rj6l9J7l6M8l0j0L2m6Q0m8j3l6J02q4J7jK1k0M7k2KMm0M0
3731Bk2L6MJ3pk3j6OL0j4m1J2m8N2J1k1O8n1L3qll8R%j2K9j0L1m9M6k3J1l4J8
3765iL9o2K2M9k0j7J1k5J0K4Kl5M9k8PK4m8j7O2p4M9O1n2l6MK6l9k2KP6q9P7m3
3798b2K8rn0LO2rll6O5j3Nm5M7K1k5l0L7p0j7Q4m6Q0k1k9k4N9l5L3r8M2M8o8K2
3831a4J2j9m6Q6J5j0j9L1j0q0j2M3K2J0k8J3L4j2m7M6n7L8l4M7k2oM7p0P1q1M0
3862a2L8l0J5n7N4n5J4P2m5k9M7J5o3P1nn9M1J7l1%LN6j0j21P0N2k3J5J0o4M0
$$ plain form
3634 -33 7 -33 -56 -18 26 -29 20 2 14 -12 -21 -5 57 24 51 -25 51 22 -19 28 -10 6 -11 37 0 36 6 61 -34 -1 -2
3665 -2 13 -6 28 -1 -13 0 -18 -3 -13 -22 -67 7 -20 2 29 -23 21 -54 -1 -16 5 1 -29 5 19 26 -36 23 24 63 -15 -20 -19 31
3699 31 -50 7 -45 -26 -17 24 33 17 -22 -5 -41 7 -23 -33 -1 -47 33 -15 -28 -64 38 -46 -29 -30 -9 -29 18 -4 -2 2 -38 2
3731 2 -20 16 20 33 26 3 -13 -7 23 9 -32 -20 -68 -16 -5 -26 42 -9 24 16 13 -25 -16 -16 -28 1 -9 22 -27 19 -4 7 -27 -9
3765 -9 30 -32 -10 39 19 2 13 -12 -2 22 24 -11 38 10 17 41 -7 -24 38 -36 13 74 22 -14 -10 16 -23 -45 -43 33 -56 21 -22
3798 -22 6 -3 -53 -50 12 3 0 -36 29 16 21 -24 23 44 19 -11 26 -44 -61 23 -23 57 36 7 -17 42 7 40 -58 -16 32 -36 -14
3831 -14 -2 -21 -67 19 34 24 5 36 26 -54 -66 -23 -1 9 -19 -6 28 16 -31 15 -42 -4 -38 9 -13 -19 28 -42 29 -52 -12
3862 -12 26 -4 11 -46 8 -47 -33 39 -6 -35 12 27 -36 35 30 -29 12 29 -2 -2 1 57 47 -74 -4 48 25 40 50 -14 26
3893B6k2JJ8k6J1k2L2J7l2L0m8j7J12j22J04j1k3J7m9K5l2k3M0mK2rqJ6j2m9K4
3924a4K7M0m5J0%J3q4L8M8o2P4j%l9K5k8K5l3L6Kp9L8J0J1j5l5K5L0j3j6N9l2
3956A5k4K6p6Q8l7j4M4L1o1mN7o3N7l0J0l3J1O2j0o0K6jm2L3J8l7J7M0j1J1o3
3987b0J8K6%k6K7Qk3J7m6MJ3M4l1K7l3r8P0k1N9p1P7l5lj9K9%MK1K8k9k2l2L7
4020@k0K1oJ8m1L4j6L6K6p5L1l3QL3l1j5N5n7L3Pj9j2K5rK2Pm0O3q0J5L8qo2N0
4054bO8n3J3l0J9J8n9QJ5J1l9JJ2%L6j4K9p2M5K2n1O4o4O4m3j8rL8K2n3M5N2p1
4087DJ9r4M9N9p7O8j1K1l3n4O7n9L4j9O6o2NK5LJ3q6O7j3j0LNn0P8l0MK8k3Qj6
4121a1k2O6j2j9j9J7PJ7k2l4K8j9O2pl2j4l5O2k9K8jLqj0P5l8j9qk4Qj3L6nk0
$$ plain form
3893 26 4 5 23 -3 8 -14 18 35 3 33 -15 -32 80 -42 62 51 28 45 -4 21 -11 -34 6 2 24 15 7 23 11 -38 -14
3924 -14 13 53 8 18 18 31 -53 -15 33 -29 45 44 44 5 30 2 27 -6 30 32 -47 -9 1 12 -3 -38 -13 17 4 -12 47 15
3956 15 -9 17 -59 29 -8 -22 22 53 -8 -12 45 -18 39 9 19 -14 -3 59 49 -11 15 14 -28 5 23 -14 3 43 32 43 -20
3987 -20 -2 24 24 -2 25 33 10 27 -19 -15 -2 42 11 38 5 -93 -23 -44 15 -56 21 -14 -17 -36 -7 -7 -3 18 46 17 -5 -37 0
4020 0 -20 1 -5 13 -28 6 -10 26 52 -23 8 -25 -17 16 -15 -30 25 -32 1 8 -11 -23 2 -7 15 22 -18 45 -35 -20 18 10 -52 -2
4054 -2 66 13 26 -4 15 33 -26 -18 -3 8 -31 -30 -18 -18 18 4 33 -39 6 28 -23 41 -23 41 -2 -20 -29 9 31 -22 23 75 4
4087 4 23 -71 -22 37 -40 28 17 38 5 -49 18 -41 -7 -26 40 -22 -17 8 11 24 -62 5 -8 -18 -15 -10 -60 18 -12 -8 20 -3 5 -11
4121 -11 -33 33 21 2 -17 0 7 24 2 -32 -4 -23 39 32 0 -14 -49 13 -16 12 11 14 6 -4 71 33 14 6 -18 -10 -23 13 8 -12
4155a2M7k0Oj4Rj9jj4N6k9j7J3l2M9k0J0j2K1k2K4l0N6k4j05N4J8N0o3Rl0K4k2
4187d0Q6p4j3L4j8J7K4qj8n4K0Nj9P8m3MJL7RJ6l5r9J33Kp0K2k2K4R2r8K1m8K6
4220hMRQJ7L2o2j2M4%m2K4l4J0Nk1oM8%k9m6O3k6J3j7M5l0k1M9j8L1L4q1K0J2
4254A5J3%k7kJ4l0K4J2m5M6m6k3L0M3j10J16o6J4L0L6ql0j7rL7o6K7P3m0qrj5
4286b1L9p9NN2N1q6M3J3oo5P5l1Pl1L6%Qj0j4j7M0ql0J1K6l4O2j4j9Rq4P1NK2
4320B6n1K9JJ6m2N1p8J15k0o2Rk7L5j5Jo0Q8%m4O8p6KM8k2Kk2M4j0Qj08J04m4
4352c4lL0k7L0K8l3k8K8pK2j1j5P9n5L3p3P3J5m0oKK7m8j5J3K1K7q9L2K1M3m9
4384ij0M7j1m9J9K7j1L5n0L1k2%j4J8j8qJ7M7qon3J6J4P0o5O9q3n2Q3l0M6J0k7
$$ plain form
4155 -12 35 15 21 7 16 -3 -4 -18 38 9 -8 5 -27 22 2 12 0 21 -1 23 -7 49 25 -80 -26 -8 42 -21 -12 -42 -18 -40
4187 -40 46 -28 -41 -7 -25 -8 16 8 -10 -64 -44 -39 -58 20 -23 -19 -18 19 28 44 9 -90 43 45 -25 -3 -25 -1 91 -7 14 -34 -8
4220 -8 -4 5 13 30 62 0 -12 32 32 -10 14 -20 -10 -5 -26 -32 16 16 -13 -59 4 -22 -9 -26 19 -11 -32 17 -1 30 64 -17 3 15
4254 15 28 28 1 -1 13 -17 7 19 -26 20 -26 -49 -19 24 -86 30 -36 -22 8 44 36 6 -11 -20 17 -49 -22 51 11 3 -6 -21
4286 -21 18 -61 -56 -4 47 -39 4 17 11 -54 21 -10 -3 -34 2 2 10 0 -14 -31 9 1 -29 -18 8 -26 36 22 3 12 -72 -1 4 26
4320 26 -25 4 5 21 -21 30 -48 67 47 -15 -6 -33 2 -13 -12 -72 16 16 -28 40 -36 -34 14 -8 -6 -28 16 6 14 -94 10 -34
4352 -34 -37 -7 -34 -4 24 -9 -37 -9 -16 6 -5 -20 59 4 37 -36 37 52 12 6 8 35 -13 -28 -15 6 33 -56 -24 -3 40 -9
4384 -9 -19 28 17 -32 -13 14 3 38 -12 19 -3 -3 -17 1 -17 -25 -8 39 31 25 -28 -12 2 72 7 76 -7 -59 24 -6 40 50 23
4417B3k4pQQ0n9m3j2rL8J4l2n5R8o0%M1M7l0k0L9k0N0r2L7l1mL6L5p1LJ3JM2k2
4451A4J9j1ql8OJ1N2NMn3M1l8j4k7O4pn0j1M7m2OP1k2lrk3o0J42o7l5M4ml2O1
4485C3m0L6n9PM6n3J5l0K8n1O2j3K2K1n0N1m8j4J6M0JLn5l1P7o8M2L5rl6K2J2
4517A2M1l6Ol8L7o6N5oJ1L0n2K8p4N0J7k7lK3mL3K4m8J6m3L6jK4j8m5M0M7o8k0
4550a9P4q6P1j01RO2l5L1j1k4P8m5L6m4J1N6l1l2Mj6L7l8l0P8nj4M1m2n5Q0k4
4581A6ok0j9K3rj5QL9j3o7Q1K6m2K1n0L2K0k2m4L2L3k1K8Jl9L3m3qK8L3k5k1K3
4614A3l3KL6J5k5k0M5n8J6k3rK3M2m9K7m7nN4rm5K0L6LL7m3jk0L2J7k1J1m1J3
4647gNL9n3K9kN2r3J3M2m8j2N7l9M7L5j24L3L1n0L1O8m9k7J5qL7j4mml3J8K3k7
$$ plain form
4417 23 -1 -8 0 80 21 -22 -34 -43 -5 9 -23 -78 20 -40 -40 1 48 18 -2 37 17 67 -25 12 -19 -23 13 48 -23 -20 -7 -6 36 14
4451 14 33 22 14 -24 -18 -7 45 50 54 1 42 4 -10 -37 27 20 -30 -41 6 -36 -30 41 19 16 7 -16 -76 66 -1 -36 8 4 -28 33
4485 33 -7 29 -30 -23 23 -30 -15 -45 -17 -68 -6 -19 3 24 -26 25 -23 -37 -21 19 20 23 -32 -63 14 -54 -12 23 14 -22 0 12
4517 12 53 17 23 -15 22 -44 11 5 16 46 -6 22 -52 -2 15 -12 -15 8 4 37 61 13 29 -14 22 21 45 27 -18 22 69 1 -19
4550 -19 55 -31 40 -61 -52 10 -25 6 -5 -29 49 4 40 -4 7 63 32 0 4 -12 25 -13 -43 35 30 16 57 15 -40 40 16
4581 16 10 -10 -29 -6 -15 -30 -22 17 4 -63 18 44 2 23 -27 5 25 3 -41 -9 24 3 31 32 -7 26 -17 -25 3 36 11 -10 13
4614 13 -20 -18 18 33 8 -12 33 -25 -9 -32 -41 -18 24 -25 2 -45 -50 4 -5 -50 -30 6 9 46 3 2 -18 14 31 10 21 -20 -7
4647 -7 -2 37 -16 13 11 63 -30 -17 25 -23 -35 22 -17 30 65 -59 -26 5 -45 -14 54 5 -22 -7 -15 22 8 4 0 -33 -15 8 -19
4680a9Q3l6k8K0n2M1J4J2MJ1m0oJ5kl1l4J6L7k4PM1l1M3q7OK6j1M5rn9L0L0N2
4713F4m7k3j2K8k1K0M1n7K6m6K8pm3J9M6m9K5MPk3QJ1j9L5m1J2L8qk1L2m5K3k9
4746b4N0n7K4L0n5J4KK8LM4l9L9r1lK0R7n9m8j1M4J5l6N4p5N8oj7l3L9l3P8n2
4778@o6N7M6m0l0N6l7l1N6k2Lk6j0P4j8j5L3j7MM9o1j1qK5J3J9p1J9qM5k0mOJ4
4812B4j2MJ5n2J2kl2O1o0N5jK7n4%J6j3j5J2M3m9l7N2J2j3L8o3L4qK4M2m1o8N6
4845Gjn3P0j0K2l5p3Q8oj5KN8o0%L2l5p3O5j8kQ1o2m1L3O2m3k6N1o5K6K6j4M3
4878C4k6qJ8rm4P0o3K6J9OP3j05N5K6q1j5O7j5k2Kq4P1K2m5RM6o6O7l8k2KK4m9
4911e5NM7K1lK0no5N0n8QN5j1J1j9oL7p7J00j6j2J9k3l6j0K2j2j7M5J4Ql8%Ml1
$$ plain form
4680 -19 64 28 0 20 -32 9 23 35 39 50 10 4 19 17 -14 -48 -32 5 -19 -12 29 -2 41 -46 -40 -14 -25 20 11 -48 -18 12 64
4713 64 17 -6 -18 10 -11 9 50 -7 19 -27 1 -6 -49 -30 16 -33 -8 -4 3 -20 -12 -1 -20 15 -26 -14 24 16 -5 27 -18 5 -24
4746 -24 26 -31 -7 23 -32 -18 -16 12 15 59 20 59 -32 -35 -15 82 23 -25 -36 8 23 -13 41 -34 24 18 1 -32 7 -26 52 0
4778 0 -66 -9 37 -3 -33 23 -14 -45 11 -11 -8 -34 -44 30 12 -3 30 13 17 66 5 -6 -14 11 24 43 -28 -9 -17 28 8 4 10 24
4812 24 12 16 31 -21 -9 -11 -43 18 -42 13 12 39 -15 -15 1 -12 -27 -15 28 -21 -58 -6 6 -7 31 -32 2 -6 18 60 19 -49 7
4845 7 6 -47 23 13 35 0 -73 15 9 -6 -4 54 -6 -6 26 -9 -82 -17 -35 -37 44 -18 -59 -26 36 -7 -33 18 -47 -21 5 -9 34
4878 34 8 0 18 9 -35 35 -28 -2 17 23 96 -9 46 72 -9 -24 43 28 6 8 -76 -5 17 -28 -19 27 -39 28 -10 -32 -30 -6 -55
4911 -55 -50 -3 18 15 35 30 -35 15 -43 -35 20 9 20 1 -5 32 -45 55 39 27 46 23 -13 -23 -1 -13 -30 15 29 37 -1 -1 3 -28
4945b8k4O7j0k2l3J09p2K4j3J1M4r1J3QqK1k4M2K9o7N9Jj5o6K7Nj2M2k6k9J01
4976F3q5%OK4K6o1J7j1M2p3M2Oqj9M6J9l7oMQk1L1O2k7j12J05k3K3ml1L6nm7j0
5010b0M7K3n6K8j3l7N1k7j7N4m3Pk0M7q3P8j4l3O3ppQm1J9J8j6mk0m9N5j3j7R8
5043E9o9j6N0J1l0J1Rn6rN8k9nM5j2K1Kn2rnN2J4q0L3%k2J6M5m8j8P3o6M7J1n7
5077b6N9l5Ml1L6M1n9J1k7N5Ok2J6jl5n0J28q0nO5o2J1JK5n0j8NJ7O3q5%P8l5
5110@MkL4o0kJ03j49N9K0no5L6J2M9j4J6n3M8L8q3QO2r4M2Ql9j2R0j8m4K6Ol5
5143a4K3m1K1m5P3l2N5p5LL2k5L0%KJK2m7N9p1K8j9qO9o9J1k7M5Mk6L7m3K4J4
5176A1j7L4q2O7k2J2l3M9j1ln5N1j0jrL6j7l4L6K4j0K8o7lK1N2K7o6j1J6l0M5
$$ plain form
4945 -28 -52 15 5 -17 -50 59 -13 11 -2 9 53 -38 -25 -17 -25 -4 -28 14 43 -24 35 36 21 -45 -18 -13 -25 17 -9 -38 63
4976 63 -22 -22 -16 8 34 -27 -10 -21 21 -52 -10 -4 -12 -31 15 34 -3 -9 -5 3 -18 13 75 48 -64 41 18 41 37 6 42 37 -10 -20
5010 -20 27 50 -6 22 9 -28 23 -4 -21 33 -10 -3 -23 24 -59 19 5 -28 35 28 21 29 -12 7 25 9 5 -15 -64 -9 -22 -39 59
5043 59 -10 -26 24 35 5 16 25 -31 -40 18 -11 -16 29 17 38 40 -12 -21 -26 26 40 -40 -7 -7 -29 -13 32 -16 -34 39 -27 20 31 -26
5077 -26 33 -2 2 -29 7 48 -11 0 -27 28 34 12 28 27 -8 -58 70 -10 -15 50 -12 -1 0 25 -25 -43 -38 -21 42 -43 -43 35 0
5110 0 4 2 36 -24 -26 77 -72 -13 7 2 -63 -27 -15 34 20 36 -17 31 69 -14 -6 56 -38 4 12 -27 -39 51 33 -11 15 21 -14
5143 -14 9 -32 -11 -56 17 -15 40 -35 -32 0 -25 5 5 7 8 30 -17 42 -29 -1 -20 -28 41 -28 -17 -44 1 5 -21 16 -27 -3 11
5176 11 -6 28 -54 13 -9 3 -30 19 8 5 -50 1 -9 -10 -19 17 0 -34 2 26 16 44 -23 -26 -5 47 74 8 -3 13 -17 28
5208B8kK2rk4k8L0n7MJ0K6j7L6l9pL3K8l3k4K4n3N1j9M8%l7l3N6N5q3NO8k9j7
5241A3Lk3K1Q3o2m4n1N2m5N9j5KJ6rk5JL4o7Q0j3L8j28J38j6kl6N5m8m4K1L3L
5273B4j6J0JJ6m1pJ2J2N0m5mKJ5j3m6O4m8MqQLp5N2j9K3l2L0O4l8l7K1K7Ql3J4
5308bl2M9n7O4N4p7L3l0m7L8J7qK1ol1L3j6Rn4M0L5j1k8J4j9l0K7L2J7m0OM3l4
5341A0kj5OL1l3K4k8J5%n4M2K6o5M2Q%J3Ko1K7M7j2Kn6L3K4n3l5O1l6O8q8K8p
5375c6J3L3J4m8k3N1l3K1J4j6j3j9P4k7p3P2Jo4N2JN2l6k5Q1p9k6R4n6l6L8j1
5406a0M2o2k3L2L4mn%j5j9K9m3J2J3rK0%K1m3M3mJ5m0%N1L6m7pQn6LmM1Pk6L3
5442B3J4m7j2M1j0j4RJ1l3K4Lm6rL4PK6j7n1L1PJ6k4J3l1J8M4k4l3N5Pq2J5M1
$$ plain form
5208 28 26 48 39 15 -13 17 -40 -36 -26 0 -17 19 -20 -27 6 34 1 -23 1 -52 -1 -20 28 28 -9 -42 14 69 -14 -9 59 30 13
5241 13 16 -7 14 97 35 -9 -60 -8 -53 6 -9 -7 9 0 -25 -24 10 -57 23 10 48 -80 58 42 40 4 59 11 -33 -12 21 24
5273 24 8 18 19 35 -6 -13 -1 11 61 16 12 14 29 16 -30 34 -14 -10 -18 -10 -7 -82 -30 -49 -26 -58 -28 36 -2 -39 -18 9 17 -16 -2
5308 -2 -34 15 -42 22 76 -1 32 2 -45 -7 10 2 23 17 -14 19 3 12 -42 -2 33 22 -6 8 -11 -41 -14 18 35 -5 1 44 10
5341 10 8 -7 -1 30 -3 21 -7 8 8 -46 -4 22 -43 -1 7 7 20 22 -39 -12 35 23 25 -31 2 26 -27 -62 -1 -37 31 -57 -29 -36
5375 -36 -23 10 24 -24 -47 4 -29 -8 6 -10 -23 -42 32 5 -68 4 5 -59 -7 -6 46 10 -15 66 -13 -39 55 -1 -37 1 -10
5406 -10 32 -30 -53 -21 13 9 4 4 -11 -30 -1 -44 -32 -19 -28 -8 -8 13 -30 13 9 24 -16 -16 35 71 24 17 25 -31 -28 -32 9 16 -10 23
5442 23 37 -10 -22 19 9 -5 4 15 -18 6 9 -37 -46 -12 -5 21 4 -47 -16 -9 7 -17 -4 -35 -17 27 3 -30 25 32 -50 -35 6
5475Fj0K2j7Mk3J4M0j8k2Qj6k3N0k2M6o6L4M0o9J8k7L7l0J0L8m3MJ0J6nj0K9n6
5508c1j4N2lk4J6N3p4L1jm1%P1l3j2Nk1M1l5LKjL6l0RO3l8j9rk7%Q2m3K5nk4l4
5544c0L2n2N4j3QK0l2PlL7j5Pj0L9p0L6lm9M4QrM1j1k0j9K7%m7M4%j6J6K2l7n1
5579d5L7oK2m9K1P4p2O2nJ5p9OK1Nl7P2m3K1k3K9%j3JL6m2qK2j2kLpK4j0o0L5
5614gqJ6Lk1m1N3m1N0NJj8L5l9N1k5qj7RJ5M0l1l9M4jj8j3j2N6m2k6M1JJ6n5l2
5649e8K9K3jn4K0M4M1k4K1m2%Qqo1N4k0nj5jK8K9L3l2L0j7l9QJ6m8K5jj4M6J7
5683C2k5L3o7K9J2nl9M7J3r3M6K9k2L5n4K8o1L5N2l8Ko4O7J2PNNnn9J8P5k5ro8
5717e2J12m1j5J2jo6M3k6l5N6k9K5k7L0R0r6O5o0L1j6ok7N6m9j4P0n4K1j1Ql8
$$ plain form
5475 6 -4 18 1 5 -18 -4 36 18 -4 4 -12 -35 15 -7 39 -27 7 47 -22 -4 -31 6 -24 -14 24 -19 -15 -5 11 6 -4 25 -31
5508 -31 -45 7 4 -20 -4 49 -25 6 5 -36 -36 35 2 -10 -5 -26 15 -20 -17 -15 -16 20 -10 -1 62 24 5 -4 -31 -31 51 8 33 28 4 -30
5544 -30 2 -50 4 -9 -1 19 -13 -6 -9 28 13 20 10 49 -21 15 12 -37 7 15 6 47 36 16 -3 24 24 -23 21 21 5 21 43 6 -45
5579 -45 -8 -14 8 -41 -20 54 -18 44 39 54 -25 -19 2 7 -30 42 -1 20 -3 26 26 13 14 50 8 0 22 10 8 11 4 28 18 -42 -7
5614 -7 -15 1 4 -17 -58 -5 -46 4 9 10 -8 27 -12 39 14 6 -11 -2 13 53 22 -17 27 26 8 -5 -17 39 -3 -29 12 13 29 -26 -58
5649 -58 -29 -6 -7 -61 -41 3 44 20 41 -1 -1 7 -1 -62 -8 -28 -33 -48 -49 -21 8 41 9 39 22 -17 -9 7 -41 -16 -17 -31 15 32
5683 32 7 40 -27 2 14 9 -30 17 30 -63 -17 12 -10 25 -29 -1 -62 -27 25 -13 -11 -75 -8 4 11 16 21 16 -43 -25 50 25 16 -52
5717 -52 60 19 4 16 15 -51 -8 -34 -69 -13 -42 -17 -44 -14 76 -20 45 -15 16 0 -6 -33 23 -26 -40 30 -24 -3 -14 -6 -44
5748d4O8j7K4r6O3pO1m6J5J4p1P8q8L3Nj7K5K5o9N2k1j7l3Q1n3J6L0m1j0O2n5
5779c3M1m6NN6j9k3MK7qLkNn4k9J23q5M8pl1M3j2Pm8M0K4Mprm2N4l6MqKjJ5jm4
5817d0N8jn6j3KO0l0M4l0K0n8O6Np3J5N2k2j4J5k3N0oj2j6J5o4K2%M6oj6j9%p
5851c6OoL6l0j6K6J2noP1p1j3M1k2L7l9K5k3l9J5Q7n3l5L8M7kp2O0j4k7N2nk8
5884A1k6pJ7L9l2l6N4j1k1Nk9N9k8J6k4J6j6O4m0Rk8L9j04M6O4K0o6qM3l6l8P8
5916C0l8l5O5nm0M4j4jJK7K1k4l7O6m6m9P5Lm7%L6r7L1J9M7m3L3o5M3J3r3J10
5948C0j0m2Q4q8L9k4J0K2Jm1QK5k3N4l0l5L7No6O0l3l7N4l7MQ1Jo2omL2K6l0O
5982A1qk2J7k7L9k3L5j7Oj5M8j04M5K1j7M0l8L8%o7NN0p4J5K1K1Qqk2L8k1J7n2
$$ plain form
5748 -44 24 7 31 -65 -2 -9 52 6 21 35 -36 42 -46 -13 -8 -25 0 25 -44 8 -13 -30 -63 18 -35 -19 11 -30 -40 22 -33
5779 -33 8 -38 -33 23 4 -19 -15 12 4 7 5 10 -44 -73 50 -35 13 6 -25 18 6 13 -35 5 29 33 26 17 -25 29 -7 -3 -11 -9 -10 5 4 -40
5817 -40 18 17 -39 -52 -50 10 -20 24 -6 14 -44 22 27 -46 -31 21 -1 -15 0 -23 27 21 9 -7 8 -56 -34 -34 12 6 -10 -29 -29 -36
5851 -36 -30 -36 0 -30 -46 -20 -8 -13 -19 52 -19 -32 9 -13 24 -15 10 -13 -52 -37 50 -3 -38 0 47 45 -27 33 19 -8 44 39 11
5884 11 -15 -22 -5 34 2 -34 20 9 -12 -7 -36 23 -5 11 -13 3 -13 51 11 20 -8 31 -73 -27 37 57 -9 -17 26 -10 -48 30
5916 30 -8 -43 22 17 -23 21 7 6 7 34 55 31 -6 60 14 -35 40 43 -4 -4 32 -65 -34 -15 32 -11 22 -43 0 13 -80 30
5948 30 20 -22 62 -26 13 -11 -1 21 22 -19 -11 14 -9 45 15 -20 17 22 -44 16 -17 -54 0 -37 -33 48 49 -13 -19 -23 9 35 5 11
5982 11 3 -19 -2 -29 10 -13 22 5 11 -4 44 -60 -15 6 -11 29 -9 29 29 -38 -33 17 -57 -42 -21 0 8 0 -22 16 -5 12 -40
6015d0mL3Mo1L3M0k4O3k7mj9j1L0J0l4L1m0K7J1m0K9k1ML5p0P4l2J0Qj5J5j6o
6048gn7R7m6MkM2o6k3L1NN0l8J1pm0J1J4J8n5O1J2k7oK7n6j2J13l0j8J8Ll2K3
6081A8m7J7J8J3n6k3P8K2j6NMp1J6qK0m6L5%J0MO0j09M9L4l6L9l9j2M9n9J9nN4
6114C7k0km7P0m1k3M9k7nkN4n1M9o0J8o6N7K4l2J1K1m5R3l7l2QJ0L3ll8N6r0M0
6147IK3m0J5K1J5j9OQm1rL5kLpj9j7J9M1m7O8n6pmn2O9J0M0k6l9j9L4Mmj6qj2
6183b4K2%J1m5N5Jl7K9n5N8j6k0QN5j00R5l4MK0%%l3Qj6nj3M0J3K1q1J7oJ8P1
6217F1r0M4K2l7M3n6N0pj9J5j4j1j0K4p3P2mL3m8l5K7l9N3pK2j8j6%K6j4J6p2
6249f2R0j0K2l2OKj5J5J4m6L8o5N5l2L2qj7N3j6j8l8O1J0J4q3P7%n1J0M5j1Ln0
$$ plain form
6015 -40 -44 -11 -7 -68 -35 5 -19 44 17 13 -6 -17 13 23 -11 20 -20 7 18 -22 7 -14 -10 25 -45 29 -3 7 15 0 15 -1 -7
6048 -7 -64 33 -13 -9 -11 31 -35 -58 -27 -22 28 -10 1 -6 -46 -35 -21 -3 -58 3 15 -12 -18 9 -47 -59 54 24 6 24 27 -5 18
6081 18 -29 -12 6 19 -37 -60 18 40 24 29 33 -38 -22 -30 -10 -56 -21 -21 -11 -7 53 -56 -7 27 -9 30 -9 -21 28 -31 -12 -17 37
6114 37 17 15 -32 38 -3 -26 23 -4 -9 -11 43 -8 41 -19 -1 -67 -10 14 -18 -7 14 -31 62 25 -7 1 11 44 41 3 59 -31 9
6147 9 32 -8 7 28 43 24 30 38 -3 -12 23 21 24 17 -2 -19 0 41 -6 62 6 -1 -5 -57 12 22 62 36 -3 -22 12 16 12 -4 -12 -24
6183 -24 -2 -2 9 -36 19 20 -17 12 -43 15 -1 -21 -13 42 -58 37 3 7 27 27 27 -6 2 -14 -19 -32 8 21 42 -39 -22 -28 -10 61
6217 61 -29 15 37 0 43 -13 37 30 11 26 12 1 -9 15 -58 14 10 43 -5 -40 -13 -52 1 -6 16 -2 -18 -18 8 -6 10 -62
6249 -62 28 18 40 8 14 16 1 16 30 -16 22 -43 12 -20 12 4 -13 40 24 6 -32 29 39 53 -30 47 47 -4 6 51 40 43 -7
6282gNqM6k3m0M3J9n2J4m3O3o5P3k0k2kKJ5j3L7OL5m4Lp0N9kL5m5J8qm5L1J3n0
6317d2K2L0K4k7k3PL1j9RJ0J0j9l5P7o3J3j7LJ4j6J4l1M3k7J9RJJ7j3n5M9lj4
6350bL2nOn1RL2p0N2N1n7m6P4K7j1k7k5QK3J0q0J4jL0J3m0j9R4k5j4KnPk6L4j9
6385eN3n4N3n0K6k2J7k4j3K3m8J9K2RJ0M7o2Qk6K7mj2L8q4M6j5%N0NnM3q6J5j1
6419a0pJ8k8O7j2m4N2K6o4J1Moj1jJ0L7m7K1J3n5L8m9N0l2MK0qm1M8l6N2n0M0
6452A0nl7K4L0k0k5Rj8P9q0jN8Mk9O1m0j9rP2r1L2Ql2n0M2O6j3jj4j4k5K7KOn2
6487d5M6K2p4oO1rN4k9pJ0km6P7q7L5MJ0J1OJ6l6Oj8k2M7Ok1K3m5pP8l0k6K2k6
6522bJ9j5ml9O5m2J6jL8o4J3L0Qk2K3o3R5q4L1lLoL6pm4j4N2Kj5L6n1l6J07n9
$$ plain form
6282 -7 -2 -10 36 13 -27 16 35 -17 -3 -46 17 -48 25 5 -17 -19 -17 -2 -15 22 28 63 19 22 -48 11 9 44 -1 17 9 -36 -5 8 -42
6317 -42 -20 10 34 7 -16 -9 22 3 12 22 32 13 -22 55 -8 5 -12 -9 5 -11 3 -28 15 -12 7 16 17 34 21 -34 15 12 -2
6350 -2 30 25 31 -20 -11 21 -49 3 54 -3 -49 25 52 41 14 -11 -3 20 30 -50 -36 -37 -7 6 -34 -53 41 16 2 4 -1 6 -20 14 -5
6385 -5 48 -6 47 -3 23 1 18 -6 -19 4 -44 -25 -3 6 16 63 1 9 -17 10 6 -6 32 -52 -6 -21 -21 29 34 29 72 -14 1 -10
6419 -10 -17 1 -27 40 28 -16 36 62 -2 9 13 7 -4 -5 5 42 -5 16 29 -26 12 -37 13 -19 -15 5 -3 -44 4 -32 20 -30 10
6452 10 5 -32 -8 22 2 -23 -14 -32 47 -33 -34 24 28 -1 60 20 1 -8 64 -27 5 13 -19 -69 -27 39 26 25 11 -3 -28 -1 1 7 -45
6487 -45 1 23 -51 -57 4 -5 49 20 13 23 21 -25 52 -35 0 4 14 25 31 47 11 17 -1 -23 24 30 9 32 -13 -20 58 28 2 24 -2
6522 -2 17 2 -2 -41 24 -18 -2 -3 35 -29 -16 14 22 0 23 -40 55 -29 2 -1 2 -4 32 25 -19 -33 19 21 6 42 -9 -45 62 3
6556Ck1j8K4j7rO6n8N5j6Jo0Q3p5L4J8nK2n2M9k8j6MP7m6l5L6J3m8ML1No1M2N4
6590E6o6K9o3M9j6j3N0n2m4J02j5l8J3j7O5n8JKK0MK0k8K0ol5pK3J6K6k5M3ql4
6623A4J1Ml0M8n0J1j0L9p2lP1k0j5jj9MOk7O8oJ2q3O6m6L1j4L5m2L0l2pK8J5%
6657A6Lm6L9k8l6O0M4n2J0j6k9KRnO6qK3l4K4n1nj1K6l7j3Q2o3N1k8L6m7P7r3
6690c4K0k0N8k1j3J8rK7Jj6PJ5m7j9L5J6M2j4m0K9r2Q7om9K4n0P9o1k0J8NO5l3
6723BmLJ2k8J8k3J9Mk4K0j1J13j46O1j3J3%M8j14L7O2m2On3N1RK3p8PK4J1qKR
6757A0jk2J5J3m7J0p%qM2K8rn0J3KqM7j7J1o1O2nKnj0K8J1J0o7J6j0NK6k0j1M0
6793C3k7kmJ7j5k8L4qm2K1N2o3l7P7J6kK0J8r5L6J1J2Ql8M8j7L8j08M9J6Rk2k5
$$ plain form
6556 3 -18 -36 -12 -29 -38 28 -30 25 9 10 -50 33 -42 -8 10 5 27 -25 24 -4 -20 -16 61 15 -20 16 29 -19 -15 16 21 -40 2 56
6590 56 -10 19 -44 5 -11 -24 26 -26 -70 32 17 -21 -8 -25 40 -18 -17 -15 5 9 29 1 21 15 -20 -27 -4 12 38 13 56 48 14
6623 14 25 29 -1 47 -3 8 -2 37 -35 -38 33 13 -2 -3 -22 -18 -12 -39 29 23 35 -48 18 -28 3 -11 24 -18 12 -20 -27 1 16 16
6657 16 19 -27 12 -16 -52 8 52 0 10 -6 -35 -33 -24 -29 37 29 52 18 42 -9 -14 -25 1 -36 -49 33 -30 21 -7 29 -18 59 -34
6690 -34 -14 -34 24 3 -10 8 -1 26 27 11 18 33 -14 -33 2 18 60 46 6 35 -57 30 24 -25 -1 -51 28 -33 -53 -35 -30 35 2
6723 2 -2 1 13 -15 3 -20 -1 3 -21 -1 -12 101 -45 16 3 16 16 64 -50 -13 49 7 13 -40 11 20 43 -35 -28 -4 7 -1 1 10
6757 10 9 -13 2 15 -32 -22 -29 -29 -37 5 33 24 -26 -13 -11 -19 28 11 22 -39 23 18 20 15 5 33 44 54 -13 3 -7 -2 24 4 -7 33
6793 33 6 4 0 17 2 -26 8 0 -42 -21 31 -32 -69 8 24 22 42 60 -35 1 12 24 32 -6 42 25 63 -45 4 20 29 7 -18
6826a8O0k3PK1l2JJ1m2l0N2K8j3lj3K9j2j1m0K5j7L4j7K3j7q1N7O7o6O8m3j0m1
6858d6P2l0LJk9K0P1p2R0q3N3j6M7mq2oj4O1n2kj6N7p3N7Pl1qK5l6O1J1k8j9j6
6892b7O2l4k4N1Jo3j1K0Q8n3QnJ4k1LK7q1L7Qol2qL1K3j8NJ7j9J4k5PJ2j2j5l3
6927e9N3N3p0j4RJ8k4KK0O0j7J0J3rj11K0O9l7L5K2n8RM4oK3l5k0KJm0P0J6j14
6960f5L4M4l8J2M3j5Kp4K2M1j4L9J2j6m7M7l4J5K7j0j3l3M5j0k1Mk3M3K8r1J06
6991F0n9p0R1k5Lj5mjJ1O7j06J7k0O0j1j1k5QO6J4k1J8m2kj1K6l2%k7Q0p4M1O
7024A2%j1mL6m9LJ8qL2q3L6o8J10lNm4%M6p0N7nNlkK8o9L8%k2P3m0K9n3kl3J13
7060G2n9rK1LQJ4p3J1K3mPJ5K0J3o6J5j4k4K3kk5K2k0l0N4Pjj1Pm4Q4l0n1Q0p4
$$ plain form
6826 -18 42 19 26 47 15 16 27 -15 -45 7 35 22 19 6 35 23 12 -28 -3 -20 14 -3 20 3 -78 -21 46 -20 48 5 -5 -46
6858 -46 26 -4 -1 0 -29 -9 62 -10 80 -3 50 34 81 77 -5 -11 -25 36 -16 -18 -34 23 -50 7 14 -17 -25 0 -36 25 36 8 -11 -27
6892 -27 35 1 -23 28 29 -34 -45 -25 63 10 18 13 27 6 9 36 -45 -8 0 -6 -38 -46 -15 8 -10 -5 12 -7 7 -18 -11 1 -11 -26 -59
6927 -59 -6 47 -23 -37 -28 -10 -34 -32 -12 48 31 41 54 45 -66 -46 23 -14 21 43 -15 -6 38 32 55 20 0 2 3 -37 33 49 -65
6960 -65 -31 13 -25 -13 30 15 17 -57 -35 6 -8 31 43 27 -20 27 -7 8 35 25 12 -21 24 14 -7 -3 -26 17 45 -46 60
6991 60 1 -69 22 -3 0 -15 -19 -20 -9 58 -48 -31 -51 9 -2 -13 -38 -30 36 50 29 47 5 3 -8 18 -14 -14 -41 39 -35 6 12
7024 12 12 1 -3 33 -16 -13 5 -3 29 -54 -18 -86 24 21 26 -18 -18 28 -42 15 10 15 12 10 38 -31 7 7 -15 58 18 47 -6 -8 -41 72
7060 72 13 4 25 28 36 50 -23 -12 11 7 14 29 49 62 -4 11 -3 -27 -4 -6 -31 -9 -29 -59 -5 2 1 -10 -3 -47 37 7 -44 36 -38
7095c8L9K6K0l5L1q2QN8o2O1l8J5k4R0r7J7L2K1l3J0Rk5L1l1Nn8M5m5O5j6k0l1
7127e2Q4l7J5k4L5k4K4j4j1Km0N4J2j3j2J5N1q1P2n0l0M1k2J2rK3l3l4O7j4mj
$$ plain form
7095 -38 1 27 47 12 43 -39 -31 27 -35 26 -12 3 -21 69 -28 -11 21 42 9 19 28 3 34 3 8 -50 -5 -50 15 -1 -21 -52
7127 -52 32 -5 10 -14 21 -3 21 7 -4 -2 -42 12 24 11 -1 14 65 -16 56 6 -24 17 -5 7 -2 21 -12 -46 21 7 3 2
$$ [...]
8191f1
##END NTUPLES=NMR FID
##END=
