##TITLE=1H_Pr Am Ril
 CDCl3, 8 sc, 
 25.08.2021
##JCAMPDX= 6.0         $$ Bruker NMR JCAMP-DX V2.0
##DATA TYPE= NMR FID
##DATA CLASS= NTUPLES
##ORIGIN= UXNMR, Bruker Analytische Messtechnik GmbH
##OWNER= root
$$ XWIN-NMR		Version 3.5
$$ Wed Aug 25 09:17:09 2021 Russian Standard Time (UT+4h)  she@DPX200
##.OBSERVE FREQUENCY= 200.131506
##.OBSERVE NUCLEUS= ^1H
##.DELAY= (6, 6)
##.ACQUISITION MODE= SIMULTANEOUS
##.ACQUISITION SCHEME= undefined
##.AVERAGES= 8
##.DIGITISER RES= 18
##SPECTROMETER/DATA SYSTEM= spect
##.PULSE SEQUENCE= zg30
##.SOLVENT NAME= CDCl3
##.SHIFT REFERENCE= (INTERNAL, CDCl3, 0, 15.7039)
##AUDIT TRAIL= $$ (NUMBER, WHEN, WHO, WHERE, WHAT)
$$ ##TITLE= Audit trail, XWIN-NMR		Version 3.5
$$ ##JCAMPDX= 5.01
$$ ##ORIGIN= Bruker BioSpin GmbH
$$ ##OWNER= she
$$ F:/spectra/data/she/nmr/H-F/1/audita.txt
$$ ##AUDIT TRAIL=  $$ (NUMBER, WHEN, WHO, WHERE, WHAT)
(   1,<2021-08-25 09:15:53.09 +0400>,<she>,<DPX200>,
      <created by zg, POWCHK disabled, PULCHK disabled
       configuration hash MD5:
       00 E9 B6 7A A2 85 ED C7 34 08 36 98 17 FE 4E 26
       data hash MD5: 16K
       3E F3 02 63 6B A3 61 68 67 58 D6 CE D3 48 1E C4>)
$$ ##END=
$$ 
$$ hash MD5
$$ 63 73 45 62 2E 96 6D E5 81 98 B7 F7 FF F6 32 46
##$RELAX= 
##$RELAX= 
##$RELAX= 
##$RELAX= 
##$RELAX= 
##$RELAX= 
$$ Bruker specific parameters
$$ --------------------------
##$DU= <F:/spectra>
##$EXPNO= 1
##$NAME= <H-F>
##$PROCNO= 1
##$TYPE= <nmr>
##$USER= <she>
##$AMP= (0..31)
100 100 100 100 100 100 100 100 100 100 100 100 100 100 100 100 100 100 
100 100 100 100 100 100 100 100 100 100 100 100 100 100 
##$AQSEQ= 0
##$AQ_mod= 1
##$AUNM= <au_zg>
##$AUTOPOS= <>
##$BF1= 200.13
##$BF2= 200.13
##$BF3= 200.13
##$BF4= 200.13
##$BF5= 200.13
##$BF6= 200.13
##$BF7= 200.13
##$BF8= 200.13
##$BYTORDA= 1
##$CFDGTYP= 0
##$CFRGTYP= 5
##$CHEMSTR= <none>
##$CNST= (0..31)
1 1 145 1 1 1 1 1 1 1 1 1 1 1 1 1 1 1 1 1 1 1 1 1 1 1 1 1 1 1 1 1 
##$CPDPRG= <>
##$CPDPRG1= <>
##$CPDPRG2= <>
##$CPDPRG3= <>
##$CPDPRG4= <mlev>
##$CPDPRG5= <mlev>
##$CPDPRG6= <mlev>
##$CPDPRG7= <mlev>
##$CPDPRG8= <mlev>
##$CPDPRGB= <>
##$CPDPRGT= <>
##$D= (0..31)
0 1.2 0 0 0 0 0 0 0 0.06 0 0.03 0 0 0 0 0.0002 0 0 0 0 0 0 0 0 0 0 0 0 
0 0 0 
##$DATE= 1629868552
##$DBL= (0..7)
120 120 120 120 120 120 120 120 
##$DBP= (0..7)
150 150 150 150 150 150 150 150 
##$DBP07= 0
##$DBPNAM0= <>
##$DBPNAM1= <>
##$DBPNAM2= <>
##$DBPNAM3= <>
##$DBPNAM4= <>
##$DBPNAM5= <>
##$DBPNAM6= <>
##$DBPNAM7= <>
##$DBPOAL= (0..7)
0.5 0.5 0.5 0.5 0.5 0.5 0.5 0.5 
##$DBPOFFS= (0..7)
0 0 0 0 0 0 0 0 
##$DE= 6
##$DECBNUC= <off>
##$DECIM= 32
##$DECNUC= <off>
##$DECSTAT= 4
##$DIGMOD= 1
##$DIGTYP= 9
##$DL= (0..7)
0 120 120 120 120 120 120 120 
##$DP= (0..7)
150 150 150 150 150 150 150 150 
##$DP07= 0
##$DPNAME0= <>
##$DPNAME1= <>
##$DPNAME2= <>
##$DPNAME3= <>
##$DPNAME4= <>
##$DPNAME5= <>
##$DPNAME6= <>
##$DPNAME7= <>
##$DPOAL= (0..7)
0.5 0.5 0.5 0.5 0.5 0.5 0.5 0.5 
##$DPOFFS= (0..7)
0 0 0 0 0 0 0 0 
##$DQDMODE= 0
##$DR= 18
##$DS= 0
##$DSLIST= <SSSSSSSSSSSSSSS>
$$ [...]
##$SUBNAM2= <"">
##$SUBNAM3= <"">
##$SUBNAM4= <"">
##$SUBNAM5= <"">
##$SUBNAM6= <"">
##$SUBNAM7= <"">
##$SUBNAM8= <"">
##$SUBNAM9= <"">
##$SW= 20.0188882624521
##$SWIBOX= (0..15)
0 0 2 0 0 0 0 0 0 0 0 0 0 0 0 0 
##$SW_h= 4006.41025641026
##$TD= 16384
##$TD0= 1
##$TE= 0
##$TE2= 300
##$TE3= 300
##$TEG= 300
##$TL= (0..7)
0 120 120 120 120 120 120 120 
##$TP= (0..7)
150 150 150 150 150 150 150 150 
##$TP07= 0
##$TPNAME0= <>
##$TPNAME1= <>
##$TPNAME2= <>
##$TPNAME3= <>
##$TPNAME4= <>
##$TPNAME5= <>
##$TPNAME6= <>
##$TPNAME7= <>
##$TPOAL= (0..7)
0.5 0.5 0.5 0.5 0.5 0.5 0.5 0.5 
##$TPOFFS= (0..7)
0 0 0 0 0 0 0 0 
##$TUNHIN= 0
##$TUNHOUT= 0
##$TUNXOUT= 0
##$USERA1= <user>
##$USERA2= <user>
##$USERA3= <user>
##$USERA4= <user>
##$USERA5= <user>
##$V9= 5
##$VALIST= <valist>
##$VCLIST= <CCCCCCCCCCCCCCC>
##$VD= 0
##$VDLIST= <DDDDDDDDDDDDDDD>
##$VPLIST= <PPPPPPPPPPPPPPP>
##$VTLIST= <TTTTTTTTTTTTTTT>
##$WBST= 1024
##$WBSW= 4
##$XGAIN= (0..3)
0 0 0 0 
##$XL= 0
##$YL= 0
##$YMAX_a= 288940
##$YMIN_a= -265810
##$ZGOPTNS= <>
##$ZL1= 120
##$ZL2= 120
##$ZL3= 120
##$ZL4= 120
##$ABSF1= 10
##$ABSF2= 0
##$ABSG= 5
##$ABSL= 3
##$ALPHA= 0
##$AQORDER= 0
##$ASSFAC= 0
##$ASSFACI= 0
##$ASSFACX= 0
##$ASSWID= 0
##$AUNMP= <proc_1d>
##$AZFE= 0.1
##$AZFW= 0.1
##$BCFW= 1
##$BC_mod= 2
##$BYTORDP= 1
##$COROFFS= 0
##$CY= 11.3945322036743
##$DATMOD= 1
##$DC= 2
##$DFILT= <>
##$DTYPP= 0
##$F1P= 2.36226072786647
##$F2P= -0.459571619588291
##$FCOR= 0.5
##$FTSIZE= 0
##$FT_mod= 4
##$GAMMA= 1
##$GB= 0.15
##$INTBC= 1
##$INTSCL= 1
##$ISEN= 128
##$LB= 0.24
##$LEV0= 0
##$LPBIN= 0
##$MAXI= 10000
##$MC2= 0
##$MEAN= 0
##$ME_mod= 0
##$MI= 1.114404
##$NCOEF= 0
##$NC_proc= 0
##$NLEV= 6
##$NOISF1= 3.799351
##$NOISF2= 2.8
##$NSP= 1
##$NTH_PI= 0
##$NZP= 0
##$OFFSET= 15.70392
##$PC= 1
##$PHC0= -13515.74
##$PHC1= 15.00099
##$PH_mod= 1
##$PKNL= yes
##$PPARMOD= 0
##$PSCAL= 0
##$PSIGN= 0
##$REVERSE= no
##$SF= 200.130013532006
##$SI= 16384
##$SIGF1= 3
##$SIGF2= 2
##$SINO= 400
##$SIOLD= 16384
##$SREGLST= <1H.CDCl3>
##$SSB= 0
##$STSI= 0
##$STSR= 0
##$SW_p= 3612.71676300578
##$SYMM= 0
##$S_DEV= 0
##$TDeff= 0
##$TDoff= 0
##$TI= <>
##$TILT= no
##$TM1= 0
##$TM2= 0
##$TOPLEV= 0
##$USERP1= <user>
##$USERP2= <user>
##$USERP3= <user>
##$USERP4= <user>
##$USERP5= <user>
##$WDW= 1
##$XDIM= 8192
##$YMAX_p= 0
##$YMIN_p= 0
$$ End of Bruker specific parameters
$$ ---------------------------------
##NTUPLES= NMR FID
##VAR_NAME=  TIME,          FID/REAL,        FID/IMAG
##SYMBOL=    X,             R,               I
##VAR_TYPE=  INDEPENDENT,   DEPENDENT,       DEPENDENT
##VAR_FORM=  AFFN,          ASDF,            ASDF
##VAR_DIM=   8192,          8192,            8192
##UNITS=     SECONDS,       ARBITRARY UNITS, ARBITRARY UNITS
##FACTOR=    0.0002496,     1,               1
##FIRST=     0,             0,               0
##LAST=      2.0444736,     0,               0
##MIN=       0,             -265810,         0
##MAX=       2.0444736,     288940,          0
$$ Real data points
##PAGE= N=1
##DATA TABLE= (X++(R..R)), XYDATA
$$ [...]
674C529n145K20L031R84p47j873j077K635K676l221l879L593M622l528m788L006
$$ 3529 -1616 -1396 1635 2619 1872 -1 -1078 1557 4233 1012 -2867 726 5348 1820 -2968 38
690C8M561k201m183J361L751m46l096n28K514J287j951j408J272J042k75p35o37
$$ 38 4599 2398 -1785 -424 3327 2881 -215 -743 1771 3058 1107 -301 971 2013 1738 1003 366
707C66M97J406J6k368n51L034R63l436j129L309J095l188j033K757P68k129o33
$$ 366 863 2269 2285 -83 -634 2400 3363 -73 -1202 2107 3202 14 -1019 1738 2506 377 -256
724b56J069J05L73j97j561K3K242j29k854N3L293m38l361L90K811j95k370j81
$$ -256 813 918 1291 1094 -467 -444 1798 1669 -1185 -1132 2161 1723 -1638 -1248 1563 1368 -1002 -1183
742a183J798J61j185l98L43P68P3j171l43J013O17j040q93J127P68j152m06O75
$$ -1183 615 776 -409 -807 -464 304 377 -794 -1137 -124 493 -547 -1440 -313 455 -697 -1103 -428
760d28K07j56j56k83J48M90j52n65J90P62n17m01O26l2k84L83R5n33k8P83J92
$$ -428 -221 -377 -533 -816 -668 -178 -330 -895 -705 57 -460 -861 -235 -267 -551 -168 -73 -606 -634 149 341
781C41r45K0J000q9p73m5P82L91q45l17O98L70j81n03n0P53K66r49j89R76L63
$$ 341 -604 -584 416 327 -446 -491 291 682 -163 -480 218 588 407 -96 -146 607 873 -76 -265 711 1074
802A074r41l90R65K50n78j78J38M20K37p11k96Q26M45q36m73Q98N66q60m84P54
$$ 1074 133 -257 708 958 380 202 340 760 997 286 -10 816 1261 425 -48 850 1416 556 72 826
822H26M23o07n54O05N66p13j98M69J9l34K3M0j26J18K5l10j08L61j45m90K04J95
$$ 826 1249 642 88 693 1259 546 348 817 836 502 525 565 439 557 582 272 164 525 380 -110 94 289
844B89k70j16N7p9nj94n2J53n9l31k7K34j12m03K25J32l30K2O8k2q7j82P2J56
$$ 289 19 -97 -40 -119 -124 -318 -370 -217 -276 -607 -634 -400 -512 -915 -690 -558 -888 -866 -798 -820 -907 -1089 -1017 -861
868h61k13j83K57J15l97q3M26j14m09K87J49k84R7N2j39R2J61j88j31J94K66k80
$$ -861 -1074 -1257 -1000 -885 -1282 -1365 -939 -1053 -1462 -1175 -1026 -1310 -1213 -1161 -1300 -1208 -1047 -1235 -1366 -1172 -906 -1186
890a186j34L41J07j20j78J71L71k05k51L42J92j83o2K07Q5K5J2MK7K26j2j86L25
$$ -1186 -1320 -979 -872 -992 -1170 -999 -628 -833 -1084 -742 -550 -733 -795 -588 -503 -478 -466 -462 -435 -209 -221 -407 -82
913h2J13k22L04l7j97L40K35l32j06M75L10o08J10M93j12j37J34N7LK8K04j2k59
$$ -82 31 -191 113 76 -121 219 454 122 16 491 801 193 303 796 684 547 681 738 741 769 973 961 702
936G02L14L54m38l09O27L12n66l97P56K33q08R0M88j37j0j44j41J78K86l43l66
$$ 702 1016 1370 932 623 1250 1562 996 599 1355 1588 780 870 1358 1221 1211 1067 926 1104 1390 1047 681
957F81K83M53m25l86L39J55k3l20k94M16K97m56m70L19N21k82p17K51O46k50o14
$$ 681 964 1417 992 606 945 1100 1077 757 463 879 1176 720 250 569 1090 808 91 342 988 738 124
978A24R2N22q7m32N5Q2j35L35k73o12N36O51p56q04Q63P49j085n90J009J32p17
$$ 124 216 738 651 219 274 356 221 556 283 -329 207 858 102 -702 161 910 -175 -765 244 376 -341
999c41n2L08j03j7L1l16k43N22L06q40l45R25K15j031l13R84K55j004p1O32k8
$$ -341 -393 -85 -188 -205 -174 -490 -733 -211 95 -745 -1090 -165 50 -981 -1294 -310 -55 -1059 -1130 -498 -526
1020e26k54j5j08K42K46k98m52L68N18l55l88K04K81Q2k28l91L39O48m35p10M55
$$ -526 -780 -795 -903 -661 -415 -713 -1165 -797 -279 -634 -1022 -818 -537 -455 -683 -1074 -735 -87 -522 -1232 -777
1041g77Q17m25p69M83O74n34m23M34J66k37O5J98m40N6R28l92j109Q47J105j122
$$ -777 40 -385 -1154 -671 3 -531 -954 -520 -354 -591 -526 -328 -768 -712 216 -176 -1285 -438 667 -455
1061d55q12J220P24j372j63J171j38q42O88L48o60J32O94l16o74P03Q10j025n98
$$ -455 -1267 -47 677 -695 -858 313 175 -667 21 369 -291 -159 535 219 -455 248 1058 33 -565
1080e65J286L26j070j03J020r0q24L56N36m81J9L28l21j42N23n2m28l6M60k4m22
$$ -565 721 1047 -23 -126 894 804 -20 336 872 391 410 738 417 275 798 746 318 282 742 718 296
1101B96q7K48L33j36o94K57Q61n64p05N56N84o29m70O62J69o66K37M22m67l10
$$ 296 209 457 790 654 -40 217 1078 514 -191 365 949 320 -150 512 681 15 252 674 207 -103
1121a03O85J04q83M2J125l96j367P95J168j135q58J325K72j457L02J265q66q56
$$ -103 582 686 -197 -155 970 574 -793 2 1170 35 -823 502 774 -683 -381 884 18 -838
1139h38J139J10j184M15R85o66r59Q95N87r03l55Q18Q8p39QN42o8m16L06J51l96
$$ -838 301 411 -773 -358 627 -39 -998 -103 484 -419 -774 44 132 -607 -599 -57 -125 -541 -235 -84 -480
1160d80N4M57k34m04M66L23n01j39L73N0j69N7j00K08K11m84k32R48j07p74L28
$$ -480 -426 31 -203 -607 -141 182 -319 -458 -85 -35 -204 -147 -247 -39 172 -312 -544 404 297 -477 -149
1181a49O35n38l50P92n2p60M64N82q05k35J004n0j022K22R42l59q72O35O94q11
$$ -149 486 -52 -402 390 338 -422 42 624 -181 -416 588 538 -484 -262 680 321 -551 84 778 -33
1201c3l85Q99J34q91L08P34p05o24J184R0j224M07R03o64n49P37K82o97kN46l77
$$ -33 -418 481 615 -276 32 766 61 -563 621 711 -513 -106 797 133 -416 321 603 -94 -96 450 73
1222G3j71L45j14k26K45P6k89j22K65L5j97M3pl3R4qj30O8J40m4l86J87M43l12
$$ 73 -98 247 133 -93 152 228 -61 -183 82 117 -80 -37 -44 -77 17 9 -121 -53 87 43 -343 -156 287 -25
1246b5m74O35M8p01J62O37m28m16N87J60p36K10P47o51l79P19j4o60K23O16l79
$$ -25 -499 136 184 -517 -355 282 -146 -562 25 185 -551 -341 406 -245 -624 95 81 -579 -356 260 -119
1267a19m63M50K26n60P2M48j72k93J84K79k58k13M93o8m14L05K35l74j3L60p7
$$ -119 -582 -132 94 -466 -394 54 -118 -411 -227 52 -206 -419 74 6 -408 -103 132 -242 -255 105 28
1288B8l82L16K07m49J11M40m05k18N20o3l65J96L63m25j80N22j6n56K74L91l85
$$ 28 -354 -38 169 -280 -169 271 -134 -352 168 105 -260 -64 299 -126 -306 216 200 -356 -82 309 -76
1309g6j89L97L7l20R6L22k40k65M04M8l41Q1L58k03l13L59K88m63M3L66k07k03
$$ -76 -265 132 169 -151 -55 267 27 -238 166 214 -127 -46 312 109 -204 155 443 -20 23 389 182 -21
1331b1L88L8l19R3J99j24j41K84o5k62K76J39l29K3K93j06j64J62R7k89J3L24
$$ -21 367 405 86 179 378 254 113 397 332 70 346 485 156 179 472 366 202 364 461 172 185 509
1353E09j73l25M04J47m64l0M43m6m43K04L14m28j21M44m4m49K63K90l35k14M21
$$ 509 336 11 415 562 98 68 511 465 22 226 540 112 -9 435 391 -58 205 495 160 -54 367
1374C67Jm61J91M22l97k39K98M9k60L8J67j52j42J22j0k24J72J47k64r9K00q9
$$ 367 368 -93 98 520 123 -116 182 231 -29 9 176 24 -118 4 -6 -230 -58 89 -175 -274 -74 -163
1396a63j72Q6J48l03rK43j98j15K84j27k10O2J92j41k12K95J09l92R6L45k82j29
$$ -163 -335 -249 -101 -404 -413 -170 -368 -483 -199 -326 -536 -474 -282 -423 -635 -340 -231 -623 -527 -182 -464 -593
1418e93L01Q4l32m2M28j37m01L86J48l15j0L32p8k23J21J79j35j51K29Rj65J25
$$ -593 -292 -208 -540 -582 -154 -291 -692 -306 -158 -473 -483 -151 -229 -452 -331 -152 -287 -438 -209 -200 -365 -240
1440b40J70k00rJ71Rj54Q1J13j30J7J48j04J46j0o1J3O8R0j08n5K43o8j40K46
$$ -240 -70 -270 -279 -108 -99 -253 -172 -59 -189 -172 -24 -128 18 8 -53 -40 28 118 10 -45 198 130 -10 236
1464B36M9k04R7J26k5j74R0K36j92q6K09J4j58K6K08m9k03J92N3l14J33J75j05
$$ 236 285 81 178 304 279 105 195 431 239 153 362 376 218 244 452 403 200 392 445 131 264 439 334
1487C34j73J09J31j32j29J87m1n5K6J9m6l8N2k5k1n6Q4o6o9Q8m0j2J2l0L0K4j1
$$ 334 161 270 401 269 140 327 286 231 257 276 230 192 244 219 198 142 226 160 91 179 139 127 139 109 139 163 152
1514A52l7j5O4l7p3N8M5k04O2J54j13n5N2O2j17j5J14j01p9J14K9j44j5R9L6j40
$$ 152 115 100 164 127 54 112 157 -47 15 169 56 1 53 115 -2 -17 97 -4 -83 31 60 -84 -99 0 36 -104
1540a04j08J46N8j74J7J42o5o5L3N4q9j03K10j18MP5j0j05pP3J04j83k4J72o1
$$ -104 -212 -66 -8 -182 -165 -23 -88 -153 -120 -66 -155 -258 -48 -166 -162 -87 -97 -202 -209 -136 -32 -215 -239 -67 -128
1565a28j09qJ33N9k13J5J87r0o2N0K5l0L5N3r8k1M4R3j96k5J30O0m4j41J71L8
$$ -128 -237 -245 -112 -53 -266 -251 -64 -154 -216 -166 -141 -171 -136 -83 -181 -202 -158 -65 -261 -286 -156 -96 -140 -281 -110 -72
1591g2r8o6J73l4p8M0J24p8m7J56p9q9J11O9j28k8J63L1q4n2J78L0j39J9J26n3
$$ -72 -170 -236 -63 -97 -175 -135 -11 -89 -136 20 -59 -148 -37 32 -96 -124 39 70 -14 -66 112 142 3 22 148 95
1617I5j27J15J15o0j70J77P3j96Q8Q0j28MJ08L8j31k8J56Kj31J7J29l6j61J10
$$ 95 -32 83 198 138 -32 145 218 22 110 190 62 66 174 212 81 53 209 211 80 97 226 190 29 139
1641A39O7j39J3R1pj17J28J3n0r7J35K1k43J19J72k00n7J18k6k8r4J01%j00J2
$$ 139 206 67 80 171 164 47 175 188 138 41 176 197 -46 73 245 45 -12 106 80 52 -42 59 59 -41 -29
1666b9NL3n2qM5q8n0J03L4j69k0J59m1o7j7J60n5j87J00P6j47MJ11%r9l3K03o4
$$ -29 -24 9 -43 -51 -6 -94 -144 -41 -7 -176 -196 -37 -78 -145 -162 -2 -57 -244 -144 -68 -215 -211 -100 -100 -199 -232 -29 -93
1694i3j92J64J63k08m4J87Mj97P1K05k00m2J18J06j86R6J07J5k16O5K04j36n6
$$ -93 -285 -121 42 -166 -210 -23 -19 -216 -145 60 -140 -182 -64 42 -144 -48 59 74 -142 -77 127 -9 -65
1717f5J75P2j87n3J97O5j89O9J68j87k3J74P4j34k9R9oq3M5Q1l8o9N1J2K6r8J07
$$ -65 110 182 -5 -58 139 204 15 84 252 65 42 216 290 156 127 226 220 137 182 263 225 156 207 219 245 147 254
1744B54K1j38j0J47L0j80JJ64o6j93J36J45j87j04K00Qj29q5K71p8k18J06J49
$$ 254 275 137 127 274 304 124 125 289 223 30 166 311 124 20 220 228 99 14 285 207 -11 95 244
1767B44j46j01J99j7j62RJ80j42k06K45J36k95J3J77k7j46n2K28j73j67J56Ro9
$$ 244 98 -3 196 179 17 26 206 64 -142 103 239 -56 -43 134 107 -39 -91 137 -36 -203 -47 -38 -107
1790a07pM2J9j04RR4m9n7M3l2J0o0OQ9qj18L8k0L0l4jJ15j27o4J55Oj69R9O0q8
$$ -107 -114 -72 -53 -157 -148 -54 -103 -160 -117 -149 -139 -199 -193 -104 -112 -230 -192 -212 -182 -216 -217 -102 -229 -293 -138 -132 -301 -202 -142 -230
1820b30l5N3J29j95PJ52p1j32Q9J50j16p0R9M5j78O1J34j02j07J45k1j30O3J20
$$ -230 -265 -212 -83 -278 -271 -119 -190 -322 -233 -83 -199 -269 -170 -125 -303 -242 -108 -210 -317 -172 -193 -323 -260 -140
1844a40m5q9J29P1j41K5P7n8j9Q2k2k7N3K4n0j0J11p7L9ON4o5K4R2l2k7P8P9j19
$$ -140 -185 -274 -145 -74 -215 -190 -113 -171 -190 -108 -130 -157 -104 -80 -130 -140 -29 -106 -67 -61 -7 -72 -48 44 12 -15 63 142 23
1873B3M1N9J6r0Q1J22j41q7J99O3j74P4J96j41p9N1L6j06Q2J18j00j3J17l6n3
$$ 23 64 123 139 49 130 252 111 24 223 286 112 186 382 241 162 213 249 143 225 343 243 230 347 311 258
1898B58P0M5m9m0P9n5k5J30q6l5O0mm0K0L1j5o2kM3kn2J9P8j66j2J11q6n0J1N9
$$ 258 328 373 324 284 363 308 283 413 327 292 352 348 308 328 359 344 282 280 323 321 269 288 366 200 188 299 213 163 174 233
1928B33j24l9K34j50j63K00k5j33nR0l9j31Q8J7m3o9J6j9Oo6O7K6j43M5R1j30
$$ 233 109 70 304 154 -9 191 166 33 28 118 79 -52 36 53 10 -59 -43 -62 -56 -122 -55 -29 -172 -127 -36 -166
1954a66l5L3O1o4l3N0o1K3J0m9J2jr1K9P6o6n3J01o2q2Q4J35j42o5J20J2j33M9
$$ -166 -201 -168 -107 -171 -204 -154 -215 -192 -182 -231 -219 -220 -311 -282 -206 -272 -325 -224 -286 -368 -284 -149 -291 -356 -236 -224 -357 -308
1982c08J37q1k4m5J33l1o5M9Q1j46O2J41r9j01R3J83j65q5K22K5j50Q4Pq0J5O6
$$ -308 -171 -252 -276 -321 -188 -219 -284 -235 -154 -300 -238 -97 -196 -297 -204 -21 -186 -271 -49 -24 -174 -90 -83 -163 -148 -82
2008h2O5q4O7K7Km7K5K4k8k0mN8k2NK9K8J5p4J3P8k9l9O8rl4J6k9J43j06pJ21
$$ -82 -17 -101 -34 -7 -5 -52 -27 -3 -31 -51 -55 3 -19 -14 15 43 58 -16 -3 75 46 7 75 66 32 48 19 162 56 49 170
2039A70p0n0J10K5j07QO0Rj44J00M9n2q9R9Q1j07k3K8K6n9M4M1j4o7O0Rl6pM5
$$ 170 100 50 160 185 78 86 146 155 11 111 160 108 19 118 199 92 69 97 123 64 108 149 135 68 128 137 101 94 139
2068A39L6j00L9L0o4RK9m4oK5Op9N5ql8O6Oq7Q0M2j34oJ12l8p0l5J50k6j63O2
$$ 139 175 75 114 144 80 89 118 74 68 93 99 20 75 67 29 95 101 14 94 136 2 -4 108 70 0 -35 115 89 -74 -12
2098a2J01j32rJ06J1j33k0J90j34j54J81K8j15o7J54Kj30N6J09j25k0R5l5q1j3
$$ -12 89 -43 -52 54 65 -68 -88 102 -32 -186 -5 23 -92 -159 -5 -3 -133 -77 32 -93 -113 -18 -53 -134 -147
2123a47J09Kr8J6J25o4p6M4Q3o0K1OQ9j71K1J10l0l1k0N2l2MP8M6p3j3M8M5j26
$$ -147 -38 -36 -134 -118 7 -57 -133 -89 -6 -66 -45 -39 50 -121 -100 10 -20 -51 -71 -19 -51 -47 31 77 4 -9 39 84 -42
2152d2M7M4J8j02J6J39q5k2N7M3j28L1J08k4o8J13J3q9l2R1K8p4oR8j0j14J03
$$ -42 5 49 67 -35 -19 120 35 13 70 113 -15 16 124 100 32 145 158 69 37 128 156 82 76 174 164 50 153
2179A53P8j79%J06m2J7l3R0or0j3K4l4L2l6K1l5n3J42r5j18J18Lo8m6O3O3j18
$$ 153 231 52 52 158 116 133 100 190 184 94 81 105 71 103 67 88 53 0 142 47 -71 47 50 -18 -64 -1 62 -56
2207e6KK7m5pL5k2j0n0O4m1q1P4R1j55l6P7Jr1k9P3L1j04J03J2m5q7J12n7l6L5
$$ -56 -54 -27 -72 -79 -44 -66 -76 -126 -62 -103 -184 -110 -19 -174 -210 -133 -132 -223 -252 -179 -148 -252 -149 -137 -182 -269 -157 -214 -250 -215
2237b15J8n7O0Kj1Lk9J7nOKJ1O2q8RQ8k7j5j1O0l2q4P5Q1k2q3J04m8NM5P6n7j06
$$ -215 -197 -254 -194 -192 -203 -200 -229 -212 -217 -211 -209 -198 -136 -224 -215 -127 -154 -169 -180 -120 -152 -236 -161 -80 -102 -185 -81 -129 -124 -79 -3 -60 -166
2270a66K06J2j54M7J44m7j66J56J50j50m7J91j2j65P9J37q0j03R4J08j36j3J01
$$ -166 40 52 -102 -55 89 42 -124 32 182 32 -15 176 164 -1 78 215 135 32 126 234 98 85 186
2293A86om3j0J21Lj42J11M4q1K0Q6k6j05N0N4n2j3O5o1K1L4qK7N3j82J9J59q0
$$ 186 180 137 127 248 251 109 220 264 183 203 289 263 158 208 262 210 197 262 201 222 256 248 275 328 146 165 324 244
2321B44j05J26J04k58J1J91n7j24P1J24k36M8J10K7j88P3J00q9j40J01J23k08
$$ 244 139 265 369 111 122 313 256 132 203 327 91 139 249 276 88 161 261 172 32 133 256 48
2343D8l0J77k5j89P5J58j75j13J38O4j86rJ90j02j71J38Q4j46J5O1p4j1K5j1n6
$$ 48 18 195 170 -19 56 214 39 -74 64 128 -58 -67 123 21 -150 -12 72 -74 -59 2 -72 -83 -58 -69 -125
2368a25R5q8k3P4q4n0L7J23j54j0J21l3j20J2N0kj56N8J62j55p6J09Q5k34N9J84
$$ -125 -30 -118 -141 -67 -151 -201 -164 -41 -195 -205 -84 -117 -237 -225 -175 -177 -333 -275 -113 -268 -344 -235 -150 -384 -325 -141
2394a41q5j29Q0Q5j16j6J81q3j62J31Q5q7l9J23m7m3J1Q5m4r9J50mn3L9P8J1q8
$$ -141 -226 -355 -275 -190 -306 -322 -141 -224 -386 -255 -170 -257 -296 -173 -220 -263 -252 -167 -211 -310 -160 -164 -217 -178 -100 -89 -177
2421a77K8P0J6j9l9M3J8nKmJ65j11JLO9j35L2J82k9j70J61Q8j38n7K44r1j67J54
$$ -177 -149 -79 -63 -82 -121 -78 -60 -65 -63 -67 98 -13 -12 -9 60 -75 -43 139 110 -60 101 189 51 -6 238 147 -20 134
2449A34R4o0q3J32j8q7j1J94j20j11J04R7p5l2P7K0n5m5J15q3q1J24k2n3M2L0
$$ 134 228 168 85 217 199 112 101 295 175 64 168 265 190 158 235 255 200 155 270 187 106 230 208 155 197 227
2475B27j01l0J13n6k3Q8m7j19J29j7q4L8m4J09j03M5R6j72m9K02j78k5P9kj01
$$ 227 126 96 209 153 130 218 171 52 181 164 80 118 74 183 80 125 221 49 0 202 24 -1 78 76 -25
2500b5KJ35o0j27R3P4j00q3J27N7k23N6J14j22j25J52O0j27J4R7Pr3K5N7r6N4
$$ -25 -23 112 52 -75 18 92 -8 -91 36 93 -130 -74 40 -82 -207 -55 5 -122 -108 -11 -4 -97 -72 -15 -111 -57
2526e7M5j16J1O5j7j4L7j6o3R0K7q7K1J6M4o2nJ10j14m6P9O7o2n0J34p5j24R7
$$ -57 -12 -128 -117 -52 -69 -83 -46 -62 -125 -35 -8 -95 -74 -58 -14 -76 -81 29 -85 -131 -52 15 -47 -97 37 -38 -162 -65
2554f5P9j38PJ75q0j53J02J60k08J9J56J8j90O2Q5m7q4J47J5r1l7R7j01J00m1
$$ -65 14 -124 -117 58 -22 -175 -73 87 -121 -102 54 72 -118 -56 29 -18 -102 45 60 -31 -68 29 -72 28 -13
2579a3J22o8n6M9L4j4Lno7Q4q4l1Q1Ro0N0NN4j31P7O7j36k3J71m7k04J57R0j09
$$ -13 109 41 -15 34 68 54 57 52 -15 69 -15 -46 35 44 -16 34 39 93 -38 39 106 -30 -53 118 71 -133 24 114 5
2608Ej05J84J7j23KJ32m5j71R3R4n4o8J13J9j33J1J40j24o6J00R0j28l6O9K3j18
$$ 5 -100 84 101 -22 -20 112 67 -104 -11 83 29 -39 74 93 -40 -29 111 -13 -79 21 111 -17 -53 16 39 -79
2634g9lO9J4k7l4N5Pj13j9Q8M3j06lL3Lj35J39k3n0m4J49q5k1rJ38j39m4Q1J21
$$ -79 -82 -13 1 -26 -60 -5 2 -111 -130 -42 1 -105 -108 -75 -72 -207 -68 -91 -141 -185 -36 -121 -142 -151 -13 -152 -196 -115 6
2663Fj39n5J73m7j77J06J45r1j10J38N8j17l0J03N3j44J15N6p6j46J49M0j22K7
$$ 6 -133 -188 -15 -62 -239 -133 12 -79 -189 -51 7 -110 -140 -37 16 -128 -13 43 -33 -179 -30 10 -112 -85
2687h5R2J7q5J2J12k5j39O1J19n8l8Q8N8q6k2P8N3j07L1M2J5j07M5J13k5q7L4
$$ -85 7 24 -61 -49 63 38 -101 -40 79 21 -17 71 129 43 21 99 152 45 76 118 133 26 71 184 159 72 106
2714A06J13j13J6Q2P6j91P4M3qr8R2O9r4o0J33Kj36k3J12j6j41Q0J32j34o2J40
$$ 106 219 106 122 204 280 89 163 206 198 100 192 261 167 107 240 242 106 83 195 179 38 118 250 116 54 194
2740A94k3p9k9M0J5m9PO2k5q8M9M5q1j0N0K1p9M2L3J4q7MOj9o1O6M6o8m9M3Rp6
$$ 194 171 92 63 103 118 69 76 138 113 25 74 119 38 28 78 99 20 62 95 109 22 26 32 13 -48 18 64 -4 -53 -10 -1 -77
2772g7O4K4J1j75k2L8L7j6NJ7m8l7O6n7PJ9j3Ol1N0l9L7m3o2J66o5l6P8j12K9
$$ -77 -13 11 22 -153 -175 -137 -100 -116 -111 -94 -142 -179 -113 -170 -163 -144 -157 -151 -182 -132 -171 -134 -177 -239 -73 -138 -174 -96 -208 -179
2802a79N3L1j0l4k4P2o4J3L1Pk0Mlk5P5q3R6p8N7pj6m1QO6J9n9N0q2k8R0Lj6k5
$$ -179 -126 -95 -105 -139 -163 -91 -155 -142 -111 -104 -124 -120 -123 -148 -73 -156 -60 -138 -81 -88 -104 -145 -137 -71 -52 -111 -61 -143 -171 -81 -78 -94 -119
2835a19O9j9J2%K4n4N9O3l5n3L8L7m3Q9rK0q8L5L8K5l2L3l7J3N9K1m0m7O8L0m3
$$ -119 -50 -69 -57 -57 -33 -87 -28 35 0 -53 -15 22 -21 68 59 79 -9 26 64 89 57 90 53 66 125 146 106 59 127 157 114
2866A14kj7l9M9M5j4o6L5LK7n4kj6M3M5p7K2O3j4o8Q5%o6J3L4K7q4Q9L5p1K8r
$$ 114 112 95 56 105 150 136 70 105 108 135 81 79 63 106 151 74 96 159 145 77 162 162 96 109 143 170 86 175 210 139 167 158
2898A58K8o7k1R3J6j35L8J01j14o0O4J8r2LN4j9p2N8k4q9L7M9k6n3n3Q4l8n9M7
$$ 158 186 119 98 191 207 72 110 211 97 37 101 119 27 30 84 65 -7 51 27 -62 -25 24 -2 -55 -108 -24 -62 -121 -74
2927g4L7k0j6K4lj3l5N0pol9K3P6o3o6M8N3l7n8N3mm6NJ22o6j18J20J1j25N5Q6
$$ -74 -37 -57 -73 -49 -52 -65 -100 -50 -57 -63 -102 -79 -3 -66 -132 -84 -31 -68 -126 -73 -77 -123 -118 4 -62 -180 -60 -49 -174 -119 -33
2958c3k3j53R1R0j26KO7J5m3mQ0k3o0J3O7q3L1R1m8m5J3J4L6k3J0N7l6J5k6L9
$$ -33 -56 -209 -118 -28 -154 -152 -85 -70 -113 -117 -37 -60 -120 -107 -40 -123 -92 -1 -49 -94 -81 -67 -31 -54 -44 13 -23 -8 -34 5
2988EN7q1O9o9O5l4K0RJ1k6j1L4q0M2J22q5k7L9j7k7p4J27k4q1N1k7J6r2R7P4
$$ 5 62 -19 50 -19 46 12 32 41 52 26 15 49 -31 11 133 48 21 60 43 16 -58 69 45 -36 15 -12 4 -88 9 83
3018H3j43j0J90j9k21J13Q8k7r4P9K5r2j2J39j13j9P1J3k3k2O5q5L4mL4k3Mm6
$$ 83 -60 -70 120 101 -120 -7 81 54 -40 39 64 -28 -40 99 -14 -33 38 51 28 6 71 -14 20 16 50 27 31 -15
3046a5M7Rl9k4l2J25m8r8J17J7j06%P5oj29P3L4o4NJ03j8j06L0P0l5m5Q9L8j22
$$ -15 32 41 2 -22 -54 71 23 -75 42 59 -47 -47 28 22 -107 -34 0 -64 -59 44 26 -80 -50 20 -15 -60 29 67 -55
3075e5J0P8n3j21J12J14j21o1P4P0o9k5O0K1j09J26k5p2LM1J7K1l0j3%qkp2J18
$$ -55 -45 33 -20 -141 -29 85 -36 -97 -23 47 -22 -47 13 34 -75 51 26 -46 -43 -2 15 36 6 -7 -7 -15 -17 -89 29
3104B9K9l0j02J06j6p2J35j8q9K1J9l5n4J4J44o3j7L9Oo0MN4nj05J03P9j57RJ67
$$ 29 58 28 -74 32 16 -56 79 61 -28 -7 12 -23 -77 -63 81 18 1 40 46 -14 -10 44 39 -66 37 116 -41 -32 135
3133A35j12NOJ08r2p7J08k6ok6R4o6J8OM8o7j2OLJ4m6M1k1L7o5K6O9p1rpL6n9
$$ 135 23 28 34 142 50 -27 81 55 49 23 117 51 69 75 123 56 44 50 53 67 21 62 41 78 13 39 108 37 28 21 57 -2
3165bj5O9mq5pJ52r3n9M9%l1r3J58M4j17L4R2p0p4P9P1j43n1J50m9q0O5J2j9n3
$$ -2 -17 52 48 -37 -44 108 15 -44 5 5 -26 -119 39 83 -34 0 92 22 -52 27 98 -45 -96 54 5 -75 -10 2 -17 -70
3195g0rJ00o5l6O2l0l8M8K5j13J2l0Q9p1RO9k2r2j6J07J0j8p2O4k1rn5N6P6p0
$$ -70 -79 21 -44 -80 -18 -48 -86 -38 -13 -126 -114 -144 -55 -126 -117 -48 -70 -162 -178 -71 -61 -79 -151 -87 -108 -117 -172 -116 -40 -110
3225a10nJ09q8j7M5Jk5k5J46l2p7M3M7l0n3Q4K5m3l7J30j24j1N8N2n8n6J14k7
$$ -110 -115 -6 -94 -111 -66 -65 -90 -115 31 -1 -78 -35 12 -18 -71 13 38 -5 -42 88 -36 -47 11 63 5 -51 63 36
3253C6o2l2J25o9j0j6K9M8r2J7O3o5L0K8Rp5KJ00m8J0nN3lq6R8rpm0JJ14o6J3
$$ 36 -26 -58 67 -2 -12 -28 1 49 -43 -26 37 -28 2 30 39 -36 -34 66 18 28 23 76 73 -13 85 76 69 29 30 144 78 91
3285I1L7Jo6J5N8j4q4L1N5m9m5L4N1q6n2J13j8l3J9pop1Q8j8m5m7J23j0j05j4
$$ 91 128 129 63 78 136 122 38 69 124 75 30 64 115 29 -23 90 72 39 58 51 45 -26 62 44 -1 -48 75 65 -40 -54
3315e4O2PPl6N6Kn3O0M5o6%J8l9K5rM9o7J5J6M7j27L9R9k9r7j4J17q7l4Q3J7n9
$$ -54 8 15 22 -14 42 44 -9 51 96 30 30 48 9 34 25 74 7 22 38 85 -42 -3 96 67 -30 -44 73 -14 -48 35 52 -7
3347gr5Q9Rn1n7K8J18j59N0J04j13QM2l3K2j4n5J8n7N7L1l7m4J16j9m1J5K5N1
$$ -7 -102 -13 -4 -55 -112 -84 34 -125 -75 29 -84 -76 -34 -67 -45 -59 -114 -96 -153 -96 -65 -102 -146 -30 -49 -90 -75 -50 1
3376Ap1NL0K9m4k1P2J5q8L4R2q3n2R0o3L4j06P9N5o1K2k9k5K9JP4p4m9P5k2k6
$$ 1 -70 -65 -35 -6 -50 -71 1 16 -72 -38 54 -29 -81 9 -54 -20 -126 -47 8 -53 -31 -60 -85 -56 -55 19 -55 -104 -29 -51 -77
3407g7M3l8K4j0p8J01m7M3%Q3m3o4P1P9q8J1Q3Nk5l9K9j3L0k6qj7k5R8J7l3l7
$$ -77 -34 -72 -48 -58 -136 -35 -82 -39 -39 44 1 -63 8 87 -1 10 93 98 73 34 63 50 80 54 46 29 4 102 119 86 49
3438D9K7O3r4M2q0L7J2Lj1m3N4k7j4j5%L8m1lmnK3l2KM4Mk0Jl0M9p6J03po4jN7
$$ 49 76 139 45 87 7 44 56 59 48 5 59 32 18 3 3 41 0 -3 -7 -12 11 -21 -19 25 29 9 10 -20 29 -47 56 49 -15 -16 41
3473D1%k5K5J1k9J8j0K8k5j3m1J0l6J18q2j2N9n2L5m1J8N0n5k5r1J32n1P9j04
$$ 41 41 16 41 52 23 41 31 59 34 21 -20 -10 -46 72 -10 -22 37 -15 20 -21 -3 47 -8 -33 -124 8 -43 36 -68
3502f8M7nm1M3J5l1j8m0N3O2m2j2P7n3l1N2O3q2j4R6p7M5m4J02j08K7N7L3j27
$$ -68 -21 -26 -67 -24 -9 -40 -58 -98 -45 17 -25 -37 40 -13 -44 8 71 -11 -25 71 -6 39 -5 97 -11 16 73 106 -21
3531b1PO0oo9L6P2j18QK1mj1n1J16k4o8OR3l6n7O3j4k9o5K9P6m7o1L4P9o9Q7N
$$ -21 -14 46 40 -29 7 79 -39 -31 -10 -14 -25 -76 40 16 -52 -46 47 11 -46 17 3 -26 -91 -62 14 -33 -94 -60 19 -50 37 42
3563D2l0k0j7J29q2n9M1Pm1m6J20J0n1j9Q3lp2nN4j01K0J08r0J5o7J29k8o5K6
$$ 42 12 -8 -25 104 22 -37 4 11 -30 -76 44 54 3 -16 67 64 -8 -13 41 -60 -40 68 -22 -7 -74 55 27 -38 -12
3592a2K6o9j9O7L5q1M4Ln5j8Q7J6n4J3m7J7J3n3O3Q5n8J6m1M1m1P2o5J24j13j9
$$ -12 14 -55 -74 -7 28 -53 -9 -6 -61 -79 8 24 -30 -17 -64 -47 -34 -87 -24 61 3 19 -22 19 -22 50 -15 109 -4 -23
3622b3J6M9l0L0J8q6K3N1l1j5K3K4p1J7L4k7k6KM2k9n2L0m7O0o9L7K1m5K3L0l6
$$ -23 -7 42 12 42 60 -26 -3 48 17 2 25 49 -22 -5 29 2 -24 -22 20 -9 -61 -31 -78 -18 -87 -50 -29 -74 -51 -21 -57
3653e7k1L0Q5j11J7O5K7n7nO4l3NN5k6k3l0N1j7L6l3%P7n8oMM3m0l7j0M3j6m8
$$ -57 -78 -48 37 -74 -57 8 35 -22 -27 37 4 9 64 38 15 -15 36 19 55 22 22 99 41 35 39 82 42 5 -5 38 22 -26
3685b6P8J7p6m1O1Lr0J22K9j23M9L8pl6m4J02m3l4KP3q3N0L5K2j4p3O4m6j5Q9
$$ -26 52 69 -7 -48 13 16 -74 48 77 -46 3 41 34 -2 -46 56 13 -21 -19 54 -29 21 56 78 64 -9 55 9 -6 83
3715H3lq0K9j1L8n4J16m5m0m5R0o7K6p0M3L6p7J7O2p4pj9j2Q8j45Q0K9k4l7RJ00
$$ 83 80 0 29 18 56 2 118 73 33 -12 78 11 37 -33 10 46 -31 -14 48 -26 -33 -52 -64 24 -121 -41 -12 -36 -73 -64 36
3746C6j42K5kP7m7k6O5p9P6l1K5J9m4m0P3L6o6J09n7Qn2L3Qk9K9Jl3MJ7m6L1k0
$$ 36 -106 -81 -83 -6 -53 -79 -14 -93 -17 -48 -23 -4 -48 -88 -15 21 -45 64 7 15 -37 -4 4 -25 4 5 -28 -24 -7 -53 -22 -42
3778d2P3j7j3n5MK2J5l7M2j9PlQn6J7J5L1qm5Q4n8NK8k9nL1rJ9l7O2k6k9nlO8
$$ -42 31 14 1 -54 -50 -28 -13 -50 -8 -27 -20 -23 -15 -71 -54 -39 -8 -16 -61 23 -35 -30 -2 -31 -36 -5 -14 5 -32 30 4 -25 -30 -33 35
3813C5l3j2KK9k9rj1M6Kn0L0L3rm8J8j8K2j9O6o4j4oO4jl8M9J8r3J09m0n6j0O1
$$ 35 2 -10 -8 21 -8 -17 -28 18 20 -30 0 33 24 -24 -6 -24 -2 -21 45 -19 -33 -39 25 24 -14 35 53 -40 69 29 -27 -37 24
3846B4L3j0n5P4k8l0o1Q5L8p5LL2Ql9Q6q5Mk8N6M6l7n5J4K6k2J0L1J9p0L1ok7
$$ 24 57 47 -8 66 38 8 -53 32 70 -5 -2 30 38 -1 85 0 4 -24 32 78 41 -14 0 26 4 14 45 64 -6 25 19 -8
3878hN1rj6j1nj2K8o6O4J5m9L6n7M2m2N6LKn1k0P2l0rJO9j49O1M4L2m0qK7lm4
$$ -8 43 34 18 7 2 -10 18 -48 16 31 -18 18 -39 3 -39 17 20 22 -29 -49 23 -7 -16 -15 54 -95 -34 10 42 2 -6 21 18 -26
3912b6M4J4n7n7R3k8k8L0J4k6m1M9O5j5q5M9P5r7O2p3L8n6M8K9L4j26Q3j5o4J1
$$ -26 18 32 -25 -82 11 -17 -45 -15 -1 -27 -68 -19 46 31 -54 -5 70 -27 35 -38 0 -56 -8 21 55 -71 12 -3 -67 -56
3942e6J9L2q2P5rM2l0r7J41l1m5O1K7n0o0J21k1p7K4L0lo0K2N3Ql2K5l4K4J8k
$$ -56 -37 -5 -87 -12 -21 21 -9 -106 35 4 -41 20 47 -3 -63 58 37 -40 -16 14 11 -49 -27 26 34 2 27 -7 17 35 33
3973C3o0J5LL4Qk5j3K8J3o1P5p9L2K0Jnk1n4J26o6m0j4OM0k5l7O1M5q1K0N6o9
$$ 33 -27 -12 -9 25 33 8 -5 23 36 -25 50 -29 3 23 24 19 -2 -56 70 4 -36 -50 -44 -4 -29 -66 -5 40 -41 -21 35 -34
4005c4j3R8o3K3J7o0k0J10p0MjPkl4K6o4J11q2K4Rj6K6n2k2P6Kj9nPj2K9L4n0
$$ -34 -47 51 -12 11 28 -32 -52 58 -12 -8 -9 -2 -4 -38 -12 -76 35 -47 -23 -14 -30 -4 -56 -78 -2 0 -19 -24 -17 -29 0 34 -16
4038a6l7M2mJ7l6N4rk8n7J41p5j0J0M3%l9mj0j0j3M7J2Qj3k2l2JP8mMl6o2O3J0
$$ -16 -53 -11 -15 2 -34 20 11 -17 -74 67 -8 -18 -8 35 35 -4 -8 -18 -28 -41 6 18 26 13 -9 -41 -40 38 34 38 2 -60 3 13
4072A3m4R7j6p1K8J7k8mJ1L9n9L9rO1r4RL0k2qj2M4K8pr1J12j5m2N2oo4M2kM0
$$ 13 -31 66 50 -21 7 24 -4 -8 3 42 -17 22 13 74 -20 -11 19 -3 -11 -23 21 49 42 -49 63 48 6 58 52 -12 30 28 68
4105F8q3j2O4k8Ll5L8KK1l7MK9m5J3P1j02M4J7J8q3P8jo3j8M1K2n2M3M6o5J0n
$$ 68 -15 -27 37 9 12 -23 15 17 38 1 5 34 -11 2 73 -29 15 32 50 -33 45 44 -19 -37 4 26 -26 17 63 -2 8 3
4137CJ7Rk8kO4q7NP6l9l8l1R3M3j16J01m2l8rK3k7ok6J10p5o2JJ18q7k2P3jm2
$$ 3 20 29 1 -1 63 -24 -19 57 18 -20 -51 42 85 -31 70 28 -10 -19 4 -23 -29 -55 55 -20 -82 -81 37 -50 -72 1 0 -42
4169d2m0O4l3lK3mM2Ln0Qj1lL3K5K4n5L6l7lnL8pm0mL2J1n8N9j9k6%oP3j02M8
$$ -42 -82 -18 -51 -54 -31 -35 7 10 -40 -32 -43 -46 -13 12 36 -19 17 -20 -23 -28 10 3 -37 -41 -9 2 -56 3 -16 -42 -42 -48 25 -77 -29
4204b9K4k6m4L5P6p0n5K5O5n8J0Q3p1P9q5J01l3l5M0O9q4j7k9Q0k5OJ0PpjP6q8
$$ -29 -5 -31 -75 -40 36 -34 -89 -64 1 -57 -47 36 -35 44 -41 60 27 -8 32 101 17 0 -29 51 26 32 42 49 42 41 117 29
4236B9J0j0M7n4n3L8L5K1k2L7n4m3%Q5o3j4K5l1mO2k5j5qMJ01q9n0O3rJk2N8N1
$$ 29 39 29 76 22 -31 7 42 63 41 78 24 -19 -19 66 3 -11 14 -17 -21 41 16 1 -7 -3 98 9 -41 22 13 14 -8 50 101
4269A01p1nM7n7Q1p2l5J7K1J6J3k5n7L2lqJ2j4Jo1K3M5n2l7O9m1n9N9pQpNJ8k0
$$ 101 30 25 72 15 96 24 -11 6 27 43 56 31 -26 6 3 -5 7 -7 -6 -67 -44 1 -51 -88 -19 -60 -119 -60 -67 -59 -66 -61 -43 -63
4303f3K6k9Q2r8L8J7l9O2m8M2n0M5k5P2n9LJ1%N5m8N6o6K4l6K4K3q4L6j1j1K1
$$ -63 -37 -66 16 -82 -44 -27 -66 -4 -52 -10 -60 -15 -40 32 -27 -24 -13 -13 42 -6 50 -16 8 -28 -4 19 -65 -29 -40 -51 -30
4334c0jj1j0k2N1m0pM9j0n9M9o5N4j0rJ9N4q6j2R2Pp4J7M5rN6m8O6kn3l4R7m2
$$ -30 -31 -42 -52 -74 -23 -63 -70 -21 -31 -90 -41 -106 -52 -62 -71 -52 2 -84 -96 -4 3 -71 -54 -9 -18 38 -10 56 54 1 -33 64 22
4367B2NN5m4k1p9J27j3n8k8J26o7r5Q6KJ2k8M4m4o6P7K2n7K9k2K4n4rj4J6N4n3
$$ 22 27 82 38 17 -62 65 52 -6 -34 92 25 -70 16 18 30 2 46 2 -64 13 35 -22 7 -15 9 -45 -54 -68 -52 2 -51
4398e1L8M1o1M2J8o5P4m0N3k0l6J06o7j1N8l5j0M0o4K3J6n8L1L0O0r7O9j5n6j7
$$ -51 -13 28 -33 9 27 -38 36 -4 49 29 -7 99 32 21 79 44 34 74 10 33 49 -9 22 52 112 15 84 69 13 -4
4428dJ1M0n9J3J6o0L3n6R6j5l2qL3r8N5NRNj6M6k0%n9J04r4PM5j4k5K2k8Q3o9
$$ -4 7 47 -12 1 17 -43 -10 -66 30 15 -17 -25 8 -90 -35 -30 -21 -16 -32 14 -6 -6 -65 39 -55 -48 -3 -17 -42 -20 -48 35 -34
4461c4qP6m4r0P3P8n3j4%nm7K5N6lm8N3j2Jl4L2n2J6K8Ql0k6L6l4Lj1M6ML3j18
$$ -34 -42 34 -10 -100 -27 51 -2 -16 -16 -21 -68 -43 13 10 -38 15 3 4 -30 2 -50 -34 -6 2 -28 -54 -18 -52 -49 -60 -14 -10 23 -95
4495i5Q4O1m7m3N5m0k5N6QpM4K0j0j5l4L7j1m7J8K5J9m8nM7n9M8oJ9j5p2J37r2
$$ -95 -11 50 3 -40 15 -25 -50 6 14 7 51 71 61 46 12 49 38 -9 9 34 53 5 0 47 -12 36 30 49 34 -38 99 7
4527GpPJ0m2M5K1Ml6K5J5M5q5l4L7lk0L5m8L1NJ7m6M3j9j2J7n9M6l7L3k5L9m2
$$ 7 0 7 17 -25 20 41 45 9 34 49 94 9 -25 12 9 -11 24 -24 7 12 29 -17 26 7 -5 12 -47 -1 -38 -5 -30 9 -33
4560c3K2LN4j0m6K3j0rMj4N7mn1K7Jn4j0O2k0o6M9k2M9r4O4Pm4N0k6nKq1K9O1
$$ -33 -11 -8 46 36 -10 13 3 -6 -2 -16 41 37 -14 13 14 -40 -50 12 -8 -74 -25 -47 2 -92 -28 -21 -65 -15 -41 -46 -44 -125 -96 -35
4594c5l6L0k2N0j9k8Oj5qO1LK9o8M8ll7N9jj7J0M5m6jj1j4K4K7j1K2q2R5n3M3
$$ -35 -71 -41 -63 -13 -32 -60 -54 -69 -77 -16 -13 16 -52 -4 -7 -44 15 14 -3 7 52 6 5 -6 -20 4 31 20 42 -40 55 2 45
4627D5l5q7K5N0L3n2L2Qk9MKK1n6M4j5L2l6o7P6L6n1k2M0L1m9jN4lm8N8K8r8L7
$$ 45 10 -77 -52 -2 31 -21 11 19 -10 -6 -4 17 -39 5 -10 22 -14 -81 -5 31 -20 -42 -2 29 -20 -21 33 30 -18 40 68 -30 7
4660GP9k9Qj5M5o5nM0J6m6M7m0j5K8j4mk8k4P3m7l8O9K4j15M3JK8J3p6j9Q6o2
$$ 7 86 57 65 50 95 30 25 65 81 35 82 42 27 55 41 37 9 -15 58 11 -27 42 66 -49 -6 -5 23 36 -40 -59 27 -35
4692c5pO8J0o7J1M7k6k7N8k9M0k1k2P8l3m3J0l7K7P3j2m6m9O8KjKQo0k3K5Qqm6
$$ -35 -42 26 36 -31 -20 27 1 -26 32 3 43 22 0 78 45 2 12 -25 2 75 63 17 -32 36 38 37 39 47 -13 -36 -11 -3 -11 -57
4726e7J4K9p6nJ1L2L2k7l8N6n1RM1j8m3P4l9O1m6K3%Oj6kM8j0pRm3N5j3N0lm9
$$ -57 -43 -14 -90 -95 -84 -52 -20 -47 -85 -29 -80 -71 -30 -48 -91 -17 -56 5 -41 -18 -18 -12 -28 -30 18 8 1 10 -33 22 9 59 56 7
4760GMOlk4L9l6n2M7LL9k2j00Q9l7j4j2P8n2L6K8km2l8O7m2L7L3J0n1m1J27k0
$$ 7 11 17 14 -10 29 -7 -59 -12 -9 30 8 -92 -3 -40 -54 -66 12 -40 -4 24 22 -20 -58 9 -33 4 37 47 -4 -45 82 62
4792F2n8L3l1L1o3N4L0L6r3N3k5J9k6P8p0j2P6J4mj33P4K3m6m1N0m6Jk7L8PoL6
$$ 62 4 37 6 37 -26 28 58 94 1 54 29 48 22 100 30 18 94 108 104 -29 45 68 22 -19 31 -15 -14 -41 -3 4 -2 34
4824C4n8m8Q3j7rkk5M0Jj1k6P5j1K1Kj7p1M7M0q1N9n1Rk2L7K6J3l2J3qK5k7n9
$$ 34 -24 -72 11 -6 -15 -17 -42 -2 -1 -12 -38 37 26 47 49 32 -39 8 48 -33 26 -25 -16 -38 -1 25 38 6 19 11 36 9 -50
4857e0J0nj5k7J3O4j9P4m7k4k5OJ4j9k5K7Q2q3J2L0l2j2jQ3m5j3pl6NJ1Q6l7k2
$$ -50 -40 -45 -60 -87 -74 -10 -29 45 -2 -26 -51 -45 -31 -50 -75 -48 34 -49 -37 -7 -39 -51 -52 31 -14 -27 -34 -70 -65 -54 32 -5 -27
4890b7K2J1l5J8QK0n5m4J08n2K8l4K2K4J1n9rN3Lm5O3J5m4Q1m3k8k7L8l0N5l3
$$ -27 -5 6 -29 -11 -3 17 -38 -82 26 -26 2 -32 -10 14 25 -34 -43 10 13 -32 31 46 2 83 40 12 -15 23 -7 48 15
4921A5l6M5j4k8J7M3Lj4jm4O3jj9j11J40n8QqJ5j5L3m6J3KQj5jK3n9O3L7n8QJ6
$$ 15 -21 24 10 -18 -1 42 45 31 30 -14 49 48 29 -82 58 0 8 0 15 0 33 -13 0 2 10 -5 -6 17 -42 21 58 0 8 24
4955B4JJ6k1j2K5J6k8j0%j5PKRJlM3o7JkK4k0K5K6k6ll5J08j43L9l0L7n8N6P0
$$ 24 25 41 20 8 33 49 21 11 11 -4 3 5 14 15 12 55 -12 -11 -13 11 -9 16 42 16 13 -22 86 -57 -18 -48 -11 -69 -13 57
4989E7o3m1M2K3j1j05M8N2k1OL8l8m0K6L5j8j9j3P2j06J3Q3l0l5R5jKo3m8L6l2
$$ 57 -6 -47 -5 18 7 -98 -50 2 -19 -13 25 -13 -53 -27 8 -10 -29 -42 30 -76 -63 20 -10 -45 50 49 51 -12 -60 -24 -56
5020e6l2M8L8j0m6O7L3o7J7l8M2mk4j5K1K0j6M3p7K1M9k4K7M4qm1n3J2J6M1Rm7
$$ -56 -88 -40 -2 -12 -58 9 42 -25 -8 -46 -4 -8 -32 -47 -26 -6 -22 21 -56 -35 14 -10 17 61 53 12 -41 -29 -13 28 37 -10
5052a0O0r6J17N3j12K5o1O9J3r5M3N8o8mK2K8m8L7k3j4pN3n0L7o8J9P6q1k4J11
$$ -10 50 -46 71 124 12 37 -24 45 58 -37 6 64 -4 -8 14 42 -6 31 8 -6 -13 40 -10 27 -41 -22 54 -27 -51 60
5082F0j5n8l8Q4K2jklq8L6K5%J5l2rL6%j7PL6j41R6L4o3k2J9N1n2L5Rp8N3n2O3
$$ 60 45 -13 -51 33 55 54 52 49 -39 -3 22 22 37 5 -4 32 32 15 22 58 -83 13 47 -16 -38 -19 32 -20 15 24 -54 -1 -53 10
5116A0J1J7p1J2J3Qk2M3j12N7L5j3J2m0L4M4n3Rjl7k2L4RN2j2n4N8n5L8M5Or9
$$ 10 21 38 -33 -21 -8 0 -22 21 -91 -34 1 -12 0 -40 -6 38 -15 -6 -7 -44 -66 -32 -23 29 17 -37 21 -34 4 49 55 -44
5148d4j2P3p4P5M2q5J7%l6N3l0l4K7L8J4k7K6p3N2j6l7L9k7qNO3l4M4p3j6O4l
$$ -44 -56 17 -57 18 60 -25 -8 -8 -44 9 -21 -55 -28 10 24 -3 23 -50 2 -14 -51 -12 -39 -47 -42 21 -13 31 -42 -58 6 3
5180Ck1LK6J7k1n2J6M1r1M1P7l0k2LrJ05j08M2k9j1JL8j0l4j8M9Om8%M7P0j55
$$ 3 -18 -15 11 28 7 -45 -29 12 -79 -38 39 9 -13 -10 -19 86 -22 20 -9 -20 -19 19 9 -25 -43 6 12 -36 -36 11 81 -74
5212g4O8L5m9Ml2Q4p1M0j1M0m6N3OjMk7N0q5M6l4pMk2K1K7l3oM2k7JJ5Rj8M0j
$$ -74 -6 29 -20 -16 -48 36 -35 5 -6 34 -12 41 47 46 50 23 73 -12 34 0 -7 -3 -25 -4 23 -10 -16 26 -1 0 15 24 6 46 45
5247D5p7LqM2m2O0j5K3r7K6L1K3l4mM9o5M2LKj9k8N9M4j07PnJ7K0m8L1m7M7NJ5
$$ 45 -32 -29 -37 5 -37 23 8 31 -66 -40 -9 14 -20 -24 25 -40 2 5 7 -12 -40 19 63 -44 -37 -42 -25 -5 -53 -22 -69 -22 -17 -2
5281bmL2n4NkMJ1k3J4j7N4p9M0K0k6J8rOJ6l7nM3m9K4M0n0NL3K3%l6k3L6m7K1
$$ -2 -6 26 -28 -23 -25 -21 -10 -33 -19 -36 18 -61 -21 -1 -27 -9 -18 -12 4 -33 -38 5 -44 -20 20 -30 -25 8 31 31 -5 -28 8 -39 -18
5316a8L5J3j8J3nO8o5kJ8mj5K5l4O3p3M0m9KL6L8k6q8R6J0m3J2J4k8o7J2M7J7
$$ -18 17 30 12 25 20 88 23 21 39 35 20 45 11 74 1 41 -8 -6 30 68 42 -46 50 60 17 29 43 15 -52 -40 7 24
5348B4r5N7qO0Lj0K4o9j7N5N0n3k2M1J5n8J7K8K7l0n8L0M1l9N1j6rp7O5j8m3O7
$$ 24 -71 -14 -22 38 41 31 55 -14 -31 24 74 21 -1 40 55 -3 14 42 69 39 -19 11 52 13 64 48 39 -38 27 9 -34 33
5380C3j9r0J08o0P2o6j0K7j9m2NK4J4k7K5j6K0j3J1lQJk2k6J28j05J2K6o3P5m7
$$ 33 14 -76 32 -28 44 -22 -32 -5 -24 -66 -61 -37 -23 -50 -25 -41 -21 -34 -23 -26 -18 -17 -39 -65 63 -42 -30 -4 -67 8 -39
5411c9N8l1l5P0qrp6N2k1L4K2N3o5k3M2l3k1j1L6K9j12M4K2k9Pj8L0j3n5J21m2
$$ -39 19 -12 -47 23 15 6 -70 -18 -39 -5 17 70 5 -18 24 -9 -30 -41 -5 24 -88 -44 -22 -51 -44 -62 -32 -45 -100 21 -21
5442b1K5J5k8k8l2P9j1k0NPpl0K0P5Nm1l3PkK9mJ3%oK4k6L0Kp1N5k8oP1r2N6n1
$$ -21 4 19 -9 -37 -69 10 -1 -21 -16 -9 -16 -46 -26 49 54 13 -20 -13 -15 14 10 23 23 17 41 15 45 47 -24 31 3 -3 68 -24 32 -19
5478a9rL1k7J35j31L2n0OJ7L3J2m8nl0Q6n5J7k8K8m3J4O5KMn6k0Q6p6oJ4Q8q2
$$ -19 -28 3 -24 111 -20 12 -38 -32 -15 18 30 -18 -23 -53 33 -22 -5 -33 -5 -48 -34 31 33 37 -19 -39 47 -29 -35 -21 67 -15
5510a5K5N2m5L0l5mnOk7M5l6QJ4oL5k5k1K1o4N1k0L0j8j7M3j12J8L2J3nj3O8n3
$$ -15 10 62 17 47 12 8 3 9 -18 27 -9 -1 13 7 42 17 -4 17 -47 4 -16 14 -4 -21 22 -90 -72 -40 -27 -32 -45 23 -30
5543c0K3J4qkm1M8l7L1K3l9J6k8K0MoL4k4j0Jq1J19k9l8K8m7M6mlM4l4n0J06r4
$$ -30 -7 7 -1 -3 -44 4 -33 -2 21 -18 -2 -30 -10 -6 -12 22 -2 -12 -11 -92 27 -2 -40 -12 -59 -13 -17 -20 24 -10 -60 46 -48
5576d8KKN3J6p5N8n0M3N6o0Kon3P1o0nN9Jj9J0j9Q2n6qO0j4l0M6l4l4l5L7J1J2
$$ -48 -46 -44 9 25 -50 8 -42 1 57 -3 -1 -7 -60 11 -49 -54 5 6 -13 -3 -22 60 4 -4 56 42 12 58 24 -10 -45 -8 3 15
5610A5k8JP2k0n3L6j9NMJ4m2N3m2R8j24nL9kj3l9L6M3m9k4M9J1l3M0l1L6o4j3
$$ 15 -13 -12 60 40 -13 23 4 9 13 27 -15 38 -4 94 -30 -35 4 2 -11 -50 -14 29 -20 -44 5 16 -17 23 -8 28 -36 -49
5642d9Q7p0O6Kn3j1N2k9rM3k3K2K0m6L4j2l7%N6k9qKmKm2J9M5l9NPlo1O6m0O2
$$ -49 38 -32 34 36 -17 -28 24 -5 -14 29 6 28 48 2 36 24 -13 -13 43 14 6 8 4 6 -36 -17 28 -11 -6 1 -2 -63 3 -37 25
5677B5p2L6Pm2M3J6nm8L1K2J4q0JL9J9l5J9j5O4o4O2k5m4P4m7j2Q1n1J7n1k9M8
$$ 25 -47 -11 -4 -46 -3 13 8 -40 -9 13 27 -53 -52 -13 6 -29 -10 -25 39 -25 37 12 -32 42 -5 -17 64 13 30 -21 -50 -2
5709bRm1K1N0l1N7j27L1O5k7j1N8q6L6k1m3M5j1j0O5m8l6N7o2L8J9RPo4O1l4J1
$$ -2 7 -34 -13 37 6 63 -64 -33 32 5 -6 52 -34 2 -19 -62 -17 -28 -38 27 -21 -57 0 -62 -24 -5 4 11 -53 8 -26 -15
5741a5L0K8m5j9J2L3n1L1k3M2k4m0Q7l9q5P1L7o5M9jJ9m2onJ08j45N9mM1n5%N2
$$ -15 15 43 -2 -21 -9 24 -27 4 -19 23 -1 -41 46 7 -78 -7 30 -35 14 13 32 -10 -16 -21 87 -58 1 -3 38 -17 -17 35
5773C5J4l9jk3k3M0mRN1o5k0K7n3N8RL3l6%ml7L9m3N8l2L1Nj5o3K8N8n8k6L2N2
$$ 35 49 10 9 -14 -37 3 -1 8 59 -6 -26 1 -52 6 15 48 12 12 8 -29 10 -33 25 -7 24 29 14 -49 -21 37 -21 -47 -15 37
5807C7q2K6jO5l5n8M4%p6N1M9om8O5j11P2m9qK9%j1O5p6j5J00k8k7n5P4J8n4J6
$$ 37 -45 -19 -20 45 10 -48 -4 -4 -80 -29 20 14 -34 31 -80 -8 -57 -65 -36 -36 -47 18 -58 -73 27 -1 -28 -83 -9 9 -45 -29
5839b9j6N4kl9K7k2LJ1m2L6MK0Nn1L6k2L3m6Q6n2m9Q6m1J6k4j2J1Q5j11l1J35
$$ -29 -45 9 7 -32 -5 -27 -24 -13 -55 -19 -15 5 10 -41 -5 -27 6 -40 46 -6 -55 31 -10 6 -18 -30 -19 66 -45 -76 59
5870E9n2q3M9L8l8O2l5k7PL6jk8Pk2J9J3l9O0J6m5QM4j4l6j3M2k2Lk7J3Qpj8O
$$ 59 7 -76 -27 11 -27 35 0 -27 -20 16 15 -13 -6 -28 -9 4 -35 25 41 -4 4 48 34 -2 -15 27 5 8 -19 -6 2 -5 -23 -17
5904a7L0k9J2K1l5RmJ9q4J35k1l8j2j0K5QJL9p0J0j6K4qK2q9M3L1j2KN5j09J27
$$ -17 13 -16 -4 17 -18 -9 -13 6 -78 57 36 -2 -14 -24 1 9 10 49 -21 -11 -27 -3 -11 11 -78 -35 -4 -16 -14 41 -68 59
5936E9o5J8%m7N4l8QpO2l4n5J2J5j3LK5%o2N0J3L9r6rQ6m2QO5m9p3nJ46p9n8N5
$$ 59 -6 12 12 -35 19 -19 -11 -18 44 10 -45 -33 -18 -31 -28 -3 -3 -65 -15 -2 37 -59 -68 18 -24 -16 49 0 -73 -78 68 -11 -69 -14
5970a4M5q3KR9j6r1L8MM2q9M1K8o%K2m4k1J5N0M4p4j1J4K6Prn0Rj6j3K3N8o0J1
$$ -14 31 -52 -50 49 33 -58 -20 -16 26 -63 -22 6 0 0 22 -22 -43 -28 22 66 -8 -19 -5 21 28 19 -31 -22 -38 -51 -28 30 -30 -19
6004a9L5Ol9J7K5r3JN7N6q2p3J03K1j6m0j1L8j7N8rk6M4l5M3p0K5K9m7k1K7L4
$$ -19 16 22 -17 0 25 -68 -67 -10 46 -36 -109 -6 15 -1 -41 -52 -14 -31 27 18 -8 36 1 44 -26 -1 28 -19 -40 -13 21
6035B1LLj1J2p2J5L1K1Ml6N4j8k4M0k9m6jM5J7j1k7J5OK8n9OLj6L4K8p3L1rN6
$$ 21 24 27 16 28 -44 -29 2 23 27 -9 45 27 3 43 14 -32 -33 12 29 18 -9 6 12 40 -19 -13 -10 -26 8 36 -37 -6 -15 41
6069D1n9M4On9N8m1K7j9j1l7R5j07M0K1J0n1j9Q2j0n9J6L7rk4N8Lm4mm0R1q0k5
$$ 41 -18 26 32 -27 31 -10 17 -2 -13 -50 45 -62 -22 -1 9 -42 -61 21 11 -48 -32 5 -4 -28 30 33 -11 -15 -55 36 -44 -69
6101f9Q3p9L2J9J0J7n3P5j3l1J4L6q9LK2Jk7L5nL7Pn8R3m2q3N7K7j2jmllk4Q3
$$ -69 14 -65 -33 -14 -4 13 -40 35 22 -9 5 41 -48 -45 -23 -22 -49 -14 -19 18 25 -33 60 18 -65 -8 19 7 6 2 -1 -4 -28 55
6135E5k6j3n4K0N6j8Pj6l2N7n8L5j8M8Rn2M2p3j6P2M8j23Q0l5L4l3J0J0l3j4M6
$$ 55 29 16 -38 -18 38 20 27 11 -21 36 -22 13 -5 43 52 0 42 -31 -47 25 73 -50 30 -5 29 -4 6 16 -17 -31 15
6166A5q7O0lL4n1kMPN3m0P1m4J9J9k6n2M4kL7p4K6m0J4P2n9Jn9PJ10n5k4N0m7
$$ 15 -72 -12 -15 19 -32 -34 -30 -23 30 -10 61 17 36 55 29 -23 21 19 56 -18 8 -32 -18 54 -5 -4 -63 -56 54 -1 -25 25 -22
6199b2M5o2J8K8m7jL8K6p7MN6Nm5L6l5K4j2RNj9N3J7j7q6M0QK0r8J22p4N2j0L0
$$ -22 23 -39 -21 7 -40 -41 -3 23 -54 -50 6 11 -34 2 -33 -9 -21 -12 -7 -26 27 44 27 -59 -19 -11 9 -89 33 -41 11 1 31
6232C1n4N0Kn4K7n2P8j7j1JJ1k8j1K5k5MM4K6l3J0j4J1m1k8k3J07q4NJ0jj9M7
$$ 31 -23 27 29 -25 2 -50 28 11 0 1 12 -16 -27 -2 -27 -23 21 47 14 24 10 21 -20 -48 -71 36 -48 -43 -33 -34 -53 -6
6264fK6l3Nn1J03j1ro0O4l9KM3qm0L0oK5n7K5m9O1J0k4m4L3M2o5L8r4N0K2P3l7
$$ -6 20 -13 -8 -59 44 33 24 -36 28 -11 -9 34 26 -14 16 10 35 -22 3 -46 15 25 1 -43 -10 32 -33 5 -89 -39 -17 56 19
6297A9k0J0l3L1Lj3j1j4L3k8L0LPJ2Qm3N7n6m0j6P3L0n1LK9N2o2No3O8k0Qk3k2
$$ 19 -1 9 -24 7 10 -3 -14 -28 5 -23 7 10 17 29 37 -6 51 -5 -45 -61 12 42 -9 -6 23 75 13 18 -45 23 3 11 -12 -34
6331c4P0m3K9Kn0J04q6p1R1QK3k7K6l2qrjN8p2J4k3M2l7m4P2L3m7J6J3j2K8oo0
$$ -34 36 -7 22 24 -26 78 -8 -79 12 20 43 16 42 10 2 -7 -8 50 -22 -8 -31 11 -26 -70 2 35 -12 4 17 5 33 27 -33
6364c3L2l0RJ0j11R5M7m5m7K8N2m1N9ol1j4nj6L9k9L7k6K4l6k1M0PJ7M7p0kP3
$$ -33 -1 -31 -22 -12 -123 -28 19 -26 -73 -45 7 -34 25 19 -12 -26 -31 -47 -8 -37 0 -26 -2 -38 -59 -19 -12 5 52 -18 -20 53
6396E3j14R5j5l5l3Q5n5Lm8N5L4l0l3qQ7n0RJ5j0N8r5K9Nnk1NP8p8M6m4L5k1n8
$$ 53 -61 34 19 -16 -49 36 -19 -16 -64 -9 25 -5 -38 -46 41 -9 0 15 5 63 -32 -3 2 -3 -24 -19 59 -19 27 -17 18 -3 -61
6429f1O3Nm2QK9M3o5oO8n3l8L8nnkJ4O8q6O8n6M9n6j9L2N7k8N0j0n1j3O7o5o0
$$ -61 2 7 -35 -27 2 45 -20 -26 42 -11 -49 -11 -16 -21 -23 -9 59 -27 41 -15 34 -22 -41 -9 48 20 70 60 9 -4 63 -2 -62
6462f2P8nK8q0P5j8jll4K4M7k0j8k4J8J8k1K4n6jM2JK9j6mm2M5j5R%L9m6L5K5
$$ -62 16 11 39 -41 34 16 15 12 -22 2 49 29 11 -13 5 23 2 26 -30 -31 11 12 41 25 21 -21 24 9 18 18 57 11 46 71
6496G1o9N5p3MJ6k5O2k7m5N1n6pO7k6N1j4l0NL2l6J5l1j4l4N1PmL2k9k2Q4n3j0
$$ 71 2 57 -16 -12 4 -21 41 14 -31 20 -36 -43 24 -2 49 35 5 10 42 6 21 -10 -24 -58 -7 0 -4 28 -1 -23 61 8 -2
6529bK5k6kJ3K6J8n7j4P6o3J0j7M5l7J6j0J5k7k8P6l8k1k2J3J5NJL9j4J5n3P4
$$ -2 23 -3 -5 8 34 52 -5 -19 57 -6 4 -13 32 -5 11 1 16 -11 -39 37 -1 -22 -44 -31 -16 -11 -10 29 15 30 -23 51
6561E1m1l5k0L5K3o2O1l8onL0l1K9kK1j1j7l1Q5n2n9Q1K0r7Q4O0k0p3j1J1K7m7
$$ 51 10 -25 -45 -10 13 -49 12 -26 -32 -37 -7 -38 -9 -11 10 -1 -18 -49 36 -16 -75 6 26 -71 13 73 53 -20 -31 -20 7 -40
6593d0M4m6j7N2N5o9K5J1JJl1n7P7jk0Qj5J9kN6j5m2K3j3Ro2OM4rl7J15k3o3J1
$$ -40 4 -42 -59 -7 48 -21 4 15 16 17 -14 -71 6 5 -15 -7 -22 -3 -5 51 36 -6 17 4 13 -49 -43 1 -8 -45 70 47 -16 -5
6627e%O1q5N1J0k0J6m3K2o8L7J2j0K9l2L1m7K5nJ6MKMM8j18P5Rk4Pj0%M2l8KJ9
$$ -5 -5 56 -29 22 32 12 28 -15 7 -61 -24 -12 -22 7 -25 6 -41 -16 -21 -5 -1 1 5 53 -65 10 19 -5 2 -8 -8 34 -4 -2 17
6662A7q0LN3Rk8JKl7J03m6J6p3M0JK6n9j2O9mLj9M9nQl0Ml9J6%N1o8K7OrL0kL6
$$ 17 -63 -60 -7 2 -26 -25 -23 -60 43 -3 13 -60 -20 -19 7 -52 -64 5 1 4 -15 34 29 37 7 11 -28 -12 -12 39 -29 -2 4 -5 25 23 59
6699E9p7lL5J8l9l8O9j3Jj4K3qJ3k4J5l0k0R5L6q5km5J9k3K0K0k0n0Q4m2N0l8
$$ 59 -18 -21 14 32 -7 -45 24 11 12 -2 21 13 26 2 17 -13 -33 62 98 13 11 -34 -15 -38 -18 2 -18 -68 16 -26 24 -14
6731a4k6M8k5pN3J8m6K3m4L3L3J4o0lrM7l1j6J1oK7m9J13o9ko3k3J00ml5KJ4Q
$$ -14 -40 8 -17 -24 29 47 1 24 -20 13 46 60 0 -3 -12 35 4 -12 -1 -7 20 -29 84 15 13 -50 -73 27 23 -12 -10 4 12
6764A2l9Q4n9l2k1N5Jk5K0jm5Q1j3K9m1j4j4rQPM5j5k7J5MK5o0O1o2%M0j0kk3
$$ 12 -27 57 -2 -34 -55 0 1 -24 -4 -5 -50 31 18 47 6 -8 -22 -31 -23 -16 29 14 -13 2 6 31 -29 32 -30 -30 10 0 -2 -25
6798b5L5JK4m6k0LJ5m1J14l4k7j0N9J9j08oO6j5k9P5j08P7j5j6j0J4L1m5n7O4
$$ -25 10 11 35 -11 -31 -28 -13 -54 60 26 -1 -11 48 67 -41 -47 19 4 -25 50 -58 19 4 -12 -22 -8 23 -22 -79 -15
6828a5jL2m1K0m3Q5n1j6J8L8j2n1L5oK2L4o7J0j2j3K7l4O8k5p0L1N9lj6Ll8K9
$$ -15 -16 16 -25 -5 -48 37 -14 -30 -12 26 14 -37 -2 -8 14 48 -19 -9 -21 -34 -7 -41 27 2 -68 -37 22 19 3 6 -32 -3
6860cl2L8K3k7j4lkP6l5M0m6K9m9oJM3n7oK5QOk7J7L3l9N0l5JLK1l7L1rl4L0n3
$$ -3 -35 3 26 -1 -15 -18 -20 56 21 61 15 44 -5 -11 -10 33 -24 -30 -5 3 9 -18 -1 32 -7 43 8 9 12 33 -4 27 18 -16 14 -39
6896c9J1M1Jm1M8l3N4n6RlrM2Knn5J6M3k3j1k9N4Lm4K8j8k0P1j2n7J3P4j21K0
$$ -39 -28 13 14 -27 21 -12 42 -14 -5 -8 -17 25 27 22 -33 -17 26 3 -8 -37 17 20 -24 4 -14 -34 37 25 -32 -19 55 -66 -46
6929d6L6P4K1q2j2O3p3QM6J8m8J6M3k9j1Lj9o6L4K4rl1M4L1m6NL4p2J2kR8k0o6
$$ -46 -10 64 85 3 -9 54 -19 -11 35 53 5 21 64 35 24 27 8 -58 -24 0 -9 -40 4 35 -11 -6 28 -44 -32 -34 64 44 -22
6962b2JN4J0j4j3k1m1P9Lm0kM2j4mj5O5n1m1N6o8J02j21P6J5o2L7o7Q4m1l1J6
$$ -22 -21 33 43 29 16 -5 -46 33 36 -4 -6 36 22 18 3 68 17 -24 32 -36 66 -55 21 36 -26 11 -56 28 -13 -44 -28
6993b8j0J8k1N1L6m3l3P5l3k6JJ6k0jpnN4o3J7K8l3J7j0j1L0K2k5mPNM1k9J5l5
$$ -28 -38 -20 -41 10 46 3 -30 45 12 -14 -13 3 -17 -18 -25 -30 24 -39 -22 6 -27 -10 -20 -31 -1 21 -4 -8 -1 4 45 16 31 -4
7027dm6L8l0O9pk0J4Ql2L3j6K5pq2R2n9K3jM2qm3J4L8rm0K2lJ2n3L0L4j6m5R9
$$ -4 -50 -12 -42 27 20 0 14 22 -10 23 7 32 25 -57 35 -24 -1 -2 40 32 -11 3 41 32 -8 14 11 23 -30 0 34 18 -27 72
7061G2o5n2J2M6k0k5N5Qn8LL9m2N4l6M6n3qN7pj8K0jj2l6j2M8J0k5m7O4J1k4r
$$ 72 7 -45 -33 13 -7 -32 23 31 -27 -24 15 -27 27 -9 37 -16 -24 33 26 8 28 27 15 -21 -33 15 25 0 -47 17 28 4 -5
7094eK0m2K2J4m0M7k0J9lk9J4k3L5l0O6j4l9Rk0L9l3N5l3J0n1M5K3rJ1p1K8L9
$$ -5 15 -27 -5 9 -31 16 -4 15 12 -17 -3 -26 9 -21 45 31 -8 1 -19 20 -13 42 9 19 -32 13 36 27 38 -33 -5 34
7126C4o3P7o6o4J01k5j1J3J9l2P6m9J9l9L3p3M6M1k5l9L2k1K7J2J7nm0L3J3Mk6
$$ 34 -29 48 -18 -82 19 -6 -17 -4 15 -17 59 10 29 -10 23 -50 -4 37 12 -27 5 -16 11 23 40 35 -5 28 41 45 19
7157A9nmOOJ5o3L7j5mJm7L1L2m8mM9N7m3m5M8p1M3K9k6k8L0m2M5j4QL6k2j8m5
$$ 19 14 10 16 22 37 -26 11 -4 -8 -7 -54 -23 9 -39 -43 6 63 20 -25 23 -48 -5 24 -2 -30 0 -42 3 -11 -3 33 11 -7 -52
7191e2L8K4m2M9Lk4j4J2K6o2P7n6mO3r7j0KN7L9Qk6j3kK9l3QjMoK5K5J7o7OJ4
$$ -52 -14 10 -32 17 20 -4 -18 -6 20 -42 35 -21 -25 38 -59 -69 -67 -10 29 37 11 -2 -4 25 -8 0 -1 3 -3 22 47 64 -3 3 17
7226A7l0M8l1j9L5lKK0o2%QJ4n3N1j1K7m0J01n6k4lJ7M1p9L9l1K8LJ3J5l4K6J3
$$ 17 -13 35 4 -15 20 17 19 39 -23 -23 -15 -1 -54 -3 -14 13 -27 74 18 -6 -9 8 49 -30 9 -22 6 9 22 37 3 29 42
7259D2l4Rpk6K7l4K6L0M3q2LQk1NJ8k8l9J30m4l2q7J17j4j5j3K6jm4O0j0o9M5
$$ 42 8 17 10 -16 11 -23 3 33 76 -6 -3 5 -16 -11 7 -21 -60 70 26 -6 -93 24 10 -5 -18 8 7 -37 23 13 -56 -11
7291a1%L3m5RK4ol5J3M4Mk3lJ1k4N3k7N9p0%K0pk2J3rm5M9LJ9j7J1M0r7Q2J5K6
$$ -11 -11 22 -23 -14 10 4 -31 -18 26 30 7 4 15 -9 44 17 76 6 6 26 19 -3 10 1 -44 5 8 27 10 21 61 -36 46 61 87
7326H7j15P5l4J6l7j9N5L7q8J3L4j2M6n2Ol7M0j0NK7p7QJ8Q8o4rk5Mj8N0m0J4
$$ 87 -28 47 13 29 -8 -27 28 65 -23 -10 24 12 58 6 12 -25 15 5 10 37 -40 -32 -14 74 10 1 -24 -20 -38 12 -28 -14
7358a4PQM2o6K7K8m0J6o2R9k9J5j0l5lLL3j0N4p9K4j4k4Q2n1l1l1P2q2O6k2K7
$$ -14 -7 1 43 -23 4 32 -8 8 -54 45 16 31 21 -14 -17 -14 19 9 63 -16 8 -6 -30 52 1 -30 -61 11 -71 -5 -27 0
7390@Mpj2J0N9o7L2Jm0J0M5km8j9K8loJ9Pj4k6L8J3o3j1Q7QpJjn1L0K7l2m6K8
$$ 0 4 -3 -15 -5 54 -13 19 20 -20 -10 35 33 -15 -34 -6 -9 -15 4 11 -3 -29 9 22 -41 -52 35 43 36 37 36 -15 15 42 10 -36 -8
7426hk3M3%ok5Q8q3N4%mq0M1K5j7J5l1N6lm8Mk0j0M0k5%j2M8m2K3N8m2L5o6k3
$$ -8 -31 12 12 6 -19 69 -14 40 40 36 -44 -3 22 5 20 -11 45 42 -6 -2 -22 -32 8 -17 -17 -29 19 -23 0 58 16 51 -15 -38
7460c8Q3J3n7n4M0%m5M3N3p2k3P8Jk4j6Q1o4j9L4K1k9k8oJJLL4K7m4K1n3M3nm7
$$ -38 45 58 1 -53 -13 -13 -58 -15 38 -34 -57 21 22 -2 -18 63 -1 -20 14 35 6 -22 -28 -27 -26 -23 11 38 -6 15 -38 5 0 -47
7494d7kP9q1N7l2K7KPr4Q9K0l2k7Q8K3m9m2lJ03o1l9O7n1j7L4j2Qr2P7O7o3rn1
$$ -47 -49 30 -51 6 -26 1 3 10 -84 5 25 -7 -34 54 77 28 -14 -17 86 25 -14 53 2 -15 19 7 15 -77 0 67 4 -5 -56
7527e6R4o3L1j6l2M9L3l5l7N4k2m8P6j18Q4J6M0p8K3k1K6MQj1%Mk1oL4L4k6k1
$$ -56 38 -25 6 -10 -42 7 40 5 -32 22 0 -48 28 -90 -6 10 50 -28 -5 -26 0 4 12 1 1 5 -16 -22 12 46 20 -1
7559aM7p9k1L2L6N6q5M7n8L3Jl5K3k1mL3j6l3O5m1OL3n6N0J7m7L1K7n8km4P1k6
$$ -1 46 -33 -54 -22 14 70 -15 32 -26 7 8 -27 -4 -25 -29 4 -12 -45 20 -21 -15 18 -38 12 29 -18 13 40 -18 -20 -64 7 -19
7592a9j2O0j08P3j1nN9l7lJ8K3k8k7J1J3nk4J0M5n8J9j6RN4m0l6M4NL3n8ql5M8
$$ -19 -31 29 -79 -6 -17 -22 37 0 -3 15 38 10 -17 -6 7 2 -22 -12 33 -25 -6 -22 -13 41 1 -35 9 14 47 -11 -19 -54 -6
7625fjn4O3j1L4m9l3N2m2%P8l3l0K3QJNK4j8j2K6m9L0nk5K8j4L4j1Ko1nM4k9M8
$$ -6 -7 -61 2 -9 25 -24 -57 -5 -47 -47 31 -2 -32 -9 -1 0 5 29 11 -1 25 -24 6 1 -24 4 -10 24 13 15 -46 -51 -7 -36 12
7660A2k9M1%k7L4k6J3p1R6o7N2rn9JN8J1n8O3k6j0n0M7l6P7l8m1K5k6N0j0j8L0
$$ 12 -17 24 24 -3 31 5 18 -53 43 -24 28 19 -40 -39 19 30 -28 35 9 -1 -51 -4 -40 37 -1 -42 -17 -43 7 -3 -21 9
7692Ij5qK2jl8N5j8J8l0J0pJ8J1%m5L0m4P1Ron7L2k8k1Q2p0J23j14oN4o1P1l7
$$ 9 -6 -14 8 7 -31 24 6 24 -6 4 -3 15 26 26 -19 11 -33 38 47 41 -16 16 -12 -33 49 -21 102 -12 -18 36 -25 46 9
7725IJ2l5l8L0K8o2Nj0Q7j7l0j0P1j04N1K7k3ql4P9l1pK0M8n8M1l6j1k2L6n3J9
$$ 9 21 -14 -52 -22 6 -56 -51 -61 26 9 -21 -31 40 -64 -13 14 -9 -17 -51 28 -3 -10 10 58 0 41 5 -6 -28 8 -45 -26
7757b6lo4Q9J5J6J3Ql4k8lK6l0jK9J9o8K1L4Lqj5K8n3J04l4j2k0L3l1j9j8K2M2
$$ -26 -29 -93 -4 11 27 40 48 14 -14 -17 9 -21 -22 7 26 -42 -21 13 16 8 -7 21 -32 72 38 26 6 39 8 -11 -29 -7 35
7790C5l2M0j8j1K4n9M4j7j4KL6k7j3m2J11o4k4L6K9o1P2o7rL4l4L7%n0j1Q0p0
$$ 35 3 43 25 14 38 -21 23 6 -8 -6 30 3 -10 -52 59 -5 -29 7 36 -25 47 -20 -29 5 -29 8 8 -42 -53 27 -43
7821d3P6p0K3L5j9JjJ2k7j8M3p4J16q7M9k3k4Lj5L6K2j3l7J8M6o6PO8Jo6JO3o6
$$ -43 33 -37 -14 21 2 3 2 14 -13 -31 12 -62 54 -33 16 -7 -31 -28 -43 -7 15 2 -35 -17 29 -37 -30 38 39 -27 -26 37 -29
7854b9J9M5k3m3M9j0j2jj9K8Rj3PK9o1N6j2J2j6K3M4r7K7l2K2m2P4l9Q2m0o5M7
$$ -29 -10 35 12 -31 18 8 -4 -5 -24 4 13 0 7 36 -25 31 19 31 15 38 82 -15 12 -20 2 -40 34 -5 77 37 -28 19
7886A9K0o2L9oK0o3R0k2n1K4j8K9M0m5k2L5Jk1Mpk4M1k4P4r4M6m1OPM7j8l1j3
$$ 19 39 -23 16 10 30 -33 57 35 -16 8 -10 19 59 14 -8 27 28 7 11 4 -20 21 -3 71 -23 23 -18 -12 -5 42 24 -7 -20
7919b0Lj1L0l4K8l0%L7mO4j25M0J0K3M4p6L3l2L1M2l7n5L2k7M7J6j9lm8R5j19
$$ -20 -17 -28 2 -32 -4 -34 -34 3 -1 63 -62 -22 -12 11 55 -21 12 -20 11 53 16 -39 -7 -34 13 29 10 7 -41 54 -65
7950f5P6jJ3j9K5%Kl2Rk3M9J8j08P9mL3n4kj2J6p7R7o4K5J9NJ5k2JJ8m2M2lQm5
$$ -65 11 10 23 4 29 29 31 -1 8 -15 34 52 -56 23 19 52 -2 -4 -16 0 -77 20 -44 -19 0 5 20 -2 -1 17 -25 17 14 22 -23
7985b3l9N5J6m6L8J4j0m%L6p2m3R4J4m4P1p9J3K1n1K4J4M6p5O2l0l9P4r1Q9l6
$$ -23 -62 -7 9 -37 1 15 5 1 1 37 -35 -78 16 30 -14 57 -22 -9 12 -39 -15 -1 45 -30 32 2 -37 37 -54 35 -1
8016aL4m9RJ9l4M9r4N3J7kQ%Ml7K6P2l2q6N9l5N8j7J9K8r5Q4j02J05p0K8jJ4l5
$$ -1 33 -16 -7 12 -22 27 -67 -14 3 1 9 9 13 -24 2 74 42 -44 15 -20 38 21 40 68 -27 57 -45 60 -10 18 17 31 -4
8049dK5pJqkMK2j4k4%K2l2Rj9Jj3R3j26Q1K5j0P1j57M6Q4l7n1L8j0K7m9k0nJ6
$$ -4 21 14 15 7 5 9 31 17 -7 -7 15 -17 -8 -27 -26 -39 54 -72 9 34 24 95 -62 -16 68 31 -20 18 8 35 -14 -34 -39 -23
8083b3N2k5r%M9j7n2L6M2o1j9PM3l2K7j1k3M0mL5n9m2O9j6M0p1P7l0QL1q0N6k1
$$ -23 29 4 -5 -5 44 27 -25 11 53 -8 -27 -20 23 -9 18 7 -16 24 20 55 -4 -46 23 7 47 -24 53 23 31 62 -18 38 17
8116A7J6J4m4k7k6M8J9n9O4k2OJ3m2n4J08m6L1JJ%L1l7k5K3K4m1P4k8n1K5rnL0
$$ 17 33 47 3 -24 -50 -2 17 -42 22 0 6 19 -23 -77 31 -15 16 17 18 18 49 12 -13 10 34 -7 67 39 -12 13 4 -1 29
8149B9o4M6l7KNJ5pn6P2pm3Q7J7o4pl2L2N4m3k8MM8k7j4L4k2l5QN2k9o1M3M3j03
$$ 29 -35 11 -26 -24 -19 -4 -11 -67 5 -2 -45 42 59 -5 -12 -44 -12 42 -1 -29 -25 23 -4 -18 16 -6 -41 -33 19 -10 -71 -28 15 -88
8183h8J01j1O9j19L5pP3q8
$$ -88 13 2 71 -48 -13 -20 53 -35
8191c5
$$ Imaginary data points
##PAGE= N=2
##DATA TABLE= (X++(I..I)), XYDATA
0@%%%%%%%%%%%%%%%%%%%%oJ4j6J6j6J6j6J9k4K8l1L4l8M2m9N5n8O4p1P9r0R8j07
$$ 0 0 0 0 0 0 0 0 0 0 0 0 0 0 0 0 0 0 0 0 0 -6 8 -8 8 -8 8 -8 11 -13 15 -16 18 -20 22 -27 28 -30 34 -37 42 -48 50 -57
43e7J19j32J43j55J73j90K08k28K52k79L08l43L82m28M85n55O39p46Q88j076J343
$$ -57 62 -70 73 -82 91 -99 109 -119 133 -146 162 -181 201 -227 258 -297 342 -404 484 -592 751
64G51j746K394l560O028j3084O6284K31873k75380k08189K78062J45997k07398
$$ 751 -995 1399 -2161 3867 -9217 57067 288940 13560 -194629 83433 229430 22032
76B2032q1690J25333M1952k7066k0009o6865R602J34981k3895j96861K1623K11688
$$ 22032 -59658 65675 107627 80561 60552 -6313 3289 138270 114375 -82486 -60863 150825
88A50825m0079k19490M0431J90786m5635j54937K9366J01974n652n0815k4290
$$ 150825 110746 -108744 -68313 122473 76838 -78099 -48733 53241 47589 -3226 -27516
99b7516J0849O2479K3293r0565l4060J15828L3281j16928j2841J02595n745o3056
$$ -27516 -16667 45812 69105 -21460 -55520 60308 93589 -23339 -36180 66415 60670 -2386
111b386K2612J2568k6417M0967J4357q8356O848J17144l2379j25681N0883J12186
$$ -2386 20226 32794 6377 47344 61701 -26655 -19807 97337 64958 -60723 -9840 102346
123A02346o3108q8248O3047N3342n4504j4657L3581k6770n363O0092l1925q7102
$$ 102346 39238 -49010 14037 67379 12875 -1782 31799 5029 -334 59758 27833 -59269
135e9269O4788R4987r8308r3734J15268P2697j24954n3101J08484K3706q6015
$$ -59269 5519 100506 2198 -91536 23732 96429 -28525 -81626 26858 50564 -35451
146c5451p319M5474q745q530P559l2471k060N9999j3823p6505K8723P8662l8729
$$ -35451 -42770 2704 -6041 -14571 -7012 -39483 -41543 18456 4633 -71872 -43149 35513 -3216
159c216o9068M3510N5626l7896l6455K9684K2013j2265o786l382j78K1530L515
$$ -3216 -72284 -28774 26852 -11044 -47499 -17815 4198 -8067 -14853 -18235 -18413 3117 6632
172F632l5617J001M6047j1182m9443K3682M1887l6914k8443M2023Q229m3520Q540
$$ 6632 -28985 -27984 18063 6881 -42562 -18880 23007 -13907 -42350 -327 7902 -35618 -27078
185b7078L5408k4360k4261L1310P663l1987P017K4078j8408j0058K5435n425k5554
$$ -27078 8330 -16030 -40291 -8981 -1318 -33305 -26288 -2210 -20618 -30676 -5241 -10666 -36220
198c6220K3280K3120l5391j2689M6305M310m6223P862M5604j2202l5428J8519
$$ -36220 -12940 10180 -25211 -37900 8405 12715 -33508 -25646 19958 7756 -27672 -9153
210i153K6329j5860r860J2561j510k72J3462j1001j7154K4721J8702l3697j3697
$$ -9153 17176 1316 -8544 4017 2507 2235 15697 4696 -12458 12263 30965 -2732 -16429
223a6429L9789O852l8530P13L2031n558k2526P186J1480o956j033L761r204J206
$$ -16429 23360 30212 -8318 -7605 24426 18868 -3658 3528 15008 8052 7019 10780 1576 2782
237B782J5620q252j8646J4251J7560j8837j3703K1227P181k0495J238J6245q264
$$ 2782 18402 10150 -8496 5755 23315 4478 -9225 12002 19183 -1312 -74 16171 7907
250G907q453J3251L75j4242P975J3161j3992q609J7569K329j6259M118J1087q403
$$ 7907 -546 12705 13080 -1162 6813 19974 5982 -2627 14942 17271 1012 5130 16217 7814
264G814l975R358l903q953J0011N817j6200k523J8102k661j9164M997J6115q280
$$ 7814 3839 13197 9294 341 10352 16169 -31 -2554 15548 12887 -6277 -1280 14835 6555
278F555j3672Q211P415q441k175L850m622R67P092q524r037J3624O988j8992m728
$$ 6555 -7117 1094 8509 68 -2107 1743 -2879 -1912 5180 -3344 -12381 1243 8231 -10761 -15489
293a5489K0446j90k0271L429J5858n901j1130N286N375l811j016N89l078L134
$$ -15489 4957 4767 -15504 -12075 3783 -2118 -13248 -7962 -2587 -6398 -7414 -6825 -9903 -6769
307f769N009p206n361J0047M744j1789l166J2723J614j2031J106J0497k639o553
$$ -6769 -1760 -8966 -14327 -4280 464 -11325 -14491 -1768 -154 -12185 -11079 -582 -3221 -9774
321i774M045K761k634J818J132m346K623O843n860n979R779M207j0716o64J0771
$$ -9774 -5729 -2968 -5602 -3784 -2652 -6998 -4375 2468 -3392 -9371 408 4615 -6101 -6765 4006
336D006j637q593M160O316m953l097N398L07m231K358K697l524o11M321r63m075
$$ 4006 2369 -6224 -2064 4252 -701 -3798 1600 1907 -2324 34 2731 -793 -1404 2917 1954 -2121
352b121L047L571m287j418N585m39m602L171L818l851j424N356J3m147K912L355
$$ -2121 926 4497 210 -1208 4377 3938 -664 2507 6325 2474 1050 6406 6419 2272 5184 8539
368H539l158l22L561r40j531K789M54k832J735K978l204j983M175M36m387L01
$$ 8539 5381 5059 8620 7680 6149 8938 9392 6560 8295 11273 8069 6086 10261 10697 6310 6611
384F611L464j500l681J408K052k990j728K040q40k525R38M25k784l09K185k242
$$ 6611 10075 8575 4894 6302 8354 5364 3636 5676 4836 2311 3249 3674 890 581 2766 524
400E24k996K998R08m588J26L887j887l423K250K444k647j518K545Q04j761K6Q53
$$ 524 -2472 526 1434 -3154 -3028 859 -1028 -4451 -2201 243 -2404 -3922 -1377 -573 -2334 -2308 -1455
417a455L67J22m81j03M76O16k34j304L21J551p39j960K83J365n67k016k35J066
$$ -1455 -1088 -966 -1447 -1550 -1074 -458 -692 -1996 -1675 -124 -863 -2823 -2540 -1175 -1742 -3758 -3993 -2927
435b927o06j060j161k21J324p81k780K33K042j175k491P07J648j272q47J006l91
$$ -2927 -3533 -4593 -5754 -5975 -4651 -5432 -8212 -7979 -5937 -7112 -9603 -8896 -7248 -8520 -9367 -8361 -8752
452h752p5J299l30j084J356J918n65j397J749K331q65q25J661J364k26K18R58
$$ -8752 -8827 -7528 -7858 -8942 -7586 -5668 -6233 -7630 -5881 -3550 -4415 -5240 -3579 -2215 -2441 -2223 -1265
469a265n5L34K066m52k377K098L435k569l304L124L511l128l177L053K484k500
$$ -1265 -1320 -986 1080 628 -1749 349 3784 1215 -2089 1035 4546 1418 -1759 1294 3778 1278
485A278k137J398J558m26j231m25K95J118R38j873j809K919K815l158l169M062
$$ 1278 -859 539 2097 1671 440 15 310 1428 2366 493 -1316 1603 4418 1260 -1909 2153
501B153M420l734m007M354M623l113l543L294L909j995k494K148J917r33K22N05
$$ 2153 6573 2839 -1168 3186 7809 4696 1153 4447 8356 6361 3867 6015 7932 6999 7221 7726
517G726j370M74L135j209m693K167N692l428o665L660N935m367n853L708M057
$$ 7726 6356 6830 9965 8756 4063 6230 11922 8494 1829 5489 11424 7057 1204 4912 8969
532H969m333l246L043M82k788R26Q95l739m43N269j273p424K210P939l886q134
$$ 8969 4636 1390 4433 4915 2127 3053 3948 209 -234 5035 3762 -3662 -1452 6487 2601 -5533
548e533M147P584m110o937L571N428k783l416J776J257o34P49m87l020J437N180
$$ -5533 -1386 6198 2088 -4849 -1278 4150 1367 -2049 -273 984 350 1099 612 -2408 -971 4209
564D209k613p378K999Q551l631r694K691R795k761j0600J793R334j672q616J76
$$ 4209 1596 -5782 -2783 5768 2137 -7557 -4866 4929 2168 -8432 -6639 2695 1023 -7593 -7417
579g417O336k34m735n20J403N04J468j420n223J792Q071k212j0693K658J2577
$$ -7417 -1081 -1315 -6050 -6570 -5167 -4663 -3195 -4615 -9838 -8046 25 -2187 -12880 -10222 2355
594B355l429j2832M138J2773l594j1283L391R870k425o364K240L190p49Q27j02
$$ 2355 -1074 -13906 -9768 3005 -589 -11872 -8481 1389 -1036 -7400 -5160 -1970 -2719 -1892 -1994
609a994l506J918O943k792r263M411J0895m797j0751M719J0292l688r299K818
$$ -1994 -5500 -3582 3361 569 -8694 -4283 6612 1815 -8936 -4217 6075 2387 -6912 -4094
623d094P922j365n953j37L784J748j604k568n56L136L232l337n261L432P354k734
$$ -4094 3828 2463 -3490 -3627 157 1905 301 -2267 -2823 313 3545 208 -5053 -1621 5733 2999
639B999q479K101R721j036r827O29R972N47q932j234Q116K047n938j904L611J961
$$ 2999 -5480 -3379 6342 5306 -4521 -3892 6080 6627 -2305 -3539 4577 6624 686 -1218 2393 4354
655D354m25j849k311K101N223k324p773K705R665k985j0505K966J0090k733r454
$$ 4354 3929 2080 -231 1870 7093 4769 -3004 -299 9366 6381 -4124 -1158 8932 6199 -3255
670c255K212P882j601o467O37M008K83j844j591k57K192J811k952l395L295M326
$$ -3255 -1043 6839 5238 -1229 -592 3416 3699 1855 264 7 2199 4010 1058 -2337 958 5284
686E284l686m850L274M618k610m414J742L925r67l377j26K702R57k280j442J519
$$ 5284 1598 -3252 22 4640 2030 -2384 -642 3283 2316 -1061 -1187 1515 2472 192 -1250 269
702B69J310q68r76j72N59R74k60j943l60K640P46l328j104L352J083l355j040
$$ 269 1579 711 -265 -437 122 1096 836 -1107 -1467 1173 1919 -1409 -2513 839 1922 -1433 -2473
719b473K899R31k606o82J661K22k95k00r98J19J821q1k507P6L037j52l390L66
$$ -2473 426 1357 -1249 -1931 -270 -48 -343 -543 -1541 -1422 399 318 -2189 -2113 924 772 -2618 -2252
737b252L218l47k623N3K028J97j437k56P99N10p9r03k39J186M77j060o60J026
$$ -2252 966 619 -2004 -1951 77 274 -1163 -1419 -620 -110 -189 -1092 -1331 -145 332 -728 -1388 -362
755c62R95j045p49J032L58m06j03n7J74M78j52n03K04P91l70n85O11K10m77L09
$$ -362 633 -412 -1161 -129 229 -177 -280 -337 -163 315 163 -340 -136 655 285 -300 311 521 44 353
775C53K49m86l3N81K06q36j00J026k0r55j9Q64J77q50l60Q21K93m75l87O1N98
$$ 353 602 116 83 664 870 34 -66 960 940 -15 -34 830 1007 157 -203 618 911 436 49 110 708
796G08K21r10k43R01K86r73m48J016L40r09j86L09L29K1n29l75P50L90q55n07
$$ 708 929 19 -224 677 963 -10 -458 558 898 -11 -197 112 441 462 -67 -442 308 698 -157 -664
816f64Q48M58r17n70Q80L49p48m75N81M29p26l73N88M7m73J7Q0m4q6J39l15j37
$$ -664 184 642 -275 -845 35 384 -364 -839 -258 171 -555 -928 -340 -293 -766 -749 -669 -713 -799 -660 -975 -1112
838a112L79r7m55K32K89l55p2J20L6m7o7%J81O3k36j0L10k8l42K41L38l47JK37
$$ -1112 -733 -830 -1285 -1053 -764 -1119 -1191 -1071 -1035 -1082 -1149 -1149 -968 -905 -1141 -1151 -841 -869 -1211 -970 -632 -979 -978 -741
862g41m4Mk6J42K52k37r8L27J64k74q7M93J46m43K68L33k95K2K69r9O8K64j09
$$ -741 -785 -781 -807 -665 -413 -650 -748 -421 -257 -531 -618 -125 21 -422 -154 179 -116 -94 175 76 144 408 299
885B99j03J51L00j63k31M40J82k48j20K08L27p7l62L16L21l19n8J88P9m9oL7j2
$$ 299 196 347 647 484 253 693 875 627 507 715 1042 965 603 919 1240 921 863 1051 1130 1081 1075 1112 1100
908A100K01n0k08R5K62l09J10P9k66K03K11k53k34K89K05m21j28M94j08n20J78
$$ 1100 1301 1251 1043 1138 1400 1091 1201 1280 1014 1217 1428 1175 941 1230 1435 1014 886 1380 1272 752 930
929I30J03q6k2nm0k33J02K44m09k83M61K00o19l72O14K06q13j44N87r1l89%l2
$$ 930 1033 947 925 920 880 647 749 993 584 301 762 962 343 -29 585 791 -22 -166 421 330 -59 -59 -91
952i1N4J66k93m15K71M25m77m65L81K50j82k16j89L61K49l96n01M73L79l54n87
$$ -91 -37 129 -164 -579 -308 117 -360 -825 -444 -194 -376 -592 -781 -420 -171 -567 -1068 -595 -216 -570 -1157
973a157K58P03k95n99J41N44n6o04J49L12j21N1l5n21L41P29o68p80P23Q85r63
$$ -1157 -899 -196 -491 -1090 -949 -405 -461 -1065 -916 -604 -725 -674 -709 -1230 -889 -160 -828 -1608 -885 0 -963
994i63p38J111L24r02m0N42o7j17O6r3k27M62L20p20k39R43K67r20k49R98L41
$$ -963 -1701 -590 -266 -1168 -1208 -666 -733 -850 -784 -877 -1104 -642 -322 -1042 -1281 -338 -71 -991 -1240 -242 99
1015I9r59j16Q47M2l96M8M6K39K20k52l48L77N48l26m84L30M27p7k43k10K66N85
$$ 99 -860 -976 -129 -87 -483 -435 -389 -150 70 -182 -530 -153 395 69 -415 -85 342 265 22 -188 78 663
1037F63m47o85N64P68m88q41O15P40n18n94N56K52k98m0K86k37j21O22j13r29
$$ 663 216 -469 95 863 375 -466 149 889 371 -223 333 585 287 247 533 296 175 797 684 -245
1057b45N96J126r36r86J213Q48j333n19J342R6j040M23N78o70j13O82k12p16N92
$$ -245 351 1477 541 -445 768 1616 283 -236 1106 1202 162 585 1163 493 380 1062 850 134 726
1076G26O47r27n90J029M53j130k62R47Q6r61J00P25m08l64L87k04k70M23lm89
$$ 726 1373 446 -144 885 1338 208 -54 893 979 18 118 843 435 71 458 254 -16 407 404 -85
1096h5n8M66%m33q9L06J03j30n50J90P82m68p66N36O91o57n40O17L10o50l1N80
$$ -85 -143 323 323 -110 -199 107 210 80 -470 -280 502 34 -732 -196 495 -162 -702 -85 225 -425 -456 124
1118A24l96l41O01J39p38j63J041k16j277O10J356j018j054J241N44j413MJ343
$$ 124 -272 -613 -12 127 -611 -774 267 51 -1226 -616 740 -278 -1332 -91 453 -960 -956 387
1136C87o11j000J057M74j184K11J088n85r70P68Q59r18m61R61K11q30J18N71l1
$$ 387 -224 -1224 -167 307 -877 -666 422 -163 -1133 -365 494 -424 -885 76 287 -543 -425 146 115
1155A15m65J80M09l84p1O04k23m95L96L62m29k19M16J40k89KJ6J37K22l73k90
$$ 115 -350 -170 239 -145 -216 388 165 -330 66 428 -1 -220 196 336 47 49 65 202 424 51 -239
1176b39P77Q3r07J45P84m32n10P34J43r11K99P14p23l51Q90Q2r83N2R77k04r46
$$ -239 538 621 -286 -141 643 211 -299 435 578 -333 -34 680 -43 -394 496 578 -405 -353 624 420 -526
1197e26N05P89p76n52Q77K45q67J4Q12n09p06R30L24j260J70J164n79p79P61L83
$$ -526 -21 768 -8 -560 317 562 -305 -291 521 12 -694 236 560 -700 -530 634 55 -724 37 420
1217D20p57r6N81k33l33L15O0k43K08J04k78o1K47l3j50j2Q2o5O4Rj9j4J12o5
$$ 420 -337 -433 148 -85 -418 -103 -43 -286 -78 26 -252 -313 -66 -99 -249 -261 -179 -244 -180 -171 -190 -204 -92 -157
1241a57k16J23M31j90n58N46K48p07R2O68k58n91N38L54p01P6P57m75n88P45K25
$$ -157 -373 -250 181 -9 -567 -21 227 -480 -388 280 22 -569 -31 323 -378 -302 455 -20 -608 137 362
1262C62p36P9O93k72n16M27M03n58j00N20j26l56J96L18k38k45L43P2m23K19L51
$$ 362 -374 -295 398 126 -390 37 440 -118 -218 302 176 -180 16 334 96 -149 194 266 -157 62 413
1283D13l48r9L46l1l81J72L18l59j09M65k26k88L98N0m57K22L03k86k79M39J17
$$ 413 65 -34 312 281 -100 72 390 31 -78 387 161 -127 271 321 -136 86 389 103 -176 263 380
1304C80m97K18L72l52k48M56J15l96J4L22j26l26L60J72m20L5M13k48k84K75K30
$$ 380 -117 101 473 121 -127 329 444 48 62 384 258 -68 292 464 44 79 492 244 -40 235 465
1325D65l02k12M86j17k94K40J19k92j6K29j40j82K66K5m21K52K24l30r5K86j13
$$ 465 163 -49 437 320 26 266 385 93 77 306 166 -16 250 275 -146 106 330 0 -95 191 78
1346G8k49J54J56k25r5L11j17k93K40K08m11p3L85J1m99J97L66l50k97M93Jm28
$$ 78 -171 -17 139 -86 -181 130 13 -280 -40 168 -243 -316 69 80 -419 -222 144 -206 -503 -10 -9 -437
1368d37J63L04l24j97L81O9m84N2M71k71k90K84Q5k79o2K05nj84J33O5j82O6K01
$$ -437 -274 30 -294 -491 -110 -41 -525 -473 -2 -273 -563 -279 -194 -473 -535 -330 -335 -519 -386 -321 -503 -437 -236
1391b36k20o6K19m4j39R2J34j02p4K64j24j34K51L5k56Q4L15j48k11K77K08l29
$$ -236 -456 -522 -303 -347 -486 -394 -260 -362 -436 -172 -296 -430 -179 -144 -400 -316 -1 -149 -360 -83 125 -204
1413b04k1M07j39l00L36J70l02j9K61k0l06K97J89k76r5L29J9k61ML59j90j79
$$ -204 -225 182 43 -257 79 249 -53 -72 189 169 -137 160 349 73 -22 307 326 65 69 428 238 59
1435E9K77J12l47J14K04j38o9J07Q8j25L2J31j03n7J54o5n6J44o3o2P7L8n9p8
$$ 59 336 448 101 215 419 281 212 319 407 282 314 445 342 285 439 374 318 462 399 337 414 452 393 315
1459C15J37j9j41P1J84k19j05J67n4j90Q1J84p5l22K46M5k26J9J67j12j34O5J28
$$ 315 452 433 292 363 547 328 223 390 336 146 227 411 336 14 260 305 79 98 265 153 19 84 212
1482B12k83L6K10j82j29J41M9q9j17J18N8j86R5O7j14m3N3j6j5O7nr5k6J26l9
$$ 212 -71 -35 175 -7 -136 5 54 -35 -152 -34 24 -162 -67 0 -114 -157 -104 -120 -135 -68 -73 -168 -194 -68 -107
1507a07m3Np9KR3j6o3OR8o9j19J14Q7j93j5J49j4p2j1J07n1o9Q9l8j25J21J28
$$ -107 -150 -145 -224 -222 -129 -145 -208 -202 -104 -173 -292 -178 -91 -284 -299 -150 -164 -236 -247 -140 -191 -260 -171 -209 -334 -213 -85
1534h5j80k5J30Mr1j9J36L4j71N1J11m2k5LP0kr4J03j3o8O9pnlP9n7l5k8J36j3
$$ -85 -265 -290 -160 -156 -247 -266 -130 -96 -267 -216 -105 -147 -172 -169 -99 -101 -195 -92 -105 -173 -104 -111 -116 -119 -40 -97 -132 -160 -24 -37
1564c7j25pJ68%j30J3J82q4n7J9R4n5k2O7k9k2J3J68j07j38K21j5j23K8J06P2
$$ -37 -162 -169 -1 -1 -131 -118 64 -20 -77 -58 36 -19 -41 26 -3 -25 -12 156 49 -89 132 117 -6 22 128 200
1590B00j45l1J55Kj35J53on9nN9Kr5J35K8r6m6O7O6q9j23J87Q1k26%J32k5q1l7
$$ 200 55 24 179 181 46 199 193 134 129 188 190 95 230 258 162 116 183 249 160 37 224 305 79 79 211 186 105 68
1618F8J13M8k05J47Qj93O3J10r4k3R6P0j74m3J79p4j87N8J52m7j64M5Q8q6l0J40
$$ 68 181 229 24 171 179 -14 49 159 65 42 138 208 34 -9 170 96 -91 -33 119 72 -92 -47 41 -45 -75 65
1644F5q5j52R9R7j34m5J38l6j81P9J76j11j53J20L4l7j15R8O2o3J3m4Q9r0k0Q7
$$ 65 -20 -172 -73 24 -110 -155 -17 -53 -234 -155 21 -90 -243 -123 -89 -126 -241 -143 -81 -144 -131 -175 -86 -176 -196 -109
1670a09k6o6L8J57j05m6J19L6j65N7J38K4j93M2J69j09l0R6R7j90N7J27M2k86
$$ -109 -135 -201 -163 -6 -111 -157 -38 -2 -167 -110 28 52 -141 -99 70 -39 -69 27 124 -66 -9 118 160 -126
1694a26J95Q9j37l7J88j7j23K9J76k1k42J66J37j81l5J56Pj46%K23p0j93J73P0
$$ -126 69 158 21 -16 172 155 32 61 237 216 -26 140 277 96 61 217 224 78 78 301 231 38 211 281
1718B81j79lJ51k3j42K7J78j43r7J69J3k06M3O5j3l3mO6q4m1qN1K2r6L5Q5q8j52
$$ 281 102 99 250 227 85 112 290 147 50 219 232 26 69 134 121 88 84 150 66 25 17 68 90 -6 29 114 26 -126
1746a26J58M4j69k1J05J2k35P3K33k18j06J72Kj61n9K37k1k47J32J52j75q9J46
$$ -126 32 76 -93 -114 -9 3 -232 -159 74 -144 -250 -78 -76 -237 -296 -59 -80 -327 -195 -43 -218 -307 -161
1769a61J24k51kK55j54j44J48J74k52o9K32p4j06J7J75j36j18J40N6r9L2P2j6
$$ -161 -37 -288 -290 -35 -189 -333 -185 -11 -263 -332 -100 -174 -280 -263 -88 -224 -342 -202 -146 -245 -213 -141 -157
1792a57j27K3J38p0k0N7l8K8j9ML2O2j10P6O4m2m4N5M6n4j00J41M3j36l9K48q8
$$ -157 -284 -261 -123 -193 -213 -156 -194 -166 -185 -181 -149 -87 -197 -121 -57 -99 -143 -88 -42 -96 -196 -55 -12 -148 -187 61 -27
1819b7o9Q6J9n6k0J94o8j60J26M5l0MJ05j8j60Q0J04l2j05R2J07j37k0J56o2l3
$$ -27 -96 -10 9 -47 -67 127 59 -101 25 70 40 44 149 131 -29 51 155 123 18 110 217 80 60 216 154 121
1845A21K1M7n3J9J64j68J7N9K8n4L0R4j29K6J02m9o4O1M4p8LJ9km7R7P2j72M6
$$ 121 142 189 136 155 319 151 168 227 255 201 231 325 196 222 324 275 211 272 316 238 241 260 258 211 308 380 208 254
1873B54J33l4p2L3R3r3j09R1L6k11J29J23j46j03J32M0k00R8Q9j32j18R5J5q0
$$ 254 387 353 281 314 407 314 205 296 332 121 250 373 227 124 256 296 96 194 283 151 33 128 143 63
1897F3K2L8n4l3J0J6j5m6L3j10N6J2p3NL2q4%j4K1k2o8R0J1j99J03L7q1p4M5L9
$$ 63 85 123 69 36 46 62 47 1 34 -76 -20 -8 -81 -76 -44 -128 -128 -142 -121 -143 -211 -121 -110 -309 -206 -169 -250 -324 -279 -240
1927b40j22mJ92r0j84J54L0p6jQ0k4j42N6J50j18n4P6jJm3J27r7m3R5N6r7o1J33
$$ -240 -362 -366 -174 -264 -448 -294 -264 -340 -341 -261 -285 -427 -371 -221 -339 -393 -317 -318 -317 -360 -233 -330 -373 -278 -222 -319 -380 -247
1955b47k4n3P6M6n2m8J22k8l1J33o0l6J21m0n7J37oj21P4R5J3q8J01N9j45J5J02
$$ -247 -271 -324 -248 -202 -254 -302 -180 -208 -239 -106 -166 -202 -81 -121 -178 -41 -47 -168 -94 1 14 -74 27 86 -59 -44 58
1982E8L8j33K0J28m6p9R5J08j64RJ93k6j92J08J78r4k08K30O2j95K6J73j01q3
$$ 58 96 -37 -17 111 65 -14 81 189 25 34 227 201 9 117 295 201 -7 223 285 90 116 289 188 105
2006A05J05m0J2o1N7K7m2K0K1n9L2j02J02N8j25N8L6m1k6O6j14K6K0k3J34r2r
$$ 105 210 170 182 121 178 205 163 183 204 145 177 75 177 235 110 168 204 163 137 203 89 115 135 112 246 154 145
2033A45J6M6j15q6J92j00j13J42N4j05m2Q2oj12M1J10r0j30J13%p0M4Ojj4k2N4
$$ 145 161 207 92 6 198 98 -15 127 181 76 34 116 110 -2 39 149 59 -71 42 42 -28 16 22 21 7 -15 39
2060C9K1j26R1om3j7Q0o9k1J9Q1o5n2O7q3N5n9K7mM7j07K9P7k4o8k7P2p2k3P6
$$ 39 60 -66 25 19 -24 -41 39 -30 -51 -32 49 -16 -68 -1 -84 -29 -88 -61 -65 -18 -125 -96 -19 -43 -111 -138 -66 -138 -161 -85
2090h5N0j73M7P1nj01J07R8j98m2K00j3j22J0J37p5j13J72J04k19MJ36m1o0P0
$$ -85 -35 -208 -161 -90 -95 -196 -89 9 -189 -231 -31 -44 -166 -156 -19 -94 -207 -35 69 -150 -146 -10 -51 -111 -41
2115d1L0l3r9J25L8j21O6M8j3n4P8Q2j02k4O5M9n3r8J37N4j01K3QM4n2m5O3K9
$$ -41 -11 -44 -143 -18 20 -101 -35 13 0 -54 24 106 4 -20 45 94 41 -57 80 134 33 56 64 108 56 11 74 103
2143A03p0m8J18m4PM8Or7L1O3q0k5L5J51j43nO8pp1M1K6k8j06N8Q8j01K3J4J6
$$ 103 33 -15 103 59 66 114 120 23 54 117 37 12 47 198 55 50 118 111 40 81 107 79 -27 31 119 18 41 55 71
2172G1p6l3J11l3j28M8P9j18KN3mo1l1J16j60J3M9qk7JJ4k5m5QM3m0n4J07mq5
$$ 71 -5 -38 73 40 -88 -40 39 -79 -77 -24 -28 -89 -120 -4 -164 -151 -102 -110 -137 -136 -122 -147 -192 -184 -141 -181 -235 -128 -132 -217
2202b17l8P7L1l2n2R9Mr8L9M8j5J5l0M4j11J39N1k4j27J30N4j97N6P8K7m2QJ08
$$ -217 -255 -178 -147 -179 -231 -132 -128 -226 -187 -139 -154 -139 -169 -125 -236 -97 -46 -70 -197 -67 -13 -210 -154 -76 -49 -91 -83 25
2230B5n1l1M4m9K3k8J42n8o5P4j1qJ3N1J3lo3J16j2n1L6K8M3m0LK7M4p9O0O2n6
$$ 25 -26 -57 -13 -62 -39 -67 75 17 -48 26 15 7 20 71 84 81 18 134 122 71 107 135 178 138 141 168 212 133 193 255 199
2261A99n3Q1pj2J3O6M6k31J39J01j15l9J00K9k28J07J88j60j07J58K0j81kJ90
$$ 199 146 227 220 208 221 287 333 102 241 342 227 188 288 317 89 196 384 224 117 275 295 114 112 302
2285C02m3j75O2O0k8q2J38j7j20mJ38n5j36N4J16j02m9Q4l7q7O2P1n1p0PP5r4
$$ 302 259 84 146 206 178 96 234 217 97 93 231 176 40 94 210 108 59 143 106 19 81 152 101 31 38 113 19
2312A9O6p6m2R1j26j6O6j2j23O3J09j42m3J63l6j74R4J28j73j16K03K4j93pJ80
$$ 19 85 9 -33 58 -68 -84 -18 -30 -153 -90 19 -123 -166 -3 -39 -213 -119 9 -164 -280 -77 -53 -246 -253 -73
2337g3m9j78J51R1j49q6J18K3j50JK16q3j95J39J54j91n6J62j3j66J06M7j19J
$$ -73 -122 -300 -149 -58 -207 -293 -175 -152 -302 -301 -85 -168 -363 -224 -70 -261 -317 -155 -168 -334 -228 -181 -300 -299
2361b99J87j22o0M1J3M1l2M2n8N9j2j11N1J73j14n8J13%r2N6R8r3k2P1J00l5j25
$$ -299 -112 -234 -294 -253 -240 -199 -231 -189 -247 -188 -200 -311 -260 -87 -201 -259 -146 -146 -238 -182 -84 -177 -199 -128 -28 -63 -188
2388a88J72K2j51j2K58j00j29R9J56j43q6K30%j62O8J69r3q8J49J03k30K7J65
$$ -188 -16 6 -145 -157 101 1 -128 -29 127 -16 -102 128 128 -34 34 203 110 22 171 274 44 71 236
2411B36o0m4M8O7q8l0J30k9o2K6N3pk2K1M7Nj34L6N4M0p2n9O5J75j71m3J67m4
$$ 236 176 132 180 247 159 129 259 230 168 194 247 240 218 239 286 291 157 193 247 287 215 156 221 396 225 182 349 305
2439C05j32K4R2r7n6J46oj72k2K42k08p8J70Nj49J8J36o1j15O4R5j57n6J59j06
$$ 305 173 197 289 192 136 282 276 104 82 324 116 38 208 213 64 82 218 157 42 106 201 44 -12 147 41
2464D1n2J7J31j40r4J11L2j09k7J13j09j3N5Oq0N2J1o1L3L0r6J7Q7q4jJ7O7j49
$$ 41 -11 6 137 -3 -97 14 46 -63 -90 23 -86 -99 -44 -38 -118 -66 -55 -116 -83 -53 -149 -132 -45 -129 -130 -113 -46 -195
2492a95j3J76m5j81J33Q4j66K6J54m3j28KJ85j45o4J68k3r6m2J53j4j10N6J22
$$ -195 -208 -32 -77 -258 -125 -41 -207 -181 -27 -70 -198 -196 -11 -156 -220 -52 -75 -171 -213 -60 -74 -184 -128 -6
2516fj40j9J19Pj07R7J1j4KJ6J2o8K6L4m7N2K6j9K9n5L2j4L6J1r2O0P4o5m4M5
$$ -6 -146 -165 -46 -39 -146 -49 -38 -52 -50 -34 -22 -90 -64 -30 -77 -25 1 -18 11 -44 -12 -26 10 21 -71 -11 63 -2 -46 -1
2546aO5j79M3J61l8j76J41J37j54p8J40L4j67M5J82j39m2J29R9k54K1R4K0j36
$$ -1 64 -115 -72 89 51 -125 16 153 -1 -79 61 95 -72 -27 155 16 -26 103 202 -52 -31 63 83 -53
2570e3J23Q6j40m0R3k2p6Q8J7Mj42J07K3m9k1PK2l9Mp1Q9K9j01L9M9j8m6K6R4
$$ -53 70 156 16 -24 69 47 -29 59 76 80 -62 45 68 19 -2 5 27 -12 -8 -79 10 39 -62 -23 26 8 -38 -12 82
2599H2j32m6J46qj23j0J49j00n5O1Q9j42j8J79p0r3P0M9n3j14Q1J17j44PR5n8
$$ 82 -50 -96 50 42 -81 -91 58 -42 -97 -36 53 -89 -107 72 2 -91 -21 28 -25 -139 -58 59 -85 -78 17 -41
2625d1q6N9N0l6l9M7L1m7K1L8qr6MQ7k6n7L1K5lo9K7N9k3m4J5O0k7n9J21Kp5M6
$$ -41 -127 -68 -18 -54 -93 -46 -15 -62 -41 -3 -11 -107 -103 -16 -42 -99 -68 -43 -46 -115 -88 -29 -52 -96 -81 -21 -48 -107 14 16 -59 -13
2657a3J04n6j29J34L8j04p5J58P4j49O0J15n6j32J47J11j98K6Q0N6r8n7J31n0
$$ -13 91 35 -94 40 78 -26 -101 57 131 -18 42 157 101 -31 116 227 29 55 135 191 93 36 167 117
2681A17r6J06K2n5KQ8l1j8l3J09n0j29J26O8q5k9L1K9M2j37J30k1k3k4O7p4o3
$$ 117 21 127 149 94 96 184 153 135 102 211 161 32 158 226 141 112 143 172 214 77 207 186 163 139 206 132 69
2708F9L2J15m3r2L5K7n8p7R3J8j68P3O3o2k3J0N2n7q8K5R2j24N7L1n8k8K8oo1
$$ 69 101 216 173 81 116 143 85 8 101 119 -49 24 87 25 2 12 64 7 -81 -56 36 -88 -31 0 -58 -86 -58 -64 -125
2737a25J7m1P4r3K6M1m0Qn7J13n9m2J9Q9qj18Q1l8J8j8J4Po2M0K3n8j3J7Q7o6
$$ -125 -108 -149 -75 -168 -142 -101 -141 -133 -190 -77 -136 -178 -159 -70 -78 -196 -115 -153 -135 -153 -139 -132 -194 -154 -131 -189 -202 -185 -98 -164
2767a64j5M8J8q9mmL2j6K3O2r3mQ6NK4n2n%M5j9M4N5o2J6M6l0J8N9Kl5l6N6l2
$$ -164 -179 -131 -113 -202 -206 -210 -178 -194 -171 -109 -202 -206 -120 -115 -91 -143 -148 -148 -103 -122 -78 -23 -85 -69 -23 -53 -35 24 26 -9 -45 11 -21
2800b1k8J1Q7l5KRN6J1n3K5M2p3k9L3m3K0O3J9l5Ok3K0PRqrL3%M4m4O7J1m2JO3
$$ -21 -49 -38 49 14 16 25 81 92 39 64 106 33 4 37 -6 14 77 96 61 67 44 64 71 80 72 63 96 96 140 96 163 174 132 133 196
2835A96Oj07P6K0n9M1rK7o0O5m3M5n3ML9pk9J7Qq9O3k9pm6Q2j5o6kP3n2NO1j06
$$ 196 202 95 171 191 132 173 164 191 131 196 153 198 145 149 188 181 152 169 177 88 151 122 115 69 151 136 70 68 141 89 94 155 49
2868D9oL6m3L2jK8k5m5P1o3l7J06j04J02n7j4J6J4k1k0q7O6M9r3j3P4k0m5L4j
$$ 49 43 79 36 68 67 95 70 25 96 33 -4 102 -2 100 43 29 45 59 38 18 -69 -3 46 -47 -60 14 -6 -51 -17 -18
2898a8m9n2O0Ko4q4J55r7k2M2K2q4p1R5J3n2P3qk5J3J6%n4L8K2K9K2k3On9L1K5
$$ -18 -67 -119 -59 -57 -121 -205 -50 -147 -169 -127 -105 -189 -260 -165 -152 -204 -131 -139 -164 -151 -135 -135 -189 -151 -129 -100 -78 -101 -95 -154 -123 -98
2930i8QlJ4j4K3K3m4k6M3M6q6O2N6j16K9M1Q4j61M8J40r0q8R5Q0j37m0J19K9j76
$$ -98 -90 -93 -79 -93 -70 -47 -91 -117 -74 -28 -114 -52 4 -112 -83 -42 42 -119 -71 69 -21 -109 -14 66 -71 -111 8 37 -139
2959a39O9O4j1mQ1k2m8j6J42r3q7R0P4n3q1J72K6j29J00Ro4q3O0Q5q4k7O7k4n6
$$ -139 -70 -6 -17 -21 60 38 -10 -26 116 23 -64 26 100 47 -34 138 164 35 135 144 80 -3 57 142 58 31 98 74 18
2988A8N1j0n9P5o6O2J1o7j9N8L6r0K0L2kq5M9N5r3m4J13K2j22K7N6ro8J01nk6
$$ 18 69 59 0 75 9 71 82 15 -4 54 90 0 20 52 50 -35 14 69 -24 -68 45 67 -55 -28 28 19 -49 52 47 21
3018B1q0J44J8j80P1R5q4p2MJ37r5K5R5q7j03R0P0j07p2J02J6p0O1Mk6k4J7K5
$$ 21 -59 85 103 -77 -6 89 5 -67 -63 74 -21 4 99 12 -91 -1 69 -38 -110 -8 8 -62 -1 3 -23 -47 -30 -5
3046eLj7oJ3km2O7o4Q1k9o9R2j6m0L1J07q7j10Q3R0j54j3J86j9j27R1J3o7qJ13
$$ -5 -2 -19 -25 -12 -14 -56 11 -53 28 -1 -70 22 6 -34 -3 104 17 -93 -10 80 -74 -87 99 80 -47 44 57 -10 -18 95
3076I5kj54R3L3o9m2P2K3q4j5J22j4n9pP6j02j5P2J2o0M4kj7J2K3k4kk4oN5M0
$$ 95 93 -61 32 65 -4 -46 26 49 -35 -50 72 58 -1 -8 68 -34 -49 23 35 -25 19 17 0 12 35 11 9 -15 -21 34 74
3107G4p7l7Q7K5n9m8Q6l9q8R2NK8o2P6kj01M0J04k7j08MJ25r2l4J00pj00j4J17
$$ 74 -3 -40 47 72 13 -35 51 12 -76 16 21 49 -13 63 61 -40 0 104 77 -31 -27 98 6 -28 72 65 -35 -49 68
3136F8p2%L5M1m8l5P1m7l0pQ4q9m8M2L8l1J6l1K2L2q3K3j2LORm1Ok3R4rj01M6
$$ 68 -4 -4 31 72 24 -11 60 13 -17 -24 60 -29 -77 -35 3 -28 -12 -43 -21 11 -72 -49 -61 -58 -52 -43 -84 -78 -101 -7 -16 -117 -71
3169g1R7n2j08O9Q7q6j38J85P6j86QJ14J5j40O6L8j09qJ98o5j58R5Q5p4q5P0M6
$$ -71 26 -26 -134 -65 22 -64 -202 -17 59 -127 -119 -5 10 -130 -64 -26 -135 -143 55 -10 -168 -73 12 -62 -147 -77 -31
3196c1j0r2P1O0j09M3O3o9L0pRj5OP0l8K1o7J11l1k2qM6k6Lo1J18J5m6J1P1pj35
$$ -31 -41 -133 -62 -2 -111 -68 -5 -74 -44 -51 -42 -57 -51 19 -19 2 -65 46 15 -7 -15 31 5 8 -53 65 80 34 45 116 109 -26
3228b6J06Q1j11L2O9Oq0qJ09o7n1M4J0j12L2O0J8j37P6Q4o9p0O3Rm7J1M1j5p3
$$ -26 80 161 50 82 151 157 77 69 178 111 60 104 114 2 34 94 112 -25 51 135 66 -4 59 68 21 32 73 58 -15
3257a5N7M8r1N1m3O6qm2K6M8o1J7K3n9J6l1J04jk9n7J17o1m1K2%L1j03L7L7j13
$$ -15 42 90 -1 50 7 73 65 23 49 97 36 53 76 17 33 2 106 105 76 19 136 75 34 56 56 87 -16 21 58 -55
3287e5lJ08p1m2J5N1n0m1P1J0o2n0J10m8qL8M4k8k2o1O3p9M3K5N9j16J2Q3l1j8
$$ -55 -58 50 -21 -63 -48 3 -47 -88 -17 -7 -69 -119 -9 -57 -65 -27 17 -11 -33 -94 -31 -110 -67 -42 17 -99 -87 -4 -35 -53
3317e3K9Q1j18OM4O4m8n8P0No7L7M2r6rK6ql9J3K4M6q2j1P0jq7M0J7jo0Q4om6
$$ -53 -24 57 -61 -55 -11 53 5 -53 17 22 -45 -8 34 -62 -71 -45 -53 -92 -79 -55 -9 -91 -102 -32 -33 -120 -80 -63 -64 -124 -40 -46 -92
3350i2j8M5lk3L4O0j2j8p0O3O8j18Q5j6L9q4J03j0o3L9K5j0q0Q1j9n7j6K4P8l8
$$ -92 -110 -65 -68 -91 -57 3 -9 -27 -97 -34 34 -84 1 -15 24 -60 43 33 -30 9 34 24 -56 25 6 -51 -67 -43 35 -3
3380cnK5J2q6N6L1k6k5J7Rk8m2R9m1n0Q2qK7k5l8R6n5MM3j6Kn2J56q4M1k7j2Q
$$ -3 -8 17 29 -57 -1 30 4 -21 -4 5 -23 -65 34 -7 -57 25 17 44 19 -19 77 22 26 69 53 55 3 159 75 116 89 77 85
3413H5j2l0K5l0kK5J0j8j1LK3j1k8M6k4l5N3o7J8PN4o0Kl0M6l6m7P4j00K3K9N0
$$ 85 73 43 68 38 36 61 71 53 42 45 68 57 29 75 51 16 69 2 20 27 81 21 23 -7 39 3 -44 30 -70 -47 -18 32
3445C2Lk6r3N9Ol7R3k5j5Kk6L8K4n5J2k8JK6M3m3R8j32RQ3l4j6l7M2l7J7j3L3
$$ 32 35 9 -84 -25 -19 -56 37 12 -3 -1 -27 11 35 -20 -8 -36 -35 -9 34 -9 89 -43 -34 49 15 -1 -38 4 -33 -16 -29 4
3477DJ6k6qL2q4M5l2pJ1P0k2o6R5j3m0k7J04p4m1nL5l2J2M2L3q7K1N6n6P1k2J2
$$ 4 20 -6 -14 18 -66 -21 -53 -60 -49 21 -1 -67 28 15 -25 -52 52 -22 -63 -68 -33 -65 -53 -11 22 -65 -44 12 -44 27 5 17
3509A7o7O1j0k3P5m2l5P3k4j8K2K4k3j8k8R2r4n0J31nj07QQ2k7j19P6Rok9M2L0
$$ 17 -50 11 1 -22 53 11 -24 49 25 7 29 53 30 12 -16 76 -18 -68 63 58 -49 -41 41 14 -105 -29 -20 -26 -55 -13 17
3540A7r6J8M2K9n8k4P3k2n6k4R8n4K8K1O4j26J14l4J5K6m0K4l4jO1n6M6Ok9L1
$$ 17 -79 -61 -19 10 -48 -72 1 -21 -77 -101 -3 -57 -29 -8 56 -70 44 10 25 51 11 35 1 0 61 5 51 57 28 59
3570E9p4N1k6M2r8OQ7M4j39O3mjq3L6R9q4j1Q3q7L7n8J43j31L0J6Lk9n5Q0l7J2
$$ 59 -15 36 10 52 -46 -40 47 91 -48 15 11 10 -73 -37 62 -22 -33 50 -37 0 -58 85 -46 -16 0 3 -26 -81 -1 -38 -26
3601b6K2Q4l7r0Q5K5o2j0M1R2r0l6Q1%k7L4m1Mn0J8J08p6q5N7O2j32J7N7om1j1
$$ -26 -4 80 43 -47 38 63 1 -9 32 124 34 -2 79 79 52 86 45 49 -1 17 125 49 -36 21 83 -49 -32 25 19 -22 -33
3632c3P9o9rK8M1j27L9L6Rm8M8R0r5q2O3J05j20MJ09j9o0MP2Ml5K7K6j01M9N7
$$ -33 46 -23 -32 -4 37 -90 -51 -15 -6 -54 -6 84 -11 -93 -30 75 -45 -41 68 49 -11 -7 65 69 34 61 87 -14 35 92
3662I2p0K3K8k7k5L4%J4m5N4j01J26j02j4K4Nok7N0J5n7m5M9L6o9n4J12l1o8M0
$$ 92 22 45 73 46 21 55 55 69 24 78 -23 103 1 -13 11 16 10 -17 33 48 -9 -54 -5 31 -38 -92 20 -11 -79 -39
3692c9L8n0k4J11K8q5J5K9k3k3J9L8l7j3P8l2k6K9j2k6m4N2N6q6K8oP1j02J4k6
$$ -39 -1 -51 -75 36 64 -21 -6 23 0 -23 -4 34 -3 -16 62 30 4 33 21 -5 -49 3 59 -27 1 -5 66 -36 -22 -48
3722d8O4l7m6m4N1K5n5P4m6J4J5k6L0m3kL8n8PM7J1l1N2O6l0j06Q6k7J0l3N0j2
$$ -48 16 -21 -67 -111 -60 -35 -90 -16 -62 -48 -33 -59 -29 -72 -74 -36 -94 -87 -40 -29 -60 -8 58 28 -78 8 -19 -9 -42 8 -4
3753dm5O2k7J1J4k4K8J8k9K6Kr1N9J0J1o6R2j0o4LO8l5p3K4K9p%LN0P3j28J0M
$$ -4 -49 13 -14 -3 11 -13 15 33 4 30 32 -59 0 10 21 -45 47 37 -27 -24 44 9 -64 -40 -11 -18 -18 -15 35 108 -20 -10 -6
3786fQk1k0N9l8J5L2m2j2K4M9K9m3K8n1Qn2P3J2l2m2N9N4o8j9K8k6L9Nj5p1O7
$$ -6 2 -19 -39 20 -18 -3 29 -13 -25 -1 48 77 34 62 11 19 -33 40 52 20 -22 37 91 23 4 32 6 45 50 35 -36 31
3818C1krk5m0O7M8q9OR3L1j02m5N1p2K9Nj6P4n4L8m7J8j6P9q5Ml9M8kRL1M9q8
$$ 31 29 20 -5 -45 22 70 -19 -13 80 111 9 -36 15 -57 -28 -23 -39 35 -19 19 -28 -10 -26 53 -32 -28 -67 -19 -21 -12 19 68 -20
3851b0l6J42n7nm0P9J5r3j1O6o9JN7J8k2n3L6ok1K9O1j38M4lP7m3L1m8k5nJO9
$$ -20 -56 86 29 24 -16 63 78 -15 -26 40 -29 -28 29 47 25 -28 8 2 -19 10 71 -67 -23 -26 51 8 39 -9 -34 -39 -38 31
3883C1m7m6omP3k2k4qK0M8MLk4p6R4j6j05N8O4k9n2P0l3J7nL8o0n1N1LQ1q5J6
$$ 31 -16 -62 -68 -72 1 -21 -45 -53 -33 15 19 22 -2 -78 16 0 -105 -47 17 -12 -64 6 -27 -10 -15 23 -37 -88 -37 -34 47 -38 -22
3916b2J00j44M9LM5p7K6O4j7l8j6N3l2j3PR5j32N8Rj4o5N1J8k6j2MQ2o8p1J22
$$ -22 78 -66 -17 -14 31 -46 -20 44 27 -11 -27 26 -6 -19 -12 83 -49 9 18 4 -61 -10 8 -18 -30 -26 56 -12 -83 39
3946C9k4j8J6L0l2l0N6K8j0l6jjrM7n5rL2k1M3Rq6J9O1m5k7K1L5o3j1J03Pl9k1
$$ 39 15 -3 13 43 11 -19 37 65 55 19 18 17 8 55 0 -9 23 2 45 54 -32 -13 48 3 -24 -3 32 -31 -42 61 68 29 8
3979HK9n9JJ4M9p2k0N1k4kkQNj2K1J1q2N0M4j5o6N4J2j0j0J0K8J2o9M4Jl0N6%
$$ 8 37 -22 -21 -7 42 -30 -50 1 -23 -25 -27 -19 -14 -26 -5 6 -76 -26 18 3 -63 -9 3 -7 -17 -7 21 33 -36 8 9 -21 35 35
4013C5l2pm2N9k6K7l3KN5n3kP3l1j9m1J1n3O5l7J10m9lJ0J6q5N4o2J00on8K8P
$$ 35 3 -4 -46 13 -13 14 -19 -17 38 -15 -17 56 25 6 -35 -24 -77 -12 -49 61 12 9 19 35 -50 4 -58 42 36 -22 6 13
4045A3jL4k8ooO0p1K0KMJ9l2L3j7n0J0M1k6K8k2QL4n8JJ8K5j8m7L8k5L0JM6p6
$$ 13 12 46 18 12 6 66 -5 15 17 21 40 8 41 24 -26 -16 25 -1 27 5 13 47 -11 -10 8 33 15 -32 6 -19 11 12 58 -18
4079a8m9J43Mj16L5M0n1K5l0R0j20M5K0k5%N1o8M9j04O5N7M7j04N9l2r1Q5j8O3
$$ -18 -67 76 80 -36 -1 39 -12 13 -17 73 -47 -2 18 -7 -7 44 -24 25 -79 -14 43 90 -14 45 13 -78 7 -11 52
4108E2n8L0m1K8l1QMKq3J02j4m5L0O4l7p1M1J7j7m7N6L2q1kM8L9m5j6N7om5rQ4
$$ 52 -6 24 -17 11 -20 -12 -8 -6 -89 13 -1 -46 -16 48 11 -60 -19 -2 -19 -66 -10 22 -59 -61 -13 26 -19 -35 22 16 -29 -38 46
4141D6n0l8k9J12j07L9K8l5jk4P6m9m9O5J5j4q2J08J8m0n9R5o1K1J6L0m5j2Q1
$$ 46 -4 -42 -71 41 -66 -27 1 -34 -35 -59 17 -32 -81 -16 -1 -15 -97 11 29 -11 -70 25 -36 -15 1 31 -14 -26 55
4170E5j8l6k0J4j3nj8P0n8K2OK8l3l8Q2ll0j6O3pm2J6m3M0j05P7M1n2J3L3L0n6
$$ 55 37 1 -19 -5 -18 -23 -41 29 -29 -7 -1 27 -6 -44 38 35 5 -11 52 45 3 19 -24 16 -89 -12 29 -23 -10 23 53 -3
4202coj9KQ6o0N9l3NL5l1L6j25J01j6Ok1pJ4K3J5Qm7k9P3J5l5M0j7j5n1L6n0K7
$$ -3 -9 -28 -26 60 0 59 26 31 66 35 71 -54 47 31 37 16 9 23 46 61 69 22 -7 66 81 46 86 69 54 3 39 -11 16
4235A6r3P1K0m0M0j5%n6N2L6o4krJ4M6m4KL3p1PQ4k7k9K9mj2j3l2J20mp3Q4r7
$$ 16 -77 -6 14 -26 14 -1 -1 -57 -5 31 -33 -35 -44 -30 16 -28 -26 7 -64 -57 27 0 -29 0 -4 -16 -29 -61 59 55 -18 66 -31
4268c1K7k0k3N5m1j2K9k8j2J1QL8j5Qo2J3J6L3n0l0Q4j04J02j6k5mk7nM8lj7J
$$ -31 -4 -24 -47 8 -33 -45 -16 -44 -56 -45 -37 1 -14 -6 -68 -55 -39 -6 -56 -86 -2 -106 -4 -20 -45 -49 -76 -81 -33 -36 -53 -52
4300e2K2LRN4j9k0L2j3L1j4m5L7No8O8pm7J7K9K1j7m7J6M7k5m2O6k7p4R1l6k0
$$ -52 -30 -27 -18 36 17 -3 29 16 47 33 -12 25 30 -38 30 23 -24 -7 22 43 26 -21 -5 42 17 -25 41 14 -60 31 -5 -25
4332b5J1Nm0L7k7k7J8J5k3L0J7J1M5p1L9j0K4lM2l0PL9n2qpN3p0N2J05j12m2K5
$$ -25 -14 -9 -49 -12 -39 -66 -48 -33 -56 -26 -9 2 47 -24 15 5 29 26 68 38 45 84 32 24 17 70 0 52 157 45 3 28
4364B8%J4o6N9k3M2m3lk1J1P1o3k8mM0M2o9L0k1rk4l3N8M1J9j22J17m3m6O2J3
$$ 28 28 42 -24 35 12 54 11 8 -13 -2 69 6 -22 -26 14 56 -13 17 -4 -13 -37 -70 -12 29 48 -74 43 0 -46 16 29
4395B9n8P0n2N4Ro3N7Pj5k4lrk1L0L8n3L3j00J26j09kJ11q6P6o9o6O6l9M5L5l2
$$ 29 -29 41 -11 43 52 -11 46 53 38 14 11 2 -19 11 49 -4 29 -71 55 -54 -56 55 -31 45 -24 -90 -24 -63 -18 17 -15
4426a5j4mL0l6j1J2P7j3q5N9l7J3PNpPk1mk8P4L1n6j7N3m3L3pk4O7nm8QL4q2P0
$$ -15 -29 -33 -3 -39 -50 -38 39 26 -59 0 -37 -24 -17 -12 -19 -12 -33 -37 -65 9 40 -16 -33 20 -23 10 3 -21 46 41 -7 1 35 -47 23
4461B3J2k6j4L4Lj9l1P6j2p6M3m3P3n7J4j2K7m3M3km9N2l2K7KL5m3L8q2L3M8l2
$$ 23 35 9 -5 29 32 13 -18 58 46 -30 13 -30 43 -14 0 -12 15 -28 15 13 -36 16 -16 11 13 48 5 43 -39 -6 42 10
4493A0N4p6M4k0l4P6r4J7P2l8qK7k4ml1P1Qok4NL5q7J2K4L4p9j2O6L8k4%j7M0
$$ 10 64 -12 32 12 -22 54 -40 -23 49 11 3 30 6 2 -29 42 50 44 20 25 60 -27 -15 9 43 -36 -48 18 56 32 32 15 55
4526E5o4n4J09p3n3J18no2j9P1q0K7L4K9Rp6j5N4n9J0K4K3l7m1K8L7qK7j6j1k2
$$ 55 -9 -63 46 -27 -80 38 33 -29 -48 23 -57 -30 4 33 42 -34 -49 5 -54 -44 -20 3 -34 -75 -47 -10 -18 9 -7 -18 -40
4557d0O4kn6N2Ml4k9K8K6J9r5P9L4p8n1N0K7n1k1K9O0l3j8N4l1nO2j04pK5n1J08
$$ -40 24 22 -34 18 22 -12 -41 -13 13 32 -63 16 50 -28 -79 -29 -2 -53 -74 -45 15 -18 -36 18 -13 -18 44 -60 -67 -42 -93 15
4589A5m7k7O1k5K8ok8M3K4nj8l7Q1k3J6k4QRj7K0K3mMk0r0P4L6m6p7J01m6j7J1
$$ 15 -32 -59 2 -23 5 -1 -29 14 38 33 15 -22 59 36 52 28 36 45 28 48 71 67 71 51 -39 35 71 25 -52 49 3 -14 -3
4622cnMLO2o3J6K4Nn1lM5j5M1n8K1J2o2J5qQ5l5q4N6K2M0l1MQq0M2L2k1l3N8n5
$$ -3 -8 -4 -1 61 -2 14 38 43 -8 -11 34 19 60 2 23 35 -27 -12 -20 65 30 -54 2 24 64 33 37 45 -35 7 39 18 -15 43 -12
4657a2O6po5M3k2KL0l8k6O8q1oJ6M0l5l9O7k4Mq2N8K8k2L5l0M6j9j9J7Kl8L8o
$$ -12 54 47 -18 25 3 5 35 -3 -29 39 -42 -48 -32 8 -27 -66 1 -23 -19 -101 -43 -15 -37 -2 -32 14 -5 -24 -7 -5 -43 -5 -11
4690a1Rk5M7J7k2K1j4J8m2J8qk1J6j1K2j2l3O3n0j7J9mK8j07L7Q5r2K6J2K3r6
$$ -11 -2 -27 20 37 15 36 22 40 -2 16 8 -13 3 -8 14 2 -31 32 -18 -35 -16 -20 8 -99 -62 23 -69 -43 -31 -8 -104
4721a04L1L5p5J04j1M4L0p1j5QJ4o1O1N7l8j0KPK6n2K2M1j3P9j02J8j4N5k0k9
$$ -104 -73 -38 -113 -9 -20 24 54 -17 -32 -24 -10 -71 -10 47 9 -1 1 8 34 -18 4 45 32 111 9 27 13 68 48 19
4751A9n2R8k7ol9N3k0Q%qRm0R7l5j03pQ6M9j18M5M6n5jK1j8PLQ6j10N8J2oL0m5
$$ 19 -33 65 38 32 -7 46 26 34 34 26 35 -5 92 57 -46 -53 33 82 -36 9 55 0 -1 20 2 9 12 98 -12 46 58 52 82 37
4785C7nk0M1ol5J2oN5m1k5kn5Q2l9M3q4K6K9oQ0r2j6l5J1OM1L2o6Q4j05M1LJ6
$$ 37 32 12 53 47 12 24 18 73 32 7 5 -50 32 -7 36 -48 -22 7 1 81 -11 -27 -62 -51 -45 -4 28 -38 46 -59 -18 -15 1
4818Ak8K1j3k3k0N0L5q8L0j1M2l6R1j7o0L8m8NNl0O8rn1N5j5kk3J7ljPl5L1j2
$$ 1 -27 -6 -19 -42 -62 -12 23 -65 -35 -46 -4 -40 51 34 -26 12 -36 -31 -26 -56 12 3 -48 7 -8 -10 -33 -16 -19 -20 -13 -48 -17 -29
4852b9l2P1o6M2j6M2j8J6L0n6J8jp8K0l7R2PJ5k0LPJ9m8K5Q2j08J4JM2k5n8N9
$$ -29 -61 10 -56 -14 -30 12 -6 10 40 -16 2 1 -77 -57 -94 -2 5 20 0 3 10 29 -19 6 88 -20 -6 -5 37 12 -46 13
4884A3K9n7O2m6J8MqM1l5qK5K3m8Ok7kK1J9m2oM7j8K6nk6MJjrP6m7l0M3N9j74
$$ 13 42 -15 47 1 19 23 15 56 21 13 38 61 13 19 -8 -10 11 30 -12 -18 29 11 37 32 6 10 11 10 1 77 30 0 43 102 -72
4919g2L8N8jo1N6Jo1J2N0Jpm1J5j8J1Rln1J6Q3QMp4L3m2K9K6j0Mn7J3Q1k5m6K6
$$ -72 -34 24 23 -38 18 19 -42 -30 20 21 14 -27 -12 -30 -19 -10 -13 -64 -48 35 43 47 -27 6 -36 -7 19 9 13 -44 -31 50 25 -21 5
4954Elj2n4L3nJ2mL4k4j5J2M9Kj9n8J2oo5Q3j0k7RJ7PK2m0%m6N3mK5k8k3L8O7
$$ 5 2 -10 -64 -31 -36 -24 -28 6 -18 -33 -21 28 30 11 -47 -35 -41 -106 -23 -33 -60 -51 -34 -27 -5 -45 -45 -91 -38 -42 -17 -45 -68 -30 37
4989C7l0l0M1k1n2P0L5m5K2pN8j36K8J4K7o4Q6j2K9j60Q4L6k5L7J6k2k1J4Qk3
$$ 37 7 -23 18 -3 -55 15 50 5 27 20 78 -58 -30 -16 11 -53 33 21 50 -110 -26 10 -15 22 38 16 -5 9 17 -6
5019fMk7P8m6j7%N6m7J3l7Kj3Q6l8j4o8J07M1n4kM2J1Po7K6J07p3n4J3n3K5L3
$$ -6 -2 -29 49 3 -14 -14 42 -5 8 -29 -27 -40 46 8 -6 -74 33 74 20 18 60 71 78 11 37 144 71 17 30 -23 2 35
5051C5l0K0l4J0l1M8N4m5n9K4J0j8O6l9kQl5O0o0M7l2J9K7m0m6K1J6lj2j9J01
$$ 35 5 25 -9 1 -30 18 72 27 -32 -8 2 -16 50 11 9 17 -18 42 -18 29 -3 16 43 3 -43 -22 -6 -9 -21 -40 61
5082F1p3Mmj5l2Q3q4N3M9o9J6M6p0N0K6j26J05l2J3k0M0jj7Nn2P6n8jOkn2K1N9
$$ 61 -12 -8 -12 -27 -59 24 -60 -7 42 -27 -11 35 -35 15 41 -85 20 -12 1 -19 21 20 3 8 -44 32 -26 -27 -21 -23 -75 -54 5
5115En2RN2j9J3k3K2n0L1M4r6N1kl4Q0J4j9q8O3Lk9N8j13O4pO2%k1j9N9o5l2Q
$$ 5 -47 -38 14 -5 8 -15 7 -43 -12 32 -64 -13 -15 -49 31 45 26 -62 1 4 -25 33 -80 -16 -23 39 39 18 -1 58 -7 -39 -31
5148c1N0m2k8O6l8O3K1jr9L5m3M8nN2n0ll0M0%k7L9l0K9k1J6j1J5J8k7k2R4j9
$$ -31 19 -23 -51 15 -23 40 61 60 -39 -4 -47 1 -4 48 -2 -5 -35 5 5 -22 17 -13 16 -5 11 0 15 33 6 -16 78 59
5180E9m3MJ8r1M0PN0kl0j2J5j8N4L0m9l5K3kj1L6q2M8k8O7l5j6pRN6j5m3PkQn8
$$ 59 16 20 38 -53 -13 -6 44 42 12 0 15 -3 51 81 32 -3 20 18 7 43 -39 9 -19 48 13 -3 -10 -1 55 40 -3 4 2 10 -48
5215d8M6k2m4M6L2l3J4k3O7r5O5j1J4j3j0O5q7nK2J4m2K8kk0NL0k6QN2p2K7oK
$$ -48 -2 -24 -68 -22 10 -23 -9 -32 35 -60 5 -6 8 -5 -15 50 -37 -42 -20 -6 -48 -20 -22 -42 -37 -7 -33 -25 27 -45 -18 -24 -22
5248b2K3k2N6l6L5n2J3OoLj2M3l4m6K7P2m9j0N9l7Kk3l2J00j03K9J2P4q3j5M7
$$ -22 1 -21 35 -1 34 -18 -5 1 -5 -2 -14 29 -5 -51 -24 48 -1 -11 48 11 13 -10 -42 58 -45 -16 -4 70 -13 -28 19
5279A9j4l4L7K1n2K0QJ2m6m5M3O0l3k2K3K1l7k9J19l7oL6m8K9l7L1J2m2K4mPn2
$$ 19 5 -29 8 29 -23 -3 5 17 -29 -74 -31 29 -4 -26 -3 18 -19 -48 71 34 28 64 16 45 8 39 51 9 33 29 36 -16
5311a6J3L3M9m7l6P1j8q4Q0J6l2k9j2N3l6j8K0K5k7j6L5M2j07M0m7Q8k4n4M0m8
$$ -16 -3 30 79 32 -4 67 49 -35 45 61 29 0 -12 41 5 -13 7 32 5 -11 24 66 -41 -1 -48 40 16 -38 2 -46
5341d6L7Q2j7pm0M9l5J2j7k8k8O2qkm3K4O1J0l0p0l9N2M5Oj5p0K8K7K9p9L5LK6
$$ -46 -9 73 56 49 9 58 23 35 18 -10 -38 24 16 14 -29 -5 56 66 36 -34 -73 -21 24 30 15 -55 -27 0 29 -50 -15 -12 14
5374A4j8q7Q7mJoL0j14O0L9m8PM9J3m6l7R8q0K8K7K4l5Lj0J9j9k1O5J1q0J3j6
$$ 14 -4 -91 -4 -8 -7 -13 17 -97 -37 2 -46 -39 10 23 -23 -60 38 -42 -14 13 37 2 5 -5 14 -5 -26 39 50 -30 -17 -33
5406c3Q5q9M1%M1k7K1l2M2k5m7M0nn1L5oj7K0pNNKJ5mn5N9qj3j5K2j2k5K5NJ2
$$ -33 52 -37 4 4 45 18 39 7 49 24 -23 17 12 -39 -4 -10 -27 -7 -14 -9 -4 -2 13 9 -46 13 5 -8 -23 -1 -13 -38 -13 -8 4
5441DNn0R7K1l6N9o8k1M3p2N8m5L7%k0rkJ3P7r9K9L1q3M8pk6j5J4L3j1K0PK2p5
$$ 4 9 -41 56 77 41 100 32 11 54 -18 40 -5 32 32 12 3 1 14 91 -8 21 52 -31 17 10 -16 -31 -17 16 5 25 32 54 -21
5475b1LO4j9m1j7Q5l5J2n9K0M7n0K1M2m4n2O0l0j0kO3k0m3K2O5n7k3kM6o2K3K8
$$ -21 -18 46 27 -14 -31 54 19 31 -28 -8 39 -11 10 52 8 -44 16 -14 -24 -26 37 17 -26 -4 61 4 -19 -21 25 -37 -14 14
5507A4J9k2l3R9r1k9RJ4k9k1L2PoJ3k3L0j5pK4J5n8L3N5j0l1o3J02l7J1j8k2J2
$$ 14 33 11 -22 77 -14 -43 -34 -20 -49 -70 -38 -31 -37 -24 -47 -17 -32 -39 -15 0 -58 -25 30 20 -11 -74 28 -9 2 -16 -38 -26
5539b6L1L8l2l1kJ4RkL9m2k0K7Pm5m5J10ql3Jl8M1J8kK1Kp4N2L4q7M9p5N4l8K8
$$ -26 5 43 11 -20 -22 -8 1 -1 38 -4 -24 3 10 -35 -80 30 22 -11 -10 -48 -7 11 9 30 32 -42 10 44 -43 6 -69 -15 -53 -25
5573b5J6k5lM4l1K1M9l4PJ0Mo5K1N2o3N5n7K8L9J5k5n4P2n9N1j6J9l2J9j7j6O1
$$ -25 -9 -34 -37 7 -24 -3 46 12 19 29 33 -32 -11 41 -22 33 -24 4 43 58 33 -21 51 -8 43 27 46 14 33 16 0 61
5605F1o9k4R0o0j5NL5n8K4K2Rm7j4O9k6l4L9MJ6j05Q3k3k6OK4j6oO2k2l3M0k3
$$ 61 -8 -32 58 -2 -17 -12 23 -35 -11 11 20 -27 -41 28 2 -32 7 11 27 -78 5 -18 -44 -38 -14 -30 -36 26 4 -29 11 -12
5637a2K8l%K1J2l9NN2r5N2Lqq1J8N8nk0p2R1J3pj9l9N8m7j0P0J1k1j1L5n3%L7
$$ -12 16 13 13 34 46 7 12 64 -31 21 24 16 -65 -47 11 6 -14 -86 5 18 11 -8 -47 11 -36 -46 24 35 14 3 38 -15 -15 22
5671B2k9m8P2m2L2J1q6M2j5J9K1L8p7rM4L6o1J6L9J8k8L1l9rqO5j5p7P3k5o2L8
$$ 22 -7 -55 17 -25 7 18 -68 -26 -41 -22 -1 37 -40 -49 -5 31 -30 -14 25 43 15 46 7 -2 -10 55 40 -37 36 11 -51 -13
5703a3j4O4r2Q7o9J09o0o3N1j7KM5j5rj1n3O2Kl9qP7q5Q0j7M1p2K9L4n5Nm7R1
$$ -13 -27 37 -55 32 -37 72 12 -51 0 -17 -15 30 15 6 -5 -58 4 6 -33 -41 36 -49 31 14 55 -17 12 46 -9 -4 -51 40
5735D0l9J0k8OJ2K2k5N7r3R0l3l9Ql3M2J2lRk5QJ5lkJ9j6j4J6l4k4J01n2m4O7
$$ 40 1 11 -17 -11 1 23 -2 55 -38 52 19 -20 -12 -45 -3 9 6 15 -10 -2 13 10 8 27 11 -3 13 -21 -45 56 4 -40 27
5768B7N3r7l1M2m3L1J4J9p5O0L6m1n7N7jK5n5nK6kL7j6m2M4n7M2Rn8RM0k6K1j4
$$ 27 80 -17 -48 -6 -49 -18 -4 15 -60 0 36 -5 -62 -5 -6 19 -36 -41 -15 -17 20 4 -38 6 -51 -9 0 -58 -49 -9 -35 -14 -28
5801b8O5o2M2l4K9m9k8O3mJ0mj6j7Om6J4O8k7J9nj6j3O8Kr6J09p7M7q5P1%n0j7
$$ -28 37 -25 17 -17 12 -37 -65 -2 -6 4 0 -16 -33 -27 -73 -59 9 -18 1 -4 -20 -33 35 37 -59 50 -27 20 -65 6 6 -44 -61
5834f1Q8ql9M8m1J8j3k0L4K5k9NlQO5o2m4N7Jk2L9J2o1K2l3kN6k9Lo0mL8M8o6
$$ -61 27 19 -20 28 -13 5 -8 -28 6 31 2 7 4 12 77 15 -29 28 29 7 46 58 -3 19 -14 -16 40 11 14 -46 -50 -12 36 -30
5868c0O2j0lo4J00p9K1J2M0l8k4L6k2L1m1P8n8Jk3M8n4J7k6L1qm8O7L4l3l8N7
$$ -30 32 22 19 -45 55 -24 -3 9 49 11 -13 23 1 32 -9 69 11 12 -11 37 -17 0 -26 5 -3 -51 16 50 17 -21 36
5899C6rm1L9K0m8l0L6k6j4N0m0L2n3j1K1N0n4K1n0M4n5Q0ol1N7j5RqJ9K1l4Qq
$$ 36 27 -14 25 45 -3 -33 3 -23 -37 13 -27 5 -48 -59 -38 12 -42 -21 -71 -27 -82 -2 -8 -39 18 3 12 4 23 44 10 18 10
5932A0qm9R1j4m6nJ1O2k2l7l0M1J8n4J1lJ3rj4lN6qn3Q8j01K0L9k9K2K2l2kK9
$$ 10 2 -47 44 30 -16 -21 -10 52 30 -7 -37 4 22 -32 -21 -24 -11 -20 -34 -37 19 11 -42 46 -55 -35 4 -25 -3 19 -13 -15 14
5965A4m7N0j4m0O6ql5oL6o5M2O5jl8l6N6k0m2L8J7Jl6l6K5J3M0K3n5J1k7Lr4Q0
$$ 14 -33 17 3 -37 29 21 -14 -20 16 -49 -7 58 57 19 -17 39 19 -23 15 32 33 -3 -39 -14 -1 39 62 7 18 -9 -6 -100 -20
5998b0K7m5jO6o1K6k2M6m1Oj1%M6L3o9nK7L7m8N6p6Qk3M4J4rl8J1Q9p0j5R1j1
$$ -20 7 -38 -39 27 -34 -8 -30 16 -25 -19 -30 -30 16 49 -20 -25 2 39 -9 47 -29 -21 -44 0 14 5 -33 -22 67 -3 -18 73 62
6031F2k4l4L3m3j5N7Kn0K1J5J2j5pK5k2l1K0M8o6Rk3N6n5j2J0J4L6K0l8o1O6j7
$$ 62 38 4 37 -6 -21 36 38 -12 9 24 36 21 14 39 17 -14 6 54 -12 -3 -26 30 -25 -37 -27 -13 23 43 5 -56 10 -7
6063gm4L5L9m6L2j9K4k6K5J8l4j1J6j9LLm2R2J4Jj07L5O6j16N2k4N9k5l3O3K3
$$ -7 -51 -16 23 -23 9 -10 14 -12 13 31 -3 -14 2 -17 -14 -11 -53 39 53 54 -53 -18 48 -68 -16 -40 19 -6 -39 24 47
6094D7j03K8M2J4j8j8L7j0k9m0N6p6N5lL4j2p9P6k4j1K9k7Q4q4P4n1L3j1Jj5n5
$$ 47 -56 -28 14 28 10 -8 29 19 -10 -50 6 -70 -15 -18 16 4 -75 1 -23 -34 -5 -32 52 -32 42 -9 24 13 14 -1 -56
6125e6J07%m7J8M2%q2rM3K3l6pO5r4M2k3M1m4L7K2Mo5lN0j1m9K0k4PN0j4K0K4
$$ -56 51 51 4 22 64 64 -18 -27 16 39 3 -4 61 -33 9 -14 27 -17 20 42 46 -19 -22 28 17 -32 -12 -36 -29 21 7 27 51
6158E1k0o1J50j36NomJ3K3J9o4j3P3l7K3q0P1j0M6j7K4r9L9J8j7J0j5L0k8n1K1
$$ 51 31 -30 120 -16 -11 -17 -21 -8 15 34 -30 -43 30 -7 16 -64 7 -3 43 26 50 -49 -10 8 -9 1 -14 16 -12 -63 -42
6189d2qK9L9j5N1l7o3L0L1n8N1l4M7m2l8R8o6%N5l4L4m7O5r8K7L5k4O3o2J2L9
$$ -42 -50 -21 18 3 54 17 -46 -16 15 -43 8 -26 21 -21 -59 39 -27 -27 28 -6 28 -19 46 -52 -25 10 -14 49 -13 -1 38
6220C8m6k7J3L1n4J8M1j8L3k6pMm1O1n5K7j5P5rl8o0Q1K0q9L0j9M2pqj4M2k3K7
$$ 38 -8 -35 -22 9 -45 -27 14 -4 29 3 -4 0 -41 20 -35 -8 -23 52 43 5 -55 26 46 -43 -13 -32 10 3 -5 -19 23 0 27
6253B7L8j25k5O1kL7k6K5M8l3k9L4K4n9j9L1m5j3M3L0n5M9J9mk2J7Jk1k8L8J0
$$ 27 65 -60 -85 -24 -26 11 -15 10 58 25 -4 30 54 -5 -24 7 -38 -51 -8 22 -33 16 35 31 9 26 27 6 -22 16 26
6284B6m1M0k2K7n3N9Mn4QL1p3L7nM6Q%n3N2K4l2l1K6l9L3k9MN6q3M5M9l0p8Q2
$$ 26 -15 25 3 30 -23 36 40 -14 -6 25 -48 -11 -16 30 38 38 -15 37 61 29 -2 24 -15 18 -11 -7 49 -34 11 60 30 -48 34
6317C4Ql6j2oL2q2P5K6q2nO1M3o2k4J8O5o1l6M1OJ3l1L8op7K4K1k4mO6q9K3P5
$$ 34 42 6 -6 -12 20 -62 13 39 -43 -48 13 56 -6 -30 -12 53 -8 -44 -3 3 16 -15 23 17 -60 -36 -15 -39 -43 23 -66 -43 32
6350C2p2j8k7P6J0m3K0M1n8L0Jo8J6pN0N0k5p2pO8kj4k3P2j3o0J1M4k8J2KQj2
$$ 32 -40 -58 -85 -9 1 -42 -22 19 -39 -9 -8 -76 -60 -67 -17 33 8 -64 -71 -3 -5 -19 -42 30 17 -43 -32 12 -16 -4 -2 6 -6
6383fM4K2j08l3N2O0k9j9N4k8j9M8k0rk5M0J1jk7k0Kk2K5L7L9p8O8n1J4p0M8k8
$$ -6 38 60 -48 -81 -29 31 2 -17 37 9 -10 38 18 9 -16 24 35 34 7 -13 -11 -33 -8 29 68 -10 58 7 21 -49 -1 -29
6415b9%OK6j3RK6k5m5L8k6J1N9l1K4o4QJ9K3ql0K3K6ml0L7k8J0m6R7qo7J6J4n2
$$ -29 -29 -23 3 -10 -1 25 0 -45 -7 -33 -22 37 6 30 -34 -26 -7 16 8 -22 1 27 23 -7 30 2 12 -34 63 55 -12 4 18 -34
6449c4L9K5p6O4k9L6k8l2P2m4OK0o8L8P0n2Ll2K0J6N9l8n8K7K2m2k7j0R1m8J5
$$ -34 5 30 -46 18 -11 25 -3 -35 37 -7 -1 19 -49 -11 59 7 10 -22 -2 14 73 35 -23 4 26 -16 -43 -53 38 -10 5
6480Ej8l0K1J3L5KJ1n2O6p2K4L8p2L1l5N5m1nM4jNo1QN3pp5O6m0J8O0l4M1Ro3
$$ 5 -13 -43 -22 -9 26 28 39 -13 53 -19 5 43 -29 2 -33 22 -19 -24 20 19 24 -37 -29 24 17 -58 8 -32 -14 46 12 53 62 -1
6514am1Rl3J04o7j4M6l2M3Lm0M7Jn1j7M9nK1l2K4l6j2Q1jp5l3L1M1J1m7M6Jl4
$$ -1 -42 -33 -66 38 -29 -43 3 -29 14 17 -23 24 25 -26 -43 6 1 22 -10 14 -22 -34 47 46 -29 -62 -31 10 21 -26 20 21 -13
6547a3l8O4k9K6k7Pk2j1J9oj5k3N0J2j1OK0J2j9N3p6K3k2R0n8lK6Ro0O1J6k1K5
$$ -13 -51 13 -16 10 -17 -10 -32 -43 -24 -30 -45 -68 -18 -6 -17 -11 9 21 2 55 -21 2 -20 70 12 9 35 44 -16 45 61 40 65
6580F5l3k6L5j9l1nK0J5m4N0Kl6oJ7n7N4j3K6j2k5K1JJJ5K3l2k2JK4Nj2n4K5j
$$ 65 32 6 41 22 -9 -14 6 21 -23 27 29 -7 -13 4 -53 1 -12 14 2 -23 -2 -1 0 15 38 6 -16 -15 9 14 2 -52 -27 -28
6614b8m0N9K6o5L2N1k0m5nJ5K9k0ml6mL4k5Q4l4kM2r5n9Q2O4m9k0N3k1n5K6L6
$$ -28 -68 -9 17 -48 -16 35 15 -30 -35 -20 9 -11 -15 -51 -55 -21 -46 38 4 2 44 -51 -110 -28 36 -13 -33 20 -1 -56 -30 6
6646Fm0K7kJ1J5k3N5Oo1L9K2p9j5L1N5q2K1J5L1p1M2n9P2k0n1P8l4L7k6j7J5M5
$$ 6 -34 -7 -9 2 17 -6 49 55 -6 33 55 -24 -39 -8 47 -35 -14 1 32 -39 3 -56 16 -4 -55 23 -11 26 0 -17 -2 43
6678D3k0q5R2j2pk6K1J0nrk9k3O7Lk0K2L2n1L8l4l5L8m0L0pL8Rm6L8o9kO0l3K2
$$ 43 23 -62 30 18 11 -15 6 16 11 2 -27 -50 17 20 0 22 54 3 41 7 -28 10 -30 0 -7 31 40 -6 32 -37 -39 21 -12 10
6712A0j1j4l3JN2k1j5J8J0pj1MM9n4k1N1o7nM6N7o4N1k3k1NJ3n9O0l5L4Q1n9p1
$$ 10 -1 -15 -48 -47 5 -16 -31 -13 -3 -10 -21 -17 32 -22 -43 8 -59 -64 -18 39 -25 26 3 -18 -13 0 -59 1 -34 0 81 22 -49
6745d9O5l3l6N0L5j4n2L5Mmm3K8L9n4Pj6J9K2l1j5J3KM7m0Q0o2J0Ll0N1j7ll4
$$ -49 16 -17 -53 -3 32 18 -34 1 5 1 -42 -14 25 -29 -22 -38 -19 3 -28 -43 -30 -28 19 -21 59 -3 7 10 -20 31 14 11 -23
6778b3L3o9kR4Lk4K1l7%j2K7l0J3J9m8R%L1Pk4Qj2Nl4L7P1o5M4l6J8l1j8L6k3
$$ -23 10 -59 -61 33 36 12 33 -4 -4 -16 11 -19 -6 13 -35 -26 -26 5 12 -12 -4 -16 -11 -45 -8 63 -2 42 6 24 -7 -25 11 -12
6812a2M4n9l8M0K3kK6m5QP0o5n%M9j9m8P0k7kJ9%l2M7n7J0LO5k8l8L4k2L9K6n9
$$ -12 32 -27 -65 -25 -2 -4 22 -23 -15 55 -10 -15 -15 34 15 -33 37 10 8 27 27 -5 42 -15 -5 -2 63 35 -3 31 9 48 74 15
6846A5j8lJ9qKJ9l2k5J00l4l3j2K8pJ4k2k8M3pK6n0j0M4j4l4M8rk5Oj7L6L5p5
$$ 15 -3 -6 13 5 7 26 -6 -31 69 35 2 -10 18 11 25 3 -25 18 11 37 -13 -23 21 7 -27 21 12 -13 -7 -24 12 47 -28
6879b8k4N1oP5j17J4N2L1m1K1j1l2j0M4m5p5J36o9L2L4m3j3M9k8j5M0L7p1lK9
$$ -28 -52 -1 -7 68 -49 -35 17 48 7 28 17 -15 -25 19 -26 -101 35 -34 -2 32 -11 -24 25 -3 -18 22 59 -12 -15 14
6909A4j2p%KK3m9J1J4k6M6jJ2rl7J6J7rn7M5kj6L1k1n5N9J2NJ1kK0o1M1m1jL0
$$ 14 2 -5 -5 -3 20 -29 -18 -4 -30 16 15 27 18 -19 -3 14 5 -52 -7 -9 -25 6 -15 -70 -11 1 6 17 15 35 -26 15 -26 -27 3
6944CM9n6K2j8L1l0l6RP4m7Rj7l3M9J1l2M1l5nJ9n8k7O1J7L4Mm3m9N9j1K3j1n1
$$ 3 52 -4 18 0 31 1 -35 -26 48 1 10 -7 -40 9 20 -12 29 -6 -11 8 -50 -77 -16 1 35 39 -4 -53 6 -5 18 7 -44
6977d4N6Ol3K1Ok5k6K0L2%k5L2m6K3m3lO6m3O3n3J2k0J0M2J6r2Q2L8p3K2J4j5
$$ -44 12 18 -15 6 12 -13 -39 -19 13 13 -12 20 -26 -3 -46 -49 17 -26 37 -16 -4 -24 -14 28 44 -48 34 72 -1 21 35 20
7009B0k7O2n0j3nL6L9m6j8L2n0RJ5M5m7L7n8J16%r8J3J7j0Rk6K4l9j5k4M5K6l0
$$ 20 -7 55 5 -8 -13 23 62 16 -2 30 -20 -11 4 49 2 39 -19 97 97 -1 12 29 19 28 2 26 -13 -28 -52 -7 19 -11
7041a1K9l2M0k6k1j2PM3J1n8M3K7p0L8j4O9o8MP7j21nK4M2M4o2k3L3QLOl4Nm7
$$ -11 18 -14 26 0 -21 -33 -26 17 28 -30 13 40 -30 8 -6 63 -5 -1 76 -45 -50 -26 16 60 -2 -25 8 16 19 25 -9 -4 -51
7074e1M2K2p7P9k6Q2r0jj2j3L2l2P1j5k9pj2L0K4mn0l4J16o2N4l5N0n8n5P9j6
$$ -51 -9 13 -64 15 -11 71 -19 -20 -32 -45 -13 -45 26 11 -18 -25 -37 -7 17 13 -37 -71 45 -17 37 2 52 -6 -61 18 2
7105BK2m7Q5n1k8N0m8J1K1kL7n2J1k4L6q0O2J4j3j4J0L1ln1j2K8J7m0O5m6n1N1
$$ 2 24 -23 62 11 -17 33 -15 -4 17 15 52 0 11 -13 23 -57 5 19 6 -8 2 33 30 -21 -33 -5 12 -28 37 -9 -60 -9
7137iNJ9k3K8J7j6JO5r5qm0P2Oj5k1J4j0%o7J10n3mL2Km4K8N7l0j7Lk8QN1q8P1
$$ -9 -4 15 -8 20 37 21 22 87 -8 -16 -56 16 22 7 -14 0 -10 -10 -77 33 -20 -24 8 10 -34 -6 51 21 4 7 -21 -13 38 -50 21
$$ [...]
8191A1
##END NTUPLES=NMR FID
##END=
