##TITLE=1H_Pr Am NCS
 CDCl3, 8 sc, 
 4.08.2021
##JCAMPDX= 6.0         $$ Bruker NMR JCAMP-DX V2.0
##DATA TYPE= NMR FID
##DATA CLASS= NTUPLES
##ORIGIN= UXNMR, Bruker Analytische Messtechnik GmbH
##OWNER= root
$$ XWIN-NMR		Version 3.5
$$ Wed Aug  4 12:05:29 2021 Russian Standard Time (UT+4h)  she@DPX200
##.OBSERVE FREQUENCY= 200.131506
##.OBSERVE NUCLEUS= ^1H
##.DELAY= (6, 6)
##.ACQUISITION MODE= SIMULTANEOUS
##.ACQUISITION SCHEME= undefined
##.AVERAGES= 8
##.DIGITISER RES= 18
##SPECTROMETER/DATA SYSTEM= spect
##.PULSE SEQUENCE= zg30
##.SOLVENT NAME= CDCl3
##.SHIFT REFERENCE= (INTERNAL, CDCl3, 0, 15.7039)
##AUDIT TRAIL= $$ (NUMBER, WHEN, WHO, WHERE, WHAT)
$$ ##TITLE= Audit trail, XWIN-NMR		Version 3.5
$$ ##JCAMPDX= 5.01
$$ ##ORIGIN= Bruker BioSpin GmbH
$$ ##OWNER= she
$$ F:/spectra/data/she/nmr/H-F/1/audita.txt
$$ ##AUDIT TRAIL=  $$ (NUMBER, WHEN, WHO, WHERE, WHAT)
(   1,<2021-08-04 12:04:30.18 +0400>,<she>,<DPX200>,
      <created by zg, POWCHK disabled, PULCHK disabled
       configuration hash MD5:
       00 E9 B6 7A A2 85 ED C7 34 08 36 98 17 FE 4E 26
       data hash MD5: 16K
       68 30 66 4A CC DE 10 21 E6 D7 AE EF 76 88 32 72>)
$$ ##END=
$$ 
$$ hash MD5
$$ 35 52 BE 98 61 E9 5C B0 E0 68 99 B7 7A 54 C2 90
##$RELAX= 
##$RELAX= 
##$RELAX= 
##$RELAX= 
##$RELAX= 
##$RELAX= 
$$ Bruker specific parameters
$$ --------------------------
##$DU= <F:/spectra>
##$EXPNO= 1
##$NAME= <H-F>
##$PROCNO= 1
##$TYPE= <nmr>
##$USER= <she>
##$AMP= (0..31)
100 100 100 100 100 100 100 100 100 100 100 100 100 100 100 100 100 100 
100 100 100 100 100 100 100 100 100 100 100 100 100 100 
##$AQSEQ= 0
##$AQ_mod= 1
##$AUNM= <au_zg>
##$AUTOPOS= <>
##$BF1= 200.13
##$BF2= 200.13
##$BF3= 200.13
##$BF4= 200.13
##$BF5= 200.13
##$BF6= 200.13
##$BF7= 200.13
##$BF8= 200.13
##$BYTORDA= 1
##$CFDGTYP= 0
##$CFRGTYP= 5
##$CHEMSTR= <none>
##$CNST= (0..31)
1 1 145 1 1 1 1 1 1 1 1 1 1 1 1 1 1 1 1 1 1 1 1 1 1 1 1 1 1 1 1 1 
##$CPDPRG= <>
##$CPDPRG1= <>
##$CPDPRG2= <>
##$CPDPRG3= <>
##$CPDPRG4= <mlev>
##$CPDPRG5= <mlev>
##$CPDPRG6= <mlev>
##$CPDPRG7= <mlev>
##$CPDPRG8= <mlev>
##$CPDPRGB= <>
##$CPDPRGT= <>
##$D= (0..31)
0 1.2 0 0 0 0 0 0 0 0.06 0 0.03 0 0 0 0 0.0002 0 0 0 0 0 0 0 0 0 0 0 0 
0 0 0 
##$DATE= 1628064269
##$DBL= (0..7)
120 120 120 120 120 120 120 120 
##$DBP= (0..7)
150 150 150 150 150 150 150 150 
##$DBP07= 0
##$DBPNAM0= <>
##$DBPNAM1= <>
##$DBPNAM2= <>
##$DBPNAM3= <>
##$DBPNAM4= <>
##$DBPNAM5= <>
##$DBPNAM6= <>
##$DBPNAM7= <>
##$DBPOAL= (0..7)
0.5 0.5 0.5 0.5 0.5 0.5 0.5 0.5 
##$DBPOFFS= (0..7)
0 0 0 0 0 0 0 0 
##$DE= 6
##$DECBNUC= <off>
##$DECIM= 32
##$DECNUC= <off>
##$DECSTAT= 4
##$DIGMOD= 1
##$DIGTYP= 9
##$DL= (0..7)
0 120 120 120 120 120 120 120 
##$DP= (0..7)
150 150 150 150 150 150 150 150 
##$DP07= 0
##$DPNAME0= <>
##$DPNAME1= <>
##$DPNAME2= <>
##$DPNAME3= <>
##$DPNAME4= <>
##$DPNAME5= <>
##$DPNAME6= <>
##$DPNAME7= <>
##$DPOAL= (0..7)
0.5 0.5 0.5 0.5 0.5 0.5 0.5 0.5 
##$DPOFFS= (0..7)
0 0 0 0 0 0 0 0 
##$DQDMODE= 0
##$DR= 18
##$DS= 0
##$DSLIST= <SSSSSSSSSSSSSSS>
$$ [...]
##$SUBNAM2= <"">
##$SUBNAM3= <"">
##$SUBNAM4= <"">
##$SUBNAM5= <"">
##$SUBNAM6= <"">
##$SUBNAM7= <"">
##$SUBNAM8= <"">
##$SUBNAM9= <"">
##$SW= 20.0188882624521
##$SWIBOX= (0..15)
0 0 2 0 0 0 0 0 0 0 0 0 0 0 0 0 
##$SW_h= 4006.41025641026
##$TD= 16384
##$TD0= 1
##$TE= 0
##$TE2= 300
##$TE3= 300
##$TEG= 300
##$TL= (0..7)
0 120 120 120 120 120 120 120 
##$TP= (0..7)
150 150 150 150 150 150 150 150 
##$TP07= 0
##$TPNAME0= <>
##$TPNAME1= <>
##$TPNAME2= <>
##$TPNAME3= <>
##$TPNAME4= <>
##$TPNAME5= <>
##$TPNAME6= <>
##$TPNAME7= <>
##$TPOAL= (0..7)
0.5 0.5 0.5 0.5 0.5 0.5 0.5 0.5 
##$TPOFFS= (0..7)
0 0 0 0 0 0 0 0 
##$TUNHIN= 0
##$TUNHOUT= 0
##$TUNXOUT= 0
##$USERA1= <user>
##$USERA2= <user>
##$USERA3= <user>
##$USERA4= <user>
##$USERA5= <user>
##$V9= 5
##$VALIST= <valist>
##$VCLIST= <CCCCCCCCCCCCCCC>
##$VD= 0
##$VDLIST= <DDDDDDDDDDDDDDD>
##$VPLIST= <PPPPPPPPPPPPPPP>
##$VTLIST= <TTTTTTTTTTTTTTT>
##$WBST= 1024
##$WBSW= 4
##$XGAIN= (0..3)
0 0 0 0 
##$XL= 0
##$YL= 0
##$YMAX_a= 315698
##$YMIN_a= -411301
##$ZGOPTNS= <>
##$ZL1= 120
##$ZL2= 120
##$ZL3= 120
##$ZL4= 120
##$ABSF1= 10
##$ABSF2= 0
##$ABSG= 5
##$ABSL= 3
##$ALPHA= 0
##$AQORDER= 0
##$ASSFAC= 0
##$ASSFACI= 0
##$ASSFACX= 0
##$ASSWID= 0
##$AUNMP= <proc_1d>
##$AZFE= 0.1
##$AZFW= 0.1
##$BCFW= 1
##$BC_mod= 2
##$BYTORDP= 1
##$COROFFS= 0
##$CY= 11.3945322036743
##$DATMOD= 1
##$DC= 2
##$DFILT= <>
##$DTYPP= 0
##$F1P= 2.36226072786647
##$F2P= -0.459571619588291
##$FCOR= 0.5
##$FTSIZE= 0
##$FT_mod= 4
##$GAMMA= 1
##$GB= 0.15
##$INTBC= 1
##$INTSCL= 1
##$ISEN= 128
##$LB= 0.24
##$LEV0= 0
##$LPBIN= 0
##$MAXI= 10000
##$MC2= 0
##$MEAN= 0
##$ME_mod= 0
##$MI= 1.114404
##$NCOEF= 0
##$NC_proc= 0
##$NLEV= 6
##$NOISF1= 3.799351
##$NOISF2= 2.8
##$NSP= 1
##$NTH_PI= 0
##$NZP= 0
##$OFFSET= 15.70392
##$PC= 1
##$PHC0= -13362.18
##$PHC1= 21.20099
##$PH_mod= 1
##$PKNL= yes
##$PPARMOD= 0
##$PSCAL= 0
##$PSIGN= 0
##$REVERSE= no
##$SF= 200.130013532006
##$SI= 16384
##$SIGF1= 3
##$SIGF2= 2
##$SINO= 400
##$SIOLD= 16384
##$SREGLST= <1H.CDCl3>
##$SSB= 0
##$STSI= 0
##$STSR= 0
##$SW_p= 3612.71676300578
##$SYMM= 0
##$S_DEV= 0
##$TDeff= 0
##$TDoff= 0
##$TI= <>
##$TILT= no
##$TM1= 0
##$TM2= 0
##$TOPLEV= 0
##$USERP1= <user>
##$USERP2= <user>
##$USERP3= <user>
##$USERP4= <user>
##$USERP5= <user>
##$WDW= 1
##$XDIM= 8192
##$YMAX_p= 0
##$YMIN_p= 0
$$ End of Bruker specific parameters
$$ ---------------------------------
##NTUPLES= NMR FID
##VAR_NAME=  TIME,          FID/REAL,        FID/IMAG
##SYMBOL=    X,             R,               I
##VAR_TYPE=  INDEPENDENT,   DEPENDENT,       DEPENDENT
##VAR_FORM=  AFFN,          ASDF,            ASDF
##VAR_DIM=   8192,          8192,            8192
##UNITS=     SECONDS,       ARBITRARY UNITS, ARBITRARY UNITS
##FACTOR=    0.0002496,     1,               1
##FIRST=     0,             0,               0
##LAST=      2.0444736,     0,               0
##MIN=       0,             -411301,         0
##MAX=       2.0444736,     315698,          0
$$ Real data points
##PAGE= N=1
##DATA TABLE= (X++(R..R)), XYDATA
0@%%%%%%%%%%qJ6j6J6k4L2m0M8n6P2q8J04j20J44j71K01k38K72l12L60m13M72
$$ 0 0 0 0 0 0 0 0 0 0 0 -8 8 -8 8 -16 16 -24 24 -32 40 -48 56 -64 80 -91 110 -128 144 -168 192 -221 251
32B51n37O09o89P77q73R80j097J226j367J520j687J871k073K291k530K793l077
$$ 251 -286 323 -366 411 -462 518 -579 647 -720 800 -887 984 -1089 1202 -1328 1465 -1612
49a612L389l733M112m532M997n519O103o761P514q382R397j0600J2056j3861J6162
$$ -1612 1777 -1956 2156 -2376 2621 -2898 3205 -3556 3958 -4424 4973 -5627 6429 -7432 8730
64H730j9215K3484k9920M0843o4103J98977k70206k78956N70980R1394l89940
$$ 8730 -10485 12999 -16921 23922 -40181 158796 -111410 -390366 180614 272008 -117932
75a17932r5019K88479L9254j01416n8496k0743M6716J64245p7409k48776P0007
$$ -117932 -212951 75528 114782 13366 -45130 -65873 -19157 145088 67679 -181097 -111090
86a11090L14991q5684l25812Q0595L21722q3795k69608O2101K05792l6448j22548
$$ -111090 203901 118217 -207595 -127000 194722 110927 -158681 -96580 109212 72764 -49784
97d9784j1239M6137N6800K3817j12047o5346J55837P8865j80561n8914J74037
$$ -49784 -61023 -14886 41914 65731 -46316 -111662 44175 123040 -57521 -116435 57602
108E7602K5818j41048J4465Q0723m9565k383O9402q3913o6875J54288M9177j92320
$$ 57602 83420 -57628 -43163 37560 -12005 -14388 55014 -28899 -95774 58514 107691 -84629
120h4629k2016K03196l918j93379L0021J61689n5274j07590P3914L3621q0447
$$ -84629 -106645 96551 92633 -100746 -70725 90964 35690 -71900 2014 35635 -44812
131d4812N0612P5491j28991n2599J93157J4574k31306K8192K35683o3464k10378
$$ -44812 5800 81291 -47700 -100299 92858 107432 -123874 -95682 140001 76537 -133841
142a33841Q1747J64897q0853j05700O4924M4482l2755Q582q389m8113M7816P0207
$$ -133841 -52094 112803 31950 -73750 -8826 35656 2901 11483 3094 -45019 2797 73004
154G3004p9695p8549J01735P5859j11984o0909J08718L8850r0464j6845O0192
$$ 73004 -6691 -85240 16495 92354 -19630 -80539 28179 67029 -23435 -40280 19912
165A9912k705k6655J5153r803j6448M4225N700o8958J6673P5958m2952o5357O5313
$$ 19912 17207 -9448 5705 -4098 -20546 23679 29379 -39579 -22906 53052 10100 -55257 10056
178A0056L8430q0751n603Q4662k8324p5619N6691N7513p3348l5726P7155J3318
$$ 10056 48486 -32265 -37868 46794 18470 -57149 -458 57055 -16293 -52019 25136 38454
190C8454p0039O737N0200k4707k1275L6813j3277l8880M9129L3120q0280k1240
$$ 38454 -31585 -24848 25352 645 -20630 16183 2906 -35974 13155 46275 -34005 -55245
202e5245J02941M203j13956J3604J10008k7896r1240L2956O5086k5578l5621J0041
$$ -55245 47696 51899 -62057 -48453 61555 33659 -57581 -24625 40461 14883 -20738 -10697
214a0697Q749J0296J3093l3037k8183N3818L5979o7760l7575P5607L5966p5278
$$ -10697 -1948 8348 21441 -11596 -39779 14039 50018 -17742 -55317 20290 56256 -19022
226a9022l0212O9061K0949n5549j1068L4440L724r183l47j6344L281L9229j0352
$$ -19022 -49234 19827 40776 -14773 -25841 8599 12323 3140 2793 -13551 -10270 28959 18607
239A8607n4914K2047N9922l4422n4310M1061L9751m0092k2373L3506N623k2202
$$ 18607 -36307 -14260 45662 11240 -43070 -2009 37742 -2350 -24723 8783 14406 -7796
251g796R425Q204j9888O354K3213j8820k2871K5798J9982l0075j4482L2345N292
$$ -7796 1629 9833 -10055 -3701 19512 692 -22179 3619 23601 -6474 -20956 11389 16681
264A6681k9984O031K1486j6361j0557K3322l435k7192J7614K5347k9958j6801
$$ 16681 -13303 -7272 14214 -2147 -12704 10618 7183 -20009 -2395 22952 -7006 -23807
276b3807L6179N152l3589M025K4432r611j3372J1517N94j0024J1859M433k0144
$$ -23807 12372 17524 -16065 -12040 12392 2781 -10591 926 1520 -8504 3355 7788 -12356
289a2356K840K4734q546k6653J2064K7679j6267k6487K0265K0891k0794j2517
$$ -12356 -9516 15218 6672 -19981 -7917 19762 3495 -22992 -2727 18164 -2630 -15147
301a5147J7939N116j1767K366L685q697P757J0668k0209o531K8455j11l0420O843
$$ -15147 2792 7908 -3859 -1493 2192 -6505 1252 11920 -8289 -14820 13635 13524 -16896 -10053
315a0053K8760j0650k4384J3372J7205j2885q953Q441K767k160M12j874l206O116
$$ -10053 18707 8057 -16327 -2955 14250 1365 -7588 853 3620 1460 1872 -2 -3208 2908
329B908O626j1110q510J6386P416j9958n003K1098J863k1154L016J8152p894j0920
$$ 2908 9534 -1576 -10086 6300 13716 -6242 -11245 9853 11716 -9438 -6422 11730 3836 -7084
343g084R936J599p625N464J668r206L352J0284p810r757J1826O499j3089k645
$$ -7084 2852 4451 -3174 2290 3958 -5248 -1896 8388 578 -9179 2647 9146 -3943 -6588
357f588J1286j51q959L77P641k029o677M304L571n584M66N058l329m260O010J908
$$ -6588 4698 4547 -4412 -4035 3606 1577 -5100 -796 2775 -2809 -2343 2715 -614 -4874 1136 3044
373C044q710J805R159o744o108R459J590r113K926O847n454m009O698O04o616
$$ 3044 -5666 -3861 5298 -1446 -7554 1905 3495 -5618 -2692 4155 -1299 -5308 1390 1994 -4622
388d622K799M427m020j433L120J045k229j014K311O61k784J175J721k191k08L566
$$ -4622 -1823 2604 -1416 -2849 271 1316 -913 -1927 384 1045 -1739 -564 1157 -1034 -1242 2324
404B324j363m408M626M299p472k305R258p61q289K742N486k588k512J423K17J036
$$ 2324 961 -3447 1179 5478 -1994 -4299 4959 4198 -4091 -1349 4137 1549 -963 460 677 1713
420A713J478l350k101M957J718n419j304L867K416k704l922K151M927j638n119
$$ 1713 3191 -159 -2260 2697 4415 -1004 -2308 1559 3975 1271 -2651 -500 4427 2789 -2330
435b330N72M959lm209j606K544L663j583o003J872P439l425p235M485N186m532
$$ -2330 -1758 3201 3198 -1011 -2617 -73 3590 2007 -3996 -2124 5315 1890 -5345 -860 4326 -206
451b06k701L097o8j792K411o68l477K771L286l316l170K500L911k218n414K627
$$ -206 -2907 190 122 -1670 741 73 -3404 -633 2653 -663 -3833 -1333 2578 360 -5054 -2427
467b427O401l916o091N532M257o064j687O192j417n238M396K798n419o45M810
$$ -2427 3974 58 -6033 -501 3756 -2308 -3995 2197 780 -4458 -62 2736 -2683 -3328 1482
482A482K12l992p44M274K242m905k899N860K369o513o24P197k059o270N005L828
$$ 1482 1694 -2298 -3042 1232 3474 -1431 -4330 1530 3899 -2614 -3238 3959 1900 -4370 635 4463
498D463o612l36P494k150p749L458P624l852p609M097Q064m382q166N282Q523
$$ 4463 -2149 -2485 5009 2859 -4890 -1432 6192 2340 -5269 -1172 6892 2510 -5656 -374 8149
513H149p149p133R295L029j0284J877R625o623p923J0319O023j3218l692J4426
$$ 8149 1000 -6133 3162 6191 -4093 -2216 7409 786 -7137 3182 9205 -4013 -7705 6721
527F721Q97j3560J24J2203l45j1963J237J1090l780q108O072L493q131R02R593
$$ 6721 7618 -5942 -5818 6385 6040 -5923 -4686 6404 2624 -5484 588 4081 -4050 -3148 6445
542F445m955j1099R579J0166j2899r264J3833R588j3196j1014J2204J1869j2268
$$ 6445 1490 -9609 -30 10136 -2763 -12027 1806 11394 -1802 -12816 -612 11257 -1011
555a011j0416J1132Q584r528o744Q144K760m944K380R77p216L297J0939o638j4039
$$ -1011 -11427 -295 8289 -1239 -7983 161 2921 -2023 357 1334 -5882 -2585 8354 1716 -12323
570a2323Q683J7488j0510j9962J2082K1230j2216k1434J2075K1140j1999j9188
$$ -12323 -3640 13848 3338 -16624 -4542 16688 4472 -16962 -4887 16253 4254 -14934
582a4934J2624J3675j1281o474Q946j058n184P915J150j3414L679J7903q173j9962
$$ -14934 -2310 11365 84 -6390 2556 1498 -3686 4229 5379 -8035 -4356 13547 5374 -14588
596a4588R924K0805r595k0864R408K0256r987j7915R760J4028p886r673N944M391
$$ -14588 -4664 16141 6546 -14318 -4910 15346 5359 -12556 -2796 11232 3346 -6327 -383 4008
610D008m840J262L697n981k499R170J589j1506k552J3836L936j6120m407J6660
$$ 4008 -832 430 4127 -1854 -4353 4817 6406 -5100 -7652 6184 10120 -6000 -10407 6253
624F253L921j5365m100J3882K869j1446j229P769j088l694L165J78n892K656R035
$$ 6253 10174 -5191 -9291 4591 7460 -3986 -5215 2554 1466 -2228 937 1115 -4777 -2121 6914
639F914o110j2381J0020J4572j2478j6084J3536J6542j4824j4726J5509J0943
$$ 6914 804 -11577 -1557 13015 537 -15547 -2011 14531 -293 -15019 490 11433
651A1433j4089o569J0421K066m816K031j92n471M443P445p336q263Q784R758r280
$$ 11433 -2656 -9225 1196 3262 -1554 477 285 -5186 -743 6702 -634 -8897 -113 9645 365
666C65j1609R081J3502q928j3305Q728J1245p429q349N397N881k918k751J72n8
$$ 365 -11244 -2163 11339 2411 -10894 -2166 9079 1650 -6699 -1302 4579 1661 -1090 -918 -976
681i76K414J845l175l172K728M462r36o633n62Q514K099r528l052R892L409r814
$$ -976 1438 3283 108 -3064 -336 4126 3190 -3443 -4005 4509 6608 -2920 -5972 3920 7329 -2485
697b485k632P823K292n105j956J404J374J549Ol906j796O128L287q162m924R634
$$ -2485 -5117 2706 4998 -107 -2063 -659 715 2264 2270 -1636 -3432 2696 5983 -2179 -7103 2531
713B531O677j1280p865J1645P282j0357n930P877M281m192l942J5L963L598l991
$$ 2531 9208 -2072 -9937 1708 8990 -1367 -7297 580 4861 669 -3273 -3258 705 4303 312
728C12o251L255P866k472q145Q12P669J851q164m049Q355N231p723n535O283N777
$$ 312 -5939 -2684 5182 2710 -5435 -4623 3046 4897 -3267 -7316 1039 6270 -1453 -6988 -705 5072
744E072m557n469K242N211K73m804k652N116L606m879l479M456K718k230k407
$$ 5072 515 -4954 -2712 2499 2772 -2032 -4684 432 4038 -841 -4320 136 2854 624 -1783
759a783N4K261J957k201l368K303M431l006l793L045K754j755k106Q70J537J52
$$ -1783 -1729 532 2489 288 -3080 -777 3654 648 -3145 -100 2654 899 -1207 -337 1200 1352
775A352j389k47O17M80p2o24m1K92P79Q9k070O03K112r34j331Q51M28k88J1m45
$$ 1352 -37 -284 333 813 741 117 76 368 1147 1236 -834 -231 1881 947 -384 467 895 607 618 173
795A73m12Q23O39j442o14J798Oj484M9O10M78n02j054M71J420q53j123O04J039
$$ 173 -239 584 1223 -219 -833 965 971 -513 -464 146 624 122 -932 -461 959 106 -1017 -413 626
814F26p47q68N39L98J26k51j353J263J488k056j085K097M99j363q44R10J035n52
$$ 626 -121 -989 -450 -52 74 -177 -1530 -267 1221 -835 -1920 177 676 -687 -1531 -621 414 -138
832a38r09l51J525Q06k275m50K505K41j990m89J201J417r86j649O82J814q0k252
$$ -138 -1047 -1398 127 933 -1342 -1792 713 954 -1036 -1525 -324 1093 107 -1542 -860 954 874 -1378
850a378J12K567m32j658J07R92Q15o06j745Q66J997q93j855L72K376o61j728O99
$$ -1378 -1266 1301 869 -789 -682 310 1125 519 -1226 -360 1637 744 -1111 -739 1637 976 -752 -53
868e3R24M2l32j222R37J350j082j026Q40Q26n79p19J79M68K90m91p68P43Q84j446
$$ -53 871 913 581 -641 296 1646 564 -462 378 1204 625 -94 85 553 843 352 -416 327 1211 -235
888b35k98J355l28q38N72j57j66K18N6m09J00Q33r76n62J096k30p86N55l6Q9P
$$ -235 -533 822 494 -344 228 71 -95 123 179 -230 -130 703 -273 -835 261 31 -755 -200 -236 -147 -140
909a40m55k8O36j77m39m7K97jM7j66l49M53O79j286j74J547k28j064M34L51l84
$$ -140 -595 -623 13 -164 -603 -650 -353 -354 -307 -473 -822 -369 310 -976 -1150 397 169 -895 -461 -110 -494
930d94M46K45r98l4J734p72j542J136J253o88r61J30J270K33j425m24J165N99
$$ -494 -48 197 -801 -835 899 127 -1415 -279 974 286 -675 -545 725 958 -467 -891 274 873
948H73n17q86J99R37O43j252j283J986J728k467j471K434P63j737n00J069j77
$$ 873 356 -530 -331 606 1249 -3 -1286 700 2428 -39 -1510 924 1687 -50 -550 519 342
965C42P68q6j689k8K816n37l446R53K929l86k928K37K738k30k376N3J566j3n80
$$ 342 1110 1024 -665 -693 2123 1586 -1860 -907 2022 1636 -1292 -1055 1683 1453 -923 -870 696 683 103
984A03O0q32j02K016o3l317M90L937r28m019J281L351j237k142J95J410N38o51
$$ 103 163 -669 -771 1245 1182 -2135 -1645 2292 1364 -2655 -1374 1977 740 -1402 -1207 203 741 90
1002I0j499K3K171L23k642k71K233L86j112j262N03J570M74j640j441J875K441
$$ 90 -1409 -1386 785 1108 -1534 -1805 428 814 -298 -1560 -1057 513 987 -653 -2094 -219 2222
1019B222k203l272K215M049k128m445K149M699k513l695K691K250k650q8J767
$$ 2222 19 -3253 -1038 3011 883 -3562 -1413 3286 773 -2922 -231 2019 -631 -719 1048
1034A048j627p83L536n13n085K019O018l355n863M084N485m149n025M348L835
$$ 1048 -579 -1362 2174 1661 -3424 -1405 4613 1258 -4605 -521 4964 815 -4210 138 3973
1049C973m206k208L368O48k180Q73J130k363J36L549j451m151K549L786k615l628
$$ 3973 -233 -2441 927 1575 -605 268 1398 -965 -829 2720 1269 -2882 -333 3453 838 -2790
1065b790J849L736j079l728M61L222M13l159q49L124N11k789j92J964k24j009
$$ -2790 -941 2795 1716 -2012 -1551 1671 2084 -1075 -1924 1200 1711 -1078 -1270 694 470 -539
1081e39P01J3j625R17K911k396l541L576L829m687m251N972M141p351k908P589
$$ -539 162 175 -1450 -533 2378 -18 -3559 17 3846 -841 -5092 880 5021 -2330 -5238 2351
1097B351J079o985J258N338k776l637M252J292n366J145N982l636n508N067N075
$$ 2351 3430 -3555 -2297 3041 265 -3372 880 2172 -3194 -2049 3933 297 -5211 -144 4931
1112D931o073m192O789L095p141j111O173j16m819J152L571k033j803K735m71
$$ 4931 -1142 -5334 1455 4550 -2591 -3702 2471 2355 -2464 -1312 2259 226 -1577 1158 687
1127F87k493J779K072j806j783J628J939j536j850Q53K658p06l067L62L977p80
$$ 687 -1806 -27 2045 239 -1544 84 2023 487 -1363 -510 2148 1442 -1625 -1263 2714 1934
1143A934l816J221L170j655k656K155J762k233j253L040k93l531J837L647l204
$$ 1934 -1882 -661 2509 854 -1802 353 2115 -118 -1371 1669 1376 -2155 -318 3329 125
1158A25l841M761L180o561j645P630n71p449K681N956m145m134N303J570n446
$$ 125 -3716 1045 4225 -2336 -3981 3649 3078 -4371 -1690 4266 121 -4013 1290 2860 -2586
1173b586O90M930l231l347M392J902m706r94M710J72m618R63M152j869l022J899
$$ -2586 -1896 3034 -197 -3544 848 2750 -1956 -2950 1760 1932 -2686 -1723 2429 560 -2462 -563
1189e63K035k176r27K144l00j479J283L99j569Q24J347j469n05J210l40n93J030
$$ -563 1472 -704 -1631 513 213 -1266 17 416 -1153 -329 1018 -451 -956 254 -86 -679 351
1206C51J15j582J265R47k110k16K794n29k916J613K532k369k091L344P79l410
$$ 351 466 -1116 149 1096 -1014 -1230 1564 1035 -1881 -268 2264 -105 -2196 1148 1927 -1483
1222a483N31L230j710k728K700K011l465p18M083j000m153K755L090l613j781
$$ -1483 -952 2278 568 -2160 540 2551 -914 -1632 2451 1451 -2702 53 3143 -470 -2251
1237b251M313p7m147J586L306k643k085L329K37l053P47K901j938j934K360J040
$$ -2251 2062 1985 -2162 -576 2730 87 -1998 1331 1568 -1485 -738 2163 225 -1709 651 1691
1253A691k814J66K512j150j722J573R58k149M8K075j067j982K235P11k394J86
$$ 1691 -1123 -957 1555 405 -1317 256 1214 -935 -887 1188 121 -1861 374 1085 -1309 -1123
1269a123K524j267j945K143P76k347P9K299j138j743K116N15k302M11K335j410
$$ -1123 1401 134 -1811 332 1108 -1239 -1160 1139 1 -1742 374 889 -1413 -1002 1333 -77
1285g7j732K107R26k548K4K672j070k069J924J258k522j03K746j051k308K343
$$ -77 -1809 298 1224 -1324 -1300 1372 302 -1767 157 1415 -1107 -1210 1536 485 -1823 520
1301E20J069k830L8K917j032k360J912J486k485m18K761o83k213J552J377j797
$$ 520 1589 -1241 -1203 1714 682 -1678 234 1720 -765 -1183 1578 895 -1318 234 1611 -186
1317a86p08K491n22k064Q77K037j818j530K420K92k240L95K394j695j436K294
$$ -186 -894 1597 1075 -989 -112 1925 107 -1423 997 1289 -951 -556 1838 143 -1293 1001
1333A001L62k684R85K193j943j350K399K25k247O19J813j482j138K138l04j613
$$ 1001 1363 -1321 -336 1857 -86 -1436 963 1188 -1059 -440 1373 -109 -1247 891 587 -1026
1349a026R11J213j253j179J763M25j937L64J758j065j371J424P14j867J31J936
$$ -1026 -115 1098 -155 -1334 429 854 -1083 -719 1039 -26 -1397 27 741 -1126 -995 941
1365I41r72j695J951P12k322N08J832j018j589J923Q68k133rJ868r00j419J885
$$ 941 -31 -1726 225 937 -1385 -877 955 -63 -1652 271 1139 -994 -1003 865 -35 -1454 431
1382D31L60j839K63J773p15j583J205J372j804m09J845k42j604P80J298j225q29
$$ 431 791 -1048 -785 988 273 -1310 -105 1267 -537 -946 899 657 -947 -167 1131 -94 -923
1399i23J786K5k036J063J491j566p08J813Oj753P22J576j649n21J756m20j274
$$ -923 863 888 -1148 -85 1406 -160 -868 945 951 -802 -80 1496 -153 -674 1082 662 -612
1416f12O83Q60q86n66J285Q6j462M27J106r83n79J066K38j025J95J147p87j073
$$ -612 71 931 45 -521 764 850 -612 -185 921 -62 -641 425 663 -362 -167 980 193 -880
1434h80J421J45j526L44J421j017j006J217M73j305l1J489r09p58J258j3j104
$$ -880 541 686 -840 -496 925 -92 -1098 119 592 -713 -744 745 -164 -922 336 323 -781
1451g81M64R07o70p18P90M43j101L1J110m88q45O47O28q31l78J169j92r41M25
$$ -781 -317 590 -80 -798 -8 435 -666 -635 475 -13 -858 -211 417 -414 -792 377 185 -756 -331
1470c31R64r25l04J002j4r47K28Q16n57k10P08l78m40N11K34m65q4N64j90l22
$$ -331 633 -292 -596 406 392 -555 -327 489 -68 -278 430 52 -388 123 357 -108 -192 372 182 -140
1490a40L07K29k19j92L15q6j38K18K57k95m74P11K3q43M28M64m19l37N88o1n86
$$ -140 167 396 177 -15 300 214 76 294 551 256 -218 493 516 -327 101 565 146 -191 397 336 -250
1511b50M24K04k93l20N58J92o40k4N06k15j96j84N21o6m22L5K88ll18K2K76k09
$$ -250 174 378 85 -235 323 515 -125 -149 357 142 -54 -238 283 217 -205 -170 118 115 -203 -181 95 -114
1533a14n3J39nj98K68k77J06j25L4JJ65m67J22N61k90l64J7R33o08n19O39L52
$$ -114 -167 -28 -33 -231 37 -240 -134 -259 -225 -224 -59 -526 -404 157 -133 -497 -480 453 -155 -674 -35 317
1555C17n17j80K60O0m3k19N55k89l34L13N35n30l92O75L89q24j92J222m32q68
$$ 317 -200 -380 -120 -60 -103 -322 233 -56 -390 -77 458 -72 -464 211 600 -224 -416 806 374 -494
1575d94K76P21j70o89J87Q09n62l42L49N00n78l09Q82j0j032L15J299j041r03
$$ -494 -218 503 333 -356 -169 640 78 -264 85 585 7 -302 580 570 -462 -147 1152 111 -792
1594g92J215P02j313j19J145p6j311L55J074o99o41M19N76m73o63J004O1r46J77
$$ -792 423 1125 -188 -307 838 762 -549 -194 880 181 -460 -41 535 62 -601 403 464 -482 -305
1613c05R04j76j222M51J139q26j049J156N15p99l42O38K88r42n4J115j37j073
$$ -305 599 423 -799 -348 791 -35 -1084 72 587 -212 -554 84 372 -570 -624 491 354 -719
1631g19J24Q40k36q51N32R95j080p62J510J83j478J58J295j20j583P10J556j025
$$ -719 -595 245 9 -842 -310 685 -395 -1157 353 536 -942 -784 511 391 -1192 -482 1074 49
1649D9j239J228Q03j241l99J266K43j702P14J374p69j538J514R52j650m20J750
$$ 49 -1190 38 841 -400 -799 467 710 -992 -278 1096 327 -1211 303 1255 -395 -815 935
1666I35J06j870M69J232o81r29Q83P72p50o89Q82L07q31QO47m1q52K30J106n57
$$ 935 1041 -829 -360 872 191 -738 145 917 167 -522 360 667 -164 -156 491 450 -402 -172 934 377
1686C77r50P86O17p95n49Q51L49q08k23Q79m6j018K34R23k70q69L18J014o94q97
$$ 377 -573 213 830 35 -514 337 686 -122 -345 534 488 -530 -296 627 357 -512 -194 820 126 -771
1706g71Q66N63j110k97J229j3j450L48J557q08j349J221P39j407j72J367jj500
$$ -771 95 658 -452 -749 480 467 -983 -635 922 114 -1235 -14 725 -682 -854 513 512 -988
1724i88O59J106r97p17J209J89j125N4J014l39p02M94N26m95n62P27K66n88J35
$$ -988 -329 777 -220 -937 272 461 -664 -610 404 65 -637 -143 383 -112 -674 53 319 -269 -134
1743a34M11l4o08K38K58o0k15L29j02j61KJ58J06p6m3j74K12L21p80L15N73l51
$$ -134 277 243 -365 -127 131 71 -144 185 83 -78 -76 82 188 112 69 -105 107 428 -352 -37 536 185
1765A85m95P76J3o85j25R24l74o05O20L41r18K5P79N1q32K97O73l64p98Q07L75
$$ 185 -310 466 479 -206 -331 593 219 -386 234 575 -343 -318 461 512 -320 -23 650 286 -512 295 670
1786F70j023R1Q39l36p01M95Q25r71m71R62k54q35P56L32o30k83P58J8q12M04
$$ 670 -353 -262 577 241 -460 35 860 -111 -582 380 126 -709 47 379 -251 -534 224 242 -570 -166
1806a66M16l83k63N99j28l89J53K67j61j98L5L27l29j30L18Q6l94J28M01m87j27
$$ -166 250 -133 -396 203 75 -314 -161 106 -55 -253 -218 109 -220 -350 -32 54 -340 -212 189 -298 -425
1827d25O66k79j58L16J01o08J58O79m77k90P22m9r57O55M52p73l2P84k52o05K08
$$ -425 241 -38 -196 120 221 -387 -229 450 -27 -317 405 356 -601 54 506 -267 -299 485 233 -372 -164
1848a64Q88q22k61O78P0n20J49N43l94m83N84K84n62k39Q13j97o39L56L65m31
$$ -164 724 -98 -359 319 389 -131 18 561 167 -316 268 552 -10 -249 564 367 -272 84 449 18
1868A8k27P05j86o92K60P44p28k04P15l32l37M18J63n71oN20Np38L87L41m33p6
$$ 18 -209 496 310 -382 -122 622 -106 -310 405 73 -264 154 317 -254 -260 260 265 -473 -86 255 -178 -254
1890b54M27L9n68L01K50m66n9O45r1o23K35N19m34m22N91oo86M50M73o81k5N52
$$ -254 173 212 -356 -55 195 -271 -330 315 224 -399 -164 355 -79 -501 90 84 -602 -152 321 -360 -385 167
1912A67j58n08K54L26k74l15O60n5l77K03L29l89k25M66K56o31M7M90k31l77N14
$$ 167 9 -499 -245 81 -193 -508 152 97 -280 -77 252 -137 -362 104 360 -271 -224 266 35 -342 172
1933A72L0l15K3M86j95m18N09pl25Q0L93l35l37N77j2n20J12M74k92l27M17J78
$$ 172 202 -113 -90 396 201 -217 292 285 -40 40 433 98 -239 338 326 -194 -82 392 100 -227 190 368
1955C68m09J6K39J59n23J32M63k90l01L29L0l87K40K61n21m5M53k30l61L85K75
$$ 368 -41 -25 214 373 -150 -18 445 155 -146 183 213 -174 66 327 -194 -239 214 -16 -377 8 283
1976B83m34k0L36k81r9M43k0n10M4L68j07m70M08J11l13Q7J24J53l55L17J7l01
$$ 283 -151 -171 165 -116 -215 228 208 -302 -258 110 3 -467 -59 52 -261 -174 -50 103 -252 65 82 -219
1998b19k67O47j51n15L15M43m07n46R05n4n60K08N03l35m68N97j3l22J84K28j91
$$ -219 -486 161 10 -505 -190 253 -154 -700 205 151 -409 -201 302 -33 -501 96 83 -239 -55 173 -18
2019a8j46K16K02m07N2K68p0l18K46K49l03j64L43K82o31R9L19j88j13M13j97
$$ -18 -164 52 254 -153 -101 167 97 -221 25 274 -29 -193 150 432 -199 -100 219 31 -82 331 134
2040A34l49M54M2m30J02L17j69k01J96M8k24J24K46l21j05L35Q5m67j09O89j55
$$ 134 -215 239 281 -149 -47 270 101 -100 96 144 -80 44 290 -31 -136 199 284 -183 -292 397 242
2061B42o12L47J74p9l65M46J48o02K53K34k34j17J99J14l74l8M12O4n35M85q3
$$ 242 -370 -23 151 72 -293 153 301 -301 -48 186 -48 -165 34 148 -226 -264 148 212 -323 162 79
2082G9k90n6K71k09J42K4Rj82m0L84m33P8K23n2j3N2J21k86j38O73k02n42N10
$$ 79 -211 -267 4 -205 -63 -39 -30 -212 -252 132 -301 -223 0 -52 -65 -13 108 -178 -316 357 155 -387 123
2105A23J35o06O9L94N9n37K90M14l07l52N04J01k97k0L16o7m67K34L45m14j50
$$ 123 258 -348 -279 115 174 -363 -73 341 34 -318 186 287 -10 -30 286 219 -248 -14 331 -83 -233
2126b33M09J26m58o0M79q9l12L13J31l10l8R9L25n34N8J88K06k87j10L19K3l10
$$ -233 176 302 -156 -216 263 174 -138 175 306 -4 -42 57 382 -152 -94 94 300 13 -97 222 245 -65
2148f5j08M20j28k25n4M46l62n2K66J26k98l09N93p1o26L17K85k41k37L03L55
$$ -65 -173 247 119 -106 -160 286 -76 -128 138 264 -34 -343 250 179 -447 -130 155 -86 -323 -20 335
2169C35n45k13N92J14o34p7M53J22n57K56M46j65l35K62J29l94j59K65L58m22
$$ 335 -210 -423 169 283 -351 -428 25 147 -410 -154 292 127 -208 54 183 -211 -370 -105 253 -169
2189a69j67N10j12m41J87M20j09l22K18M02n79N0L33mn09N3N40l02m44N40K95
$$ -169 -336 174 62 -379 -192 228 119 -203 15 417 -162 -112 221 217 -292 -239 301 -1 -445 95 390
2210C90n93j63P18j6m43n1P96m25l95J55M67o72N2M11o8l47J99N38l25m26L50
$$ 390 -203 -366 352 336 -107 -158 638 213 -182 -27 440 -232 -180 231 163 -184 15 553 228 -198 152
2231A52L6r2j77K16K7q2k03K06J56k94n8K49j9j75J23J39j57k96L72j69r9M6j4
$$ 152 188 96 -81 135 162 80 -123 83 239 -55 -113 136 117 -58 65 204 47 -249 123 -46 -145 -99 -113
2254a13K71k57q9L53O1l85k10P03k94n14K51O00o56o6M84P9m27L7N07m32k79L69
$$ -113 158 -99 -188 165 226 -159 -369 334 40 -474 -223 377 -279 -345 139 218 -209 -172 335 -97 -376 -7
2276gO5l69J53L17j68l59Q0N27k61l22M71Qk76j4M68l03m94L79M54m70j67P02
$$ -7 58 -311 -158 159 -9 -368 -288 239 -22 -344 127 135 -141 -155 313 10 -484 -105 349 -121 -288 414
2298D14k53k32K9K21qk76K27p8O0n2J84q1L5p4k10K06R2n1r7P9r4o5L7M49k55
$$ 414 161 -71 -42 179 171 -105 122 44 104 52 236 155 190 116 -94 112 204 153 56 135 41 -24 13 462 207
2323B07l42K59L8m72K20L76k33l54K40K44k34l08O09m7n26R8M29l1n78M28Nj69
$$ 207 -135 124 162 -310 -90 286 53 -301 -61 183 -51 -359 250 203 -323 -225 204 173 -405 23 28 -141
2345a41j35M77q0n53M43J64l23j62N20j75l74P9M43l24O6K38j28k63J82O0k8j49
$$ -141 -276 201 121 -432 11 175 -148 -310 210 35 -339 -260 183 -141 -75 163 35 -228 -46 14 -14 -163
2367a63K5J0OR6J42k54J38J4Nl37M05oj67J57J83l24k22K25K83k00k80O48q9m62
$$ -163 -138 -128 -122 -26 116 -138 0 14 19 -318 87 81 -86 71 254 -70 -292 -67 216 16 -264 384 295 -167
2391a67K25K87n73l1P72j94p33M25K85l18j10K54K81n73R4M14l25j21Q5K10k83
$$ -167 58 345 -228 -259 513 319 -414 11 296 -22 -132 122 403 -170 -76 338 13 -108 -23 187 -96
2412i6m0M76l46k60L11J04q1j98P8O1p2O4J34l44J31K00j94j46R2L18l42m4M59
$$ -96 -136 340 -6 -266 45 149 68 -130 -52 9 -63 1 135 -209 -78 122 -72 -218 -126 192 -150 -194 265
2435B65k71j52K95j07l73K44P4p5j62L01m1k12M6M64j83n66L92J89l06j16M31
$$ 265 -6 -158 137 30 -343 -99 -25 -100 -262 39 -2 -214 -168 296 113 -453 -61 128 -178 -294 137
2456A37j78j30J68K80m29K15P2J7n67L70J75j32j94M52o1l90K08J61k57n6J94
$$ 137 -41 -171 -3 277 -152 63 135 152 -415 -45 130 -2 -196 256 195 -195 13 174 -83 -139 55
2477E5l7j39P9J79j76k2L20l53K5J82J21j42k58N10j63l71J47K60l14J50P4M3
$$ 55 18 -121 -42 137 -39 -61 259 -94 -69 113 234 92 -166 344 181 -190 -43 217 -97 53 127 170
2499A70l32K6M39l06q8K74n6j47M7P5j75k00L21K52n01R3K27j67j5M3K29m23J4
$$ 170 -162 -136 303 -3 -91 183 127 -20 27 102 -73 -273 48 300 -201 -108 119 -48 -63 -20 209 -214 -200
2522b00K55k66N0J60K9o9j04K11r8o6L8J00m0J7m6K16m66K94M4j04j91K67j16
$$ -200 55 -211 -161 -1 28 -41 -145 66 -32 -98 -60 40 0 17 -29 187 -279 15 59 -45 -236 31 -85
2545h5k6J03J10l40L26K33k14k11K46J5l32n7K68N5j64R8J46k80m0K57n8on3J35
$$ -85 -111 -8 102 -238 88 321 107 -104 142 157 -175 -232 36 91 -73 25 171 -109 -149 108 50 44 -9 126
2569A26k31O4O7J58m06J25K08j43L3L56m47o1K43q0N5lO8q2k79L64O6j70o0J54
$$ 126 -105 -41 26 184 -222 -97 111 -32 1 357 -90 -151 92 12 67 64 132 50 -229 135 201 31 -29 125
2593A25J0q7k34L29j08j83L99p1k85J02J18j47j55J97Mj46J43L48m20j35K29m8
$$ 125 135 48 -186 143 35 -148 251 180 -105 -3 115 -32 -187 10 14 -132 11 359 -61 -196 33 -15
2615a5o9p8K11P8j81K7J0NN5j75Q2L1k5P2o8q0N6J15p6n1J07j42J99j13J5j35
$$ -15 -84 -162 49 127 -54 -27 -17 -12 43 -132 -50 -19 -44 28 -40 -120 -64 51 -25 -76 31 -111 88 -25 -10 -145
2641a45J90j16j16J05K05j67j40K65K3k40P3J44j14N1J72j73j18J53K07j60j06
$$ -145 45 -71 -187 -82 123 -44 -184 81 104 -136 -63 81 -33 18 190 17 -101 52 259 99 -7
2662gj9J25o5j27L44j64k37J87M8k37%J62J97k09k9J79M9m22K98J0j26q7Q4K45
$$ -7 -26 99 34 -93 251 87 -150 37 85 -152 -152 10 207 -2 -31 148 197 -225 73 83 -43 -130 -46 199
2686A99k12q7l2M35j59k95K4J73q2j35L03k5k44J25m1M3j30K47k01n5lK30Kr9
$$ 199 -13 -100 -132 303 144 -151 -127 46 -36 -171 132 107 -137 -12 -53 -10 -140 107 -94 -149 -152 78 80 -19
2710a9k08J31K8m1j1K28m1k50M2L30j95j60L30k70J89l91L18L6j35J48q9P2k14
$$ -19 -227 -96 -68 -109 -120 108 67 -183 -141 189 -6 -166 164 -106 83 -308 10 46 -89 59 -30 42 -172
2733a72L7L35m36J77O5O4k72J17J49o3r5J78m7o9p8J23P3k43J71Q6M8k54k7L71
$$ -172 -135 200 -236 -59 6 70 -202 -85 64 1 -94 84 37 -32 -110 13 86 -157 14 100 148 -106 -133 238
2757B38m0l28K06J75j71j0R0n6k35N6K8l1j02L93L6j65j16K59q9k19J51j17j5
$$ 238 198 -130 76 251 80 70 160 104 -131 -75 -47 -78 -180 213 249 84 -32 227 138 -81 70 -47 -62
2780f2L1q9L24j26k72L5L34K3m14M06j98p3J78n1P6l02J13J89j94m1J3K8j60L55
$$ -62 -31 -120 204 78 -194 -159 175 198 -216 190 -8 -81 97 46 122 -180 -67 122 -72 -113 -100 -72 -232 123
2804A23j24J20o0j84J10O0n6k53K30P3l45Q6K90J52m88N33j74k19M3J06o0K6J17
$$ 123 -1 119 59 -125 -15 45 -11 -264 -34 39 -306 -220 70 222 -266 267 93 -126 -83 23 -37 -11 106
2827A06j5k36N5L41j18j2k1J19k67K3RM9Mk4O0j04J5L2qJ04k7r3RJ37j62K47j63
$$ 106 91 -145 -90 251 133 121 100 219 -48 -25 -16 33 37 13 73 -31 -16 16 8 112 85 -8 1 138 -24 223 60
2854F0M2j75J12m7K72l58rJ42K3k33J39K82l26J7J13L4j36o4K86k47L3J05J44
$$ 60 102 -73 39 -8 264 -94 -103 39 62 -171 -32 250 -76 -59 54 88 -48 -112 174 -73 -40 65 209
2877B09l11R4R7p5j26mJ17nm3q2J11j00L4K07k55N9K09q6j12j85L29r1j68J93
$$ 209 -102 -8 89 14 -112 -116 1 -4 -47 -129 -18 -118 -84 123 -132 -73 136 50 -62 -247 82 -9 -177 16
2901A6Ol0K4q4n7J59m3k0N0j25JJ42j3OO3m6J3n1J76j32l3O7l01J15K75k06L4
$$ 16 22 -8 16 -68 -125 34 -9 -29 21 -104 -103 39 26 32 95 49 62 11 187 55 22 89 -212 -97 178 -28 6
2928Fn1J47j67L5K65k35r4Q4J00Qn3J70k04j06K81l6j82J07K8K8k19K06J12k07
$$ 6 -45 102 -65 -30 235 0 -94 -10 90 98 45 215 11 -95 186 150 -32 75 103 131 -88 118 230 23
2952B3j56K81j39j23J70J32j02j29J80k23Kj09K30j59M7L7K7J0q3R0Q6k17K24
$$ 23 -133 148 9 -114 56 188 86 -43 137 -86 -84 -193 37 -122 -75 -38 -11 -1 -84 6 92 -125 99
2975I9r6L3o6J1J3o3N3L1j62O1J86k32k0J08J21j75J15J38n5k09K05N7k25J31
$$ 99 3 36 -30 -19 -6 -69 -16 15 -147 -86 100 -132 -152 -44 77 -98 17 155 100 -109 96 153 -72 59
2999E9J99q7l40M3J90k68K29M1r1r1J69%n6j02J12Q4k27K67N3j04j17J33p7J6
$$ 59 258 171 -169 -126 64 -204 25 66 -25 -116 53 53 -3 -105 7 91 -136 131 184 80 -37 96 19 35
3023C5J2R0j95r3K54q7j36J52O9q0n7J2J26k13K67k8q9p8K05k07p1N3J78rk21
$$ 35 47 137 -58 -151 103 16 -120 32 101 21 -36 -24 102 -111 156 128 39 -39 166 -41 -112 -59 119 110 -111
3048a11J10K8j10k04L52o3j08P6K07l14K93J86l39L7rJ36j05j60J04q4J38j07
$$ -111 -1 27 -83 -287 65 2 -106 -30 177 -137 156 342 3 40 31 167 62 -98 6 -78 60 -47
3070d7Q0j14l0L33l37J39m3J70k36J48j17m6M4NJ17j69Q8O8j54J04o8K48l05j0
$$ -47 33 -81 -111 222 -115 24 -19 151 -85 63 -54 -100 -56 -51 66 -103 -15 53 -101 3 -65 183 -122 -132
3094a32K53j25jj00K17j16Q3q5J58l20K50O7j9q9O8p0j82K69J5l19K80r5J42l45
$$ -132 121 -4 -5 -105 112 -4 79 -6 152 -168 82 149 130 41 109 39 -143 126 141 -178 102 7 149 -196
3118a96K87J01j10r0l6J06mj76K67k79J77K8kj90J06Q8j25r6K44J9k75P2J8P1
$$ -196 91 192 82 -8 -44 62 58 -118 149 -130 47 75 73 -117 -11 77 -48 -144 100 119 -156 -84 -66 5
3142Ej21L07j34p2o4K05M1k85N0j19R5J94j07o7j24O7J64k29j12N16k70r0J25
$$ 5 -116 191 57 -15 -79 126 167 -118 -68 -187 -92 102 -5 -72 -196 -129 35 -194 -306 210 -60 -150 -25
3165b5K56m44R3K71j83l8R7K5q9q9J89k1Nk00J43L8l38K57J50j62P4j42K09j2
$$ -25 231 -213 -120 151 -32 -70 27 52 -37 -126 63 42 47 -153 -10 28 -310 -53 97 -65 9 -133 76 64
3189F4j02l7l8J95j13J73k29Q8OJ7J74k88P1M7J13L1k47N6R5J6j08K7j5j6p6L19
$$ 64 -38 -75 -113 82 -31 142 -87 1 7 24 198 -90 -19 28 141 172 -75 -19 76 92 -16 11 -4 -20 -96 223
3215B23k00o3K39j85k31J97R8J63l28J04J35j51R0lm5j68K65j96M5qJ81r0q2j30
$$ 223 23 -40 199 14 -217 -20 78 241 -87 17 152 1 91 88 43 -125 140 -56 -11 -19 162 72 -10 -140
3239a40K12Nl56L47k07J80r6j4l3J54m0k9K9M1j21j8Q9n5q2L3j58L40k86J26J56
$$ -140 72 77 -279 68 -139 41 -55 -69 -102 52 12 -17 12 53 -68 -86 3 -52 -134 -101 -259 81 -205 -79 77
3264G7k60J99O7j44k2k0J00j8K0j10J92j95k8K20lj46j60L08j13k6J28k0Jp2K36
$$ 77 -183 16 83 -61 -83 -103 -3 -21 -1 -111 81 -114 -142 78 75 -71 -231 77 -36 -62 66 46 47 -25 211
3289B11q6k44O0Q5l7j4O7M4j49nm7K39k2ll4o0J23j42P7pMK2K8J28k66J51Q2q8
$$ 211 125 -119 -59 26 -11 -25 42 86 -63 -68 -115 124 102 99 65 5 128 -14 63 56 60 82 110 238 -28 123 205 117
3317A17k69Q7K99j86r2j09Q6j3K5J2j49K31Pj63J51m4L4Jj10N7L9rl3j99K76j44
$$ 117 -152 -65 234 48 -44 -153 -67 -80 -55 -43 -192 39 46 -117 34 -10 24 25 -85 -28 11 2 -31 -230 46 -98
3343i8N8p0J25L6M4j01j85J72j42K17j2j32J2L7J63k79K53K1l82K03J85j28j7
$$ -98 -40 -110 15 51 95 -6 -191 -19 -161 56 44 -88 -76 -39 124 -155 98 119 -263 -60 125 -3 -20
3366b0p2M8J9J13j87J71J5j86K19K5k24J29n5J63n2rj41P6o3J49J31l30m5R7K73
$$ -20 -92 -44 -25 88 -99 72 87 -99 120 145 -79 50 -5 158 106 97 -44 32 -31 118 249 -81 -126 -29 244
3391B44l03jL1P6p4O4op5n4K35j79M9o2J00j13N1p8R4J23j82J38m8Q7l40L62p5
$$ 244 -59 -60 -29 47 -27 37 31 -44 -98 137 -42 7 -55 45 -68 -17 -95 -1 122 -60 78 30 117 -223 139 64
3417F4k5j11J93j18N2q4J84k15j12L9K97j87j72K67o2j70j72M90j51o6j6JK46
$$ 64 39 -72 121 3 55 -29 155 -60 -172 -133 164 -23 -195 72 10 -160 -332 158 7 -59 -75 -74 172
3440A72j94Kl1L5j2J2J17p2N3j54R8lj18P4M4j67L5L02k77Q6K2l2j12Q8P3o1Q8
$$ 172 -22 -20 -51 -16 -28 -16 101 29 82 -72 26 23 -95 -21 23 -144 -109 193 -84 2 24 -8 -120 -32 41 -20 68
3467F8k48K17Q2j75J25p0j05PJ39j7j32J01NJ37j51M3K57k83j06P1K52l25P6J02
$$ 68 -180 37 119 -56 69 -1 -106 -99 40 23 -109 -8 -3 134 -17 26 283 0 -106 -35 217 -108 -32 70
3491G0n7NJ10K4j96J10o1K5j44J12M6q3J0j31R2q2N1J26j5j04L39l04J24P0j33
$$ 70 13 18 128 152 -44 66 5 30 -114 -2 44 -39 -29 -160 -68 -150 -99 27 12 -92 247 -57 67 137 4
3516Dq3N6O8q%p5pK3L4q8n4n6J51o5J29j22J9O5r6L9J15k4Qj17J16j47O9K2p6
$$ 4 -79 -23 45 37 37 -38 -45 -22 12 -76 -130 -186 -35 -100 29 -93 -74 -9 -105 -66 49 25 33 -84 32 -115 -46 -24 -100
3545a00n2J43J54j96o3J07J79j84K18j34rk04K20K5k15K47k33R2O2n8jM3m6L0
$$ -100 -152 -9 145 -51 -114 -7 172 -12 206 72 63 -141 79 104 -111 136 -97 -5 57 -1 -2 41 -5 25
3569B5J36l34O2J62j44K71k6k27J13j06J74q9n3K25k07O9J70r2o5j47Q7o0pJ9
$$ 25 161 -173 -111 51 -93 178 152 -75 38 -68 106 17 -36 189 -18 51 221 129 64 -83 4 -56 -63 -44
3593d4J41j40L3J80k56j7P7j25J02J53j82J71j70Q3J3O8k02P7K22k49K14k23l6
$$ -44 97 -43 -10 170 -86 -103 -26 -151 -49 104 -78 93 -77 6 19 87 -115 -38 184 -65 149 -74 -110
3616a10K1J03J66k28M2Jr0J7J02p0J06k4l2j71M9j1K04k12N2P9Q2N7o8j8L4k30
$$ -110 -89 14 180 -48 -6 -5 -95 -78 24 -46 60 36 4 -167 -118 -129 75 -137 -85 -6 76 133 65 47 81 -149
3642a49J29j17J16J3J02k38K38j16j98J99J1K6j51J66j5P2P3k46P4J88r7j08K9
$$ -149 -20 -137 -21 -8 94 -144 94 -22 -220 -21 -10 16 -135 31 16 88 161 -85 -11 177 80 -28 1
3665Aj83K02l7Jk2J89l2k67J22L3j79K07q8p2K07j98P4P9p9K01j48j24J20P1l
$$ 1 -182 20 -17 -16 -38 151 119 -148 -26 7 -172 35 -53 -125 82 -116 -42 37 -42 159 11 -113 7 78 75
3690G5k98J24N1M7l4J91l02P5M9j4j3q1K34j35K90k36j22pJ45K6j83N3O7p9j2
$$ 75 -223 -99 -48 -1 -35 156 -146 -71 -22 -36 -49 -130 104 -31 259 23 -99 -106 39 65 -118 -65 2 -77 -89
3715h9R3m8J2m0J16P4r5N3j00J1j8N9J59j14j50Q9k8M1ron7L7J47j59K02l9p6
$$ -89 4 -44 -32 -72 44 118 23 76 -24 -13 -31 28 187 73 -77 12 -16 25 16 10 -47 -10 137 -22 180 141 65
3742F5k16J16M5l6o9k1J73j5j12L2p0J71Q5j02o3r1J70o8n5J55j11R9j95R1K03
$$ 65 -151 -35 10 -26 -95 -116 57 42 -70 -38 -108 63 148 46 -17 -108 62 -6 -61 94 -17 82 -113 -22 181
3767A81j32j64R8j17J14O2j18N7J34j05m7J4p6O0J4J5L9PQ0j79K89l97K17Pk2
$$ 181 49 -115 -17 -134 -20 42 -76 -19 115 10 -37 -23 -99 -39 -25 -10 29 36 116 -63 226 -171 46 53 31
3792C1j82J02K2K8r6R7M5j49K42p7j70rQ6L6k00J09N4rQ8k8r4N6J23N6j87o7J55
$$ 31 -151 -49 -27 1 -95 2 47 -102 140 63 -107 -116 -30 6 -194 -85 -31 -40 48 20 -74 -18 105 161 -26 -93 62
3819F2j84K30q7Kj5j5L7M0j17r1J9O3J33m4K04j63j26o3K79j69J27j7p4P1Mj72
$$ 62 -122 108 21 23 8 -7 30 70 -47 -138 -119 -56 77 33 237 74 -52 -115 164 -5 122 105 31 102 106 -66
3845f6L5N5j8J1K2Q7j88J4J14j25N2m1n0J41k29J34P4j17O8L6k5J31p8J52k80
$$ -66 -31 24 6 17 39 126 -62 -48 66 -59 -7 -48 -98 43 -186 -52 22 -95 -27 9 -16 115 37 189 -91
3870i1P5M6j29p5L15k82J04l9P4j22K61r4k5o5l8lP7kJ28jk01J15K6rj16J23P7
$$ -91 -16 30 -99 -174 141 -141 -37 -76 -2 -124 137 43 18 -47 -85 -88 -11 -13 115 114 -87 28 54 45 -71 52 129
3897A29j80l2J08n5J41j87R6m8j70J52J27j89K3k2J13l7j5j0m8N3N1j6n1L2o3
$$ 129 -51 -83 25 -30 111 -76 20 -28 -198 -46 81 -108 -85 -107 6 -31 -46 -56 -104 -51 0 -16 -67 -35 -98
3922i8K67k51J66k04K4J52Rj69J39O2m5N8q9J99k28R8l6p7P4j17Q7Q1r4L2K9j81
$$ -98 169 -82 84 -120 -96 56 65 -104 35 97 52 110 21 220 -8 90 54 -23 51 -66 21 102 8 40 69 -112
3948a12r3K87k76J87J45j86K0m1lMJ54j62R1J56j28nj06k3P2L2j5lj60J95M0q4
$$ -112 -205 82 -194 -7 138 -48 -28 -69 -72 -68 86 -76 15 171 43 38 -68 -91 -19 13 -2 -5 -165 30 70 -14
3974a4l7R2l6o3O0l7k2j2mJ33p9o1O8k2L8j19P7k11L44k11J85k22J16l5K6J03
$$ -14 -51 41 5 -58 2 -35 -57 -69 -73 60 -19 -80 -12 -34 4 -115 -38 -249 95 -116 69 -153 -37 -72 -46 57
4000E7k7O2k29K61r9j37J22o7J56%l8qk6r2q1L03k16LP1r3P4L6m5JK4q7m9K73
$$ 57 30 92 -137 124 25 -112 10 -57 99 99 61 53 27 -65 -146 157 -59 -56 15 -78 -4 32 -13 -12 12 -75 -124 149
4028A49j81qK8J79l57K02J59j24l8k4J24k8j28J09Ok1k8j3O6n6l1J2N2J71l14
$$ 149 -32 -40 -12 167 -190 12 171 47 9 -15 109 81 -47 62 68 47 19 6 72 16 -15 -3 49 220 -94
4053i4P9R0n4o0O0j16J00R7p1j80K7J47L5l3q3P4KJ74k30j21K58k53J38J43j75
$$ -94 -15 75 21 -39 21 -95 5 102 31 -149 -122 25 60 27 -56 18 20 194 -36 -157 101 -152 -14 129 -46
4078d6L7Nr1j4O1l5j0J12k03K08J43l47K09p9J5j05J22m2O7K4R5l1r8K8j56J91
$$ -46 -9 -4 -95 -109 -48 -83 -93 19 -184 24 167 -180 29 -50 -35 -140 -18 -60 7 31 126 95 -3 25 -131 60
4104F0J7j4jN5o5m6q4M8o2RN5L9j18r4L14k01J94j37J93n5j23P6j17p3mJ92n4
$$ 60 77 63 62 117 52 6 -78 -30 -92 -83 -28 11 -107 -201 113 -88 106 -31 162 107 -16 60 -57 -130 -134 58 4
4131DL2q4J26J78k42o6R9j58K36m5j71J47j74K47l74K75o7M1J8j75K7P0j46L81
$$ 4 36 -48 78 256 14 -52 47 -111 125 80 -91 56 -118 129 -245 30 -37 4 22 -153 -126 -56 -202 179
4155A79k76m7K27k16J73q7J96n1j14oq4l1J42n0N4n2J44l1j16p9J22q5P1P1j0
$$ 179 -97 -144 83 -133 40 -47 149 98 -16 -22 -106 -137 5 -45 9 -43 101 70 -46 -125 -3 -88 -17 54 44
4180D4R5p1J14k88j24M47j96j47J13K92k27p2Q8j20K4O9q2p4O9P1Mj28J23P8j56
$$ 44 139 68 182 -106 -230 217 21 -126 -13 279 52 -20 68 -52 -28 41 -41 -115 -46 25 29 -99 24 102 -54
4205e4m1J27j42K9k1K30Q4k09kM0J32q8j40J9r3J85N6o9m9J48n1j26N7k1Kl3Q5
$$ -54 -95 32 -110 -81 -102 128 212 3 1 41 173 85 -55 -36 -129 56 112 43 -6 142 91 -35 22 1 3 -30 55
4232E5j51K41j43J43p0j69J12n1n2M8M0J38l51J09J65j74J04j01J90m2j17r0J59
$$ 55 -96 145 2 145 75 -94 18 -33 -85 -37 3 141 -210 -101 64 -110 -6 -107 83 41 -76 -166 -7
4255gO2n5PK14l44P0R0j2pK6p4l3L3j51J59M9j16N2N3j20L%K41j88P3O7j4k06
$$ -7 55 0 7 221 -123 -53 37 25 18 44 -30 -63 -30 -181 -22 27 -89 -37 16 -104 -101 -101 140 -48 25 92 78 -128
4283a28K23j5O1j87J82k93J72J10l0j08k0N1kK7j08J40k2J66j58k7nJ78k89P5
$$ -128 95 80 141 -46 136 -157 15 125 95 -13 -33 18 16 43 -65 75 53 219 61 34 29 207 -82 -7
4307gj4o6p1J75j16J15J5j81J92L3m9L1M2J10k15r6J57m2nNJ04J2m0J9p4m3J39
$$ -7 -21 -87 -158 17 -99 16 31 -150 42 75 26 57 99 209 -6 -102 55 13 8 13 117 129 89 108 34 -9 130
4334A30j65J54j22l9Rm2k5O8j6j26J95j16mk3M9N8m9R8j37J29r6j03K10n5Q6n0
$$ 130 -35 119 -3 -42 -33 -75 -100 -32 -48 -174 21 -95 -99 -122 -73 -15 -64 34 -103 26 -70 -173 37 -18 68 18
4360A8j54J03J59k36J12K87l80KK45%k60L92k06j41J03j8O2j04M4jJ45j27l5J47
$$ 18 -136 -33 126 -110 2 289 -91 -89 156 156 -104 288 82 -59 44 26 88 -16 28 27 172 45 10 157
4384A57j67lo1K9J09o4J43q1j27J23K0j61l3O8R9%J06k47J70o6n5K12o9p7K9%
$$ 157 -10 -13 -74 -45 64 0 143 62 -65 58 78 -83 -116 -48 51 51 157 -90 80 14 -41 171 102 25 54 54
4410E4p2M1M4k8n6j95J17J77O5j26Oj01J37m1o0k8n9N0P9L6j38Q4j41J06n9M8
$$ 54 -18 23 67 39 -17 -212 -95 82 147 21 27 -74 63 22 -38 -66 -125 -75 4 40 -98 -14 -155 -49 -108 -60
4436f0L9j75J71J36k19J54r7n4R9l1M1P1o8o4O2mp4Q1l4K7K6j42P7L5k0n6J22
$$ -60 -21 -196 -25 111 -108 46 -51 -105 -6 -37 4 75 7 -57 5 1 -73 8 -26 1 27 -115 -38 -3 -23 -79 43
4463D3m6J1K47j23q7j66J62J45J2j6j16j93J87m7j66J03J00Q2k49J7K59p8j28
$$ 43 -3 8 255 132 45 -121 41 186 198 182 66 -127 60 13 -153 -50 50 132 -117 -100 159 81 -47
4486d7K18k71o4J52m5K3J04pJ02k88J33o0M0J05j32J4L6P4n7lj28J72j71O5j17
$$ -47 171 -100 -164 -12 -57 -34 70 63 165 -123 10 -50 -10 95 -37 -23 13 87 30 27 -101 71 -100 -35 -152
4511a52L00j30j08l1O8M0J04r7j26J08n%L2r9j4k8K05Mj79J55j62K67l26J79J1
$$ -152 148 18 -90 -121 -53 -13 91 -6 -132 -24 -29 -29 3 -96 -110 -138 67 71 -108 47 -115 152 -174 5 16
4536A6j29R3r4J29j8L1J43k02PJ61j08m7K61j47j39J36r4P1k48K32J15j54J62
$$ 16 -113 -20 -114 15 -3 28 171 -31 -24 137 29 -18 243 96 -43 93 -1 70 -178 54 169 15 177
4559A77j98n9N3K0k6k6J03K5M5k4p6k4O8p1r4L28j71j30n4J56j02J02l5p8n0J54
$$ 177 -21 -80 -27 -7 -33 -59 44 69 114 90 14 -10 58 -13 -107 221 50 -80 -134 22 -80 22 -13 -91 -141 13
4585A3K7j1q8l9P8j17P5J00l0k6J36n9n1o1P1N7j20LO3j02L6N6R7P0j81J40k31
$$ 13 40 29 -59 -98 -20 -137 -62 38 8 -18 118 59 8 -53 18 75 -45 -42 21 -81 -45 11 108 178 -3 137 -94
4612i4J1q8K31n7K5J93l55J35L4j64K88j32j08J20q1J59p0R6p1j08r4J28r2J40
$$ -94 -83 -171 60 3 28 221 -134 1 35 -129 159 27 -81 39 -42 117 47 143 72 -36 -130 -2 -94 46
4636D6r6Q8M2j61R0r8K22k48Q6O3J05j51O8k01J53m5n8Q1o3J60kr1N4j64O6J09
$$ 46 -50 38 80 -81 9 -89 133 -115 -29 34 139 -12 56 -145 8 -37 -95 -14 -77 83 81 -10 44 -120 -54 55
4662E5j4qkL6Q8k17K0n6J15j47J60mJ04j48j30K06j35K65k02j19J02q9O3k08O9
$$ 55 41 33 31 67 155 -62 -42 -98 17 -130 30 26 130 -18 -148 58 -77 188 -14 -133 -31 -120 -57 -265 -196
4687a96L9K40n5PNL3N1m6j42J78m1rp9m9Q6j6p0K33j40%o9M8J3qK06m7j30k3m8
$$ -196 -157 83 28 35 40 73 124 78 -64 114 73 64 -15 -64 22 6 -64 169 29 29 -40 8 21 13 219 172 42 19 -29
4716b9o6J42j04k7p2J15j02K08N6j86J27r3l1J31J15m7j42O0p4L3K9p9J28j6j27
$$ -29 -95 47 -57 -84 -156 -41 -143 65 121 -65 62 -31 -62 69 184 137 -5 55 -19 14 43 -36 92 76 -51
4741e1J17R4r1j9k4p8J98r5J5l8k7N8j07R1r3j27K79o3j07L6R1n0k0L7R4q8Ml7
$$ -51 66 160 69 50 26 -52 146 51 66 28 1 59 -48 43 -50 -177 102 39 -68 -32 59 9 -11 26 120 32 36 -1
4769aJ16k49K08j63j66K81j74K28l28K61j00J03q5L3kO0K7%j95K82j76J37j52
$$ -1 115 -134 74 -89 -255 26 -148 80 -248 13 -87 16 -69 -36 -38 22 49 49 -146 136 -40 97 -55
4792e5J84j15j26M8Rm2L5J43j28J32j35N0R1L5k87K33j11k6p4J51M5o8J02j17
$$ -55 129 14 -112 -64 -55 -97 -62 81 -47 85 -50 0 91 126 -161 72 -39 -65 -139 12 57 -11 91 -26
4816b6J18k5j04J71j04n2J6N9J2J04j78Q2j6n3O4Q1j3p9p1J58k78M5J53j17j3
$$ -26 92 67 -37 134 30 -22 -6 53 65 169 -9 73 57 4 68 149 136 57 -14 144 -134 -89 64 -53 -66
4841f6o8J59M2Q6M0o9l2j35K2j5P4l3j2m4P6n8j32J30l2J23o8j2J74l08J87P6
$$ -66 -134 25 67 153 193 124 92 -43 -21 -36 38 5 -7 -51 25 -33 -165 -35 -67 56 -12 -24 150 -158 29 105
4867A05k5j6j30k1J90k29J95k12J2J06L9j18J34j18J47j51J04m1q7jq2P3J68l5
$$ 105 80 64 -66 -87 103 -126 69 -143 -131 -25 14 -104 30 -88 59 -92 12 -29 -116 -117 -199 -126 42 7
4891GO4j64p2Q5N9M6j1j86K8J92j93M2L20k77L1l1p5J86j02P4p4J40j20R1k1K4
$$ 7 71 -93 -165 -80 -21 25 14 -172 -144 48 -145 -103 217 -60 -29 -60 -135 51 -51 23 -51 89 -31 60 39 63
4917F3j24p8J64K5j2L8j98J05jp8n1J83o0N4J9k2Q2l5O0k28m9J53k11R7K30j26
$$ 63 -61 -139 25 50 38 76 -122 -17 -18 -96 -147 36 -24 30 49 27 109 74 134 -94 -143 10 -201 -104 126 0
4943@N8J9j55J04j83J67j01O8k6p7J79N0m0q0q0o4J76j16J61J9k72J55J63k81
$$ 0 58 77 -78 26 -157 10 -91 -23 -49 -126 53 103 63 -17 -97 -161 15 -101 60 79 -193 -38 125 -156
4967a56J82Q6j47j4P1j97K59j43MR5ql5O9M8k18K51j31n2Q4Q0j82R1j11N7p0J36
$$ -156 26 112 -35 -49 22 -175 84 -59 -55 40 32 -3 66 114 -104 147 16 -36 48 128 -54 37 -74 -17 -87 49
4993D9p4l9K3J3j55J38J17p1m6J28j00N2q6MJ36j0k2M4p5k6Rl2J36j59J05k3j9
$$ 49 -25 -64 -41 -28 -183 -45 72 1 -45 83 -17 35 -51 -47 89 79 57 101 26 0 9 -23 113 -46 59 36 17
5020A7n9o4J56n5J12j92Q4J7J96j89j22J72j26j29K97j7k52LK35m1j21J36p8O7
$$ 17 -42 -106 50 -5 107 -85 -1 16 212 23 -99 73 -53 -182 115 98 -154 -151 84 43 -78 58 -20 47
5044D7o1J26j87J12j50l1J52O4p8l3J39k35J13p0Q9l8O7O0j17k19K03n8J24K9
$$ 47 -14 112 -75 37 -113 -144 8 72 -6 -39 100 -135 -22 -92 -3 -41 26 86 -31 -250 -47 -105 19 48
5068D8j02J47r8J47j14j1J08o9k9j02Pn5J28n4j8J86j72J50j16L7k27L40j0k00
$$ 48 -54 93 -5 142 28 17 125 56 27 -75 -68 -123 5 -49 -67 119 -53 97 -19 18 -209 131 121 -79
5092g9J25j04K09j83l7L1n4J1l5J69J43j55j86J46j10J82j25R0L1l7nj2M1n9o7
$$ -79 46 -58 151 -32 -69 -38 -92 -81 -116 53 196 41 -145 1 -109 73 -52 38 69 32 27 15 56 -3 -70
5117g0p1P7J23o4N2l1j20j4J63J0j26k0R7K0m5J07j59j28K71j02o9M5J09j46o0
$$ -70 -141 -64 59 -5 47 16 -104 -118 45 55 -71 -91 6 26 -19 88 -71 -199 72 -30 -99 -54 55 -91 -151
5142a51J5K15r5N2P1l5k1q1qK1J67q7J35k31j0n0J47k98K55n5l7P8r6Q7Qo7q3
$$ -151 -136 79 -16 36 107 72 51 -30 -38 -17 150 63 198 -33 -43 -93 54 -244 11 -44 -81 -3 -99 -12 -4 -71 -154
5169a54J08j34K10M5q5j51K88j4l7q8J8j02J61n9J4L1Q8p0o9q7R2K9q5J35J06
$$ -154 -46 -180 30 75 -10 -161 127 113 76 -12 6 -96 65 6 20 51 139 69 0 -87 5 34 -51 84 190
5194A90j90j30K56Onj20j37O5k2R2Jj07J48p2O1l1O2K8j32q3l8K83j33Q8j91J3
$$ 190 0 -130 126 132 127 7 -130 -65 -87 5 6 -101 47 -25 36 5 67 95 -37 -120 -158 125 -8 80 -111 -98
5220i8p1L31l36J95m5k8O7j62K3K93j13n8j4O7r5m3n2N7R0N2J82k94J5L4j28J39
$$ -98 -169 162 -174 21 -24 -52 15 -147 -124 169 56 -2 -16 51 -44 -87 -139 -82 8 60 242 -52 -37 -3 -131 8
5246Hm4O4K5j04o1J33r4J59j58k0J41q1n2J60n2j33J02m9p1K42l6k3l6J01j29
$$ 8 -36 28 53 -51 -112 21 -73 86 -72 -92 49 -32 -84 76 24 -109 -7 -56 -127 115 79 56 20 121 -8
5271hK9p1Q0L9m8j64K09j73j0K99l25J88n3J10mnj12l6P7j09J21j19J24L0r7j3
$$ -8 21 -50 30 69 21 -143 66 -107 -117 182 -143 45 -8 102 98 93 -19 -55 22 -87 34 -85 39 69 -28 -41
5297d1LJ91k79O2J8L4j2m3L8k4Q7K6j63M6J62j29r0J04M4j12L7J17k50J58NJ08
$$ -41 -38 153 -126 -64 -46 -12 -24 -67 -29 -53 34 60 -103 -57 105 -24 -114 -10 34 -78 -41 76 -174 -16 -11 97
5323I7j76OJ86k35J88N0p2k2q0J06p0K8r2J11r1LJ7NN6o1J09q0K26j56J0k41J29
$$ 97 -79 -73 113 -122 66 116 44 22 -58 48 -22 6 -86 25 -66 -63 -46 -41 15 -46 63 -17 209 53 63 -178 -49
5350d9J4K15l44K47K8j40J42j14n8M8J67j14J74l55J40r6m8L35l40m1J54o2K07
$$ -49 -35 180 -164 83 111 -29 113 -1 -59 -11 156 42 216 -139 1 -95 -143 192 -148 -189 -35 -97 110
5373A10o0j46P6O4m8j10J28Q1j7j53K61j77R4j29Q1j76K15o5R9k93L5J32l4L8
$$ 110 50 -96 -20 44 -4 -114 14 95 78 -75 186 9 103 -26 55 -121 94 29 128 -165 -130 2 -32 6
5397FJ85l1q3m1q9q1J43j70K24j49N2J0K8p8N1m6n2K54l8j04j08J12k26J79P8
$$ 6 191 160 77 36 -53 -134 9 -161 63 -86 -34 -24 4 -74 -23 -69 -121 133 95 -9 -117 -5 -231 -52 26
5422B6l1oJ18j48Km3P1j7J17o5k5M3%j27k2M7L7r5J53J12r3P2j94o9K61j04j52
$$ 26 -5 -11 107 -41 -39 -82 -11 -28 89 24 -1 42 42 -85 -107 -60 -23 -118 35 147 54 126 -68 -137 124 20 -132
5449a32O0J64L0jk12Q5R4k46K43j88K99k48Q2Ok17L5K35j29m6J09P3q4J06j19
$$ -132 -72 92 122 121 -91 -6 88 -158 85 -103 196 -52 30 36 -181 -146 89 -40 -86 23 96 12 118 -1
5473ap3R7k9r2M8O1n7R0j18J20k4n5j01j9J86j8k06K12n3L4L6qM4l8m4m8J38J44
$$ -1 -74 23 -6 -98 -50 11 -46 44 -74 46 22 -33 -134 -153 33 15 -191 21 -32 2 38 30 74 36 -8 -56 82 226
5501B26k17j41K3J54R2j70O8Op9j11O2N6J32O8k76J59j13p8J53L8q8n7P9r9j1
$$ 226 9 -132 -109 45 137 -33 35 41 -38 -149 -87 -31 101 169 -107 52 -61 -139 14 52 -36 -93 -14 -113 -124
5526a24RQ6o6J77k01K41k8M9p5j82J05j17P1j49O6K3J75J06j04J00j46J06n9j55
$$ -124 -115 -29 -95 82 -119 122 94 143 68 -114 -9 -126 -55 -204 -138 -115 60 166 62 162 16 122 63 -92
5550i2J60J3mk61K66m7O4k00O9N0m7RK5k0M8Nj8M1j32J37k7m4M2L5k13J24K47
$$ -92 68 81 77 -184 82 35 99 -101 -32 18 -29 -20 5 -15 33 38 20 61 -71 66 39 -5 37 72 -141 -17 230
5577B30k19K0L8k25K41m0j12OJ11n4P5M4j01jN2p6l1r2R1M9n9J8K0m2O2L1p0Q3
$$ 230 11 31 69 -156 85 45 -67 -61 50 -4 71 115 14 13 65 -11 -42 -134 -43 6 -53 -35 -15 -57 5 36 -34 49
5605D9j04J34j54ML1k4O6nN7M1j02J43j52j35J91j96J03n0O4P1J5P9j34j10J10
$$ 49 -55 79 -75 -71 -40 -64 2 -3 54 95 -7 136 -16 -151 40 -156 -53 -103 -39 32 47 126 -8 -118 -8
5630hJ80j90J19m5k0j61J13R4ml8m1J26j14j5Kl4n2J28O8k8n1O9j06M4l0J2m3
$$ -8 172 -18 101 56 36 -125 -12 82 78 40 -1 125 11 -4 -2 -36 -88 40 108 80 29 98 -8 36 6 18 -25
5657b5J50j37L3J34r6j08Nm2J46j31o9K23j18J47r3Jn8p2J07N7Kl1m1J59j04k9
$$ -25 125 -12 21 155 59 -49 -44 -86 60 -71 -140 83 -35 112 19 20 -38 -110 -3 54 56 25 -16 143 39 10
5683A0j9J07r7m7J12j0j31m6J95%j54J51j50K0LJ8R9l9p9m6K4nN0l5J07PQk08
$$ 10 -9 98 1 -46 66 56 -75 -121 74 74 -80 71 -79 -59 -56 -38 61 22 -57 -103 -79 -84 -34 -69 38 45 53 -155
5711a55J88r2J39q3L4K2o8k2M2L1j46k6K10Po2n4R6j68N2M6Q0j0k2J83k14J21
$$ -155 33 -59 80 -3 31 53 -15 -37 5 36 -110 -136 74 81 19 -35 61 -107 -55 -9 71 61 39 222 8 129
5737A29j17l0o1R4P0q2m8J46K5k02P3K1O3o8r6R4J39om6m3j1n6J5M4j13L7m8R4
$$ 129 12 -18 -79 15 85 3 -45 101 126 -76 -3 18 81 13 -83 11 150 144 98 55 44 -12 3 47 -66 -29 -77 17
5765A7J62p9j64l5J95M4j38r4J58j38K34l71K05K4o1Ol3K38k23M6M8j38o5P2J50
$$ 17 179 100 -64 -99 96 140 2 -92 66 -72 162 -209 -4 20 -41 -35 -68 170 -53 -7 41 -97 -162 -90 60
5790F0Lj92P8PlJ92j17j71J72J1N2N5j92PJ46o6r9j0K3j9P1n6M5J98j74N2M9Q7
$$ 60 63 -129 -51 -44 -47 145 28 -143 29 40 92 147 -45 -38 108 42 -57 -67 -44 -63 8 -48 -3 195 21 73 122 209
5818B09l41J9J72n0N5j22J36j74N8j8Q0p0K52q2j6j78K2M0J7l8p4J84rj2o5j44
$$ 209 -132 -113 59 9 64 -58 78 -96 -38 -56 24 -46 206 124 108 -70 -48 -8 9 -29 -103 81 72 60 -5 -149
5844a49K21k48O6l8OK01j60K19r4J00q8k9o5J75k72J08M0j39J04r9M6P0J44M9
$$ -149 72 -176 -110 -148 -142 59 -101 118 24 124 36 7 -58 117 -155 -47 -7 -146 -42 -141 -95 -25 119 168
5868A68k56R7P6j82O1j07K03j48L63k32rK25l84R8Jj3J95k14J48r1k13K02j44
$$ 168 -88 9 85 -97 -36 -143 60 -88 275 43 34 259 -125 -27 -26 -39 156 -58 90 -1 -214 -12 -156
5891a56O4O4J4N5j7l0J1o1J54l10K84j83P6P8j48K02k13M5N9J3k0O4Jk7N8j84
$$ -156 -92 -28 -14 41 24 -6 5 -56 98 -212 72 -111 -35 43 -105 97 -116 -71 -12 1 -19 45 46 19 77 -107
5917a07J22N6k5j19m5J9J31L9Q8j34j83J74P8j03J1j14J21o4J18q8J26j81J72
$$ -107 15 71 46 -73 -118 -99 32 71 159 25 -158 16 94 -9 2 -112 9 -55 63 -25 101 -80 92
5940I2j04P5K6j68K53q9o7M5j33J45j78L8O0p5J03L7k7m4nn1k3P4r0J86Kj26l9
$$ 92 -12 63 89 -79 174 85 18 63 -70 75 -103 -65 -5 -80 23 60 33 -11 -16 -67 -90 -16 -106 80 82 -44 -83
5967h3J05L8k3q4J9P8k0K7J3j24q0J34Q4q8j7q2J12j5J01k42J99N5j2o3J55o4
$$ -83 22 60 37 -47 -28 50 30 57 70 -54 -134 0 84 -4 -21 -103 9 -6 95 -147 52 107 95 32 187 123
5993A23j25l2Jk9qR1j19R9j34J78n3k0JK30j54l6Q6r1K5j99J88K2j50k4J57O4
$$ 123 -2 -34 -33 -62 -70 21 -98 1 -133 45 -8 -28 -27 203 49 13 99 8 33 -166 22 44 -106 -130 27 91
6019I1k13J16J83k44J39L5n5p2R7k28N1n5L01k8j60M8K3Qj80R6L7p5Q4j3j5j27
$$ 91 -122 -6 177 -67 72 107 52 -20 77 -151 -100 -155 146 118 -42 6 29 37 -143 -47 -10 -85 -1 -14 -29 -156
6045a56J11J99o4k91rL56k09J24k0j17P9R7j52k1J34m7J01j66K17k0j32O7o0j99
$$ -156 -45 154 90 -201 -210 146 -63 61 41 -76 3 100 -52 -73 61 14 115 -51 166 146 14 81 21 -178
6069a78J45P2N4k17J02P2O4q7j55O1J11j3J1K4k5p0L10j63j73J71j38J57j17k0
$$ -178 -33 39 93 -124 -22 50 114 27 -128 -67 44 31 42 66 41 -29 281 118 -55 116 -22 135 18 -2
6093bj27J57j43n3J63M4jo1j8Oq3L32k91J99k33J73M7J0j60l8K14J7j88j18K24
$$ -2 -129 28 -115 -168 -5 39 38 -23 -41 -35 -118 214 -77 122 -111 62 109 119 -41 -79 135 152 -36 -154 70
6118G0P5j12k01kJ13p2J17n6J72j99R1J92r5j24K3j7q2J37k3q3J31l80K49j63
$$ 70 145 33 -168 -170 -57 -129 -12 -68 104 -95 -4 188 93 -31 -8 -25 -107 30 7 -76 55 -325 -76 -239
6142b39J37J84k06J49OM5k8p4K27m04L08P2k07Q2ll7N8J49k60L8J24r2J23j53
$$ -239 -102 82 -124 25 31 76 48 -26 201 -203 105 177 -30 52 49 12 70 219 -41 -3 121 29 152 -1
6166aP6l6j1Qr5m1R5J07j10q7J07J09j03o0ko6R2N6J15R4l07j16K42M4j05o8l5
$$ -1 75 39 28 36 -59 -100 -5 102 -8 -95 12 121 18 -42 -44 -110 -18 38 153 247 -60 -176 66 110 5 -63 -98
6193i8P9L2R1J2j29R4q2Kj51L08j62ln4J44M9j45K05l06J38P1k52J22m2M8L5o4
$$ -98 -19 13 104 116 -13 81 -1 1 -150 158 -4 -7 -61 83 132 -13 192 -114 24 95 -157 -35 -77 -29 6 -58
6219e8N2J31l7j47Q4j9J08j47r1J13l4N4j10J42q9J54n0j50jJ70M2q2JJok1Q5
$$ -58 -6 125 88 -59 25 6 114 -33 -124 -11 -45 9 -101 41 -48 106 56 -94 -95 75 117 35 36 37 31 10 95
6246I5k44O8K47j18j97J03Q7q3N0k7j08J42r3J61m9N1K8j62l3R2J29n8O7k04R4
$$ 95 -149 -81 166 48 -149 -46 41 -42 8 -19 -127 15 -78 83 34 85 113 -49 -82 10 139 81 148 -56 38
6271C8o4k0Q5L2k49K77k0j24L0l4K01r8o5J20q2j9qK1K28j60j26KJ48l79L75j37
$$ 38 -26 -46 39 71 -178 99 79 -45 -15 -49 152 54 -11 109 27 8 0 21 249 89 -37 -35 113 -266 109 -28
6297b8N3p5J7L3l6N5j43Q8n8J14j32J61j64o7K77j6j77J17k32J43K7J57q1j14
$$ -28 25 -50 -33 0 -36 19 -124 -36 -94 20 -112 49 -115 -182 95 79 -98 19 -213 -70 -43 114 33 -81
6321h1J35j78Q6R1j78Q2R5q5J00M1P4j70OR4k37K17l6J5j15M3L7J07j83J09j54
$$ -81 54 -124 -38 53 -125 -43 52 -33 67 108 182 12 18 112 -125 92 56 71 -44 -1 36 143 -40 69 -85
6346h5O9M2j0J73j68k9OM2R1k46J95q7M6o8J7K48l48P5K10l36L01o5q3k7j16Q2
$$ -85 -16 26 16 189 21 -8 -2 40 131 -115 80 -7 39 -29 -12 236 -112 -37 173 -163 138 73 -10 -37 -153 -71
6372g1L17k78R2Q3o3J8j1l5j27k9M9K46K7j67j36R1QK8P8j56J18R8j39k6m1J33
$$ -71 246 -32 60 143 80 98 87 52 -75 -104 -55 191 218 51 -85 6 14 42 120 -36 82 180 41 15 -26 107
6398A07j21QJ15o7l7K7j6J88k21j28m4j17L13r3P9o3J19Pj16O1O6R9k44P0j03
$$ 107 -14 -6 109 42 5 32 16 204 -17 -145 -189 -306 7 -86 -7 -70 49 56 -60 1 67 166 -78 -8 -111
6423a11R8Q6J00l07Q4N9J57kj65J10o9n5OJ76k99J09j8J21j10K29k63K3N8O6p7
$$ -111 -13 73 173 -134 -50 9 166 164 -1 109 40 -15 -9 167 -132 -23 -41 80 -30 199 -64 -41 17 83 6
6448FQ0n3o8l7K6M4r8J18j25J19Q6M7r3J17k77Q7J8j07P8R3K7j38l3K00j95J65
$$ 6 86 33 -35 -72 -46 -2 -100 18 -107 12 98 145 52 169 -108 -21 -3 -110 -32 61 88 -50 -83 117 -78 87
6474H7j44P1j5N1jl7J00j3k22k4J97O0k6j60n9P0l1J35j4m5P7J72k82N7J05q9
$$ 87 -57 14 -1 50 49 12 112 99 -123 -147 50 110 84 -76 -135 -65 -96 39 25 -20 57 229 -53 4 109 20
6500B0j2o3J53Q0j83j94J42M7m1J01J17l17N9J92j52o7N4J15m3J09j04J09j25
$$ 20 8 -55 98 178 -5 -199 -57 -10 -51 50 167 -150 -91 101 -51 -118 -64 51 8 117 13 122 -3
6523cj16K8J60M9j52J78j00j09R6N9J8j43L4q6J17R6j86J8m4J92L3r7M3J12k99
$$ -3 -119 -91 69 118 -34 144 44 -65 31 90 108 -35 -1 -87 30 126 -60 -42 -86 106 139 42 85 197 -102
6548a02M3Q7k5m0K37k82n6J96K8j16j06J89ml3P7k20J18q0R4M9OJ54k66l4J95
$$ -102 -59 28 3 -37 200 -82 -138 58 86 -30 -136 53 49 16 93 -127 -9 -89 5 54 60 214 -52 -86 109
6573A09r9N2n3k05J32L08l11J31k2j07M5J07l5p5P0Po5%R6l1p8j4N0Q3N9m2k76
$$ 109 10 62 9 -196 -64 244 -67 64 42 -65 -20 87 52 -23 47 54 -11 -11 85 54 -24 -38 12 95 154 112 -164
6600a64K71k79L68k70M6k2j3K4q1J16j13R9Q1J4k43M9l0K94P0l25J1r3K87J69
$$ -164 107 -172 196 -74 -28 -50 -63 -39 -120 -4 -117 -18 63 77 -166 -117 -147 147 217 -108 -97 -190 97 266
6624B66l45K19J1j05K4M5Q9k34N4O1m7K4r9%j91J17O3M0m8N9pQ8r1J0N3O7j3k46
$$ 266 -79 140 151 46 70 115 204 -30 24 85 38 62 -37 -37 -228 -111 -48 -8 -56 3 -4 84 -7 3 56 123 110 -136
6652a36K12P7j46l2P0j40N8L8mL5j55K97r4p7J06j70LM2J94l54K34n1L7r2Rj95
$$ -136 76 153 7 -25 45 -95 -37 1 -3 32 -123 174 80 3 109 -61 -58 -16 178 -176 58 7 44 -48 -39 -234
6678b34K62J70k12m7j18P6k6L74l89J58k4P0j66J08J05m5p3R8j06kj2J26j65P3
$$ -234 28 198 -14 -61 -179 -103 -129 245 -144 14 -10 60 -106 2 107 62 -11 87 -19 -21 -33 93 -72 1
6702AL1jJ44k56N6R2r9q%K2N1J03k50R8P1j71J68rp7p2K54j73J71k40J52J43k15
$$ 1 32 31 175 -81 -25 67 -32 -40 -40 -18 33 136 -114 -16 55 -116 52 43 -34 -106 148 -25 146 -94 58 201 -14
6729a4p0J6J61j12N8l0Q1p0r2J34%j20q0L28j42P2l2lp6m6J41j35J00j70J68j07
$$ -14 -84 -68 93 -19 39 9 90 20 -72 62 62 -58 -138 190 48 120 88 85 9 -37 104 -31 69 -101 67 -40
6755d0o2Q9Q7k24oJ98mm3j09K10j43n0M1l9J65k02J29L1j6j20Q7K9k36L90k09
$$ -40 -102 -13 74 -150 -156 42 38 -5 -114 96 -47 -97 -56 -95 70 -132 -3 28 12 -108 -21 8 -228 162 -47
6780d7J56p5o7O2j36L36k78RJ52J3j35j1L40k95R9k07P8p1J27m6o1j42K7J26J69
$$ -47 109 34 -33 29 -107 229 -49 -40 112 125 -10 -21 319 24 123 -84 -6 -77 50 4 -57 -199 -172 -46 123
6805A23j26k7J5M7j25J19N3j21L6m6K16p5k43K97j46N7l10L63j18K9J01o4p6n
$$ 123 -3 -30 -15 32 -93 26 79 -42 -6 -52 164 89 -154 143 -3 54 -256 107 -11 18 119 55 -21 -26
6829b6J16R4j99P0qk4p5N8L1j53J25R3or9pJ13j04K3n3J45n9k6p1J98o7k7k19
$$ -26 90 184 -15 55 47 23 -52 6 37 -116 9 102 96 -3 -10 103 -1 22 -31 114 55 29 -42 156 89 62 -157
6856a57J40J47o9k48J39M6P1q8J59k28L3R7p2P7n8n1N8J1q1J53J2J66j17k52J47
$$ -157 -17 130 61 -187 -48 -2 69 -19 140 -88 -55 42 -30 47 -11 -62 -4 7 -74 79 91 257 140 -112 35
6881C5j47K71j84o0M9Mj08P7R1k01K32n7J68j79M0n2J16j29K4Q0Q3k14O9j54J97
$$ 35 -112 159 -25 -85 -36 -32 -140 -63 28 -173 59 2 170 -9 31 -21 95 -34 -10 70 153 -61 8 -146 51
6906E1j7o2J97J7j39m9P8j37L1M1J03o1J0K2q1l5Q9k42L38j10j49l7J36J28Nj28
$$ 51 34 -28 169 186 47 -2 76 -61 -30 11 114 53 63 85 4 -31 58 -184 154 44 -105 -142 -6 122 127 -1
6932aj50J60j10j9K17k60K04Q6j64R8J26l85K61p1Q2j51J54n8j9j47J61m1n7J10
$$ -1 -151 9 -101 -120 97 -163 41 127 -37 61 187 -198 63 -8 74 -77 77 19 0 -147 14 -27 -84 26
6956B6n4K90k67n4K1J13j75J96k20J08K02k74k5P9Q2K5O6j17O1j19J35j31K7O8
$$ 26 -28 262 -5 -59 -38 75 -100 96 -124 -16 186 -88 -113 -34 48 73 139 22 83 -36 99 -32 -5 63
6980F3m5j12N2J06j37n9K22r4R3j48L3J54l4j84K2Q2q0m8J08o4R2l0J03m4q9K75
$$ 63 18 -94 -42 64 -73 -132 90 -4 89 -59 -26 128 94 -90 -68 14 -66 -114 -6 -70 22 -8 95 51 -38 237
7006B37l26M1J59r4L9k40J82M0k5n4J3K4o9k2M4K8J82j44k29K39N0j17O4P9j61
$$ 237 -89 -48 111 17 56 -184 -2 38 13 -41 -28 -4 -73 -95 -51 -23 159 15 -214 25 75 -42 22 101 -60
7031f0oJ33o1p1k3O6P0n8k4L1j34Q4J08P7j69N8Q8n0j42L29k95K33k00OJ23n9
$$ -60 -66 67 6 -65 -88 -22 48 -10 -34 -3 -137 -53 55 132 -37 21 109 59 -83 246 -49 184 -16 -10 113 54
7057E4j5j5k46M03k70N2K17l00K16k45K51j25K4N6j16J42J0nR7j38j49K26j03
$$ 54 39 24 -222 181 -89 -37 180 -120 96 -149 102 -23 1 57 -59 83 93 88 185 47 -102 124 21
7080B1L3j46J26K7k06jJ24q9J10M9q2K5j6q7J06p8J56j93Q1n3J79j26O1N3j81
$$ 21 54 -92 34 61 -145 -146 -22 -111 -1 48 -34 -9 -25 -112 -6 -84 72 -121 -40 -93 86 -40 21 74 -107
7105a07P5K00o2Rj69P3nk08K84r8M1p2J21o0j02j4o2K03r3K7k4M4M4K6j5j02P3
$$ -107 -32 168 106 115 -54 19 14 -194 90 -8 33 -39 82 22 -80 -94 -156 47 -46 -19 -43 1 45 71 56 -46 27
7132B7Qk3k0O9j44P5J78p0J9N9j88j5J05K6k26J41P2j9O1rj29n1K19m9o9n2J00
$$ 27 35 12 -8 61 -83 -8 170 100 119 178 -10 -25 80 106 -120 21 93 74 135 126 -3 -54 165 116 47 -5 95
7159I5j61J42%k49J07L0o8N5J40K7j4j59ON6jpn1P2R9k1J04k79j15J70r7J26j85
$$ 95 -66 76 76 -173 -66 -36 -104 -49 91 118 104 -55 -49 7 6 -1 -52 20 119 98 202 -77 -192 -22 -119 7 -178
7186a78J80L2r7J11q3K76l23J13j6N2j04R9k04K66o1j53J00o1J8M0J32k42m5J07
$$ -178 2 34 -63 48 -35 241 -82 31 15 67 -37 62 -142 124 63 -90 10 -51 -33 7 139 -103 -148 -41
7210d1J48k29J08R6j60J26q3O7o5J2r9O9M2J37j64q8J24j46J20o7O3M8k51K04
$$ -41 107 -122 -14 82 -78 48 -35 32 -33 -21 -120 -51 -9 128 -36 -124 0 -146 -26 -93 -30 18 -233 -29
7234b9j40K87j35m4J76k02j28L37k06M1LP7po5J54q3K2OM0n5j54N7J11k9L5r3
$$ -29 -169 118 -17 -61 115 -87 -215 122 -84 -43 -40 37 30 -35 119 36 58 64 104 49 -105 -48 63 34 69 -24
7260b4M9j10J30k8J15p7OJ90l88J28J05j51N2k21L47j57Q0m6Q6L7j28k9j4n3J92
$$ -24 25 -85 45 17 132 55 61 251 -137 -9 96 -55 -3 -224 123 -34 46 0 86 123 -5 -34 -48 -101 91
7285I1M7l15Q6J0p5L22k80N9J1J7J7q5K23k35J30j34K04j43K4J10j04J31k17Q2
$$ 91 138 -177 -91 -81 -156 166 -114 -55 -44 -27 -10 -95 128 -107 23 -111 93 -50 -26 84 -20 111 -106 -24
7309b4J2j03Q1R1j98J36m9J21j2J00m6l33K35P7m9o0Q1j36K57o7k4o9q5J18j68
$$ -24 -12 -115 -34 57 -141 -5 -54 67 55 155 109 -224 11 88 39 -21 60 -76 181 114 90 21 -64 54 -114
7334a14J31P5k08J06J91k01J09N7j59p5J63J16K1j58r5j06K07M2r8k7J17j57O5
$$ -114 17 92 -116 -10 181 -20 89 146 -13 -88 75 191 212 54 -41 -147 60 102 4 -23 94 -63 2
7357Bn4m4PL2N7n2L1No4j0P1M6J26j87NM3R9o3q4j5k1MM2JJ48j79P3J3r8L2R1
$$ 2 -52 -96 -89 -57 0 -52 -21 -16 -80 -90 -19 27 153 -34 -29 14 113 50 -34 -49 -70 -66 -24 -23 125 -54 19 32 -66 -34 57
7388E7P0r6q4k5K88k15P1l6j45J22j19K10p7R4j09J7k69J45J29j34J54k08J11
$$ 57 127 31 -53 -78 210 -5 66 30 -115 7 -112 98 21 115 6 23 -246 -101 28 -106 48 -160 -49
7411d9Q2k13K54n7K5J25k5k35R4O0K4j4j69k5J19J5j64MO2K6J61K3r2Jk04J96
$$ -49 33 -180 74 17 42 167 142 -93 1 61 85 71 -98 -123 -4 11 -153 -149 -87 -61 100 123 31 32 -172 24
7437B4k8J82r5K5j79o3L01k07J46j0j14J85k23J31k4P4r7M5j26K1P4j42J48k9
$$ 24 -4 178 83 108 -71 -134 167 -40 106 96 -18 167 -56 75 51 125 28 73 -53 -32 42 -100 48 19
7461A9K2J2j5J14j06J28l8p3r9N2j5j9K5o6O9l3R7j07n9q5J02j1J94n0l7n2k7
$$ 19 41 53 38 152 46 174 136 63 -36 16 1 -18 7 -59 10 -23 74 -33 -92 -177 -75 -86 108 58 21 -31 -58
7488e8J85k19P2LJ61q4k26K05m5N8j16J35p8j44K80l9l23J99n8N4kPM4j77J75
$$ -58 127 -92 -20 -17 144 60 -166 39 -6 52 -64 71 -7 -151 129 90 -233 -34 -92 -38 -40 -33 11 -166 9
7513Ij58J56J2J19k59M42l73K1m2J73%j13m6o6J71l2n7J30j97J16q8l6J31N1q5
$$ 9 -149 7 19 138 -121 321 -52 -31 -73 100 100 -13 -59 -125 46 14 -43 87 -110 6 -82 -118 13 64 -21
7538b1p6J42j45O0J28r1j38J39K7J7m3q0pP9j57J05J33j3m6p4L6o6j1J10R5q3
$$ -21 -97 45 -100 -40 88 -3 -141 -2 25 42 -1 -81 -88 -9 -166 -61 72 59 13 -61 -25 -91 -102 8 103 20
7564B0N0j78K30j12j0J59r7M7k05J13qq1J47p1p9K1J29p2J0j66J93k9k96K83K9
$$ 20 70 -108 122 10 0 159 62 109 -96 17 9 -72 75 4 -75 -54 75 3 13 -153 40 11 -285 -2 27
7589B7r7j8k4J84j30J10j88J87j14J99k2j92OQ1L4P8k63J40k9L0K60k97J7J12
$$ 27 -70 -88 -112 72 -58 52 -136 51 -63 136 114 -78 -72 9 43 121 -142 -2 -31 -1 259 -38 -21 91
7613I1m4l9j20J33l4j3l5P8m7j2O5P2l0j09l5J10R6k13J70p4M1j64J42m2M2M1
$$ 91 47 8 -112 21 -13 -26 -61 17 -30 -42 23 95 65 -44 -79 31 127 -86 84 10 51 -113 29 -13 29 70
7639G0q2J79r7k0Nj6o3l0QK41k17P1J14j57l3J62k6k42K07K0j22oQ3J0M2k46P9
$$ 70 -12 167 70 50 55 39 -24 -54 -46 195 -22 49 163 6 -27 135 109 -133 74 94 -28 -34 49 59 101 -145 -66
7666f6J64j89nJ64J00j43m2l8J96m3j59M7J28j45R5Q7o9o2j09mj8J33l8r4K46
$$ -66 98 -91 -96 68 168 25 -17 -55 141 98 -61 -14 114 -31 64 151 82 20 -89 -93 -111 22 -16 -110 136
7691A36j50Q1j62K59Pj14j99K24j52oM1J13n2Jj5N7K9n5%j79J62K0r8O3Q3o6P5
$$ 136 -14 67 -95 164 171 57 -142 82 -70 -76 -35 78 26 27 12 69 98 43 43 -136 26 46 -52 11 94 28 103
7718A03j14K12k59J52k14K06j33J68j85M9%PK30j50k54K55Kk8k9J0j24J18j2r6
$$ 103 -11 201 -58 94 -120 86 -47 121 -64 -15 -15 -8 222 72 -182 73 75 47 18 28 -96 22 10 -86
7742h6L8q7k9J24J72j85J45k83J95O5j47J29j54o9O5K49j56j02K09k9j16J3l3
$$ -86 -48 -135 -164 -40 132 -53 92 -191 4 69 -78 51 -103 -172 -107 142 -14 -116 93 64 -52 -39 -72
7765g2M1Q2p2Q0j19k0J80j33J69o9k28R9N6k7J18k27N06l38j10K06j42j37K88
$$ -72 -31 51 -21 59 -60 -80 100 -33 136 67 -161 -62 -6 -33 85 -142 364 26 -84 122 -20 -157 131
7788A31j0k26j3K40L6k41P9m6M7j17K09m2j65o4K07J00j87L6P4J5j24J88o8K0
$$ 131 121 -105 -118 122 158 -83 -4 -50 -3 -120 89 47 -118 -182 25 125 -62 -26 48 63 -61 127 59 79
7812G9NL8j03OM6jj95J63j8n0L5q0J64j04j76J67J20k0k6R7p8J42k56J01k36J60
$$ 79 84 122 19 25 71 70 -125 38 20 -30 5 -75 89 -15 -191 -24 96 76 50 147 69 211 -45 56 -180 -20
7838b0j04l2J82K1K0j62m9J20J00l1j3K6r9j3N0kR6m0K3j66J92n4j4Q9R7k03O0
$$ -20 -124 -156 26 47 67 -95 -144 -24 76 45 32 58 -41 -54 -4 -6 90 50 73 -93 99 45 31 120 217 14 74
7865G4n9J03j17M9J21l18K14Qp1J24m0l1m1r5K75o4l23J71Q7LP8k11J87l15J68
$$ 74 15 118 1 50 171 -147 67 75 4 128 88 57 16 -79 196 132 -191 -20 67 70 148 -63 124 -191 -23
7890b3L8J19o7J35j99j75J78r0KJ54l9m2R6o6k2j35K47j88R0J39j00r7K73j70
$$ -23 15 134 67 202 3 -172 6 -84 -82 72 33 -9 87 21 -1 -136 111 -77 13 152 52 -45 228 58
7914E8j03J84k34P3Q1j52R1r2N5lK45j32k31K76l03K02r4R0Mj8J30p3k6J5l9n3
$$ 58 -45 139 -95 -22 59 -93 -2 -94 -39 -42 203 71 -160 116 -187 15 -79 11 15 -3 127 54 28 43 4 -49
7940d9j87J46Q0L1N6j11l1J98j49O1m9j09J84k09M3J95Lr8j34P4o8R1j5J92L8
$$ -49 -236 -90 -10 21 77 -34 -65 133 -16 45 -4 -113 71 -138 -95 100 103 5 -129 -55 -123 -32 -47 145 183
7965A83k91O5j88J34k9J34k16J82j25M25l28Q2j14J23j76K4J69o6J18j04N4o4
$$ 183 -108 -43 -231 -97 -126 8 -208 -26 -151 274 -54 28 -86 37 -139 -115 54 -12 106 2 56 -8
7987hp0J84ML8j28o2m4M4P1j07J46M1j5M8o7j6O3j21J8J35j69O5n7o5n9Q2N5l1
$$ -8 -78 106 110 148 20 -42 -86 -42 29 -78 68 109 94 142 75 59 122 1 19 154 -15 50 -7 -72 -131 -49 6 -25
8015b5KQ7L6m3l5r8MM8q7q5R1J31k5K2o1q6J53l9J42j25K3k3J29j74LoJ21k7j84
$$ -25 -23 64 100 57 22 -76 -72 -24 -111 -196 -105 26 1 23 -38 -124 29 -10 132 7 30 7 136 -38 -35 -41 80 53 -131
8044a31l3J03J91P4j22N1k70O7o8K27n5J7R9o5K4j60J07N7q8l0M4K9j02J3P5P4
$$ -131 -164 -61 130 204 82 133 -137 -70 -138 89 34 51 150 85 109 -51 56 113 25 -5 39 68 -34 -21 54 128
8070A28q2j8p1k07K98j9j23K12j27k9P0j27R4Kr3N2K8j99K98l9j13M9l3j4K96
$$ 128 46 28 -43 -250 48 29 -94 118 -9 -38 32 -95 -1 1 -92 -40 -12 -211 87 48 -65 -16 -49 -63 233
8095B33l47P5J84k03M5j73K56j69J60j87J65P1k43Q0Qo2M3J20n5L3m1J62j75k6
$$ 233 -114 -39 145 -58 -13 -186 70 -99 61 -126 39 110 -133 -53 -45 -107 -64 56 1 34 -7 155 -20 -46
8119d6J82j33n9N5R6L1L8j13n8P9mJ11k05K09k86l1M6K4Q2n3J80j26om9M5j05
$$ -46 136 3 -56 -1 95 126 164 51 -7 72 68 179 -26 183 -103 -134 -88 -64 18 -35 145 19 13 -36 9 -96
8145i6J10j72K42M6o3m4J8k66L15J29j75J56m63K15K19n0k81K93k91R8M1j90K06
$$ -96 14 -158 84 130 67 23 41 -225 90 219 44 200 -263 -48 171 121 -160 133 -158 -60 -19 -209 -3
8168cO5rj6J0l3J1N1j56l5J71q8N1J2nR3j1k34J85L4J02k25j16J96
$$ -3 62 53 37 47 14 25 76 -80 -115 56 -32 19 31 26 119 108 -126 59 93 195 -30 -146 50
8191E0
$$ Imaginary data points
##PAGE= N=2
##DATA TABLE= (X++(I..I)), XYDATA
0@%%%%%%%%%%%%Qj6J6j6J6k4L2l5M3n6O4p2Q8j04J20j36J55j79K03k30K62k96
$$ 0 0 0 0 0 0 0 0 0 0 0 0 0 8 -8 8 -8 8 -16 16 -19 24 -32 32 -40 48 -56 64 -72 83 -96 107 -123 139 -157
34a57L36l80M26m75N28n88O57p30Q07q94R89j090J203j327J460j609J773j952
$$ -157 179 -201 225 -250 278 -310 347 -383 424 -470 519 -571 632 -695 765 -844 929 -1023
52a023K152k378K629k913L238l613M051m566N191n966O950q248J0041j2686J6976
$$ -1023 1129 -1249 1380 -1533 1705 -1908 2143 -2423 2768 -3198 3752 -4496 5545 -7141 9835
67I835k5033M5053j78479k62677N74974J52025m63657j05145L55391N6416j88795
$$ 9835 -15198 29855 -148624 -411301 163673 315698 -147959 -253104 102287 158703 -30092
78c0092n1772M2748M4402J00826o7572k08230P3436K88288p9737l20813Q0477
$$ -30092 -81864 -39116 5286 106112 38540 -169690 -96254 192034 112297 -208516 -128039
89a28039L30993q4640k98994P3951K40888n2878j62632J2247Q4422L3543q639
$$ -128039 202954 118314 -180680 -106729 134159 81281 -81351 -69104 15318 48861 40222
100D0222q4493m6671J34805P7217j71639p2150J81321M3937j61350n173J13483
$$ 40222 -44271 -90942 43863 121080 -50559 -122709 58612 102549 -58801 -63974 49509
111D9509l3536m2818O2201m1102o9957J22298N9634j77228l6093K00858Q838k01092
$$ 49509 15973 -26845 35356 -5746 -75703 46595 106229 -70999 -107092 93766 102604 -98488
123i8488J7236J79985m3097j36953O5841P2611p8360P929P9948r0849o6802J63467
$$ -98488 -81252 98733 55636 -81317 -15476 57135 -21225 -13296 66652 -24197 -90999 72468
135G2468L4919k16567P185K37822m7721k25916P4872J89490q3191j36333P4395
$$ 72468 107387 -109180 -101995 135827 88106 -137810 -62938 126552 43361 -92972 -18577
146a8577P4758n1218j6537J2565l0612K9031O1009o5200p5558R1843P8704j08484
$$ -18577 56181 4963 -11574 991 -29621 -590 60419 -4781 -80339 11504 90208 -18276
158a8276o9845J11878M9954j01500k7709P6423O008m3738J0534Q304j7059K7529
$$ -18276 -88121 23757 73711 -27789 -55498 20925 26933 -16805 -6271 2033 -15026 12503
170A2503J2844n8453M087P4498k9525p3229N4949N3271p4134k2260Q4495j1640
$$ 12503 25347 -33106 -29019 45479 15954 -57275 -2326 50945 -23189 -45449 39046 27406
182B7406q1525M3735O7354o6785m6892P6976K4109p4430l225O1412j5707l6531
$$ 27406 -54119 -10384 56970 -9815 -56707 20269 44378 -30052 -33277 28135 12428 -24103
194b4103L1945M647l8945L1391L6800o5325k7769R2672J3022j10021N226J14283
$$ -24103 7842 12489 -26456 4935 41735 -23590 -51359 41313 54335 -55686 -50460 63823
206F3823k1381j02038L1836P8815l0274n0657J8779K1508n32L246k1478k1913
$$ 63823 42442 -59596 -27760 51055 20781 -29876 -11097 10411 9879 13125 -8353 -30266
218c0266M4222L3218o1574l7133P2454L6924p6087l3975P2904K5870o3483j5869
$$ -30266 13956 47174 -14400 -51533 20921 57845 -18242 -52217 20687 46557 -16926 -32795
230c2795M6216O772k2137j492l984J391K8242o316m8417J5563N8700k8743n7929
$$ -32795 13421 20193 -1944 -3436 -7420 -6029 22213 15897 -32520 -16957 41743 13000 -44929
243d4929L8331M7625m1418l1310L7481J3687k8621K359J5272j5779p05K2482j3383
$$ -44929 -6598 41027 -391 -31701 5780 19467 -9154 -6795 8477 -7302 -8007 14475 1092
256A092k3550K2828K1827k8079j7631L1585J0216l2012K72K6345j1827j5915J9901
$$ 1092 -22458 370 22197 -5882 -23513 8072 18288 -13724 -13452 12893 1066 -14849 5052
269E052L674k5307J0514K7123k4178k2031L4342J1050l5795J1K9571p679j8943
$$ 5052 8726 -16581 -6067 21056 -3122 -25153 9189 20239 -15556 -15545 14026 6347 -12596
282a2596J1152P313j0946N718P814j6513p02K2820n922k5686J0090K7503j3845
$$ -12596 -1444 5869 -5077 641 8455 -8058 -8760 14060 8138 -17548 -7458 20045 6200
295F200k7250J8503K4272k0872j6746J9636Q825j5081j496Q069n627J678J0221
$$ 6200 -21050 -2547 21725 853 -15893 3743 12568 -2513 -4009 4060 -1567 111 10332
308A0332j3997r032K5066L538l0288L598L0051q992k6853J1957K0845j3624j3030
$$ 10332 -3665 -12697 12369 15907 -14381 -10783 19268 10276 -16577 -4620 16225 2601 -10429
321a0429J1150N517n265q67o8j707L547M839q313q371J3672Q369j8551o294K0782
$$ -10429 721 6238 973 106 38 -1669 1878 6717 -1596 -9967 3705 12074 -6477 -12771 8011
336H011L439k1190L01K0045n846j5164R468O175r397K290M846p673P13R928n352
$$ 8011 11450 -9740 -9439 10606 4760 -10404 -936 5239 -4158 -1868 2978 -4695 -3982 5946 594
351E94j0231R943Q307j3043m267J2368P96j0087L28Q217r57p012L101N331n001
$$ 594 -9637 306 8613 -4430 -8697 3671 4467 -5620 -5292 2925 1968 -5044 -1943 3388 -1613
366a613j825N619j915m752M580L529p445l26R412m166p853Q544L980r808R87Q169
$$ -1613 -3438 2181 266 -4486 94 3623 -3822 -4148 5264 1098 -6755 1789 5769 -4039 -3052 5117
382E117m084n571O214K459o845J058N808l445k752L868R65k800p01K320Q86k736
$$ 5117 1033 -4538 1676 4135 -2710 -1652 4156 711 -2041 1827 2792 -8 -709 1611 2497 -239
398b39J53K345j390j211K865k75m141K720M641n944l950Q728Q52r346K138O951
$$ -239 -86 2259 869 -342 2523 2248 -1893 827 5468 -476 -4426 4302 5154 -4192 -2054 4897
414D897l084l908K060J285j96M96k100k261M287J775n321j607M963J590l381k912
$$ 4897 1813 -2095 -35 1250 1054 1550 -550 -2811 1476 3251 -2070 -3677 1286 2876 -505 -3417
430c417K225M455k020n277J363M813m38m584q23L645K351k000n006J778O904k570
$$ -3417 -1192 3263 1243 -4034 -2671 2142 1704 -2880 -3703 -58 2293 293 -4713 -2935 3969 1399
446A399p744L955O635m906l938M045J264k302J319M43k932J701L696l296l235
$$ 1399 -6345 -2390 4245 -661 -4599 -554 710 -1592 -273 170 -2762 -1061 2635 -661 -3896
461c896L379L249k178m528K282O095l187o122M876M997n626l033O258J06n945
$$ -3896 -517 2732 554 -3974 -1692 4403 1216 -4906 -30 4967 -659 -3692 2566 2672 -3273
476c273L152M107m875j430N170Q3m200k62L949J518m578k489N754K016n976j521
$$ -3273 -121 3986 -889 -2319 2851 2934 -1266 -1528 2421 3939 -639 -3128 2626 4642 -1334 -2855
492b855O655k41p071L549N295o134k043P168j135p589K782P679l541q006M154
$$ -2855 3800 3559 -3512 37 5332 -802 -2845 4323 3188 -4401 -1619 6060 2519 -5487 -1333
507a333P949m641q090M750Q462o196q050P905N486r972n86R901m392r033Q765
$$ -1333 6616 1975 -6115 -1365 7097 901 -7149 756 6242 -3730 -4316 5585 1193 -7840 925
522I25O871j1969m752J3861K165j4296j01J2947m39j2056O25J1830k297r850M801
$$ 925 7796 -4173 -8925 4936 7101 -7195 -7296 5651 5212 -6844 -6219 5611 3314 -6536 -1735
537a735N698o999j495R121k888j0579P276J0967j1439r687J3788R205j3447j0444
$$ -1735 3963 -3036 -4531 4590 1702 -8877 -1601 9366 -2073 -11760 2028 11233 -2214 -12658
551a2658J2873J1612j2159j1331J1763R627j0293p644Q821N115o618l02L470n295
$$ -12658 215 11827 -332 -11663 100 9727 -566 -8210 611 5726 -892 -1194 2276 -3019
565c019J284R460n135j2543P749J5917r691j8849J1312K0972j2279k1368J2135
$$ -3019 -1735 7725 2590 -9953 -2204 13713 4022 -14827 -3515 17457 5178 -16190 -4055
578d055K1555j2042k0670J2552J6676j2243j0016J0282K521o937L987L404j0471
$$ -4055 17500 5458 -15212 -2660 14016 1773 -8243 2039 4560 -2377 1610 5014 -5457
591e457J166J5796o404j9182R336K0584r869k0996R294K0998r934j9229R920J5898
$$ -5457 -4291 11505 5101 -14081 -4745 15839 5970 -15026 -5732 15266 5332 -13897 -3977 11921
605A1921q910j1957O606P407n493j749M453m069k916P600J996j0203k296J2790
$$ 11921 3011 -8946 -2340 5067 -426 -2175 2278 -1791 -4707 2893 4889 -5314 -7610 5180
619E180L167j5088m152J6546M143j6007m232J4643L756j2767k050R636J63n761
$$ 5180 8347 -6741 -10893 5653 9796 -6211 -10443 4200 7956 -4811 -6861 2775 2938 -2823
633b823J864J929m141J191P424m286j0943Q257J3608j1276j5586J3423J6277j4051
$$ -2823 -959 970 -3171 -1980 5444 1158 -9785 -1528 12080 804 -14782 -1359 14918 867
647H67j5982J5487J3174j5237q533J2541M267p754J29K126l582K134O618n869
$$ 867 -15115 372 13546 -1691 -10224 2317 6584 -1170 -1041 1085 -2497 -363 6255 386
661C86q079Q638Q760q924j0832R452J2665r231j3627Q981J2225p962r792O280
$$ 386 -7693 945 9705 781 -10051 -599 12066 2835 -10792 -1811 10414 2452 -7340 -1060
675a060P109m051m320J596J160J236J070l191k412L048L744j812n563k11P790
$$ -1060 6049 1998 -2322 -726 434 1670 2740 -451 -2863 185 3929 2117 -3446 -3657 4133
690D133J482r185k708R698L391j0102l112Q952K555o837k004L156J650L30r08
$$ 4133 5615 -3570 -6278 3420 6811 -3291 -6403 2549 5104 -1733 -3737 -581 1069 1399 491
705D91k850r70N138K362o976l981Q617N917j0432p469J1439Q002j1248o958R509
$$ 491 -2359 -3329 1809 4171 -2805 -6786 1831 7748 -2684 -10153 1286 9288 -1960 -8918 591
720E91N068o117l941J973L874K181m323m770L503P309k804q269J784Q227M43q208
$$ 591 5659 -458 -4399 -2426 1448 3629 -694 -5464 -1961 5348 2544 -5725 -3941 4286 4729 -3479
736c479k756Q351M761q142n372P095N905n517n615L352N439r79m978j423M837
$$ -3479 -6235 2116 6877 -1265 -6637 458 6363 846 -4769 -1417 4022 3043 -1935 -3358 1479
751A479L389n262l388M840L083l535k558J501K197R03k262k701K111M132k874
$$ 1479 4868 -394 -3782 1058 4141 606 -1952 -451 1746 2649 387 -2314 -203 3929 1055
766A055l954L150L183k722k234J342J677n0j602l40R77K01m68p9m28N57L69n7
$$ 1055 -2899 251 3434 712 -1522 -180 1497 1447 -155 -495 482 683 215 136 -292 265 634 577
784E77j726L00K085r12j771J213N57m40j26k09j48N63L11r08q14J704K78j960
$$ 577 -1149 -849 1236 324 -1447 -234 323 -117 -243 -452 -600 -37 274 -634 -1448 256 534 -1426
802a426J84J160K4k91r97L46J429p03j089P24R71l27j252N43Q28j64k03q84O51
$$ -1426 -1242 -82 -58 -349 -1346 -1000 429 -274 -1363 -639 332 5 -1247 -704 124 -40 -243 -1127 -476
821d76J560j491j273K017Q15j776o42J280Q75p67p96J97J247O05k010p53K630
$$ -476 1084 -407 -1680 337 1152 -624 -1266 14 889 122 -674 -477 770 1375 -635 -1388 1242
838A242M22k214l94J533J003j150j355R35J581l99j952J46K585n07k323L29J604
$$ 1242 1664 -550 -944 589 1592 442 -913 22 1603 1204 -748 -602 1983 1476 -847 -518 1086
855A086K59p77j382O96J963r04k161P96K112q20j822L53J604l25o48p15M24J560
$$ 1086 1345 568 -814 -118 1845 941 -1220 -424 1688 868 -954 -601 1003 678 30 -685 -261 1299
873A299j158j336J277Q46r40p05J98P69o9n37n06N70R79j410n66J553R3j433L97
$$ 1299 141 -1195 82 928 -12 -717 -519 250 181 -356 -862 -292 687 -723 -1289 264 357 -1076 -679
892f79O46m48O0k1l53M24M81n32n73J111J49j292M62N17j20O8l05R5K59j17l13
$$ -679 -33 -481 -421 -442 -795 -371 110 -422 -995 116 265 -1027 -565 -48 -168 -100 -405 -310 -51 -168 -481
913d81J4L32J88k78K52k75O6J064j092o19J595p6j228O40M81n83J53M84o98k02
$$ -481 -467 -135 53 -225 27 -248 -182 882 -210 -829 766 690 -538 102 583 0 153 637 -61 -263
933b63J529n11j573R65J380r13j134N28J068M4j302k79J138N86q44n10J75Q55
$$ -263 1266 755 -818 147 1527 614 -520 8 1076 1120 -182 -461 677 1263 419 -91 84 939
951I39M36j206j322J576J777k257j706K545J149k294o74J297J14j33Nj126j58
$$ 939 1375 169 -1153 423 2200 -57 -1763 782 1931 -363 -1037 260 374 241 246 -880 -1038
968a038K378j84l194P79L011o47l147L86K798j96k485J59J891j52j032R8j17q3
$$ -1038 1340 1156 -2038 -1259 1752 1105 -2042 -1656 1142 946 -1539 -1380 511 359 -673 -575 -692 -775
986g75J456j06k635L33L699q68m146J521L619j350k741P03K164k1j158q32L12
$$ -775 681 575 -2060 -1727 1972 1104 -3042 -1521 2098 748 -1993 -1290 874 853 -305 -1137 -825
1003h25J790Qk236k72K390M42j666p40R01J347j5j652p76J389K466k104k958K361
$$ -825 965 973 -1263 -1535 855 1297 -369 -1109 -208 1139 1124 -528 -1304 85 2551 447 -2511 -150
1021a50L370j997m302K104M713k258m468K901L057k749j359K219p76r95K436j69
$$ -150 3220 1223 -3079 -975 3738 1480 -2988 -87 2970 221 -1138 1081 305 -690 1746 1577
1037A577m132J340N756k944o014L754N692m260n254M189M747m334l303L779J525
$$ 1577 -2555 -1215 4541 1597 -4417 -663 5029 769 -4485 -296 4451 117 -3186 593 2118
1052B118k899J39J668j594p78L165o26m089J749M012k498l624K076L751j576l751
$$ 2118 -781 -642 1026 -568 -1346 1819 1193 -2896 -1147 2865 367 -3257 -1181 2570 994 -2757
1068b757J113L250k25k926q34L103R48l143l01K249r7j275M30N25j231L28K448
$$ -2757 -1644 1606 1381 -1545 -2379 724 1672 -1471 -1772 477 380 -895 -465 60 -1171 -843 1605
1085A605j727l121K904L875m218l980N316M403o622l629P543J814p123J68O074
$$ 1605 -122 -3243 -339 3536 -682 -4662 654 5057 -1565 -5194 2349 4163 -2960 -2792 3282
1100C282j688m749L525K722n166J53N770k700n523M568M954n394m720O348L958
$$ 3282 1594 -3155 370 3092 -2074 -1921 3849 1149 -4374 194 5148 -246 -4966 1382 5340
1115E340p095k306O952M19n668R53M091j655k699K510P54k750J186K223k106j907
$$ 5340 -1755 -4061 2891 3310 -2358 -1405 2686 1031 -1668 842 1596 -1154 32 2255 149 -1758
1131a758K102J599j450j944J184K210r72k905M47L731k27m334J009L652j644k870
$$ -1758 344 1943 493 -1451 -267 1943 971 -1934 -1487 2244 2017 -2317 -1308 2344 700 -2170
1147b170J715K538k409j531K575M16k974Q72L619k666l639L984L527o060k222
$$ -2170 -455 2083 -326 -1857 718 1134 -1840 -968 2651 -15 -3654 330 3857 -2203 -4425
1162d425P291O32q002J814O780l318n268M884L008n765l88N501k163m217L943
$$ -4425 2866 3498 -4504 -2690 4090 772 -4496 388 3396 -2369 -2757 2744 581 -3636 307
1177C07K628m497j450M968J67m846R99M465j685l526J864K530k012j269K097J95
$$ 307 2935 -1562 -3012 1956 2123 -2723 -1724 2741 1056 -2470 -606 1924 -88 -1357 740 935
1193I35k026J044J141j535L44J363j118j110J630J85j234O83O89j497M59J749
$$ 935 -1091 -47 1094 -441 -97 1266 148 -962 668 853 -381 302 991 -506 -47 1702
1209A702k050o70K882l42l107J199K838k167k340L022J430l395k31L258j184k986
$$ 1702 -348 -1018 1864 1522 -1585 -386 2452 285 -2055 967 2397 -998 -1229 2029 845 -2141
1225b141K359K438l389j452M006j07m257J727L754l144k565L738J047m166Q56
$$ -2141 218 2656 -733 -2185 1821 1714 -2543 -816 2938 -206 -2771 967 2014 -2152 -1296
1240a296L891k450k810L191J123l410M79L039j442k445K076J343k503k60K584
$$ -1296 2595 145 -2665 526 1649 -1761 -1282 1757 315 -2130 -54 1289 -1214 -1474 1110
1255A110p31k167J670J189j974m46K289n66k075J570J451k408k29K723r18k262
$$ 1110 379 -1788 -118 1071 -903 -1349 940 374 -1701 -131 1320 -1088 -1317 1406 488 -1774
1271a774J806J375k304j43K181n89k036J794J061k358o3K686j150k168J945J434
$$ -1774 32 1407 -897 -1040 1141 552 -1484 310 1371 -987 -1050 1636 486 -1682 263 1697
1287A697k530k72K855j011k199J725J437k121p43K502k02k578J770J591k493n64
$$ 1697 -833 -1105 1750 739 -1460 265 1702 -419 -1162 1340 1138 -1440 330 1921 -572 -1136
1303a136K930o32k642J562J907k161j134K663j93k457J181J779j847j151K197
$$ -1136 1794 1162 -1480 82 1989 -172 -1306 1357 1164 -1293 -112 1667 -180 -1331 866
1318H66K21k183J85K483j499j805K434O57k522J77K415j162k083K177J055k719
$$ 866 1087 -1096 -911 1572 73 -1732 702 1359 -1163 -986 1429 267 -1816 361 1416 -1303
1334a303J53K627j599j766K201P21k118J2K021r96j509J850O08k078N69J557j170
$$ -1303 -1150 1477 -122 -1888 313 1034 -1084 -1072 949 -47 -1556 294 902 -1176 -607 950 -220
1351b20j134J559Q18j956j52J832n24j627J380J257j897k95J804n44j565J454
$$ -220 -1354 205 1023 -933 -1085 747 223 -1404 -24 1233 -664 -959 845 301 -1264 190
1367A90J224k345m3K337p82j921J532J280j896o18K361n63j892J422R42j689k70
$$ 190 1414 -931 -974 1363 581 -1340 192 1472 -424 -1042 1319 756 -1136 286 1228 -461 -731
1384g31J895l63j714J027J387j604r96K052nj800O21J432j018j009J631L18j809
$$ -731 1164 801 -913 114 1501 -103 -1099 953 948 -852 -231 1201 183 -826 805 1123 -686
1401f86M94J587j267r52J463L70k064O82J588j209r06J516l3j427O41R90q48p36
$$ -686 -192 1395 128 -824 639 1009 -1055 -373 1215 6 -900 616 583 -844 -203 787 -61 -797
1419g97Q35O27j361J00J194o37p78P82L89r60K06O10k47q85R18M79j362K06J294
$$ -797 38 665 -696 -596 598 -39 -817 -35 354 -606 -400 210 -37 -922 -4 475 -887 -681 613
1438F13r50p62J174L87j251J53J331p33j067J185N32j307K96J031n64p84Q78O24
$$ 613 -337 -1099 75 462 -789 -636 695 -38 -1105 80 612 -695 -399 632 68 -716 162 786
1456G86j222k26J413m38q42M66Q91q29n46J158J57j316O30P68p12o78J191N2r10
$$ 786 -436 -662 751 313 -529 -63 828 -1 -547 611 768 -548 82 850 138 -540 651 703 -207
1475b07M45L73n23l17P05r1o89J81P32n16j30M76Mm18O7J63j27k85M42j90j26
$$ -207 238 611 88 -229 476 385 -304 -123 609 93 -37 439 443 25 92 255 128 -157 285 95 -31
1496c1K2L69l41k34N19J03q25K14O44m65m15O10K07p90K41M50m79q6L07P0m03
$$ -31 -9 360 19 -215 304 407 -418 -204 440 -25 -440 170 377 -413 -172 278 -201 -287 20 90 -313
1517c13o9N64l00j72mL47j84l18P2L22j18k11K18k9J00m4P4m2j29K09Qj69P1j8
$$ -313 -382 182 -118 -290 -294 53 -131 -449 -377 -55 -173 -384 -166 -195 -95 -139 -65 -107 -236 -27 -19 -188 -117 -135
1541a35J27J8j72K6K97J7m98J62O69j92p00O18L18n65j02L94j67k7p6L15O0m87
$$ -135 -8 10 -162 -136 161 178 -320 -158 511 319 -381 237 555 -10 -112 282 115 88 12 327 387 -100
1563a00J49M44j67m72L46N72q38k47R92L5j272M02P48j75o40K56P04o66m24O26
$$ -100 49 493 326 -146 200 772 -66 -313 679 714 -558 -156 592 417 -223 33 737 71 -353 273
1583B73K42p57k12P27K07r54K19J037p12j053J198O66j223n76J315J82j293K25
$$ 273 515 -242 -454 273 480 -474 -255 782 70 -983 215 881 -342 -918 397 579 -714 -489
1601d89R00l21r30P23M52l94o50O77K59n87l19R79o4j047Q6J280n02j174J094
$$ -489 411 90 -840 -117 335 -59 -709 -32 227 -360 -679 300 236 -811 -725 555 53 -1121 -27
1620b7Q16j214n57R76M51p86k76P34K68j082J69J001k65p31L76Q72q98q04J471
$$ -27 789 -425 -982 -6 445 -341 -617 117 385 -697 -528 473 208 -523 -147 725 -173 -977 494
1639D94N16j659N7J611k72j500M95J292o19j376J051R54j315n38J496L07j581
$$ 494 1010 -649 -592 1019 747 -753 -258 1034 415 -961 90 1044 -271 -809 687 994 -587
1656e87J00J710o88j414J065J043j385p92J580N66j847K04J474o19j136Q21O36
$$ -587 -487 1223 535 -879 186 1229 -156 -948 632 1198 -649 -445 1029 410 -726 95 731
1673G31n79q02Q65N06j068rO19J46r00O9J026k91j078O72O85q77n46J053L39j040
$$ 731 152 -650 215 721 -347 -356 263 409 -491 -422 604 313 -765 -93 592 -285 -831 222 561 -479
1693d79k09Q69L66r74j36P98o0r80M12R86n29p34P13M48r06m90J129J60j258J73
$$ -479 -688 181 547 -427 -563 235 175 -805 -393 593 64 -670 43 491 -415 -905 224 384 -874 -701
1713g01J635o89j369J291O93j125p23J667K8j548L56J286o76r17J145N52j407
$$ -701 934 245 -1124 167 860 -265 -988 679 707 -841 -485 801 125 -792 353 905 -502
1730e02o1J238k96r52N41P08o25n57O81K60m69j01M42K30p42J42N75j76m45J95
$$ -502 -563 675 379 -573 -32 676 51 -506 175 435 -34 -135 307 537 -205 -63 512 336 -109 86
1750H6K73n27J94K34K4r9M7q0k8K04m18n8N52k71o10O93Q3n01j73Q34j28q41M94
$$ 86 359 -168 26 260 284 185 232 152 124 328 -90 -148 404 133 -477 216 299 -202 -375 459 331 -510 -16
1773a6M72n69n05Q59J57p45q7P07l46o16O48M59q05j58Q40j23q38M73Q54q23n74
$$ -16 456 -113 -618 241 398 -347 -434 273 -73 -689 -41 418 -387 -545 295 172 -666 -193 661 -162 -736
1794g36R21k5q48M11Q98o53n55P66r9p04K26N09j83m47O82K7l71p1L97r6k05J14
$$ -736 185 160 -688 -277 621 -32 -587 179 80 -624 -398 111 -72 -519 163 190 -181 -252 145 49 -156 -42
1816d2L13n15m1N24j7l83J16M20k38k22N62j95m63L96K27n84J78N69l97k72L28
$$ -42 271 -244 -285 239 222 -161 -45 375 137 -85 477 282 -181 215 442 -142 36 605 208 -64 264
1837B64J87p73K29P79n78m72Q09j74o18N40K91m96j64L59J85n82N3M22k1n43N33
$$ 264 451 -322 -93 686 108 -364 445 271 -347 193 484 -12 -176 183 368 -214 -161 261 240 -303 230
1858B30k5j53m04O06O3p65L50L80k61l98N75j11m64J03O38n25l97Q47j97o02K99
$$ 230 205 52 -352 254 317 -448 -98 282 21 -377 198 87 -377 -274 364 -161 -558 289 92 -510 -211
1879b11M40m74p4M36N7n54J24L20l93L9M72j9n12k7M83j72m33P79j56m99%P29
$$ -211 229 -245 -319 117 174 -380 -256 64 -329 -290 182 163 -349 -376 107 -65 -498 281 125 -374 -374 355
1901C55n11r3M26O6n81K02N28m94k52O57k21j85L6L92k93k21N27K08q34K98K24
$$ 355 -156 -249 177 243 -338 -136 392 -102 -354 303 82 -103 -67 325 32 -189 338 546 -288 10 234
1922B34k37k54M50K47n41P6M24j68n23O07J7m68L1N79m19l70O09J10l75j55N04
$$ 234 -3 -257 193 440 -101 -25 399 231 -292 315 332 -136 -105 474 55 -315 294 404 29 -126 378
1943C78l60k59K80K68k52j82K37O6m99M13L27n06l1K94J5n30K45L92l87l29N48
$$ 378 18 -241 39 307 55 -127 110 176 -323 90 417 -89 -120 174 189 -341 -96 296 -91 -420 128
1964A28K0n93K41M71m02l53N30J28m15J23J15j69o6M09k04q0o2L52l60p4N05j98
$$ 128 148 -445 -204 267 -135 -488 42 170 -245 -122 -7 -176 -242 167 -37 -117 -179 173 -187 -261 244 46
1986D6k49P7R3j13m3M60k51k78n7N44l58r2O26j21n57J50O36o18j50M92P3m88
$$ 46 -203 -126 -33 -146 -189 271 20 -258 -315 229 -129 -221 405 284 -273 -123 513 -105 -255 237 310 -178
2008a78J86N43l47n36M59K27n18J98K02nn27K86M26k75k98M20j39k55K84K48l36
$$ -178 8 551 204 -332 127 354 -164 34 236 231 -296 -10 416 141 -157 263 124 -131 153 401 65
2029F5j42K03J33l29J63Q7l29M8L09o0k93J77R2j74k13M61l96j53M96L9n41L12
$$ 65 -77 126 259 -70 93 180 -149 -101 208 148 -145 32 124 -50 -263 198 -198 -351 145 184 -357 -45
2051d5L69l91l24L30R3l50J79L19j50l82K07J82j13m63O09Q2n67K65M05k25l57
$$ -45 324 -67 -391 -61 32 -318 -139 180 30 -352 -145 37 -76 -539 70 152 -415 -150 255 30 -327
2072c27L85J32k48l83O29j32k59J68Q7j79j9M21l58n2K46j32j4O9K48j69k48L85
$$ -327 58 190 -58 -441 188 56 -203 -35 52 -127 -146 275 -83 -135 111 -21 -35 34 282 113 -135 250
2094B50n5l10K97J07j55j87L62j87l58M04K78n82k2L53J59l96j37Q01o42k42L10
$$ 250 195 -115 182 289 134 -53 309 122 -236 168 446 -136 -158 195 354 -42 -179 622 -20 -262 48
2115D8N05o35N1M89k12o31J94O34k59m11N18P6n83m5N08j58k74J56L59l61l35
$$ 48 553 -82 -31 458 246 -385 -191 443 184 -227 291 367 -216 -261 247 89 -185 -29 330 -31 -366
2136c66L95p2L8k70L44Pl62OL40j07k77O8L80k36k91K34K24k79k6R7K10j64k30
$$ -366 29 -43 -5 -275 69 76 -286 -280 60 -47 -324 -256 124 -112 -403 -169 55 -224 -250 -153 57 -107 -337
2159c37N31j45l02j08M18O2l74J62K38k45m04N11K74m58J34K19o9k74q8N72r8
$$ -337 194 49 -253 -361 57 119 -255 -93 145 -100 -504 7 281 -177 -43 176 107 -167 -255 317 219
2180B19n01L24K04l41k38M96K52o48J78K72j1l99K62L95l05j96J83K43l30k28
$$ 219 -282 42 246 -95 -333 163 415 -233 -55 217 206 -193 69 464 159 -37 146 389 59 -169
2200a69M72l9n22J41K92%m11K23M17m57j12L68K81o57R7L75k47l54L12M92o46
$$ -169 303 264 -258 -117 175 175 -236 -13 404 -53 -165 203 484 -173 -76 299 52 -302 10 502 -144
2221a44j50N31K6m64J91J37j67j49K09K9j81m8J67O3k38L8K60J03n26J69J60p3
$$ -144 -294 237 263 -201 -10 127 -40 -189 20 49 -132 -180 -13 50 -188 -150 110 213 -313 -144 16 -57
2243e7k49K60J94k90j75M32n4j37j0J85q7r2j39J47K50m63K7M72K1n03J92M16
$$ -57 -306 -46 148 -142 -317 115 61 -76 -86 99 12 -80 -219 -72 178 -285 -258 214 235 -268 -76 340
2265C40l87m85O10P1o08K83N95r3o62M71L03n82O2M15j45k89l8N81l27l65M55
$$ 340 -47 -532 78 149 -459 -176 419 326 -336 135 438 -144 -82 333 188 -101 -139 442 115 -250 205
2286B05N4j26m05N75m8m19K83K43k29n7q3K03l11K16n4j70o2K22k5r3J50J13k58
$$ 205 259 133 -272 303 255 -164 119 362 133 76 -7 196 -115 101 47 -123 -185 37 12 -81 69 182 -76
2309g6J03j04j52K06J10%o4j17M4j63J10K24k1k08P7J46j85k94L29L20n91p9N94
$$ -76 27 -77 -229 -23 87 87 23 -94 -50 -213 -103 121 100 -108 -31 115 -70 -364 -35 285 -306 -385 209
2332B09k21m38N63Kl60J1L99l27k53N05J51m41j77O44k94l10L56R6k8m31L78Q5
$$ 209 -12 -450 113 115 -245 -234 165 -162 -415 90 241 -200 -377 267 -27 -337 19 115 87 -344 34 119
2354A19k42J2K90k12j02K29j04j97N8L87j76n9J80m4l11L04J47k30j47K44j10
$$ 119 -123 -111 179 -33 -135 94 -10 -207 -149 238 62 3 183 139 -172 132 279 49 -98 146 36
2375C6J5O8J44k62j37L31q9k75L23L35m07j65M06q1k91P4L75o00j92N75Q1n84
$$ 36 51 119 263 1 -136 195 106 -169 154 489 82 -83 323 242 -49 25 400 -200 -392 183 264 -320
2397c20L65N9k44j57M68J6l93J36K85j36m09K76L02m49K7J46K08k91j02M04k80
$$ -320 45 104 -140 -297 171 187 -206 -70 215 79 -330 -54 248 -201 -174 -28 180 -111 -213 191 -89
2418h9k36K95J30l80J88J73l15J14L28k24k00K78O6l62j04M26j82k88L79J12l68
$$ -89 -325 -30 100 -280 -92 81 -234 -120 208 -16 -216 62 128 -234 -338 88 -94 -382 -3 109 -259
2439b59K33J93l34LL24o4j52l01M82Kj33k0L69j43k66K24k08L3O4M15n41k45O46
$$ -259 -26 167 -167 -164 160 96 -56 -357 125 127 -6 -26 343 200 -66 158 -50 -17 47 462 -79 -324 322
2462C22p4m00J12M07l06k79K82K6j02O1K51k38j11K26j73j82K21J92j40j94L56
$$ 322 248 -152 -40 367 61 -218 64 90 -12 49 300 62 -49 177 4 -178 43 235 95 -99 257
2483B57j44k32J32J04kj36J20k7l71L94nk95q6L88M6l01N4K67r1l30L77Q2l76
$$ 257 113 -119 13 117 115 -21 99 72 -299 95 90 -205 -291 97 143 -158 -104 163 72 -258 119 201 -175
2506a75m8L17o7l41L39j14k20K50J66j37l16K57K59l03m1J84J1p5r1J79ml6j0
$$ -175 -223 94 27 -314 25 -89 -309 -59 107 -30 -346 -89 170 -133 -174 10 21 -54 -145 34 30 -6 -16
2529a6R1j58R9R9k88O0K35q2l10J32L33k23j48M35k42j34J56J65j14j55L45j00
$$ -16 75 -83 16 115 -173 -113 122 40 -270 -138 195 -28 -176 259 17 -117 39 204 90 -65 280 180
2551A80j81m0K26j65j07K97m7l19J80L26l61J21m6N5l42K23L53k53k76K27K93
$$ 180 -1 -41 185 20 -87 210 163 -156 24 350 -11 110 64 119 -223 0 353 100 -176 51 344
2572C44l19j9K32k57j34K68j12M8ok3Nj70J34p5j83J77K09j60k51J65K65k20k11
$$ 344 25 6 238 -19 -153 115 3 51 45 22 27 -143 -9 -84 -267 -90 119 -41 -292 -127 138 -82 -293
2595b93L37j61j41J76K24l02O2K23Nl43K48J77m26O6K68j09j84N9K64k62o4K58
$$ -293 44 -117 -258 -82 142 -160 -98 125 130 -213 35 212 -214 -148 120 11 -173 -114 150 -112 -176 82
2617H2j17j51N4J30j41K8Q6O6k79L49O3L2k85L2J74k1qj82RK33j18m8J58l7k28
$$ 82 -35 -186 -132 -2 -143 -115 -29 37 -242 107 170 202 -83 -51 123 102 94 -88 -79 154 36 -12 146 109 -119
2642a19J8K68k4j90O3K02j49j7J37j41j31m2K27M5m10J66J38J07j22J15J00j27
$$ -119 -101 167 143 -47 16 218 69 52 189 48 -83 -125 102 147 -263 -97 41 148 26 141 241 114
2664A14l66M11m0k15M7J96l20k5L21M6l47O9R0L8j04j53J89P8j11Q1q1J6j9M6
$$ 114 -252 159 119 -96 -49 147 -173 -198 123 169 -178 -109 -19 19 -85 -238 -49 29 -82 -1 -82 -66 -85 -39
2688c9M7L0r3k2J04j53m8J51o6qK8J23l7l0L6P6k72J27L0J76p3l04M33p4l55J62
$$ -39 8 38 -55 -77 27 -126 -174 -23 -89 -97 -69 54 17 -13 23 99 -173 -46 -16 160 87 -217 216 142 -213 -51
2714e1K03jk92J18K55q3k15L9Q6j99K01J66j56k22J54J81k40L5j6K99k84j85M62
$$ -51 152 151 -141 -23 232 149 -66 -27 59 -140 61 227 71 -151 3 184 -56 -21 -37 262 -22 -207 255
2737B55j16j23j24K54j2k08J21K2L3j93J37J16r2o9O1K3k11M2J23J13j76J27K
$$ 255 139 16 -108 146 134 -74 47 69 102 -91 46 162 70 1 62 85 -126 -84 39 152 -24 103 105
2760A05j97o3J78J71l82J20N7L4k18P6J02j46J8M8n1Q7M6L1m1J9k56K94M7j73
$$ 105 -92 -155 23 194 -188 -68 -11 23 -195 -119 -17 -163 -145 -97 -148 -61 -15 16 -25 -6 -262 32 79 -94
2784i4j12K69k2r0K51k15k8j69R2J68j11mK31l3k14J06Q1o6q7J18j19l9L3J19
$$ -94 -206 63 41 -49 202 -13 -41 -210 -118 50 -61 -65 166 133 -81 25 106 40 -47 71 -48 -87 -54 65
2808F5j07J5pJ11l2L4j21J44p3j79J24J82l61J16J27M5k54L34N8j65p7J97m5k20
$$ 65 -42 -27 -34 77 45 79 -42 102 29 -150 -26 156 -205 -89 38 83 -171 163 221 56 -21 176 131 -89
2832h9nK71K0k45P4O6Q5k95K34r9P7o0O2Jj83J73j24L4j14R0p8J45j84j6K59r0
$$ -89 -94 177 197 -48 26 92 177 -118 116 17 94 34 96 97 -86 87 -37 -3 -117 -27 -105 40 -144 -160 99 9
2858IK9j47L8J52n3p3M4r6J11q3J19R6k00R5j23o9R1J40j69MJ30J15l20l4L19
$$ 9 38 -109 -71 81 28 -45 -1 -97 14 -69 50 146 -54 41 -82 -151 -60 80 -89 -85 45 160 -160 -194 125
2883A25j77J4j32L76m20K6L67l14l1L28J1k65j0J99j4r1J24j71J72l26M04m89
$$ 125 -52 -38 -170 206 -214 -188 179 -135 -166 162 173 -92 -102 97 83 -8 116 -55 117 -209 195 -294
2905b94K46R5j6k8M7n0j12J15J93j49Q8k03J79M9k41L02j40j02K4K47l20l7K15
$$ -294 -48 47 31 3 50 0 -112 3 196 47 135 -68 111 160 -81 221 81 -21 3 250 -70 -107 108
2928A08j6j04m0O4Q7k72J30O7j02k6J85m2k67J29K82j01j34k8N8j16J8J85j61
$$ 108 92 -12 -52 12 99 -173 -43 24 -78 -104 81 39 -228 -99 183 82 -52 -80 -22 -138 -120 65 -96
2951i6rR8J59m36K59o3J06j18K03L3o0k39K21N6j68K9M4j91Q7J22J5l8q2K52k72
$$ -96 -105 -7 152 -284 -25 -88 18 -100 103 136 76 -163 58 114 -54 -25 19 -172 -85 37 52 14 -68 184 -88
2976h8J17J63l99P3j36K56ok4L30j14l85R9J28j4j2L21j87k83K36Qj39l3J06r1
$$ -88 29 192 -207 -134 -270 -14 -20 -44 286 172 -213 -114 14 0 -12 309 122 -161 75 83 -56 -89 17 -74
3000g4o5J99J64k77N4J2J30j13J60j58j09K1m3J81j40J39P2k07J16J9J18k41L5
$$ -74 -139 60 224 -53 1 13 143 30 190 32 -77 -56 -99 82 -58 81 153 -54 62 81 199 -42 -7
3023gJ36j43r9O3K48k95r2K88k7k03J43l1j61J17K90k95n6K51r0km2Q6k9l20K60
$$ -7 129 -14 -113 -50 198 -97 -189 99 72 -131 12 -19 -180 -63 227 -68 -124 127 37 35 -7 79 50 -270 -10
3048a0Q5k23j74L11J8q8L76k18k11J59K25l94o5K12J80j92o3K43k56pR7J31k65
$$ -10 75 -148 -322 -11 7 -81 295 77 -134 25 250 -144 -209 3 183 -9 -72 171 -85 -92 5 136 -129
3071a29n6L59j58j33K02j18m6PJ28J03j52j9J74j84J8lMO8m5J43l83J04K54j26
$$ -129 -185 174 16 -117 85 -33 -79 -72 56 159 7 -12 162 -22 -4 -7 -3 65 20 163 -220 -116 138 12
3095A2j66O1K45k43P4M3K9n4j95M54m39J39J51L5k50P6L6j01J22l6L1q8lN1N8
$$ 12 -154 -93 152 -91 -17 26 55 1 -194 260 -179 -40 111 146 -104 -28 8 -93 29 -7 24 -64 -67 -16 42
3120D2j12j6J65j71p4J65J66l36J90O0j05J8J12o1j40K00Rl33J93n3J10j32K02
$$ 42 -70 -86 79 -92 -166 -1 165 -171 19 79 -26 -8 104 43 -97 103 112 -221 -28 -81 29 -103 99
3143I9o1l30J57K55o3k59M59l32j05J53M5N1j89P1k6j31J23J80j08j38J04K42
$$ 99 38 -292 -135 120 57 -202 257 -75 -180 -27 18 69 -120 -49 -75 -206 -83 97 -11 -149 -45 197
3165A97l18J18J15oj41k5J39J37k81K01j05j95K51m5RQ8n7n7J97k45KO4J56j91
$$ 197 -121 -3 112 106 -35 -60 79 216 -65 136 31 -164 87 42 51 139 82 25 222 -23 -21 43 199 8
3189HR5N6l07L56j4j68Q9j50O3Q5j59m4J15l6jr1J45j16j34J83m3QJ25j24J22
$$ 8 103 159 -148 208 194 26 115 -35 28 113 -46 -90 25 -11 -12 -103 42 -74 -208 -25 -68 -60 65 -59 63
3214F3m3k64L24J43k59m4K51k26kJ74oq6p3qQ8n9K4J95l18j61M13j46K2p4J90
$$ 63 20 -244 80 223 -36 -80 171 -55 -57 117 111 25 -48 -56 32 -27 -3 192 -126 -287 126 -20 2 -72 118
3239A18k00P4l3J58k8j08M5J08r0J9M0k87K27p8J4o7J26J10j53J63j88M4L5mj11
$$ 118 -82 -8 -41 117 89 -19 26 134 44 63 103 -184 43 -35 -21 -88 38 148 -5 158 -30 14 49 45 -66
3264f6j31K40k1r6P5J40j62m2K0J71j61n3J55L6j38J19Mr6r3N9J82j13P2n6J22
$$ -66 -197 43 22 -74 1 141 -21 -63 -43 128 -33 -86 69 105 -33 86 90 -6 -99 -40 142 29 101 45 167
3289A67k73P9J03q7k04L65j06m1R5m3p2k0K20j14o5k7N5j79N2jj00Q4O9J53k94
$$ 167 -106 -27 76 -11 -215 150 44 3 98 55 -17 -37 183 69 4 -23 32 -147 -95 -96 -196 -112 -43 110 -184
3314a84J87r3K0rOJ10ml9p3J08j22J45m5q5J74j94Nl5J9J85r7j77J92M0k46J36
$$ -184 3 -90 -70 -79 -73 37 33 -6 -79 29 -93 52 7 -78 96 -98 -93 -128 -109 76 -21 -198 -6 34 -212 -76
3340g6K86k64K2J52j45j6P0J70k47qO4l5j1k2K53p4p8M0m1r9K7j35J82m3mj03
$$ -76 210 -54 -32 120 -25 -41 29 199 -48 -56 8 -27 -38 -60 193 119 41 81 40 -59 -32 -167 15 -28 -32 -135
3366a35K15o2l4J49M6k37J50Qj53J40j60m7Q9QJ32k3k23J07q5J76P6j56pL9l2
$$ -135 80 18 -16 133 179 -58 92 100 -53 87 -73 -120 -31 -23 109 86 -137 -30 -115 61 137 -19 -26 13 -19
3391a9jn7J07k52L69j17j06J29j66J27J3l9j10J78j22K4J86j31r3K4J58p0J96
$$ -19 -20 -77 30 -222 147 30 -76 53 -113 14 27 -12 -122 56 -66 -42 144 13 -80 -56 102 32 228
3414B28l82J61j21J0J26Mj28Po9K08j31J61j07m3J27j1M2l9L8r1np9lJ12m2q6
$$ 228 -154 7 -114 -104 22 26 -102 -95 -164 44 -87 74 -33 -76 51 40 82 43 81 -10 -15 -94 -97 15 -27 -113
3440a13j34L36O5j44n2P6L2k6j08J11J2j9q6J47l6L0q2j54J89R5m4o4J5k1j26
$$ -113 -247 89 154 10 -42 34 66 40 -68 43 55 36 -50 97 61 91 9 -145 44 139 95 31 46 25 -101
3465a01k7J83J21P4k29n2N4P6k58J00J31j5J3m3L9k4N5Pk05lO5P2k51K48Q6j30
$$ -101 -128 55 176 250 21 -31 23 99 -159 -59 72 57 70 27 66 42 97 104 -101 -104 -39 33 -218 30 116 -14
3491a4p9J85r6j14J5J51J33j02k2j34j8n4J56K3N9lo2j1n9O9n5J96k68j09J65
$$ -14 -93 92 -4 -118 -103 48 181 79 57 -77 -95 -149 7 30 89 86 24 13 -46 23 -32 164 -104 -213 -48
3516d8m3l4K69j52m5J82k52m8K31k04K26nj54j0J31j9J9j49J19n6N4O1j67j26
$$ -48 -91 -125 144 -8 -53 129 -123 -171 60 -144 82 77 -77 -87 44 25 44 -105 14 -42 12 73 -94 -220
3540b20K14n4J60J01p2p8N7n9nPJ6p5N8J12j76r2J32K5l0K7J39j60m7J89k78O4
$$ -220 -6 -60 100 201 129 51 108 49 44 51 67 -8 50 162 -14 -106 26 51 21 48 187 27 -20 169 -109 -45
3566d5Q0OJ68k29k2Q7p6K5m4M2p1J54p5P0j10q5q4J66L0R8k32j16K73j2N0j37
$$ -45 35 41 209 -20 -42 45 -31 -6 -50 -8 -79 75 0 70 -40 -125 -209 -43 -13 85 -147 -263 10 -2 48 -89
3592h9J95o8P4j82J52Q1j21kj05j5j56k4K03J22O2k16rL6k0N1N7K9k26J88N7j25
$$ -89 106 38 112 -70 82 163 42 40 -65 -80 -236 -260 -57 65 127 -89 -98 -62 -82 -31 26 55 -171 17 74 -51
3618e1K5R7r0N6q2J87n4j30j19L47j45R5j03K6J9m4j00J47Lp6oJ06P9q4k84J56
$$ -51 -26 71 -19 37 -45 142 88 -42 -161 186 41 136 33 59 78 34 -66 81 84 8 2 108 187 103 -181 -25
3644b5J12Or0R7j39J23Q4j75P7j38J75j68j1J39j39N0j88O8J35J26k15J16K4j05
$$ -25 87 93 3 100 -39 84 168 -7 70 -68 107 -61 -72 67 -72 -22 -210 -142 -7 119 -96 20 44 -61
3668f1q2P9J75J4q8K0j39J16J7n8n5j16J86j45K8K40j42j18J0P5K6mo2j08P6J30
$$ -61 -143 -64 111 125 37 57 -82 34 51 -7 -62 -178 8 -137 -109 131 -11 -129 -119 -44 -18 -22 -84 -192 -116 14
3694A4l8j51J85J0o4j21K95j64o0j04L62j11m1O9J9Rp0n1J78j58mP6j2j18nJ45
$$ 14 -24 -175 10 20 -44 -165 130 -34 -94 -198 164 53 12 81 100 109 39 -12 166 8 4 80 68 -50 -55 90
3720I0L9q2Q4k59L6J40j6L4q6O1k5LN3J2j55L9J27r8J34j97P2j82M7K15J02j70
$$ 90 129 47 131 -128 -92 48 32 66 -20 41 16 19 72 84 -71 -32 95 -3 131 -66 6 -176 -129 86 188 18
3746A8Q9l8p0q3QO8R2j14J66j77l9R0J85k22J01p1r6O9p4J62J5R7j48l0k8J37
$$ 18 107 69 -1 -84 -76 -8 84 -30 136 -41 -80 10 195 -27 74 3 -93 -24 -98 64 79 176 28 -2 -30 107
$$ [...]
8191a09
##END NTUPLES=NMR FID
##END=
