##TITLE=1H_Pr Am NCS Bn
 CDCl3, 8 sc, 
 4.08.2021
##JCAMPDX= 6.0         $$ Bruker NMR JCAMP-DX V2.0
##DATA TYPE= NMR FID
##DATA CLASS= NTUPLES
##ORIGIN= UXNMR, Bruker Analytische Messtechnik GmbH
##OWNER= root
$$ XWIN-NMR		Version 3.5
$$ Wed Aug  4 13:19:13 2021 Russian Standard Time (UT+4h)  she@DPX200
##.OBSERVE FREQUENCY= 200.131506
##.OBSERVE NUCLEUS= ^1H
##.DELAY= (6, 6)
##.ACQUISITION MODE= SIMULTANEOUS
##.ACQUISITION SCHEME= undefined
##.AVERAGES= 8
##.DIGITISER RES= 18
##SPECTROMETER/DATA SYSTEM= spect
##.PULSE SEQUENCE= zg30
##.SOLVENT NAME= CDCl3
##.SHIFT REFERENCE= (INTERNAL, CDCl3, 0, 15.7039)
##AUDIT TRAIL= $$ (NUMBER, WHEN, WHO, WHERE, WHAT)
$$ ##TITLE= Audit trail, XWIN-NMR		Version 3.5
$$ ##JCAMPDX= 5.01
$$ ##ORIGIN= Bruker BioSpin GmbH
$$ ##OWNER= she
$$ F:/spectra/data/she/nmr/H-F/1/audita.txt
$$ ##AUDIT TRAIL=  $$ (NUMBER, WHEN, WHO, WHERE, WHAT)
(   1,<2021-08-04 13:18:04.39 +0400>,<she>,<DPX200>,
      <created by zg, POWCHK disabled, PULCHK disabled
       configuration hash MD5:
       00 E9 B6 7A A2 85 ED C7 34 08 36 98 17 FE 4E 26
       data hash MD5: 16K
       07 12 50 2E 09 04 91 06 AA 63 64 3B DF CC 44 8D>)
$$ ##END=
$$ 
$$ hash MD5
$$ FD 26 2B 17 0A 00 72 80 8F CC 30 C5 BD C2 76 42
##$RELAX= 
##$RELAX= 
##$RELAX= 
##$RELAX= 
##$RELAX= 
##$RELAX= 
$$ Bruker specific parameters
$$ --------------------------
##$DU= <F:/spectra>
##$EXPNO= 1
##$NAME= <H-F>
##$PROCNO= 1
##$TYPE= <nmr>
##$USER= <she>
##$AMP= (0..31)
100 100 100 100 100 100 100 100 100 100 100 100 100 100 100 100 100 100 
100 100 100 100 100 100 100 100 100 100 100 100 100 100 
##$AQSEQ= 0
##$AQ_mod= 1
##$AUNM= <au_zg>
##$AUTOPOS= <>
##$BF1= 200.13
##$BF2= 200.13
##$BF3= 200.13
##$BF4= 200.13
##$BF5= 200.13
##$BF6= 200.13
##$BF7= 200.13
##$BF8= 200.13
##$BYTORDA= 1
##$CFDGTYP= 0
##$CFRGTYP= 5
##$CHEMSTR= <none>
##$CNST= (0..31)
1 1 145 1 1 1 1 1 1 1 1 1 1 1 1 1 1 1 1 1 1 1 1 1 1 1 1 1 1 1 1 1 
##$CPDPRG= <>
##$CPDPRG1= <>
##$CPDPRG2= <>
##$CPDPRG3= <>
##$CPDPRG4= <mlev>
##$CPDPRG5= <mlev>
##$CPDPRG6= <mlev>
##$CPDPRG7= <mlev>
##$CPDPRG8= <mlev>
##$CPDPRGB= <>
##$CPDPRGT= <>
##$D= (0..31)
0 1.2 0 0 0 0 0 0 0 0.06 0 0.03 0 0 0 0 0.0002 0 0 0 0 0 0 0 0 0 0 0 0 
0 0 0 
##$DATE= 1628068683
##$DBL= (0..7)
120 120 120 120 120 120 120 120 
##$DBP= (0..7)
150 150 150 150 150 150 150 150 
##$DBP07= 0
##$DBPNAM0= <>
##$DBPNAM1= <>
##$DBPNAM2= <>
##$DBPNAM3= <>
##$DBPNAM4= <>
##$DBPNAM5= <>
##$DBPNAM6= <>
##$DBPNAM7= <>
##$DBPOAL= (0..7)
0.5 0.5 0.5 0.5 0.5 0.5 0.5 0.5 
##$DBPOFFS= (0..7)
0 0 0 0 0 0 0 0 
##$DE= 6
##$DECBNUC= <off>
##$DECIM= 32
##$DECNUC= <off>
##$DECSTAT= 4
##$DIGMOD= 1
##$DIGTYP= 9
##$DL= (0..7)
0 120 120 120 120 120 120 120 
##$DP= (0..7)
150 150 150 150 150 150 150 150 
##$DP07= 0
##$DPNAME0= <>
##$DPNAME1= <>
##$DPNAME2= <>
##$DPNAME3= <>
##$DPNAME4= <>
##$DPNAME5= <>
##$DPNAME6= <>
##$DPNAME7= <>
##$DPOAL= (0..7)
0.5 0.5 0.5 0.5 0.5 0.5 0.5 0.5 
##$DPOFFS= (0..7)
0 0 0 0 0 0 0 0 
##$DQDMODE= 0
##$DR= 18
##$DS= 0
##$DSLIST= <SSSSSSSSSSSSSSS>
$$ [...]
##$SUBNAM2= <"">
##$SUBNAM3= <"">
##$SUBNAM4= <"">
##$SUBNAM5= <"">
##$SUBNAM6= <"">
##$SUBNAM7= <"">
##$SUBNAM8= <"">
##$SUBNAM9= <"">
##$SW= 20.0188882624521
##$SWIBOX= (0..15)
0 0 2 0 0 0 0 0 0 0 0 0 0 0 0 0 
##$SW_h= 4006.41025641026
##$TD= 16384
##$TD0= 1
##$TE= 0
##$TE2= 300
##$TE3= 300
##$TEG= 300
##$TL= (0..7)
0 120 120 120 120 120 120 120 
##$TP= (0..7)
150 150 150 150 150 150 150 150 
##$TP07= 0
##$TPNAME0= <>
##$TPNAME1= <>
##$TPNAME2= <>
##$TPNAME3= <>
##$TPNAME4= <>
##$TPNAME5= <>
##$TPNAME6= <>
##$TPNAME7= <>
##$TPOAL= (0..7)
0.5 0.5 0.5 0.5 0.5 0.5 0.5 0.5 
##$TPOFFS= (0..7)
0 0 0 0 0 0 0 0 
##$TUNHIN= 0
##$TUNHOUT= 0
##$TUNXOUT= 0
##$USERA1= <user>
##$USERA2= <user>
##$USERA3= <user>
##$USERA4= <user>
##$USERA5= <user>
##$V9= 5
##$VALIST= <valist>
##$VCLIST= <CCCCCCCCCCCCCCC>
##$VD= 0
##$VDLIST= <DDDDDDDDDDDDDDD>
##$VPLIST= <PPPPPPPPPPPPPPP>
##$VTLIST= <TTTTTTTTTTTTTTT>
##$WBST= 1024
##$WBSW= 4
##$XGAIN= (0..3)
0 0 0 0 
##$XL= 0
##$YL= 0
##$YMAX_a= 320367
##$YMIN_a= -582012
##$ZGOPTNS= <>
##$ZL1= 120
##$ZL2= 120
##$ZL3= 120
##$ZL4= 120
##$ABSF1= 10
##$ABSF2= 0
##$ABSG= 5
##$ABSL= 3
##$ALPHA= 0
##$AQORDER= 0
##$ASSFAC= 0
##$ASSFACI= 0
##$ASSFACX= 0
##$ASSWID= 0
##$AUNMP= <proc_1d>
##$AZFE= 0.1
##$AZFW= 0.1
##$BCFW= 1
##$BC_mod= 2
##$BYTORDP= 1
##$COROFFS= 0
##$CY= 11.3945322036743
##$DATMOD= 1
##$DC= 2
##$DFILT= <>
##$DTYPP= 0
##$F1P= 2.36226072786647
##$F2P= -0.459571619588291
##$FCOR= 0.5
##$FTSIZE= 0
##$FT_mod= 4
##$GAMMA= 1
##$GB= 0.15
##$INTBC= 1
##$INTSCL= 1
##$ISEN= 128
##$LB= 0.24
##$LEV0= 0
##$LPBIN= 0
##$MAXI= 10000
##$MC2= 0
##$MEAN= 0
##$ME_mod= 0
##$MI= 1.114404
##$NCOEF= 0
##$NC_proc= 0
##$NLEV= 6
##$NOISF1= 3.799351
##$NOISF2= 2.8
##$NSP= 1
##$NTH_PI= 0
##$NZP= 0
##$OFFSET= 15.70392
##$PC= 1
##$PHC0= -13359.15
##$PHC1= 18.00099
##$PH_mod= 1
##$PKNL= yes
##$PPARMOD= 0
##$PSCAL= 0
##$PSIGN= 0
##$REVERSE= no
##$SF= 200.130013532006
##$SI= 16384
##$SIGF1= 3
##$SIGF2= 2
##$SINO= 400
##$SIOLD= 16384
##$SREGLST= <1H.CDCl3>
##$SSB= 0
##$STSI= 0
##$STSR= 0
##$SW_p= 3612.71676300578
##$SYMM= 0
##$S_DEV= 0
##$TDeff= 0
##$TDoff= 0
##$TI= <>
##$TILT= no
##$TM1= 0
##$TM2= 0
##$TOPLEV= 0
##$USERP1= <user>
##$USERP2= <user>
##$USERP3= <user>
##$USERP4= <user>
##$USERP5= <user>
##$WDW= 1
##$XDIM= 8192
##$YMAX_p= 0
##$YMIN_p= 0
$$ End of Bruker specific parameters
$$ ---------------------------------
##NTUPLES= NMR FID
##VAR_NAME=  TIME,          FID/REAL,        FID/IMAG
##SYMBOL=    X,             R,               I
##VAR_TYPE=  INDEPENDENT,   DEPENDENT,       DEPENDENT
##VAR_FORM=  AFFN,          ASDF,            ASDF
##VAR_DIM=   8192,          8192,            8192
##UNITS=     SECONDS,       ARBITRARY UNITS, ARBITRARY UNITS
##FACTOR=    0.0002496,     1,               1
##FIRST=     0,             0,               0
##LAST=      2.0444736,     0,               0
##MIN=       0,             -582012,         0
##MAX=       2.0444736,     320367,          0
$$ Real data points
##PAGE= N=1
##DATA TABLE= (X++(R..R)), XYDATA
$$ [...]
1563a795r5m3r4K03P3K7p7p7J59k0J02k1K98K30k40J14M07q1o0K76M20k97K15
1586c76K56j33K78M09p0p0K99K50n9m1N58j9M9j01K49K5j27N9N09m4j35N6M4k21
1610A645K18p6N5k11J88J1n67q1M4J02J30k40k98O1l41m0L1J8j92l58q6l4m52
1633d73K45j09l34j13K10l88k56L6J80k38k76J12k0m17R5L35j31j29OJ07j42k30
1655a930L72K5L4N4M4O4nP5K54j64L34J65J0j57K68K06K48n2K50j34J11J27M23
1678F22j05J43L89j18J0j22L75pJ11J28J50k08j47O2K47J18K0k52M7l7J53k90
1700A289QJ86P1m29j01K3L7m7j94j75K42k80m93K10N6k52j57n4j08j32q4j32k59
1723g75K36L4k62n8r6p6o8l3J01p9k52n6J14m6p2j07K44Q8m65J78L41l89M75K46
$$ plain form
1563 -1795 -1890 -1933 -2027 -1824 -1751 -1724 -1801 -1878 -1719 -1739 -1637 -1658 -1360 -1130 -1370 -1256 -849 -930 -990 -714 -294 -591 -376
1586 -376 -120 -253 25 434 364 294 593 843 784 743 1301 1282 1331 1230 1479 1504 1377 1436 1945 1901 1766 1822 1866 1645
1610 1645 1863 1787 1842 1631 1819 1830 1263 1182 1226 1328 1458 1218 920 981 640 600 631 649 457 99 13 -21 -473
1633 -473 -228 -337 -671 -784 -574 -962 -1218 -1182 -1002 -1240 -1516 -1404 -1424 -1841 -1746 -1411 -1542 -1671 -1665 -1558 -1700 -1930
1655 -1930 -1558 -1533 -1499 -1445 -1401 -1337 -1342 -1267 -1013 -1177 -843 -678 -668 -825 -557 -351 -103 -155 95 -39 72 199 622
1678 622 517 660 1049 931 941 819 1194 1187 1298 1426 1576 1368 1221 1283 1530 1648 1668 1416 1463 1426 1579 1289
1700 1289 1297 1483 1554 1125 1024 1047 1084 1037 843 668 910 630 137 347 403 151 -6 -60 -168 -300 -384 -516 -775
1723 -775 -539 -505 -767 -825 -921 -997 -1065 -1098 -997 -1076 -1328 -1384 -1270 -1316 -1388 -1495 -1251 -1163 -1628 -1450 -1109 -1498 -1023 -777
1747g77m57O1M90n4m54M01K99l32K70K13k61J99N45k68L56J02k84L56K58L9qK38
1769I32k39j88L48L82o07M88Q0l02K62K16j41M6K9m2K2jn0k90L15J9n78L48K47
1792A296o59K72K0n23J14K19l55k47J12j60k44J85Q4n09K73l9m20L9p7j93L59
1813d53Ln16j20K97k68P8K44k33k65K57l7k30L93J14m53J84m0Qp8L79M6k50K58
1836f82J9k1K39K34k32J43K09k39L8L27J3J04J18n2L8J12j8R7K4J61k50K79J47
1859H08j72L15l8l65K93K95k78j5N1j91J36J86n8k53J27J06l51L9J41l17J60k3
1881E96j11r9o8k7k3Q9l30j4L3l5j73J92l09QJ8K7k09L7K3k52Q8j40P2k5K3O5
1907e44k48J22r2j84K38L9l5l11L17L8J43j19O0j49L5J45K8j5P2L7L48k00N2m8
$$ plain form
1747 -777 -1234 -1173 -683 -737 -1191 -790 -491 -823 -553 -340 -601 -402 143 -125 231 333 49 405 663 702 694 932
1769 932 693 505 853 1235 628 1116 1196 894 1156 1372 1231 1277 1306 1264 1286 1285 1235 945 1260 1279 701 1049 1296
1792 1296 637 909 929 406 520 739 384 137 249 89 -155 30 114 -395 -122 -161 -581 -542 -619 -812 -453
1813 -453 -450 -966 -1086 -789 -1057 -979 -735 -968 -1233 -976 -1013 -1243 -850 -736 -1189 -1005 -1045 -1037 -1115 -736 -690 -940 -682
1836 -682 -663 -684 -445 -211 -443 -300 -91 -330 -292 35 48 152 270 218 256 368 350 447 471 632 382 661 808
1859 808 636 951 913 548 841 1136 858 843 894 703 839 1025 967 714 841 947 596 635 776 459 619 596
1881 596 485 386 318 291 268 357 27 13 46 11 -162 30 -279 -271 -253 -226 -435 -398 -375 -627 -539 -679 -607 -632 -609 -544
1907 -544 -792 -670 -762 -946 -708 -669 -704 -1015 -698 -660 -517 -636 -576 -725 -690 -545 -517 -532 -460 -423 -75 -275 -223 -271
1931b71n2J83L80M2l03J89J04j31l7J99K73j18Ll3J04O6J32m6J26j38L0q6J49
1954G65J6j66J85qm3r9nq8o0K52j34j04p1N5j16Q0m00L70k00k49J54o8j76J13
1978Cj33Kj53J38M1k93j0k9J0o4MJ04j58p7Q5pk13K04n8j82j0NJ90j32j75K60
2004f48L1NO2O1o0J1K32j17OJ62K43k78L6L33l22J45J70m5O7J07J6J18k11J52
2028B76n3k1K32K22k35j4L7oJ24P5km5k8r3J79N1j44p1Q7l9l3j33m5J42nj57r
2055B92o0N0N3p7j38nJ0j86N8Lj75OL5j64j16J52q8L1K0q0J04k14o3P3p5n9L90
2082b23n2m73K75J6mO8j08Q2l1j0Q7R5R4n5j49P8O2M5l3L44l25K5J74L0r7Q8P6
2109G9m3j5R9j02J83r8J33L1m3J77K1r3mJ27R3j60k7L1J5o3k1J75Ol7p8M7j92
$$ plain form
1931 -271 -323 -140 240 282 -21 168 272 141 104 303 576 458 461 428 532 598 730 684 810 672 702 616 765
1954 765 781 615 800 792 749 650 645 557 497 749 615 511 440 495 379 459 59 429 229 -20 134 66 -110 3
1978 3 -130 -128 -281 -143 -102 -395 -405 -434 -424 -488 -484 -380 -538 -615 -530 -537 -750 -546 -604 -786 -796 -791 -601 -733 -908 -648
2004 -648 -617 -612 -550 -489 -549 -538 -306 -423 -417 -255 -12 -290 -254 79 -243 -98 72 27 94 201 217 335 124 276
2028 276 223 202 434 656 421 407 444 438 562 637 635 590 562 469 648 699 555 484 571 532 499 366 321 463 458 301 292
2055 292 232 282 335 258 120 115 125 -61 -3 0 -175 -169 -134 -298 -414 -262 -350 -319 -299 -379 -275 -489 -552 -479 -554 -613 -223
2082 -223 -275 -748 -473 -457 -461 -393 -501 -419 -450 -460 -373 -278 -184 -239 -388 -310 -248 -203 -236 108 -217 -192 -18 12 -85 3 79
2109 79 36 21 120 18 201 103 236 267 224 401 422 329 325 452 545 385 358 389 404 341 320 495 501 464 386 433 241
2136B41R9j64J67J9N3k29J95q7k06O9K56k83j21P5r0q0J21j14KJ04k20J08o7q4
2160b36j37J18L4k61P6J63k69L7L2m5n1K28l2o6R5L0j51Q3O1j17J44j57j37J52
2184d06R1M9k7J38k25J71K88n4j94P2J63j62R1j10J33kL0J45R2r0p9J67n5M6k0
2209B52K71k19o4J43J56k22J20p2J63l33K49m4m5J72j10k38K70j47o9J04l00K48
2231B85p1j91J96k23J83j31P0kk38L6J49J1k76J07J08j91l0N0j29r4K20j01J32
2254a30j11o7j40R4J08K5k7rj96O4L4J61q5J6k88K48L0o4J7J05l5O1R7j31JN2
2280a70J43p3m1Q4J81KJ4j66J56n3o5K08k0j07J62J5N3n2p3J03Nk1K1l9O0J74
2306E01l55J81k8M7KP2j22N5j57J28R3k39n0JK25k67J0j5N1n9L5Q0l60J23K8p1
$$ plain form
2136 241 340 176 343 362 415 186 381 294 88 157 413 130 9 84 -6 -86 35 -79 -77 27 -193 -85 -152 -236
2160 -236 -373 -255 -221 -482 -406 -243 -512 -475 -443 -488 -539 -311 -343 -409 -314 -284 -435 -352 -291 -408 -264 -421 -558 -406
2184 -406 -315 -266 -293 -155 -380 -209 79 25 -169 -97 66 -96 -5 -115 18 16 46 191 283 193 114 281 226 272 252
2209 252 523 304 240 383 539 317 437 365 528 195 444 400 355 527 417 179 449 302 233 337 37 285
2231 285 214 23 219 -4 179 48 118 116 -122 -86 63 74 -202 -95 13 -178 -208 -158 -287 -381 -161 -262 -130
2254 -130 -241 -308 -448 -354 -246 -221 -248 -257 -453 -389 -355 -194 -279 -263 -551 -303 -273 -337 -320 -215 -250 -189 -92 -223 -222 -170
2280 -170 -27 -100 -141 -57 124 126 140 -26 130 77 12 220 200 93 255 270 323 271 198 301 306 285 306 267 327 501
2306 501 146 327 299 346 348 420 298 353 196 324 417 178 128 129 354 87 97 82 133 74 109 189 -171 -48 -20 -91
2332i1n4N7k57K07N0N2l16K11k28P5K24l17l5J54N9j10j48L31k34J1J55j91k2
2355d17J71j40R1J55j05p5J03m9l4J14K19k07L3J11q3O2K87j43n4n8P6m7K74p4
2379B10j67J79J35k63J19n1j51O3L65j8k20N6M3q3K45j50j22l1J6R7R0q7j60O0
2403A75N2j14k9J28k28J98j91K34j45k7l0j18J94j11q5K6n9m0L8J0M5j10K55j1
2427E7l25K1J37j65j0P7j45J06K8n7P8j9LJ15n4o8J65q6n0J38r2o3M0K3j10kK84
2454B6j79K6J09k8J2K5p0M0JJ15n6R8l8J8j02J91K2j36J19j86J04j15J15j55J30
2479H6J3J78m3P1l9p7M4m5n9L58m17l2K64n4o2r8j1M2J64k60J43Jk03l1R3j20
2505i4P2k30L06j26OjK0l0m0j34P1J36q7q6j03J62R1j05J00j12O9j62o3J10J82
$$ plain form
2332 -91 -145 -88 -345 -138 -88 -36 -352 -141 -369 -294 -70 -387 -422 -268 -209 -319 -467 -136 -370 -359 -204 -395 -417
2355 -417 -246 -386 -295 -140 -245 -320 -217 -266 -300 -186 33 -174 -141 -30 -113 -51 236 93 39 -19 57 10 284 210
2379 210 43 222 357 94 213 162 11 74 439 421 201 257 300 217 462 312 190 159 175 272 362 275 115 175
2403 175 227 113 84 212 -16 182 -9 225 80 53 23 -95 99 -12 -97 -71 -130 -170 -132 -122 -77 -187 68 57
2427 57 -268 -247 -110 -275 -285 -208 -353 -247 -219 -276 -198 -217 -214 -99 -153 -221 -56 -142 -192 -54 -146 -209 -169 -146 -256 -258 26
2454 26 -153 -127 -18 -46 -34 -9 -79 -39 -38 77 21 119 81 99 -3 188 210 74 193 7 111 -4 111 -44 86
2479 86 99 277 234 305 266 189 233 188 129 487 70 38 302 248 186 88 77 119 283 23 166 167 -36 -67 26 -94
2505 -94 -22 -252 54 -72 -66 -67 -47 -77 -117 -251 -180 -44 -131 -217 -320 -158 -67 -172 -72 -184 -115 -277 -340 -230 -48
2530d8j33k2J58j32K0N3m9QJ9Mm9P6P0n6J70j0k25K60p2pj77K35r3m1K3J27n0
2557E9p2Q2L3J43j26l2M1q4nk15K60j38K63j47J74k68J42pJ38j25o8K21k10M0
2581I9j9N7J9j06M2pj09R1nq3Rm8o7J07pJ07k02P9j0Jk00R0O2j2J08j59K39j55
2609g9j10M2J58L2j12O1j08J7rn3J01J62k27P2M9j69J95k19J41r7K96M2k78J36
2633D3k10L13o9j35L2R4k4O2q4K57l14M3k5N7J07q2P5n8j36R9p9L2M7Q8k6j97
2659i0R5j1m6R4J00j73J95p8j01j08J19j07K16j03O4j38R8q1N4q0L0p9J60p8k8
2684g6o2j7J63Jo2N1j96P4q2K10l1o6O5J17n8q9j82J79K5P6k50J72J05o7j75J89
2710A4M6k8Q3j08Pj41K02o1J6j10J74P2Lk12J96P9L4l60Q8j5Q9J36k58J33o5M1
$$ plain form
2530 -48 -181 -203 -45 -177 -157 -104 -153 -145 -126 -122 -171 -95 -25 -81 89 79 -146 114 42 35 -142 93 0 -41 -18 109 59
2557 59 -13 69 102 245 119 87 128 44 39 -176 84 -54 209 62 236 -32 110 103 241 116 48 269 59 99
2581 99 80 137 156 50 92 85 -24 67 62 -21 -12 -60 -127 -20 -27 80 -122 -43 -53 -52 -252 -162 -100 -112 -4 -163 76 -79
2609 -79 -189 -147 11 43 -69 -8 -116 -99 -108 -161 -60 102 -125 -53 -4 -173 22 -197 -56 -153 143 185 -93 43
2633 43 -167 146 77 -58 -26 68 44 106 22 279 -35 8 -17 40 147 65 140 82 -54 45 -34 -2 45 133 107 -90
2659 -90 5 -6 -52 42 142 -31 164 86 -15 -123 -4 -111 105 2 66 -72 26 -55 -1 -81 -51 -130 30 -48 -76
2684 -76 -138 -155 8 9 -53 -2 -198 -124 -206 4 -27 -93 -28 89 31 -58 -240 -61 -36 40 -210 -38 67 0 -175 14
2710 14 60 32 115 7 14 -127 75 14 30 -80 94 166 169 -43 153 232 266 -94 -6 -21 68 204 -54 79 14 55
2736E5J88q3oj22Ol0pj48J78q9Q4J37n6m5n1mRQ5k12K10m2j71J87j53R7r3m5J8
2764a03J00K4M6j36j11J50J1q0Q5j17J72j12j9PP4o8Q2j39K2J43k4k07J17P3j67
2789a77J44k23K57k0l8n0J9J83m5j14O4Q4j55L2J4l5N6RJ00l7j85Q0J89k26R7
2814B3J24n3j12J07M2J14l53J97K15k60J6p9K4Q8J49l23K00q3J33j67L4J36o0
2837A12j28N5N4J16k14j41R1J00K2j84O4j58J29J0J27J5J6j60n5K08j22r6J12
2860b7k40J83K1J8O7j20L7K0M9N8k00L8J18j25Q5K58k85J53j34r5N7J24j30J27
2884E7r6Q7m2J14ok13J60l5L0O9m4O9k0j73Q7j15J85k9j12J58oj60L8K59k59J30
2910A33j14O3%nL1j16Q6K05j13j31M0P4j82J94r6j94M7N9J78j33jp5J16j21P2
$$ plain form
2736 55 243 160 154 32 38 8 1 -147 31 -58 26 163 107 62 11 7 16 101 -111 99 57 -114 73 -80 17 -76 -121 -103
2764 -103 -3 21 67 -69 -180 -30 -19 -99 -14 -131 41 -71 -90 -83 -9 -77 5 -134 -112 31 7 -200 -83 -10 -177
2789 -177 -33 -256 1 -19 -57 -107 -88 95 50 -64 0 84 -71 -39 -25 -60 -4 5 105 68 -117 -37 152 -74 23
2814 23 147 94 -18 89 131 245 -108 89 304 44 60 -19 5 93 242 -81 119 36 169 2 36 172 112
2837 112 -16 39 93 209 -5 -146 -55 45 67 -117 -53 -211 -82 -72 55 70 86 -74 -129 79 -43 -139 -27
2860 -27 -267 -84 -63 -45 22 -98 -61 -41 8 66 -134 -96 22 -103 -18 240 -45 108 -26 -121 -64 60 -70 57
2884 57 -39 48 6 120 114 -99 61 26 56 125 81 150 130 -43 44 -71 114 85 -27 131 125 -35 3 262 3 133
2910 133 19 82 82 77 108 -8 78 283 170 39 79 153 -29 165 69 -125 -78 -19 159 26 25 -50 66 -55 17
2935A7K0j88J09n0rn2K26n1k96K17j59J42n3K24k40L7P4J2q0l0q0mJ3J73N5j35
2961a08j16J93Mj4n1j15j2K49lR1n2j27R8K2J06j79J15nK3n0k9N5j0k14J79j24
2987g4l5J76j11K37p9j33M1J08l1o6N3K4j14j60J44j9J44k38J40M6J17l03K42
3010A09j60J50PK5j78RM6j17Q8j76K45k0L5O8K5k54J3J5o6K70l03J02Q7j83J37
3035b6o0J38k30J65k32L16M3k28O8j44J73J96k44N2q1J70Pq5J14R1p8j96k1J98
3059A06j47R0J6M3j78J07k4j32K23j54J38l1j00M0Q6n8p7J45j12MP2lj39K14K7
3084A56j04J02ql22J38MP6J15j99P0j6r8N5K06k13K8J4P3j04M4K6j21M7j8O2R1
3110A04m2j10l7m5J47J3o1M3rL3j06Q2j04J45p1J02j41j41K36k17k0Q4N2N5L2
$$ plain form
2935 17 37 -151 -42 -92 -101 -153 73 22 -274 -57 -216 -74 -127 97 -143 -106 -32 -20 -100 -130 -210 -214 -201 -28 27 -108
2961 -108 -224 -31 -27 -41 -92 -207 -219 30 27 118 66 -61 37 59 165 -14 101 96 119 69 40 95 85 -129 50 -74
2987 -74 -109 67 -44 193 114 -19 22 130 99 33 86 110 -4 -164 -20 -39 105 -133 7 53 170 -133 109
3010 109 -51 99 106 131 -47 -38 8 -109 -21 -197 48 28 63 131 156 -98 -85 -70 -136 134 -169 -67 20 -163 -26
3035 -26 -86 52 -178 -13 -245 71 114 -114 -46 -190 -17 179 -65 -13 -94 76 83 -2 112 203 125 -71 -92 106
3059 106 -41 49 65 108 -70 37 13 -119 104 -50 88 57 -43 -3 83 25 -52 93 -19 -15 57 54 -85 129 156
3084 156 52 154 146 -176 -38 -34 42 157 -42 28 12 -86 -31 175 -38 -10 4 77 -27 17 43 -78 -31 -49 13 104
3110 104 62 -48 -85 -130 17 30 -31 12 3 36 -70 12 -92 53 -18 84 -57 -198 38 -179 -199 -115 -63 -8 24
3135B4k18J86J8OM7k2N0Mq2K3j34q5J81m3N7K28k12p9L20k84J7m9Q4r8N4j8J79
3162A54l02J67P2M0j78j4m1J78l7L5j19J09j60J55l8p8N2M0k6k06L36k23Pk5J08
3187Fo7J12J0j18J9O5k2O6o2o2n9j9K61m3o5J6q0mJ05j10J6N1j02k1J36j24J27
3214C2j72R8P8q4J25J5r0r0K94l36P0R5m0l7J65j22M9n6J89k1Rj89k1J8K0L9n8
3241b0L3J45j63J09j07O8j6n6J11j76J63j55N6m2q1L7J98j36L0p0J25l8O1N2j62
3266c4J33j70o3Q5l1P3P8o4q7N8n4J0L2n6J16j04M4l5N8Jj97J71j6M9Q6j55J97
3293A25L5n9k40lJ46k5J40p9j27Q2J58k63J81j6n3j75K83J5j53j32J70M3p0n8
3317g5j40K50j00J66l1j13L6J75j06J24j41J57j23j22J55J3n6k5J0q5j2N4Q2j20
$$ plain form
3135 24 -194 -8 10 16 63 41 91 95 13 36 -98 -183 -2 -45 12 240 28 -51 269 -15 2 -47 37 -61 -7 -25 154
3162 154 -148 19 91 131 -47 -61 -102 76 39 74 -45 64 -96 59 21 -57 -5 35 9 -197 139 -84 -77 -102 6
3187 6 -61 51 61 -57 -38 27 5 71 9 -53 -112 -131 130 87 22 38 -42 -46 59 -51 -35 16 -86 -107 29 -95 32
3214 32 -140 -42 36 -48 77 92 2 -88 206 -130 -60 35 -5 -42 123 1 50 -6 183 162 171 -18 -39 -21 -1 38 -20
3241 -20 13 158 -5 104 -3 65 49 -7 104 -72 91 -64 -8 -50 -131 -94 104 -32 -2 -72 53 15 76 128 -34
3266 -34 99 -71 -134 -49 -80 -7 71 7 -80 -22 -76 -66 -34 -90 26 -78 -34 -69 -11 -10 -207 -36 -52 -3 83 -72 125
3293 125 160 101 -139 -142 4 -21 119 40 -87 -5 153 -110 71 55 2 -173 110 125 -28 -160 10 53 -17 -75
3317 -75 -215 35 -65 101 70 -43 -7 168 62 186 45 202 79 -43 112 125 69 44 54 -31 -43 11 93 -27
3341b7rm5O5K06O9l19J27Q8o7r9l5j79J79J32k63R1K80l02O0p9O8J22P5j01j39
3366a02m2J1J15J06L4j77p2J75j83O9O2q5R1j66J74k04J59p4K87k60R2p5J3Oj34
3391a80K87j20J68j64kO3J6j52J50nk2q6R5L9P4j73j9N3k8j45J53J34j61J77k51
3416i9K14kk7j05J24l12L53p8j29m0Q9KO2j22R6J0p0NM3Q6p1j19J77j19Q1n4J82
3443A77j64K4o4J03M3l0k22J00Q3j03r1RR2R4J39l12J51k17J78J08k26J4J44p6
3467d6O4M5Mn6k2J5j01K5O9K6j36J04Q1j27J43j84J67k05J73l4L9L9j25J39j90
3492i3L12j62j34N0O9K3J3Ok53K24j03J67p1j00m9J11J53q2n3N7k20J68n9P9j56
3517a03J39P4j72Q0j6o1q4J71J06k62p8K46rj64J36L2j74J9J67j79J65k7m1p9
$$ plain form
3341 -27 -36 -81 -16 190 259 -60 67 155 88 -11 -46 -225 -46 86 -177 -86 194 -108 -48 -127 -59 63 138 37 -102
3366 -102 -144 -133 -18 88 122 -55 -127 48 -135 -66 -4 -89 2 -164 10 -194 -35 -109 178 -82 10 -65 -52 -46 -180
3391 -180 107 -13 155 -9 -11 52 68 -84 66 61 39 -47 48 87 161 -12 -31 22 -6 -151 2 136 -25 152 -99
3416 -99 115 113 86 -19 105 -207 146 68 -61 -101 -12 -10 52 -70 26 36 -34 -29 14 100 29 -90 87 -32 49 -5 177
3443 177 13 37 -27 76 119 89 -133 -33 50 -53 -144 -135 -43 51 190 -122 29 -188 -10 98 -128 -114 30 -46
3467 -46 18 63 67 11 -11 4 -97 -72 -3 23 -113 -9 72 -55 88 -96 71 -134 39 5 44 83 -42 97 -93
3492 -93 219 57 -77 -27 42 65 78 84 -169 55 -48 119 48 -52 -101 10 163 81 28 85 -135 33 -26 53 -103
3517 -103 36 110 -62 18 2 -59 -143 28 134 -128 -206 40 31 -133 3 35 -139 -120 47 -132 33 6 -35 -114
3541a14L2p1J05O5P9j31J18k26J42r3j5N2J07O9p4k70K76poJ68k63P8Q1l9o3Q5
3567H5p7j51R5K68l02J9N3M4R3k0o0n4o6r3K57O0j54k0J0j05J34M0n2P6L2j78
3593f6j14j18K07O5j3P7pL8L8j69J45m0M0j76o8m0k6L29p3Qj98L76k42j6N9k77
3619b61R4J03MQ3l5Q7k93J67j4N6m0j11K16j20j1J15j85J28r3L9M3L6K9L1K0j01
3645a3j04l7k2K14L16l32J40j75K79l33N4O1j76J59m7J1L8K6j01L5l6J28mj4o6
3670Am3J15rJ04j95O2j9J05jM6o7j25qN4M4m6m5P1N3j5q0J13o2Q6j79O9j09JJ31
3699E2K4j50j91K54j43J97j5m6o6K05l86K17O7o3r3J0L1pJ86l12K79l3j75L0L39
3724B11k76J16n9m5Rj16K52j32O7j21J11j51J64j11N7p6M7P8K1Q2n5j19q1P8Q
$$ plain form
3541 -114 -82 -153 -48 17 96 -35 83 -143 -1 -94 -109 -57 50 119 45 -225 51 44 38 206 -57 21 102 63 0 85
3567 85 8 -143 -48 220 -82 -63 -10 34 127 107 47 -7 -73 -166 91 151 -3 -23 -13 -118 16 56 4 80 112 -66
3593 -66 -180 -298 -91 -26 -39 38 31 69 107 -62 83 43 83 -93 -161 -201 -227 102 29 37 -161 215 -27 -43 16 -261
3619 -261 -167 -64 -60 23 -12 75 -218 -51 -65 -9 -49 -160 56 -64 -75 40 -145 -17 -110 -71 -28 8 37 68 88 -13
3645 -13 -117 -154 -176 38 354 22 162 -13 266 -67 -13 48 -128 31 -16 -5 33 59 -42 -7 -43 85 81 67 1
3670 1 -42 73 64 168 -27 35 16 121 120 166 99 -26 -34 20 64 18 -27 44 97 82 2 115 53 139 -40 29 -80 -79 52
3699 52 76 -74 -265 -11 -154 43 28 -18 -84 121 -265 -48 19 -44 -137 -127 -96 -103 83 -229 50 17 -158 -128 211
3724 211 -65 51 -8 -53 -44 -160 92 -40 27 -94 17 -134 30 -81 -24 -100 -53 25 46 128 73 -46 -127 -49 -41
3749d1L1jNM9Ok10M1J61J4J70n6j41O2J0Kk1J73k38J4m9j05K25N0j27J14j69J82
3776A51j90R8J25j3k9k00J21j98o4J55Q8j12J87lj52k38L11p1j28J44o4n6N1N6
3800c1M9o3m4J67j27j33J81N5p5o7JJ20j00P8o1j6ll0L1Rj47Q8J32%p2Pm9P1m1
3829g0J36j70K3Q4J19j69R8j6Jj48M3K03k84K24j23j6J58k6J61j3j06k27J41m
3853A9p5N9J10q5K9J2r6N0j5o1j0J27O4j02j26K31K9n2j6k57N7Q3n5rJ98j50J91
3880A50j27m8Q8j37m4M9J7m5j1P7K5j6J05j12L9j60J11n2j06J6J89m3KJ0N3P7
3906A07j07j7OM5j48J23R8j42m8K57j66o5K3K5Jj3k17J91J02j24N0k3J52J65l50
3931g5O7l3R0r0J38k4j13Q4k5N1j34Q1M3j2K9J42k71J14j03J26J72k28j18J12
$$ plain form
3749 -41 -10 -11 -6 43 49 -161 -120 41 55 225 169 28 90 100 102 81 254 16 30 -19 -124 101 151 24 138 -31 151
3776 151 -39 59 184 171 142 -58 63 -135 -199 -44 44 -68 119 116 -36 -274 37 -34 -162 -18 -82 -138 -87 -31
3800 -31 18 -45 -89 78 -49 -182 -1 54 -21 -88 -87 33 -67 11 -50 -66 -69 -99 -68 -59 -206 -118 14 14 -58 -51 -100 -29 -70
3829 -70 66 -104 -81 3 122 -47 51 35 36 -112 -69 134 -150 74 -49 -65 93 67 228 215 109 -118 23 19
3853 19 -56 3 113 28 57 69 -27 23 8 -53 -63 64 128 26 -100 131 160 108 92 -165 -108 -25 -80 -89 109 -41 150
3880 150 23 -25 63 -74 -118 -69 -52 -97 -108 -31 -6 -22 83 -29 10 -150 -39 -91 -197 -181 8 -35 -33 -23 30 107
3906 107 0 -17 -11 34 -114 9 107 -35 -83 174 8 -57 -34 -9 -8 -21 -238 -47 55 -69 -19 -42 110 275 -75
3931 -75 -8 -41 49 -41 97 73 -40 44 19 70 -64 17 60 48 77 219 -52 62 -41 85 257 29 -89 23
3955B3p4J05j25M8MO9o3K12Nj92M3j11j28Q1j5J18j47KQ2l7J72k58P3J13M5j81
3981a36J21JJ24j84p3K1L9J57k40J20Q6j14J27j08K03j44k9M7on5j6P6l1R1j56
4006g9K32K9j48J5J64l21LK26j06l3L6QJ0M7Qj00l7J59j18k6K8qr3J77j6k64L11
4033A04j04J4J05j78j1J51j4j33P7l0N7p2p4P2k1J92k84J94N4j16p5p0J16J16
4057G0N8l15K3R9K2n7J89k14K0O5r7K22k61J17M4J06k23L01k36O0J1n1l9L8J21
4082G3l54L32o8P6j52O8k22J47O8n7J43k3R1j28Om1nJ13j05K8M1q2J60k2k36J02
4108d7K2O2r5J89j28l3J0L4O0o5J80j28J4L1j30j6rM4m9m7J14p7Q6J31k96J52
4134Ij08L9Q7n3Kn6j91L23R8l16M9J51j1J10j52Q0j36J3l9l7R3O7m4k9l1M0o4
$$ plain form
3955 23 -51 54 -71 -23 -19 50 -13 199 204 12 55 -56 -184 -103 -118 0 -147 -145 -63 -100 72 -186 -113 0 45 -136
3981 -136 -15 -14 110 -74 -147 -126 -87 70 -170 -50 36 -78 49 -59 144 0 -29 18 12 -43 -59 17 -14 77 -79
4006 -79 153 182 34 49 213 -108 -105 121 15 -18 18 26 36 83 91 -9 -46 113 -5 -31 -3 -11 -104 73 57 -207 104
4033 104 0 14 119 -59 -70 81 67 -66 11 -19 38 -34 -108 -36 -57 135 -149 45 99 -17 -92 -162 -46 70
4057 70 128 -187 -164 -65 -43 -100 89 -125 -105 -40 -137 85 -176 -59 -15 91 -132 169 -67 -7 4 -47 -86 -48 73
4082 73 -281 51 -17 59 -93 -25 -247 -100 -32 -89 54 31 122 -6 0 -41 -46 67 -38 -10 31 -51 109 87 -149 -47
4108 -47 -25 37 -58 131 3 -30 -20 14 74 9 189 61 75 106 -24 -40 -49 -5 -54 -101 13 -64 22 153 -143 9
4134 9 -99 -60 27 -26 -24 -80 -271 52 150 -166 -117 34 23 133 -19 61 -75 -62 -101 -138 -45 22 -22 -51 -82 -42 -106
4161a06J33Km3J43j86J85j76Q3N7o3n7j47L40k06J17l00K44L1k10J45q1O0j10
4184a45Q0J08J1L1k13j1R1K3K3J96j72P5p1j51L5J90p4j6o7j03J44k09K27r0J3
4209g5L58k85j0J2%L9k02K75j10o9J68j29k1kl0J12K6l6j54J49J58n5k14K13j79
4234f1QJ19l7M2r6R3r9J50l8j9o4J69p6Q0k33L7J33j51qp5J00k5n7j30%L35j4
4261H3q0J36j15Kj9OO5j16O7l8J00P9r9J13l11L18k12J02J7l0N3j19M6Q1r5J34
4287A68k1k70J94O1p2o4jN5o5K18j59K7p1j37K00j92O7J0P6l8p3K8r0K02L7M1
4313A31j29j93K10j86O2nO2P6j73J10J40k28k2J90J1k1J12n5N9o4p2q3N1j3MJ11
4339H5N2k35J27j75J11J66k47J21J4R3k25J55j45Kj3K61l09J41j69J40j6J28j55
$$ plain form
4161 -106 27 29 -14 129 -57 128 -48 35 92 29 -28 -175 165 -41 76 -224 20 51 -159 -14 -95 -35 -145
4184 -145 -65 43 54 85 -128 -139 -48 -25 -2 194 22 97 26 -125 -90 100 26 10 -57 -160 -16 -225 2 -88 -75
4209 -75 283 -2 -12 0 0 39 -163 112 2 -67 101 -28 -49 -51 -81 31 57 21 -133 16 174 119 -95 118 -61
4234 -61 -53 66 29 71 -25 68 -31 119 81 62 -2 167 91 171 -62 -25 108 -43 -51 -126 -26 -51 -108 -238 -238 97 83
4261 83 3 139 24 26 7 13 78 -38 29 -9 91 170 71 184 -127 191 -21 81 98 68 121 2 48 129 34 168
4287 168 147 -123 71 132 60 -4 -5 50 -15 203 44 71 0 -137 63 -129 -62 -52 24 -14 -87 -59 -149 53 90 131
4313 131 2 -191 19 -167 -105 -110 -48 28 -145 -35 105 -123 -145 45 56 35 147 92 151 87 15 -68 -17 -30 -26 85
4339 85 137 -98 29 -146 -35 131 -116 5 19 112 -113 42 -103 -101 -114 147 -162 -21 -190 -50 -66 62 -93
4362i3J42j11J46j85O2K15p4j23nJ21j20Q5qJ29r6j42QM0L7o9J60j93J24k1r6
4387f7R8l6k1k60L78j13K37k25j21K50q9M9k84K02P5j44K41k92N7J60l21P1J74
4410A9j05N7k6n7J80J3J2k44P7K1K1l2k2P3J1J41L8r7j87J78L1k19J51j12K15
4435A37j39r9QN5J4j01J96m6n9P3K7R1k49J43%QO3k03J77K9r1j80J30L5L3j76
4461a24N6J8J1l0M3k4k2J16Q0l6n2K7r9l5J35p1P7j3j46mR5K9j07Nj2M8L9j52
4489a48J49n2J50j13L7l7O3j32J08Lj30J75j91M7J05n8K3jk40L29o2j51Q0K0J78
4514A52k68JJ37k65L03Nk68J90L0K3k18J36k5N5j19J97Kj36J14n2K34k74K04j90
4538c2K6K33k36l0L3j15Q2K0J1L9j69J50R1j2q6O7m8L3q9P8K7k20K11L5k52J60
$$ plain form
4362 -93 49 -62 84 -101 -39 176 102 -21 -26 95 -25 60 52 181 85 -57 -49 -9 28 -41 119 -74 50 29 -67
4387 -67 31 -5 -26 -286 92 -21 216 -9 -130 120 31 80 -204 -2 73 -71 170 -122 -65 95 -226 -155 19
4410 19 -86 -29 -55 -112 68 81 93 -151 -74 -53 -32 -64 -86 -13 -2 139 177 80 -107 71 102 -117 34 -78 137
4435 137 -2 -101 -93 -38 -24 -125 71 25 -34 39 66 157 -92 51 51 59 122 -81 96 125 34 -146 -16 19 52 -124
4461 -124 -68 -50 -39 -69 -26 -50 -72 44 124 88 36 63 -36 -71 64 -7 70 57 -89 -93 2 31 -76 -71 -83 -35 4 -148
4489 -148 1 -51 99 -14 23 -14 49 -83 25 28 -102 73 -118 -71 34 -24 -1 -2 -242 87 25 -126 -46 -26 152
4514 152 -116 -115 22 -243 60 65 -203 -13 17 40 -178 -42 -67 -12 -131 66 68 -68 46 -6 228 -46 158 -32
4538 -32 -6 227 -9 -39 -6 -121 -39 -19 -8 31 -138 12 103 91 5 72 24 57 -32 46 73 -147 64 99 -153 7
4564GM7j42O0n8m8J68O3j3k01K82k87J21k0M1N8j56n6J61l1j71K11j76J51J0J0
4589C1j2K1j99K40r3k04J60O6j79J56J79k40k0J22K5J18k56k1J32n7l6r5P9J53
4613G0r3J41M7k72K08j76JJ70r5K0k8j6r4J15J6P6r1N4J01j82K74j49K8j72Q2
4638C5l9lJ5q0p9J05J29j14M3J11k45K84j89M5k6L0M2j29K75l03J92r2q4N1J26
4663A00k02J95p2n5O2j28K14j70L0n6L4J49j28J73K9k16J57j15M8Jk46M4J37n8
4687g3J89k72Q0Q5n9o1Q2M6J35j47j72K38m5J1M4M3r7r4J20r5N6J18j92L2N1r7
4713g4Q0j98J62j5j3P6k9j00j6J27PJ56k83J47L3q3K4J59p8j31J19m1o3oJ8j04
4739a26J64j64M6J06N6j29q4R5l7N0k0K16j42n7j6R5M0J3j42j9l5J02j9k39L00
$$ plain form
4564 7 54 -88 -28 -86 -134 34 97 84 -117 165 -122 -1 -21 20 78 -78 -134 27 -4 -175 36 -140 11 21 31
4589 31 19 40 -159 81 -12 -216 -56 10 -169 -13 166 -74 -94 28 53 171 -85 -106 26 -31 -67 -162 -83 70
4613 70 -23 118 165 -107 101 -75 -74 96 1 21 -7 -23 -117 -2 14 90 -1 53 154 -28 246 97 125 -47 35
4638 35 -4 -7 8 -72 -151 -46 83 -31 12 123 -122 162 -27 18 -8 22 64 -65 210 -93 99 7 -77 -26 100
4663 100 -102 93 21 -34 28 -100 114 -56 -26 -82 -48 101 -27 146 175 -41 116 1 49 50 -196 -152 -15 -73
4687 -73 116 -156 -76 9 -50 -111 -29 17 152 5 -167 71 26 37 81 124 27 -67 53 -42 14 132 -60 -28 23 -74
4713 -74 6 -192 -30 -45 -58 18 -11 -111 -127 0 7 163 -120 27 60 -23 1 160 82 -49 70 29 -34 -40 -22 -126
4739 -126 38 -126 -80 26 82 -47 -131 -36 -73 -23 -43 173 31 -26 -42 53 93 106 -36 -55 -90 12 -7 -246 54
4764E4Q9n4o9L3r2LM9j6J01k67J07J22r0O2j25M4j13J47l2P7mkj19J26r1J7R1
4791D8o6J05j76P0M4p6j7r9L42j56j4m9j14K92j21n0O3m3M2n5J86k19J79L0r8
4816D8K9JJ08k07oM0J07J3j89nOJ16o0N7N7k62Q3k1P9n6J59n7K2j34J91q0j02
4843f3J47j23K3O2j09O5j35J04O5N9j09J35j90N2J5o4K51n7q8o3L4n4J25l8qj1
4869B5j34oP2k9j22J59o3K28k6j07j01Q0L48l08l6L4O8J2j8jj16J40j47o2N0k4
4895h4l1J73p6Q7n9k9j1R8q5J31o7PL5o1k9O0j56N4p2J1J80j14R2l4R6j57K32
4922A91j15l2m9M2%j27P1m3M9j3k8J1J16Nj46K02k97P2P8j02O5J2J26Q7j89K5
4948A1k06K43l8r5J16j66J48n0m8J86j4k78J02lK80k90K5J42j27L5n1R3r1J99
$$ plain form
4764 54 143 89 20 53 -39 -36 13 -3 98 -169 -62 60 -30 32 -93 -49 -162 -15 -47 30 26 24 -95 31 -60 -43 48
4791 48 -18 87 -89 -19 25 -51 -68 -167 175 19 5 -44 -158 134 13 -37 26 -17 25 -30 156 -63 116 146 48
4816 48 77 78 186 -21 -27 13 120 133 -56 -61 -55 61 1 58 115 -147 -64 -85 -6 -62 97 40 62 -72 119 39 -63
4843 -63 84 -39 -16 46 -63 2 -133 -29 36 95 -14 121 -69 -17 -2 -66 185 128 40 -23 11 -43 82 44 36 25
4869 25 -109 -115 -43 -72 -194 -35 -98 130 104 -3 -104 -24 324 16 -20 14 82 94 76 75 -41 99 -48 -110 -60 -84
4895 -84 -115 58 -18 69 10 -19 -30 68 -17 114 47 54 89 28 -1 59 -97 -43 -115 -104 76 -38 54 20 116 -41 191
4922 191 76 44 -5 37 37 -90 -19 -62 -13 -26 -54 -43 73 78 -68 134 -163 -91 -13 -115 -50 -38 88 175 -14 11
4948 11 -195 48 10 -85 31 -135 13 -37 -85 101 87 -191 -89 -92 188 -102 -77 65 -62 -27 -78 15 -76 123
4972A23j62J07k98L28J05j99K6J39r0l2O1j4j20q6J90l6M3Pj25m7O6K79j49k00
4996h4J65j83N4j19RmK04r0J70j74J24j33j1N2J8RJ0O0j93P5r4K07r2RJ72o9j38
5023d6j60Q5J75j31N3M4j84J19J93o8k20J53l4N4j6k7k01K46J93j91J49r5k5m2
5047B4p8J31j60Q3Rj24J46M7m7J85m43K56J3L8rL5J3Kj91K5L3J04p9j61J06l6
5073g8N3mr3k0O1J58j02R5J7j65J0K08j83j19K71o1K3l5j01K16Jj87j5J52j47
5098d5n5J65j66MJ55j41Q9j53J73p5l3J63j03p2N3J17J9k11J29j51O9mn6M2K43
5123A56k39J05j28K16j91j48K31o4J62l1k02J71n3j37J03j2J61j37j42K46n0j08
5145i1J12J57j71j1J50j61M6j97K50j77L5J68j34k3j35J50OR7J56j77k3k16L39
$$ plain form
4972 123 -39 68 -230 98 203 4 30 169 79 47 108 94 -26 -112 78 42 85 92 -33 -80 -14 265 116 -84
4996 -84 81 -102 -48 -167 -158 -162 42 -48 122 -52 72 -61 -72 -20 -2 7 17 77 -116 -41 -135 72 -20 -11 161 92 -46
5023 -46 -206 -121 54 -77 -24 20 -164 -45 148 80 -140 13 -21 33 17 -10 -211 35 228 37 186 91 66 24
5047 24 -54 77 -83 0 9 -115 31 78 31 216 -227 29 42 80 71 106 119 121 -70 -45 -12 92 13 -148 -42 -78
5073 -78 -25 -29 -122 -142 -81 77 -25 70 87 -78 -68 140 -43 -162 109 48 71 36 -65 151 152 -35 -50 102 -45
5098 -45 -100 65 -101 -97 58 -83 6 -147 26 -49 -82 81 -22 -94 -41 76 95 -116 13 -138 -69 -73 -129 -87 156
5123 156 -83 22 -106 110 -81 -229 2 -62 100 69 -133 38 -15 -152 -49 -61 100 -37 -179 67 17 -91
5145 -91 21 178 7 -4 146 -15 31 -166 84 -93 -58 110 -24 -47 -182 -32 -26 71 227 50 27 -189 150
5168A50j49L6mk53K19K2k7j41K1J84rj76K02j29M3Jj01l1K75j2k03O7n3J6P7M7
5194G2k5p1q2m3J25J59k18K63j7j27P8j77J39O7k96J98L2j58OO0K33k10j40J9
5218a13K7K08j30Q4j60Q3K7j32Q8P1j9p2J20p9J45k20J07k02K44K8j22J00q2J04
5242A05pj03J02J6j70J24k74K27M6j16J47j49m2L3P1R3p2O1Kr5Nj09nJ84n0K8
5268E2j24J38j30j9l0J87j26M1q7K17p5j28R4M7j73P3K45k90O5J13J1kL1k13J45
5293F2q8Qj70K23j00L7M9Mp9L7pP6QJ31l01j6J69j34R9r4J09J24k03K16j41k2
5319cLJ75j75O7l1j60L8J34k7j31K62j47J10j96J07k1n8K6J32n2j7j2rn5j29l0
5345a99J55Q5K0M1j54Q2k4J04k13K24j41J22k08J67J75k91J4O9J5q3K4J59j2j06
$$ plain form
5168 150 1 37 33 -220 -1 21 -6 -147 -126 58 49 -127 75 -54 -11 -10 -111 -142 133 121 -82 -15 -68 -52 25 72
5194 72 47 -24 -106 -149 -24 135 -83 180 163 36 114 -63 76 143 -153 45 77 -81 -75 -15 218 8 -132 -113
5218 -113 -86 122 -8 76 -84 -1 26 -106 -18 53 34 -38 82 3 148 -72 35 -167 77 105 -17 83 1 105
5242 105 98 -5 97 113 -57 67 -207 20 66 -50 97 -52 -94 -61 10 103 31 92 94 -1 4 -105 -110 74 24 52
5268 52 -72 66 -64 -83 -113 74 -52 -11 -98 119 44 -84 10 57 -116 -43 202 -88 -23 90 101 99 130 -83 62
5293 62 -26 -18 -188 35 -65 -28 21 25 -54 -17 -24 52 60 191 -110 -126 43 -91 8 -86 23 147 -56 160 19 -3
5319 -3 0 175 0 67 36 -124 -86 48 21 -110 152 5 115 -81 26 5 -53 -27 105 53 36 24 15 -40 -169 -199
5345 -199 -44 41 61 102 -52 30 6 110 -103 121 -20 102 -106 61 236 -55 -41 28 43 -40 -16 143 131 25
5369B5k9j4MP6Q3j41N8j24N6m9l7J78K2q0K3q1R5q4n4J64k2k4J5n5n7m0K29n0
5397H7j24o1J19j9O9RM4Pj56n5J5L3J4k0R4o7j8J58q1r4j55N7R4L9o2J41P0r4
5425D4p4J24p1k71L56o9Ln3J55j37j09K84j30j07Lj59K02k1l9J75l7J2j10N2L0
5450E3j38J26k6L6K5k54L45j67J24l3j60l8J55n9K6k9Q8j21J12l0%J6K9k43P6
5475h7J55j24O5m9J01q4L6O9k00O7M5M8R5q1k65L38l9j19J00j93J05J52p8j25
5499f8N9j63M7Q0K3m1J79n3j1O1j05R6j9p2l9k9L0N6n6j88K36q1k43L57m6j2n4
5526e6N2K8P6j22J29k40Q4J0J24j18Q5l26L58r9J32o3J3J01k82K35k07P0M7O5
5550I6j10M7o3Nn0J86k3l9J34k17j37J36l3J0M7M7M3j09j03L18k25j7L0k9J0P7
$$ plain form
5369 25 -4 -18 -14 62 145 4 62 -62 -6 -55 -92 86 108 28 51 -30 65 -19 -73 91 69 45 60 5 -52 -92 137 87
5397 87 -37 -98 21 2 71 80 124 131 -25 -80 -65 -32 -18 -38 56 -11 -29 129 48 -46 -201 -144 -50 -11 -73 68 138 44
5425 44 -30 94 23 -248 108 39 42 -11 144 7 -102 182 52 -55 -52 -211 -9 -30 -69 106 69 81 -29 23 53
5450 53 -85 41 15 51 76 -178 167 0 124 91 -69 -107 48 -11 15 -14 74 -47 65 35 35 51 80 -163 -87
5475 -87 68 -56 9 -40 61 -23 13 82 -118 -51 -6 42 137 56 -209 129 90 -29 71 -122 -17 135 57 -68
5499 -68 -9 -172 -125 -45 -22 -63 116 63 52 113 8 104 85 13 -26 -55 -25 31 -25 -213 23 -58 -301 56 10 -2 -56
5526 -56 -4 24 100 -22 107 -133 -49 -39 85 -33 52 -274 84 -15 117 54 67 168 -114 121 -86 -16 31 96
5550 96 -14 33 -30 -25 -75 111 88 49 183 -34 -171 -35 -68 -58 -11 36 79 -30 -133 185 -40 -57 -27 -56 -46 31
5576C1j70J26J13Nj09J0k9J23o6M2j1j44K60j43mJ2J1r1M1j20K56k15J36j59J23
5601B8N7k30L0j2J04R3j58l4J20r5N5J43k72K41%oKJ9m5M3j18K04k05n2N3K51
5627B16j22J3p9M5pLj31J7R0Q4j25J15j57K41n5j79J01q2j52K96j83rj34K43%
5652D9j89J89p7M9JN1q8O1q0m9M1Mj81K39p3Pn2J48p3Q2n4j26K47q6l2N6o3m6
5680d5L3j33J40K7O0j59J48J3p3k5j00J40j9n1O9J35j91L9J35L8j74o0j1P6j32
5705a20J22o7O4J0p2M0J00J06l65J82mk3P0j15Q5M6p9O8o1J53%O5k37Q9j1k5j16
5732i5M6J74m5M5Kj54N1m1Q4O8k90Q3N9P6l8o6J09j62L6R8k12J98j38j2M5J29
5758E0o8lJ5o0Q3j42J71j53J39j00R3L2j56QP1J3j91J33J05nn5Km1O6J39j08k13
$$ plain form
5576 31 -139 -13 100 105 -4 6 -23 100 34 76 65 -79 181 38 34 46 57 -34 7 -113 143 -72 64 -95 28
5601 28 85 -145 -115 -127 -23 70 -88 -122 -2 -97 -42 101 -171 70 70 64 66 85 40 83 -35 169 -36 -88 -35 216
5627 216 94 107 28 73 66 69 -62 -45 45 129 4 119 -38 203 148 -31 70 -12 -164 132 -51 -60 -194 49 49
5652 49 -140 49 -28 21 22 73 -15 46 -34 -83 -42 -38 -219 20 -53 -46 -98 50 -23 59 5 -121 126 40 8 64 1 -45
5680 -45 -12 -145 -5 22 82 -77 71 84 11 -14 -114 26 7 -44 25 160 -31 8 143 181 7 -53 -64 12 -120
5705 -120 2 -65 -1 9 -63 -23 77 183 -182 0 -4 -27 43 -72 13 59 -20 48 -13 140 140 205 -32 57 46 21 -95
5732 -95 -49 125 80 125 127 -27 24 -17 67 135 -155 -72 -13 63 25 -41 68 -94 -58 40 -172 26 -112 -124 -79 50
5758 50 -18 -21 -6 -66 17 -125 46 -107 32 -68 25 57 -99 -91 -20 -7 -198 -65 40 35 -20 -18 -59 7 146 38 -175
5785a75J46J56k86K12j12KPJ57k3j78J01m0oN1N5m2J39j52o4OL7j7m0J06j46R3
5811a3j8J11n8J9n6R2j73M7J67j48J75n6k29J19j65K51K1j37N3j18J1J19n3J46
5835A07p3l9R1k39J45R0%j57Q4J01lJ3k33K6m3J6K23j93j2N9r5K7O3J22M0r3j95
5862a68J97J29k43rP0J24j18L7J11j67J64L2j98R1n7q6p7J03K24j00p5l4O3j06
5886i3K00j14K03l09M8K25j84PK00q6o7M9m5j18J76j36L1J6L6k00L16p9j28J19
5910F7q7P4j5qm3r3K16r5j31L0J78k44J55r4q7J65P2j38J56j72J64R4q1j13P5
5935D5l8j15%K79j41O8K2k31J43m9q3Q7Qj38Q1J36m0j23oK9J86j40m5j2J59J38
5961B20k11J00n2j00N1Rn1j19J7K02l2J1l9r4K8K53r5K9j65j2P7j73J2L5R1oj34
$$ plain form
5785 -175 -29 127 -159 53 -59 -57 -50 107 84 -94 7 -33 -39 12 67 25 164 12 -52 -46 -9 -26 -66 40 -106 -13
5811 -13 -31 80 22 41 -15 77 -96 -49 118 -30 145 89 -140 -21 -186 65 86 -51 2 -116 -105 14 -39 107
5835 107 34 -5 86 -153 -8 82 82 -75 9 110 107 120 -113 -87 -130 -114 109 -84 -96 -37 -132 -105 -42 80 120 27 -168
5862 -168 29 158 -85 -94 -24 100 -18 19 130 -37 127 159 -39 52 -5 -91 -168 -65 159 59 -16 -50 13 -93
5886 -93 107 -7 196 -113 -65 160 -24 -17 183 97 30 79 34 -84 92 -44 -13 3 39 -161 155 76 -52 67
5910 67 -20 54 39 31 -12 -105 111 16 -115 -85 93 -151 4 -90 -177 -12 60 -78 78 -94 70 164 83 -30 45
5935 45 7 -108 -108 171 30 98 120 -111 32 -17 -100 -13 -5 -143 -62 74 34 -89 -95 -66 120 -20 -65 -77 82 220
5961 220 9 109 57 -43 8 17 -34 -153 -136 66 34 45 6 -88 -60 193 98 127 -38 -50 27 -146 -134 -99 -8 -14 -148
5988a48J80j37L10o5r3M1r0o9N2K24k33J27k03K37k46m8J15N8Nq4j8K5oJ1Lo4
6014a16R6J30p8O9k18K36m0k4J2j10J69j54k%J31l21J82Q3j50J42o5J8L5l3j9
6039b7M6l3n0r0J74j14k1R6k1J94j22j82J59K6k0k9m4J77k06J35o4m9P3j02K9
6064f5K7J22n6p3J58J0k10M4r3K05j19Q7n4L1J02r2J63n5k18M7P4l0O0j17L3r7
6090a16J61j21J28m4J03j90l5J90J10n9q6m5n2O7N6r2R3K0k07J10l2L24k58J3
6114C8q0P1J2j89P0R9l2J79j74j98L73k65o0M9nJ9J91n9m4J68j85J64j42j6%j8
6140c4JQ9p2L0nkp3Pj13J80r4n4J96j12O6j23J78J03j24m9o1RL3Q2k0r8o0m5K33
6169F8k5%L2N7k96N1P9J13m5L4k9j09J55Rr1L8L6m7p6J1P7o7PQ7j54p4J82l7J26
$$ plain form
5988 -148 32 -105 205 140 47 88 -2 -71 -19 205 -28 99 -104 133 -113 -161 -46 12 17 -67 -85 -60 -66 -55 -52 -116
6014 -116 -20 110 32 101 -117 119 79 55 67 -43 126 -28 -30 -30 101 -220 -38 45 -105 37 -28 -10 25 -8 -27
6039 -27 19 -14 -64 -154 20 -94 -115 -19 -40 154 32 -150 9 35 15 -14 -58 119 -87 48 -16 -65 8 -94 -65
6064 -65 -38 84 28 -45 113 123 -87 -43 -136 69 -50 37 -17 14 116 24 187 132 -86 -39 35 5 65 -52 -19 -116
6090 -116 45 -76 52 8 111 -79 -114 76 186 127 41 -4 -56 11 67 -25 68 88 -119 -9 -41 283 25 38
6114 38 -42 29 41 -148 -78 21 -11 168 -6 -204 169 -96 -156 -107 -112 -93 98 39 -5 163 -22 142 0 -16 -16 -34
6140 -34 -33 56 -16 14 9 7 -66 -59 -172 8 -86 -140 56 -56 10 -113 65 168 44 -5 -66 -57 -24 58 38 -60 -120 -165 68
6169 68 43 43 75 132 -164 -113 -34 79 34 68 39 -70 85 94 3 41 77 30 -46 -35 42 -25 -18 69 -85 -159 23 -14 112
6198A12q7M1j36K9q5J65q7M0J4j33J78o6j47P8M7Q7m3j26J44M3j91J10O9p7j90
6223b11J28O7j00J06N2N9j31J07l8P8k07L6K3j6N4J12j62l8P1k2l6N3mm2J96j23
6249A2j07J14j70J91lK0l1nj03K36p1k59L11n8L6J10j92P1k00R2j15J14Q6J0j74
6274h5J17j02J92J0o6j04K32k28Q1r6pK33k79J89k71R2J10Rp3Q7N1n3j42J80p5
6299BJ9p9L6P1J7rQ0j74J11L5j39J43l6l2m9J19j02p6j9k0L5R5j44m5P1P9l1m4
6327h6K35k93J25j37N6K8M2O7Q3k3j82J8J46k18J51P9j79J66J28p9p8o4J78k43
6351h0O7o6j7K17j19k6Q4r4o0k9J49n3O8p2k3J28J1Kj58N1J11j62m2O2k13J96
6377f8M4K25l00m2J86m1J2k2Q3O8n8j65J25m3j4J97j82j34J03j44L10n8j38r9
$$ plain form
6198 112 25 66 -70 -41 -126 39 -48 -8 6 -127 51 -15 -162 -84 -37 50 7 -119 25 68 -123 -13 56 -21 -211
6223 -211 -83 -16 -116 -10 42 101 -30 77 39 117 -90 -54 -31 -47 7 119 -43 -81 -10 -32 -68 -15 -19 -61 135 12
6249 12 -95 19 -151 40 37 57 26 21 -82 154 83 -176 135 77 113 223 31 102 -98 -6 -121 -7 79 89 -85
6274 -85 32 -70 122 132 66 -38 194 -34 47 -49 -56 177 -102 87 -184 -92 18 27 -46 41 92 39 -103 77 2
6299 2 21 -58 -22 49 66 57 137 -37 74 109 -30 113 77 45 -4 115 13 -63 -82 -102 -67 28 -116 -161 -90 -11 -42 -86
6327 -86 149 -144 -19 -156 -100 -72 -30 37 120 97 -85 -67 79 -139 12 91 -88 78 206 127 49 -15 163 -80
6351 -80 -13 -79 -96 121 2 -24 60 -34 -94 -123 26 -27 41 -31 -54 74 85 87 -71 -20 91 -71 -113 -51 -264 -68
6377 -68 -24 201 -99 -141 45 4 16 -6 77 145 87 -78 47 4 -10 187 5 -129 -26 -170 140 82 -56 -155
6401a55R4P4Q7k40J35k5jK7Q6p6k13J47K17r0j67K3j26K73j04J16p8J4P7mJ95
6426B86k56j61J91j71R2P6p6m2J27j04L3J14j55RRPJ18j96q3K78k91J56L6J94
6450A91j93j43J52J2q3P7j45K60j50KP9j05J88r7j04J71q6J1k1L7j12N4o9r3L32
6475A65j61J57j51L1Kn0q4J26L8p8n8m5J65O8k34N6j9l1J00l7P2N3j57R7j90K03
6501C8r1R8q7j4J96j99j1J96n8K4k10J58j28J69q7J61P1k21J3o2K5J20m6mq9j12
6527a50J31J67k26P4o3R3K5o1p0L4R5L9R4o0j41J0j47K51j0o3J64p5j08J32k19
6552h4Q7M6j13J53j58R6j54K13k5o8M1j07J23p2R9q1o4O3J2M2k7n4N1j72P2N5
6578b6j83L01j88K4MP1O4J6q9j7q3J37O6p9o4m5pJ22J78j65L0R7k09nmR1r1n0
$$ plain form
6401 -155 -61 13 100 -140 -5 -30 -31 -4 82 6 -207 -60 157 67 -100 -77 -203 70 -34 82 4 18 95 91 286
6426 286 30 -131 60 -111 -19 57 -19 -61 66 -38 -5 109 -46 -37 -28 -21 97 -99 -182 96 -195 -39 -3 191
6450 191 -2 -145 7 19 -64 13 -132 128 -22 -20 59 -46 142 45 -59 112 26 37 16 53 -59 -5 -74 -167 165
6475 165 4 161 10 41 43 -7 -91 35 73 -5 -63 -108 57 125 -109 -53 -72 -103 -3 -40 32 85 -72 25 -165 38
6501 38 -53 45 -42 -56 140 -59 -70 126 68 92 -118 40 -88 81 -6 155 226 5 18 -44 -19 101 55 51 -38 -150
6527 -150 -19 148 -78 -4 -67 26 51 -10 -80 -46 49 88 182 122 -19 -9 -156 95 85 22 186 111 3 135 -84
6552 -84 3 49 -64 89 -69 27 -127 86 61 -7 34 -73 50 -22 77 -4 -68 -5 7 49 22 -32 19 -153 -81 -26
6578 -26 -209 92 -96 -72 -68 3 67 83 -6 -23 -106 31 97 18 -46 -91 -98 24 202 37 67 164 -45 -50 -54 37 -54 -104
6606a04K47l2j9q4j01J43q3J61l4j07r4R9J40k37k0Q9n0R0K2J1j1J1J8j92J37
6631@j97L33j54J33n4N1q2lq6l2O0K5M0j8J14j53J32k25J17p6M7p4K13m7j1q8
6657c5K30j29j12j0K07j67K7O8q0p3N1n9K23q6j04R5p3L9o2J60j9pj82o8N2J48
6683C4q0J3J71l66L17m0j77J07o3l3J68N6k84J96o0L2pN3j06J56k9M9p8j56J17
6708a0q8J64J87m26K10K38k37j33J89j42j8J66j38j17J59m7M8qO1j07j23K68L3
6731A29j56J84k04k3K32j91N4j81K12k27K04m4l4P9m0j22J18J31k53K4J95j50
6753f3m1J83j60j80L62j83N5j17k0J35J9J3n9Jn7RJ62j8j05J48l08M27p9r2R9
6778A31k10o7K31p0N9q9L5k7L6Q0k2m4l0K9Jn5KJ04q6J67mk23q6J44j21m3J47
$$ plain form
6606 -104 143 111 92 8 -93 50 -33 128 94 -13 -107 -8 132 -105 -125 -36 -86 4 26 37 26 37 55 -137 0
6631 0 -197 136 -18 115 61 112 30 27 -59 -91 -31 -6 34 16 130 -23 109 -116 1 -75 -28 -102 111 64 53 -35
6657 -35 195 66 -46 -56 151 -16 11 79 -1 -74 -23 -82 141 55 -49 46 -27 12 -50 110 91 84 -98 -166 -114 34
6683 34 -46 -33 138 -228 89 49 -128 -21 -84 -117 51 107 -177 19 -41 -9 -16 37 -69 87 58 107 29 -127 -10
6708 -10 -98 66 253 -173 37 275 38 -95 94 -48 -66 100 -38 -155 4 -43 5 -3 58 -49 -172 96 129
6731 129 -27 157 -47 -70 162 -29 25 -156 56 -171 33 -11 -45 34 -6 -128 -10 121 -132 -108 87 -63
6753 -63 -104 79 -81 -261 101 -82 -27 -144 -164 -29 -10 3 -56 -55 -112 -103 59 41 -64 84 -224 203 124 32 131
6778 131 -79 -146 85 15 74 -15 20 -7 29 109 87 43 13 42 43 -12 -10 94 8 175 171 -52 -138 6 -115 -158 -11
6805a1j8J62k02J43j09j31L3R3J44j15J47k32K7K55j61J12j91R4K06l49J35j73
6827a41J10J07j36J47p1O2p5rN1p1k5n8RK5P4J30Nj13j18K2l9R9r9k4J05l8J46
6854G5k7j70J82j09m8k7J26O2l08K60l4J05m7L3k0J41j54M5k23J62K5JN5j48P4
6879C1O5n1m5j54J05J12j19M3n7J29r4P4j77J13m6K08k29J58m2n6O8q3J25j96
6903a18PK36k13J48k22K46j36K4J39J1k53N6J17j14O4J44l1j67J24m4J22o6o7
6926Gj29K13j72J07j69L9Q4PP3j26K65l71K50k0J6j21J53k57J36K3k4Q7p1l0q5
6951a15K16k7P9k63J88p0P2o3n0kJ49r7q0j8M1R5j21P8l6J07j26Q7R3j23L4o4
6977a6k8L1J26j22k1L4R9m9mn2j44K5K16p6p5N4K50k21n2M4j06J72k39J45Q9j12
$$ plain form
6805 -11 -29 133 -69 74 -35 -166 -133 -40 104 -11 136 -96 -69 186 25 137 -54 40 246 -103 32 -141
6827 -141 -31 76 -60 87 16 78 3 -6 45 -26 -51 -109 -100 -75 -1 129 134 21 -97 -75 -114 -15 -114 -138 -33 -71 75
6854 75 48 -122 60 -49 -97 -124 2 64 -244 16 -18 87 40 73 53 194 40 85 -138 24 49 50 105 -43 31
6879 31 96 45 0 -154 -49 63 -56 -13 -70 59 -35 39 -138 -25 -71 137 -92 66 24 -32 36 -47 78 -118
6903 -118 -111 125 -88 60 -162 84 -52 -28 111 122 -131 -75 42 -72 -8 136 105 -62 62 18 140 74 7
6926 7 -122 91 -81 26 -143 -104 -20 -13 60 -66 199 -172 78 58 74 -47 106 -151 -15 8 -16 71 0 -30 -115
6951 -115 101 74 153 -110 78 8 80 17 -33 -35 114 17 -63 -81 -40 55 -66 12 -24 83 -43 44 137 14 48 -16
6977 -16 -44 -13 113 -9 -30 4 103 54 50 -2 -146 -121 95 19 -56 -2 248 27 -25 19 -87 85 -154 -9 80 -32
7003c2K25j64j48K0Q5N3JJ38j19j84N4J48r9J25p9l0L7j14N4m3J9J20j27J99j15
7028B4k6n9J00L5j95l3J01J45p6K1N6qL8j31P2k15J64J34j19M1j58P9M7o0K46
7053B23k67KL1K15N9l07j3K29j54Q1j78J0J28q1j6L4J9q1O2j19J06l6JJ24m2K9
7079E9m9q6j11N9K64J2j42p4L9J97j57n1oQ7n5K15l15J48J0r0J21K1j11N0k62
7104b27J39k5R7R6k00K24j18L8M5J2r5k03n0K93R7J65m01M9J59l6j5k1j1j20M2
7129f6J16j83J28j54L50j07k35m6J67nJ78P9l56J01J54k26P1J74k6j74L1o6J60
7152F5nmq0j14J70P6o0Nj3o2J53j99p8J11M3M6Qj90J43M7p7M1J2Kk23K16o4M9
7180A8Jp4J24L9k95J69L9j76K59j28J9r1J11j1Q7L2p9o2rq6K23p4k7L9j59J70
$$ plain form
7003 -32 193 29 -119 -99 -14 39 40 178 59 -125 -71 77 -22 103 24 -6 31 -83 -29 -72 -53 67 -60 139 24
7028 24 -2 -61 39 74 -121 -154 -53 92 16 37 93 85 123 -8 64 -151 13 147 28 69 -89 -10 37 -23 223
7053 223 -44 -42 -11 204 263 -44 -57 172 18 99 -79 -69 59 -22 -38 -4 15 -66 -4 -123 -17 -53 -52 72 30 59
7079 59 10 -76 -187 -128 136 148 6 -68 -29 168 11 -40 -46 41 -14 201 -114 34 44 -46 75 96 -15 35 -227
7104 -227 -88 -113 -16 80 -120 104 -14 24 69 81 -14 -217 -267 26 123 288 -113 -64 95 59 44 23 12 -108 -66
7129 -66 50 -133 -5 -159 191 84 -151 -197 -30 -35 143 222 -134 -33 121 -105 -34 140 114 -60 -29 -95 65
7152 65 60 56 -24 -138 32 108 48 53 40 -22 131 -68 -146 -35 8 54 62 -128 15 62 -15 26 38 40 -183 33 -31 18
7180 18 19 -55 69 108 -187 -18 21 -155 104 -24 -5 -96 15 4 91 123 44 -18 -27 -113 110 36 9 48 -111 59
7206E9j45J58L4k20J48j21j5N4J42j16j4O5j3j74J4J16M7J11j21J4Ro3R3l00J64
7231g4o7J2J42j4j32J35j13J61J00j64J96p7j53kK72k57J26k17J73l8J49j89L4
7254CJ6nK3j53K40j81J86j82K03j26Q8j78K7P2J23k66K09j77jO3P9p6J13j41J20
7279G9o8j76J34N6n4j23L33k44o0J59Nl12K23K14j40J42l18J67Q5j85N7J25k04
7302a05Q4J24m8m6L3k5j68J9M6N3m0j7K61k84J88Q7l94K30j28Q4J52R4l04M8j9
7327g5K38k7q3NR1l6r1K9k3N5j17J75j43M0Kq1N5r1J29q7J47o9j7j15M6K6r1O0
7355d8lM4M5l1N4n3Q2K9k19R5K5j6rM1q8K5R8k8j82J36J40k30lo3J92K28l55O1
7383c3J35k20P5j37L01k87J78k5j07j7P8J18p8j44K64p9J4mj74J42j08Q8l9k2
$$ plain form
7206 59 -86 72 106 -114 34 -87 -102 -48 94 -22 -36 29 16 -158 -144 -28 19 130 9 23 32 -31 62 -238 -74
7231 -74 -141 -129 13 -1 -133 2 -111 50 150 -14 182 105 -48 -50 222 -35 91 -126 47 9 158 -31 3
7254 3 19 14 37 -116 124 -57 129 -53 150 24 112 -66 -39 33 156 -110 99 -78 -79 -16 63 -13 100 -41 79
7279 79 11 -165 -31 25 -29 -152 181 -63 -123 36 41 -271 -48 166 26 168 -150 17 102 -83 -26 99 -105
7302 -105 -21 103 55 9 42 17 -151 -132 -86 -33 -73 -90 171 -113 75 162 -232 -2 -130 -46 106 200 -104 -56 -75
7327 -75 163 136 53 58 149 113 22 51 28 83 -34 141 -2 38 40 -41 14 -77 52 -35 112 43 26 -89 -43 -17 -108 -48
7355 -48 -51 -7 38 7 61 8 90 119 -100 -5 20 4 -5 36 -52 -27 71 43 -139 -3 137 -93 -96 -159 33 261 -94 -33
7383 -33 102 -118 -43 -180 121 -166 12 -13 -120 -137 -59 59 -19 -163 101 22 36 32 -142 0 -108 -20 -59 -81
7407h1J18j35J2J57M6q9Kn4J10k22P2O2o9K2j03K36j88K54k73J70j28J07N8o3
7431B1L1j43K68j98J05M8n7O1l66L60p1o6n0K9M5L2Jj84K71j53N5l7M0p0J7K7
7457A6j14K03j42qm6P2j09K21L3j70J95k30J59k3L3j20J59q5L8j14R7j35J10j18
7481g8M9J34j57J43j99n7J48J1lM3O4p0J5k4L4k5M1p1L0J39j47r1L1Qm6o6J83
7508C9n1m6Q6Q0j02l1K9Rj12R8k0j9K0N7k50J50J02j53L68m59K42p7M7K23j88
7533D2nJ40j27m4q7m9L28k99K6k1M0J12j8l7N3o3r2J55j45R5n9K02j00m2J17k99
7559a77J14p8J20j7l6K85o2m11J72K68j10j1j51o0J06J19m7J46l08j13L41j10
7581b0N1p2k2K73k89L3R4rj04K3J02Jr1j11p3K69j64J32J4j00P3L1r4J09j73J74
$$ plain form
7407 -81 37 -98 -86 71 117 28 30 -24 86 -136 -64 -2 -71 -49 -152 84 -104 150 -123 47 -81 26 84 21
7431 21 52 -91 177 -21 84 132 75 136 -230 130 59 -7 -57 -28 17 49 50 -134 137 -16 39 2 42 -28 -11 16
7457 16 -98 105 -37 -45 -91 -19 -128 93 126 -44 151 -79 80 57 90 -30 129 44 82 -32 65 -70 40 -78
7481 -78 -29 105 -52 91 -108 -165 -17 -6 -9 34 98 28 43 19 53 28 69 -2 28 167 20 -71 -40 -32 -78 -144 39
7508 39 -12 -58 28 108 6 -25 4 13 -99 -1 -21 -40 -20 37 -213 -63 39 -114 254 -205 37 -40 7 230 42
7533 42 37 177 50 6 -81 -130 198 -101 -75 -96 -56 56 38 1 54 -9 -101 54 -91 4 -55 147 47 5 122 -177
7559 -177 -63 -141 -21 -38 -74 211 149 -262 -90 178 68 57 -94 -154 -48 71 24 170 -138 -251 90 -20
7581 -20 31 -41 -63 210 -79 -46 48 39 -65 -42 60 61 -30 -141 -214 55 -109 23 37 -63 10 41 -53 56 -117 57
7607E7L1J19k11qk6J52k7j46P5p3N2q6o9J41R9M2o9rj1j82Q6N9J41p6l1m8J04
7634H6k06K7J19Lm4N0L8k30L05j53J6L3P5J3j49j48J35rPq3j12L27k10N6r6L4
7660a16K02o5r9J09m1m5j7K51j25J03l04L46r0j2p7o4J39k00J54j78P8J2m0J06
7684B7n0r6K36j12J22k5j76N2P4K1k03J59k5OK9j31Q8N9j48J86kq9J07n8L3K1
7710A05l5k19Q8l7K16j30k7J77j64pJ23K9n3k5r0J20r1N9P3l9J61k29j30J71j01
7735e5N2k3q4K83j38j28M5N3M3O2k25J25l3J24o4j69k4K34k19O4N0rM9m8j34J72
7761CM5j05K9r8J23q4J66j98J69n4J88k91P8J56j02N5j03K04j52m7J86l5k10J74
7785I7j74j6K41j49j5j2k4J61N9k34L2JJ1j3J48J04j17k67J57r1Q2q5N4j08K06
$$ plain form
7607 57 88 207 -4 -12 -38 114 87 -59 16 -57 -5 -91 -160 -19 80 122 53 44 33 -149 -63 -4 137 61 30 -18 86
7634 86 -120 -93 26 29 -15 35 73 -157 148 -5 11 44 119 132 -17 -165 -30 -39 -32 -115 -227 100 -110 -54 -150 -116
7660 -116 86 21 -78 31 -10 -55 -72 179 54 157 -147 199 109 97 20 -44 95 -105 49 -129 -51 -39 -79 27
7684 27 -23 -119 117 5 127 102 -74 -22 52 73 -130 29 4 10 39 -92 -4 55 -93 93 91 2 109 51 84 105
7710 105 70 -149 -61 -98 118 -12 -39 138 -26 -33 90 119 66 41 -49 71 -20 39 112 73 234 5 -125 46 -55
7735 -55 -3 -26 -110 173 35 -93 -48 5 48 110 -115 10 -23 101 37 -132 -156 78 -141 -77 -27 -36 13 -35 -169 3
7761 3 48 -57 -28 -126 -3 -87 79 -119 50 -4 184 -107 -29 127 25 80 -23 181 29 -18 168 133 -77 97
7785 97 -77 -93 148 -1 -16 -28 -52 109 168 -66 -34 -33 -22 -35 113 217 100 -167 -10 -101 -19 -104 -50 -158 48
7810D8k39J05Q0J44J4k24R7q7l9J41K26j85q1n8M6rK53l35J82o2J43k56J04l8
7834c0J20o6j8K5m5J28j23OR1r3J07k61L20k51q4J57k4m2M3L7N5j91K4J41r1j02
7860a67J3J45RK7J34k08J5J73j56Q3j21L4p9K28j38j0J05k07K38j33P0j02M0L0
7884B3rk3o1J26j04O1np3J02l3P7j42N5o7n2J38j08J12l6N5k39J65J46q1L4o9
7910hO0P2j22j35J18Q0Pj64L4O5j24NK88j00o9k0N1l63L58p6J43Q3j68nR8n2M
7937F0k8j83K49l8n4r6l1J06R0k54J21N2k56J44J48j19K10j7j34p6Q8J0M3m1M3
7962C7P2k98J96J7J35l12L77l30Q1Nr2O2o0J81j05R2nj59J26J9r1J10j39O3N6
7987C8q7k5M9J13k18K11j18J19k00J73rl2P0l7K6N8Qr8N1K2o6j58R1j13J98K47
$$ plain form
7810 48 -191 -86 -6 138 152 -72 25 -62 -101 40 266 81 0 -58 -12 -21 232 -103 79 17 160 -96 8 -30
7834 -30 90 24 6 31 -14 114 -9 -3 88 -5 102 -159 161 -90 -174 -17 -41 -83 -40 -3 52 -139 -115 26 -65 -167
7860 -167 -154 -9 0 27 161 -47 -32 141 -15 68 -53 -19 -98 130 -8 -18 87 -120 118 -15 55 -47 -7 23
7884 23 14 -9 -70 56 -48 13 8 -65 37 4 81 -61 -6 -73 -125 13 -95 17 -19 36 -203 -38 108 27 61 -8
7910 -8 52 124 2 -133 -15 65 72 -92 -58 7 -117 -112 176 76 7 -13 38 -325 33 -43 100 183 15 10 108 56 60
7937 60 32 -151 98 60 6 -90 -121 -15 75 -179 -58 -6 -262 -118 30 -89 121 104 -30 -106 -18 -8 35 -6 37
7962 37 109 -189 7 24 159 -153 224 -106 -25 -20 -112 -50 -110 71 -34 58 53 -106 20 39 -52 58 -81 -18 38
7987 38 -49 -74 -25 88 -130 81 -37 82 -118 55 46 14 84 47 73 131 139 41 92 114 48 -110 -19 -132 66 313
8013C13k79N8q8J04L2j07N3Kj28L8j74J82k83K79J04j52J52j75J49k8o3M2j25
8036i4R5j31N8J89j92J96pj84K47mk28P2J09k2j33l2K84j95J8K8j17O7o3K1O4
8061D6q7J05j00Q0K92j54k48j29K52j53Q7k6Q6j14M2Q4k6r9kJ07L8j2n6p0Q0k3
8087@Q3M4j50k7N3R3j09M0oj56J93po7K6n3J69o8n4P7j50J88j23j14Q9j3J89k00
8114e3jK32m1j18mn4J10N3j95J42m9j21O3r9K21k20K44j41j8J48r5L7k8j01k7
8139a15J11n1K65j20p9P5Nj82J16L7j07J96r7Pj07n9K9L25k19j6k79L89l26J17
8163h5L9K2Q5JJ18p6n4j3J56l99K14j76J26Q2k10K43j17L2r2O6n0K13k17K9K13
8188A50J2l26J65
$$ plain form
8013 313 34 92 4 108 140 33 86 88 -40 -2 -176 6 -277 2 106 -46 106 -69 80 52 -11 31 -94
8036 -94 1 -130 -72 117 -75 121 114 -70 177 173 -55 17 126 104 -29 -61 223 28 46 74 -43 24 -39 -18 46
8061 46 -41 64 -36 44 336 182 -66 -195 57 -96 -9 -35 51 -63 -21 63 37 -62 -64 43 81 69 13 -57 23 0
8087 0 83 127 -23 -50 3 96 -13 27 21 -135 58 51 -16 10 -43 126 58 4 81 -69 119 -4 -118 -29 -42 147 -53
8114 -53 -54 178 137 19 15 -39 71 124 -71 71 22 -99 -36 -135 86 -134 110 -31 -49 99 4 41 13 -88 -115
8139 -115 -4 -55 210 90 11 86 91 -91 25 62 -45 151 54 61 -46 -105 -76 249 30 14 -265 124 -202 -85
8163 -85 -46 -24 61 62 180 104 50 37 193 -206 8 -168 -42 40 -170 73 -44 -12 -104 -38 -88 125 -92 -63 150
8188 150 162 -164 1
8191A
$$ Imaginary data points
##PAGE= N=2
##DATA TABLE= (X++(I..I)), XYDATA
0@%%%%%%%%%%Qj6J6j6J6k4L2l6M4n4O4p4Q8j04J22j46J70j94K24k57K95l35L78
33B01m29M85n46O13o85P65q54R50j056J171j295J432j580J743j924K118k332K571
51A348k833L122l445L810m223M690n228N855o597P493q597R994j1828J4353j8056
66a0142K4014l5133O2586k48098l75239O06712J49493m35346m0014L55449m7806
77F476k37608j4123J01037P6158Q5011j19986j86569J21898J93646k08139k00919
88c83118K79860K52296k76294k37531K28688J80703j68151p0637J68415P8612
98E2843q5029p3435k4165O2563J25639k1670j31446O4040J28170j14861j16331
109a33682J53931J36720o7595m6471K5207k8545J6454O4589n3906k4719J37680
$$ plain form
0 0 0 0 0 0 0 0 0 0 0 0 8 -8 8 -8 8 -16 16 -20 24 -30 34 -40 48 -56 66 -80 90 -104 120 -137 158 -177 201
33 201 -228 257 -289 324 -361 404 -450 500 -556 615 -680 752 -828 915 -1009 1109 -1223 1348
51 1348 -1485 1637 -1808 2002 -2221 2469 -2759 3096 -3501 3992 -4605 5389 -6439 7914 -10142
66 -10142 13872 -21261 41325 -206773 -582012 24700 174193 -261153 -301167 54282 6476
77 6476 -231132 -245255 -144218 -68060 16951 -103035 -289604 -167706 25940 -182199 -383118
88 -383118 -103258 149038 -127256 -364787 -136099 44604 -123547 -194184 -25769 52843
98 52843 -32186 -105621 -129786 -67223 58416 36746 -94700 -30660 97510 -17351 -133682
109 -133682 20249 156969 89374 42903 68110 39565 56019 120608 66702 41983 179663
120A79663k624j92502N344J75846j3717j10410O3676Q2700q0665o9915L6807J3446
132H7649R790O4664k9004j24147K0723J03885q5840j04350J47935J04086j84315
143A1076j05539J48204M2121j29598R950J08843l5749q6759p95r136p048O0516
155F086r20p8797J7897N6200p5686o9326R7278P5867q6619n8553O2329J2274p3552
168a15522p126P2282K8926l9315l3519q87Q805P982N922J4962L0241k503n3154
181h2906j6643N6023K7770l1344O749M3372j7724m7540J0610L9307J7531Q097
193A3302n09o185N302o075j8714K6818N7308p028n0022Q285L2011k2318j4767
206A7408M4713L0236k5309k4032L930J694j941J6678J7402m613j0793j1255j7547
$$ plain form
120 179663 177039 -15463 -10119 165727 152010 41600 105276 187976 107311 37396 74203 87649
132 87649 97439 162103 133099 8952 29675 133560 47720 -56630 91305 195391 11076
143 11076 -94463 53741 95862 -33736 -23786 85057 49308 -37451 -38246 -47382 -54430 6086
155 6086 5166 -73631 -55734 466 -75220 -144546 -47268 28599 -58020 -116573 -54244 -41970 -115522
168 -115522 -122648 -50366 -21440 -60755 -94274 -95161 -86356 -78374 -72452 -57490 -27249 -29752 -82906
181 -82906 -99549 -43526 -15756 -47100 -40351 3021 -14703 -62243 -51633 -12326 5205 13302
193 13302 12793 6608 11910 5835 -12879 13939 71247 64219 14197 22482 54493 32175 17408
206 17408 62121 92357 67048 43016 46946 48640 46699 63377 80779 76166 65373 54118 36571
219C6571j682K5044J3999j8397j1784N221j6230k0421J6087J7772r763m513l03
232C1601k5114k1177J3684J3634q617l79K863k2315k3032L453J3828R372k673
245a4872j5291j1121o29m735r849R283K2565l033k6097r415R333K820o656O811
259e0886K0700n87k4776r334J3761J3548M192q41K446O406l858j6669J351L1490
273a3057J5019j7089j38J4777j0758j1569J8512K2576L195n820o351m691P197
286A1803J2455J610L926J2012l369j4826j249J0882P690J268L881M726q671j2216
300B9922J861Q981M648L161N67j0770j2526L779N562n148M511P393j1979j3082
314A6880l54k890j952Q917K406j3523p113N99j1419l886J4883K561j5028p551
$$ plain form
219 36571 34889 59933 73932 55535 43751 48972 32742 12321 28408 46180 36417 31904 31601
232 31601 6487 -14690 -1006 12628 4011 3632 6495 -15820 -38852 -35399 -21571 -12199 -14872
245 -14872 -30163 -41284 -41913 -46648 -56497 -47214 -24649 -27682 -53779 -63194 -53861 -51041 -57697 -50886
259 -50886 -30186 -30773 -55549 -64883 -51122 -37574 -33382 -34223 -31777 -25371 -29229 -45898 -44547 -13057
273 -13057 1962 -15127 -15265 -488 -11246 -22815 -4303 18273 21468 15648 9297 4606 11803
286 11803 24258 25868 29794 41806 38437 23611 22362 33244 40934 42202 46083 50809 42138 29922
300 29922 31783 40764 45412 48573 49140 38370 25844 29623 35185 30037 34548 41941 29962 16880
314 16880 16526 13636 11684 20601 23007 9484 2371 2970 -8449 -12335 2548 5109 -9919 -17470
328a7470k68l630m127J742M301k77m843p322n937L82K995K378J299n78j540p360
344d0255p479R517J2229m681m624N213j535o892M923R133L49K260N309n145k624
359b4302Q280J657J07J0465N040o773k048O541M384K197N901K533j353J553J066
374A5248N50L635M355L541J435k586j48K175j161J845O235J248n669k782K021
389B9942j63J436K309n047k038M606n098q317M282L960o551l838K663k679o354
404I113k473p65Q38J576p432p949K791K409o320m397J183J682k836p050k637L934
420a8333J75o995j634O267n33q026k252L893M437o39p292j073R497J388r210M51
436b9879J0021J488n861J150N244K248L08l128J304J1329K749r914N64J3012L724
$$ plain form
328 -17470 -17738 -21368 -25495 -23753 -19452 -19729 -24572 -31894 -37831 -37449 -34454 -32076 -30777 -31355 -32895 -40255
344 -40255 -47734 -38217 -25988 -30669 -35293 -30080 -31615 -38507 -33584 -24451 -24102 -21842 -16533 -21678 -24302
359 -24302 -16022 -14365 -14258 -3793 1247 -5526 -7574 -1033 3351 5548 11449 13982 12629 14182 15248
374 15248 15798 19433 23788 27329 28764 26178 26030 28205 27044 28889 35124 36372 30703 27921 29942
389 29942 29779 31215 33524 28477 26439 31045 25947 17630 21912 25872 19321 15483 18146 15467 9113
404 9113 6640 5875 6713 8289 857 -7092 -4301 -1892 -8212 -12609 -11426 -9744 -12580 -19630 -22267 -18333
420 -18333 -18158 -25153 -26787 -20520 -21053 -29079 -31331 -27438 -23001 -23640 -30932 -32005 -22508 -21120 -30330 -29879
436 -29879 -19858 -18370 -24231 -23081 -17837 -15589 -15281 -18409 -17105 -5776 -3027 -12941 -12377 635 4359
451D359p641j424R369P511l742n773M789R756j266o082N450P773k203m201o55
466A6020M842P462k600r889L657J1998l434j2879K730J1536j855r308j280N612
480B2612Q94p790m533Q028K890q927o083K304J804j728m039m240J832M625p378
495B71j1411N274Q832q371q634M926L311p752o195M163M583l405m922l56J558
510a8128j324k891J357J411j04J647k406n170L112O013j914j177M830l58n460
525b0562J637P293N7j300M527J321k618o25N070M983k649j746Q935L856r136k026
541b983J1594M549o042K188N817l609k069L872N7L098O664l252r378L060J1144
556B4710m344j1477R007J4181j0769j6777O659J4641n635j0931O793N466q957
$$ plain form
451 4359 -3282 -4706 4663 12174 8432 2659 7448 17204 15938 9856 15306 23079 20876 16675 16020
466 16020 20862 28324 25724 15835 19492 31490 28056 15177 17907 29443 27588 18280 17000 22612
480 22612 23506 15716 11183 19211 22101 13174 7091 9395 11199 9471 5432 1192 3024 7649 271
495 271 -11140 -5866 2966 -5405 -14039 -9113 -5802 -13554 -19749 -15586 -11003 -14408 -19330 -19686 -18128
510 -18128 -19452 -22343 -20986 -19575 -19679 -18032 -20438 -25608 -22496 -16483 -18397 -19574 -14744 -15102 -20562
525 -20562 -18925 -11632 -11575 -12875 -8348 -7027 -9645 -10270 -5200 -217 -2866 -4612 4323 8179 -957 -2983
541 -2983 8611 13160 7118 9306 15123 11514 9445 13317 13374 16472 23136 19884 10506 13566 24710
556 24710 20366 8889 17896 32077 21308 4531 11190 25831 20196 9265 16058 21524 12567
569A2567o337J878J870L598N95r496o459R312L334j7189l689K0442K636k2796
583i734p998J4321N001j2133m171R901K637j0869q825L958R484K1p300l525L853
598a5379M511o129j0133P693J6545m545j8935O42J7451R34j5536J712J8629J695
612h45j7525m929J6036P347r779k341R789M035n054n547L27J0130J1250o171j4187
627g464P197J6989r346j6369J6657K1063j4186j9322J1202J5920p805r374Q443
640A3605Q580l540p604m090M615Q655R56q724k878R016N99j6076j653J9922L891
655B5274k0060o530J3281J322j1934p27R282J428p493p935n95O227J348o196j210
670d518L953j280p763l974M827O170j948q203j688O784j117r752J290J0604J157
$$ plain form
569 12567 6230 8108 9978 13576 14171 4675 -1784 7528 10862 -6327 -10016 10426 13062 -9734
583 -9734 -17732 -3411 1590 -10543 -14714 -4813 -2176 -13045 -21870 -17912 -8428 -8407 -15707 -19232 -15379
598 -15379 -10868 -16997 -27130 -19437 -2892 -7437 -26372 -25730 -8279 -7345 -22881 -21169 -2540 -845
612 -845 -18370 -23299 -7263 84 -9695 -12036 -2247 1788 -3266 -8813 -8486 1644 12894 6723 -7464
627 -7464 -267 16722 7376 -8993 7664 28727 14541 -4781 6421 22341 14536 5162 13605
640 13605 22185 18645 11041 6951 11566 20221 21177 12453 9575 18591 19190 3114 1461 21383 25274
655 25274 5214 -1316 11965 13287 1353 626 9908 11336 3843 -4092 -4687 1540 2888 -3308 -4518
670 -4518 -565 -1845 -9608 -13582 -8755 -2585 -4533 -12736 -14424 -7640 -8757 -18509 -17219 -6615 -5458
685e458q892l274L703J019k229J676N046Q9l990k716P84K994M658J823m185o71
701i623O036k027p045O773J0897l544o331L970K173l711K198O129P00l13K94l244
717C332o34N197K804j719M85K900j284n159K60O553K340k866p58R20k664k660
733G047K794L244j018m94j716l514N73J834j938K61K766k152n116m58J065j956
749A222P12K333k050k193j650l260m5L292L07k206j015j088l192j027K511J995
765e354n95j831j835o48j156m47L400J673j722r37j260j816J742L408m46o36J886
782f574n61l532J559L738j62R71K537j297k040M90J032J777L299K056k239k208
798a154J262J396J458K177Q26O62q86k200P29K722Q70J189P21o17j571o68n6J594
$$ plain form
685 -5458 -14350 -17624 -13921 -12902 -15131 -13455 -8409 -8320 -12310 -15026 -14242 -11248 -6590 -4767 -8952 -9623
701 -9623 -3587 -5614 -12659 -5886 5011 1467 -4864 -894 1279 -2432 -234 5895 6595 6282 6576 3332
717 3332 2698 7895 10699 8980 9465 12365 11081 5922 6182 12735 15075 12209 11451 12371 9707 7047
733 7047 9841 13085 12067 11573 9857 6343 6916 8750 6812 7073 9839 7687 2571 2113 3178 1222
749 1222 1934 4267 2217 24 -1626 -4886 -4931 -1639 -1332 -3538 -4553 -5641 -8833 -9860 -7349 -5354
765 -5354 -5949 -7780 -9615 -10263 -11419 -11866 -8466 -6793 -8515 -9452 -10712 -12528 -10786 -7378 -7824 -8460 -6574
782 -6574 -7135 -10667 -9108 -5370 -5532 -4561 -2024 -3321 -5361 -4871 -3839 -2062 1237 3293 1054 -1154
798 -1154 108 1504 2962 5139 5965 6627 5741 3541 4270 6992 7862 9051 9772 9155 7584 6916 6860 8454
816H454L336N60l974j010J136j626k64K735Q52j225k194k211o77R59Q38m87J41
833E343R2m103k887J395J851K76r40k152j200p74j656j41J894P75k169j970o7
850f433j168p77J066P12R25m94l322j310J751J266L03Q31L60j683j569M47R43
867h152K156J867j219o41Q58p69k81K487K082P09n48q77l88J260J978P21J110
884B353J176r67j409J029J373R81J290J96L0m5r06p41J732K453N4j221p19p01
902E958l36J335O56K80O78j891k072M43J012o60l9P63o36j636j289p56L24J670
920C804n57j755l51r82j740Q5R36K46j61j741j726k13M77l40k96R22j74k030j098
939f694r7O70J119N1j325J06l32r33K91J334R10l71m22k11q2R16OlJ980Q78j544
$$ plain form
816 8454 11790 12350 8376 7366 8502 6876 6612 9347 10199 8974 6780 4569 3892 4851 5689 5202 5343
833 5343 5435 1332 -1555 -160 1691 1967 1027 -1125 -2325 -3099 -4755 -4896 -3002 -2227 -4396 -6366 -6433
850 -6433 -7601 -8378 -7312 -6600 -5675 -6169 -9491 -10801 -9050 -7784 -7481 -6650 -6290 -7973 -9542 -9095 -8152
867 -8152 -5996 -4129 -5348 -5989 -5131 -5900 -6181 -3694 -1612 -903 -1451 -2328 -2716 -1456 522 1243 2353
884 2353 3529 2562 1153 2182 3555 4536 5826 6022 6052 6007 5101 4360 6092 8545 8599 7378 6659 5958
902 5958 5622 6957 7613 7893 8571 6680 4608 5051 6063 5403 5364 6127 5491 3855 2566 1810 2134 3804
920 3804 3247 1492 1141 159 -1581 -1496 -560 -314 -475 -2216 -3942 -4155 -3678 -4018 -4314 -3392 -3566 -5596 -6694
939 -6694 -6791 -6121 -5002 -4951 -6276 -6170 -6502 -7435 -7144 -5810 -4900 -5271 -5693 -5904 -5986 -5070 -5064 -5067 -3087 -2209 -3753
960c753o44Q66J100Q86R23M4M09K57p88M1K324J838j180k51R69J41j1K57Q06J733
980E967L61j371r63P53J606k48m43Q66K50o62j438J9K102K44k187J29R27p12j854
999C346j60J142ol38j170j818M43R39j754p01J411k52k385j296N41R85r09j259
1017c241J91N49p04k572LK265m37j270J3m90j05L84o14k0J290L53j559j127J986
1036e105Q74j020l5J390R17q18j443J583J901m85k57J064L46n97O91R68Q4J039
1054A097J250j404p63K550P43j799Q56J869J08j474J3J299M46l7L39J01o5p93
1072D336L35Q81q35J93Q51j333q99J428kj783k5J547o23j893J32J05j87O7l69
1091A926o99o92l30J59l20r55L15K77j533q09P44M89k136k90J951q65j681K02
$$ plain form
960 -3753 -4397 -3531 -2431 -1545 -622 -578 -169 88 -700 -659 1665 3503 2323 2072 3041 3182 3171 3428 4234 5967
980 5967 6328 4957 3994 4747 6353 6105 5662 6528 6778 6116 4678 4697 6799 7043 4856 4985 5912 5200 3346
999 3346 3186 4328 4322 3984 2814 996 1439 2378 624 -77 1334 1082 -1303 -2599 -2058 -1073 -1982 -3241
1017 -3241 -3050 -2501 -3205 -5777 -5774 -3509 -3946 -5216 -5203 -5693 -5798 -5414 -6028 -6048 -4758 -4405 -5964 -7091 -5105
1036 -5105 -4231 -5251 -5286 -3896 -2979 -3797 -5240 -3657 -1756 -2241 -2498 -1434 -1088 -1685 -994 -26 58 1097
1054 1097 2347 943 180 2730 3473 1674 2530 4399 4507 3033 3046 4345 4791 4754 5093 5194 5129 4336
1072 4336 4671 5552 4717 4910 5761 4428 3529 4957 4955 3172 3147 4694 4071 2178 2310 2415 2228 2295 1926
1091 1926 1227 535 205 364 44 -911 -596 -319 -1852 -2661 -1917 -1428 -3564 -3854 -1903 -2768 -4449 -4247
1109d247L94j89L77j72q22p9P29k34q64M62J313m51j097J23J633J76j554P82K025
1128a695r78j106J262R03j44N54N1l12J083J245r83o16K128O54j053k09J054J484
1146C322m94j357J082J746q59r59J371P00p65k74P54k10K54M61r81m01J640m40
1164D590j723L38J119j76j387q87Q97R54j377j409J150L28j975l45J602j188j177
1181f66O34k48j002Q68m51j847K72J492r24j792M87R40l57j418k78J509j83j618
1199d582M81J389j188j100J663K55q74O72P8j108R47J715j134j164J991O35j289
1216b613K52J460K63j1k37L79L82R3J2Q39R26n73j96N51L53K56P14n91l0J217
1236C446j77p88N92O19k66r7K71k41j86K86m55l6Q47n96r32Q08J42r68r0M91m80
$$ plain form
1109 -4247 -3853 -4042 -3665 -3837 -4659 -4738 -4009 -4243 -5107 -4645 -3332 -3783 -4880 -4757 -3124 -2948 -4502 -3720 -1695
1128 -1695 -2673 -3779 -2517 -1614 -1758 -1204 -1153 -1465 -382 863 -120 -736 1392 2046 993 784 1838 3322
1146 3322 2828 1471 2553 4299 3440 2481 3852 4552 3787 3513 4267 4057 4311 4772 3791 3390 5030 4590
1164 4590 2867 3205 4324 4148 2761 1874 2771 3725 2348 939 2089 2417 442 97 1699 511 -666
1181 -666 -32 -280 -1282 -414 -865 -2712 -2440 -948 -1872 -3664 -3177 -2237 -2594 -4012 -4290 -2781 -2964 -4582
1199 -4582 -4101 -2712 -3900 -5000 -3337 -3082 -3956 -3284 -3206 -4314 -3367 -1652 -2786 -3950 -1959 -1324 -2613
1216 -2613 -2361 -901 -638 -649 -886 -507 -125 -32 -20 819 1745 1172 976 1527 1880 2136 2850 2259 2229 3446
1236 3446 3269 2481 3073 3692 3426 3329 3600 3359 3173 3459 3004 2968 3815 3219 2287 3095 3237 2269 2179 2670 2190
1257B190m06m9m42l75K46j95p76n7L68o39o84j66K66j18m47l37J03l92m54o4K94
1278b134o0p14K16k63k43M40O3q33O53J90p62l44P49L03j22L4N64o17N7N44K10
1299b069K51L3L7M90J8L71j6k3Q07L39j08J27o7P52K27o5L85K83j97K07L96j04
1321B074K13J41M10n9o0K2m68L14P96j04n35P1K9k13k17K61J43l57j75o5m54l38
1343A429m2R2J8l92k00m53n83L42K52p10l71J30n13k88j97M47k43n68L23n07m02
1364b436K53o6l35L04j5k76m69L17K10k93L73J18j63p7p9O1M16L76j43K57q8P
1386a748M00l8N70N18p2k97K50N73l17K85J012k16m59N86q0O3L16P79m83k4N27
1407B145o1m43L25O13k37K27j62j67J8R7K02J08j48k62m1m08K19N6j57l30J38
$$ plain form
1257 2190 1784 1735 1293 918 1164 969 193 136 504 -135 -819 -985 -719 -837 -1284 -1621 -1518 -1910 -2364 -2428 -2134
1278 -2134 -2194 -2908 -2692 -2955 -3198 -2758 -2695 -3528 -2875 -2685 -3447 -3791 -3042 -2739 -2861 -2827 -2263 -2880 -2823 -2279 -2069
1299 -2069 -1818 -1785 -1748 -1258 -1240 -869 -885 -908 -101 238 130 257 190 942 1169 1104 1489 1772 1575 1782 2178 2074
1321 2074 2287 2428 2838 2779 2719 2741 2273 2587 3383 3279 2744 2815 2844 2631 2414 2675 2818 2461 2286 2221 1767 1429
1343 1429 1387 1479 1497 1105 905 452 -131 211 463 -247 -618 -488 -1001 -1289 -1486 -1039 -1282 -1850 -1527 -2034 -2436
1364 -2436 -2183 -2249 -2584 -2280 -2295 -2571 -3040 -2723 -2513 -2806 -2433 -2315 -2478 -2555 -2634 -2573 -2157 -1781 -1924 -1667 -1755 -1748
1386 -1748 -1348 -1386 -816 -298 -370 -667 -417 156 -161 124 1136 920 461 1047 967 1030 1346 2125 1642 1618 2145
1407 2145 2084 1641 1966 2579 2342 2569 2407 2240 2258 2355 2557 2665 2517 2255 2214 1806 2025 2081 1924 1594 1732
1428A732n7p82n3K03j82l94L62l57o46j97K20k87k84K39k99n25n6n7j30k9K27
1449a352l07l46j10k25J46o1M7K72l38j17o7R1J96k9M98l48k45N70k50M8O09J51
1471a167k14K02J26n5P9M52J64K92K16j73k30N73M92j49L00J99J3J50j34K19L81
1492A736L41j84J9K0J0j83M04K25k29K14k01m89J76M00l43O0o0r5k99j59j83J61
1514A341J17j52l05k98l3l08l0M5q3j17m32m95K34j47j27l23J24n0l75j64J5j16
1536a679L0J59n48J06K03k43j32L07K48k55j72J24N8k60M45j87M50J03m13R9L99
1557a158O0R9K28J77J33j86K80j9N09J55m9J7L8Q6K99J95j09L96J81k60J18M06
1579A596j31L1J65N48n59mK59k05K07Q9j3j56k72K14j31j34K50p7k82k49j03J18
$$ plain form
1428 1732 1675 893 840 1043 861 467 829 472 -174 -371 -151 -438 -722 -483 -782 -1307 -1363 -1420 -1550 -1579 -1352
1449 -1352 -1659 -2005 -2115 -2340 -2194 -2255 -2208 -1936 -2274 -2391 -2458 -2367 -2171 -2200 -1702 -2050 -2295 -1725 -1975 -1927 -1318 -1167
1471 -1167 -1381 -1179 -1053 -1108 -1029 -577 -413 -121 95 -78 -308 265 757 608 908 1107 1120 1270 1136 1355 1736
1492 1736 2077 1893 1912 1932 1942 1759 2163 2388 2159 2373 2172 1683 1859 2259 1916 1976 1916 1821 1522 1363 1180 1341
1514 1341 1458 1306 1001 703 670 362 332 377 294 177 -255 -750 -516 -663 -790 -1113 -989 -1039 -1414 -1578 -1563 -1679
1536 -1679 -1649 -1490 -2038 -1932 -1729 -1972 -2104 -1797 -1549 -1804 -1976 -1852 -1794 -2054 -1609 -1796 -1346 -1243 -1656 -1557 -1158
1557 -1158 -1098 -999 -771 -594 -461 -647 -367 -386 123 278 229 246 284 370 669 864 755 1151 1332 1072 1190 1596
1579 1596 1465 1496 1661 2209 1650 1646 1905 1700 1907 1996 1983 1827 1555 1769 1638 1504 1754 1677 1395 1146 1043 1161
1601A161j06l86L08j27n62j00J21k70J03k09r5k00j15j37l81o2J18J53l25l22
1621a433L1Jr0j02K03J01n19qKJ23k7q7l8J80j42K92j87J82OK84m5m4J43L96m0
1646h18N3L94o1J06K78j12J57mM24Q9j3j2K84Q8O4J76K28j31R6K03j18p0K04N1
1670A556K07k04N0j11j18L02j44m1j0L06m05J36k76j24kk13j03J30k15j9k58K74
1692G18k67l52l8k55Q2q5j66k46N0J9k32k12m9Q3J03k91j01J27j84k65K78j2k86
1715a581jQ8K05j56K4r3j13M63n7j90k9L28jK02J03Q9J10mj18J56L31O1Q5L12
1739B14o5j85K30K60k15L32L26l49J59J68K6j49M17Q4k80J60J31k99N30J01m03
1760A193J08J99l36M2J52j95o9l0r3k72M82j00o19K13R2l40J11p2l04K32j74k34
$$ plain form
1601 1161 1055 669 977 850 288 188 309 39 142 -67 -162 -362 -477 -614 -995 -1057 -939 -786 -1111 -1433
1621 -1433 -1402 -1401 -1491 -1593 -1390 -1289 -1808 -1816 -1814 -1691 -1718 -1805 -1843 -1663 -1805 -1513 -1700 -1518 -1512 -1228 -1273 -1317 -1174 -778 -818
1646 -818 -765 -371 -432 -326 -48 -160 -3 -7 417 506 493 481 765 853 917 1093 1321 1190 1286 1489 1371 1301 1505 1556
1670 1556 1763 1559 1609 1498 1380 1682 1538 1497 1487 1793 1388 1524 1248 1124 1122 909 806 936 721 702 444 718
1692 718 451 99 61 -194 -112 -197 -363 -609 -559 -540 -772 -984 -1033 -950 -847 -1138 -1239 -1112 -1296 -1561 -1283 -1295 -1581
1715 -1581 -1582 -1494 -1289 -1445 -1421 -1514 -1627 -1164 -1221 -1411 -1440 -1112 -1113 -911 -808 -719 -609 -613 -731 -575 -244 -183 -98 214
1739 214 149 -36 194 454 239 571 897 548 707 875 901 752 1169 1253 973 1133 1264 965 1495 1596 1193
1760 1193 1301 1500 1164 1206 1358 1163 1094 1064 971 699 1181 1081 462 675 767 427 538 466 162 394 220 -14
1782a4j03j4j62l57J41N2m18K79J36n23k01L01r6m1K85l71l17L29J00l11N5K71
1804i79k29K01L49n53l1L42k50M42Ml30M5L23j5K38K49k9m34K68N04n36O07J66
1826C52l37J66L10k81M11j4N8o7QK8N2J38K70l63k3M08k56J76K01l96J82j9o3
1849I41N4k44J54j55K80j13k44n3J94k12P5n7l39J40N8j90k85Q5j62l2R0Nk38
1872b48K6N5k40k40L22k46MK01l24p2j7K31j68o0mj58Q0J83l21K56k06L2J85M0
1896f89k02K07J16l4J3O3m5J01J77K0K4m4L93l71O8L87k07J17O7N4j36J8L8L35
1920D70j14R0K48p2n5r4L14p0k34M19j08j65K20m9n7r3J79j00K1J49k14j17J12
1943F80m2j49j38K37k08O3k01J35j98q2J28r5j82M5N7k29kk20Nm2R0j33o7ML9
$$ plain form
1782 -14 -117 -131 -293 -650 -509 -457 -875 -596 -460 -983 -1184 -883 -979 -1020 -735 -1106 -1423 -1094 -994 -1305 -1250 -979
1804 -979 -1208 -1007 -658 -1211 -1242 -900 -1150 -708 -704 -1034 -989 -666 -681 -443 -194 -223 -657 -389 115 -421 186 352
1826 352 15 181 491 210 621 607 665 598 606 634 686 824 1094 731 708 1116 860 1036 1237 841 1023 1004 941
1849 941 995 751 905 750 1030 917 673 620 814 602 677 620 281 421 479 289 4 89 -73 -105 -15 -10 -248
1872 -248 -222 -167 -407 -647 -325 -571 -567 -366 -690 -762 -779 -548 -716 -776 -780 -938 -858 -675 -996 -740 -946 -914 -729 -689
1896 -689 -891 -684 -568 -602 -589 -526 -571 -470 -293 -273 -249 -293 100 -271 -203 184 -23 94 161 215 79 97 135 470
1920 470 356 446 694 622 567 473 787 717 483 902 794 629 849 800 743 650 829 729 750 899 685 568 680
1943 680 638 489 351 588 380 443 242 377 179 97 225 130 -52 -7 50 -179 -181 -401 -396 -438 -348 -481 -548 -544 -505
1968e05n2j80M3r1m4J75J26l47L26r2R4o4k40J29p0J76J82p3n8j09K69qj6K42
1992a87r6r2J13j8J44J89j4N9j61J61J21P7j78L86P8k15R0j16J22j90L52j14l0
2015D81R1l4m3J94J47j58M4N2l67L38k23KK6m5R6k18N4j12M5j00J65l12p8J1J05
2040A61j06q7K0j15j52J85j1k54Q%r9P5N6j53j60R3K5n4j51J11k5K44j96O7k45
2065g63L21p6j16K17l49K81j28K55m9Q7j57J2K46J11l11L48Q6k44J78M7n2J03
2087D7N5K2n7J14R2j39J32lJ73j59j14M4M28k97K00m3j73J76l1k8O7m3O4o2M0
2112E05r8K8p1o1J32l7j56L2j88L34l5j06j4p3J19k70N2j86l1R7Q2k08R6m8r0
2137a95J05m1j05j97R8q3M8k9K20k65R9m8j42J74j31J28j02J40j26J3J1n4J79
$$ plain form
1968 -505 -557 -737 -694 -785 -829 -654 -528 -875 -549 -641 -547 -611 -851 -722 -792 -616 -434 -507 -565 -674 -405 -413 -429 -187
1992 -187 -283 -375 -262 -280 -136 53 39 98 -63 98 219 296 118 504 582 367 457 341 463 273 625 511 481
2015 481 572 538 495 689 836 678 722 774 407 745 522 524 550 505 601 383 437 325 370 270 435 123 45 56 161
2040 161 55 -32 -12 -127 -279 -94 -105 -359 -351 -351 -450 -375 -319 -472 -632 -539 -514 -568 -719 -608 -633 -389 -585 -518 -763
2065 -763 -442 -518 -634 -417 -766 -485 -613 -358 -407 -320 -477 -465 -219 -108 -419 -71 15 -229 -51 -4 -56 47
2087 47 102 124 67 181 273 134 266 263 436 277 163 207 635 338 538 495 322 498 467 439 506 463 527 465 505
2112 505 407 435 364 303 435 398 242 274 86 420 385 279 265 192 311 41 93 -93 -124 -27 55 -153 -57 -105 -195
2137 -195 -90 -131 -236 -433 -335 -418 -370 -399 -179 -444 -345 -393 -535 -361 -492 -364 -466 -326 -452 -439 -428 -482 -303
2160c03q1J63j07o6L17j20j06K62R9k68J44oP0n3R2k2J78q6kk4O7J60n0K3j11
2185A70J46Jj5j03L10j2j83J54R6k10N0j26J65j70K76j11j24N8R6o6q2J16l10
2208A26Q6M5j06j23J70k02O9J03n5j78J24m9k09J49ml02K62q4k16K74j9k38N7
2231c20R2n6j22J60pj78lm1J12j6R6j11P2m2j4l6J47j5j22J36O1k35L08n4m8K11
2257b5p6%J20o6O1J19l9k14L07J9o9j3R3M7j08K06j91L5l3K1l7J06P5l6J78j47
2283C33O8Pj75J94q3R6k13p4J69o2L0j8qj51K72j64k28P7P9m8J75P0p0l98l4K19
2309F3j7J00k62j58M0J09j46K57j11j60O9J8k84K37O5K8j18n6q4j8J46l3k11J83
2333c43J7J4M2O6l9Q6j06O9R5k4j88J81K09j38j00J51k4L3J87k71J93j8K0Q9j28
$$ plain form
2160 -303 -384 -221 -328 -394 -77 -197 -303 -41 58 -210 -66 -72 -2 -55 37 15 193 107 105 81 148 308 258 281 170
2185 170 316 317 302 199 509 497 314 468 564 354 404 278 443 273 549 438 314 372 468 402 320 436 126
2208 126 212 257 151 28 198 -4 65 168 113 -65 59 10 -199 -50 -54 -356 -94 -178 -394 -120 -139 -377 -320
2231 -320 -228 -284 -406 -246 -253 -431 -434 -475 -363 -379 -283 -394 -322 -364 -378 -414 -267 -282 -404 -268 -207 -442 -134 -188 -236 -25
2257 -25 -101 -101 19 -47 14 133 94 -120 187 206 137 124 217 264 156 362 171 206 173 194 157 263 338 302 480 333
2283 333 401 408 233 427 344 440 227 153 322 260 290 272 264 113 385 221 -7 70 149 101 276 346 276 -122 -156 63
2309 63 46 146 -116 -274 -234 -125 -271 -14 -125 -285 -216 -198 -482 -245 -180 -152 -270 -326 -410 -428 -282 -315 -526 -343
2333 -343 -326 -312 -270 -204 -243 -157 -263 -194 -99 -123 -311 -130 79 -59 -159 -8 -32 1 188 -83 110 92 112 201 73
2358G3P4j87J71J94j79J52O0q3R3k1j1j07J63Pj33Q0k1J5J18n8j48rq9J48j31
2383A71J36k17L3Q9j53q1K56k54j7J29j05j07J05k3J28k47N8R5k56L32j07k1j46
2406b02o5j43L09r2RQ2j00j38k3L7K3J62L3p6p3qk0O2M9K9p0J08q6Jj7J84j54
2433a79K44j88J78K3j04J8P4M6N7k11N8J22K4lr9N1Lk7R3j89J97j5l3P8r4N1n8
2460A17K8L2R4l2oo3p1J4M6q7j4N2R9j12N0o1M7j49j02M4m9K99j20l5n8P1j19
2487h5Rr0N2Q5O0j02j44J87q2k8J48j09l8k4n2QQ8Lo4r9J96q7J03n7J15L2j37
2514a12M4r0J10n5o8K07k88L4J80O0j08J11J2j13J48M6n7l9o5J54n1J01j83j6
2538c8K42M4j87j16j3J44N9j0m3J1M1L2j1l1j5O9l9N0j94J68N3j49nK7K6o8r0
$$ plain form
2358 73 147 -40 131 325 146 298 358 275 368 347 336 229 392 399 266 346 325 340 458 400 252 243 154 302 171
2383 171 307 90 123 212 59 -22 234 -20 -37 92 -13 -120 -15 -38 90 -157 -99 -4 -260 72 -35 -56 -202
2406 -202 -267 -410 -101 -193 -184 -102 -202 -340 -363 -326 -303 -141 -108 -184 -257 -265 -285 -223 -174 -145 -215 -107 -193 -192 -209 -25 -179
2433 -179 65 -123 55 78 -26 -8 66 112 169 -42 16 138 162 159 60 111 114 87 180 -9 188 173 140 218 124 175 117
2460 117 145 177 271 239 233 170 99 113 159 72 58 110 209 97 147 86 133 -16 -118 -74 -123 176 56 21 -37 34 -85
2487 -85 -76 -166 -114 -29 31 -71 -215 -28 -110 -138 10 -99 -137 -161 -213 -205 -117 -114 -178 -277 -81 -168 -65 -122 -7 25 -112
2514 -112 -68 -158 -48 -103 -171 36 -252 -218 -38 22 -86 25 37 -76 72 118 61 22 -43 111 60 161 -22 -38
2538 -38 204 248 61 -55 -68 76 135 125 82 93 134 166 155 124 109 178 139 189 -5 163 216 67 62 89 115 47 -43
2565d3j2J14Lk06J84O4P6k08n2n0O2L4P4j72P1j11m6K07j28O8p3O7r5K9%K37k61
2592a67qJ45o6O9m8n2J17q3k0K19lo3J52o4m3k37J66j22J59j92J54O7KQn4k56
2618b20K38p9J68k9o0J16k48K75n6pm3J99j08j61R1J03j48O5j74M4kQ5j6M2L8
2643A13j04P0j12L7Q1J3k29R8J16J06j31J5j13r5L67l21R0K5j51J55n5M8j38J24
2667Ij56J3R7%m5K15j44p4J97o8p8kOM8o3j10L0Q8j60K32j49MJ19pl0j35J01l
2695f5P6M6J07n1k02K61j9j88PJ25k3j97J93Q0j13o8O2m5J42N1j60kQ1j30J64
2720A32j60R1m8R9J5k09k7Q2P8R7j62J12j09J08L6j18J2Q1L9k44J01L1O1kj81
2745h5J10j89Qj7M5J6j51K96p7j23J45M6j01J04k3k18K32oM6p6j31J03p3n0J79
$$ plain form
2565 -43 -55 59 62 -144 40 104 180 -28 -80 -130 -68 -34 40 -132 -61 -172 -218 -11 -139 -71 -144 -77 -172 -143 -143 94 -167
2592 -167 -175 -30 -96 -27 -75 -127 -10 -93 -113 106 103 40 192 128 85 -152 14 -108 51 -141 13 80 82 90 36 -220
2618 -220 18 -61 107 78 18 134 -114 161 105 98 55 254 146 -15 76 179 31 96 -78 -34 -36 49 33 75 113
2643 113 9 79 -33 4 85 98 -131 -33 83 189 58 73 -40 -135 232 -89 1 26 -125 30 -25 23 -115 9
2667 9 -147 -134 -37 -37 -82 133 -11 -85 112 44 -34 -36 -30 18 -45 -155 -125 -37 -197 35 -114 -110 9 2 -28 -163 -62 -65
2695 -65 11 57 164 113 -89 172 153 -35 -28 97 74 -123 70 150 37 -31 31 -14 128 179 19 17 98 -32 132
2720 132 -28 63 15 114 129 -80 -107 -25 53 150 -12 100 -9 99 135 17 29 110 149 -95 6 37 98 96 -85
2745 -85 25 -164 -156 -173 -128 -112 -263 33 -44 -167 -22 24 -77 27 4 -214 18 12 58 -18 -149 -46 -119 -169 10
2770A0K4p0N6j02R4o1J50p8M0m2R0k09J10P6k69K80j54Mj1J16k1p0M3J49j25N5
2796H5L9m5J9O5j33J44n6j17J16p9m2M4O0l8J36j4j66P8Lo7j23J73j50P1P8j02
2822b1K4J31j91p7J27q6J27j83O1J12p8J55j78J28p9j8Qj33N3J8O4k2R9k3Q3j95
2848i4jp9J3J89o6m4J0N2j2j37R7nj8R1Jn0J0K11k60J22k8j22R6m7R1k5kJ81m0
2877A34j13J7N7P0L5l3N2o3j7j37J58k22J35L6j24qj3N6Q3q4M1%ko4K7O9q2j11
2905a03J29m2p3J72O6k27J65O3k67J67p0k2L1o1n2J55j05L17l41pL4m4N7J5k22
2930b65R1K04k07K3L4Q3k50Q7L95k10J3R2N5k11O1j27L3J66L3j65j3oo0J49J23
2955A28j77J87ol7n2l1L4N8M3j36j17K77k31J14K08k01q9J31n1J05j34j7O2qO4
$$ plain form
2770 10 34 -36 20 -82 12 -49 101 23 63 21 111 -98 12 88 -181 99 -55 -51 -62 54 33 -37 6 155 30 85
2796 85 124 79 98 163 30 174 118 1 117 38 -4 40 100 62 198 184 18 96 99 32 -91 82 -68 3 81 -21
2822 -21 3 134 -57 -134 -7 -93 34 -149 -88 24 -54 101 -77 51 -28 -46 -38 -171 -118 -100 -36 -58 41 18 101 -94
2848 -94 -95 -174 -161 28 -38 -82 -72 -20 -32 -169 -72 -77 -95 -4 -3 -53 -43 168 -92 30 2 -120 -24 -71 20 -5 -7 174 134
2877 134 21 38 95 165 200 167 219 156 139 2 160 -62 73 109 -15 -23 -36 20 103 19 60 60 58 -6 21 90 8 -103
2905 -103 26 -16 -89 83 149 -78 87 150 -117 50 -20 -42 -11 -72 -124 31 -74 243 -98 -105 -71 -115 -58 -43 -265
2930 -265 -174 30 -177 -154 -120 -37 -287 -200 195 -15 -2 90 145 -66 -5 -132 -99 67 100 -65 -78 -84 -144 5 128
2955 128 -49 138 132 95 43 12 46 104 147 11 -106 171 -60 54 262 61 -28 103 52 157 23 6 68 60 124
2980A24j39n0K48j30N7j00O2J7k7n4o0M9o3KlJ41j34j07K44k82J98q3P5k04K41
3005B2J07k43Q7k9K2L2j13l3o3M8K13r1j07K00j02m9J68p3rP5j39J53j24K5j25
3030a48K64n3q0j45J22j43J56P4jr1J19j46J12Kq0J94j93O6M8k6P4J18k4k99K3
3055e7P6m2N4k06K27k6P6pk1o9m4N8q5J88o1k24j31M14j4Q3l97K33J02k13J32
3080D6L6r9R9L6j74j20K01j07J72l9m3n4K02j98J98j67J63j33l1o7J05jj12K01
3104A14j77N4J16j49j57N3NK73q2Mj82J56p7J85k78K50l7k10J53j31K53k30K54
3127A60l04M3K25k28J31j63J82QK14k07p7R6k11J52p1q1R6K54k50J4J05j16M6
3150A8kLP4k30P7n1N0J24Q1j35O4N8r5j35J12k3L9r1r0K2J52q6J40J2L1k61J36
$$ plain form
2980 124 -15 -65 183 53 110 10 72 89 62 8 -52 -3 -66 -64 -67 74 -60 -167 77 -205 -7 -90 -15 -219 22
3005 22 129 -114 -27 -56 -34 -2 -115 -148 -211 -163 50 -41 -148 52 -50 -99 69 -4 -13 62 -77 76 -48 -23 -148
3030 -148 116 63 -17 -162 -40 -183 -27 47 46 -45 74 -72 40 42 -38 156 -37 29 77 51 125 243 219 -80 -57
3055 -57 19 -23 31 -175 52 26 102 95 74 5 -39 19 -66 122 61 -163 -294 120 106 189 -208 25 127 -86 46
3080 46 82 -17 82 118 -56 -176 25 -82 90 51 8 -46 156 -42 156 -11 152 19 -12 -79 26 25 -87 114
3104 114 -63 -9 107 -42 -199 -146 -141 132 50 54 -128 28 -49 136 -142 108 71 -139 14 -117 136 -94 160
3127 160 -144 -101 124 -104 27 -136 46 54 268 61 -16 80 -131 21 -50 -131 -35 219 -31 -17 88 -28 18
3150 18 16 19 93 -137 -60 -111 -61 63 144 9 73 131 36 -99 13 -10 29 -62 -152 -130 22 -64 76 88 119 -142 -6
3177fK17l35J86k67J56NJ67m9l9p8r8J43m7j4p9J25NL19m49L1K04j15J01j12L4
3202Ej21M6J81j34Q0k87K45O8k7K7Lq5M0m1k5P4J4L6j3r1Mp9Q8J36j6p9Ljj72
3231a21J55n7l6K45k18N6o8J17n8q7j44Q5K01p0Q7n5j61M0K81k95M6q9M5J12J09
3256A20q8M8p7p6Q7j53J81j21N1Q0Nj01J12q4j48J67ln3mo1j01K46j08O8j00K66
3282A53l40J55P7r8M7J70p9L6q6O2j24K8J65k63L18k33K07J1J6k22L0j3j03J25
3306C9oj77L14k66O7J72o9j45J38o2P9m9Q0o8j21N2k18J43q6N8R5J18k48J18o3
3331a05N9lL4J03L9j68L8J70m11K56l8PR4k23J79JO0j26k27K43p0K3P4j46J87
3356E0o3K6R8k21m3j0K33k20J73j48J28O1j81K36K5k09K85j36M1j02J48l38J53
$$ plain form
3177 -6 211 -124 62 -205 -49 -44 123 74 35 -43 -141 2 -45 -59 -138 -13 -8 311 -138 -107 97 -18 83 -29 5
3202 5 -116 -70 111 -23 57 -230 15 83 56 83 86 1 41 0 -25 49 63 99 86 -5 -1 -80 8 144 128 49 52 51 -121
3231 -121 34 -23 -59 186 -32 24 -44 73 15 -72 -216 -131 70 0 87 32 -129 -89 192 -103 -57 -146 -101 11 120
3256 120 32 80 3 -73 14 -139 42 -79 -28 52 57 -44 68 -16 -164 3 0 -53 -57 -118 -219 27 -81 -13 -113 153
3282 153 -187 -32 45 -53 -6 164 85 121 35 97 -27 1 166 -97 221 -12 195 206 222 0 30 17 -86 39
3306 39 33 -144 170 -96 -29 143 74 -71 67 5 84 35 115 47 -74 -22 -240 -97 -183 -125 -30 88 -160 -42 -105
3331 -105 -46 -49 -15 88 127 -41 -3 167 -244 12 -26 -19 75 -148 31 32 92 -34 -261 -18 -88 -65 9 -137 50
3356 50 -13 13 111 -110 -153 -163 70 -150 23 -125 3 64 -117 119 144 -65 220 84 125 23 171 -167 -14
3379a4j43K46mn2j12P8Q7n1Q9q5K0J6j76Q9R5r4q4J71j99K39o8j14q1J99J71j32
3405I1j01M1J05j11j64K08j80J21k0r9J6j7J51P9m7j63O0j29J01K9N8j83J3N3
3429h8j34J92L1qM4j09j92J68R2k38K21q7K7J8K0O7K7j10K0k9J2M9NQ2L7j10J83
3456A90k38o0MP4om8N4J34q6J02r1N9j30J81r7R0j72J58J0k17K49r6J5R1r6l6
3482C8k7lJ53j19n8q6J0J13J23k34L14k45M2j37R6lq6M5O1Q8L4n9j84K4j19K05
3508a4j92K97k17J44n8r6P9O7k06J4K18j07K2Pq7J25M0j46R5K10j37j02oR3o0
3533a7M1q7J25k34K07j68J48j5j06L1J74qj68K35j18k4O4q5K3J8J27p8r1J05j22
3558b3N7l6j23k9J15J41j33J32j90J30j6LL8l10Q5R8kL7J49j60M7k3O3j73J23
$$ plain form
3379 -14 -157 89 85 33 -79 -1 86 35 124 39 59 75 -101 -12 83 -11 -95 76 -123 116 48 -66 -147 52 223 91
3405 91 -10 31 136 25 -139 69 -111 10 -10 -109 -93 -110 41 120 73 -90 -30 -159 -58 -29 29 -154 -141 -88
3429 -88 -222 -30 1 -7 37 -72 -264 -96 -4 -242 -21 -108 -81 -63 -43 24 51 -59 -39 -68 -56 -7 -2 80 117 7 190
3456 190 -48 -108 -104 -30 -36 -84 -30 104 18 120 29 88 -42 139 42 132 -40 118 128 -89 160 64 79 170 74 38
3482 38 11 8 161 42 -16 -102 -92 21 144 -90 224 -21 21 -116 -20 -23 -109 -64 -3 85 119 60 -124 -100 -219 -14
3508 -14 -206 91 -126 18 -40 -136 -57 10 -196 -182 36 -71 -49 -42 -129 -4 36 -110 -15 195 58 -44 -50 43 -17
3533 -17 24 -63 62 -172 35 -133 15 0 -106 -75 99 91 -77 158 40 16 80 -5 18 36 163 85 -6 99 -23
3558 -23 34 -2 -125 -154 -39 102 -31 101 -89 41 25 28 66 -244 -159 -61 -63 -26 123 -37 10 -13 50 -123 0
3583@n0J87k03p2K09l6KQ6k72J5J63J00l08J65K4J08r3l3j05L6Q2r4J57K1j8m
3609F7j79p8J40J38q7qp6M5k2J71j09Q4o1JJ16k70K16j19j7J9M9m3L3L4Jn4p6
3636h5J29L3j77K06J7j14L8l1N4n3N3j76P3J07j7p5M8k13J93O5J73j45j57K25
3660A71l36K29n7l7Jl6P7o0K1M8l2M2j75J7L3Q2k2RJ03j07j6R1k27J23N8j52J07
3687d5l9R8j42K17k08J31mK2k19L83j63n4Q1r6J22j76Qq0R4J63j61M9O6lQ8j89
3713e7R3P5j01J8j34J00J10k47J27N3r8J47k27N0N0K5L5j62J11K21kK8r2o0J7
3738H0N9K7L3r6j03J11m5J58k56J40P4j72K3kJN4j48J70n8j36j1J49q4p4l8q5
3764b29K82pr8L4J3PN8J46j82k47K27O7j60K1j31J82j5o8J38P3m7j29M4l4K5p9
$$ plain form
3583 0 -50 137 -66 -138 71 35 37 123 -149 -134 29 129 -179 -14 10 118 25 -8 -113 -77 5 -89 68 89 71 67
3609 67 -112 -190 -50 88 1 -7 -83 -38 -60 111 2 86 25 26 142 -128 88 -31 -48 -29 20 -23 10 44 45 -9 -85
3636 -85 44 77 -100 106 123 9 47 16 70 17 70 -106 -33 74 57 -18 30 -183 10 75 248 103 -54 171
3660 171 -165 64 7 -30 -29 -65 12 -48 -27 21 -11 31 -144 -127 -94 -12 -34 -25 78 -29 -45 46 -181 -58 0 -152 -45
3687 -45 -84 14 -128 89 -119 12 8 30 -189 194 31 -23 58 -38 84 -92 -84 -164 -70 93 -68 -19 47 44 132 -57
3713 -57 36 111 10 28 -106 -6 104 -143 -16 37 -61 86 -141 -91 -41 -16 19 -143 -32 189 187 215 123 63 80
3738 80 139 166 199 103 0 111 66 224 -32 108 182 10 33 31 32 86 -62 108 50 -86 -97 52 -32 -106 -144 -229
3764 -229 53 46 -52 -18 -5 2 60 206 24 -223 4 71 -89 -68 -199 -17 -32 -100 38 111 64 -65 -21 -55 -30 -109
3790a09o6Q6L7Qjk3L8N8j57O1J02j06Nq4P8K4K41k06N9r9J0Q2m2l8O7N6N6k43
3818a06J22Q0J5Lk31J97J25j35n0R5k4n4K02j29k08K14K5j42NJ11o3j14J47q3
3842BK4J0r3j4K98k60J61j91j24K52j50m3K8L58l19nQ0j13j0R8K3q9mJ72l31K44
3868DN1o5M3n9q1N7R8q4kn2j15L8R6M1K3O1j48M9j08j8J43j17PJ2P8J45p8k3P1
3897F7q7J5J17k52K18p0q5Q2r5Q5p3K63j31p5K26j51P8j06j9J03o4L3jk8o6K36
3923B20m1q6j05N9k70M24j8j84o6p9K13j07O6k0m2Q3q5N1J34j53O7j22M5r6O8
3948d4N8N2j93J44J9q3l6R0j83J61j97J39P6r5j18R2J94o3k03J29J0p8J67j47
3972a09J21k8N4mp2J8K5l3PQ0k4N7j52mQ7L9j34K9n0LJ30N8j97J81l6q1J53q0
$$ plain form
3790 -109 -175 -89 -52 -44 -45 -68 -30 28 -129 -68 34 -72 -67 -151 -73 -49 192 -14 45 -54 -44 38 -4 -42 25 81 137 -106
3818 -106 16 96 111 114 -117 80 205 70 20 115 91 37 239 110 -98 116 141 -1 4 115 52 -62 85 2
3842 2 26 36 -57 -71 227 -33 128 -63 -187 65 -85 -128 -100 258 -61 -66 14 -99 -109 -11 12 -77 -81 91 -240 4
3868 4 55 -10 33 -26 -107 -50 48 -36 -38 -90 -205 -167 -71 -30 -7 54 -94 -45 -153 -171 -28 -145 -138 -126 -48 97 19 -4 67
3897 67 -20 -5 112 -140 78 8 -77 5 -90 -5 -78 185 54 -21 205 54 132 26 7 110 46 79 78 50 -16 220
3923 220 179 93 -12 47 -223 201 183 -1 -67 -146 67 -40 26 6 -36 47 -38 13 147 -6 61 -61 -16 -112 -44
3948 -44 14 66 -127 17 36 -47 -83 7 -176 -15 -212 -73 3 -92 -210 -118 76 13 -190 -61 -51 -129 38 -109
3972 -109 12 -16 38 34 -38 -20 5 -28 -21 59 35 92 -60 -64 23 62 -72 -43 -93 -90 40 98 -99 82 46 -35 118 38
4000C8k7kj2lR1n2k3Qn6J68n0M6n0r5J76r1j8j1j49K13j59R8j01J09j70J35M1
4027E4q1q3K31k25MO0m8l4J99n6Nj98j35K20j10J16K5P0j05rJ29j90K45j07Mj6
4053c5p7J18k55K93r3L2j30J91K7j45J27m5l2Q5j32j08J98n4N3JO1j12j2Q6R0
4078A32m0N0p0L1O8k74J06rJ22p2L1j6j20j9J73k2Pj96J14L8L8J17j48j9k58J60
4104g6J36j30j28J07K66k31P4l9n1N3k3J1M7lj86K02%j28J77j53Q5j91J37QO7
4129C1m7J07p0l6j38n6K86n5m0n1n7Q9J58l21R0KP9k5J6q1K83j07m3O9j08J08
4155H3J65j87L8j42L4R2k07N0L7Lj11J56J11j83Q8j18K15j04L1M5l5L9j33J83
4179A50j63K0R3k06p7K33o3m0j16J28J7n1m6K06p4o1N7j75O5J22p9J32m6j99N
$$ plain form
4000 38 11 9 -3 -6 85 33 10 18 -38 130 80 126 76 -19 157 66 48 37 -112 101 -58 40 -61 48 -122 13 54
4027 54 -27 -110 121 -104 -100 -40 -88 -122 77 21 26 -172 -307 -87 -197 -81 -56 14 -91 -100 29 -161 84 -23 -19 -35
4053 -35 -112 6 -249 44 -49 -17 -147 44 71 -74 53 8 -24 61 -71 -179 19 -35 18 19 80 -32 -44 42 132
4078 132 92 142 72 103 171 -103 3 -6 116 44 75 59 -61 -80 93 71 78 -118 -4 34 72 189 41 22 -236 -76
4104 -76 60 -70 -198 -91 175 -56 18 -21 -72 -19 -42 -31 16 13 -173 29 29 -99 78 -75 10 -181 -44 -36 31
4129 31 -16 91 21 -15 -153 -209 77 22 -18 -69 -126 -37 121 -200 -110 -108 -29 -54 -38 -119 164 57 14 83 -25 83
4155 83 248 61 99 -43 -9 83 -124 -74 -37 -34 -145 11 122 -61 27 -91 124 20 51 96 61 100 -33 150
4179 150 -13 7 100 -106 -183 50 -13 -53 -169 -41 -24 -75 -121 85 11 -50 7 -168 -103 19 -60 72 26 -173 -168
4204a68J40j20J77J40k27J62k5n3ol9L1q4K62k64P5K3L6j27N1Lj59J96q8J1j46
4229a99K13J20j31r7M4q4K02j79j40K12M1K9N7Q4j40j70K08p3J36j04O9j09J85
4252A74l03J11J59j68Q6l0j02J84j22Q5P7j59o2j6O7jl9Q7j08Q1r4O2J43j50J34
4277I6j07J2r4L0J03j54J24r7J17K0N1q2m0o0P3k5J20J0j46l8P1N8j1j54J67j08
4303f4J64j75J09j8M7nj29J78l8q8N5N2l7j85j05K41L7Q2o1L2k48J32M7j06m7
4328a30J26j39M2K3R0m2j35J73J36k17MJ4m5K70p3q1J50l72K90P2j88q8J23j37
4352a34P1K05j72J14j37j37J73n9N0K3p3K6l4J17J3P7k09j09K22j31Q4N5j32N
4376i2P8J58k29Q9P0k72K35L5j74K5o7K45k24K02j12j42K04L2p1k7k8O7L2o9k0
$$ plain form
4204 -168 -28 -148 29 169 -58 104 79 26 20 -19 12 -72 190 -74 1 24 60 -67 -16 -13 -172 24 -64 -53 -199
4229 -199 14 134 3 -94 -50 -134 68 -111 -251 -39 2 31 88 172 32 -138 70 -3 133 29 98 -11 174
4252 174 -129 -18 141 -27 59 29 -73 111 -11 74 151 -8 -70 -86 -19 -20 -59 28 -80 1 -93 -31 112 -38 96
4277 96 -11 1 -93 -63 40 -114 10 -87 30 50 101 19 -21 -81 -8 -33 87 97 -49 -87 -16 42 31 -123 44 -64
4303 -64 100 -75 34 16 63 58 -71 107 69 -19 36 88 51 -134 -239 2 39 121 60 92 -156 -24 23 -83 -130
4328 -130 -4 -143 -101 -78 12 -30 -165 8 144 -73 -69 -55 -100 170 97 16 166 -206 84 156 -32 -120 3 -134
4352 -134 -63 142 -30 84 -53 -190 -17 -76 -26 -3 -76 -50 -84 33 46 123 -86 -195 27 -104 -20 35 -97 -92
4376 -92 -14 144 -85 4 74 -198 37 72 -102 -77 -144 101 -123 79 -33 -175 29 61 -10 -37 -65 2 34 -35 -55
4401e5k7K3J8m2N0p2J21q5J01j18kJ34j07J09rp2j59m0J78m7J70j51M4J65lj12
4427A2n1P8j46J41n4J87l15pJ80r2K36j79M4K48k70R8j01m9J06j1R2r6j7L7q4
4452a3j1M6J14k18J03p6pJ31j22N2L0o4k1K4k8J17J0Mj89J13n7J06pK2j87o7J60
4479c5M5j38K52j57k7J21q4j1j37J03Q9jJ43j72m5J09K1j08J53Q7j77j98K91J9
4503A43j83J8k3n8P2J15j34L2R0k96J98j36Q9R7j3k9p9J46qM8J04k9k40N4j4k9
4529f5N8rJ27j37J09K6n8n7R3qPl2n5Q6j49J0pk0J41j9k1j9J16k07l6J31p2k3
4557i0P0j04l2J51j42J52p1j28m0P3K39n0Q5J33q6j49n4R1K4O2j6j17j40L2J71
4582F4j10n9J85j37J25o1N3N4K6j58j4Q8l8r9n5J83q8N0j17O7M5L0q9j2R4l9J56
$$ plain form
4401 -55 -82 -59 -41 -83 -33 -105 16 -69 32 -86 -88 46 -61 48 39 -33 -192 -232 -54 -101 69 -82 -38 127 124 12
4427 12 -39 39 -107 34 -20 167 -148 -155 25 -67 169 -10 34 282 12 110 9 -40 66 55 147 51 34 71 -13
4452 -13 -24 22 136 -82 21 -55 -62 69 -53 -1 29 -35 -56 -32 -60 57 67 71 -118 -5 -62 44 37 59 -128 -195 -35
4479 -35 10 -128 124 -33 -60 61 -23 -34 -171 -68 21 20 163 -9 -54 55 76 -32 121 208 31 -167 124 143
4503 143 -40 -22 -45 -103 -31 84 -50 -18 72 -224 -26 -162 -73 24 11 -18 -97 49 41 89 193 164 -76 -22 -36 -65
4529 -65 -7 -16 111 -26 83 109 51 -6 87 79 86 54 -1 85 -64 -54 -61 -81 60 41 20 1 117 -90 -126 5 -67 -90
4557 -90 -20 -124 -156 -5 -147 5 -66 -194 -234 -161 78 28 113 246 160 11 -43 48 72 134 118 1 -139 -107 64
4582 64 -46 -105 80 -57 68 7 60 114 140 -18 -32 56 18 -81 -136 47 -41 9 -108 -41 4 34 -55 -67 27 -12 144
4609A44l12J78n6Q3j01P6J34j10j02K04m1j11J31j61l7M3n4l1kJ02j66J79j7P6
4633D9o1O3j78J26J9oq5J6K8k1R0L0j74qj7K8P5N5J6KK2j52LJ13k5n5j1Pk2J13
4663D0j5p1j32J37N1j07k6K16O7n8m0k43J78M0oj24p9K32j16j6K13j54R1o1j32
4688a15Q6N3j18J38J06o4j45m6J90j60%K3J5k7OR9k27K85l47K54J08M6j10m4n9
4713e3J50j2q9L6j87K33q8J88k33J05j80j5J13NJ44k32J95m5Jm5J5N5r2P0j56
4738a17J45j78J36k7k0n5J1O6mR3Lj53k3J55r2N3o3j6P5nn3J48p3L4p4RlK12j10
4767G4p6m1m9J89l64L13nK53j68p8l9k5L2n1O1q2K2o7J21r5m7J38M4j5O0j70R0
4794B5P7l5k3J9Q1k75J49k31J01J35r6J51j63nQ3Q6J1l4p6J13j0k5L9j45L7rj8
$$ plain form
4609 144 -168 10 -46 37 -64 12 146 36 -66 138 97 -14 117 -44 -81 -38 -92 -123 -125 -23 -189 -10 -27 49
4633 49 -12 51 -127 -1 18 12 -73 -57 -29 -50 40 70 -104 -112 -129 -101 -26 29 45 47 69 -83 -80 33 8 -47 -58 -51 -73 40
4663 40 25 -46 -178 -41 10 -97 -123 93 160 102 62 -181 -3 37 31 -93 -172 60 -56 -72 141 -13 78 17 -115
4688 -115 -29 24 -94 44 150 86 -59 -105 85 -75 -75 -52 -37 -64 -58 41 -186 99 -248 6 114 160 50 6 -53
4713 -53 97 85 -4 32 -155 78 -10 178 -55 50 -130 -145 -32 -27 117 -115 80 35 36 -9 6 61 -31 39 -117
4738 -117 28 -150 -14 -41 -61 -116 -105 -39 -43 50 53 -100 -123 32 -60 -7 -70 -86 -11 -16 -69 79 6 40 -34 -25 -28 184 74
4767 74 -2 -43 -92 97 -267 46 41 294 126 48 9 -16 16 -35 26 -56 -34 -101 20 -75 -122 16 60 45 105 -65 25
4794 25 102 67 44 63 144 -131 18 -213 -112 23 -73 78 -85 -90 -7 79 90 56 -20 93 83 58 97 -48 -11 -20 -38
4821c8P1Q0O7k50j96K99j54J65R1l6l7j21Q2J09j68M5N6O2j90L4K28k62O7j49
4845a45L5Q3J42k20l08N70%j77Q9n8L0J4n2R4p5k8J36k4j91Q1np3J65J22k23l3
4871e1O3J66k50J82q1j22J85j63L2q3K32j5j07m8J38l0%L8o9O9R6j39p8J55k21
4896a01J20j15J01R1l4k9J27k83K10m7j31J1L11l24J21j65J90N2j89Q0l4K02j99
4919c5J26j82J30J04j81j08J12K6K1N9j38M6ro0N8n6K19r5j42Q7j68J28J77k53
4943a34Q2j9l5R2J08p9j03J65J0k09R1J31j02pR7j6p5j2N3J07r1j14J16r7Q1o5
4969b5k5L0J07L3j34P7N1l5k07J13M4j04K43Lj29j47J2K18k01J27r7L0j01O2K34
4994A79j07j25J67j96J54p7o5J16r7J65J0k79J92j25J2Oj3m5K01j03n0M2L3R5
$$ plain form
4821 -38 33 113 180 -70 -266 33 -121 44 135 99 62 -59 23 132 -36 9 65 127 -63 -29 199 -63 4 -145
4845 -145 -110 -27 115 -105 -413 157 157 -20 69 11 41 55 3 97 22 -6 130 106 -85 -4 -9 -82 83 205 -18 -51
4871 -51 12 178 -72 110 29 -93 92 -71 -39 -122 110 95 -12 -60 78 48 48 86 17 86 182 43 -35 120 -101
4896 -101 19 -96 5 96 62 33 160 -123 87 40 -91 -80 231 -93 28 -137 53 105 -84 -4 -38 164 -35
4919 -35 91 -91 39 143 -38 -146 -34 -8 13 72 -66 -20 -29 -89 -31 -87 132 37 -105 -18 -186 -58 119 -134
4943 -134 -52 -71 -106 -14 94 15 -88 77 87 -122 -31 100 -2 -9 88 72 -3 -15 38 145 54 -60 56 -41 40 -25
4969 -25 -50 -20 87 120 -14 63 114 79 -128 -15 29 -75 168 171 42 -105 -93 125 -76 51 -46 -16 -117 -55 179
4994 179 72 -53 114 -82 72 -5 -70 46 -51 114 124 -155 37 -88 -76 -70 -83 -128 73 -30 -80 -38 -5 90
5018I0j13M0l9P8j33K18j10N2o4j40J63n8N6k7o0k18J73K07j18J4j23N3J22J2
5042G5q4j20K33k04J2J6J62j8k33K16n7pO9p0K28m9j52j04K8J1kK7O8J05j31o4
5068d5R6q3o3K61j09r7J48j01o6J10l7Q2L6j50K14p3k32K66r2M5k9K2k16J21p9
5093g1J71j63j5J82j37P2j14J41p3p7J08J93j58j08Q2K5j3J17j54P6j4k32J88
5116B6n7J90j63j82J26O0o6J6N5K3q1J50k1k6q7L8J03j59J1J21p5j16PJ11j6j25
5142a37Q2j01J51l3O5o7K03k56L52m05m6R4J22K8m2n9K0j3n7P8J9Mj72K80j53
5167d3J7q0N0R7Rj76P2J68j49j38J25r8K68j49O4j38P7L0j57K58L6k12L4j8K1
5192c2j57J3J82q3L52l41M6o4k6R1J5j0J92j36j00N5N8l4n3p1M2J13k25K44%j94
$$ plain form
5018 90 -23 17 -22 56 -77 141 31 83 19 -121 42 -16 40 13 -47 -265 -92 115 -3 11 -112 -59 63 75
5042 75 -9 -129 104 -100 -88 -72 90 72 -161 55 -2 -9 60 -10 218 169 17 -87 -59 -48 -50 -23 45 150 19 -45
5068 -45 51 -32 -95 166 57 -40 108 7 -59 51 14 96 132 -18 196 123 -109 157 65 110 81 103 -113 8 -71
5093 -71 100 -63 -78 104 -33 39 -75 66 -7 -84 24 217 59 -49 33 58 45 162 8 84 70 -162 26
5116 26 -31 159 -4 -186 -60 0 -66 -50 5 28 -53 97 76 50 -37 1 104 -55 -44 77 2 -114 -107 4 -12 -137
5142 -137 -55 -156 -5 -38 27 -40 163 -93 259 -146 -192 -98 24 52 10 -49 -29 -42 -99 -21 -2 2 -170 110 -43
5167 -43 -26 -106 -56 41 50 -126 -54 114 -35 -173 -48 -146 122 -27 37 -101 -24 6 -151 107 143 -69 -35 -53 -32
5192 -32 -189 -176 6 -77 275 -66 -20 -84 -110 -19 -4 -14 178 42 -58 -3 55 21 -32 -103 -61 52 -173 71 71 -123
5218a23Q7o1J60l3P2l3j7j50K36j84nJ12J31l33J45J03Rk29J18j07J2J20L4j78
5242a14K00j31k15K24m5J10r9J40j2k9p2O9j83L7J09L8Q6l01J86No9Q2r1R8l0
5267gp1j2MJ65nm7k58M70j80j01K54l09J60m1qK9l0M1L5RK1k54Q5k4Q1n9M7j79
5295a84QJ84J04k3j04n4J02J06r2n5L5M7j26r0J40R7j53J07l9n8J20j41J9P5p2
5320d7J09j55L0N9rQ0o5L1j30R1m4J59o8r6J05j53J58r1J02j87K89j65m1J17k46
5345a67M3K00o3L5k25M7K26n0j28J04p3Q9P6n8j13J73N8j71N4j03kJ86j2k03N0
5370b7L7J14k91J77P3o8j0O8rj73J4P4lJ5j13O2Q7j28Q2l2KJ4K36j63m6Q2j34
5397f0K5J20j13J49j79J09O8k41O5J76k07r1J82n3L2NM9l6J3P8n7j17j7J60q4
$$ plain form
5218 -123 -36 -97 63 30 102 69 52 -98 138 -46 -51 61 192 -141 4 107 116 -113 5 -102 -90 30 64 -114
5242 -114 86 -45 -260 -36 -81 29 -70 70 58 29 -43 26 -157 -120 -11 27 113 -188 -2 3 -66 16 -75 23 -7
5267 -7 -78 -90 -86 79 74 27 -231 239 59 -42 212 -97 63 22 14 43 13 54 89 98 119 -135 -50 -74 7 -52 -5 -184
5295 -184 -176 8 112 89 -15 -69 33 139 47 -8 27 74 -52 -142 -2 95 -58 49 10 -48 72 -69 -50 25 -47
5320 -47 62 -93 -63 -4 -13 67 2 33 -97 -6 -50 109 41 -55 50 -103 55 -36 66 -121 168 3 -38 79 -167
5345 -167 -124 76 13 48 -177 -130 96 46 -82 22 -51 38 114 56 -57 116 174 3 57 -46 -48 138 126 -77 -27
5370 -27 10 124 -167 10 83 15 5 73 64 -109 -95 -21 -24 -9 -122 -60 27 -101 -19 -51 -49 -35 201 38 -8 74 -60
5397 -60 -35 85 -28 121 -58 51 119 -122 -57 119 -88 -179 3 -50 -18 -13 36 0 13 91 34 -83 -100 60 -24
5422b4P4Pj45K3Q4j32J40j14K02j84P2J00l4J15k58KP6j09J43n2J38n4m3j46K
5447a17J58j90J63L0J18j75J4m8O7%ML7O1m5j44K36o8m2J7j8l9l0Q5R1j27j68
5473a30K8J25K8R7k64J3J39J3N0j92J46N5j19M3l5J7L3pk8L2l2j00J24k00J07
5498e7n9K12j88O9m4n3M9j11K17n3O8p9K8o8J05m0r3RR8j78J34J27l3j30P8J28
5524A36j03r4J22k09K14j08l5K48J39l38R3j14K17Nk49J83k46L00j32O7l6p3J46
5547A33q6J1m7j2L1k28O8K9J61L7j4P6k2j31n8Q1q8P2J23%j62p1L7J34r0J28m1
5574G1m7j29L60l08P2m0J36k13J12o3r2%J28m4K2o2R6M7k68%R9O6N3k16J56Q6
5600B2p6K07k20K14k56K8k9J55j29j29K20m8k6J81j41j20L54j70l2K36r7j42m1
$$ plain form
5422 -24 50 57 -88 -65 19 -113 27 -87 115 -69 3 103 69 184 -74 -72 4 -105 38 -14 124 70 27 -119 -117
5447 -117 41 -149 14 44 162 -13 1 -47 20 20 24 61 122 77 -67 169 101 59 76 58 19 -11 74 165 38 -130
5473 -130 -102 23 51 148 -116 -103 36 49 99 -93 53 108 -11 32 -3 14 47 40 12 44 12 -88 36 -164 -57
5498 -57 -116 96 -92 -23 -67 -120 -71 -182 35 -18 50 -29 -1 -69 36 -4 -97 -88 10 -168 -34 93 60 -70 8 136
5524 136 33 -61 61 -148 66 -42 -77 171 310 -28 65 -49 168 173 -76 107 -139 161 29 96 60 -13 133
5547 133 47 58 11 -1 30 -198 -130 -101 60 97 83 159 137 6 -52 29 -59 13 136 136 -26 -97 -60 74 -16 112 71
5574 71 24 -105 255 -53 19 -21 115 -98 14 -49 -141 -141 -13 -57 -35 -97 -1 46 -222 -222 -123 -57 -4 -220 -64 22
5600 22 -54 153 -67 147 -109 -81 -110 45 -84 -213 7 -41 -67 114 -27 -147 207 37 5 241 144 2 -39
5623c9J22k03K7Q8P4J9n6j5pK8Jl3m5K8j3N1pJ22q1j17o7K20p8N8j72PJ17j40
5651a11P9J37k90J24j15J69M5j53J66j46K51j81j36K5O0P7j00o3J98j51J0N3L8
5674a4j8l7M2j1M4j18R6M7j64K21l2J34k71K19j87O9j13N0n4J53N3k10J15L2j61
5699a15j2K63l08J25P8r0K4m2r2K62j18RK07j05Q5k90J31j0L4N0p5O2N4k49O5
5724e7j44K3j4K04j0m5J03k45K21k07K41m1k48J57K6M8p0mL0K08k09K9j23P3p4
5749a28P7O1n0l0J1jjL4j72J19J45n9m7l1oO5J55J5k64N2J53k01J98j02km7kM8
5777a0O8j38J37N5r0Qr6P1m6J41j48l3L7j9R9j23P5j6j27J20JP4k49K41O1o6m6
5804a9j70Q1J42J21k43K22q2m0k2M2J3pj20M1ML5rj38Q6m0q4K78k5k11J85j27
$$ plain form
5623 -39 83 -120 -93 -5 69 88 32 17 10 38 39 6 -39 -11 -24 27 20 142 61 -56 -123 97 19 77 -95 -88 29 -111
5651 -111 -32 105 -185 -61 -176 -7 38 -115 51 -95 156 -25 -161 -136 -76 1 -99 -162 36 -115 -105 -52 -14
5674 -14 -32 -69 -27 -38 6 -112 -16 31 -133 88 56 190 -81 138 -49 20 -93 -43 -97 56 109 -101 14 46 -115
5699 -115 -127 136 -172 -47 31 -59 -35 -77 -169 93 -25 -16 191 86 171 -119 12 2 36 86 11 73 127 -122 -57
5724 -57 -201 -178 -192 12 2 -43 60 -185 36 -171 70 29 -219 -62 -36 12 -58 -62 -32 176 -33 -4 -127 -54 -128
5749 -128 -51 10 -40 -70 -59 -60 -61 -27 -199 -80 65 6 -41 -72 -78 -13 142 157 -107 -55 98 -103 95 -7 -9 -56 -58 -10
5777 -10 58 -80 57 112 22 30 -66 5 -41 100 -48 -81 -44 -63 36 -87 -12 -28 -155 -35 -34 40 -209 32 93 27 -19
5804 -19 -189 -108 34 155 -88 134 52 12 -10 32 45 38 -82 -41 -37 -2 -11 -149 -63 -103 -187 91 66 -145 40 -87
5830h7J91j08j66K41NJ25k09J37n8Mj5j55O1J39j92J35p2O6j1k9r5J7QJ64j38
5855d2J24j24J2O5j09P7j8P3kk4P0Jk4o8k69L30j79J46n5Pq1J07p9Jj46L56j97
5882d8j6J94j14L0k7M1pn8O8j6O2J4j24P6n8m6N3o3M3n9m9J06J4r4J83m9n5j38
5910a37K2p0J64p7J30j12N6L7K8j39K21j38N8P2J32k83k3pL9j1p8k3j8K23j41
5935g5J3K2j85J78J55j84o9K3L36j66j38P3J04l2r0q9J87Rj9L4o4Mn3J3J36m8
5961G5j46J8K24j99k2J51j47N7k58K84lJj4j39N9K26l14J04m0k9K10j70j53K34
5985Ij16l7l5K76k47K60r2N1l1rk7m4J36r3j36K06J7r5K26j79M9j27R0j65R4P1
6011E2j0o8j00J54j34O0r4J90j07Q0R0j33j13J3J67o7J07j69Q6o9J30K9j46J4
$$ plain form
5830 -87 104 -4 -170 71 76 201 -8 129 71 75 60 -95 -34 105 -87 48 -24 42 31 2 -93 -76 -68 96 -42
5855 -42 82 -42 -30 35 -74 3 -15 58 56 32 102 103 79 11 -258 72 -107 39 -16 -9 -90 17 -62 -61 -207 149 -48
5882 -48 -64 130 16 46 19 60 53 -5 63 47 109 123 -1 75 17 -29 24 -39 4 -55 -104 2 16 -78 105 56 1 -137
5910 -137 -115 -185 -21 -98 32 -80 -24 13 41 -98 123 -15 43 115 247 -36 -59 -66 -27 -38 -116 -139 -157 66 -75
5935 -75 -62 -40 -225 -47 108 -76 -145 -122 214 48 -90 -17 87 55 -35 -124 63 72 53 87 23 27 -26 -13 123 75
5961 75 -71 -53 171 -28 -50 101 -46 11 -247 37 34 35 21 -118 -59 167 -147 -43 -83 -112 98 -72 -225 9
5985 9 -107 -144 -179 97 -150 110 18 69 38 29 2 -42 94 1 -135 71 88 -7 219 40 89 -38 52 -113 -19 52
6011 52 42 -26 -126 28 -106 -46 -140 50 -57 23 113 -20 -133 -120 47 -20 87 -82 4 -65 65 94 -52 -38
6035c8Q4O0k08J00l7L7J93j61n3Q5J1Ok40L16k5k04K3R4n3J4m8j7K24m22J45K24
6061A10j20q8P2J9kO5Mk23K12j36Q5N0R6o3j32K0N2J7j53R7pj08J21J52n8p0p9
6088f7P1j00L5R3k7j7J5Q3P0q6m1o6R1r8R1j49J10j6RJ22j13K7K8N5Ok26J32K2
6116E4m7J03j34l0P9Jj11K25j38l5N7r0J7j21R7K08o9Q9j83J53j84N4J3l7l0J94
6142A35n8l8m4j2L3Nr8K6M8Q6j4j69P3R6n0k24J70L3J05o3K0j03k22K96N4j22
6168c7M8j06J09OPl35K58J30j11r1J92r0J36o8N3k17J08L7p3M3j10J11j39K01
6192F2n2m0NJ07k34J34l3K6L6K6r0J15r7J34J0r1jj76J68k8ok3r1J06K85k48j12
$$ plain form
6035 -38 46 106 -102 -2 -39 -2 191 30 -23 62 73 79 -161 155 130 -74 -51 43 -10 4 -44 -61 163 -259 -114 110
6061 110 -10 -98 -26 -7 -9 56 60 -163 49 -87 -2 48 144 81 -51 -31 21 38 -115 -18 -25 -133 -12 140 82 12 -67
6088 -67 4 -96 -61 32 5 -12 3 86 156 70 29 -37 54 -44 47 -102 8 -8 1 123 10 37 65 120 126 -100 32 54
6116 54 7 110 -24 -54 25 26 -85 140 2 -33 24 -66 -49 -170 -73 135 66 155 -28 125 -59 -5 8 -29 -59 135
6142 135 77 39 -5 -17 16 21 -77 -51 -3 83 69 -100 -27 69 19 -205 -35 -2 103 40 60 -43 -265 31 85 -37
6168 -37 11 -95 14 20 27 -308 -50 80 -31 -122 70 -20 116 48 101 -116 -8 29 -44 -1 -111 0 -139 62
6192 62 10 -30 -25 82 -152 -18 -51 -25 11 37 -53 62 -35 99 109 18 17 -159 9 -19 -25 -48 -139 -33 252 4 -108
$$ [...]
8191d4
##END NTUPLES=NMR FID
##END=
