##TITLE=1H_Pr Am NCO
 CDCl3, 8 sc, 
 4.08.2021
##JCAMPDX= 6.0         $$ Bruker NMR JCAMP-DX V2.0
##DATA TYPE= NMR FID
##DATA CLASS= NTUPLES
##ORIGIN= UXNMR, Bruker Analytische Messtechnik GmbH
##OWNER= root
$$ XWIN-NMR		Version 3.5
$$ Wed Aug  4 13:26:16 2021 Russian Standard Time (UT+4h)  she@DPX200
##.OBSERVE FREQUENCY= 200.131506
##.OBSERVE NUCLEUS= ^1H
##.DELAY= (6, 6)
##.ACQUISITION MODE= SIMULTANEOUS
##.ACQUISITION SCHEME= undefined
##.AVERAGES= 8
##.DIGITISER RES= 18
##SPECTROMETER/DATA SYSTEM= spect
##.PULSE SEQUENCE= zg30
##.SOLVENT NAME= CDCl3
##.SHIFT REFERENCE= (INTERNAL, CDCl3, 0, 15.7039)
##AUDIT TRAIL= $$ (NUMBER, WHEN, WHO, WHERE, WHAT)
$$ ##TITLE= Audit trail, XWIN-NMR		Version 3.5
$$ ##JCAMPDX= 5.01
$$ ##ORIGIN= Bruker BioSpin GmbH
$$ ##OWNER= she
$$ F:/spectra/data/she/nmr/H-F/1/audita.txt
$$ ##AUDIT TRAIL=  $$ (NUMBER, WHEN, WHO, WHERE, WHAT)
(   1,<2021-08-04 13:25:06.85 +0400>,<she>,<DPX200>,
      <created by zg, POWCHK disabled, PULCHK disabled
       configuration hash MD5:
       00 E9 B6 7A A2 85 ED C7 34 08 36 98 17 FE 4E 26
       data hash MD5: 16K
       5A 80 F4 16 D9 15 BA 12 F1 68 BE A0 60 4A FF 6F>)
$$ ##END=
$$ 
$$ hash MD5
$$ D6 CC 30 99 0C A4 2B C6 15 BF 68 92 4E 7A 7A CF
##$RELAX= 
##$RELAX= 
##$RELAX= 
##$RELAX= 
##$RELAX= 
##$RELAX= 
$$ Bruker specific parameters
$$ --------------------------
##$DU= <F:/spectra>
##$EXPNO= 1
##$NAME= <H-F>
##$PROCNO= 1
##$TYPE= <nmr>
##$USER= <she>
##$AMP= (0..31)
100 100 100 100 100 100 100 100 100 100 100 100 100 100 100 100 100 100 
100 100 100 100 100 100 100 100 100 100 100 100 100 100 
##$AQSEQ= 0
##$AQ_mod= 1
##$AUNM= <au_zg>
##$AUTOPOS= <>
##$BF1= 200.13
##$BF2= 200.13
##$BF3= 200.13
##$BF4= 200.13
##$BF5= 200.13
##$BF6= 200.13
##$BF7= 200.13
##$BF8= 200.13
##$BYTORDA= 1
##$CFDGTYP= 0
##$CFRGTYP= 5
##$CHEMSTR= <none>
##$CNST= (0..31)
1 1 145 1 1 1 1 1 1 1 1 1 1 1 1 1 1 1 1 1 1 1 1 1 1 1 1 1 1 1 1 1 
##$CPDPRG= <>
##$CPDPRG1= <>
##$CPDPRG2= <>
##$CPDPRG3= <>
##$CPDPRG4= <mlev>
##$CPDPRG5= <mlev>
##$CPDPRG6= <mlev>
##$CPDPRG7= <mlev>
##$CPDPRG8= <mlev>
##$CPDPRGB= <>
##$CPDPRGT= <>
##$D= (0..31)
0 1.2 0 0 0 0 0 0 0 0.06 0 0.03 0 0 0 0 0.0002 0 0 0 0 0 0 0 0 0 0 0 0 
0 0 0 
##$DATE= 1628069106
##$DBL= (0..7)
120 120 120 120 120 120 120 120 
##$DBP= (0..7)
150 150 150 150 150 150 150 150 
##$DBP07= 0
##$DBPNAM0= <>
##$DBPNAM1= <>
##$DBPNAM2= <>
##$DBPNAM3= <>
##$DBPNAM4= <>
##$DBPNAM5= <>
##$DBPNAM6= <>
##$DBPNAM7= <>
##$DBPOAL= (0..7)
0.5 0.5 0.5 0.5 0.5 0.5 0.5 0.5 
##$DBPOFFS= (0..7)
0 0 0 0 0 0 0 0 
##$DE= 6
##$DECBNUC= <off>
##$DECIM= 32
##$DECNUC= <off>
##$DECSTAT= 4
##$DIGMOD= 1
##$DIGTYP= 9
##$DL= (0..7)
0 120 120 120 120 120 120 120 
##$DP= (0..7)
150 150 150 150 150 150 150 150 
##$DP07= 0
##$DPNAME0= <>
##$DPNAME1= <>
##$DPNAME2= <>
##$DPNAME3= <>
##$DPNAME4= <>
##$DPNAME5= <>
##$DPNAME6= <>
##$DPNAME7= <>
##$DPOAL= (0..7)
0.5 0.5 0.5 0.5 0.5 0.5 0.5 0.5 
##$DPOFFS= (0..7)
0 0 0 0 0 0 0 0 
##$DQDMODE= 0
##$DR= 18
##$DS= 0
##$DSLIST= <SSSSSSSSSSSSSSS>
$$ [...]
##$SUBNAM2= <"">
##$SUBNAM3= <"">
##$SUBNAM4= <"">
##$SUBNAM5= <"">
##$SUBNAM6= <"">
##$SUBNAM7= <"">
##$SUBNAM8= <"">
##$SUBNAM9= <"">
##$SW= 20.0188882624521
##$SWIBOX= (0..15)
0 0 2 0 0 0 0 0 0 0 0 0 0 0 0 0 
##$SW_h= 4006.41025641026
##$TD= 16384
##$TD0= 1
##$TE= 0
##$TE2= 300
##$TE3= 300
##$TEG= 300
##$TL= (0..7)
0 120 120 120 120 120 120 120 
##$TP= (0..7)
150 150 150 150 150 150 150 150 
##$TP07= 0
##$TPNAME0= <>
##$TPNAME1= <>
##$TPNAME2= <>
##$TPNAME3= <>
##$TPNAME4= <>
##$TPNAME5= <>
##$TPNAME6= <>
##$TPNAME7= <>
##$TPOAL= (0..7)
0.5 0.5 0.5 0.5 0.5 0.5 0.5 0.5 
##$TPOFFS= (0..7)
0 0 0 0 0 0 0 0 
##$TUNHIN= 0
##$TUNHOUT= 0
##$TUNXOUT= 0
##$USERA1= <user>
##$USERA2= <user>
##$USERA3= <user>
##$USERA4= <user>
##$USERA5= <user>
##$V9= 5
##$VALIST= <valist>
##$VCLIST= <CCCCCCCCCCCCCCC>
##$VD= 0
##$VDLIST= <DDDDDDDDDDDDDDD>
##$VPLIST= <PPPPPPPPPPPPPPP>
##$VTLIST= <TTTTTTTTTTTTTTT>
##$WBST= 1024
##$WBSW= 4
##$XGAIN= (0..3)
0 0 0 0 
##$XL= 0
##$YL= 0
##$YMAX_a= 455052
##$YMIN_a= -533579
##$ZGOPTNS= <>
##$ZL1= 120
##$ZL2= 120
##$ZL3= 120
##$ZL4= 120
##$ABSF1= 10
##$ABSF2= 0
##$ABSG= 5
##$ABSL= 3
##$ALPHA= 0
##$AQORDER= 0
##$ASSFAC= 0
##$ASSFACI= 0
##$ASSFACX= 0
##$ASSWID= 0
##$AUNMP= <proc_1d>
##$AZFE= 0.1
##$AZFW= 0.1
##$BCFW= 1
##$BC_mod= 2
##$BYTORDP= 1
##$COROFFS= 0
##$CY= 11.3945322036743
##$DATMOD= 1
##$DC= 2
##$DFILT= <>
##$DTYPP= 0
##$F1P= 2.36226072786647
##$F2P= -0.459571619588291
##$FCOR= 0.5
##$FTSIZE= 0
##$FT_mod= 4
##$GAMMA= 1
##$GB= 0.15
##$INTBC= 1
##$INTSCL= 1
##$ISEN= 128
##$LB= 0.24
##$LEV0= 0
##$LPBIN= 0
##$MAXI= 10000
##$MC2= 0
##$MEAN= 0
##$ME_mod= 0
##$MI= 1.114404
##$NCOEF= 0
##$NC_proc= 0
##$NLEV= 6
##$NOISF1= 3.799351
##$NOISF2= 2.8
##$NSP= 1
##$NTH_PI= 0
##$NZP= 0
##$OFFSET= 15.70392
##$PC= 1
##$PHC0= -13358.37
##$PHC1= 14.60099
##$PH_mod= 1
##$PKNL= yes
##$PPARMOD= 0
##$PSCAL= 0
##$PSIGN= 0
##$REVERSE= no
##$SF= 200.130013532006
##$SI= 16384
##$SIGF1= 3
##$SIGF2= 2
##$SINO= 400
##$SIOLD= 16384
##$SREGLST= <1H.CDCl3>
##$SSB= 0
##$STSI= 0
##$STSR= 0
##$SW_p= 3612.71676300578
##$SYMM= 0
##$S_DEV= 0
##$TDeff= 0
##$TDoff= 0
##$TI= <>
##$TILT= no
##$TM1= 0
##$TM2= 0
##$TOPLEV= 0
##$USERP1= <user>
##$USERP2= <user>
##$USERP3= <user>
##$USERP4= <user>
##$USERP5= <user>
##$WDW= 1
##$XDIM= 8192
##$YMAX_p= 0
##$YMIN_p= 0
$$ End of Bruker specific parameters
$$ ---------------------------------
##NTUPLES= NMR FID
##VAR_NAME=  TIME,          FID/REAL,        FID/IMAG
##SYMBOL=    X,             R,               I
##VAR_TYPE=  INDEPENDENT,   DEPENDENT,       DEPENDENT
##VAR_FORM=  AFFN,          ASDF,            ASDF
##VAR_DIM=   8192,          8192,            8192
##UNITS=     SECONDS,       ARBITRARY UNITS, ARBITRARY UNITS
##FACTOR=    0.0002496,     1,               1
##FIRST=     0,             0,               0
##LAST=      2.0444736,     0,               0
##MIN=       0,             -533579,         0
##MAX=       2.0444736,     455052,          0
$$ Real data points
##PAGE= N=1
##DATA TABLE= (X++(R..R)), XYDATA
0@%%%%%%%%qJ6j6J6k4L2m0M8n6P2q8J12j36J60j92K24k64L12l61M17m86N63o43
31c42P32q33R46j073J211j362J528j710J912k131K370k632K918l230L570l942
47b068M349m795N284n820O411p062P785q597R506j0532J1704j3053J4629j6501
61h760J8761k1552K5111k9824L6394m6259O2900r8037K98266l86739k66431P80124
73C63954k19637l53391J95645l1250j00140M34231k10195n03441M36976L96433
83D09185n43147j09302L77918q2717o0607J49838l12905k4358N03078j94436n20459
94d07912L61031L16933l50502n2829J65741j32135J59720J62085m17851j8172
104b13891N33847j72703m23880K81957J54997k41050J24152J6793l03261K60993
$$ plain form
0 0 0 0 0 0 0 0 0 0 -8 8 -8 8 -16 16 -24 24 -32 40 -48 64 -72 88 -104 120 -144 168 -193 224 -262 301 -342
31 -342 390 -443 503 -570 641 -721 807 -903 1009 -1122 1248 -1384 1534 -1696 1874 -2068
47 -2068 2281 -2514 2770 -3050 3361 -3701 4084 -4513 4993 -5539 6165 -6888 7741 -8760
61 -8760 10001 -11551 13560 -16264 20130 -26129 36771 -61266 237000 -149739 -416170 363954
73 363954 144317 -209074 -13429 -44679 -144819 289412 79217 -424224 12752 409185
83 409185 -133962 -243264 134654 51937 -8670 141168 -171737 -196095 306983 112547 -407912
94 -407912 -46881 270052 -80450 -133279 32462 -99673 60047 222132 -195719 -213891
104 -213891 319956 147253 -276627 5330 160327 -80723 43429 60222 -243039 17954
114A7954K89498m69293j15046N02708q9030l20531K28030K8484j97945K62682
124A37511K2932m30395J94919L98411l60517k42972L50488L7007j89040Q9438
134G782n3591p6266K75727l0937l54014J80310K92373k44864j23600J79061n0679
145A302j1695J27037j96147r7259L24999j6165l22662J30560K01761j50467n950
156a4686P4150j42051R1955J95640k52000j38121L20921O972k79529R2785J20097
167G6133j23437O2402M7796j95823R2262K29459k09962j48568K56071K4232j89589
178g9024Q0459M2671j17100J05360O0219k08090K6759K05329j00709j25419J05468
189d077K2610k5618N8271q3659n9628J85373Q508k17238O3434J64982j08848o8678
$$ plain form
114 17954 307452 -161841 -276887 225821 136791 -183740 44290 72774 -125171 137511
124 137511 160443 -269952 -75033 323378 -37139 -280111 70377 107384 -81656 7782
134 7782 -45809 -122075 153652 122715 -231299 -50989 241384 -3480 -127080 51981 1302
145 1302 -10393 116644 -79503 -176762 148237 132072 -190590 -60030 141731 -8736 -14686
156 -14686 59464 -82587 9368 205008 -46992 -185113 135808 142780 -136749 -43964 76133
167 76133 -47304 15098 62894 -132929 -40667 188792 -21170 -169738 86333 110565 -79024
178 -79024 1435 44106 -72994 32366 92585 -115505 -88746 116583 15874 -109545 -4077
189 -4077 18533 -7085 51186 -32473 -92101 93272 101780 -115458 -52024 112958 4110 -64568
201f4568Q0965l8139m930R1870r2971p8916J61896K4271j56563M5829R5008p0246
213f494N992M1744r2561K6264J22987j07784j04340J46264M1004j34743J8635
224d3032P3739m0588J1093K6269o6386K6599Q8115p1847o1907R0589J1840p3253
236b8769K5357J8761m0209L2548J7479o3840K1413O2335m7108k5705N5393j1412
248A6243k7077L9630j5195l8742M8824Q100o4390K2102M1911m7467p760M4103
260B0282k8025j7069M9071j4690l9644M5263J5370m9668J5575L1605l6334o707
272a4971L2498k2980j9710L1776m508k6691K1914R547k1193J4560J1667k2082
284a0173R040K1629k2441j0679K4548n371k0271J0323L535j0734O367j92q539
$$ plain form
201 -64568 16397 -21742 -26672 65198 -27773 -106689 55207 79478 -77085 -31256 63752 -6494
213 -6494 -502 41242 -51319 -25055 97932 -9852 -114192 32072 73076 -61667 -43032
224 -43032 30707 -9881 1212 27481 -38905 -12306 75809 3962 -57945 32644 44484 -28769
236 -28769 -3412 15349 -24860 7688 25167 -38673 -17260 45075 -2033 -27738 27655 16243
248 16243 -10834 28796 13601 -25141 23683 31783 -32607 -10505 31406 -16061 -23821 20282
260 20282 -7743 -24812 24259 9569 -30075 15188 30558 -19110 -3535 28070 -8264 -14971
272 -14971 17527 -5453 -25163 6613 2105 -24586 -2672 6875 -14318 242 11909 -10173
284 -10173 -1133 20496 -1945 -12624 11924 6553 -13718 -3395 140 -10594 -4227 -4419 -12958
297a2958J2782M012j4362J0221J2882j6468k07J9706j3084j5892K0834J711k4468
310a5291O465J5336j2453n896J0817k1j533N728l214q91J1796l362j1734J0115
324E862O660j4447k840J0602l733r182N087N157n451m73O615R63k593J600M581
339H408M37n769Q55N474m727p527L181L804o426m095N569K259m167Q94L172J299
355B641Q71j456m98L433n47n728l40M413m611n784M853R90o751L438N361n646
371e361L28Q861k395o285O977L945p730o09L325k489j79j909m843N994L659j0347
387i058J152J2489m833o844J1647j93r879J0990L108j7026O011J3302j5094o268
401a0496J3558n157n173J1271r019p203K4624k709k8395K0113K2014k8438m780
$$ plain form
297 -12958 -176 3836 -10526 -305 12577 -3891 -4098 15608 2524 -13368 7466 9177 -15291
310 -15291 -8826 6510 -5943 -11839 -1022 -1043 -2576 3152 -62 -953 10843 7481 -4253 5862
324 5862 12522 -1925 -4765 5837 2104 -7078 -1991 3166 -2285 -2758 3857 4820 2227 3827 8408
339 8408 8845 3076 3931 9405 4678 -2849 332 4136 -2290 -6385 -816 1443 -2724 -1830 1342 2641
355 2641 3512 2056 1558 4991 4444 -1284 -1624 2789 -1822 -7606 -2753 -1763 -8514 -5076 285 -5361
371 -5361 -5033 3828 1433 -4852 2125 6070 -1660 -2269 1056 -1433 -1612 -3521 -8364 -2370 1289 -9058
387 -9058 -7906 4583 -250 -7094 4553 4360 -5519 5471 8579 -8447 -2436 10866 -4228 -10496
401 -10496 3062 -2095 -7268 4003 -5016 -12219 12405 9696 -18699 1414 23428 -5010 -9790
414i790K4875j3048j0718K1265j2674j8695K9814K356l3742J6393K1842k3438
426e560L502J7228k3447O387L2347l2785k2858M9120j439m7243K2445K2043l2433
439a2693J0703J9186l6831R256M3922l6692k6165N0209l190l6839K8801Q91l5580
452b5022L8424J5264o6885J6947O4269m7514l6619N4660l343l1105L5858j1735
464C199m0711N7071J9835p9415J5637O7425m3357k8766M2498k1233j2180N4417
476C4420l7125n6609Q1043K9322r2909J2554O8680l9066j3402L5023m3816R08
488b0977P6598n3073p2099Q9570L2796r0537J4421M9590m2500J7135L6116p6606
500c9566N497J04767n5798q5414Q6058L2419p4103K3540J9074n4229N2571M2645
$$ plain form
414 -9790 15085 2037 -8681 12584 -90 -18785 11029 13385 -20357 -3964 17878 -5560
426 -5560 -2058 15170 -8277 -1890 30457 -2328 -25186 23934 22495 -24748 -2303 19740 -12693
439 -12693 -1990 17196 -19635 -10379 33543 -3149 -29314 20895 17705 -19134 9667 10558 -25022
452 -25022 13402 28666 -38219 -21272 42997 -4517 -41136 13524 10181 -20924 14934 3199
464 3199 -37512 19559 39394 -40021 -24384 43041 -316 -29082 13416 -7817 -19997 34420
476 34420 -2705 -59314 21729 51051 -41858 -29304 39376 310 -13092 21931 -21885 -20977
488 -20977 55621 2548 -69551 20019 52815 -37722 -23301 26289 -16211 924 37040 -39566
500 -39566 -34069 70698 14900 -70514 15544 47963 -26140 -2600 16474 -37755 14816 57461
512E7461j09010J780J22526n0684q3996P4836J6913n1613M8604q446p8820P7777
524A7328O2765j22169j6941J15379l1768o1559M8170j6574k0965Q1983l9177j03123
536h6651J00149P6158j26220j9812R9524l2745k8716M8127n8119k1445J18517
547F8767l5683j29387Q5576Q8456r5092k2009N4152l0853K5308M4626j04699j2941
559f3779J48055m1672j34660Q2009P1244p9320O833K6855o2236N3005P1901j21007
571d2772l5554J45054j6324j10560N0308L4574l9671M4948j5217r2177Q3972Q6943
583I3524j32344m1901J29870j4028p3664M6255j2135l2778R0001j6652j23535
594h7387P4932J03111j04446m6003Q4615j5299j9798M6147o2100l2229J23517
$$ plain form
512 57461 -51549 -49769 72757 22073 -61923 12913 29826 -21787 26817 18371 -60449 17328
524 17328 80093 -42076 -59017 56362 24594 -36965 11205 -5369 -26334 55649 16472 -86651
536 -86651 13498 89656 -36564 -56376 43148 10403 -18313 29814 -28305 -49750 68767
547 68767 33084 -96303 -10727 77729 -17363 -39372 14780 -16073 9235 53861 -50838 -63779
559 -63779 84276 42604 -92056 -10047 61197 -18123 -11290 15565 -46671 6334 78235 -42772
571 -42772 -78326 66728 50404 -60156 -9848 24726 -14945 30003 14786 -77391 6581 93524
583 93524 -38820 -80721 49149 35121 -38543 7712 -4423 -37201 52800 36148 -87387
594 -87387 -12455 90656 -13790 -59793 24822 9523 -10275 35872 -26228 -58457 65060
605F5060j2957j34118O1911R2786p4999k2051M3032m0824K6455O6654j01292m7300
617g7643J43339k427j31925M5324O9387n2228J1333J3853p3837N2950R0916j12826
629b3784o1742J32412P663r8909L3438K2490l7123N7949k939j08866O1601J07899
641I0089j05842o2872J08325K428o0299M0414j6688m1708Q9459M048j23361M6884
653b9123J06405p9335n0644O9205j2208j6756N0660n3395m6540J09446Q583j20773
665f4475L8288Q3563o1730j6056M4243m9622P446Q1936p0220p0924J09619K6978
677E9046j04813K0674N5828m1385J3956K3913p1114K3360R1320p3533o9038R7655
689B5869J9395p9746K7492K4664m5827M2235K7875q8982J4792R7853n3715o6103
$$ plain form
605 65060 52103 -82015 -20104 72682 -2317 -24368 18664 -22160 4295 70949 -30343 -77643
617 -77643 65696 63269 -68656 -23332 46055 -6173 5160 19013 -54824 -1874 89042 -23784
629 -23784 -85526 46886 54549 -44360 -10922 11568 -25555 32394 29455 -79411 -17810 90089
641 90089 -15753 -78625 29700 32128 -28171 12243 -4445 -46153 43306 47354 -76007 -29123
653 -29123 77282 -2053 -52697 16508 4300 -12456 38204 -15191 -61731 47715 56298 -64475
665 -64475 -26187 57376 -4354 -20410 23833 -25789 -18343 63593 -6627 -77551 32068 59046
677 59046 -45767 -25093 30735 -10650 3306 27219 -43895 -20535 70785 -2748 -71786 25869
689 25869 45264 -34482 -6990 17674 -28153 14082 41957 -47025 -32233 65620 11905 -54198
701e4198O7009J5394m2462K7886q642m2418O1938K3413r2056J3198Q4619m4896
713H785m4951N0600n972k5399M3960j9483n1553O0697K8882p7827O262O0942l4690
726B53k0358L6802k6281j3253N5401k4893n5933N6506L0877o3982M246M2791k8662
739f486l249L0604l5722j0652N6080j9550n0150M1348K3157m2193R560K0860k9473
752a5866J2761K9589m0685j0373N0839j4063l8589K9948J1381k7720J5885P693
764A0800l0396J8255K6336l6890q579L9477j1558k3495K2554j016j7792K2935
776A0631N46l2171J9548K5433l2127q842L0614q920j5831J8026m193j4309K0654
789I059J985k5072J2408J8054j9661m004J6570r457m851J5267j0090j1808K0064
$$ plain form
701 -54198 12811 28205 -14257 13629 4987 -37431 24507 47920 -44136 -30938 53681 8785
713 8785 -36166 14434 8462 -16937 27023 7540 -44013 16684 45566 -32261 -25999 34943 253
726 253 -20105 16697 -9584 -22837 32564 7671 -48262 8244 39121 -24861 -20615 22176 -6486
739 -6486 -9735 20869 -14853 -25505 30575 11025 -39125 2223 25380 -16813 -7253 13607 -15866
752 -15866 -3105 26484 -14201 -24574 26265 12202 -26387 3561 14942 -12778 3107 10800
764 10800 -19596 -1341 24995 -11895 -20474 19003 7445 -16050 6504 5488 -12304 10631
776 10631 11177 -20994 -1446 23987 -8140 -16982 13632 4712 -11119 6907 2714 -11595 9059
789 9059 11044 -14028 -1620 16434 -3227 -7231 9339 -118 -4969 10298 208 -11600 8464
802H464J935k1229P934J4147j1987l111Q551n606r0Q598r267n175J3674k749j1872
817g783Q255M099r439L689N731r523L81J1073o617p652R512K016p802K134K837
832I11l259K186O91n327K731N312n813l163P286k6n730K997K962l253kK615j466
849c48j244J918K56j758J78J019j63q7q46N70J557p87j295J456J193r91r70J301
867I59O42j332m29Q82L90q21l89N90N35j067L95R37n69m40Q55N88j198J95J061
886A784p50q63M17Q29o44p81J84J183m28j174P22J177o00j549J217Q20j634j05
904a95J480j123j134J452L06k499Q04J970j794r22J606k15n85J227j530m94K889
921A243j237l608L156K558m596p89M636k064k919M366m86l836L534J889m799J054
$$ plain form
802 8464 10399 -10830 -2896 11251 -736 -3847 4704 -902 -992 7606 -1661 -6836 6838 4089 -7783
817 -7783 472 4571 -4868 -1179 4552 -4971 -4590 6483 -134 -7786 1726 3742 -4060 -1926 911
832 911 -2348 -162 529 -4798 -2067 3245 -2568 -5731 1555 1529 -4201 -1204 1758 -1495 -1497 1118 -348
849 -348 -1592 326 582 -1176 -998 21 -142 -229 -1075 -505 1052 265 -1030 426 1619 628 -342 959
867 959 1601 269 -160 722 1112 291 -98 492 1027 -40 355 1292 723 283 1138 1726 528 723 1784
886 1784 1034 171 588 1417 773 -8 176 1359 931 -243 479 1656 1056 -493 724 1544 -90 -195
904 -195 1285 162 -972 480 786 -1713 -909 1061 -733 -1655 -49 -264 -849 378 -1152 -1646 1243
921 1243 6 -3602 -446 2112 -2484 -3273 1363 -701 -3620 746 260 -3576 -42 1847 -2952 -1898
937a898L738l044k11L136l818j11N992m459n169Q229J275q512L556N471o004L3
953a796N852n716j591Q685l945o919P883J621p366M052K210p371N917N582j2034
968d936K18J4343o948j0524J0981K380r101N863J957j0055Q203P035j4906n65
982f055J5483p427q469J0711k564o796J2285l192j5572J3948J1045k0311j823
995h737J8204q213p267J1029p016n870J7420n493j9496J6684J1466k0449J014
1008f724J4140j1432P61J3552j7267o251K7127o959k5619J7608J3552j8683K290
1021c905Q827j3658Q477J4967k4642n674L1814q392k4557J7330P669j5586J1188
1034C858K509k3510J6926K2374l1771j0088L4253n122k1661J3814L53j0339K0528
$$ plain form
937 -1898 1840 -1204 -1415 1721 -2097 -2208 3784 -675 -5844 2385 3660 -4852 -1296 4175 -1829 -1796
953 -1796 4056 -1660 -3251 5434 1489 -5430 2453 4074 -3292 760 2970 -4401 1516 7098 -4936
968 -4936 -4718 9625 2677 -7847 3134 5514 -3587 2276 4233 -5822 2381 9416 -5490 -6055
982 -6055 9428 2001 -6468 4243 1679 -5117 7168 3976 -11596 2352 13397 -6914 -8737
995 -8737 9467 1254 -6013 5016 -2000 -7870 9550 4057 -15439 1245 12711 -7738 -6724
1008 -6724 7416 -4016 -3255 10297 -6970 -13221 13906 6947 -18672 -1064 12488 -6195 -3905
1021 -3905 4922 -8736 -259 14708 -9934 -15608 16206 7814 -16743 587 8256 -7330 3858
1034 3858 6367 -17143 -217 22157 -9614 -19702 14551 9429 -12232 1582 1935 -8404 12124
1047A2124m445l0320K2941K4928l3991q553L0486r111j1903J7609j3413j1999
1059a5647L4561n093l9919K2872K9407l0798p802K2135j2143L67K0078k6684j2285
1072b0951M3290n586m2485K1967K4452k6205K069J3183k3762J1912K9579l6744
1084i281j9027M8166j215l9786J6900J5424j9732J4667M621l5645J9727L8542
1096C3361m1024k3391M6135J67l0419J6687N44j7820L0139K430m8020K1116M4759
1109C4664l8384k2943L7271l938j5942K1771j6472k1145M4910M814n6735J8071
1121a4058M5346l1930j7715K6950j2514k762K9385k8566k6495N1887P882n5095
1133b7685J4459L5746k5653k775J7759k7971P018M2127l5617l4786N2330J3050
$$ plain form
1047 12124 7679 -22641 300 25228 -8763 -17316 13170 4059 -7844 9765 -3648 -15647
1059 -15647 18914 13821 -26098 -3226 26181 -4617 -12419 9716 -2427 -2060 18018 -8666 -20951
1072 -20951 22339 16753 -25732 -3765 20687 -5518 -3449 9734 -14028 -2116 27463 -9281
1084 -9281 -28308 19858 18643 -21143 -4243 11181 -8551 6116 10737 -24908 -5181 33361
1096 33361 -7663 -31054 15081 15248 -15171 1516 2060 -15760 14379 16809 -31211 -10095 34664
1109 34664 -3720 -26663 10608 6670 -9272 12499 -3973 -25118 19792 24606 -32129 -14058
1121 -14058 31288 -642 -18357 8593 -3921 -6683 22702 -5864 -32359 19528 27410 -27685
1133 -27685 -13226 22520 -3133 -5908 11851 -16120 -9102 33025 -2592 -37378 14952 28002
1145B8002m7788J0005K3162k0496J1137J2647l8928R588M8361l2875l5778M2985
1157A0022J0263l1972J3352M159k2910K8467J4088n0714O725N2489k6641l3700
1169b6372L1787N084j8227J8550r227k6227L6990J5872n1587L567M4978k0089
1181E099k0929K1709r221o244L0658j9242l4552M1171K1244m7848n87L4706j4599
1194A365p712J5300k0773o82L7758k0664l6308L6052J9994l6003J220J9133j4740
1207f060P243J4469l1129j126M1761j6441l4915K6900J5543k2539N283M683j7288
1220a3616J8645J5708l6292k605L9344j2254k6896J9088N397j2729J4659m254
1232D195k3388K2752J8859l3815n146L0913q376j5070J3453o070o081K2660r093
$$ plain form
1145 28002 -19786 -9781 13381 -7115 4022 16669 -22259 -12671 35690 2815 -32963 10022
1157 10022 20285 -11687 1665 5824 -17086 11381 25469 -25245 -18520 33969 7328 -26372
1169 -26372 5415 10499 -7728 10822 1595 -24632 12358 28230 -23357 -19790 25188 5099
1181 5099 -15830 5879 -3342 -9586 21072 1830 -32722 8449 29693 -18155 -18742 15964 1365
1194 1365 -6347 8953 -11820 -12502 25256 4592 -31716 4336 24330 -11673 -10453 8680 -6060
1207 -6060 1183 15652 -15477 -16603 25158 8717 -26198 702 16245 -6294 -1011 3672 -13616
1220 -13616 5029 20737 -15555 -18160 21184 8930 -17966 1122 6519 -6210 8449 4195
1232 4195 -19193 3559 22418 -11397 -16543 14370 5994 -9076 4377 -1693 -7774 14886 5793
1245E793k7066K3827J9109k9699l897K2097q463m854J1801j4642m434K6639q350
1258G861k6755J9053J5619k0099o78J0433j0543N946J1886k1132m351K7567p010
1271G797k2856J4371R749j3688M567M166j3540R526J2973k0228n209K2596n092
1284E132j5171J0567K136q568J0640q86j6572J2156J3856j9177n058J8205m343
1297B917q829Q573l415n852J3286j971j6104J0404J1467j4373k115J1329o248
1310i31j904Q872q125n668J4958j596j4740Q276Q477j0303O4O570o597J340Q302
1325F995r384m080J2870k186j0888P208M184p802L695L765q663L061Q841r001
1339a385m663J0555r30p613N089J364n119M577J770q094L616P130p569k887Q018
$$ plain form
1245 5793 -21273 2554 21663 -8036 -11933 10164 1701 -3153 8648 -5994 -10428 16211 7861
1258 7861 -18894 159 15778 -4321 -4999 5434 -5109 837 12723 -8409 -12760 14807 7797
1271 7797 -15059 -688 9061 -4627 -60 4106 -9434 92 13065 -7163 -12372 10224 5132
1284 5132 -10039 528 2664 -5904 4736 3850 -12722 -566 13290 -5887 -10945 7260 2917
1297 2917 -5912 2661 -754 -6606 6680 4709 -11395 -991 10476 -3897 -6012 5317 -931
1310 -931 -2835 6037 -2088 -7756 7202 5606 -9134 -858 7619 -2684 -2620 3950 -2647 -1307 6995
1325 6995 -2389 -6469 6401 4215 -6673 535 4719 -3083 612 4377 -4286 -1225 7616 -1385
1339 -1385 -6048 4507 3577 -4036 1053 2417 -2702 1875 3645 -4449 -833 6297 -1272 -4159 3859
1354C859k379m639N332k69n535N187J943p218K186N887n123k150M960k010k253
1369b222M235k088l399N137N62n937K529L982m701m05M182k849j798M482j542
1384A68l594L884J061m033J579K555l274N60K643k876n81L593j759k743L833N67
1400A583l595J421K430k714l76K854j711j299K750n52j820J621N35j688R31P86
1416A156j595L43J687j764o01K329p48j851J674O96j751N95J372j510k14J180
1432I98r60l67J426o95p46J409m86j391J562N72j992M54J695j604r39K188m01
1449G23j654J433L37j354L19N94q73K64O82j222J76J526j367p39J762m55j505
1466a353J406K01j476R75Q01j616R3J559j086l97R26o70o2J084j139p83K577o20
$$ plain form
1354 3859 1480 -3159 2173 1904 -3631 1556 3499 -3719 -1533 4354 -769 -2919 2041 31 -2222
1369 -2222 2013 -75 -3474 1663 2225 -3712 -1183 2799 -1902 -2307 1875 -974 -2772 1710 168
1384 168 -3426 458 1519 -2514 -935 1620 -1654 -1094 1549 -1327 -1908 1685 -74 -2817 1016 1583
1400 1583 -2012 -591 1839 -875 -1251 1603 -108 -1407 1343 791 -1029 592 1127 -561 370 1156
1416 1156 -439 -96 1591 -173 -774 1555 807 -1044 630 1326 -425 170 1542 32 -182 998
1432 998 38 -329 1097 402 -344 1065 579 -812 750 1322 -670 -216 1479 -125 -1064 1124 723
1449 723 -931 502 839 -515 -196 398 -475 -211 471 -751 -575 951 -416 -1155 607 152 -1353
1466 -1353 53 254 -1222 -247 554 -1062 -969 590 -496 -893 33 -637 -699 385 -754 -1537 1040 420
1484D20k532J922J426k463L21J794j939J31K328k017j171L097n35k413K041M53
1500H63j953J805P63l607K081L253m122j425M581j046k856K836l25k350L240M38
1516B176m891K847L792m802p98M246k253j215L615l123k474O253o98o844L870
1531b99M779n617l95M012l519J62N036n441l142Q400r18p969M580L550n392K039
1547a34K879o695K388P638p873m664J0294n48q134M776J988n159M828J525r360
1562f251M479R140r224n000J0650j482o482O117j371o258R260J860j3399M788
1576c173J1659r783m746R256k825l284P510n468p348J3361J906j5676N124J1596
1590H109r096k822P400o045n15J0991q543r844J5502L677j5999L925R353p529
$$ plain form
1484 420 -2112 -190 1236 -1227 -906 888 -1051 -920 1408 -609 -1780 1317 782 -1631 410 863
1500 863 -1090 715 1478 -2129 -48 3205 -917 -2342 2239 1193 -1663 1173 848 -1502 1738 2176
1516 2176 -2715 132 3924 -878 -1676 2570 317 -898 2717 -406 -2880 3373 2675 -4169 -299
1531 -299 4480 -1137 -1532 2480 -1039 -877 4159 -1282 -4424 3976 3058 -4911 -331 3219 -2173 -134
1547 -134 2745 -3950 -1562 6076 -1797 -6461 3833 3285 -4849 -73 1915 -3244 1584 3109 -6251
1562 -6251 -1772 7368 -1856 -6856 3794 2312 -4170 1947 576 -5682 3578 5438 -7961 -3173
1576 -3173 8486 -1297 -6043 3213 388 -2896 4614 -854 -8202 5159 7065 -8611 -3487 8109
1590 8109 -987 -3809 3591 -2454 -2969 8022 -521 -10365 5137 8814 -7185 -3260 6093 -1436
1604a436J099N471j1002K464J4909j1091j2089J6353L783j4213M633N222q345
1617d242O609N456j5982K563J8039j0640j2447J3856K438r542O366j086r535J2660
1631D513N777k0134K300J9472j0023j0572J1189j234n227J0117n308j2766J5839
1644C943P981k0723Q75J6352p335n862Q054o962j255J5343r279j5844J7681R165
1658A2134j9259N54J1884o693M92O930j3033k42J9803r148j7824J5510Q739j4244
1672d397K230M865q643Q218Q009j9182o39K2421p906j7085J2552N654r535O323
1686B885q91j2204J3282J0227k1617k083K1256o164j2436R679p30n470J2328m814
1700C248j6711J5465J3094k0962l710J7248m919o185P874p569l682J8028n925
$$ plain form
1604 -1436 -337 5134 -5868 -3404 11505 414 -11675 4678 8461 -5752 -1119 4103 -4242
1617 -4242 2367 7823 -8159 -5596 12443 1803 -10644 3212 5650 -3892 2474 1388 -8147 4513
1631 4513 10290 -9844 -7544 11928 1905 -8667 2522 1288 -3939 6178 870 -11896 3943
1644 3943 11924 -8799 -7924 8428 1093 -4769 3285 -3677 -4932 10411 1132 -14712 2969 12134
1658 12134 -7125 -6571 5313 -1380 -888 6042 -6991 -7233 12570 3422 -14402 1108 9847 -4397
1672 -4397 -2167 2698 -5945 2273 10282 -8900 -9539 12882 4976 -12109 443 6097 -3438 2885
1686 2885 1994 -10210 3072 13299 -8318 -10401 10855 4691 -7745 1934 1204 -4266 8062 3248
1700 3248 -13463 2002 15096 -5866 -9576 7672 2753 -3432 4442 -3127 -6809 11219 5294
1713E294j9628J4518J3388j7406k622J1715o803P18R356j3762m764K1427m150
1726G281k0573J1623J1412j2744R70N415r803O367J1485j7485o169K2061k791
1739G049j7655R353O252r291O576J782j4446R074J4589j7914p661J9538j649j2521
1753f924P802R5p043J1645o4j7621R886J5409j6053p158J5213k496o830Q388n172
1768i23p144J5181N41j8821P636J4347j1922m700R583m824j338R793r047q013
1782i651J6367J632j7092N287J1145q980q02O382q196J364J1714r659r369J4735
1796D877K525j3401M211O196o939L400L959j0602K635J2705r391q967J2244K024
1810E476r524M202K240o713O475L604j1814K063J2037p431p111Q654K69n554N505
$$ plain form
1713 5294 -14334 184 13572 -3834 -6456 5259 -1544 -826 8530 -5232 -9996 11431 7281
1726 7281 -13292 -1669 9743 -3001 -2031 3384 -6419 -52 11433 -6052 -12221 9840 7049
1739 7049 -10606 -1253 4999 -4292 2284 4066 -10380 -1306 13283 -4631 -12292 7246 5597 -6924
1753 -6924 878 973 -6070 5575 5511 -12110 -2224 13185 -2868 -10026 5187 2691 -4139 4249 -923
1768 -923 -8067 7114 7655 -11166 -3530 10817 -1105 -5805 3778 -1046 -2384 7409 -1638 -9651
1782 -9651 6716 8348 -8744 -3457 7688 -1292 -2094 4288 -3908 -2544 9170 -489 -9858 4877
1796 4877 7402 -5999 -1788 4408 -2531 869 4828 -5774 -3139 9566 175 -8792 3452 5476
1810 5476 -4048 154 2394 -4319 2156 5760 -6054 -3991 8046 615 -6496 2158 2427 -3127 2378
1825B378j283o934Q018L989j1543R94J0161n133n046O038j545k941O216k665o887
1840f183P721L621r395Q53P095m042j754M003l457j635P091k861o863O512L664
1855D370o795L77M189l268L16L548m527r48O662k538n473M662K401m550J294K032
1871A752l422J678L044m783p53N501j592m035L226J125k648J568N59k985K127
1886C62K555m130p08M032j147k430K209n5j617K078J22l077J895K226k836p75
1902a296K540r66r16J351p45q31J885k20k289J352J491j970j37J221o12n01J171
1919E28o07j020J626p5j638P95P96r50J88K96o19L35Q05j034l09J440n01r44O82
1938b06L97p92L46L19n72M16L16m66M3L21j90m85O92l17k18O93l31l33M18M76
$$ plain form
1825 2378 1095 -5839 2179 6168 -5375 -4381 5780 647 -4399 1639 94 -2847 3369 704 -6183
1840 -6183 1538 5159 -4236 -3383 3712 -330 -2084 1919 -1538 -3173 3918 1057 -5806 706 4370
1855 4370 -2425 -2048 2141 -1127 -811 2737 -1790 -2738 3924 1386 -4087 575 2976 -1574 -280 1752
1871 1752 -1670 8 3052 -1731 -2484 3017 1425 -2610 616 1741 -907 661 1220 -1765 362
1886 362 2917 -1213 -1921 2111 964 -1466 743 688 -929 1149 1271 -1806 89 2315 -521 -1296
1902 -1296 1244 278 -638 713 -32 -863 1022 802 -1487 -135 1356 -614 -751 470 -142 -643 528
1919 528 -79 -1099 527 452 -1186 -391 405 -545 -357 -61 -680 -345 460 -574 -883 557 56 -888 -206
1938 -206 191 -601 -255 64 -508 -92 224 -242 -199 122 -68 -553 139 -178 -396 297 -34 -367 51 527
1958E27q46K48N06l91m4L47l03j53M88O2n62N61r3m27L46J61o58K84O34o07k98
1979b18P00j46n05O28Po82M91L58q68M10L38n67O8O86o00m66R93j43j181R00M48
2000F51j158K88Q24r23j86J105n95q43J174L2j168O88N77j063J75J044j121k77
2018g76J491j069q86J540J8j397Q39O28j276O43Q62j708L26J620j169q70J737
2035E53l68j390J649m3j722J525R73k426N59J981j396j095K028n79j420K191m03
2052F17k173K123J189l054N37K366j828m64K202j596j042K997r65k846K612J525
2068B200l051K48K270j943O1K101k573p02L801j380l502L063J375l190J115J687
2084A580k992J208K674l711j054M868j522l611K998Q54k705J964M52l397K448
$$ plain form
1958 527 -319 -71 435 44 0 347 44 -109 379 441 -121 440 347 -80 266 427 -231 53 687 80 -218
1979 -218 482 336 -169 459 466 -216 275 633 -235 175 513 -54 14 700 100 -366 627 484 -697 203 651
2000 651 -507 -219 605 -318 -504 601 6 -837 337 369 -799 -111 466 -597 -422 622 -499 -776
2018 -776 715 -354 -1240 300 318 -1079 -240 388 -888 -245 617 -1091 -765 855 -314 -1184 553
2035 553 185 -1205 444 401 -1321 204 1177 -1249 -690 1291 -105 -1200 828 249 -1171 1020 617
2052 617 -1556 567 1756 -1298 -761 1605 -223 -687 1515 -81 -1123 1874 909 -1937 675 2200
2068 2200 -851 -603 1667 -276 -215 1886 -687 -1389 2412 1032 -2470 593 1968 -1222 -107 1580
2084 1580 -1412 -204 2470 -1241 -2295 2573 1051 -2560 438 1292 -1413 551 1003 -2394 54
2099E4L186m959q73N103j731l139L253q02k190L857m28n098L581L719n253j039
2115b759M703j905j550L019k399j848N491r92o125L994L962n099l87L535k753
2130a113N24L560m442k263P232j178o641M032L294m261J065J764m261K497M895
2145D704o335k685P888q70o300L606J924l489L058O31o173L770O047o981l316
2160d521P737q39m618L494q29l038N956r8q560M498P030p063l158O407j612k301
2176a515M505l929l566Q584l2r867M129P104o210j629M411l532L99O120o296m968
2192f292J0200R07r986L252N609m953P45K711n897K049Q027p309o175J0197J355
2207D440q284K696L082m633M077K115r097K757J0049p236o894Q955J425o147L460
$$ plain form
2099 54 3240 -1719 -2592 2511 780 -2359 894 92 -2098 1759 1331 -3767 -186 3533 -1720 -2759
2115 -2759 1944 39 -1511 1508 -891 -2739 2752 1760 -4365 -371 3591 -1508 -1895 1640 -1113
2130 -1113 -589 2971 -1471 -3734 3498 2320 -4321 -289 3005 -1256 -191 1573 -2688 -191 4704
2145 4704 -1631 -4316 3572 2702 -3598 8 1932 -1557 1501 2132 -4041 -271 5776 -1205 -4521
2160 -4521 3216 2377 -2241 1253 424 -2614 3342 3244 -5316 -818 6212 -851 -4009 2398 786 -1515
2176 -1515 2990 -939 -4505 4079 4047 -5820 -1691 5413 -797 -2426 1985 -1547 -1148 4972 -1324 -6292
2192 -6292 3908 4815 -5171 -1919 3690 -1263 -518 2193 -3704 -1655 6372 -937 -7112 3085 4440
2207 4440 -3844 -1148 1934 -2699 1378 3493 -5604 -2847 7202 -34 -6928 2027 3452 -2695 765
2222G65l17m610O774K363j0840K274J0461o271n626O529l00l088N198l276o235
2237f199R147L556j1768J447R368m893l317M730l272p09P359m829p821R786L988
2252F573j0352P66O470l762K5L302o241M70R655n566q541Q458M236p937Q26L561
2268A943m097L193L333q604K33J0485m453q178O716K784n081K511J24n164N766
2283A511M109r739m84R787l066o464M536N98k685M862k334o452O864M972r186
2298c171j361P945k401l428L780k595j277O718k869p554O463N168p602j054N206
2313A968k487q7L363n114j305Q450k656p701N492M077n247R2K675l602K367L758
2329D043o501j473Q335j985o445M005K649l776J890P33m766L573M614o795k078
$$ plain form
2222 765 448 -4162 2612 4975 -5865 -3591 6870 599 -5027 1502 1202 -1886 3312 36 -6199
2237 -6199 2948 6504 -5264 -3817 5551 658 -2659 2071 -1201 -1910 5449 620 -7201 2585 6573
2252 6573 -3779 -3013 3457 -305 -280 3022 -3219 -2749 6906 1340 -7201 1257 5493 -2444 -1618 1943
2268 1943 -2154 1039 4372 -4232 -3999 6486 2033 -6145 571 3355 -1726 785 909 -4255 1511
2283 1511 5620 -4119 -4603 5184 2118 -4346 190 788 -1897 2965 631 -5821 1043 6015 -3171
2298 -3171 -4532 3413 1012 -2416 1364 -1231 -2508 4210 1341 -6213 250 5418 -2184 -3238 1968
2313 1968 -519 -606 2757 -2357 -3662 4788 2132 -5569 -77 4000 -1247 -1155 1520 -2082 285 4043
2329 4043 -2458 -3931 4404 2419 -4026 -21 2628 -1148 742 1475 -3291 282 4896 -1899 -3977
2344c977P322j158m766K946L47k310L692l05n722L733M906n927k005N358j018
2359A116k417K955j828k109N207o35o162L128M575m791j044L363j643m69K901
2374B147k930k266N747o99n446K737L270l500q2K160k647Q01L417l641k201M946
2390A813p1m233J951J790k383J122J166l167J108L772l495k215M170j33l055J952
2406I2M52k116K125R93l689J248L572k960j970L294k54j945J997m26k075K443
2422G81J074l501J084K724k216j160K491j122j140K350j014j830K432O52l089
2437a484Q31K367j884l81J667j205n33K162j176j885K267P02k454O41J341j225
2453b49k2J251j341n10K081q61j675J721N26j726P46P91j447K25J270j412j66
$$ plain form
2344 -3977 3345 2187 -2579 367 714 -1596 2096 1791 -3931 -198 4708 -1219 -3224 2134 1116
2359 1116 -1301 1654 -174 -2283 2924 2289 -3873 -745 3830 -961 -2005 1358 -285 -754 2147
2374 2147 -783 -3049 2698 1999 -3447 -710 2560 -940 -1022 1138 -1509 -708 2709 -932 -3133 1813
2390 1813 1742 -2491 -540 1250 -1133 -11 1155 -2012 -904 2868 -627 -2842 1328 1195 -1860 92
2406 92 544 -1572 553 1546 -2143 -895 2677 -283 -2253 1041 787 -1158 839 413 -1662 781
2422 781 1855 -1646 -562 2162 -54 -1214 1277 155 -985 1365 351 -1479 953 1605 -1484
2437 -1484 -653 1714 -170 -551 1116 -89 -622 1540 364 -1521 746 1448 -1006 -365 976 -249
2453 -249 -271 980 -361 -871 1210 349 -1326 395 921 -805 -59 732 -715 -490 780 -632 -798
2470g98J717o18j296J209L19j403O81O64j340N83R80j157n36J516l98j084Q87
2487g4K70r82N38O33j127L80P76p46k68J186m65p62P80O5q41N84L66q09K12R94
2507G10q49l12R47l45n34N89J59q06N26N07j005J95Q23o06l82P71r5m20M75Q0
2527D28m98L81L00p10K04M88n35j83O31k80n14P21J8p33M03J13n21K23L43m58
2547a79J92M11l99l93P89m17k16N25k32n39N42Q3o50K01N25l52r6J29n9n2L76
2568A89m12m17O40J59n68K46Q6k26M55k4q60O06N69o45m55R06j23o60Q21n04m07
2589f24J086k01j141N58R88r19k13Q05n10j57J054q35p46J491L1j445P69P28j004
2608b85M43L16j109O43J412j545q56J863Lj593R90K90j179J107N54k084P14K107
$$ plain form
2470 -798 919 301 -995 214 533 -870 -189 475 -865 -282 698 -459 -995 521 123 -961 -74
2487 -74 196 -786 -248 385 -742 -362 414 -332 -600 586 121 -641 139 204 -637 -53 313 -496 -284 710
2507 710 -139 -451 496 151 -383 206 365 -441 85 592 -413 -218 605 -1 -383 388 293 -127 348 428
2527 428 -70 311 611 -99 105 593 58 -125 506 226 -288 433 451 -282 121 234 -287 -64 279 -179
2547 -179 13 424 25 -368 421 4 -212 313 81 -458 84 167 -483 -282 243 -109 -205 -76 -135 -187 189
2568 189 -223 -640 0 159 -409 -163 -77 -303 152 128 -732 -126 443 -202 -657 249 126 -534 287 -217 -624
2589 -624 462 261 -880 -322 666 -253 -466 339 -171 -328 726 -109 -855 636 667 -778 -9 719 -285
2608 -285 158 474 -635 8 1420 -125 -981 882 885 -708 282 572 -607 500 1054 -1030 -316 1791
2626A791k121r61K133k11j299J199l43j319K213K44k990J184K310k137q01J903
2642G95p89q75K131j185k078L091N27l448R49K520k206k53J789j799j38K833j938
2659g4k611L544R16l805J119K286k220N68J476k771Q9L989k452l154L881J002
2675A783l289J395R74k511J998J715m378N53M806k602l174L456K89k123J747j01
2691E38k952L411K097n585L75N209k439k585L058q70j310L242j439m158M506K585
2707C683n708L1M487j986j604K750k325j027M950k284m863M540K841m981J09L172
2723A785k264L79K337m149n27O114k165n419M156K597m007P24J511l040K299K996
2739C327n837q59O955j889n026L265J470k696K076N6m483M089L733o438j349O164
$$ plain form
2626 1791 -330 -1291 842 631 -668 531 188 -1131 1082 1326 -1664 -480 1830 -307 -1108 795
2642 795 6 -869 1262 77 -2001 1090 1617 -1831 -882 1638 -568 -821 968 -831 -969 1864 -74
2659 -74 -2685 859 1775 -2030 -911 1375 -845 -277 1199 -1572 -1483 2506 54 -3100 781 1783
2675 1783 -1506 -111 863 -1648 350 2065 -2313 -1760 3046 444 -2730 726 1015 -1108 639 538
2691 538 -2414 997 3094 -2491 -2116 3093 654 -1931 1127 257 -1053 2189 750 -3408 1098 3683
2707 3683 -2025 -1994 2493 507 -1097 1653 -672 -1699 3251 967 -3896 644 3485 -1496 -1387 1785
2723 1785 -479 -100 2237 -1912 -2439 3675 1510 -3909 247 2844 -1163 -439 1072 -1968 331 3327
2739 3327 -2510 -3369 3586 1697 -3329 -64 1406 -1290 786 842 -3641 448 4181 -2257 -3606 2558
2755B558j376l614L128p76j781M346j314n739M539M477o149j278N044j702j746
2770a383L048k903j610O242j461o708M295M428m884j053L346k252N80L223m612
2785a704j821P198j053o464L249L650m019O88J652l704K279M574o171k439P380
2800C295o39n560K674J722k614K539K71n049L081N424o217k877O421m00l958K490
2816F03k80k340M345N9o455L102N783n395k738M801p14j956L124k451k805N980
2832B663K18p025K609N194m108j649L185j965k52M200l883l316O375Q79o684J989
2848a570L974l053RJ976l672J063M979l977m173O062J107n074J492K022k478J919
2864F06J395m857J307N440l915l533M718Q25l468J725K57k630L466J389n492Q17
$$ plain form
2755 2558 1182 -2432 696 -80 -1861 2485 1171 -4568 -29 4448 -1701 -2979 2065 363 -1383
2770 -1383 1665 -1238 -2848 3394 1933 -4775 -480 3948 -936 -1989 1357 -895 -315 2908 -1704
2785 -1704 -3525 3673 2620 -3844 -595 3055 -964 -276 1376 -2328 -49 4525 -1646 -4085 3295
2800 3295 2656 -2904 -230 1492 -1122 1417 1688 -3361 -280 5144 -1073 -3950 2471 2071 -1887 603
2816 603 323 -2017 2328 2387 -4068 -966 4817 -578 -3316 1485 771 -1185 1939 -512 -3317 2663
2832 2663 2881 -4144 -1535 3659 -449 -2098 1087 -878 -1130 3070 -813 -4129 2246 3125 -3559 -1570
2848 -1570 2404 -649 -640 1336 -2336 -1273 3706 -271 -4444 1618 2725 -2349 -857 1165 -1313 606
2864 606 2001 -2856 -1549 3891 -24 -3557 1161 1986 -1482 243 500 -2130 1336 2725 -2767 -1950
2880a950N482k819l261L572k13j713K305r35l112L979J698n322O32M432k405j632
2896a262K526j414q58L392j929l401L905J870m473J72L108j746l63J863k404j95
2912a209L709j937l281L297J573l346M78J742j678O20J575k845l67L757j486k951
2928b349K470J223k390R55O87k187J856J398l097k97L273j192j931J762J70j339
2944i88J451p2j985J605J577k564m05K478p48j296J265l47q44J808l93k150J663
2961E5J428k153j56J535n91n57J036q94n12J871l02k076J357J082j379j12Q71
2978E03m43j25J059j121m33J702m25j394R31M77j116N87L72q37L17P51j241k73
2996g09J365j96r07N35L16p58N65Q2p27L81R37j109l52J049m56n80P77j97l66
$$ plain form
2880 -1950 3532 713 -2548 1024 811 -902 1403 468 -2644 1335 3033 -2289 -1657 2775 370 -1262
2896 -1262 1264 -150 -1008 2384 455 -2946 959 2829 -1644 -1472 1636 -110 -473 1390 -1014 -1209
2912 -1209 2500 563 -2718 579 2152 -1194 -716 1026 -652 -32 1543 -1302 -1669 2088 602 -2349
2928 -2349 121 1344 -1046 -91 596 -1591 265 1663 -1434 -1731 1542 350 -1581 181 351 -988
2944 -988 463 391 -1594 11 1588 -976 -1381 1097 349 -947 318 -29 -873 935 542 -1608 55
2961 55 1483 -670 -826 709 118 -439 597 -297 -809 1062 760 -1316 41 1123 -256 -368 503
2978 503 60 -65 994 -127 -560 1142 717 -677 254 731 -385 202 574 -263 54 805 -436 -709
2996 -709 656 460 -447 88 404 -354 211 293 -434 -53 884 -225 -577 472 16 -564 213 16 -350
3015c50M10M70j237N48Q27r94j01P02l13m26O56l00n13Q62j05o54M78M31o43j43
3035c95N73l74j14N27m09k00P16k05o52N42J65l61J92K02m49j6N78m54l72O69
3055A63K3n83N10J22o08K72N07p28J26P55m17m32Q90l61n75N61K33q56L70N32
3075E04o93K29N26o52O5N76m86k46O07O8q11K63N47p20L15M07p77P0R17o02n53
3096d46P95j21o71O71L8p42N95L23r41J15Q69o11m92R17k35p40P47lp45P74L14
3117D11j060L2J196p70k77P28m04m73Q94j20r00Q54L96j202K09J077q26k97J088
3136E56o88n71J311m07r96Q82M39r45K28P33j080L07J002j031n10J682n62j156
3154h06J043L80j213P29M93j307P48J016j496l24J659n17j172J056P1q28J142
$$ plain form
3015 -350 60 530 -707 -159 668 -326 -427 275 -38 -464 192 -108 -621 241 136 -518 -40 391 -252 -395
3035 -395 178 -196 -310 217 -192 -392 324 119 -533 9 174 -187 5 207 -242 -258 320 -134 -506 163
3055 163 186 -397 113 235 -373 -101 406 -322 -196 559 142 -290 600 239 -336 225 458 -398 -28 504
3075 504 -189 40 566 -86 -21 555 69 -177 430 498 -313 -50 497 -223 92 499 -278 -208 709 107 -446
3096 -446 349 228 -443 228 266 -476 119 442 -499 -384 485 -126 -618 299 64 -676 71 68 -677 97 411
3117 411 -649 -617 579 -191 -468 260 -144 -617 277 157 -743 111 507 -695 -486 591 -235 -532 556
3136 556 -132 -703 608 201 -795 87 526 -419 -191 542 -538 -231 771 -260 -770 912 350 -806
3154 -806 237 617 -596 133 626 -681 67 1083 -413 -737 922 405 -767 289 360 -468 674
3171F74k44j517J229J205j905k08J615o71o87J177o06q37J801m37j857J375J283
3188A390j973j4J261r25J59J144j485o06K100k79k087J214R96j639L11Q17j308
3205i24P69J517k251p06K585m15j923J297N00j356J238J95k181J502J875k619
3221h97o31K484m84j337J150m45q81K114o6k957J945J950k580o32K120j007k33
3238c87J690j828q62L087m25l548K135J955k309JJ362j531M94K196k677j328L804
3255A829n21l288J905J373j793P99O96k502J223K841l146j729L878o5k950J643
3271A93P12j844J929L90l553J662L403l359j634L409l74j908J886r68j759L210
3287A395L04m518J835L673l178j334K771j018r21K647k137k126M211K66m397J461
$$ plain form
3171 674 430 -1087 142 1347 -558 -766 849 178 -509 668 62 -775 1026 589 -1268 107 1390
3188 1390 -583 -597 664 -261 -102 1042 -443 -1049 1051 772 -1315 -101 895 -744 -433 384 -924
3205 -924 -155 1362 -889 -1595 990 575 -1348 -51 449 -907 331 526 -1655 -153 1722 -897
3221 -897 -1528 956 472 -865 285 -160 -1041 1073 1007 -1950 -5 1945 -635 -1267 853 -154 -387
3238 -387 1303 -525 -1387 1700 1275 -2273 -138 1817 -492 -491 871 -660 -166 2030 -647 -1975 1829
3255 1829 1308 -1980 -75 1298 -495 304 1000 -1502 -279 2562 -584 -2313 1565 1500 -1450 193
3271 193 905 -939 990 1380 -2173 -511 2892 -467 -2101 1308 934 -974 912 -56 -1815 1395
3287 1395 1699 -2819 -984 2689 -489 -1823 948 -70 -991 1656 -481 -2607 1604 1870 -2527 -1066
3303a066L235k507o22J811j883R5L387k891k697M518P63m114R65K396k169O55
3319a24J300l265Q80M202l092k966M145Q09l264J423O74k112K245J143m382J066
3335a318M400k828k951L533L46k091J742n62k268L189J443m826M52M549k488k004
3351a682K646q81o81K545j644k972L788J726m587L42L243j739p43J673k081k5
3367a072L618k328l265L677J832l913N30K034j793P01J706l443J42M177j968l635
3383c000L327J308k885J138O32k069J914J751l980l0M345k029k750K604M55j797
3399a066J744l29k435K534J997m081k56L649j166k127K134o22j070K537r31l026
3415b514K716K107l535k06K926j611n35J783j778o73L055r55l107K628J898k923
$$ plain form
3303 -1066 2169 -338 -960 851 -1032 -937 2450 -441 -3138 1380 2143 -1971 -1006 1390 -779 -124
3319 -124 1176 -2089 -1209 2993 -99 -3065 1080 1889 -1375 48 722 -1390 855 1998 -2384 -1318
3335 -1318 3082 254 -2697 836 1182 -909 833 271 -1997 1192 2635 -2191 -1739 2810 322 -1682
3351 -1682 964 83 -598 1947 303 -2669 1119 2845 -1742 -1400 1843 104 -639 1034 -1047 -1072
3367 -1072 2546 218 -3047 630 2462 -1451 -921 1113 -680 21 1727 -1716 -1574 2603 635 -3000
3383 -3000 327 1635 -1250 -112 520 -1549 365 2116 -1864 -1894 2451 422 -2328 276 731 -1066
3399 -1066 678 349 -2086 448 2445 -1636 -1892 1757 591 -1536 598 -24 -1094 1443 512 -2514
3415 -2514 202 2309 -1226 -1432 1494 -117 -652 1131 -647 -1320 1735 780 -2327 301 2199 -724
3431g24j45K017j524K39J643k178r03L381q00k949K135J561k589P48P76j777J195
3448A06J901k924o97L320p43k411J594P22j481J141N1j925J289J845k411q84K690
3465A183m26j844J314p7j031J619k7k388J429J796k199o05K004n54r49J129o31
3482b57r71K124l7k656J229J830j746k63J139p63j62J260j008r91K226q6k187
3499a319J013J389j349n6R04j157K16J473j329r51J743J15j490O78Q45j077K33
3516a19P13j194K50J336j090q44J535O6j197O81L24r56P81N45j457L86J155j017
3534a02m98J069j88p52P43J17q78O69O38j312J51J200o49n45O91k74m87P46j86
3553A53p85P79K94r15N5Q87q25N3M88l06j24M10k22n95N67N15q66J01M69l07n5
$$ plain form
3431 -724 -869 1148 -376 -137 1506 -672 -1575 1806 1006 -1943 192 1753 -836 -88 688 -1089 106
3448 106 2007 -917 -1614 1706 963 -1448 146 868 -613 528 579 -1346 -57 1788 -623 -1507 1183
3465 1183 757 -1087 227 150 -881 738 711 -1677 -248 1548 -651 -1256 748 194 -755 374 -257
3482 -257 -1228 896 859 -1797 -568 1262 -484 -747 392 -371 -533 727 -281 -1272 954 868 -1319
3499 -1319 -306 1083 -266 -322 582 -575 -359 1114 -215 -1166 577 692 -798 -120 725 -352 -119
3516 -119 594 -600 -350 986 -104 -948 587 653 -544 137 461 -495 286 831 -626 -240 915 -102
3534 -102 -600 469 281 -471 272 389 -489 180 818 -494 -343 857 208 -337 354 80 -407 339 153
3553 153 -632 147 441 -474 -419 468 -357 -304 184 -122 -246 164 -58 -653 -86 429 -437 -336 133 -174 -229
3574b29N67o12k74P00j6p47N18J97l95k4N38n89K32L52l00r1K93j27n77N78J91
3595A85m48L14L20m71j3L18k34k02M92k41j75J80K44l42K67P3m09Q6L65k92r4
3616g7L71k87o5K15J15j81o3J05m01K81J56j59k0K91m81K1L38l2j56L49j85k30
3638i5J94J09k65O1L57m51lK13q4k31K99j36q7J21J04o36N37J07l79J63K30k09
3660h1r8M03n81n1M96r9m20K77J84n35M19J62n19K78M58o63j8O34k34m56M42J23
3682A21k45K19P3n49K74O33o65l20Q10m27l21P49m40l32Q91l6j207R44M93q19
3702a54N2O42o33K4O65q67j86J135k52j062P04P06j192K77P52r36K81R74j155
3721b25l77J476m41j163Q81M40j034O55L87j204N65J137j293o60J698o13q55P80
$$ plain form
3574 -229 338 -274 -548 152 136 -611 -93 104 -291 -315 223 -366 -134 218 -82 -173 120 -7 -584 -6 185
3595 185 -263 51 371 -100 -113 205 -29 -231 261 20 -155 25 269 -73 194 267 -142 -56 309 17 -77
3616 -77 294 7 -58 157 272 91 28 133 -268 13 169 10 -10 281 -200 -179 159 127 -29 320 135 -95
3638 -95 99 208 -57 4 361 -90 -93 120 36 -195 104 -32 -119 2 106 -530 7 114 -265 -102 128 -81
3660 -81 -179 224 -357 -408 88 -11 -431 -154 30 -505 -86 76 -443 -165 293 -370 -388 246 12 -444 -2 121
3682 121 -124 95 168 -381 -107 526 -139 -459 351 -76 -397 352 -88 -420 471 435 -772 172 665 -154
3702 -154 -102 540 -93 -69 596 -271 -457 678 426 -636 68 774 -418 -141 611 -325 -44 930 -225
3721 -225 -602 874 433 -730 151 591 -443 212 599 -605 -40 1097 -196 -856 842 229 -626 154
3739A54N6r03J109J90j613P71J377j475n14J603m98r96J150m70q51J494q5j732
3757a233P34J676j774l00J410r53rJ183q41j232J835L19k065P91J401j198j31
3774c87R67j288J92J828j389j347K116M21k026Q92N92j146P53Q67j921M32K108
3791A664j628j447K006J20j279R14N1j266J416P94k669O07K202j078j413J706
3807G00l06q13J197o66j374K109N27k576K99K400j272j042J369q88k54J774j142
3824D2j581K175Q98k668L70J779j072p6Q44j437j20K454j463k096K313Q16k275
3841a097O54J052j225P22R40k292J51K830j513k055K095N58j590R16J25j523J646
3858C94J149l114L73K763j246j616J599l00o01J297m90j845K285R49k624r2K415
$$ plain form
3739 154 210 -693 416 606 -1007 -236 1141 -334 -848 755 257 -739 411 -59 -910 584 499 -1233
3757 -1233 -499 1177 -597 -897 513 -440 -449 734 -107 -1339 496 815 -1250 -459 942 -256 -387
3774 -387 580 -708 -516 1312 -77 -1424 692 1113 -913 -21 571 -575 178 1045 -876 -444 1664
3791 1664 36 -1411 595 715 -564 350 401 -865 551 1345 -1324 -717 1485 407 -1006 700
3807 700 394 -419 778 112 -1262 847 1374 -1202 -903 1497 225 -817 552 -336 -590 1184 42
3824 42 -1539 636 1534 -1134 -764 1015 -57 -133 711 -726 -846 1608 145 -1951 362 1178 -1097
3841 -1097 -443 609 -616 106 1046 -1246 -1095 1735 222 -1833 262 820 -770 146 271 -1252 394
3858 394 1543 -1571 -1198 1565 319 -1297 302 2 -599 698 208 -1637 648 1597 -1027 -1119 1296
3875A296j001r98J143q31j73K097j093k223K221J393k487k95J705r60L5J121j600
3892f50l06K670j072k340J871J339k109N07Q56j450Q65J220k407m25L038p51k490
3909a634J844Q05j677R04L06j727J207J713k619k99K763j067j702J410Q4j157
3925h46J547l79k053J836J622k516m87K135n60j140J277o80m59J641k53k467J597
3942a85J557k061k71J488q19N1J086j363p55K337l60k333J474J302j684K8R74
3959D66j073K44J465j801p71K452l00j837J060R73j185N03L78j534Q86J808k124
3976c90q57K288m22j355Q02M50j073J011J21j582P35J755j529r34J619k43p59
3993c63R00l78r16J678j38j733P15J550j424n54J117n17j48Q17p51p33J274L43
$$ plain form
3875 1296 295 -703 440 -391 -564 1533 440 -1783 438 1831 -656 -951 754 -206 -171 950 -650
3892 -650 -956 1714 642 -1698 173 1512 -597 -90 766 -684 181 1401 -1006 -1431 1607 856 -1634
3909 -1634 210 1015 -662 242 548 -1179 28 1741 -878 -1177 1586 519 -1183 227 311 -846
3925 -846 701 322 -1731 105 1727 -789 -1276 859 299 -841 436 -244 -703 938 685 -1782 -185
3942 -185 1372 -689 -960 528 -291 -240 846 -517 -1272 1065 705 -1628 -154 1148 -536 -508 466
3959 466 -607 -363 1102 -699 -1470 982 682 -1155 -95 878 -307 196 574 -960 -74 1734 -390
3976 -390 -1247 1041 619 -736 66 516 -557 454 575 -1007 -272 1483 -46 -980 639 396 -363
3993 -363 537 159 -757 921 783 -950 -235 1315 -109 -663 454 -63 -211 606 -145 -878 396 739
4011G39j830O47J088q67k88Q49m88j75J249j076r20J526K78j419M17P68q49K36
4029a15M61q48K62R84r10o28J098K0r56N48K65p27O85J81j063L71R85o09p79R08
4049A33N9m09K55K8n63P86J56r27J74Q74o33l91N46L4o5J51j35n39P05M71j108
4070c98J85P96m36k83M46l19j69P36m55n78P60K66q80J90P29o59Q8K92m21QN57
4091D55l13n33O30J14m80lK96k25o8N23o89M3O87m92m59O90n0l32K32j11k21J73
4113a33L12m13p3O28m21l04O19q7l88J94J23m17J63L64n86J96M79k39j42K38j76
4134f3j62M53j09l87M18J73n23Q8L47l22j30L86k55J7L67j69k91L13M6l83R9N49
4156D62m14l06N63k61l04M77J47m49M70r1m87J64L82k58l5J22jl22L13J75n97
$$ plain form
4011 739 -1091 -444 644 -223 -511 338 -150 -325 924 -152 -1072 454 732 -687 -270 498 -351 -115
4029 -115 346 -502 -240 744 -166 -794 304 324 -632 -84 181 -546 139 320 -743 -372 613 4 -775 133
4049 133 192 -217 38 66 -497 289 445 -482 -308 566 -67 -458 88 122 57 208 73 -466 239 710 -398
4070 -398 -213 583 147 -136 310 -9 -178 558 103 -475 285 551 -329 -139 590 -69 19 311 -110 -102 455
4091 455 142 -391 239 353 -127 -130 166 -59 -127 396 -293 -250 437 -55 -514 176 126 -206 26 -85 -306 -133
4113 -133 179 -234 -307 321 -100 -404 215 128 -260 -66 57 -360 -197 167 -419 -223 256 17 -125 113 -63
4134 -63 -225 228 119 -268 150 323 -200 -112 235 -87 -217 169 -86 -69 298 129 -162 151 197 -186 -87 462
4156 462 48 -258 305 44 -260 217 364 -85 385 294 -193 -29 353 95 60 182 181 -141 172 347 -250
4177b50N26l9l61J98J67n28M86Kl56N0M69k99l02N24r8m85J40L25l47l0N21l91
4199g8j63P10o00k99N56J8l56J42J38m21K80K14l91j16P10m17n7K43k72j92L38
4220a3p0j98M38K0o10L75L63m90j29N68k85l28N76j76k92N35l1n80J16O19o27
4241b19M7N39n31M6M99k85n73P72Q4o68K41M08m38J97K91m78j23P51l86n57P30
4262C47J02n94M04o4l81K94L01q52K65N84k42o25N67j27j63M87l46l75O54%p47
4283e11M62N16o85m4M53k84j17N36m63m68R54mq28J68N83n58J40L30n64J45Q23
4304E84q76m85J147N7q05L34L33o82M80L13r12K43J045p65n39P34No44Q19l40
4324D6n96Q91J62j182L36J134q08l17O35j54l49R40p61p18J289K96j462K54J225
$$ plain form
4177 -250 276 237 -124 74 241 -287 199 201 -155 -105 364 65 -237 287 189 -296 -156 169 -178 -208 313 -78
4199 -78 -241 469 -131 -430 126 144 -212 -70 68 -353 -73 141 -250 -366 344 -73 -130 113 -159 -351 -13
4220 -13 -83 -281 157 177 -433 -58 305 -185 -314 254 -31 -359 217 41 -251 284 253 -327 -211 408 -219
4241 -219 -172 367 -164 -118 381 96 -477 295 379 -289 -48 360 -78 119 410 -68 -191 560 174 -383 347
4262 347 449 -145 259 195 -186 108 409 -443 -178 406 164 -461 106 -21 -184 303 -43 -418 236 236 -511
4283 -511 -49 467 -218 -262 191 -93 -210 326 -137 -605 349 345 -483 -315 268 -290 -150 180 -384 -239 584
4304 584 -292 -777 370 427 -378 -44 289 -393 87 400 -512 -269 776 11 -528 206 211 -433 386 46
4324 46 -550 341 503 -679 -343 791 -17 -334 301 147 -202 738 -23 -741 548 844 -618 -364 861
4343H61q76j68N81p17J37R87n25j221J356M42j219K18P80p65K63O14j186k6J385
4362I21p98j153J317L59j106O13N4p31Q08O50j551o9J480n95j183J339L0p47N54
4381A92L0j239J239N89j709J70J448m92q27P59k49o20J258k73j490J310Q67j550
4399e87KJ269o06l78O16p36j71J288l89j440J179Q94j437R5R44q64Q5R90j163
4418d09n28J900n48j606J036Q73j093L65N41r11N12P17j416k96J850n38j126R77
4436C00J91p86P14j27j123Q57J041j207n42J303k72q81Q25j91o51J180k48j437
4454a054J061R41j290k60J197n50l16P19o28n42J556j59j753Q80J145j135k88
4471d76P58m65p8Q45j053n78J753q8j416N37O71o42P7N89r75K52J020j197m12
$$ plain form
4343 861 -15 -183 398 -319 -182 805 280 -941 415 857 -362 -144 636 -129 134 748 -438 -464 921
4362 921 123 -1030 287 646 -460 153 207 -524 284 934 -617 -686 794 199 -984 355 385 -362 192
4381 192 222 -1017 222 811 -898 -728 720 228 -599 160 -89 -709 549 276 -1214 96 963 -587
4399 -587 -585 684 78 -300 316 -420 -591 697 308 -1132 47 941 -496 -401 543 -321 -236 754 -409
4418 -409 -937 963 415 -1191 -155 718 -375 -10 531 -380 132 849 -567 -863 987 449 -677 300
4436 300 491 -295 419 292 -831 26 1067 -140 -682 621 349 -532 293 102 -549 631 383 -1054
4454 -1054 7 948 -342 -602 595 45 -271 448 -180 -722 834 675 -1078 -198 947 -188 -476
4471 -476 282 -183 -261 584 -469 -1047 706 618 -798 -261 410 -232 -155 434 -541 -289 731 -466 -878
4490h78J361J10j270O72J95n34N14J88j105M92J154r82p76J261k28o93Q54j22
4508B13o64P68L27j302L10J275q62o49Q78K8o81Q39m06p79J301N2j188L79P93
4527F32n99l03O10k80j01O46o60o23J280K7r60K47N71m32l4M11o01r7Q41n55o59
4548f39P74L73r95L58L76n87M99J88p60J59Q78n84p25Q54R0o07K94J85o38P78
4568B71J43q03J14P52m45l85N74j14m21N95k38n01L96M30q71oQ61m30k79M18n5
4589Fl49O44k59l47K28L90p41J56N73n04P9M06l31k18P68m22m74M98L96o18Q5
4610c4L05m07J02L05m67R3M89k20m34K96K74l32N8J10k34J84K15l75j78N77j41
4631A86m82M67j51q2J87M0l58P3L15k83J9J98j01K0K02j00k98J81q8j34J81J77
$$ plain form
4490 -878 483 593 -677 -5 190 -344 170 358 -747 -255 899 -83 -859 402 174 -519 335 213
4508 213 -451 317 644 -658 -348 927 65 -584 294 322 -359 480 74 -705 596 648 -540 -161 632
4527 632 33 -270 340 60 -41 605 -55 -678 602 629 -331 -84 487 55 21 432 -169 -266 575 20 -639
4548 -639 135 508 -487 -129 247 -340 159 347 -413 -254 624 40 -685 169 259 -348 -54 131 -507 271
4568 271 414 -389 -275 477 32 -353 221 107 -314 281 43 -458 -62 368 -503 -509 352 -78 -357 61 6
4589 6 -343 301 42 -305 -77 313 -428 -272 301 -203 -124 282 -49 -267 501 79 -395 103 499 -119 -34
4610 -34 271 -136 -34 271 -196 -103 386 166 -268 28 302 -30 28 138 -96 88 303 -72 -250 327 186
4631 186 -296 171 20 -62 125 165 -193 -120 195 -88 -69 129 28 48 250 150 -148 33 -55 -189 -8 169
4653A69k12k30K66J34k00O9%l23J94J32k98J89J28k09M3J40N7k47J49L9j98J71
4675c7K02k12j08L66k56JJ15P4l52L11J33n80M06l6o7J37Qj19q4K51j08j75J95
4698F5J74l09J06Q1k18J13J20k82L07N1k78L8L68l68j12L06k98N3L45j28j03J41
4720A72q2j08Q7J69k78j11L60K0l87N37k74o5O5M5l68L34N6l19K47p1n1r6J31
4743A3N8k40o0L93k24M7J03m34L60J59l30m1J75rk16K10q5mJ22J02l95L85j19
4766c0j93P5N1n5J4M02m43JL04o9k53J24L42m72K44J15k82J7K43j03k36L99m9
4789A46k27J69m2k13K05J85l95M0M47m59r5K82R6k29M45k39k57J96K84n11J31
4810d1N07n41j6L76l08j45M43l71l41M43L50m61j20M46k76p0M12m25k5N23j66
$$ plain form
4653 169 -43 -273 -7 127 -73 -4 -4 -327 -133 -1 -299 -110 18 -191 -148 -8 49 -198 -49 -10 -208 -37
4675 -37 165 -47 -155 211 -45 -44 71 145 -207 104 237 -343 63 27 -40 97 105 -14 -98 153 45 -130 65
4698 65 239 -70 36 117 -101 12 132 -150 157 208 -70 -32 336 -32 -144 162 -136 -83 262 134 31 172
4720 172 90 -18 69 238 -40 -151 209 229 -158 379 105 40 105 150 -218 116 172 -147 100 29 -22 -118 13
4743 13 71 -169 -229 164 -60 -13 90 -344 16 175 -155 -196 -21 -30 -246 -36 -121 -125 -3 99 -296 89 -30
4766 -30 -223 -148 -97 -152 -138 264 -179 -178 126 57 -196 -72 270 -202 42 157 -125 -108 135 32 -204 195 146
4789 146 -81 88 46 -167 38 223 -172 -132 315 -144 -239 43 139 -90 355 116 -141 55 339 -172 -41
4810 -41 466 -75 -91 285 -23 -168 275 -96 -437 6 356 -105 -225 221 -55 -125 287 -138 -163 360 194
4831A94n44L84K91m46kQ6l52K16N78n53k06O53j11o91N50O5l27J48K46n19K64
4852g6L42n55j3N72k73l10M57k91j19M09j42m70M22N26p07O9M20l24j44L43k14
4873g8j07M64o0p45O50K18n86J71L48m00J34L00l18l03O60o1m91K36M09m11k8
4894BJ28l39K40M29o37j51P11no06L21m6n7K29p2p00K65R76q22k91P40l24k14
4916b23L39m8k92O76k64q40N15P01o52r3M23l71O1M98o33k96Q21k19o03K65P77
4937E42o60kK23l72K5O89n81m18Q52Q9q86L38K67l67K72P7n10L58O07p31l19P40
4959B33N9p34M25K5k00M77Rn61J3Q10n41m01O54o7m10N61l43l51O02J3p67K24
4981b70P06n24k42N81q0j92M54m40m35O44K04p89L37M49m65q6L34k50l2O37n00
$$ plain form
4831 194 -350 34 325 -121 -123 -37 -389 -173 405 -148 -354 299 188 -503 47 112 -215 -67 179 -340 -76
4852 -76 266 -289 -302 270 -3 -313 144 -147 -266 143 1 -469 -47 479 -228 -159 261 -63 -207 136 -78
4873 -78 -185 279 219 -526 124 342 -244 -73 275 -125 9 309 -9 -312 348 287 -204 32 441 30 2
4894 2 130 -209 31 460 -177 -328 383 378 -228 93 47 -10 219 147 -553 -288 688 -134 -425 315 -9 -223
4916 -223 116 68 -224 452 188 -652 -137 564 -88 -181 242 -129 -68 430 -203 -499 322 103 -500 -235 542
4937 542 -118 -120 103 -269 -244 445 -136 -554 298 387 -499 -161 106 -261 11 88 -422 -64 543 -188 -507 233
4959 233 292 -442 -17 8 -192 285 294 -267 -254 556 15 -386 268 201 -209 352 9 -342 260 273 -494 -270
4981 -270 436 -88 -330 251 171 -21 433 -7 -442 202 406 -383 -46 403 -62 -148 186 -64 -96 541 41
5002D1m42O30Q8o86J68N00k45J20P3n68M5R81n38o67O84J75n72J01L80o63L22
5023g3K93n13L1N00j40m64M96n2k07K19J87o71O00J34p01L5P28l96l96N79j26
5044F3l60O87m20n01O02L67n97k24O53k81j59K09k30nO36m06m36M73L17n14j1
5065a37M59l59m5L41m62l2O66j67n97M52L31p24K79J83m24J79M37n54n2N09j36
5086A47n53M94N0k79Q0L37p40N02M11n71k65P56l04m32M96j06j24K02l3l94L66
5107D0K57l56j97M36q9k27J38j06j76N04o8n28K96K71k39k08K56n2p1K56k01l01
5129c65N27M2m90J68M15l49j14K93l8j53L14m94K1L15Rk53P1J78j40O3J37l37
5151a80J45L39k00k99L67o8k49K11J72k96L2K42l71M7M45m09m1K88j38kj2k6J4
$$ plain form
5002 41 -401 229 317 -369 -201 299 54 174 247 -321 -276 705 167 -500 184 359 -213 -112 268 -395 -73
5023 -73 220 -293 -262 238 98 -366 130 78 -129 90 277 -394 206 340 -361 -326 402 6 -390 189 63
5044 63 -297 390 -30 -531 71 438 -159 -383 270 -11 -170 39 -191 -196 440 34 -402 71 388 -126 -137
5065 -137 322 -37 -82 259 -203 -235 431 264 -333 119 450 -274 5 188 -236 -57 380 -174 -226 283 147
5086 147 -406 88 138 -141 -61 276 -464 38 449 -122 -387 369 65 -367 129 23 -101 101 68 -326 40
5107 40 297 -59 -256 180 91 -136 2 -104 -280 224 156 -372 -76 195 -44 -252 4 -48 -119 137 -64 -365
5129 -365 162 204 -286 -118 297 -52 -166 127 89 -64 250 -244 -223 92 101 -152 -81 97 -43 20 157 -180
5151 -180 -35 304 104 -195 172 104 -145 66 238 -58 -26 216 -155 -108 337 -72 -113 175 37 35 23 -3 11
5174A1L4K49m70m8L52j25k5K47k9j83j9J05j42K70ok67K4K54k55j1L18k92n9J02
5198C5K0k99K49K96l40j4%m9k6J26M2r6K46j03m64L38J81k69J1K82m07R0K37r7
5222a1k3j7J63k49J70O3j47J13l0j79K10N1j54m1L28j32k60J36K0j13O0O4k11
5245a89K04O8k21J91K54k67Rj53J92k26K18mj68n3K3J13P3J11j30j27J42j30N
5268f5L29k43l1QP2q9N2R0j55p0J68p4lk0M0o2J38k28qK37l7l33L39Q3k19O0r
5295c0J03j88R1j4r1R8J32j82J39o7k27J66K49k37l05M03m9k13J61J42l44K49
5317a4K13k32m7J01j37o0K80L8l08R0J43k05J37K70p26M31K84k18j21J80o4N6
5339I1K08l13N8n2K23k71L4J39j34R7Kj88o5K90r5k66K47P3k69J34K56j28J2l7
$$ plain form
5174 11 45 294 -176 -224 128 3 -22 225 196 13 -6 99 -43 227 221 -46 -22 232 -23 -34 284 -8 -67 35
5198 35 55 -244 5 301 -39 -53 -53 -102 -128 -2 40 -56 190 87 -377 -39 142 -127 -116 166 -241 -151 86 -11
5222 -11 -34 -51 112 -137 33 96 -51 62 32 -147 63 114 -40 -81 247 115 -145 -9 11 -102 -42 22 -189
5245 -189 15 83 -138 53 307 40 49 -104 88 -138 80 76 -92 -145 -122 -9 64 175 45 -82 60 -70 -65
5268 -65 264 21 -10 -2 70 -19 33 123 -32 -102 66 -8 -11 -31 9 -53 85 -143 -151 86 49 -284 55 138 -81 -21 -30
5295 -30 73 -115 -24 -38 -129 -31 101 -81 58 -9 -236 -70 179 -58 -363 40 -9 -222 -61 81 -263 -14
5317 -14 199 -33 -80 21 -116 -176 104 142 -166 -76 67 -138 -1 269 -457 -26 258 40 -81 99 35 91
5339 91 299 -14 44 -8 215 -56 -22 117 -17 80 82 -106 -171 119 24 -242 5 78 -191 -57 199 71 83 46
5363D6Kk1L31l68j54M00j20k46K62q1M1j25J63k52j5K37k15R0P4O1j00J14p8k16
5387a70J53L13o06L29K16m14K01L1j13l9J44j05k33K94J55l53M9J79j46J19J9
5408B3j60rK67l01j62M52k7j51J7J90j90R5K66n75K86K90j99l47K63K51l82L9
5430f4K76l46K06K85l96k28N25l56k01M54K16l55J90l57k03N23J67o05R6N53l76
5451Dk63K47L8k01L39K4l51L87j2m36K55J13p1m2K45l06j10M95l34l68M55J54
5473B62n03K25O4q2m8L12l71j07N67k23m07K05L06n01L25j09j10J54L15n18k9
5494b73M90k1l72P7K05k66K35J68n92L06L22m55j28N60k15j04L1J56l32L70Kn33
5516c69L87L05l75j54N24m43J16K69l61j08N11q3n01K78L03l33r5L43o1k47K87
$$ plain form
5363 46 48 27 358 -10 -164 236 116 -130 132 51 92 -33 130 -122 -137 100 -115 -25 49 110 10 124 46 -170
5387 -170 -17 296 -310 19 235 -179 22 53 -60 -99 45 -60 -293 1 156 -197 -148 31 -115 4 23
5408 23 -137 -146 121 -180 -342 110 83 -68 -51 139 -51 44 310 -265 21 311 112 -235 28 279 -103 -64
5430 -64 212 -134 72 357 -39 -267 258 -98 -299 155 371 16 206 -151 -354 169 336 -269 -173 380 4
5451 4 -259 -12 26 -175 164 188 -163 224 212 -224 31 144 73 31 276 -30 -140 355 21 -347 108 262
5473 262 -241 -16 48 -34 -82 230 -141 -248 319 96 -311 -106 200 -301 24 -85 -195 -41 274 -244 -273
5494 -273 217 196 -176 -99 106 -160 75 243 -349 -43 279 -176 -304 256 41 -63 -32 124 -208 162 164 -369
5516 -369 18 323 -52 -206 318 -125 -9 260 -101 -209 302 219 -282 -4 299 -34 -129 214 153 -94 193
5537A93k48k94O36N4n92J52K37k42K79J46l77J27J95l86k61M25P9k79L8K71k77
5558a24L35k2j68r5M02m31j13L64q5j10J44k7k07K65M6m16N1M91k67l41K30J91
5580A13j96J75k06l08N06J57n19k21O57l44N4K38j79J17K23j93m87N02N7l60J77
5601c7N9M7n4N9j77r7M59j70k43J02L37l97J16R3j20L6K61n60K18L68j52m67M29
5624A10M2k29P6K34m33K89L36m69n6M07k63k52K95l8j8P2K8j62o5M14l04j06K23
5647A31j75nQ2n6k1J77j76K4L3J50l89J17K41l04J87K69m22k8L68j04l11J53O2
5670Cn3l3J33k49K15j00l4j04K11l1l22J86K06l15L31O9j82J97l8k94k05P02j47
5693A46k56rO4k5J96p6p5KJ54m2j59K33r8l04M06o9k14J39J59l28O1L70j26j25
$$ plain form
5537 193 -55 -349 287 341 -251 -99 138 -104 175 321 -56 71 266 -120 -381 44 123 -156 -118 153 -124
5558 -124 211 189 21 -74 328 -103 -216 148 63 -47 97 70 -137 128 174 -242 -191 300 33 -308 -78 113
5580 113 -83 92 -114 -422 84 241 -278 -499 158 -186 -132 106 -73 44 267 74 -413 89 146 -214 -37
5601 -37 22 69 15 74 -103 -200 259 89 -154 -52 285 -112 4 97 -23 13 274 -286 -68 300 148 -319 110
5624 110 152 -77 -1 233 -200 89 425 -44 -100 307 44 -208 87 49 31 103 131 -31 -96 318 14 -92 131
5647 131 -44 -49 33 -23 -44 133 -43 -19 14 164 -225 -108 133 -171 16 285 -137 -165 203 99 -212 -59 3
5670 3 -50 -83 50 -199 16 -84 -118 -222 -11 -42 -364 -178 28 -287 44 113 -69 128 90 -204 -409 293 146
5693 146 -110 -119 -55 -80 116 40 -35 -33 121 79 -80 153 55 -249 157 88 -126 13 172 -156 -95 275 149 24
5717B4P0j52M5K20j38j27J41j45r0J67K59l38L1K00k47J88j1j40k70M54q8j98
5739a45L25J02l53oJ91k32M5J02K9k15K30J64l28M6J83p2j07J13Kj49J27j22k02
5762b72L05p3k12L59L2j36k08M45m26J95l5j31P0R9j50L4J11N7k95Q8K82k52Q6
5785b7N4L1pj06Q2J19j55L6j27P9J04j27j0J90j81J32Q4j60j5L55m23J67J84j50
5809A29j84J62m3k05J20mq3J97J17r8j92J81j9j02J86j7k42L6J35j76j3L34j77
5832D2j75J20K98m67K46M7k53L3J85n8J34n1k75K5L27l18K21k15K18k12Q2J7j10
5855a39L37ok29o2K39j12j42l5L06l24J58M1k59K41K0j45MR4K3jK21l07J9K19
5879A61j94m4O0N6j66K9K34j84P7J36j40l16L37o9n0R9J34j94m9J37k15J07J39
$$ plain form
5717 24 94 -58 -13 207 69 -58 83 -62 -152 15 274 -64 -33 167 -80 108 97 -43 -313 141 53 -145
5739 -145 180 282 -71 -77 114 -118 -73 29 58 -157 73 237 -91 -45 138 66 -41 72 74 -75 52 -70 -272
5762 -272 33 -40 -252 107 139 3 -205 240 -186 9 -26 -157 -87 12 -138 -104 7 64 -231 -143 139 -113 -27
5785 -27 27 58 51 -55 27 146 -9 27 -100 -21 83 -44 -54 136 -45 87 171 11 -4 351 -72 95 279 129
5809 129 -55 107 64 -141 -21 -25 -108 89 206 108 -84 97 78 -24 162 145 -97 -61 74 -102 -115 219 42
5832 42 -133 -13 285 -182 64 111 -142 -109 76 18 152 101 -174 -149 178 -140 81 -134 84 -128 -46 -29 -139
5855 -139 198 192 -37 -99 140 28 -114 -149 157 -167 -9 32 -227 14 34 -111 -107 -13 10 9 230 -77 -58 161
5879 161 -33 -77 -17 39 -127 -98 136 -48 29 165 25 -291 46 -23 -73 26 160 -34 -83 54 -161 -54 85
5902H5pJK80m58K8J39r2J03j11K29l03J21J23q2k33K42J20k06m6J69p3N9R2m54
5926b74M19p0M8j28J1q5O9J87j34k49M29j72k90J29J59j94N1K80j96O2k7j69j67
5949c11K76J11j50J6K3K2n8K72j87RJ83k62r5K25J05k32L4o5J8qN9k28L31N7j79
5974c4k33J54J93j96O7Mp2R8O7k80L18J29q5l53L31k64J33J11q9l9J76J58k96
5997bj53N02l67m5R5l7r3M51l78k89M57Mj86l2K06l19K10J62j87R1O8m6l93M25
6021A44l0k94K90j18Oj42K45k64O4L20k96k63L59J01k34L09j43k78K29K26n15
6042b84J88K29n2k23K35j50q9K38l4k53J75J42l39N8L32k54J81j04k6L4Q9l6m10
6065c53L47J90m49J4K66r8R1K01k56j68L97N0l57J16J96m02L21p6l00K35K87k85
$$ plain form
5902 85 78 79 359 -99 -71 68 -24 79 -32 197 -106 15 138 56 -177 65 185 -21 -67 102 29 88 180 -274
5926 -274 145 75 123 -5 6 -79 -10 177 43 -206 223 51 -239 -110 49 -145 -94 186 -10 52 25 -144 -311
5949 -311 -35 76 -74 -58 -35 -13 -71 201 14 23 206 -56 -151 74 179 -53 -19 -84 -66 -74 -15 -243 88 145 -34
5974 -34 -267 -113 80 -116 -49 -45 -117 -19 48 -232 86 215 130 -223 108 -156 -23 88 -1 -40 136 294 -2
5997 -2 -155 347 -20 -65 30 -7 -100 351 -27 -316 141 145 -41 -73 133 -186 24 186 -1 90 158 112 -281 144
6021 144 114 -180 110 -8 -2 -144 101 -163 -99 221 -75 -338 21 122 -112 197 54 -224 5 231 -284
6042 -284 -96 133 81 -142 93 -57 -146 92 58 -195 -20 122 -217 -159 173 -81 100 -4 -30 4 93 57 -353
6065 -353 -6 184 -265 -251 15 -83 8 209 -47 -215 182 232 -125 -9 187 -215 106 30 -270 -35 252 -33
6087c3O8Kk7k34K59J15k27J71O3k52O5L13l02k12L27J49j41j0L3k10K49Nm97L32
6111FK52l80p5J10k7J45Pj87L6Q8J0l29K87R0j7J27j26l6pJ02j86j26L76J9l70
6136b11O5L14k31r1J89j65R1M14l97k00N32k64k77K33N1P6l0R5m52R7L79n28k6
6159c36L95K5j83J48k5kJ28pl44J08J62j29j52L51q7n1J95j93M2RJ24l23p6M02
6183A81j73q6J79j51K6J05l5q5jJ55r9J4J43j81p7m4L0k7K52j91j12K35k8k11
6207a81K33j8lJ6M4j85m4L86l56O1K33r7k46K18J6l11J75K41k46R3m9j32N0K06
6231A04r4RL0p4j53K07J3j26o7K32p8K7j51J63j09K5NL1j49K21k6j07K84k13O2
6256F6N2j15l8K77l15m5K25M5k58l6J95j13m7K89j52m9q3K91k03J31nj30LJ61
$$ plain form
6087 -33 35 37 10 -224 35 150 -77 94 157 -95 -30 283 -19 -231 96 245 104 94 127 -83 166 171 -326 6
6111 6 258 -122 -197 -87 -114 31 38 -149 -113 -25 -15 -344 -57 33 16 143 17 -19 -26 76 -110 -236 140 159 -211
6136 -211 -146 168 -63 -154 35 -130 -39 375 -22 -222 310 46 -231 2 53 129 99 194 -258 -161 218 -310 -336
6159 -336 59 84 -99 49 24 22 150 143 -201 -93 69 -60 -212 139 52 1 196 3 45 54 178 -145 -221 181
6183 181 8 -78 101 -50 -24 81 46 -39 -40 115 16 30 173 -8 -85 -129 -99 -126 126 -65 -177 58 30 -181
6207 -181 52 34 31 47 91 -94 -138 248 -108 -47 186 89 -157 61 77 -234 -59 182 -64 29 -20 -152 -102 104
6231 104 10 19 49 -25 -178 29 42 -84 -151 81 3 30 -121 42 -67 -42 -37 -6 -155 66 40 -67 217 4 66
6256 66 118 3 -35 242 -73 -118 107 152 -106 -142 53 -60 -107 182 30 -19 -102 189 -14 117 112 -18 -15 146
6280A46r8k16K92j94J99m5j06j08K72O3l11K26m9k71K04qJ01n0J10j88k7r4J53
6303Ar6R1K9l39M02R2k41L9R5j32K4Q9q2l1J01m2k34Q0Q8p9K02j21L5j75K78j38
6329f4j78L09j08o3p3J19l5J34J13j52rJ04Pj96P3J4n6J97n3p1N1k9q6O4m1j00
6355a29l9M41l00j28J29J38j42k3P5P1j10J39n9Q4q4j9Pp3P9m2J9N7j26p3K91
6380A83k91J12J25j5j71K15j21j62K5J78p9r7J89j63M8K5j06L2j2kM2K2J39k55
6404a39R3M0K7J00r4q9j67K68j12o5K11l35M1L04J3j69O4R0j96lL08l49J22J53
6428A16k2j32K31j2k17K4oj34N8Q8P9j39L67k49r7J05NJ63k24r2o8K36n6j05Q8
6453GJ08j46r4K69j55O1m0k8k19J00K58k32p2K48o2p0J18r4k8K97j49k19K29o3
$$ plain form
6280 146 48 -168 124 -70 129 84 -22 -130 142 205 -106 120 71 -200 4 -4 97 47 157 -31 -58 -152 1
6303 1 -95 -4 25 -314 88 180 -61 -22 73 -59 -35 54 -28 -59 42 0 -234 -154 -66 -145 57 -64 -29 -204 74 -64
6329 -64 -242 67 -41 -104 -177 -58 -93 41 154 2 -7 97 104 -92 -19 -5 -61 136 83 12 63 34 -52 12 -29 -129
6355 -129 -168 273 -27 -155 -26 112 -30 -53 22 93 -17 122 63 147 63 44 51 -22 57 15 34 91 -35 -108 183
6380 183 -108 4 129 114 -57 158 37 -125 -100 78 -1 -98 91 -72 -24 1 -105 -73 -85 -87 -45 -23 116 -139
6404 -139 -46 -6 21 121 27 -62 -229 39 -73 -138 73 -262 -221 83 96 -73 -9 81 -115 -118 190 -159 -37 116
6428 116 94 -38 193 181 -36 -12 -18 -152 -94 -6 73 -66 301 52 -45 60 65 228 4 -88 -156 80 24 -81 7
6453 7 115 -31 -125 144 -11 50 10 -18 -237 -137 121 -111 -183 65 3 -67 51 -43 -71 226 77 -142 87 24
6477B4k06J20J70j43O9j50N6J3K35m8j56P9q3lL1P9k54R1K71m02Q9J43J4k80J26
6502a15K00q8J84k35jp5J36r0k1R4K1r5L6K82k56J43Kj90J45kj9j37J51q8j60
6527a78K80k3l0r6N9p5J81J29l58p2K88j56J1K61k13k05L10o3k10P3K18k24J28
6550C5P1j85K70l0j55p4J55r0J7J12Q4k75J27P7j02K5K05k50k43K22R7j56J02
6573C9N6j94J67m0j62J19R4r2k02L22k91K25N3l49J03K75j50k94K18P5n0J38K1
6596H1n8j35L5M8k31L92m5k06J05K6j57o4K75r5jJ91k14j19K61Q4q6l1L5j86K29
6621A34R6m97K73J38l60m9M64j81j17Q6P1j82K01l1j67J19Q9J29m54L61L8j32
6643B9O5j45j01J40K47k89j33K79r0q9J26j4n2J66r3j13J43J83k66o6L59l24R7
$$ plain form
6477 24 -182 -62 108 -35 34 -116 -60 -47 188 140 -16 63 -20 -23 8 87 -167 -76 195 -207 -118 25 39 -241 -115
6502 -115 85 -3 181 -54 -55 -130 6 -84 -105 -11 10 -85 -49 233 -23 120 122 -68 77 75 56 -81 70 -18 -178
6527 -178 102 79 49 -47 12 -63 118 247 -111 -183 105 -51 -40 221 8 -197 113 50 -160 -87 131 -93 35
6550 35 106 -79 191 161 6 -68 87 -3 14 126 210 -65 62 139 37 62 267 17 -226 -4 93 -63 39
6573 39 95 -99 68 28 -134 -15 79 -13 -215 107 -184 41 94 -255 -152 123 -27 -321 -103 -28 -78 60 81
6596 81 23 -112 -77 -29 -260 132 87 -119 -14 12 -145 -209 66 -29 -30 161 -53 -172 89 173 87 56 91 -95 134
6621 134 230 -267 6 144 -216 -265 199 18 -99 -13 58 -124 77 46 -121 -2 87 216 -238 123 161 29
6643 29 94 -51 -152 -12 235 -54 -187 92 2 -87 39 25 -27 139 46 -67 76 259 -7 -73 286 -38 59
6666E9J3j81J30K83j67m73M05J18k18P6J30k58l6L09l83mJ93J69m64M93q3j62
6688e1j6J41l45L36J0k69J1L04p7j10P9n6o4J10J02m56L32oj94J70L2j09p6L74
6712A72j10r7J68J96l73Q6J72k06p7K46k50K03J48j63j48J56l0k65Q8nk1o6J88
6735A2N4L0O7lj05J54j81k51K70Q6j98K27q8j49R5M4j45q8K49k4j43N0J43l29
6759b23K80j51L2K1J31j61M0R8k36R7K8jj23L00k04k38K09K16k69R9J23j89O6
6782e5ML3kp2J23K9rj06J18rj26L2J32o1k9j41J90J02k59K95q0j9j57J64j61M
6808f0J58j28k08K37L01m62R9R3j75n4L58j79N5n9J5l2J40k4k04K10j02K6M7L1
6832H3n6jP7j7k31J54K7j53J57l5M4J49n1l60J90Q9o3j30J83k5j56J85J94j82
$$ plain form
6666 59 72 -109 21 304 137 -336 69 187 -31 45 175 -83 -119 190 -193 -197 -4 165 -299 194 111 -51
6688 -51 -67 74 -271 65 75 -194 -183 121 44 -66 13 -43 -107 3 105 -351 -19 -25 -219 -49 -17 -126 -202 172
6712 172 62 -35 133 329 -44 42 214 8 -69 177 -73 130 278 115 -33 123 93 -172 -84 -89 -110 -176 12
6735 12 66 96 163 160 55 209 28 -223 47 133 -65 162 74 -75 20 64 -81 -169 80 56 -87 -37 106 -223
6759 -223 57 -94 -62 -41 90 -71 -31 67 -169 -72 -44 -45 -168 132 -72 -310 -101 115 -154 -55 68 -121 -55
6782 -55 -51 -18 -20 -92 31 60 51 -55 63 54 -72 -40 92 31 2 -139 51 153 -106 189 109 90 -67 97 -64 -60
6808 -60 98 -30 -238 -1 300 -162 -63 30 -145 -199 159 -20 35 -24 -9 -41 99 75 -129 81 -21 5 52 83
6832 83 27 26 103 86 -145 9 36 -117 40 5 49 198 147 -213 -23 66 3 -127 56 31 -125 60 254 72
6856G2k07K49j16M7L3l83L06M1n5O2o9rk9L7K7L1J4J34l10J67r6N3o4l4J89m8
6882D2j12K04j71k5P9o9K03j13n8n6R6Lj07K39j69OJ04j91L16j27j32oJ24M5l0
6907I5j66J68N4k79K32j02P8ro0P3p2J22k89K15J93j02l5j17k2j71L33r0j00Q
6931d3K00j70M0r3J06j32K23Q3j86N2j64J95j15J2k01K80j72o4J9K26j32j9J12
6954E7J2l7q0q8M0P2K00j60k46L92o6r6l9N4k66K31R8j39J05n5j78K18O7j40N
6979c9RL5k0J04J2j10M4j7q3J16Q5j60P0J45n7j11J22o6o1J65q2k02Q5oL0n9K33
7006A82q2k1n6j49K35k14kJ55p5Q3q8Q1pj01K0R7r7j17K71n0m6Q2j55j62K19K4
7032B7m7j05R9J01k54K20q1l2M4O4j18L1J25Rj18k8j10K18j02n0J43Nj40j27K43
$$ plain form
6856 72 -135 114 -2 45 78 -305 1 42 -13 49 -20 -29 -58 -21 6 37 51 185 -125 42 -54 -1 -65 -99 90 42
6882 42 -70 134 -37 -62 17 -52 151 38 -20 -76 20 23 -84 155 -14 -8 96 -95 221 94 -38 -44 80 125 95
6907 95 -71 97 151 -128 104 2 80 71 11 84 12 134 -155 60 253 151 116 -1 -23 -194 139 49 -51 -43
6931 -43 157 -13 27 -66 40 -92 131 214 28 80 -84 111 -4 8 -193 87 -85 -149 -130 96 -36 -55 57
6954 57 69 32 -48 -136 -96 -24 176 16 -230 162 96 0 -39 15 -251 -20 78 -61 44 -11 -189 29 96 -44 -39
6979 -39 -30 5 -15 89 101 -9 35 18 -65 51 136 -24 46 191 134 23 145 79 18 183 101 -101 -16 -22 8 -51 182
7006 182 100 79 23 -126 109 -105 -107 48 -27 56 -32 49 42 -59 -39 58 -39 -156 115 65 19 101 -54 -216 3 27
7032 27 -20 -125 -26 75 -179 41 -40 -72 -28 36 -82 -51 74 83 -35 -63 -173 45 -57 -107 36 41 -99 -226 17
7057A7k8j68j8L84l23J28No8m1K31j71j31J84o6L9m7O3o7n5K49j32J16M1j72j62
7082a92K11J12k37J72j27p5Q6K16l02P5K67j73j87J08J17j99J01o5J72r6J22j00
7104FqK9j0o7K87j72j67K81kl93J73J11j37j27L07k44rK15K53l23J93l74k8L03
7128I7j61j88J56J30k22J74J47n7n3n2j91k4K97k32L9K38n8l3PJ33l75L0K94k02
7152a06p3N4R8k31K98N1j98N7K08k83o8L80l29Q3Q4j66l5J28L62m83J15O8mR3
7176A03k07J99J3jk24J89K3N0j47J26Rk51J22K41l77J48J13o1r5j1L92n41M5Q2
7200f0L2J00O4j26O9q4j62M0K23j61L7J43L0j40P9l0k10J18L7j99K16J62j37j97
7224a56L3K83k40K8J6r5N2L68n38J88J63j16J30j43J33k25K63Qk45J46J18k64
$$ plain form
7057 17 -11 -179 -197 187 -136 -8 -3 -71 -112 119 -52 -183 1 -65 -26 -73 -10 -77 -132 117 -15 101 142 -30 -192
7082 -192 19 131 -106 66 -61 -136 -50 166 -136 -61 206 33 -154 -46 71 -128 -27 -92 80 -16 106 6
7104 6 -2 27 17 -50 237 65 -102 179 177 -216 -43 68 -69 -196 111 -133 -142 73 326 3 196 -178 -206 97
7128 97 -64 -252 -96 34 -188 -14 133 76 23 -29 -220 -244 53 -179 -140 98 40 7 14 147 -228 -198 96 -106
7152 -106 -179 -125 -27 -258 40 91 -107 -50 158 -125 -193 187 -142 -59 25 -141 -176 -48 314 -169 -54 14 10 103
7176 103 -104 95 108 107 -117 72 95 145 -2 124 133 -118 4 245 -132 16 129 68 -27 -38 354 -187 -142 -60
7200 -60 -28 72 136 10 79 -5 -167 -127 96 -65 -28 115 145 5 84 54 -156 -38 -1 -200 16 178 41 -156
7224 -156 -123 160 -80 -52 -36 -131 -79 289 -249 -61 102 -14 116 -27 106 -119 144 152 -93 53 171 -93
7246i3k35L42j4K1P3j48j39L11n3k44J20J42j69N1Qp6J5LJ20j26J34J7j87J33
7270FJ66k89L32J6j93J35O9l20k7P8N9j89J73o0o5J11K17m8r0J55k82J5L1Q5n3
7295C2R5j50q2J27j4qo1J47k28J24OL8j72K23n0q7N3J06j54p0P1L5j14K83m2p2
7321C6K3J12k38m1L11k99O9L7o2J67j96j0J39j35M5j5J50Pj94J20j33N9o9L46
7345B29k35j18J61p3n4Q9R6k28L7Q0L9J43m1j78K7J69j18j56J85q8P4L2n6N9j20
7370d5rR9JK39j71j51O5j78M1K82r7p1l5J64l0j26K2m8p6J40j23J40q9P3j72K81
7396A26o6j12J97j04J9q0J94k49J61j04r2p6M00j38k4j68J54%R4Lk30J93j14j0
7420b6k8j1K31k48J14jJ39j81K44k92n2K17k23J02L0j00P7Q8j26L4%j8N4R7r7
$$ plain form
7246 -93 -328 14 0 21 94 -54 -193 118 65 -179 -59 83 -86 -35 -27 -103 -88 -85 35 -91 43 60 -127 6
7270 6 172 -117 215 231 38 173 242 -78 -105 -27 32 -157 16 -44 -109 2 219 171 81 236 -46 -31 0 85 32
7295 32 127 -23 -105 22 8 0 -61 86 -142 -18 -12 26 -146 77 27 -60 -7 99 -55 -125 -54 -19 -133 150 108 36
7321 36 59 171 -67 -108 203 -96 -27 10 -52 115 -81 -91 48 -87 -42 -57 93 100 -94 26 -107 -48 -117 229
7345 229 -6 -124 37 -36 -90 -1 95 -133 -96 -16 23 166 125 -53 -26 143 25 -131 54 -34 40 72 16 75 -45
7370 -45 -54 45 46 285 114 -37 28 -150 -109 173 76 5 -30 134 104 -22 0 -48 -124 16 -107 33 -56 17 -155 126
7396 126 60 -52 145 41 60 -20 174 -75 86 -18 -110 -186 214 76 52 -116 38 38 132 135 -95 98 -16 -26
7420 -26 -54 -65 166 -82 32 31 170 -11 233 -59 -111 106 -117 -15 15 -85 -8 80 -46 -12 -12 -30 24 121 24
7445B4K6j25MO8J5J7j66R9j83K37l2r6K43j32L4Mj18J92N0k30K7j5K9l3R6N3j11
7472b3lj63N4J09P3k32J94J39P3j99k9n0R7l4j35J69r7l1Q7l2J1R3l23K14Q1k10
7498a67J00J8P0L0l5M8k02J31j7R2p7L2R3j15K6Nq2Q9k37R5J27J55p6r7J22o5
7524F3j20R6j35J12J86m23J44L7m9J23O6k06L4j40L08k46p1J38O1O4m5r5J30J14
7548A46o0k07O2k4M0J08j51m3J75p1j1L3J18j34J2J52j93J00Q7q1j5l5L6j28m5
7573a29J47n5J58p3j39N1Q2K6l10J60K13k67J32J59k73m4K3K13k56K59r4j52O6
7596a03o4O6J12j60J58p1L00l36j77K81o5rJ07j13Q0O1J75k84O5O0j68M7N7L2
7620E1j02J57k15J51rM0j97N9K07m6k82J37M5j1J35j14K4m9j17M9P2K31m94J63
$$ plain form
7445 24 50 -75 -71 -3 12 29 -137 -38 -221 16 -16 -112 131 -1 33 37 -81 111 161 -69 -42 -57 -28 -61 35 88 -23
7472 -23 -26 -189 -135 -26 47 -185 9 148 221 22 -7 -57 40 6 -129 40 -57 -88 -1 -33 -22 71 -252 -38 43 -167
7498 -167 -67 -49 21 51 16 64 -138 -7 -24 68 -9 23 116 1 27 32 -50 39 -198 -103 24 179 103 6 128 63
7524 63 -57 39 -96 16 202 -221 -77 -40 -89 34 100 -106 -72 -212 96 -150 -221 -83 -22 42 -3 -98 32 146
7548 146 86 -121 -59 -83 -43 65 -86 -129 46 -25 -36 -3 115 -19 -7 145 -48 52 139 58 43 8 44 -84 -129
7573 -129 18 -37 121 48 -91 -40 42 68 -242 -82 131 -136 -4 155 -118 -162 -139 74 -182 77 -17 -169 -103
7596 -103 -167 -101 11 -149 9 -62 238 -98 -275 6 -59 -68 39 -74 6 67 242 -42 23 83 -85 -38 19 51
7620 51 -51 106 -109 42 33 73 -124 -65 142 96 -186 -49 -4 -15 120 6 30 -19 -136 -87 -15 216 -278 -115
7644a15K0J14k41L07j04QJ02j05o5O2Ln0j4J00j36O4R2j67k7R6J90j15nJM5j69
7670a09K04m2l8k0j56P4P4P9j2p7JK3n5oR6k7j13o2K71k89K30j30J19M9j22J29
7696I1r2J06j05R9k40J10o0K78r8j00r2jK29j18k43L37k18QP4K7qk9K16k73J39
7721C7j49K73k24N9O8J72j89J45l54J63O1r7j2K2J46K6n2q6MP6P8j88R2j0m0r5
7747g4QJ15j08J37M7k40K89k46J21p7M1j24J23J05k46K16m4r6P2Qj35KM6R4j24
7772i0J3K61k43o2K90M9l47K80k90L8K09Jk35J62l0j59NJ6J21j73L59j63O2j63
7796h9J64j12O0j11Q7M8J08oj36j28K89j82J13r3q9J37j84R4Q8p6j1m9N1J32j67
7821f2J65k42J08M4J4rj82L02k52m1J16J7RJ00J0j19p8R2Q3k87J09O9l7R6K6p7
$$ plain form
7644 -115 -95 19 -222 85 -19 -11 91 -14 -79 -17 -14 -64 -78 22 -114 -50 42 -125 -152 -56 134 19 14 15 60 -109
7670 -109 95 53 15 -5 -161 -87 -13 66 54 -23 -22 1 -54 -60 36 9 -104 -166 105 -184 46 -84 35 84 -38 91
7696 91 -1 105 0 99 -141 -31 -91 187 89 -11 -103 -104 125 7 -236 101 -117 -109 -35 -8 -16 -45 171 -102 37
7721 37 -112 161 -63 -4 64 236 47 192 -162 1 62 -35 -47 -25 121 147 95 9 13 89 167 -21 71 61 21 -74
7747 -74 -66 49 -59 78 125 -115 174 -72 49 -28 13 -111 12 117 -129 87 43 -53 19 27 -108 -106 -60 34 -90
7772 -90 -77 184 -59 -121 169 218 -129 151 -139 -101 108 109 -126 36 6 -153 -148 -132 -11 -184 175 12 74 -89
7796 -89 75 -37 23 -88 -1 47 155 149 13 -115 174 -8 105 12 -77 60 -124 -30 58 -18 -29 -78 -27 105 -62
7821 -62 103 -139 -31 13 27 18 -164 138 -114 -155 -39 -22 -13 87 97 -22 -100 -8 75 -212 -103 -34 -71 25 51 -26
7847b6J57j18N0j57K21k17R8k2j82J95j0J31j66J86j51J09k54M6J58q4J08k04
7869a32k4L11j21m9J47j53J34k17M4j07J07R6l04K31L8m8j15J08Pr5J5j35L67
7892A05J08j08j09k6n1J27j43K26j51n6J74ql1q8J38j21L8j05K4j03J54J34J3
7915A41j00j46J13N2J19j20j98L04j76k5J08p6j42L08k26kJ67r4R6k21R1O6j22
7938h3mlk8K52k22M6J05P9k03J7Q9l1O1k6j16P4J22j79K8m9nN0l7R7j15k2K3J1
7966f9l7M0l7j06Q7NJ87k11J69j10L3J37j04l8kj00Q5K5Q5p5O7n9Q4j24J26j7
7992D1o0O7n0Q9K5K2j18P7j53J90q5j29j0K08q0n5J28q3K0p5L5L45k45n1j4NJ73
8019B17l28J10j1J1O8n3O3m9k1r7J79j21J48j01N8j22K10Qk73J96j95l9J86l9
$$ plain form
7847 -26 131 13 63 -94 127 -90 8 -14 -196 -1 -11 120 -46 140 -11 98 -156 -110 48 -36 72 -132
7869 -132 -156 155 34 -15 132 -21 113 -104 -60 -167 -60 36 -268 -37 1 -47 -162 -54 -47 -142 -127 -262 105
7892 105 213 105 -4 -30 -81 46 -97 129 -22 -78 96 88 57 -31 107 -14 24 -81 -57 -160 -6 128 141
7915 141 41 -105 8 60 179 59 -139 165 -11 -36 72 -4 -146 162 -64 -66 101 7 103 -118 -27 39 -83
7938 -83 -87 -90 -118 134 -88 -42 63 142 -61 -44 45 14 75 49 -67 7 129 -50 -22 -71 -76 -26 -63 34 -81 -103 -80 -69
7966 -69 -106 -66 -103 -209 -122 -117 70 -141 28 -82 -49 88 -16 -54 -56 -156 -71 -46 39 -36 31 -28 56 -68 58 41
7992 41 -19 48 -2 87 112 134 16 93 -60 130 45 -84 -94 114 34 -21 107 24 44 -31 4 349 104 53 39 44 217
8019 217 -111 -1 -12 -1 67 14 77 28 7 -90 89 -32 116 15 73 -49 161 169 -104 92 -103 -142 44 5
8043Em7k9j20Q6PoK11j81N9j33K05k34J13q6L54k24qL8j31R5j6k6J00oL5k6q7
8070e2J14k01K5J49P4p9r2M6rN9k1p7J14K6j46j53J53N1j7N7m7O6J02j56r3K11
8096A04j2j3j95J79lJ2J14k22j38Q7k8K04j95N4l4J85r8J09m0j82J17J28o9n6
8120Hl7O9K2j7j19R6m7j58J68N2j8L0O1j11J4M9n0o7r2K42j13o1J13k20K34N9
8146A07o1m8k9N9k03K61j27k25K90J27j79J94j87O5j08o3J10M6J3j25m7K16j70
8169h4J25j99K5J16n4J21j19J8J51j0j24K71l16J7K0M6P2r8J06r7k3q5
$$ plain form
8043 5 -42 -71 -191 -105 -98 -104 107 -74 -15 -148 57 -177 -64 -150 204 -20 -28 10 -121 -26 -42 -68 32 26 61 35 -52
8070 -52 62 -139 -114 35 109 30 -62 -16 -25 34 13 -64 50 76 -70 -223 -70 -19 -36 21 -26 40 142 -14 -107 104
8096 104 92 79 -116 63 60 72 186 -36 -174 -87 -115 89 -106 -52 -86 99 1 110 70 -112 5 133 64 8
8120 8 -29 40 62 45 -74 22 -25 -183 -15 37 19 49 110 -1 13 62 12 -55 -147 95 -18 -79 34 -186 48 107
8146 107 46 -2 -31 28 -175 86 -41 -266 24 151 -28 166 -21 44 -64 -127 -17 29 42 -83 -130 86 -84
8169 -84 41 -158 -133 -17 -71 50 -69 -51 100 90 -34 237 -79 -62 -42 4 76 -22 84 -13 -36 -121
8191a21
$$ Imaginary data points
##PAGE= N=2
##DATA TABLE= (X++(I..I)), XYDATA
0@%%%%%%%%%%Qj6J6j6J6k4L2m0M8n6P2q8J04j20J41j65J90k21K54k89L28l74M26
33B26m82N44o12O85p67Q59r55J058j176J305j444J596j760J941k140K359k600
50a363K864l154L475l836M242m700N225n830O534p369Q382r631J1214j3306J6196
65H943k0446K7302m0083P1361k74829l05827Q77107m4923n82257J82806J55420
76E4574j90973K80348l6483m74665L39915M82336n31541k62464M76686j382k37067
87a00716J45726j36057j02715M29148q0418n41448K97592M39185l73606j80092
97b03401K85792n4658n963J68832l03920j08353M99496q2908n07062K40276K99701
108B27832k86584r303J45519k32852J24508L23095l79683k13563N13815J0732
$$ plain form
0 0 0 0 0 0 0 0 0 0 0 0 8 -8 8 -8 8 -16 16 -24 24 -32 40 -48 56 -64 77 -88 102 -119 135 -154 174 -200 226
33 226 -256 288 -324 361 -406 453 -502 556 -620 685 -759 837 -923 1018 -1122 1237 -1363
50 -1363 1501 -1653 1822 -2014 2228 -2472 2753 -3077 3457 -3912 4470 -5161 6053 -7253 8943
65 8943 -11503 15799 -24284 47077 -227752 -533579 343528 298605 -283652 -100846 54574
76 54574 -136399 143949 107466 -367199 -27284 455052 -76489 -338953 137733 136351 -100716
87 -100716 45010 -91047 -193762 235386 154968 -386480 -88888 350297 -23309 -203401
97 -203401 82391 27733 21770 190602 -113318 -221671 277825 194917 -312145 -71869 227832
108 227832 -58752 -68055 77464 -155388 -30880 292215 -87468 -301031 212784 223516
118B23516m34449J73954J79560k37188J23348J21082l70926Q5166M36007k93135
128F935l31568L80053J40148k83215M4838P4386r7389J77547L2805l34534J07436
139h2558L38939k29261k17619K26500K8456j06028J03324r4469j24317K76586
149A19553M8096l39209Q0821K76793j53371j06420J24632p9932O19J80774j81481
160b9125j81817K98559P4038l16864N0078K10188j19462k5612R9376j37961K0475
171e8127K28038j57215k00080K44690Q6479k37535L2846J20768j11163L3892R7493
182H0086j66528j6875K21062o7360j70496J15607P5218p2363K5696k7430o8992
193g2375J38790L7991k13322K6504J98928r3695j21033J03726J2945m6625P4678
$$ plain form
118 223516 -210933 -36979 142581 -94607 28741 149823 -221103 -135937 300070 6935
128 6935 -324633 55420 195568 -87647 -42809 31577 -65812 111735 144540 -189994 -82558
139 -82558 256381 27120 -190499 36001 64457 -41571 61753 -32716 -157033 119553
149 119553 167649 -171560 -90739 186054 32683 -73737 50895 -29037 -28418 152356 -29125
160 -29125 -210942 87617 161655 -155209 -105131 105057 -14405 -40017 59359 -78602 -58127
171 -58127 169911 12696 -187384 57306 143785 -93750 -60904 59864 -51299 -17407 80086
182 80086 -86442 -103317 117745 50385 -120111 -4504 70714 -1649 24047 -3383 -72375
193 -72375 66415 104406 -108916 -82412 116516 22821 -98212 5514 18459 -28166 46512
204D6512m3102r1544J35849N6279j68001J2840J31679o6203m7154O1468n5547
215b6924j2362J14408o9488j19754J34542P6194j45725o850J10492l3665l0028
226i160L9073m3546k440Q2242n2972q0852Q4121L6465q7683Q913M8225l6727R147
239e194L3404n0760K463O8368l5948m6474N4796N654m5750K7099M992m4643L2513
252E20K4686o0967P195N6890l6307k5228N0493j0261l1669M2502J716m7549L1261
265C282K8484n1748n05M2007k9009k0538L6486q987k7186L0492Q981k9927J5661
278b507K0391k2599L876J7733k0245k151K2689j8065j7853K3886J653k3592Q819
291g965J2450j0850L382O927p492Q055P945j4093L187J4186j4330q157J8257p400
$$ plain form
204 46512 3410 -88134 47715 103994 -64007 -51167 80512 14309 -32845 28623 -26924
215 -26924 -39286 75122 5634 -114120 20422 96616 -49109 -55959 54533 20868 -9160
226 -9160 29913 -13633 -16073 66169 13197 -67655 16466 52931 -34752 -25839 22386 -14341 -5194
239 -5194 28210 -22550 -20087 48281 12333 -34141 20655 26309 -19441 7658 12650 -31993 520
252 520 25206 -35761 -28566 28324 -7983 -33211 17282 7021 -24648 17854 19570 -27979 3282
265 3282 31766 -19982 -20487 21520 -7489 -28027 8459 -528 -27714 2778 11759 -18168 -2507
278 -2507 17884 -4715 -839 16894 -3351 -5502 17187 -878 -18731 5155 6808 -16784 -7965
291 -7965 4485 -6365 -2983 3944 -3548 4507 12452 -1641 1546 15732 1402 -6755 11502 4102
305D102j9459J6709R015k3572L000K1544r601r326J3294L498n758L946r09l977
319B506P246j833j3495O052Q785j3514n374J2979r69r442N519P672m554k168O607
334F017O16m579r1K996j540o227j200M909l465p252L964N485m411l640O912L948
350B442m259k15M278L0j310j690j507K054q90n343n34M649j991n014N271M498
366D69n374K073P214m159k056P830j402q084M535M660q233k944N544j639j824
381c390Q34k226M489N557p579j036J2530k456j0386Q797L561j2041N115O633j5328
396f926Q48J5875j1391j0353J5701Q93r481R638r31j0101J7934L382k7935J1315
410a532K6400k6281j4703K7856n264j9348J8478r56k1620K3055J1857l3226P634
$$ plain form
305 4102 -15357 1352 10367 -13205 -10205 11339 1738 -7588 5706 9204 3446 7392 6483 2506
319 2506 9752 7919 -5576 476 9261 -4253 -9627 3352 2383 -7059 -1540 6132 1578 -590 6017
334 6017 6633 2054 1963 4959 3419 -2808 -4008 901 -2564 -9816 -5852 -367 -4778 -8418 -1506 2442
350 2442 -1817 -2032 2246 2276 966 -724 -2231 -177 -1067 -6410 -6944 -2295 -4286 -9300 -4029 469
366 469 -4905 -2832 4382 223 -1833 5997 4595 -3489 1046 5706 -2527 -5471 73 -1566 -3390
381 -3390 -2556 -4782 -293 5264 -2315 -3351 9179 6723 -3663 5134 8695 -3346 1769 8402 -6926
396 -6926 -6078 9797 -1594 -11947 3754 4647 -4834 4804 3873 -6228 11706 15088 -12847 -1532
410 -1532 24868 -1413 -16116 11740 6476 -12872 5606 4650 -16970 6085 17942 -15284 -7650
423g650L0341k1605r770K2414j4776p439K9517k0479l0894M2584J1155n1334J2749
436a5187L6929k9905n449K8652k5081o082M3708k4020l7557M6220J1527m7243
448b3488J7245K0207l5683J9131K8015n5555L98O9831l3599n2720N5322J7362
460B6466m6141K2530J1749m2268L5699L3045p2681k770P7604l1948n0830M7068
472G523L331l0244M1638j1091n9505O2269M6073r1567q250Q5258k9134m3502M1172
485A3971j7049k0675O4123k6946p9347P4789N5966r5299q230P5224l1952j7300
497a2725M4202m9431j8111R5542l1688j00760P5097O0979q6089l090N0804m3856
509a9126J6973N3864q4602k2521J22121k7432j08713O7556N2049o9105J8073K4483
$$ plain form
423 -7650 22691 1086 -8684 13730 -1046 -8485 21032 553 -30341 12243 23398 -27936 -15187
436 -15187 21742 -8163 -13612 15040 -10041 -16123 27585 3565 -33992 12228 23755 -23488
448 -23488 -6243 13964 -21719 -2588 25427 -30128 -29730 40101 6502 -46218 9104 26466
460 26466 -19675 2855 14604 -27664 8035 41080 -31601 -34371 43233 11285 -39545 7523
472 7523 10854 -19390 22248 11157 -48348 13921 59994 -31573 -39823 45435 16301 -27201 13971
485 13971 -3078 -23753 40370 13424 -65923 8866 64832 -30467 -38697 36527 4575 -12725
497 -12725 31477 -17954 -36065 59477 27789 -72971 2126 63105 -22984 -26074 24730 -19126
509 -19126 -2153 51711 -32891 -55412 66709 39277 -69436 -1880 50169 -18936 -863 23620
521B3620o9871M3338P5985j05680m2280J25825r785r3415M5263K3546l9885N3559
533C0220o599r9021P1711R4879j19496m9710J19030r420o8470M6169j5101l9979
545d5787R3733n311j30343O4148J14534r6437n5316Q1025q163j7319M3647o7561
557b9150l3623J32757j3882j49007O5908J07646q7155l1388N8509l9130J2136
568f379P3708r0641n8130J40101R339j34999L7514P5370n1404P076J5948p4206
580e6703M9928R6182j12983o7889J38949J3258j07498L5532L2418m5562N4984
591C0616J1336j13751M7160J19245r5122p7048J01090J3374n6324L5987k1064
602d501m4569R8001J1906j35791L9646J19008p4325n9085O4433j3257j1485N9256
$$ plain form
521 23620 -46251 -2913 73072 -32608 -74888 50937 41152 -52263 -7000 16546 -23339 30220
533 30220 23621 -75400 -3689 91190 -28306 -78016 41014 31594 -36876 9293 -5808 -45787
545 -45787 47946 42635 -87708 -23560 90974 -5463 -60779 20246 12083 -5236 38411 -29150
557 -29150 -62773 69984 56102 -92905 -26997 80649 -6506 -37894 20615 -18515 -6379
568 -6379 67329 -23312 -81442 58659 67998 -67001 -29487 45883 -5521 1555 17503 -56703
580 -56703 -6775 89407 -23576 -91465 47484 60742 -46756 -11224 21194 -24368 30616
591 30616 41952 -71799 -24639 94606 -516 -77564 23526 36900 -19424 16563 -4501
602 -4501 -49070 48931 60837 -74954 -35308 83700 9375 -49710 14723 1466 -10019 49237
614D9237o6287o2318J27827K3695j44457K6541J05422n4576k8955L8295m7268
625c2844J7717Q8669q6105q1158J28759L5174j22329J6395O3953m0837J9798K1651
637B8843q8697L2221J15510q7322q9493J13729L2997q9685K3344K3337m6713N6209
649B4280K6589j12744K1845J21172o7477q1244Q0218J8185m7293L6406j7822n4182
661e2067Q5428L0483j22216J6316J07366n5038n1783N7995j9308k1635P1074l9429
673G186q1812R4629N1599j13005j295Q4660l5502k1468L7628m6111k615Q6721
685F0615n0145q4950R0601M5673r4324O714N5477m0841R543M1199o9437q258R8951
698F0818l6384q6172O4553M1529n9657Q557J8646l9625L6564L6358q1505n811
$$ plain form
614 49237 -17050 -79368 48459 72154 -72303 -45762 59660 5084 -23871 14424 -32844
625 -32844 -15127 73542 -12563 -93721 35038 70212 -52117 -35722 28231 -12606 7192 28843
637 28843 -59854 -27633 87877 555 -88938 24791 57788 -31897 -8553 14784 -31929 24280
649 24280 50869 -61875 -40030 81142 13665 -67579 12639 30824 -16469 19937 2115 -52067
661 -52067 33361 63844 -58372 -42056 65310 10272 -41511 16484 -2824 -24459 46615 7186
673 7186 -74626 20003 71602 -41403 -42698 41962 6460 -15008 22620 -23491 -26106 60615
685 60615 10470 -74480 16121 61794 -32530 -25816 29661 -11180 -1637 39562 -29875 -38133 60818
698 60818 24434 -61738 2815 44344 -15313 -6756 11890 -27735 8829 45187 -36318 -42129
710d2129R2833l0957o7746N1476J9092m1567K7887L773n2004M1807M3258p3544
722b7821j1953P3609k2832m2814L9523l500k7828M4176m988n9187M2939M6092
734D5416o3780j3089N6511j8636k4234L2777j7533k2923M9277m336n6057L2670
746c937L8415m4783n687L3766k1759m382L2353k8304k1962M8458j785m7782K3823
759c566K5709l1017L132J9324k5305N294L0797k9209j8634M0894j886l3767J8993
772G59J1652k2089J2765J0167k9427R583L0630k7360j7978L3372k69k4585J5059
785B279N951j7541J3432Q674k4357N349K2884j7400j1613J9326l361j1827J3661
798E457k760j4851J6211P218k1996L486J8442j0659q889J0947j980m768P995n080
$$ plain form
710 -42129 50704 19747 -47999 3477 22569 -18998 8889 12662 -39342 2465 45723 -27821
722 -27821 -39774 33835 11003 -31811 7712 4212 -23616 20560 15572 -43615 -676 45416
734 45416 -18364 -31453 25058 6422 -17812 14965 -2568 -25491 23786 19450 -36607 -3937
746 -3937 34478 -10305 -15992 17774 -3985 -8367 23986 -4318 -26280 22178 20393 -27389 -3566
759 -3566 22143 -8874 -5742 13582 -11723 -6429 24368 -4841 -23475 17419 15533 -18234 759
772 759 12411 -9678 3087 13254 -16173 -6590 24040 -3320 -21298 12074 11805 -12780 2279
785 2279 8230 -9311 4121 12795 -11562 -6213 16671 -729 -12342 6984 3623 -8204 5457
798 5457 2697 -12154 4057 11275 -10721 -7235 11207 548 -8341 2606 626 -4142 3853 -1227
812a227p727J2035J370j3581N882Q600r628J48Q231p028k628J0939m031r433Q746
827F68M652r107N37N336l219n9K376l795R75N957m423m351O971J651o772K061
843e42M329l209j500L134j027k159K070M25j661R3J179o8m70j37R0J378p14j206
861EJ065J143j404j024J058O92j197o34Q42K63n74l25N87N34r07J78Q43n20o46
880b1P00J41r80l23Q92l03j051N01O46m56q55L99J003k13j254N56J060n60j358
899a476O55J340j617q53J768m24j770J458P57j873L47K311j021j890J979O38j265
916i36Q34n84p27K196k28l600K173L599m110j651N071p47m046L433J670m539K553
933C61L187m702j70M291k196k120L367j905j678N214k227n866O632L452q651R17
$$ plain form
812 -1227 -8954 3081 4451 -9130 -3248 5352 -4276 -4128 4103 -2925 -5553 5386 1355 -8078 668
827 668 5320 -3787 -3250 2086 -1133 -1192 1184 -2611 -1636 4321 -102 -4453 2518 4169 -2603 -542
843 -542 3787 578 -922 2212 1185 -974 1096 1521 -140 -47 1132 1064 594 457 547 1925 1211 5
861 5 1070 2213 809 -215 843 1535 338 -296 546 809 235 -90 497 1031 124 302 1145 625 -21
880 -21 679 820 -160 -483 409 106 -945 -444 202 -254 -1109 -710 293 80 -1174 -618 442 -118 -1476
899 -1476 -821 519 -1098 -1951 -183 -607 -2377 -919 -162 -2035 -1688 623 -398 -2288 -309 329 -936
916 -936 -102 -686 -1413 783 555 -3045 -872 2727 -1383 -3034 2037 1290 -2756 677 2347 -2192 361
933 361 3548 -1154 -1324 2967 771 -1349 2018 113 -1565 3649 1422 -4444 2188 5640 -3011 -2094
949b094P642m781l026O356l098m140P369j071q503O369M405q175J638M948o049
964b210J827P051r257l179J3952l804j3141R545O452j0731J882N733q574L070
978a384R256j2232m236J6161l820j2657R759L168r763P870K556j5035Q553J4377
992A2573j8219o668K0374l794j3832J0770L65r441J3245M25j9826J1917J6675
1005A4564j9866n652J8690o848p326J3784r258j0892K3417k79k7684J3085K0679
1018A6414j9291n748J5320r024m40J5758j7422j1354K9868j433k9687J3877J6936
1031A3774j8248K556J0206j8806P128K4624k5382j7403L4977K344k9727J0897
1043c060J1616j3845J0939L851k6861J3644K9634l0235j7659L4567j026k2512
$$ plain form
949 -2094 5548 767 -2259 4097 999 -3141 4228 3157 -5346 1023 5428 -2747 -1109 3839 -2210
964 -2210 -383 6668 -2589 -5768 8184 4380 -8761 784 7236 -3495 -1613 4120 -4454 -1384
978 -1384 7872 -4360 -8596 7565 3745 -8912 847 4015 -5748 2122 4678 -10357 -1804 12573
992 12573 -5646 -12314 8060 4266 -9566 1204 1569 -7872 5373 5798 -14028 -2111 14564
1005 14564 -5302 -10954 7736 888 -6438 7346 -1912 -12804 10613 10334 -17350 -4265 16414
1018 16414 -2877 -8625 6695 -2329 -2769 12989 -4433 -15787 14081 12648 -17039 -3162 13774
1031 13774 -4474 -1918 8288 -10518 -3390 21234 -4148 -21551 13426 15770 -13957 -3060
1043 -3060 8556 -5289 5650 9501 -17360 -3716 25918 -4317 -21976 12591 11565 -10947
1055a0947J4943p36j6728K5548M254l9473J4508L6415k8669j9294K8371l131j2322
1068g261J8242j4129j8008L7089L751m5392J4572L5087k5931j1346K1319j4228
1080f235j607K9164k5455k6285M4915R283m6693J0428K9009k0314J62J3954k7195
1093a6869P253L9836l1736l2836M6271J1858m0621R818J6625j9621J5947J1983
1105A7908m1552R065M9008l0910l5808M0653R351k8924J4772L69k3760L2161J4488
1118B6821n3670O847N3709k6938l2851L2131J723j6688K3317j2634l0607M2159
1130A3319J8548n6425M020M7710k2148j9924K4256j3888o879L7584k1745m1067
1142c6639M6391K4962n2921p16L7465j7388n862J8553k6972k379M6213k2093m4220
$$ plain form
1055 -10947 3996 3260 -13468 12080 16334 -23139 -8631 27784 -885 -20179 8192 5061 -7261
1068 -7261 10981 -3148 -21156 15933 19684 -25708 -11136 23951 -1980 -13326 7993 -6235
1080 -6235 -7842 21322 -4133 -30418 14497 23780 -22913 -12485 16524 -3790 -3628 10326 -16869
1093 -16869 -9616 30220 -1516 -34352 11919 23777 -16844 -7026 9599 -10022 5925 17908
1105 17908 -23644 -14579 34429 3519 -32289 8364 17715 -11209 3563 3932 -19828 12333 26821
1118 26821 -26849 -20002 33707 6769 -26082 6049 7772 -8916 14401 1767 -28840 13319
1130 13319 31867 -24558 -20538 27172 5024 -14900 9356 -4532 -11411 26173 4428 -36639
1142 -36639 9752 34714 -18207 -18923 18542 1154 -4708 13845 -13127 -15506 30707 8614 -35606
1155c5606M0113K3537m0167K743J9556k0511J2514K0505m1758m728N4705j7916
1167A2987m5025L1398J9719k7451Q087N091k4756K4247K2998m6717o789N1163
1179B4952j3179l4494K3267N588j5793K1749o023l4768L1530K9395m6735j0947
1191b5458M3719q618k2078J7028p483r007L1323j0103l9057L0049K9186l8273
1203h772q978K9510r310o638J6525k0368q836L8483p967m0413K3222K6170k6694
1216d066m638J5140j2947O705J8546k8643j0249L9564m881l4789J7020J6348j7388
1229d278N581N011k0461J3890K2767k9880j2711L4305k369k4157J2337M336j1224
1242f853J5654r68k6575J7156K4318k8497j1590K7354l139j4204J1253n361r131
$$ plain form
1155 -35606 4507 28044 -12123 -9380 10176 -10335 2179 22684 -19074 -23802 30903 12987
1167 12987 -32038 -640 19079 -8372 -285 4806 -19950 4297 27295 -19422 -26211 24952
1179 24952 11773 -22721 546 6134 -9659 12090 6067 -28701 2829 32224 -14511 -25458
1191 -25458 18261 9643 -12435 4593 -2890 -11897 19426 9323 -29734 315 29501 -8772
1203 -8772 -17750 11760 2450 -4188 12337 -8031 -16867 21616 13649 -26764 -3542 22628 -4066
1216 -4066 -8704 6436 -6511 194 18740 -9903 -20152 19412 14531 -20258 -3238 13110 -4278
1229 -4278 1303 6314 -14147 -257 22510 -7370 -20081 14224 11855 -12302 35 4371 -6853
1242 -6853 8801 7833 -18742 -1586 22732 -5765 -17355 9999 6860 -7344 3909 -1452 -10583
1255a0583K1943j888k8196J4469K2110k0885q134J6258n779k628J2403j4199r195
1268a4304K5605j091k6565J1621J7052j5384k099R602j0080K839J4383j5854r580
1281a3855K2471q6j9526Q756Q816j0547N036M454j4702O773J6140j6509r797J9914
1295G338L2j4357P501K832q422R143K613j5864O503J4582j3112p109J3568k227
1309C021o923Q221l181q096J2177K274j5634N186J2340j0259m287R269l975k667
1323b534P839n725o368J1682Q03j2407N087P990q294l3O038o562m05R261o255
1338A17p215J0259J562r510L510M708n792J711M288o918N84Q030n765n018P933
1353B484J26o802M190K308n978L068L935o579j99P178l969l990N503l01l572L236
$$ plain form
1255 -10583 11360 9472 -18724 -4255 17855 -3030 -11164 5094 -685 -3313 9090 -5109 -14304
1268 -14304 11301 10210 -16355 -4734 12318 -3066 -5165 4437 -5643 -2804 11579 -4275 -13855
1281 -13855 8616 8530 -10996 -2240 6576 -3971 1065 5519 -9183 -2410 13730 -2779 -12576 7338
1295 7338 7370 -6987 514 3346 -5076 4067 6680 -9184 -2681 11901 -1211 -8320 5248 3021
1309 3021 -3902 4319 1138 -6958 5219 7493 -8141 -2955 9385 -874 -5161 4108 133 -2534
1323 -2534 5305 -420 -6788 4894 5697 -6710 -1623 6367 -1927 -1960 4078 -2484 -2889 6372 117
1338 117 -7098 3161 4723 -4787 -1277 3431 -2361 -650 3638 -3280 -2696 5334 -431 -5449 2484
1353 2484 2610 -4192 -2 2306 -3672 -604 3331 -3248 -3447 3731 -238 -4228 1275 974 -2598 638
1369F38j64l872L914K305n990P83N461l973k149N032j739k735L903j34l933K980
1385C27K431m258M25L583k708j064L448k047j712L732q14l350L037J694l806M65
1401f17L289k405j430L085r85k131K394K50k467J290J269j809K24J341j470k73
1417d45J950j318j289K164j07k009J355R90j949M0J639j111o57J111j45j142J477
1434E54l88j203J433K4j442Q30Q58j429k67J942j172j473K116l2j792Q23J262
1451F44j577K25R80q23k64J106r62m16J666r33j129J763M4j639R37R93j515L34
1469e66J321j346l18J844p27j063J094J44o18R56p12j136K244J39k650J266K261
1486B133k310o64K467j299j017K385j038k011K823L68l038J341J704k305N49J673
$$ plain form
1369 638 474 -3398 516 2821 -3169 -2386 3075 -898 -3047 1985 246 -2489 1414 1280 -2653 327
1385 327 2758 -1500 -1075 2508 -200 -1264 2184 137 -1575 2157 1343 -2007 1030 2724 -1082 -617
1401 -617 2672 267 -1163 1922 937 -1194 1200 1450 -1017 273 1542 -267 -43 1298 -172 -445
1417 -445 1505 187 -1102 1062 955 -1054 301 1291 -658 -618 1021 -90 -747 364 219 -923 554
1434 554 166 -1037 396 420 -1022 -192 666 -763 -1030 912 -260 -1733 383 351 -1441 -618 644
1451 644 -933 -708 272 -551 -815 291 -671 -1087 579 -354 -1483 280 324 -1315 -378 615 -900 -566
1469 -566 755 -591 -909 935 208 -855 239 383 -235 721 9 -1127 1117 1256 -1394 -128 2133
1486 2133 -177 -841 1626 327 -690 1695 657 -1354 1469 1837 -1201 140 1844 -461 88 1761
1502A761k866N78L669l304k360M535K87m236K075J513k812J733J594m365J214
1517i84M606m156k515M864p76k949L266q88l524M758J236p060K495N898n051k609
1533c389N057j785k010M678k922m579P205J424q735K839O221n482p92M486m421
1548b205k27P329n343o390R337K420r744K962N346n536J396M089p680J201J0203
1563G158p224p549J0637J779r148M279K849o866N458M771j2024J519J3100p482
1577A257q605R920Q75o590N594q78p973R674N013j5222J611J4415p707p441R095
1592C038j962m635R579m318j1060J2306P349j6610L54J3260o394m300P607o882
1606b668j988J3989p002j4355J4374Q438j6330M30J0432p154P47P595j2045j785
$$ plain form
1502 1761 -1105 -527 3142 -162 -2522 2013 2300 -1936 139 1652 -1160 573 2167 -2198 -984
1517 -984 3622 -534 -3049 1815 1039 -1910 1356 468 -3056 1702 2938 -4122 -1627 4271 -780 -3389
1533 -3389 1668 -117 -2127 2551 -371 -4950 2255 3679 -5056 -2217 4004 -1478 -2270 2216 -2205
1548 -2205 -2432 4897 -446 -6836 2501 4921 -4823 -1861 3485 -2051 -655 3434 -4246 -3045 7158
1563 7158 -66 -7615 3022 4801 -4347 -68 2781 -4085 1373 6144 -5880 -4361 8739 1257
1577 1257 -7348 2572 3447 -3143 2451 1573 -6400 3274 8287 -6935 -5324 9091 1384 -6057 3038
1592 3038 1076 -3559 6020 1702 -9358 2948 10297 -6313 -5959 7301 907 -3393 4214 -2668
1606 -2668 -4656 9333 2331 -12024 2350 10788 -5542 -5112 5320 -1834 -1087 6508 -5537 -7322
1620g322J7923o848j6059J2788P877j2609K371M711r063P246Q515j7412k072K0933
1634A0979o516j5759J1412N134r297O407l5j2329J1321J1027j9352l583J9603
1647I012m690j1630Q461n01n350J1919l715j6610J3960J3386j9426m556J6646
1660F906m252o153P935p342m265J7562m486j9678J2732J3970j5904l192J0552
1673D385o343J584R227j4390m675K1929m013k0537J0878J1644j1908Q86M934j0345
1687f744P342J2113j8307o640K2620k278j7738Q599N923q248P168P31j5911J0607
1701g63J5987j9402q642K0268j108j2450P200p95o514J3525j052j9718J0556J7600
1715A4692j7149q035J5396k755o047R072p585p758J8560L64k2197Q529J6871j3460
$$ plain form
1620 -7322 10601 3753 -12306 482 8359 -4250 -1879 2832 -6231 1015 9530 -7882 -9954 10979
1634 10979 4463 -11296 116 5250 -4047 2360 2325 -10004 1317 12344 -7008 -10591 9012
1647 9012 4322 -7308 1153 652 -4698 7221 3506 -13104 856 14242 -5184 -9740 6906
1660 6906 2654 -3499 4436 -2906 -7171 10391 5905 -13773 -1041 12929 -2975 -6167 4385
1673 4385 -1958 -374 8853 -5537 -10212 11717 7704 -12833 -1955 9689 -2219 -1333 3601 -6744
1687 -6744 598 12711 -5596 -12236 10384 8106 -9632 -1033 4890 -3358 3810 4541 -11370 -763
1701 -763 15224 -4178 -12820 7448 6340 -6110 1090 295 -6219 7306 6254 -13464 -2908 14692
1715 14692 -2457 -10492 4904 2149 -3898 5174 -2411 -10169 8391 8755 -13442 -4913 11958 -1502
1729a502n060R965o280M14J1776j2480r612K0875J661k0998O962J2391j0119M59
1743a548O030j1249L827J5450j4050j1872J9812K779j6715N446O548q160O095
1756B393M018j5730N164J7764j3648j1628J6367K134j1914O245J230q786J0646
1769D255M559j8117L622J7541j0341j0273J1683l19n882Q050l848r746J3273N384
1783I841j8006K280J4888q060o166Q393m037k866J0661n787j1229J3033N920j4701
1797e836J123J0390o360j540O315p543j305J2835o410j1492J1665N439j1648J557
1811b810O223n920K129N674r899r26J2899n246j0305Q968L608p628L062K285o541
1826d427M706N892j0277j409J1040l361p664O060J707m898M460m3p034N451N796
$$ plain form
1729 -1502 -6562 3403 -2877 -2463 9313 -3167 -12779 8096 9757 -11241 -4279 8112 -2007 -1548
1743 -1548 4482 -6767 -2940 12510 -1540 -13412 6400 9179 -7536 -2090 4458 -3702 2393
1756 2393 6411 -9319 -4155 13609 -39 -11667 4700 6834 -5080 1165 2395 -6391 4255
1769 4255 8814 -9303 -5681 11860 1519 -8754 2929 2610 -3272 4778 930 -8816 4457 9841
1783 9841 -8165 -5885 9003 943 -5223 3170 -867 -3733 6928 1141 -10088 2945 8865 -5836
1797 -5836 -4713 5677 -683 -2223 4092 -3451 -4756 8079 1669 -9823 1842 7281 -4367 -2810
1811 -2810 3413 -2507 -378 5296 -4603 -5529 7370 2124 -8181 787 4395 -3233 -171 2114 -4427
1826 -4427 279 6171 -4106 -5515 5525 2164 -5500 560 2267 -2631 1829 1786 -5248 203 5999
1841E999r058j537Q726k649m691M707j059l054N776p84p437M798N788o874j964
1856c313O134k166k127L838k730k272N742n11o657L962M138n040l47L549k905
$$ plain form
1841 5999 -3059 -4596 4130 1481 -3210 1497 438 -2616 3160 2376 -5061 -263 5525 -1349 -3313
1856 -3313 2821 655 -1472 2366 -364 -2636 3106 2595 -4062 -100 4038 -1002 -1349 2200 -705
$$ [...]
8191A4
##END NTUPLES=NMR FID
##END=
