##TITLE=1H_Pr Am 6 Boc
 200.13MHz, CDCl3,
 8 sc
 
 28.4.2025
##JCAMPDX= 6.0         $$ Bruker NMR JCAMP-DX V2.0
##DATA TYPE= NMR FID
##DATA CLASS= NTUPLES
##ORIGIN= UXNMR, Bruker Analytische Messtechnik GmbH
##OWNER= pz
$$ XWIN-NMR		Version 3.5
$$ Mon Apr 28 14:33:26 2025 Russian Standard Time (UT+4h)  she@DPX200
##.OBSERVE FREQUENCY= 200.1313
##.OBSERVE NUCLEUS= ^1H
##.DELAY= (6, 6)
##.ACQUISITION MODE= SIMULTANEOUS
##.ACQUISITION SCHEME= undefined
##.AVERAGES= 8
##.DIGITISER RES= 18
##SPECTROMETER/DATA SYSTEM= spect
##.PULSE SEQUENCE= zg30
##.SOLVENT NAME= CDCl3
##.SHIFT REFERENCE= (INTERNAL, CDCl3, 0, 14.3821)
##AUDIT TRAIL= $$ (NUMBER, WHEN, WHO, WHERE, WHAT)
$$ ##TITLE= Audit trail, XWIN-NMR		Version 3.5
$$ ##JCAMPDX= 5.01
$$ ##ORIGIN= Bruker BioSpin GmbH
$$ ##OWNER= she
$$ F:/spectra/data/she/nmr/H-C/1/audita.txt
$$ ##AUDIT TRAIL=  $$ (NUMBER, WHEN, WHO, WHERE, WHAT)
(   1,<2025-04-28 14:32:08.32 +0400>,<she>,<DPX200>,
      <created by zg, POWCHK disabled, PULCHK disabled
       configuration hash MD5:
       00 E9 B6 7A A2 85 ED C7 34 08 36 98 17 FE 4E 26
       data hash MD5: 16K
       6A 17 A0 43 4F 4C EE 4F 78 8F FD C2 51 D9 09 7C>)
$$ ##END=
$$ 
$$ hash MD5
$$ 20 48 24 AD FD 2F 69 ED A2 05 B7 24 9E 0E 0D A5
##$RELAX= 
##$RELAX= 
##$RELAX= 
##$RELAX= 
##$RELAX= 
##$RELAX= 
$$ Bruker specific parameters
$$ --------------------------
##$DU= <F:/spectra>
##$EXPNO= 1
##$NAME= <H-C>
##$PROCNO= 1
##$TYPE= <nmr>
##$USER= <she>
##$AMP= (0..31)
100 100 100 100 100 100 100 100 100 100 100 100 100 100 100 100 100 100 
100 100 100 100 100 100 100 100 100 100 100 100 100 100 
##$AQSEQ= 0
##$AQ_mod= 1
##$AUNM= <au_zg>
##$AUTOPOS= <>
##$BF1= 200.13
##$BF2= 200.13
##$BF3= 200.13
##$BF4= 200.13
##$BF5= 200.13
##$BF6= 200.13
##$BF7= 200.13
##$BF8= 200.13
##$BYTORDA= 1
##$CFDGTYP= 0
##$CFRGTYP= 5
##$CHEMSTR= <none>
##$CNST= (0..31)
1 1 145 1 1 1 1 1 1 1 1 1 1 1 1 1 1 1 1 1 1 1 1 1 1 1 1 1 1 1 1 1 
##$CPDPRG= <>
##$CPDPRG1= <>
##$CPDPRG2= <>
##$CPDPRG3= <>
##$CPDPRG4= <mlev>
##$CPDPRG5= <mlev>
##$CPDPRG6= <mlev>
##$CPDPRG7= <mlev>
##$CPDPRG8= <mlev>
##$CPDPRGB= <>
##$CPDPRGT= <>
##$D= (0..31)
0 0.7 0 0 0 0 0 0 0 0 0 0.03 0 0 0 0 0 0 0 0 0 0 0 0 0 0 0 0 0 0 0 0 
##$DATE= 1745836327
##$DBL= (0..7)
120 120 120 120 120 120 120 120 
##$DBP= (0..7)
150 150 150 150 150 150 150 150 
##$DBP07= 0
##$DBPNAM0= <>
##$DBPNAM1= <>
##$DBPNAM2= <>
##$DBPNAM3= <>
##$DBPNAM4= <>
##$DBPNAM5= <>
##$DBPNAM6= <>
##$DBPNAM7= <>
##$DBPOAL= (0..7)
0.5 0.5 0.5 0.5 0.5 0.5 0.5 0.5 
##$DBPOFFS= (0..7)
0 0 0 0 0 0 0 0 
##$DE= 6
##$DECBNUC= <off>
##$DECIM= 32
##$DECNUC= <off>
##$DECSTAT= 4
##$DIGMOD= 1
##$DIGTYP= 9
##$DL= (0..7)
0 120 120 120 120 120 120 120 
##$DP= (0..7)
150 150 150 150 150 150 150 150 
##$DP07= 0
##$DPNAME0= <>
##$DPNAME1= <>
##$DPNAME2= <>
##$DPNAME3= <>
##$DPNAME4= <>
##$DPNAME5= <>
##$DPNAME6= <>
##$DPNAME7= <>
##$DPOAL= (0..7)
0.5 0.5 0.5 0.5 0.5 0.5 0.5 0.5 
##$DPOFFS= (0..7)
0 0 0 0 0 0 0 0 
##$DQDMODE= 0
##$DR= 18
##$DS= 0
##$DSLIST= <SSSSSSSSSSSSSSS>
$$ [...]
##$SUBNAM0= <"">
##$SUBNAM1= <"">
##$SUBNAM2= <"">
##$SUBNAM3= <"">
##$SUBNAM4= <"">
##$SUBNAM5= <"">
##$SUBNAM6= <"">
##$SUBNAM7= <"">
##$SUBNAM8= <"">
##$SUBNAM9= <"">
##$SW= 18.0517328524113
##$SWIBOX= (0..15)
0 0 2 0 0 0 0 0 0 0 0 0 0 0 0 0 
##$SW_h= 3612.71676300578
##$TD= 16384
##$TD0= 1
##$TE= 0
##$TE2= 300
##$TE3= 300
##$TEG= 300
##$TL= (0..7)
0 120 120 120 120 120 120 120 
##$TP= (0..7)
150 150 150 150 150 150 150 150 
##$TP07= 0
##$TPNAME0= <>
##$TPNAME1= <>
##$TPNAME2= <>
##$TPNAME3= <>
##$TPNAME4= <>
##$TPNAME5= <>
##$TPNAME6= <>
##$TPNAME7= <>
##$TPOAL= (0..7)
0.5 0.5 0.5 0.5 0.5 0.5 0.5 0.5 
##$TPOFFS= (0..7)
0 0 0 0 0 0 0 0 
##$TUNHIN= 0
##$TUNHOUT= 0
##$TUNXOUT= 0
##$USERA1= <user>
##$USERA2= <user>
##$USERA3= <user>
##$USERA4= <user>
##$USERA5= <user>
##$V9= 5
##$VALIST= <valist>
##$VCLIST= <CCCCCCCCCCCCCCC>
##$VD= 0
##$VDLIST= <DDDDDDDDDDDDDDD>
##$VPLIST= <PPPPPPPPPPPPPPP>
##$VTLIST= <TTTTTTTTTTTTTTT>
##$WBST= 1024
##$WBSW= 4
##$XGAIN= (0..3)
0 0 0 0 
##$XL= 0
##$YL= 0
##$YMAX_a= 163691
##$YMIN_a= -181856
##$ZGOPTNS= <>
##$ZL1= 120
##$ZL2= 120
##$ZL3= 120
##$ZL4= 120
##$ABSF1= 10
##$ABSF2= 0
##$ABSG= 5
##$ABSL= 3
##$ALPHA= 0
##$AQORDER= 0
##$ASSFAC= 0
##$ASSFACI= 0
##$ASSFACX= 0
##$ASSWID= 0
##$AUNMP= <proc_1d>
##$AZFE= 0.1
##$AZFW= 0.1
##$BCFW= 1
##$BC_mod= 2
##$BYTORDP= 1
##$COROFFS= 0
##$CY= -3
##$DATMOD= 1
##$DC= 2
##$DFILT= <>
##$DTYPP= 0
##$F1P= 0
##$F2P= 0
##$FCOR= 0.5
##$FTSIZE= 0
##$FT_mod= 4
##$GAMMA= 1
##$GB= 0.15
##$INTBC= 1
##$INTSCL= 1
##$ISEN= 128
##$LB= 0.25
##$LEV0= 0
##$LPBIN= 0
##$MAXI= 10000
##$MC2= 0
##$MEAN= 0
##$ME_mod= 0
##$MI= 1.114404
##$NCOEF= 0
##$NC_proc= 0
##$NLEV= 6
##$NOISF1= 3.799351
##$NOISF2= 2.8
##$NSP= 1
##$NTH_PI= 0
##$NZP= 0
##$OFFSET= 14.38212
##$PC= 1
##$PHC0= -1188.714
##$PHC1= 11.79221
##$PH_mod= 1
##$PKNL= yes
##$PPARMOD= 0
##$PSCAL= 0
##$PSIGN= 0
##$REVERSE= no
##$SF= 200.129724274929
##$SI= 16384
##$SIGF1= 3
##$SIGF2= 2
##$SINO= 400
##$SIOLD= 16384
##$SREGLST= <1H.CDCl3>
##$SSB= 0
##$STSI= 0
##$STSR= 0
##$SW_p= 3205.1282051282
##$SYMM= 0
##$S_DEV= 0
##$TDeff= 0
##$TDoff= 0
##$TI= <>
##$TILT= no
##$TM1= 0
##$TM2= 0
##$TOPLEV= 0
##$USERP1= <user>
##$USERP2= <user>
##$USERP3= <user>
##$USERP4= <user>
##$USERP5= <user>
##$WDW= 1
##$XDIM= 8192
##$YMAX_p= 0
##$YMIN_p= 0
$$ End of Bruker specific parameters
$$ ---------------------------------
##NTUPLES= NMR FID
##VAR_NAME=  TIME,          FID/REAL,        FID/IMAG
##SYMBOL=    X,             R,               I
##VAR_TYPE=  INDEPENDENT,   DEPENDENT,       DEPENDENT
##VAR_FORM=  AFFN,          ASDF,            ASDF
##VAR_DIM=   8192,          8192,            8192
##UNITS=     SECONDS,       ARBITRARY UNITS, ARBITRARY UNITS
##FACTOR=    0.0002768,     1,               1
##FIRST=     0,             0,               0
##LAST=      2.2672688,     0,               0
##MIN=       0,             -181856,         0
##MAX=       2.2672688,     163691,          0
$$ Real data points
##PAGE= N=1
##DATA TABLE= (X++(R..R)), XYDATA
$$ [...]
1424C25q38N8P76l98o14N70L48l30l68P78m4m89L33M17n33k24N17J25q65L44L65
1445B53k03o25O43K98r31O6Q47k37n20L33M33l98j46P53k00n15K16M23n08k87
1465c05O12j90l28j03O02l76k76M06O8m34K3O91l44m34O21L37m98j96M64j73k35
1486f8J41L49n39k26M69N4n46L39K97l90k12N24Q9m75m8P08j40o45N67R9l47l36
1508c36O76j67m66K74J99l27l22O08m6o60M24L54k94l62Q77J5m57j46N79j69o47
1529c93L71M92n18k11N40j20n42L70J02j91j72L20J21m34K91J44j58k45M12K20
1549C99n09q4O78j64o29M29K90n13k12L59p1n08L47L03k10j61J58L28l85P7O17
1570E39k35n06K87J98l52jK66On85M57R1k69j84M24m2n99N37R0j02j63K71K42
$$ y = [325, -513, -455, 321, -77, -691, -121, 227, -103, -471, 307, 263, -226, 107, 524, -9, -233, 284, 409, -456, -112, 253, 50, -575, 68, 366, -565, -499, 348, 111, -409, -76, 357, -41, -187, 566, 366, -149, 67, 490, -18, -305, 307, 117, -211, -314, 288, -88, -364, 42, 110, -324, -301, 390, 46, -388, 233, 570, 72, -124, 340, 167, -68, 73, 422, -117, -343, 126, 180, -366, -27, 270, -120, -332, 192, 281, -194, -242, 466, 326, -319, 248, 347, 0, -336, 340, 173, -293, -19, 180, -147, -469, 139, 93, -567, -143, 211, -83, -445, 432, 447, -10, -156, 423, 254, -393, -22, 470, -48, -259, 281, 161, -381, -11, 91, -100, -272, 48, 169, -265, 26, 170, 12, -233, 179, 399, -110, -194, 484, 320, -309, 120, 410, -103, -315, 44, -27, -535, -188, 115, -95, -256, -98, 230, -155, -78, 539, 304, -202, 85, 283, -69, -70, 196, 202, -383, 74, 165, -104, -288, 136, 94, -505, 32, 122, 20, -143, 128, 370]
1592C70o13L63K61j55n79L49K10m09j16N25j94k80J98K24m00j71O19O9m48N1M98
1613C72m06k45N29Q6o23J80M20r9m27M95L0m52M5M33l54k31L04J51l07q0L63K8
1635B12m25K37M21m76L2K32Q6o50L64J63k57k32J64K29l86J66K27j60k75L69J13
1656A54l27j01M65L7m33L37J97k95j38K58N7m85P7L10k47k02K26K07j88j32M10
1677A87o7k87K14K96l75K8K57n3j66l7J26l31lK74k9l66Q5M23j34l15L26J49n46
1700c44J69M22k27j11K69k6j40j39L50q5k95r0L61j69k38N37q2n12L16J51j76
1721e9j69L80J05l71o4M40k51k47L66J09j85k8J89q2l86J71K54l81k13L86J26
1742I0m63L10L09k51l14M16mj43K1K69l8l72L56l2j90k02K72r4j38O6K16j15j65
$$ y = [370, -243, 120, 381, 226, -353, -4, 206, -203, -319, 206, 12, -268, -70, 154, -246, -417, 202, 271, -177, -126, 372, -34, -279, 250, 336, -287, -107, 313, 214, -213, 282, 312, -140, -95, 338, -16, -247, 57, 208, -99, -179, 184, 212, -213, 24, 445, -31, 1, 233, 319, -331, 33, 196, -61, -293, -129, 100, -286, -120, 107, -53, -328, 41, 154, -173, -274, 191, 228, -205, 132, 329, 34, -104, 154, 211, -274, -197, 113, -134, -336, -110, 97, -91, -223, 187, 120, -167, 47, 343, -32, -4, 253, 200, 34, -3, 123, -208, -211, 63, 34, -332, -247, 176, 42, -273, 53, 202, -344, -175, 247, 20, -91, 178, 152, 12, -127, 223, 138, -157, -247, 114, -55, -293, 244, 162, -350, -34, 117, -59, -228, 152, 257, -114, -178, 262, 11, -236, 130, 239, 54, 26, 215, 133, -253, -82, 172, -209, -422, -36, 90, -373, -63, 246, -5, -319, 97, 93, -50, -29, 240, 202, -170, 186, 154, -36, -238, 34, -60, -198, -132, 84, -31, -196]
1765a96Q3J51j28O4Q9M6j90L46R4l27k9K45j61j43J10M2j71j85K91L2l90J87K89
1788A49l43J21R5Q3l09P7K74J06m47J93K87n16Q4K23j39r7K34l9k06j14K91r1
1810h4j81K84K47j66j80J73l0j39L06j57k56J81n1L0n7o9J35jk74J62K58l00M0
1833a29K90j83q1J4J70m8L0j8J28j83j11L20j45j43J35K8l43j8M24m0k93J73L49
1856C26l55k30N29j51k46J58K33k77k25M91j04j33Q5J14k42l4l6J73k72L1L01
1877A36o5j73Q4L73m51J41J09J9l01K51N7j59j01K17j38j47OL33k57j61J69K00
1899A42k30L4L3N7k18L03J85l72j28M92j57k61P4N2kj55J96q0j15J65J67l81K49
1922E0j5Q4l43J84J04j4m2J65kk03j38K74l3j46R6N3j46j59K65K50n92K13K07
$$ y = [-196, -113, 38, -90, -26, 63, 109, -81, 265, 359, 32, 3, 248, 87, -56, 54, 96, -75, -260, 31, 63, -327, -140, 149, -194, -73, 22, 105, -204, -127, 147, 253, -194, -1, 286, -230, -146, 77, -62, -159, 75, 36, -170, -284, 7, -84, -265, 19, 266, 100, -80, 93, 63, -76, 230, 73, -183, -2, -53, -23, -80, -149, -14, -15, -289, -127, 131, -169, -129, 161, -22, -103, -89, 81, 33, 63, 45, 173, -10, -121, 199, 54, -89, 46, 74, -269, -287, 137, 97, -196, -23, 326, -29, -259, 270, 119, -127, 31, 264, -13, -238, 253, 149, 16, 101, 215, -27, -61, -97, 76, -196, -165, 136, 71, -102, -18, 355, -96, 45, 154, 173, -128, 123, 180, 21, -80, 137, -1, -148, -142, 191, -66, -227, -58, 142, -88, -54, -21, 36, -182, 121, 306, -66, -194, 298, 141, -120, -46, 6, 4, -151, 45, -35, -150, 15, 182, -199, 50, 35, 119, -224, -40, 64, 50, 8, 173, 171, -32, -170, 104, 71, -75, 21, 74, -72, -231, 34, 284, -308, -95, 112]
1945A12j46j31K36K5j9n6J62Jk43K61p0j02l5L7q0m0J5L8J7j75J53J09j17q0J66
1970C8K67l38J63M3q2k16K78p7j63l1R2l5j05K98k66mK3K45l2l56L41Nj25J6L45
1995C24k30j59K5K05k72K6K59j01p8j46K12j32q8J35J35m41J66L46k54J6L51j97
2017A02J1l1N7j21l26M49R5k27k45L61q1k07l8L04k07p9K44o2N4j4L7P5j00K82
2041C33j95k6q8m4J53l46L44J20k85k30M80l47j05J30K79j30j43K60J05l04j08
2062a47L11j07j52L28N9k69j30P7Q0l70L49J37m18J85R0J02k71K14k4K5k00J62
2084C1K77k74oJ72j22j96K46r2r2k3J06m9k90K56J40j90K2%K77k54J45K00j95
2107H9j81K48N6l75J06J77L5k20p7J49rJ0j04J04k71M71j04k82J76N3M5j79m6
$$ y = [112, -34, -165, 71, 96, 77, 21, 183, 184, -59, 202, 132, 30, -5, 32, -48, -88, -73, -35, -18, -193, -40, 69, -48, -128, 38, 305, -33, 130, 173, 91, -125, 153, 76, -87, -118, -26, -61, -166, 132, -134, -138, -115, 130, 98, -258, 83, 88, -37, -21, 324, 94, -65, -40, 165, -107, -81, 178, 77, -1, -147, 65, -67, -155, -20, 115, -326, -160, 186, -68, -52, 299, 102, 113, 82, 139, 18, -308, 141, 236, 9, -236, 125, 44, -163, -201, 103, -104, -183, 61, -1, 53, 39, 76, 151, 51, 333, 138, 112, 24, -20, 133, -213, 131, 251, -34, -264, 216, -131, -236, -106, 173, 43, -100, 160, 265, -39, -147, 164, 57, -95, 233, 292, 23, -107, -30, 50, -320, 29, 166, -252, -67, 23, 125, -146, 68, 44, 69, -131, 31, 308, 34, 28, 200, 78, -118, 128, 36, -56, -79, 27, -22, -312, -56, 84, -106, -84, -84, 193, -61, 84, 284, 89, -92, 156, 212, -163, -57, 120, 155, -65, -142, 7, -2, 8, -96, 8, -263, 208, 104, -178, -2, 51, 96, -83, -129]
2130a29M60k60j12L4K36m86L36J58j98k56Q4P9r9J28P1O9j52J42j01J08r1K30
2152B51n6j40nR6j40j90J06K35m19K12J9k16L42j86K20m1r1J9O3j87J35L27n26
2175a72Q6J90N1j40l1J00j59JJ93j18k80K37rj4R1o2J37j19j52M40j69j40k0J81
2199A22r6j66K36P5l09%K43j79r5O0L20l89N3J17N7k31P5L26l24K47J55l4l94
2222a31J50J23p7k21K21k0k09J00J21k32p3J20J78j30Q1Q2j11n1J55m7N0j22K50
2245B07j77p2J23j06r6nJ05K2l4j35J28L3j20K09Rk48J94J00q0K5m6J85k14nJ10
2270A12n9j36J61Q1m16j8K68Q3k73L56P0l39O4J37K8p7J0R0K8l15J60J87n0k77
2294a25P0Pn4J53O5j86L9P1qk56J66K07j3l7k1M0m7j26J50l8k60L35k55Q6m6M
$$ y = [-129, 331, 71, -41, -7, 229, -257, 79, 237, 39, -217, -133, -54, -153, -25, 46, 115, -37, 105, 4, 112, 21, 251, 195, 55, 50, 146, 6, -184, -78, 157, -262, -50, -31, -247, 95, -91, 129, 88, -3, 16, 79, -108, 27, 354, -172, -86, 104, 155, 15, -16, 84, -75, -74, 119, 1, -279, -42, -51, -65, 26, -36, 101, -18, -170, 270, 101, -39, -59, 122, 26, -140, 96, 171, -138, -138, 105, -74, -169, -109, 211, -178, -125, -8, 49, -182, -107, 219, -105, 142, 297, 263, -131, 19, 142, 65, -156, 65, 45, -164, -64, 57, -175, -248, -128, 50, -80, 1, 83, -28, -79, 76, 29, 79, -43, 207, 30, -42, 81, -25, -121, -126, -21, 1, -33, -168, -40, -7, -127, 82, 91, -157, 37, 137, 57, 82, 36, 221, 7, 2, 112, 53, -83, 78, 159, -257, -275, -7, 76, -197, 159, 229, -110, -46, 91, 119, 42, 52, 142, 170, -145, 15, 202, 152, -125, -55, -48, -102, 51, 116, -70, -31, 40, 32, -224, -58, 149, 136, 99, 78, 118, 71, -55, 95, 57, -203, 132, -123, -37, -83, -79]
2320g9L1k9Q9R6Jj75J01O4m6k37L35q0q5K35k61K03o7n6M4k09K2J04j70N6K52
2345A39j82j33J11N8J87k51K34P5k29q2K33r1j55J73M4j92l0J03L1j67n9K30j48
2368a01oJ89J75l51J17K05k29k0K9j7L9o7oK07k50J76j36Q9M8j15J11q3r4J43
2392E3j24n8K43r1n4J79j00K2lj27J38j83l3K78k14J2K1P8j14M8J33J10j97k24
2416b07M49l15Q0J00j11j31L67k28L3K0L6m7p6l7Q7j86J08p3R6J2j25K81j40N3
2440D6L3R3m4o9K8L6j88p0K43k27O6J33q9J3j57J20J45j52Oj1J61k06J07m6o3
2465i2J04J48m1l6l2L2p3j6O0p3k5j55K12j1o4P5k9o1J0J78n7M0r3m3Q5J9OPo9
2494Fk9R2k21j00K55l4q6M4N1k1l7R5L2K9j22K03j48q4J07L4j62P6J36k27N6O6
$$ y = [-79, -48, -77, 12, 108, 109, -66, 35, 99, 53, -184, 151, 71, -14, 221, -40, 163, 96, 40, 84, -125, -103, 1, -169, -113, 139, -43, -176, -65, -7, 180, -71, 163, 238, 9, -73, 160, 69, -86, 87, 131, -61, -91, 12, 43, -124, -183, 47, -101, -107, 82, 257, -94, 23, 228, -1, -21, 8, -9, 30, -37, -43, 164, -86, 90, -46, 43, 91, -24, 87, 4, -90, 53, -71, -129, 114, 23, -31, 148, 48, 70, 67, -60, 78, -105, -138, 140, -74, -62, -41, 37, -77, -29, 104, 214, 17, -207, 242, -73, 7, 107, -4, -135, 232, 4, 37, 57, 93, 46, -30, -67, 20, -166, -58, -131, -35, -23, -148, 133, -7, 46, 79, 172, 128, 59, 87, 123, -65, -135, 108, -119, -53, 80, -9, 4, -153, -33, 112, -40, -34, -45, 116, -90, 17, -29, -92, 12, 160, 119, 83, 51, 83, 10, -6, 54, -19, -44, -199, 13, 2, -62, 13, -16, -77, -67, 111, 54, 94, 1, -42, 43, 62, 68, 75, 6, -23, 69, -152, -252, 3, -31, -117, -73, -22, -43, -80, 15, 47, 76, -46, 157, 9, -75, 32, 66, -96, -20, 116, -111, -55, 11]
2520A1m1J9j75K73j79R6J32q1j0j37R5l9R2j13K13j54O6N7p5k03L00k10J68j23
2544a8j1J03l10M01l89K33r9R6p7J79j49J96L1j85J1j84J84o9J02r4O1R6j06M5
2568D7j83O7M7l9J29j18J94l5j44L30k37j30MJ26j16K54k54o8M1O3J79k03po7
2592a20J69j38K0P5q3J25j15J91k71o7J22P6p2J85k9j70J9J75j25J6Q7q4k85O7
2616b32K63O1j7p8j32K25l0O2k8j05qN0l1n0j11K9K6Q3J44q8j6oj4q3J23oK2r
2644D4K07k06K3n6J12q7N3k9K00m41J08nm9J90r1l9R8P8J30k96K6Q3j58J37l2
2669@j38L19j88L4n5ol1R7m4q1J63j36J01j50J16q0O7Q5k2L3P4j14m3m9JO3q9
2696g3R2j52J87p8k28J83R9K0m6j40J59j25j8K28j44J79l30L82l12J40p4K7j46
$$ y = [11, -30, -11, -186, 87, -92, 4, 136, 55, 45, -92, 3, -36, 56, -57, 156, 2, 68, 125, 50, -153, 147, -63, 105, -18, -29, 74, -236, 165, -224, 9, -90, 6, -71, 108, -41, 155, 186, 1, 12, -172, 12, -57, 45, -49, 12, 108, 2, 47, -136, -69, -22, -61, 68, -50, 144, 109, -35, 295, 58, -72, -68, 58, -58, 196, -58, -126, -85, -22, 157, -46, -53, -120, 49, -89, -69, 6, -77, 48, -67, 124, -147, -214, -92, -16, -88, 97, 68, -102, -83, 92, -33, -17, 70, -14, -299, -232, 31, 92, 75, -3, -135, 90, 60, 122, 94, -11, -19, 31, 0, -50, -161, -132, -106, -23, 121, 33, 17, 11, -3, -86, 37, 31, 53, 44, 251, 45, 68, 12, 124, 37, 90, 61, 261, -180, -72, -77, -126, 64, -27, -66, 32, 110, 240, -56, -30, 53, -105, 32, 0, -138, 181, -7, 27, -28, -34, -65, 32, -12, -93, 70, -66, 35, -115, 1, -79, -12, 73, 51, 84, 158, 44, 1, -48, -47, 16, -73, 19, -133, 54, -24, -252, -69, 30, 50, 4, -136, 23, -102, -120, 108, -36, 143, -187, 195, -117, 23, -51, -24, -170]
2719a70J80L5kqp1j30J63k7L6P1l12J56J06j7J63r8m6j1Mj13mJ94p4R1j63J17
2745G0j61N9j05N8M7J56k61J95O3j90K06L1l41RJ45k34J89p6K21l9K6j18M8l0
2769c2LMM7o0Q0j6O9l4j89Q2J01L6J0j1j09K1r2n6K51j26n4Q7q0J02R1k21M6O8
2797A8r3M9on5n5J57kj13j4J56j02K12j10k21J00J23q5l9OM4K95l17J63k76J71
2822FN5m1Q0j34P4oj04J20K2k6j20J49j47J91j51j5O8l6R2j54J70q0J81j79j83
2847a68K08j87K31n3j24P6M7q1k7O9k45L07j80N7RP0M2o9M1J26n4J10j37q1K25
2872B12j72o3j5M5p7k7O1J8oJ58j12n4J6N5k30P4J27M8j23J06K2j61Q7j34J7k0
2898a48J42o4L9Qj37J90J09k31o8J06N4j9N6o0O9K11k50R6j93K09j70j47J38K0
$$ y = [-170, 10, 45, 43, 35, -36, -166, -3, -30, 6, 77, -235, -79, 27, 10, 173, 75, 29, 18, 22, -91, -95, 99, 25, 116, -47, 70, -91, -32, -137, -79, -32, 124, -137, 58, 121, -69, 137, 168, -173, -164, -19, -253, -64, -140, 81, 42, 68, -50, -2, -32, -29, -25, 22, -38, 42, 26, 95, 61, -128, -46, 55, 91, 101, 90, -19, 2, -90, -146, 105, -21, -75, 12, -68, 34, 125, -96, -50, 18, -75, -26, -32, -87, -142, 15, 13, -100, -114, 42, -60, 152, 42, -179, -79, 44, -41, -80, -74, -30, 265, -52, 111, -165, 6, 61, 20, 100, -34, 40, 34, -70, 50, 72, 46, -74, 75, -72, 119, -32, -47, 21, -15, 77, -77, 93, 13, 194, 15, -168, 40, -147, 84, 31, -93, -17, 30, -51, -78, -9, -254, 53, -127, -70, -61, 9, 51, -18, 23, 149, 95, 205, 68, -13, 212, 40, -23, -38, 7, -70, -97, -36, -18, -24, 134, 22, -32, -16, 39, -191, -117, 10, 58, -65, 41, 63, -98, -11, -145, -128, -148, -6, -70, -31, -23, -160, 30, 139, -92, -160, -54, 0, -19, 37, -23, 46, 257, 7, 103, -90, 119, -51, -198, -60, -40]
2922d0J13l6O2P2j55P2J18k11J63j05j71J4K13q8J34j79jk3Rj05L38k14j33J58
2946EN7j28J59q9J27j30L8j48Q9K8j07J00j05J71l63J62J37k8J11j44q7Q8L8k5
2970d4q5j2J08k8J72m1j29R1q5J52j26J39n0j20PLm5R3J8J70j39r0K2Q4q1J4N
2997CO5p3J52r6Qo3J2Q8j2M1j52j52J83J46j71n8M9Q2j32O0J43j90M2R7j56J23
3023C9k0n6k4JO3k7J83q1k8QN2j11Q2k05q4K66l0n8N5pJ1j8J2N5OL5j06l2Q5M3
3053A09p9J0J13j57P1M4j76k1P8l5Q0l2K3q7rK93j34R9p4j21j07J23p4O0n1n2
3079a06P5J05n6O9j33j6J94j37L1q2J72j08j16J15N4k9r0K71k40Q9j68J52N2r9
3103ao1K9m7J5j9J23qj07J63j23J45q4m8K4J16j42O2q7q3J59k26N7J78p9R8r1
$$ y = [-40, 73, 37, 99, 171, 16, 88, 206, -5, 158, 53, -118, -104, 109, 21, 155, -24, -25, -48, -39, -144, 194, -20, -153, 5, 62, -66, 93, 4, 131, 1, 39, -109, -20, 8, -99, 1, -104, 67, -296, -134, 3, -25, 86, -58, -145, -57, -19, -44, -129, -141, -33, -61, 111, 70, -59, 32, -53, 99, -27, 112, 62, -58, -51, -48, -93, 0, 18, 188, 49, -41, -19, 65, -16, -2, 3, 68, -5, 147, 51, 59, -4, 8, 96, 84, 125, -27, -179, 4, 150, -21, -79, -30, 52, -80, -20, 123, -67, -25, 72, -84, 39, 19, -37, -61, -60, 3, -24, 159, 78, 50, 58, 110, -1, 81, -124, -208, 58, 28, -30, 25, 18, 29, 11, 23, 78, 84, 119, 13, -19, 66, 109, 30, 40, 153, -4, 67, 111, -65, -86, -8, -43, 37, 5, 28, -59, -68, 225, 91, 190, 116, -5, -112, 11, -63, -3, -54, -106, -31, 74, 18, 87, -46, -62, 132, -5, 26, -56, 116, 8, -108, 7, 61, 32, -58, 213, -27, 62, -106, 46, 98, -1, -62, -33, -80, -65, -84, 39, 31, -76, 87, -36, 109, 25, -23, 1, 117, -25, 37, -50, -133, 26, -200, -143, 35, -44, 54, -37]
3129c7n2J19N5k28L18n8p7lJ0R6j49k00L57j91k0K29j30j59R9l2RJ7m6k3R0Q6
3155H0l8O7j26M6L0Pq7J11k89J73r8q8K28j09P3j67n4K55n1p2K1o5L7K77j78N
3181a2Nj68J84P1j46K04o2K9j0j06k7J13j7j89J39j1O2q0p6Q7p5J29p6J76O7j46
3207F5K5j42R9j57J32r0P8j00Q9L2M6j3j66J56j92J52q8P1K6j26O0l5j1Q7p7J70
3233I1o7r8OL0M4R5j23j0n2P0r8K8K26j12J9j9O6r0l1m6K8N9m5K80l61J18J50
3260A58j84J04n3M6p8j7Q9j56Q3j06J94k6J20k50O8k7R8q5Q9j5j49J47k36J99
3284A3p3K16j19M3r3O2J60j54L0j12o2L0n1K82j92j27K09q3K8j56J64P5k37l0
3308a77K15k25Q6J02r8J77j98J47j05n3K17pn0l6L0Oq6L4N0k9n0q7L4K7lQ4K2
$$ y = [-37, -89, 30, 85, -143, 175, 117, 40, 37, 47, 143, -6, -206, 151, -40, -60, 169, 39, -120, -21, -53, -44, -27, -73, -96, -6, 80, 42, 109, -17, 29, 59, 66, -21, 90, -199, -26, -124, -212, 16, -93, -20, -187, -241, 14, -37, -109, -88, -153, -116, 161, -17, -12, -7, -175, 9, 80, -66, 138, 76, 105, 95, -11, -38, 75, 58, -131, 8, -3, 59, -21, -97, -10, -85, 44, -32, 144, 211, 65, 90, -52, 47, -110, 22, -68, 10, -90, -1, 31, 77, 64, -102, 54, -138, 14, -74, -3, 23, -103, -43, -78, -89, -2, -79, 91, 24, -74, -68, -38, 6, 101, -22, -32, -84, -14, -112, -84, 142, 30, 49, 30, 96, 6, -25, -71, -43, 16, -29, 251, -110, 8, 158, -26, 78, 25, 71, -7, -24, 65, -91, -8, -114, 80, 54, 174, -76, -8, -35, 63, -22, 67, 52, -97, 50, -186, 13, -60, 156, 37, 80, -13, 49, 209, 55, 85, -27, -89, -59, -110, 172, -20, -147, 62, -21, 7, -149, 15, 90, -147, -177, 38, -187, -101, 1, -97, 80, -118, 29, -76, -129, 88, 81, 31, -5, 25, 31, -55, -21, 29, 0, -50, -137, -103, -76, -79, 5, 27]
3335B7j79K17n5q0J23j19J38p6j98K44K2j19l1K03m8P8j17j5M0r1r8Q7j73L64
3359A44n0k94J94l3m9j14Q9J35j51J07L37k87pr7P3j02K35k14J43j39QK41k09
3382d0K04k49J18O5k19R3o8J88n3q5J61j60P8K43j37k50M8o5J62j96q7L16k49
3405a82Q9J00p0J7R8r9J27np5j81J95k8O3k21J63R8j32J2L2q8J62j61J2N0J8k1
3431b7L6pJ83k44M1r6k7J87m2n3j47J84j29J63m4O4k06K62n5N3j18j2K43k38J40
3456A11Q8j88Qj39R9L3k3L9l5J7kR9kj28j13J31J26p0j90Q3K5qK5o6P9j80J49
3483c2l3J4O4k12K03p9J96o8M7j00N2k2R2j12P0j00L0j4l0J6q9J02m0o2J15P1
3509G9n1o6M6p0K06m20J86J57km2j14j8J58j07L1lj54M1K30k02J48j3O2L9k2j76
$$ y = [27, -152, 65, 10, -70, 53, -66, 72, -4, -202, 42, 64, -55, -86, 117, 69, 147, 30, 15, 55, -36, -134, -47, -220, 144, 94, -200, -6, -39, -88, -202, -113, 22, -129, -22, 315, 28, 21, -76, -3, -105, 130, -84, 59, -80, -72, 169, -40, 164, -85, 33, 98, -121, -28, -96, 92, 39, -46, 115, -45, 33, 276, 139, -111, -63, -128, 34, -162, -249, 67, -182, -93, 7, -63, -46, 52, -47, 80, 75, 0, -181, 14, -14, 49, -172, -9, 89, -43, -31, 1, -87, 75, -86, -74, -24, -6, -27, 9, 2, 185, -59, -18, -114, -141, 46, 4, -49, -196, -12, -141, 22, -22, 42, -164, 98, 43, 96, -22, -34, 209, -29, 111, 199, 11, 19, -120, -21, 12, -11, 28, -7, 10, 8, 107, 105, -23, -136, -5, 121, 51, -139, -56, -31, -39, -14, -80, -1, -181, -32, -65, -51, 13, -199, 4, -75, 121, 53, 100, 0, 52, 30, 122, 10, 80, -20, 10, -4, -34, -18, -107, -5, -45, -107, 8, 79, 28, -38, 8, -62, 144, -276, -90, 67, 65, 23, -91, -109, 49, -58, -27, -30, -184, -143, 87, -115, 33, 20, 82, 121, 99, -77]
3535g7J31K10k43Q2j22J02n7k5J67n9q7o6q5J57j3J05j65k72K56O0J33M0j85j44
3559a57O3J59j29R7q0jJ14m7p0K09r1l1m2P7m2K4lj5O1Jj11K2K5r6Q3p6j3J90
3587A21j42j02K92j05J15j35P6j25o1K9M8N6j41J61j38M3J23m5j40J91j06O9j45
3610f1Q4j14M3P8J2N5j00j25J21q7j12K50P5q9Q8l8j00J10p1J48k00O6O9l34K13
3635a9o6J7N8q6%J32l3R6k09P3K79k47k17N8%pK13j41m0J14M5j8K54k44KJOl4
3663a3pk4M4k05L88j32j15N8M7j42n0J60k2L3j03J47o6j4M8jj46K56l04J11O1
3688IJ00k3n3N2k41K08L3j58n5P3QQ9j41m1K17k4L6j07l3J86j35M6P6j12R2j55
3714e3q2M7j33K73p5J12l96M43q1j08N6O5J80j49j90j8J48n1m1K09j18k15K76
$$ y = [-77, 54, 264, 21, 103, -19, 83, 26, 1, 168, 109, 22, -44, -129, 28, 15, 120, -45, -317, -61, -1, 132, 172, -13, -157, -94, 65, -64, 33, -47, -48, 66, 19, -51, 158, 67, 36, -6, 71, 29, 53, 50, 35, 96, 97, -14, 8, 33, -63, 20, -56, -69, 121, -21, -123, 169, 64, 179, 44, 120, -5, -66, -37, 11, 67, -74, 87, -51, -8, 115, 70, -70, 121, 15, 84, -61, 23, -91, -48, 30, 42, 97, -3, -128, -7, -94, -206, 44, 119, 30, 118, 80, -20, 90, 19, 167, -33, 33, 102, -232, -19, -85, -68, -10, -96, -96, 36, 3, 99, -110, -37, 242, -5, -222, -164, -164, -171, 42, -99, -139, -25, 20, 2, 256, 12, 14, 15, 21, -13, -20, -44, 0, -205, 183, 51, -64, -6, 41, -101, -151, 9, -13, 20, -83, 64, -2, -16, 32, 31, -115, 141, -163, -52, 9, 109, 86, 33, 85, -156, 52, 85, -73, -128, -55, -47, 42, -99, -140, 77, 53, 89, -18, -51, 135, 0, 46, 122, 10, 102, -53, -135, -88, -221, 52, -23, 89, -307, 136, 55, -53, 3, 68, 248, 99, -91, -109, 39, -12, -53, 156, 38, -177, 99]
3737I9j67N5m0P0l8K4k4k2J08p6j74L00j77R2j73J73J23k84R7J29j56j58M93l23
3761d9J5k0k8J19k30J66l5K7J1J13j98K14j38P0J7j1R6k74L49k69n7K37j61o3
3785i9J34M1r7K6j3N8q1M6p6mj5O5mnj44M08l10J29qm7j04K55j63n1J31l7p5j15
3813a55J78j25J44R7j35KJ58r0r3R8m8k51K46o0K5k5M6p3P2J13m6j53N1R5n8R4
3839A07l9l5j35J09O2Mqj12o0L5J63l9p4PrQj27K10m8j36J81L9k13J09j17J11
3865gj51K29n9p7K4r1J83r2K67l19K0j18J61M4l6O3j92J15N4O1j86Q4J88j36N5
3890H4n4q5J05p9o2J58%k26J54K8m2pJ66j52KJ1j20J65j14J71j23k54L28n9n2
3915e7j5kj07J83l2J41j28k8J92j84k1j2R2M7kK0p6p1Q0P1k11J28l4J11p3L0p0
$$ y = [99, -68, -13, -53, 17, -21, 3, -21, -43, 65, -11, -185, 115, -62, 30, -143, 30, 153, -131, -34, 95, -61, -219, 274, -49, -34, -54, -82, 37, -193, -27, -62, -35, -24, 89, -109, 105, -33, 37, 54, 43, 139, -135, 214, -55, -112, 125, -36, -99, 35, 76, -21, 5, -8, 50, -31, 15, -61, -65, -80, -15, -19, -24, -168, 240, -70, 59, 51, 4, -100, 155, -8, -59, 72, 35, -40, -155, 23, -102, 42, 139, 4, 6, 164, 74, -19, 79, 31, -220, 26, -34, -9, -34, 12, -61, 11, 124, 78, -75, -24, 71, 13, 107, 68, 33, -102, 7, 69, 73, 65, -47, -107, -72, 91, 52, -22, -15, -24, -16, -143, 67, 19, -117, 64, 103, -110, -1, -118, -7, -158, 71, 12, -65, -41, -132, 51, -41, 226, -93, -73, -191, -30, 14, -22, 41, -151, -36, 18, 79, -107, -23, 165, 29, 84, 30, -55, 50, -29, -91, 67, 67, -159, -5, 23, -19, -26, 140, -12, -10, 1, -119, 46, -68, 103, -20, -274, 54, -5, -57, -72, -74, -181, 2, -30, 111, -17, -45, 147, -37, -58, -70, 22, 69, 67, 87, 11, -60, 20, 91, -120, 8, -26, 85, 12, 42, -28]
3942b8J04P2k46Q7m8J23j76O3j22R6J06n6J25j75L7KQ0%j09M0Pj49K80r1J15k99
3968a62J61O8j94J80M5M8M8l76L06k68L04k10k08K95j01J39j76R6n6L2p6K04R9
3991A98j27k24K15j15m2J27J63k23J27m5l1o4J39k78J94M5J2j70P8R1l12J76J15
4014D9Lq9J04j39m9J14k8O7k31K53j96J26p8j1J19L8j62Q3k4Q7M5r6R1j45K47
4039A78k40QK72m08J95K8j75R1P2r9J64k31J68n0k8Q9j75J28M9l2q6J65p0R6p7
4064C2K1R2j20J1j22J13J02K4j48J70l23J23O5m5j4P4j52J24j73J6J03j6pJ89
4088A39k99J28j08K30j1K9k19Q3J06k03J73J3k1n2m0J15j22J73j19N4k9k6P9j92
4112a19K29j45QO4J0L2k38J09K79k68q3J70L3M4k27J31Q6o9n1q9J47k11m8K74
$$ y = [-28, 76, 148, -98, -11, -59, 64, -112, -49, -171, -75, 31, -25, 100, -75, -38, -36, 44, 44, -65, -25, -18, -167, 113, 22, 137, -162, -1, 67, -127, 53, 98, 146, 194, -182, 124, -144, 160, -50, -258, 37, -64, 75, -101, -5, -61, -29, -105, 99, 198, 71, -153, 62, -53, -95, 32, 195, -28, 99, 54, 23, -41, 98, -180, 14, 59, 71, -99, -21, 70, -242, -66, 49, 52, -37, 67, -72, -121, -7, -35, 32, -199, 54, -142, -16, -94, -105, 14, 52, -110, -27, -51, 36, 81, -15, 76, -69, 178, -62, -54, 218, -190, 5, 33, -142, -51, 21, -78, 86, -145, 23, -27, -55, 34, -141, -13, 36, 4, -82, 83, 13, 109, 32, 53, 145, 25, 36, -86, 27, 129, 153, 5, 175, -148, -25, 40, -5, -19, 55, -97, 27, -146, -130, -27, -43, -50, 139, -160, -32, -140, 90, 79, 108, -111, -28, 78, -125, 48, 61, 40, -12, -52, 63, -59, 114, -5, 49, 20, -6, 73, -119, 110, -35, -27, 37, 47, 79, -159, -50, 229, -39, -122, 48, 81, 125, -102, 29, 115, 46, -5, -94, 53, -158, -206, 68]
4136F8l7l8l8%K15k6j82j29J39j74L14j44K3p8J7R3j5J59j42j85J73j16O2q8j7
4161a46J62o9l6J63K3k40K68j61L2j03Q4Jk14K56j16J20J63k08N0Kq4J41n5O8
4185A01j3j03L4J02j34R8n5J04n9l7J1q1N2R9r8k0J94o2k25J8k4J57M4j46N2j86
4211a77L41r7M4k73K07j75L22q6k2j68p5K9P9qJ35j43O4J28j80M0q7K29p6o7j2
4236b8O5j5Kj11P6L7q9M4J31j80J1m3j4J79O6j58M4%r1J27q8J38k7q7q9J19m8
4263b9L5L4q5P6Lj4l6J54r3P9j97J65j93%L4jJ43q0j6m5nM6J32n9J5j75M6J19
4291E3J9j89Q4P6r2n7o9K39L4m3j89K6M6J69n1K3pj00J19j84m5J79R7o4J22k98
4317a02J69qj00p6p1K46j1o9o4m8O6j9J70j85o8P4Q1J14k06J87q4P9jJ11j80J29
$$ y = [68, 31, -7, -45, -45, 170, 144, -38, -167, -28, -202, 112, -32, -9, -87, -70, 23, 8, 167, 25, -160, 13, -103, -41, -129, -146, 16, -53, -89, 74, 97, -143, 125, -36, -4, -107, -23, -22, -236, 20, -96, 24, 187, -21, 29, 31, -53, 88, 33, 101, 88, -15, 19, 121, -13, 85, 30, 134, 75, 38, 49, -32, 20, 119, 21, 1, 195, 133, -92, -74, -98, 59, 103, -43, 9, -177, 164, 67, 111, -162, 45, -130, 192, 106, 84, -84, -159, -130, -51, -59, 76, -67, -3, 125, -55, -15, -102, 127, 51, -16, -28, 37, 22, 24, -87, -11, 26, -63, -19, 112, -68, -57, -100, -114, 65, 131, -27, 17, 17, -74, 53, -35, 103, 76, -11, -100, 19, -29, 6, 40, -45, 31, 34, 20, -16, 138, 45, 124, -73, 92, -101, -101, -67, -68, 75, -5, -21, -66, -71, -25, 107, 48, 63, -112, -66, 53, 72, -117, -33, 43, -49, -106, -175, 64, 98, 55, -134, -108, -62, 107, 56, 79, 72, -28, 91, -93, -138, 41, 138, 74, 196, -102, 67, 59, -41, -117, -188, 58, 47, -22, -86, -134, -68, -87, 83, -102, -170, -96, -15, 99, -107, 80, -4, 75, 74, 185, 5, 134]
4343A34m8J25m06J33O5j4k4J9j2J33Pq7oj40L06j54n3M7j26J50J4O2j19J50jj39
4369A6m8j0K75j10j16J39j41R6j81K67m1k10j00L08q6m6m6K3j2nr7M1J95k11N8
4394d2O2R3j15O0M6k47N5K0J27j57l2J45n6m3J2K36j97J3r0K11J23l87K91k17
4418h9J23M9N6j18Mj45K58q8L2j27RjJ4N3j32p0K4n5J71P3Nl4J14j07J40pj30
4445B2L9o5q6J66J7k45O7j34K89k9k9k26L46k6n5j40M9J27M3j94j6L9j60l0L56
4470A25n4k12J74j40J7J01nm9K31q6j81L9k9JR5J54q4l7k4l2R4j30M0j85J57J37
4496A17q2n9p8j18J68J82k62J91J8j83J0P5N3K36l08j02J21j59J73M8q5q2J82
4519E6k9r2J08k7Q4j98N9j2O4m2P2o9l9Q9j14P6r8NK47j03j31J11Rj9j00J36j32
$$ y = [134, 86, 211, -195, -62, 3, -11, -35, -16, -28, 105, 112, 25, 19, -121, 185, 31, -22, 25, -101, 49, 63, 125, 6, 156, 155, 16, -32, -42, 233, 123, 7, 146, 5, 101, -80, 187, 146, -64, -164, 144, 58, 12, -34, -11, -23, -28, -125, -84, 111, -100, -42, 20, 113, -2, 58, 104, -143, -88, -68, 59, -98, -130, 15, -41, -84, -72, 164, -33, -20, -110, 101, 224, -163, 128, -89, 34, 83, 139, 21, 25, -120, 138, 50, 82, -45, -36, -37, -23, 30, -102, -172, -148, -203, -32, 41, 46, 12, 126, 19, 159, 152, 22, 61, -4, -90, 76, 93, -152, -85, -219, 70, 41, 12, -214, 132, 106, 51, -89, -40, 87, 130, -64, -80, -41, -201, -231, 125, 71, -141, 33, -107, -90, 11, 6, -43, 188, 102, -79, -40, -69, -68, 27, 181, 97, 60, 36, 4, 98, -32, 8, -177, -20, 117, 35, -24, -102, -220, -52, 130, -132, 59, 77, -106, -96, -21, 32, 268, -40, -142, -21, -180, -7, 41, -44, -126, 56, 27, -65, 43, 16, 100, -98, -39, -51, 13, -29, 43, -26, -65, 24, -90, -14, -112, -107, 140, 37, -94, 17, 26, 7, -93, 43, -89]
4546h9K00j90J82k6r3j16K45o7P0j91R3k7Lj96J56J0O3j16J63k0p3J83J4k16J9
4571a9o1O1k7J70j62L9K5q0N8q4Q3j05J39l4J95k59R9j3M6R7j92J03p5p3J08K1
4597F0N9r8j51J17K39k68L1J00j16R2l0L4k04J68j5P2r9j53K30l01M20j49k8j79
4621a69O5J29p3R8j62Q6M9l8p4j9R3k7R7pn5O5r1J10k8j19J58j49k9J30q3P7j82
4648a48j7K28j81K42j94M7J4qJ17j69R9p7m5j5Q7k5O1J54k62L9M8J22j36k7K05
4673A59O6l31j0q0P3M2J3N0j47K83m3j43N6J64k53P0J00P1k37Q8q0R9p6N5L6L1
4699E6p9JJ71l45J59J69j54J85Jj89J44j26rPq8J33L4j52P2O3o8l7J3J3J42J0
4725A26p3k3j15R2K6p5J83p7m2j43o8J99m1l2R0k7L4k40J51o9L0Q4J94j49l0j44
$$ y = [-89, 111, -79, 103, 77, -16, -132, 113, 46, 116, -75, 18, -9, -6, -202, -46, -36, 27, -89, 74, 54, -19, 164, 178, -38, -19, -80, -19, -46, 124, -38, 1, 26, -54, 4, -80, 3, -102, 37, 3, 198, -61, 38, 25, 71, 168, -24, 79, 4, -69, 39, 60, 119, 21, -130, -13, 226, -42, -11, 89, -27, 65, 35, 69, -135, 33, 18, 90, -9, -162, 68, -233, 187, 38, 10, -169, -104, 25, -48, 50, -112, -26, 23, -15, -89, -108, -15, -42, 55, 48, -7, 58, -33, 77, 49, -70, 88, -61, -90, 40, -43, 34, -148, -165, 63, -118, 124, -70, -23, -9, -17, 100, -69, 30, -47, -92, -107, -20, -45, 16, 170, -92, -53, -5, 117, -19, -46, 159, 225, -106, -116, -196, -123, -81, -68, -18, -165, 118, 75, -68, -12, 152, -101, -31, 69, 140, -97, -9, -89, 10, -66, -11, 25, 56, -23, -22, 149, -196, -37, 132, -22, 163, 164, -25, 119, -7, -16, -9, -97, 36, 70, -82, -10, 53, -15, -52, -39, -26, 116, 126, 53, 30, -85, 7, 33, -42, 141, 64, 22, -121, -189, 10, -31, -63, 27, 0, 34, -206, -55, -124, -94, -10, 184, 35, 5, -139]
4751a39J61j0M9n6R9k89J81j02J23l1jr3Q1k3j31Q7L5Nl8K64j92Q0j00N5M1K0
4777G6Q5j43oK3j20kM9N1O6q0k7j0O4j98K71q3o8K09p0j80J52k16J08O1j04m5
4803a37J57K6j55n5K13J41j61o2kK7R1j03j3J9k1j2N0o7J58k36J73J28m3j0j6
4828I0m2j12J23n2r4K7J42j49J66j88K20j3k67J78K8P2r4j28J32l2jq6O2J38j14
4853FQ5k88L59k15jO6J18k31J66r9K37k51K3J9J60j29M3J7j18J02j0n9P9j48J
4878f8K90q6n1j94pLN4K04j59m3K11k76J26j76K13p5M7K2r0mP7j55J60j69K37
4903I1j82o5j0K02k43K00J66j00p5M7j8L3r1k7K17p8j55J61j37J65k8k02N1n9
4927a37l9J69r7J65J75k31j29k23K94n9N2N6p9K15j05J36r0j05r3J62j76J28j22
$$ y = [-139, 22, 12, 61, 5, 104, -185, -4, -106, 17, -14, -15, -108, -27, -50, -181, -94, -59, -54, -92, 172, -20, 60, -40, 15, 56, 76, 161, 18, 12, 35, -85, -87, -38, 13, 79, -1, -28, -38, 26, -172, 99, 16, -52, 157, 87, -93, 59, -157, -49, 12, -92, -137, 20, 46, -109, -164, 49, 190, 29, -33, -35, -8, 83, -20, -33, -14, -35, -47, 3, -64, 94, -142, 31, 159, 116, 106, 90, 48, -64, 59, 7, -87, -60, 82, -67, 99, -89, 131, 118, -149, 29, 57, 129, 35, -93, 39, 7, 6, -80, -18, 120, 6, 91, -197, 162, -53, -54, 12, 130, -101, 65, -34, 203, -48, -25, -6, 154, 25, 68, 85, -33, 69, 59, 0, 79, -69, -68, 222, 136, 85, -109, -116, -113, -59, 145, -14, -57, 154, -122, 4, -172, 41, -34, 13, 35, -55, -59, 18, -137, 23, -146, 91, -91, -156, -166, 36, -207, -7, 159, 59, -16, 31, 13, 46, -45, -72, 145, 67, -88, 73, -64, 101, 73, -129, -78, -137, -176, -7, -104, 61, 236, 5, -124, -347, -53, -112, -60, -4, -83, 132, 27, 163, 73, -32, -125, 37, -139, -11, -133]
4950a33K23j66N0M5k6l1P1k76K79lm6r5J48j3L0o5N7k02K65j85J65j28Q2j24R9
4975B1J02j97J10K7Q8j64j3m4L82l36P1k8j2J37o9q1PL7j08R9J11j1j63M0L4%
5001D0j7n4P8r1j27M9R6J21k3O1j18m9R4l4j38O9k2p3N8l7J00rJ5o8R7k41J30
5028i3k8J53j28K34j24%JN4j15M2M3k5n0N3k42J73N7OJ23j64k9k1Q1n0J50K0j56
5055c5q5j04L47j30N7J57l8l19J83J17j84J26r5o2j10L03o6n5J61j82%p7Q7Lm5
5080d6JO2K9o5l3m0m9J61J27j94R9j2k8j4J3N6n5K0J25j14N8m4j40K21o2p9L6
5107C3O1j01J9l3J32j23o7K30k47J46K2j66J05j70J59m9J27j11J07k53K21P4o9
5130D7r9J87k63Q9J20n3l4m0qJ08o6J22Oj00j8p9J48n7R2q1p6J95k41jJ45m4k28
$$ y = [-133, 90, -76, -26, 19, -7, -38, 33, -243, 36, 33, -13, -108, 40, 27, 57, -8, 49, -153, 112, -73, 92, -36, 46, -78, 21, 123, -74, 36, 63, 151, -13, -26, -70, 312, -24, 47, 19, 7, 144, 75, -6, 1, 38, -70, 29, 140, 129, -34, 6, 40, 40, 23, -31, 47, -44, -171, -122, -26, 95, 72, 133, 15, -34, 60, 26, -112, -43, -65, -138, -80, -117, -17, -26, -11, -79, 18, -223, -93, -121, 32, -96, 138, 14, 14, 15, 69, -46, -4, 39, 14, -36, 17, -225, -52, 5, 11, 134, -30, -59, -80, 1, -49, 101, 121, -35, -120, -224, 123, -7, 50, 207, 169, -150, 33, 150, -34, 92, -3, -65, -175, 128, 62, 7, 168, -14, -14, -91, -4, -1, -46, -45, 17, 46, -19, -52, -92, -141, 20, 147, -47, 52, 40, 12, -2, 11, 67, 12, 32, 157, 43, 101, 57, -83, 138, 76, -3, 33, 94, -7, 12, -21, 111, -12, -79, 151, -96, 50, 72, -94, 11, -159, 0, -49, 78, -33, 74, -179, 42, 116, 47, -52, 135, -128, -39, 81, 28, -6, -46, -54, 54, -12, 110, 116, 16, -2, -81, 67, 10, 102, 21, -55, 140, -101, -102, 43, -1, -229]
5157b29K35K3J3J1o4K20k33J8J14l06J32q7Q4M6J07l1m5J29j46O0j06j8n7K71
5181A41j81J0p7J14j33J04oJ41j92J20o6J86%l39K43qJ7Q0j75rJ43j70l3J44j73
5206a19K04mk92J71J71j69M4PK10l23J19j01m8Mj6N1M3P3j98K96o0j11N6K1N7
5231H6o1l2J9r5J36Q9j86J77j71n3J32j03K25k45J42kj55L0J22o4m7Q2L2j16o
5256f4Qk7J60j03L4J41j62O5j30N9q6J09L4lk6lJ10j80J4M4R6k06J69r4L3j5j2
5283c5o2J5J62j74J65n7q3O7J42j82L8m0Q6j15l1J52K0j65q2J30j33O3Q2J80j20
5308B3j3p1p2K44j04j21J38k5Q6Q6j90m1k2J93j69N2J8O6P6j32J26k06j8K7M3
5333fJ31j44O8j37J58O6j78P7KK8o3K28k25J24r3r0J87j23N2p1l7L9m2J45j31
$$ y = [-229, 6, 29, 42, 53, -11, 209, -24, -6, 108, -198, -66, -153, -69, -23, 84, 53, 8, 137, -9, 51, -55, -73, -130, 141, -40, -30, -107, 7, -126, -22, -28, 113, -79, 41, -25, 161, 161, -178, 65, 57, 74, 154, -21, -30, 113, -57, -90, 54, -119, 85, 81, -211, -40, 131, -38, 6, 13, 223, -100, 19, -82, -130, -126, -142, -91, -48, 25, -173, 123, 63, -48, 8, 29, 86, 25, -7, 12, -83, 53, 142, -44, 133, -38, -91, 41, -62, 163, -82, 60, 58, -97, -67, 55, -9, -56, 26, 58, -58, -64, -56, -83, 77, -26, 8, 149, -13, 52, -78, -19, -105, 4, 38, 35, 9, 6, 116, -64, -50, -6, 90, -116, 53, -41, -8, -23, -35, -97, -82, 80, -94, 71, 14, -69, -2, 140, -42, -4, -44, 42, -73, -104, 48, 68, -97, -179, -49, -182, -119, -37, 143, 23, 10, -61, -133, 111, 7, -114, 24, -1, 85, 171, -19, -60, -82, 111, -58, -6, 12, 78, 154, 22, 148, -58, -76, -49, -6, 125, -19, 49, -88, 70, 136, -42, 35, 37, 65, 2, 230, 5, 129, 36, -54, 133, 10, 62, -9, -46, -7, -49, 96, -35]
5358c5N0pK0J06O7m14K29n1P1J30k09L2M0l0r6J74K4k1j38J23j72K86j77j66J12
5383e2L3o3l3N8J30j65N8O9P4m9q4n7K2q6P1Q0j42J74J21j58Q8m3on2J0N5l5j3
5411EK0j24J57k4N1k22Q9J8K5J07q4N6j12N3N0j55J85J08j22l2j53KK02j01k7
5436b8P5Lj33L3L8Q0j90J20M9m9L6P9n1p7M4N2J30k24J9J40j65J37j98n9L3K66
5462A60Or1j09J09j07j18K23l0Oq4P3k31K59J2mQ9k52J57p7L2j12P4j6j3P2J08
5488A36k58J13M2qr0N3J09j17j3R3P0j21l3J03k74J54P0K1j74l1J36J07n3L2p1
5513dJ02r5j70J96m8j52J96J10j48o4J82M5j84P2Q6r2L5o5n6NJ33N5l9j09q7R5
5539aJ84j64J35j09o3j83J47M3J93j11n6q6N8L7r7P9N8j41J54j28n7k9P1J6Ml
$$ y = [-35, 15, 8, 28, 134, 201, -213, 16, -35, 36, 166, -43, -11, 29, -1, -97, 77, 101, 80, -58, 65, -107, 179, 2, -164, -52, -19, -82, -115, -57, 73, -92, -34, 35, 109, 60, -24, -81, -59, -145, -74, 6, -136, 38, 159, 1, 89, 46, 40, -12, -2, 53, 18, 5, 25, -99, 58, 34, 85, -137, -48, -30, -5, 102, 18, 74, -38, 15, 65, -90, 95, 203, 81, 49, -104, -102, 100, -1, -28, 47, 50, -83, -50, -12, 68, -122, -2, 47, -2, 34, 113, 62, -15, 29, 81, 211, -13, 6, 146, -19, 118, -80, -139, -106, 160, 166, 75, -34, 75, -32, -150, 73, 43, 49, -35, 38, -193, 66, 78, 74, 163, -89, 68, -9, 23, -89, -15, -31, -44, 28, 136, -122, -9, 33, 25, -65, -12, 97, -20, -33, 60, 130, 9, -24, 79, -195, -41, 29, 50, -124, -155, -19, 88, 35, 67, -4, 98, 3, -167, 29, -19, -171, 25, 135, -13, -77, 105, 150, -34, 38, 124, 32, 67, 2, -54, -49, 84, 139, 100, -9, -96, -1, 183, 19, 154, 45, -18, -201, -54, -11, 182, 71, 15, -71, -13, 24, -73, 6, 64, -77, 77, -51, -108, -137, -66, -50, -46, -49]
5565d9n4j06J07J32p6J57j69o1J10J34j62l3J0J10j41R4n1J00N9m03M10j70n4
5588a06qK54j18j0K7jM7O1j42j6q7Rm1L09j81N6j5l9J9k05J65J77k59J7l6J46
5614B3j19K02k13J47ql0j63K74j02N3kl6J59l27J72j18L8l5J25j2j18J59l6J4
5638D7J06k29kJ77M0k03q4J30Q6j7j04J37j26N7p5k0J42n2M7k1L1p6J83j27o7
5663b0N6P1rk9j37n3R4j17j02L45m2j06O3J07k50L04j21k04J05J33L4k11J74j51
5687f6K82k05P1j54Q4Nr8J10n2K40l28J98r8NJ8o8P3j27k8J50k81L66p7J5O5N2
5713A52j90P1L8J7jk65N8Mj8J36r2L9N8J23k36j37J41J08L4JL7j37k6R3Lk51K38
5740bJ31j19p8J38k24K79m8N2k82Q8J06J10j36J99j22J5m7j5j64J27Oj66K38l7
$$ y = [-49, -103, -209, -102, 30, -46, 111, -58, -119, -9, 125, -37, -70, -60, 50, -91, 3, -48, 52, 111, -292, 118, -52, -106, -114, 140, 22, 12, 39, 38, 85, 146, 4, -12, -99, -90, -131, 178, -3, 53, 38, -1, 18, -187, -22, 155, -104, -87, -123, 23, -96, 106, -107, 40, 32, 2, -161, 113, 11, 64, 62, 26, 185, -142, 30, -88, -50, -85, 40, 28, -90, 69, 33, 47, 153, -76, -78, 99, 139, -64, -148, -18, 68, 51, -53, 84, -42, 15, -60, -80, 62, 10, 57, 36, 67, -9, 174, 47, -20, 36, 107, 98, 69, -68, -121, -27, -144, -246, 99, 57, -49, 14, 121, -129, 175, 54, -150, -45, 88, 122, -89, 85, -66, 216, 11, 82, -72, 12, 17, -81, 29, -23, 217, -111, 87, -11, -6, 12, -56, 17, -110, -138, 12, -269, 97, 20, 35, 100, 152, -38, 33, 71, 88, 87, -178, -120, -116, -134, 2, -90, -51, 7, 130, -106, -243, -102, 6, 40, 41, 78, -59, -85, 8, 11, -240, -2, 129, 10, -68, 70, -154, 125, 77, 129, -153, -65, 41, 151, 15, 214, 92, 107, 60, 45, -119, 8, 14, -152, 86, 49]
5764D9l2J46l28J95j71jK79j33KJ19j40J2l2j8q4J43J39k44K43k21O2O3J17k18
5788e3J78l5j25l1K40l11K43n3r7L1Pj40J24N5rK1k69J13J36O8r6Rj33m1J71O0
5814F3K2j44m5M4P7k20K83J9P9k9r4o4J20r8j63J59m8n9J94j04L6J93j29j3k4
5839E5k2p4kQ7jN6j66J47j61j6N9K38q5on0j42m5N2N6J28k04M1L8q9J39j9L3M
5867E1j56N7Jj8J37q4J15j70K35q1k0k49N2j9J36O1k29R9P1J63q3j35OJ6Jj10
5893a53K34j08Mj41J28n4o4N3L6R3N1j9j60K82j88r2o3R5Q1k28J89n8J5o2J55
5918B6k5%R5r7M7R9j87l3J4Q0N9L0k11N8L8j2mn3K2P3j70K20J8r6Mm8q2L1N2K20
5948A68j32M3j60Q6L1L4o4J20j80RM9Q3j07j49L85l48L5J67N4k83P7q4J40K1m7
$$ y = [49, 17, 163, -165, 30, -141, -142, 137, 4, 6, 125, -15, -3, -35, -53, -137, 6, 145, -99, 144, -77, -15, 48, 165, -53, 125, 90, -35, -66, 174, -137, 106, 53, -44, -13, -6, -146, -22, 33, 24, 45, -224, -111, 25, 93, -3, 6, -127, -168, 3, 63, 85, -59, -104, -60, 17, -203, 80, 99, 178, 149, 55, -9, 111, 13, -150, 9, -39, -98, 96, -8, 28, 221, 92, 79, 55, 33, -41, -43, 44, 43, 99, -67, 80, -81, -97, -38, 200, 115, 109, 59, -83, -128, -76, -20, 108, -96, -55, -17, -106, 33, 14, 47, 51, -105, -48, -47, -65, 72, -12, 103, -67, 168, 87, 67, -182, -130, -149, -13, 48, -181, -82, -11, 152, 69, -66, -60, -44, -43, -153, 81, -27, -23, -164, -36, -90, -154, -101, -65, 28, 79, 60, -100, 182, -6, -98, -161, -66, 15, -213, -24, -82, -67, -129, 26, 1, 1, 96, -1, 46, 145, -42, -75, -61, 19, 78, 108, -103, -45, -7, -19, -23, -76, -54, 19, -151, 69, 87, -9, -5, -53, -135, -104, -52, 168, 36, 79, -81, 5, 36, 70, 6, 126, -54, -45, 4, 87, -20, -169, 216, -132, -97, 70, 124, -159, -82, -166, -26, -5, -52]
5973e2R3j04J96o4l1L0n2j46K2J35n6oj52K22k3j04J05r5Pk4J54j83O6J66j54
5998e0j03Q6J28r9J07rj75Q3k4J46j91J31O9k9j2L4N2j37M2j01m1K01k06J09N2
6023F3j90J22r9J31j35R9L6j08J39N9m1k17J36K17j38J5j53J42J7l5j39O9m3J59
6047A06O6j33L0m8qM1O8j78o6p7K03K08k94J43o9N1k7j38M3j15J65N5J16j96N3
6072aJ10n5O5l55K46j43qJ61o1J22l0j51J62l7L8k00J30N2OO3K0j38N7j58k9j8
6098a52J39k06J06O7J59r0J5j9j66J32j17J07R1q5O0j01N4J65ko6q4Q3N9k33j6
6123a00O2L8nQ7j2j76R0j26j6K50m1q0O7p0J99j93M7j26P5n9m2J78O9j71P9k2
6149Bj52J69P5j11K35j21j78J32j08q1L31j46jr9k2K20k25j9n9K96k11P0Q2m8
$$ y = [-52, 41, -63, 133, 69, 38, 68, 16, -130, -108, 27, -29, -35, -187, 35, 12, -92, 13, -82, -75, -99, 55, -128, -62, 104, -50, -153, -67, 61, -38, 69, 60, -115, -32, -56, 90, -101, 30, 99, 70, 58, 92, 144, 7, 49, -52, -93, 108, -98, 11, 63, -127, -5, -104, 27, -108, -9, 27, -81, 58, 117, 76, -141, -5, 212, 74, 89, -64, 78, 95, 60, -79, -10, -53, 106, 172, 39, 69, 21, 13, 54, 122, -56, -122, -199, 4, 212, -82, 61, -8, 43, 16, -122, -79, -194, -29, 26, 142, -54, -1, 109, 54, 119, -236, 10, -133, -141, 20, -41, 81, 51, -100, 62, 25, 63, -137, -7, 45, 51, 114, 134, -4, 53, -105, -134, -152, -13, -219, -113, -46, 113, 23, 38, 19, -147, -15, -132, -25, 66, -19, 41, -60, -6, 159, 157, 91, 7, 90, 149, -84, -100, -38, 0, -5, 82, 70, -106, -16, -142, -158, 92, 51, -29, 38, -32, 167, -26, 21, -105, -30, -89, -131, 47, 116, -55, 24, 2, -150, 19, 94, -17, 218, 97, -81, 51, -57, -138, 193, 47, 46, -53, -75, 145, -80, -99, -158, 138, -73, -3, 79, 31]
6173C1l0l5j16J7J65j97J96n9MJ94l8r9r5Q4J6on1N0j8j8O1Kl8K26j46r6k11K52
6201D5O3j01KRRj03P9L1l2R5l2n7R9o8Q2j00M9K8j78OJ77k22Q7k2j2m5K3K97l03
6230i4PJ23K7N3p5l8j32nL4O5R9j44o3J54N7P9j87J12l9J03j54J22k57K38J0j53
6256e8M5M7Q7l03K95j27j76Q4R4M5q2J52j23j65K36l4r8K03k65K11k8r0Q8Qj83
6281a37J53l2J8kk0J55j87L2j38L10j59J02l6R2j73J13k48J80k85K81j5Q6p0n6
6305c6J91m9j54J10j75L19k10L3j16J7J06k41J67j10J66L3j65J2J80j05q6L58
6327B45p5j54p3l9K49j50r7N9k3J11P7k21K07m5j14m%l1P9q5j7N7J0Q7p7l5R2
6354C3k5l9n3R0r6Klm9J63J8r9O2J35j57J81r6j95J93J88k62k09K63n1k8j9j08
$$ y = [31, 1, -34, -150, -133, 32, -165, 31, -28, -24, 170, 132, 33, -62, 22, 38, 32, -19, 31, 13, -5, 56, 58, 20, 246, 100, 4, -207, 45, 108, 7, 9, 18, 27, -76, 3, 34, 2, 97, 65, 8, 107, 39, 121, 21, 70, 98, -80, -74, 103, -119, -32, -54, -66, -111, -88, 209, -94, -87, 36, 63, 116, 41, 3, -129, -134, -100, -35, 64, -80, -143, 11, 68, 147, -40, 72, 33, 136, -18, 104, -153, 85, 95, -58, -13, 34, 121, -182, 113, -14, -190, -106, -12, 33, -49, 103, -20, -185, 51, 17, -81, 122, -143, 68, 40, -50, 38, 46, -137, 16, -16, 2, 0, -20, 135, -52, -20, -158, 152, -7, 95, 59, 151, -22, 91, -157, 23, -262, 19, 4, 90, 20, -36, 155, 106, -48, 62, -113, 206, -4, 29, -87, -70, 36, -205, -38, -148, 18, 51, -114, -102, 78, -27, -113, 245, 170, 16, -57, -96, 153, 3, -94, -35, -58, 53, 130, -91, 116, 71, -43, -47, -47, -78, 1, -84, -101, -44, -34, 53, -24, -59, 33, 8, -31, -84, 6, -90, -88, -91, -140, 23, 41, -58, 4, 139, -18, 163, 67, -128, 65, 253, -9, -218, 45, -6, -34, -53, -161]
6380a61J56O9N3r4j09O7l2Qj39K28k2qM6n8O9p8k4PK20k62J45j15n9J66j04q4
6406a15J00k4n5j6K33j54j38l2J89J05j12K0q3J17q9N3O3j62R3J03n5Q2j09j18
6430a04R6J79j27P6k4j20K1J02k16O2R5m0k8l4J59o7M6j74R8N9j94K48j67J45
6454I1p8j69J63n2J71M7n2m2j9j41K9J25j16K13j15P9q5j23N7Q1q2j02MJ52M6
6479H2j26J42k51M0K14j35R4p9J42k03J33P4k50O4J54m2L1k16L6J15q2P2Qq8j
6504g2O1L0j09J30J88k50k3N7o2RN7J4m0N2Q7j41r6K32j54J2J57k03Q8j03P5Q7
6530H3m1n2k0r9L78j95l6lk3ON2j97K1J8M3r6K06q6n7J49r3R4l0N9n0m8N0R0j7
6559A06k0q3n9Q1o6K33j61O6q1J39k00J47j59L9n1K2n4O4j1m5N5j36J2J53R9j38
$$ y = [-161, -5, 64, 117, 23, -86, -19, -51, -43, -182, 46, 24, 16, 62, 4, 73, -5, -29, -22, 198, -64, 81, -34, -93, 73, -31, -115, -15, -39, -94, -110, 123, -31, -169, -201, -12, 93, -19, 1, -82, 35, -54, -1, 62, -100, -7, 96, 41, 123, 14, -104, -8, 171, 44, 120, 96, -24, -3, 99, -117, -55, 40, 0, -28, -62, 97, 30, 76, -98, 0, 59, -135, 113, -54, 91, 13, -156, 7, -45, 126, 173, 121, 79, 60, -81, -52, 73, -43, 170, 55, 134, 49, -74, -17, 64, -18, -120, -116, 36, 82, -44, 98, -153, -113, 101, -34, 60, -19, 123, -80, 53, 127, -123, -59, 95, 53, 84, -132, -96, 19, -63, 9, 17, -71, -72, -11, 19, -90, 40, 228, -22, -45, 12, -50, -41, 16, 30, -10, 42, 129, -12, -108, 124, -30, -18, 139, -64, 24, -79, -4, 83, 42, -10, -30, -129, 249, 54, 18, 15, -8, -2, 50, -147, -126, -108, -65, -161, 45, -41, -98, 51, -42, 52, 22, 81, 31, -17, 33, 123, 106, 86, 3, -56, 25, -41, 192, 31, 97, 16, 155, -45, 102, -57, -18, -69, -47, -101, -37, -48, -93, -38, -174, -162, -9, 90, -48]
6585d8O5j5j0q5J01O8Q6j19j01K84k04J94r1k42J34J03j58K4J22J3j21M1P2j51
6609c8o7J40j35L5j32J91K7j93J65J56l05jO8K27j49k0K86k72m6j0R9j20J42j66
6633a18P0M8j47K74j54J22k4k6Q0r9L2M2j70K7r4K5o9O7J30N0k68J49M2O9k52
6658a94J93J1nm3J08k61K21J49k17K7J30Jr9k1M3M9j86J04j09M1n3J46l1Q5L2
6683A21o7M7o8Ll8J10p8jp9M2M6j82J83R9j85K2M6K9n5M0No3o9J83j22j69J98
6710bj1o9p4J34J5p1K84j52j18M4QK0n7M4j00K11O0j26m0N0Rj8j0r8K88j40j58
6737g7o3J60J7k39J00L13k05J0O8l11K23P7k2l8l6J39l6m6N7j18Q0j39LJ9J84
6762A20j64J27j58j2K90j03l52K32j62J72K1o6k8r7K11K1J7r6l1Q5q7P9j24R8
$$ y = [-48, 17, 2, -8, -93, 8, 76, 162, 43, -58, 226, 22, 216, 125, -117, 17, 120, -38, -14, 108, 121, 0, 41, 113, -38, -105, 35, -100, -65, -197, -6, 21, -172, -7, 149, -156, -157, -89, 138, -11, -31, 255, -17, -63, -73, 26, -94, 48, -118, -48, 0, -147, 127, -27, 95, 71, 45, 125, 26, 58, 100, -70, -43, -137, -112, -181, -114, 16, 66, -202, -53, -11, 58, -194, -1, 10, 5, -38, 70, -191, 30, 179, -38, -11, 119, 120, 21, 0, 43, 92, -94, 10, -99, -58, -111, 35, 4, 89, 121, 54, 101, 33, 36, -2, 108, 30, 29, -50, -8, 38, -144, 39, 138, -47, -25, 21, 50, -5, 35, 40, -23, -92, 91, -31, -200, -2, -13, -82, -156, -22, -7, -78, 206, 54, -64, -20, -12, 8, -49, -5, -105, 106, 166, 40, 0, 50, 59, 41, 31, -67, 221, 81, -77, -140, 20, 37, -202, -102, 211, 6, 16, 84, -227, -4, 73, 51, 13, -23, 116, 80, 34, 91, -27, 53, -86, -83, -64, 120, -44, 83, -75, -87, 203, 100, -252, -20, -182, -10, 11, -55, -83, -180, 31, 52, 69, -27, -58, 27, -60, 19, -105, -7]
6786gq6j04J40J50j03J26Jj80L7k9N5j48K52n9j61J16j31K12k29R7m5O0n0J87
6810A01k62K03Pq8J18j80J40q6j09J44K3M6k38P6J19p3J13Nr7k9M7l4J86k99J92
6835B5J0p2P9l0j92J46m0pR0J26o7l1J8p6O3J40l1j23P1KL9k19j1K42k28oN7O6
6863D1k02J16R1Jn6R6p3O8l2K8j36MQ5j23J40q6k3J31j43L0J51p8L3k9r9J72n1
6890E6k2k9J1p2Q8N2R4j16j55J25J8O5p1J3n3j22j3Q3k1J13m8n8m8J23J8j16J16
6917C1pl6j31K89j69J19rj96l5K63j21p9J86j97J57l18K98M9n8l4J04j53R8k8
6941B3k74L58j28M2Rm2RJ51k52K8q1J42M8l1Q1j80J77k6p2m9o4P2M7K1r8J19j57
6968a27O9L1J00M2j93J61n7k37M1M6P6J51J3O0m8j01p0l0Q1r8K5Qq6J30M7mp8
$$ y = [-7, -93, -197, -57, 93, -10, 116, 117, -63, -26, -55, 0, -148, 104, 45, -116, 0, -131, 81, -148, -51, -96, -36, -86, 101, -161, 42, 49, -39, 79, -101, 39, -47, -156, -12, 11, 57, -181, -105, 14, -59, 54, 59, -38, -67, -20, -54, 132, -167, 25, 35, -37, 42, 12, -180, -34, -74, -81, 9, 135, 68, 37, 55, -21, 42, 182, 151, 28, 99, 101, 140, -79, -90, 152, -76, -82, -25, 41, -161, -45, 46, 47, -9, 87, 14, 82, 50, 78, -58, -54, 31, -92, 48, -38, -61, 70, -73, -43, 108, 30, 63, 34, -65, 107, 56, 34, 5, 16, -56, 32, 84, 178, 62, -93, 32, 50, 115, 44, 57, 4, -118, -131, -48, -69, 44, -4, -62, -110, 13, 31, -85, 31, 24, -12, -143, 146, -23, 96, 87, -109, -144, 119, -2, -81, 105, -92, 65, -253, 45, 94, 36, 2, 106, -47, 51, 23, -251, 107, -21, 21, 30, -12, -3, 148, -104, -76, -157, -15, 33, 2, 83, -97, 80, 54, -18, -67, -131, -59, -12, 9, -89, 30, -127, -58, -27, 73, 115, -78, 83, 26, -211, -170, -124, -48, 103, 116, 176, 128, 27, -43, -73, 8, -90, -65, -57, -143, -13, 34, 30, -48]
6995d8J49M5k54JQ7O9J0q6M9j95J10O3l1J97k10J65j17kQQ8r7N0L2m8q7Q0NJ4
7023D7j7J01l20R5J79k58J38j3J90j10N2j09n9m5N2J25l3qJ29o0k2k3k6LO5q4
7049a1J53k10K1J84l0r0L4P7Pj68J26p1PJ06o1Lj11R0j81J32n4J1J8M4j52K42
7075A16l4p7m2o2Q4J51j3o2j25Q9j1Q9j61K31k4j44lP8q7J42p4j26PO1M0l7l9
7102c3q9L38k87r6Q7J8J95k03L7J12k14J96m6K9k4j84K84j54n9J14p3J99m8j21
7126b2J23L2m43L87j8r9O0q7K20l05Q8R4%O5r1q9Q6j42J39j30P8j1J25l1n3M8
7152B4j19NN3J8j80J68J55l36J54j22K1J42N5j5M5m0j68J10j30R5K06j71Q4q8
7176c4l5P0K2n6o5J51N0m6J4q0O5l2j36J16L1j65J3K11k03K03j65n8P9p4J07j5
$$ y = [-48, 101, 146, -108, -107, -20, 49, 59, -27, 22, -173, -63, 0, -31, 166, -44, 121, 4, 2, 10, 98, 1, 51, 83, 35, -52, 28, 33, 47, 30, 131, -189, -94, 85, -173, -35, -48, 142, 32, 84, -25, -84, -129, -77, 48, 15, 7, 136, 76, 54, 31, 5, 8, 73, -11, 142, -68, -47, 137, 107, 17, 51, 128, 135, -33, 93, 22, 29, 135, 74, 77, -34, 56, -125, 7, -47, -36, -18, 26, -126, 116, 82, 5, -37, -99, -15, 136, 123, 61, -64, 25, 14, 103, -58, 173, 149, 5, 2, 80, -7, 135, 61, -65, -58, 3, 43, 6, -33, -122, 216, -71, -167, -80, -62, 133, -70, -33, 79, -135, 61, 15, 44, 20, -164, 120, -34, -93, 21, -52, 147, 99, -22, 101, 133, -310, 77, 59, -40, 20, -67, 153, -152, -64, 30, 30, 95, 4, -85, 1, -141, -2, -132, -54, -65, 60, 29, -24, 24, -95, -90, -37, -19, -199, -31, 124, -212, -58, -180, -159, -17, 38, 23, 68, 28, -140, -30, -160, -65, 141, -30, 54, -34, -69, 1, 23, -33, -98, 53, 103, 57, 71, -9, 56, 24, -112, 4, 35, -130, -117, 94, -109, 94, -71, -129, -50, -124, -17, -32]
7202c2J22l3N0j60Kq1K18KK4j39Q8j77n0J70j23K9J85j23N7j57J13nO1q1o3Q3
7228b0p2J06J47l97J82M5j40K20j56J24K2j76L2K27k90J18lq8K6L5J3J51j07j59
7252a60M4M2OR8J89j71m1p6K24r8n2K33j27k41K71o0j68Q4j6Oj00J29K4O8j99
7277i1J18KN4k59J83l9K4L4J14Q7k02o3J02q3K35j85r3R5q7J49K2Mk58J82j8p0
7303d3O9j13p2K42k31J47m2o5PJ98K7j21r4J17q3j09J85j06R0O0J45l04Q2jN5
7328D0m7r5j4K26o0o2r5J42j70J40k7M5J56k89L5J51j03Q2No9K1j05l8J72J7j16
7354e8k8J03j30P5j29L68N1k55J54j80J54k91n7K13M0l2O2k62K74J2j87K30o1
7377F6q1J04M6o4j27J2k3j2N9J57pj24r8J95o1Q7k16%P3n7k6J6km3K56j16p2J02
$$ y = [-32, 90, 57, 107, -53, -51, -132, 86, 88, 112, -27, 61, -116, -166, 4, -119, -90, 95, -28, 29, -128, -15, -20, 41, -40, -103, -20, -92, 14, 161, -236, -54, -9, -149, 71, -85, 39, 61, -115, -83, 144, -146, -28, -31, -119, -93, -58, -45, 106, -1, -160, -116, -74, -68, 30, 219, 48, 7, -69, 155, 57, 5, 238, 111, -130, 141, 81, -87, -3, -19, -13, -113, 16, 40, 108, -91, 27, 29, 83, -176, 7, -32, -8, 26, 140, 227, 25, -38, 64, -19, 216, 31, -62, 33, -54, 95, 117, 121, -137, 45, 27, -43, 26, -87, -159, 83, -148, -1, -43, -108, -101, 97, 124, 3, -91, 26, -57, -166, 19, -87, 3, 63, 208, -96, -14, -15, 40, -7, -102, -116, 110, 50, -12, -107, 35, -135, 5, -22, 23, 179, -110, -75, 76, -27, 55, 60, -9, 12, -93, -131, 41, 58, -58, -86, 17, -113, -38, -167, 201, 252, -3, 151, -29, 125, -166, -223, -10, 30, -2, 60, -202, 72, 84, -103, 127, 66, -15, 89, 135, 71, -56, -44, -67, -79, -20, 137, 130, 6, -92, 103, 42, 129, -87, -87, -14, -71, -97, -81, -83, -126, 130, 14, -58, 44]
7405D4Ln6j12K13j26RL5k65K30m4M9q1Q7mKj2j4P7j69P7Q1k6l5J40k11J97L1j88
7433f8k2R7Lm3J13r1M6J42j63O2L4p7O8j19l6p0J05Om0J9J83j97J49l86J30R2
7459f3L6J8o7j23J31oM4R6j43Q7p0kR3j30J44r8J88j27o1P1lR9M9k13o6N7J15
7486E6N6r0m2l8K3l4J08m6K45j37j31L4j03K79n2j25J40j66m8K09j59K0j43J02
7510d2n8J36N5j13J80l50L09kq5n6K01p8l9n4J13j08J6J25ok69J75J18k78J23
7534A3k53M02k06j23J14k2K25l31K18O3J1q2J09k36mj23J15K30K4j18j05O4j27
7557a42J96l7Q8r9J8l8R2j46l3K01j4j23K2P3j05K8knO5N5k7m6J87k95mR2j7l6
7585e2P3j63K56p9j1j09P1N6q7J9j08J45Kj07jJ0M4M3j19kK05o5Nj78L45p2j38
$$ y = [44, 47, -9, -121, 92, -34, -25, 10, -255, -25, -69, -20, -101, -14, -18, -16, -28, -42, 35, -134, -57, 24, -2, -37, 103, -108, 89, 120, -68, -90, 7, 10, -33, 80, -11, 35, 177, 14, 76, 110, 33, 101, -18, -54, -124, -19, -13, -53, -34, 149, -48, 101, -285, -155, -63, -27, -9, -76, -199, -68, -74, -30, 66, -77, 10, -60, -62, 31, -99, 45, -53, 135, 8, -53, 18, 15, 114, 163, -50, -116, -59, 56, 112, 22, -20, -58, -35, -69, 39, -7, 238, 101, -30, 4, -99, 180, 128, 3, 143, -23, -71, 138, -21, -1, -144, -42, -100, 36, 91, -22, 158, -192, 117, 115, 30, -26, 175, 97, 58, 4, 117, 9, 25, 150, 144, -125, 50, 168, -110, 13, -240, 162, -44, -167, -53, -75, 150, -181, 37, 100, 111, 29, 138, -98, -102, -225, -110, 120, 144, 26, -79, -15, -142, 54, 17, 105, 6, 24, -14, 78, -68, -101, 100, 86, -37, -15, 58, -47, -19, -21, -26, 39, 94, 67, 21, 208, -87, -91, 1, -16, -52, 21, -142, 114, 35, 24, -85, -14, 42, -45, -26, -134, 11, 13, -94, -95, -85, -41, 2, -117, -119, 86, 21, 26, -152, 193, 121, -17]
7612a7rl5J40j83l1J48M0l2j33q9J56J15n2R8k17J4K6P8J38o9m7k6L0o9j42R7
7638g1J30j09O5O4p5M0N1Lk03M7J28o5K03k36L5J34n5k18Q1J53r4J52j95QR1l8
7664B6j01J20L6J34k54R9j45J56j49Rj01O7O6O7q1R9J19m41K67N4q7K7j55L9K00
7689G1p7J7L4j53Q4O5M6j73l9J11l4M9J91k27M9k00L9K2J47j27n7N9K55M2k37
7714d3J15j77J87k01O2L1R7J7m2j00J10J25j11o2J95k39J24J8j49J4p0J59j37
7737g7p7J54O2O4k46L03j27j36rL2r6J25O9p8l9P5j36J09m8P0j20P2J07L6m7N
7763D7o0P8m8j0n2mN4q8Q6j30K07o7P3o5p3j06J52N7p2P8M9m3J59n2j83r5J55
7790D7o4R7N4k62J04k9K03n5j19N8jm8j8P1MJ21n6j50J07k16L09j74KM6j36R4
$$ y = [-17, -26, -61, 79, -104, -135, 13, 53, 21, -112, -201, -45, 70, 18, 116, -101, -87, -61, 17, 155, 86, 39, 13, 43, -26, -168, -71, 59, -50, 15, 79, 4, 44, 95, 98, -105, -58, 70, 5, 208, -28, 7, 141, 86, -132, -51, 102, 8, 160, -35, -27, 64, 26, -75, 45, 81, 215, -39, 60, -85, 71, -78, -69, -170, -103, -37, 30, -51, 48, 167, -274, -7, 47, -40, -13, -168, -129, 71, -6, 11, 45, -108, -24, 41, 87, -86, -125, -14, -48, 1, 192, -35, 14, -186, -147, -125, 22, -105, -162, -103, 152, 194, -43, 72, -105, 82, -119, -57, -26, 71, 88, 46, -54, 56, 181, 70, 8, 203, -36, 88, 106, -43, -29, -99, 60, -77, -154, 0, 62, 126, -120, 183, 56, -80, -89, -57, -153, -28, 41, -37, -76, -1, -137, -28, -76, -6, -126, -54, 53, 89, 42, 47, -13, 65, 17, 7, -45, -49, 5, -83, 3, -127, 80, 13, 86, 21, -52, -158, -6, 51, -21, 57, 106, 63, 222, 170, -13, -108, 47, -17, 80, 134, -128, -24, -53, 150, 95, -24, 34, 33, -15, -33, 38, 42, 163, 107, -43, 64, -152, 157, -17, -15, 31, -105, -11]
7816a1K1j1K04j27j71N6lO5M2nm9J5p9J21l9j15P7p2j18L0K15j02M3K4j4p0k6
7843i9j41K32j2pk9o5J80j71K53j43N1l4q3J55j37N0k0j18K95k29l7P2L2J59k6
7868A28j39m3KP0j99J39j41J78mj41M9m0J06K0Q6j69q1J31K4j22P9J19O5j73J74
7893A18j93J11m5P6q6J4O1l5poK23n6j08oj50J84j50K5j06J82l4J16k63K78j30
7918A3j4j33K17L3q6p5J02n0j31Q1N0r0J03k4nk3M%k59L03lN9j6j26K44k55O5
7945a6q3O0n9K43j3m7q9J57j66J33k48R3Ro4J16P2j41K49j01j41Q6k00K13oj84
7970a27K56o1j02n8J05p5M1J8j22J36j64K10n3%p0Rj8J44o5Q5L2O2k79J24J5j33
7996i0J94j55k4R7k02J49j02K14K1P2j90k5PJ77j56K9J9n4Jk2jM3j5j6j17K55
$$ y = [-11, 10, -1, 203, 76, -95, -39, -42, 23, 65, 60, 11, 26, -53, 68, 29, -86, -9, -81, -199, -169, 46, -56, -13, 11, -3, -73, -99, -240, -8, -20, -27, -56, -121, 59, -112, 141, -2, 49, 15, -68, 87, -50, 0, -20, -138, 157, -72, -109, -37, -5, 154, 128, -11, -54, -52, 18, -181, -42, -183, -5, -9, -150, -101, -141, -35, -15, 71, -98, -179, -48, -24, -146, -67, 52, 117, -56, 118, -75, 36, -9, 67, -19, -5, 56, 21, 14, 8, 231, 175, 67, 61, -89, 95, -55, -30, -136, 46, 12, 128, -135, 143, 13, -1, -134, 83, 116, 30, -45, 57, 7, -124, -43, 7, -83, 20, -4, -9, -32, -28, -28, -287, 16, 13, 72, 56, -70, 174, -81, -16, -99, -39, -98, 145, 132, 85, -4, 153, -13, 120, -128, -35, -26, -90, 26, 98, -43, 206, 105, -36, 50, -150, 63, 57, -127, 129, 68, -34, -92, 13, -62, -21, -3, -125, 11, -153, 57, 4, 4, -66, -57, -75, 69, 4, 89, 121, 183, -96, 28, 43, -90, 104, -51, -75, 22, -180, -31, -133, 81, 102, 174, -16, -41, -34, 143, -13, 16, 35, -19, -18, -40, -41, 2, -13, -29, -146, 109]
8022A09r2R1j21p0K33k88Q6L8k3J31j27M1l3Q7j28K08K0l06K58j59Q4q5K8M0j49
8047a27pN4N6K6r2MJ80k82K37P6j33l2J3Q4k8k3L2j0nn0M3j16N3Q4O7o6j14Qj17
8076a85J38J68j56R3O0q7j7Ol5J7OJ31j46J20p4o4J9o5j62J83J04j76Q6j7m3K62
8102A66k20P7m6j23K36r3J0n6j45K46k18J73N5j24k3O8J05p0O7o9j05J68j35J06
8126E0o2Ln9O2q1J08P8k92J71J49j60R3j16M7J38j23j28J10J19J18j84m7m0J2
8150c4O5o4K30p2P6k33JK4N4n7q8J66j92o3J82J28p5m3R9j18J16j24J7m7P2J17
8176A37q0l8l0q8M0JJ4l5n1J68j23O8j3Q5k53
$$ y = [109, 17, 108, -13, -83, 150, -138, -52, -14, -37, 94, -33, 8, -25, 62, -66, 142, 162, -144, 114, -45, 39, -46, -18, 22, -127, -134, -80, -24, 2, -90, -86, 94, -188, 49, 125, -8, -40, -27, 57, 29, 6, 38, 28, 23, -27, 16, -100, -47, 37, 104, 38, -76, -68, -185, -47, 121, -35, 58, 118, 31, 14, 20, -15, 2, 8, 139, -7, 113, 39, -25, -6, -71, -233, -50, 54, -122, -36, -53, -96, 166, -54, 23, -23, -146, 90, -3, 7, -49, -194, 52, -166, 7, 62, -62, -85, -17, 88, 18, 85, 16, -89, 79, -56, 50, -12, -9, -68, -6, -87, 21, 99, -193, -22, 127, -33, 60, -56, -9, 129, 6, -122, -12, 107, 225, 41, -6, -46, -34, 31, -33, 197, 125, 201, -32, -31, -7, 47, -10, -98, 68, -124, -187, -5, 123, 48, 5, 104, -14, 102, -22, -5, -52, 20, 137, 57, 19, -11, -99, -59, -58, -44, -79, -130, 38, -85, -17, -30, 55, -198]
8191a98
$$ Imaginary data points
##PAGE= N=2
##DATA TABLE= (X++(I..I)), XYDATA
0@%%%%%%%%%%%%Qj6J6j6J6k4L2l2M0n1N9p2Q8j04J20j36J52j76K06k33K64l01
34a60L39l82M30m83N41o03O73p50Q31r19J020j129J244j372J513j667J836k022
52a060K228k457K713l001L329l702M130m635N235n962O866q026R580j1776J5133
67H595k0959L3896j15995O5381J92773j80776p5084J14273K1423j00284P7097
78B0340O3102j21874n5451J52158K6054j30181l591J00796l3761n1301M9984M2
90A6317p2671N2840Q5198p4031q3969P5077M6065p0302k277O4136m5600n4514
102f3731Q0999N2668q4742k9007P0239j0931n6944N1133M2619p7824k6558R0134
114C8055K903r1074J9519Q3406l6919o4479N1524M4163n4353j6863N2516j3231
$$ y = [0, 0, 0, 0, 0, 0, 0, 0, 0, 0, 0, 0, 0, 8, -8, 8, -8, 8, -16, 16, -16, 24, -27, 32, -40, 48, -56, 64, -72, 80, -96, 110, -123, 141, -160, 179, -203, 227, -256, 285, -318, 355, -395, 436, -483, 537, -592, 652, -720, 793, -874, 962, -1060, 1168, -1289, 1424, -1577, 1752, -1950, 2180, -2455, 2780, -3182, 3684, -4342, 5238, -6538, 8595, -12364, 21532, -94463, -29082, 163691, -17085, -92169, 22104, 43527, -56757, 20340, 83442, -38432, -93883, 58275, 84329, -45852, -49443, 51353, 17592, -33709, 16275, 16317, -56354, -3514, 81684, 7653, -76316, -1239, 44826, -25476, -27753, 36383, -9217, -63731, 17268, 69936, -14806, -43813, 26426, 15495, -41449, 9684, 52303, -25521, -52079, 38055, 40958, -50116, -30597, 52809, 15890, -48589, 2935, 47098, -7255, -24118, 28398, 15167]
126A5167n6506K5477M9365k7630l0746K7790R931k6104O326J8429j6854o534K1237
139I348j1128k2430L2862K7775m4550l0982M4936K5284l5656n625L1331j3878
151G287k7632K8874J9497m3731j5549M6816M965m7286O617M5219j3687l5050K1412
164b248J7353k9778Q55M0538j2786m3498K1838L8339k9001k7789L4873J3613l9079
177a6770nL9186r792l1039J7045J5108k8127p97L4753j0420l3203K1928K6762
190B4629k8941j4444L4232n15l5312J4501K9865k7554k0284L7585O525m5597M340
203b0970M5254j4644l5732K6388K3924l3757q613L7954o382l6206J9218K8776
215B5210k9525j6787L7614L437m0020P648L3583j9543k3427K8111J0362l3894
$$ y = [15167, -41339, -15862, 33503, 5873, -24873, 2917, 12848, -13256, -6930, 11499, -5355, -11889, 9348, -1780, -24210, 8652, 36427, -8123, -39105, 5831, 31115, -4541, -10166, 21165, 7287, -20345, 8529, 28026, -15705, -31254, 15562, 20527, -26759, -20142, 25077, 11390, -23660, -2248, 15105, -14673, -13818, 26720, 13934, -29564, -7726, 30613, 1612, -26177, 8696, 22309, -16770, -16775, 22411, 12619, -18420, -1375, 13733, -14394, -15191, 19562, 9142, -24061, -2133, 24629, -4312, -18756, 15476, 14961, -20351, -5850, 24015, -3539, -23823, 13762, 20287, -25310, -20970, 24284, 9640, -26092, 296, 24220, -9537, -18150, 19804, 13422, -22784, -3566, 25210, -4315, -21102, 16512, 19949, -20071, -12423, 21160, 1617, -21810, 6301, 16663, -17231]
227a7231L144L3599j5725k7358K5927J7881l1522l606L4753p820l1167J9129K1707
240B1711k8477j0586L2174k909l2408J5165K7085k6375j8491L3018P836l4542
252a6799L487L1881j3513k3082K3083J1937k9600k78L2215r905k9578J8056K2361
265B0265k3503j2678K4838q8k4362J1278K0120k0510j3069K6636N389k7268L988
278h964K4808j2070j7740J9580R094k4263K70K4599r731k2890J6735J5744k2074
291f902p555K4709j597k3883J0299K0188j6863j3713K2078N971k2896L157K1899
304A4892j1467j7161J7396J0716k1396l616K1335m504j9240J0946J3512j6514
316e101o851J9328k10j9078Q072J6789j3125j1360J7317N084j8584K163J7429
$$ y = [-17231, -14087, 19512, 3787, -23571, 2356, 20237, -11285, -14891, 19862, 12042, -19125, 4, 21711, -6766, -17352, 14822, 11913, -20495, -5330, 21755, -4620, -23111, 9907, 17743, -16799, -13312, 18569, 5056, -18026, 5057, 16994, -12606, -12884, 19331, 9426, -20152, -2096, 20265, -3238, -15916, 8922, 8834, -15528, -4250, 15870, -4640, -17709, 8927, 14316, -12952, -8964, 15844, 3774, -13966, 5614, 14708, -9555, -9285, 15314, 5583, -17307, -572, 15172, -6902, -14457, 10252, 8655, -15228, -4929, 15259, -1604, -15317, 6761, 12732, -10164, -7007, 14892, 3425, -13736, 3660, 14376, -7020, -10636, 10699, 6195, -13045, -2099, 11413, -5101, -11952, 7376, 7166, -11912, -3840, 12949, -176, -11536, 5781, 10865, -7719, -5556, 11873]
329A1873r279j4043J4007Q890j8409k662J8816m511j7261J0337J3392j4788p652
342a1290J8061J411j7659N293J6207j0884j1524J5178N994j7625K29J6978o971
355C398j4485J1119R581j4790m083J6105k313j4923Q278J2360j2383p297J5459
368F026K032j5413M044J3610r260j0079J2953N121j5570J03J4625n728j2466J0083
382H1Q102j3495l257J5439j869j4469P098J2151j0194p367J2891J829j3512M020
396b552J2417r197j0256J1994N922j3681j561J2868m135j0497R211P160j2709
409e016k714J4639r44j3551N277J0902q310o258J0577J035j2171L734J1366q051
423E15r540J0208N525j1571o64J1176m638r228R150P064j1313l472J2877l98j1586
$$ y = [11873, 2594, -11449, 2558, 11448, -6961, -9623, 9193, 4682, -12579, -2242, 11150, -3638, -11290, 6771, 8182, -9477, -4184, 12023, 1139, -10385, 4793, 10787, -6838, -6609, 10369, 3398, -11087, 32, 9613, -5177, -9260, 6845, 4532, -10391, -2113, 10247, -2136, -9433, 6026, 8058, -7355, -3311, 10299, 1039, -9040, 3913, 9034, -6536, -6433, 8192, 2464, -10002, 81, 8183, -5312, -8569, 6870, 5001, -9468, -2370, 9781, -413, -7780, 5111, 6940, -6572, -2552, 9865, 668, -9588, 2406, 8328, -5353, -6914, 5954, 1819, -8678, 533, 7693, -5016, -7730, 6909, 5965, -7586, -2309, 8593, 283, -5975, 4602, 5637, -6534, -2800, 8566, 515, -9025, 1183, 6708, -4863, -5527, 5649, 1011, -8217, 933, 7997, -3316, -6788, 6089, 5691, -5895]
438e895M406R474q293o196J0264J929j1257J484R959n294p509Q123L208r809R55
453d451J0968m147r790P416P430r052l047R940j286j0224N522R178q189p819Q997
468A446L851r136J92P300m305m903P565K888r499K89R979k679p710N119M849p507
484b261p56R542l390j0793N096J0237o581p912O535L404o403J520O272n546n501
499f537Q594M216q940j522Q475j332o056M602K772p971J25J0325k908j1914M049
514d022J0697m895p471M652L236m992J632N885n030n180P168L923p471j264O782
529C650j672n063M352K314p425J52R421l115j0570M852R519n308p140O212L487
544C666o796Q52P127l149o274N333M674o505j863O251j409n709L624L783o028
$$ y = [-5895, -1489, 7985, -308, -6504, 3760, 5689, -5568, -4084, 5875, 581, -6928, 1195, 4403, -5406, -4451, 6517, 2370, -7420, -4, 7426, -1626, -4673, 5267, 3981, -6243, -721, 8457, 268, -7551, 1446, 5297, -3839, -3647, 3653, -652, -5555, 2010, 4898, -4601, -4312, 5667, 2988, -4722, 397, 5246, -2261, -3017, 6525, 3135, -7658, -2562, 7675, 1094, -6818, -283, 3121, -3282, -1762, 4510, -1036, -6537, 2057, 6273, -2667, -4189, 4286, 2954, -3102, 1500, 4272, -3699, -3574, 6751, 3843, -8071, -4022, 6675, 1780, -5691, -1039, 2197, -2795, -1163, 4722, -308, -5488, 1680, 5603, -1868, -3132, 3650, 1978, -3085, 1267, 3581, -3844, -3692, 5729, 2614, -7956, -3104, 6415, 1107, -6033, 179, 3666, -3130, -2278, 4849, 1700, -4574, 759, 5433, -1072, -2935, 3316, 1907, -3802, -178, 3605, -2423]
559b423j945P931p37q607K398Q069l653n487N649K544o447O55O900k520o245L692
575b26L875m783j026N264k356n047M463L180o203j301P673q63q215L533P766m723
591A011n500O072K730o685K40O456k574n544M340L191n943j318N851o66m933K107
607a165K937l735M84N394k943o123M517O656n365m478N100K024m854Q53L873l799
623f24l099N334J718o566m22O276j280m789L015K514m426N14O336k222o509L228
639a002N900m262l654M536J110n257J031N348l116m922L746L273m120j038M201
654A774j374l226L695K194m840q86N779m99m809J547L399l112j671M289m78n900
670d118J956N981l105m392L295K476l826J26M368j994l802L506L359m511j697
$$ y = [-2423, -4368, 3563, 2826, -5781, -3383, 4686, 1033, -4454, 1195, 3739, -2708, -2053, 4847, 2327, -3918, -226, 3649, -1134, -2160, 3104, 748, -4299, 164, 3344, -2859, -4160, 3513, 2650, -5565, -2032, 5734, 1011, -4489, 1583, 4313, -2372, -2132, 4324, 1750, -3794, 546, 3737, -2206, -3524, 2327, 1661, -3272, -1165, 1772, -1963, -1479, 3915, 972, -5151, -634, 6022, 657, -3821, 1279, 3303, -1551, -698, 3175, -624, -3723, 1611, 3329, -3237, -3659, 2617, 1337, -3452, -437, 2077, -2349, -1835, 4501, 2279, -4230, -1002, 4898, 636, -3018, 1518, 2628, -2629, -1598, 3750, 634, -4288, -542, 2731, -1389, -2427, 1774, 400, -2826, 869, 3063, -1777, -2663, 3116, 2617, -2192, -645, 2754, -358, -2029, 2260, 1782, -4118, -2162, 3819, 714, -3678, -383, 2093, -1733, -1607, 2761, 767, -3035, 471, 3830, -681, -2378]
685b378M791l19m408J894L558l965k289M590O66m666M69M005j999k312L382R45
701A964m152O63M732j748m004K523K961l525p89L719j383l706K460L196l953k459
717c501M639R40m466P38L742j915k536L471J242l872K62M152j679l554K801K317
733B781l551j436L874m34l538J467L020l147j744M191N17m537J313L930k102k766
749b162L083J467l593J16L733j859l580L141K263l778j396L957m15l737K139K894
765B273l160j646L746Q78l901Q50L703k242k474L229J287l977j87L919j226l721
781b649K358K288l235r13L303n08l301K115L128k937k133L874P96l546N63L223
797B426j956k639L198J355l979j41L676j406l404K504K530l345j050L740k89l454
$$ y = [-2378, 2413, 2094, -2314, -420, 3138, -827, -3116, 1474, 2140, -2526, -2057, 1948, -51, -2363, 1019, 1964, -2188, -1525, 3207, 1459, -2545, -22, 2939, -586, -1375, 2344, 961, -2745, -285, 2911, -1042, -3501, 1138, 2078, -2388, -1650, 2092, 177, -2359, 1112, 2354, -1518, -1256, 2896, 1217, -2337, 464, 2781, -770, -2206, 1668, 1234, -2304, -837, 2183, -964, -2708, 1483, 2000, -2537, -1224, 2706, 604, -2162, 921, 2388, -1205, -1089, 2644, 785, -2795, 346, 2609, -1169, -2565, 1392, 977, -2760, -621, 2273, -887, -2533, 1213, 2091, -1810, -960, 2743, 501, -1973, 1256, 2543, -1434, -1621, 2298, 1072, -2649, -291, 1997, -1238, -2151, 1152, 644, -2657, -542, 2586, -351, -2484, 1390, 2186, -1360, -797, 2426, 470, -2169, 1029, 2384, -1595, -1736, 1940, 534, -2870, -366, 2164, -1181, -2231, 1509, 1220, -2234]
813b234J773L131k768j952L599P55m009P64L413k040k886K944J395l356l45L454
829A638j163l208K401K541l166j072L675Q8l493J468K998k610k034L323P73l648
845a489K80L098j904k486K928J533l484o54L643p74k989K156K264k872j013L550
861A787k54l367J510K810k370k027K712R06l442N78K685j534k349K668J558l246
877a375n17L573o98k887J839K427k705j247L265m9l164R02K659k130k086K850
893F57O94l001J61L112j377k486K241J849k927m93L224m58k799J536K385k383
909f5j620K919N30l087M25K738k017j906K629R29l188Q8L390j217k796K532J656
926A940k734o07L258m21l245J490K514k070j989K643M58k754O43K379j533k359
$$ y = [-2234, -461, 2670, -98, -2050, 1549, 2304, -1705, -941, 2472, 432, -2454, 490, 1885, -1471, -1816, 1638, 475, -2733, -332, 2209, -957, -2029, 1646, 1734, -1759, -291, 2707, 97, -1937, 1386, 2159, -1489, -1209, 1889, -15, -2501, 427, 1960, -1524, -2178, 1465, 691, -2298, -142, 2122, -750, -1763, 1787, 1533, -1834, -324, 2486, 116, -1911, 801, 1707, -1735, -1157, 1528, -6, -2355, 313, 1871, -1375, -1892, 1681, 983, -1904, -65, 2362, -343, -1590, 1675, 1626, -1538, -636, 2023, -107, -2193, 657, 1351, -1650, -1489, 1623, 246, -2240, 1, 1850, -1077, -1570, 1654, 1196, -1603, -67, 2318, -65, -1685, 1234, 1764, -1323, -898, 1840, -177, -2083, 546, 1475, -1713, -1625, 1765, 548, -2248, 284, 1940, -794, -1401, 1857, 1436, -1809, -319, 2195, 125, -1864, 779, 1237, -1517, -874, 1505, -28, -2387]
942b387K842J235l176J32K787p54k197K207J357k845o23L438m31l421J143K748
958B055k289j672K593L54k611O12K526j687k075K534J370k676j08K704j228j938
974a536K067J622k863r45L242k37l065Q49K499j993j509K301P78k556L15K471
990A440j106j585J567J183k043j89K268p20k214J866J153k206j099K754j01k786
1006a818R97K318j821j594K409R04k586J03K316n85j860J564J062k036l92K478
1022A459o45k335J503J445j997r91K515j88k547P59K625j650j724K173R97j917
1038e18k85K121p11j669J557J248k172n26K171n58j912J032J356j911o32K067
1054F58O0k283P37K390j299j815J876J005j834%J832o58j875J265J395j783r32
$$ y = [-2387, 455, 1690, -1486, -1354, 1433, 679, -1518, 689, 2046, -799, -1422, 2016, 1585, -1836, -693, 2055, -234, -1906, 687, 1041, -1570, -958, 1568, -119, -2194, 340, 1710, -966, -1074, 1630, 402, -1536, 531, 2153, -710, -1655, 1587, 1350, -1715, -866, 1633, -360, -1869, 432, 1210, -1346, -1031, 1440, 334, -1251, 316, 1499, -544, -733, 1535, 815, -1399, 467, 1620, -586, -1685, 1069, 968, -1818, -821, 1497, -324, -1918, 491, 1395, -1191, -1088, 1228, 643, -1217, 347, 1409, -627, -1019, 1459, 814, -1521, -18, 1427, -570, -1561, 954, 766, -1781, -1022, 1603, -47, -1771, 402, 1399, -518, -803, 1318, 607, -1062, 495, 1743, -429, -955, 1216, 658, -1254, -222, 1134, -777, -1409, 658, 718, -1565, -828, 1562, 263, -1552, 324, 1329, -505, -505, 1327, 669, -1206, 59, 1454, -329, -1261]
1071a261J903p2j892R89J322j503q85K123J73k037L69K197j102j336J464R59k026
1088f15j24J967n99j715P56J493j650n78J492L9j750Q03J686j337j206K270K38
1105A170j897J97K108j102j717J675R84j945n06K085m58j887Q44J580j506q32
1121a207J602M77k102P51J776j406r02J754N93k206K10K038j053j236J387N70
1137A046j861k35J862n10j607R32J282j321n87J573J55j697P61J473j154q48J538
1154H02K35j785K04J580p82j430J223Q46j687l11J731j97j557Q06J317j349m43
1171g97J539O1j557L59J682j124q75J209L24j242l98J613o52j297J034R93j405
1188e33m57J528k42j163O44J373j227p62J514L03j557K51J401q87p76Q47N07j440
$$ y = [-1261, 642, 570, -1322, -333, 989, -514, -1399, 724, 897, -1140, -771, 1426, 324, -1012, 452, 1411, -615, -739, 1228, 629, -1086, -330, 1163, -487, -1065, 427, 466, -1284, -481, 1205, -132, -1338, 932, 1170, -727, -530, 1578, 476, -1241, 434, 1418, -527, -1033, 1052, 594, -1293, -449, 1131, -375, -1207, 395, 872, -1230, -479, 1297, -109, -1011, 743, 1336, -870, -660, 1378, 325, -911, 476, 1046, -815, -1050, 812, 302, -1305, -373, 909, -412, -999, 574, 729, -968, -207, 1266, 112, -736, 802, 1037, -748, -544, 1036, 254, -1176, 47, 893, -794, -1105, 626, 429, -1128, -322, 995, -354, -797, 742, 803, -754, -395, 1287, 163, -712, 497, 821, -421, -819, 794, 142, -1155, -121, 872, -533, -990, 538, 296, -867, -223, 1150, -77, -839, 675, 978, -579, -328, 1073, 186, -590, 257, 764, -676]
1206f76r4J457o30j317J039J157j329l13J333nj555Q82J208j117p22J139M18j330
1224d55J14J287q19j082J284K92j429n5J458n31j092J048P91j106l84J380pj360
1242f66O41Q85o41q14R71Q2j055Q1J195q09r54J041O21j088L2J190o22p96P60
1261E4R90j117m98J089K21j294L47R05n43p73Q46L82j471J93J250n90q09R16N19
1280F17j283K09Q11J58j084M86J016r24l06O79K94j329L97Q60p78p01J122J3j095
1299h38K81J000l35q32R34L81r06m3J217k14j356Q14N78o28n81R19J27j120K58
1318c44Q46o12o24P62M38r46r0R11o9o58L20Q26j130j5R05r3j123O40N73o98l45
1339e26O88R6q74L41P03m53p26Q19M36p95J48Q35k75q77M75O12p31l89R24k04
$$ y = [-676, -770, 687, 57, -1260, -221, 936, -393, -706, 627, 622, -933, -51, 1157, 40, -682, 457, 875, -455, -341, 946, 127, -955, 329, 621, -808, -863, 595, 64, -1028, 20, 811, -295, -679, 701, 694, -666, -25, 860, 219, -595, 376, 458, -597, -516, 679, -130, -1084, -43, 578, -510, -478, 712, 90, -706, 54, 1044, -73, -571, 518, 739, -555, -208, 697, 154, -619, 227, 609, -862, -669, 581, -9, -818, 98, 617, -666, -457, 354, 512, -572, -86, 930, 6, -300, 379, 673, -656, -259, 601, -177, -878, 244, 257, -838, -557, 443, 108, -724, 210, 591, -315, -358, 859, 645, -711, 103, 681, 53, -528, 391, 518, -602, -344, 502, -110, -734, 28, 466, -480, -570, 341, 272, -386, -66, 760, -370, -385, 520, 427, -696, -56, 517, -181, -526, 162, 258, -616, -275, 428, -25, -751, 68, 504, -291, -143, 692, 417, -460, 15, 627, -104, -493, 431, 227]
1359B27r24N40O82o94n56Q20L68j000K46P23n01o27R15L92q72l2J008l09p27N40
1379B19L34r05k14Q81j87n90J46P23o73l44P64K23r45M91N99k75n96O72L13q03
1399a67m4Q50l43p41N43L20o31k20O80o2o04L02L63m12l39O74K11o74J26O75m62
1420D5k01L12M60r31o3J007m44o82L40P32q34j24M97j56m93M07M24l12m47O15
1440A52L42o96J53M89k85n07L88M07n75j45M45j02n28L01L13m06k12M09M54q39
1460d42K60P33j34n74M76Qo14K05O07l77o00M42L03n03j07N04O7q63L08O96n17
1481a22l73O24L40o86K54L53l74k70M11J15m72J55L67l81k78M11J94o04J4N30
1501B08p3n75N03J43l01n3N55j96m15K91M01m64k41M91O5n24K5M25l53l25K49
$$ y = [227, -697, -157, 525, -169, -725, 95, 463, -537, -291, 432, -69, -696, 219, 611, -261, -293, 715, 406, -321, 219, 553, -352, -566, 315, 128, -462, -316, 407, -266, -610, 154, 377, -568, -77, 522, 247, -349, 323, 636, -167, -211, 639, 296, -445, 98, 418, -213, -433, 247, 185, -419, -117, 246, -166, -505, 169, 380, -294, -168, 507, 45, -156, 156, 616, -315, -378, 629, 185, -497, -157, 575, -259, -383, 114, -42, -535, -128, 296, -16, -463, 152, 494, -202, -49, 440, 155, -352, 36, 443, -132, -277, 168, 66, -462, -161, 152, -254, -466, -57, 397, -442, -182, 551, 417, -157, 319, 327, -287, -82, 525, 148, -452, -10, 293, -210, -317, 187, 254, -609, -301, 395, -122, -495, 129, 469, -217, 37, 390, 16, -254, 157, 272, -200, -45, 322, -59, -337, 74, 268, -336, -322, 208, 135, -440, 63, 206, -95, -148, 407, 211, -204, 87, 488, 24, -217, 274, 339, -185, -160, 265, -88, -413, -164]
1522a64N09n68k61O19q0l25R4N23m15j23M81O3o42p3P65l15k75K91l0k06j33N52
1544B87l39l82K73M14l64j36O72l16m10L88M17m08l73O47p2n76P3N04l99k65M28
1565F3J31n57K67K50j64m23O50R6n54J10K62N7m35L50K38l07l80M48J01n26R4
1586b29J81n8j20J26J50k02M4L06j49l55N18ok54P3L04o0l55M3J98l25PK33N0
1609A20o20K05M24k32k97L67K10l51J45K38j29r5J75K77n80q5P00j90n33J39K60
1630A48m56k2M94O0o98K18L45j21j33L67K3m49n6N07J07n21M28Q5k25k22L08N1
1652B38o71L22K00m55j11M28K74n62K73L81k59j32K92J24m25J28K47j22m72M90
1672A88M9o00J68L60k11j67P6K23k39j87M71P6m38K25K08k14j84L81L2k66j77
$$ y = [-164, 345, -223, -484, 135, 55, -270, -176, 347, -68, -191, 290, 353, -289, -362, 403, 88, -187, 104, 74, -132, -265, 287, -52, -434, -161, 253, -111, -247, 425, 109, -301, 87, 504, 96, -277, 370, 298, -278, -205, 299, -100, -365, 63, 194, -363, -96, 154, -10, -433, 217, 313, -241, -131, 131, 188, -247, 103, 341, 34, -346, 102, 203, -323, -229, -48, -106, -226, -100, 50, -152, -108, 198, 49, -306, 212, 206, -48, 25, 329, 269, -86, -43, 155, -170, -163, 70, 120, -500, -295, 129, -103, -400, -33, 177, -174, -29, 209, 80, -15, 160, 437, -143, -228, 472, 282, -251, -112, 148, -308, -330, 164, 224, -474, -256, 89, -32, -165, 202, 225, -224, -280, 227, 334, -187, 241, 326, 101, -121, 187, 238, -433, -111, 89, -366, -477, -49, 225, -337, -64, 317, 58, -74, 218, 342, -83, 45, 292, 170, -302, 188, 237, -363, -195, 165, -46, -213, -137, 86, -153, -340, 131, 207, -231, -6, 202, -12, -196, 185, 217, -49, -226]
1693b26O17k79n51M46J06m73k7N74k05l19K95L02k82j99M29J4l92O5M51k59l28
1714b41M65j12k57J35K87l67j63K72K41l13j50L07q6l22K58L69l56j23M98j05
1734B37l78K33O3j69k56M02J03n84K20K82k76j11J93Q0k15J5M15j75j54J03J73
1755B01j57j17M01j72l15Q6K84k26j25K06p6m21L00J95j62l31O79k11K5j31K97
1776B30o5k11J34K84l64o5K62q0j98K0J83j27k65J78J45q4j24K54j25j90K22O7
1798H1k6p9R4J05l46L95l1j74k01M01j36k95k7L56k54M8Q5J23k49J58Q5k2q6M7
1822E2K48n05J60K67q7l11K98oj68k21M10m4m30J65L18l08OJ12K80l06J36OK9
1845A01l62K21L67m12o0M49k19k27Q7J80k18o2O1J15k49L32J14j66k89K14J50
$$ y = [-226, 391, 112, -439, 7, 113, -360, -387, 187, -18, -337, -42, 260, -22, -221, 208, 222, -170, -105, 346, 87, -241, 224, 112, -145, -10, 277, -90, -253, 19, 260, -53, -203, 104, 18, -304, -46, 323, -33, -156, 342, 237, -141, 92, 155, -14, -270, 132, 235, -349, -129, 153, -123, -234, -41, 39, -176, -161, 254, 79, -75, 28, 201, 44, -73, 328, 156, -159, -73, 211, -15, -140, 66, -10, -431, -131, 64, -98, -429, 250, 39, 64, -67, 230, 165, -46, 88, 372, 8, -57, 205, 125, -73, -53, 130, 3, -262, -84, 61, -23, -147, 107, -18, -208, 14, 81, 55, -24, 70, 175, -171, 224, 193, 19, -182, 219, 83, -212, -239, 117, -137, -89, -4, 119, -130, 28, 113, 91, 5, 52, 300, -205, -45, 222, 135, -176, 122, 116, -52, -273, 137, 93, -337, -172, 146, -162, -156, -44, 236, -70, 66, 72, 101, -261, -40, 327, -85, -145, 304, 85, -142, -55, 125, -93, -155, -94, 21, -228, 104, 218, 52, -237, -23, 127]
1866A27k54J37K94j54j35k3J97l39M8L22k48l17J94J63j17q0J75Q1j53N4K50k90
1888f8j73L84R4j56o6P5n7k18K92J38l83K8K51j5m53J94J40j97Q7K40j61l09J70
1911a63O09n07J27m7J50j79m3K42j01r2rJ19k63J51J53J2n73J80L01JM9q6R9j21
1935Io2K45l8k64N1J30j75O2K48k7m06Q4J40k58K26R1Q2k48n5L32q8k65M17L2
1959B63k43m9K99k47j06K57j4l10P3O6K1k15J71Q1r8j46L10Q6k77K15P6j41p7
1982eN5M0k28L6R1p9r2J36J52l11nR6K34k57K3R2m7L6L09p3k29J4L71k24j38J02
2008I9j55J9j19K89j00j21L9N9j61L0K33qj01m5J43J24l03J42J75l22j73K90k39
2031b05J30L1K12j94k71K71K8j73N6L02k07j32L36L4k08j6L45j97l37L19r9m5
$$ y = [127, -127, 10, 304, 150, 15, -8, 189, -150, -102, 220, -28, -345, -151, 12, -105, -185, -10, 71, -82, -28, 222, -68, -241, 143, 237, 81, 15, 90, 33, -185, 107, 245, -138, -110, 141, 126, -327, -133, 7, -190, -103, 137, -24, -333, -163, 446, -61, 66, 19, 169, -10, -53, 189, 88, -4, -13, 106, -157, -6, 147, 159, -414, -234, 67, 68, 117, 31, 130, 9, -53, 192, 154, -110, -59, 71, -104, -42, 206, 179, -227, -143, -3, -261, -35, 56, 138, -110, -165, 167, 79, -186, 231, 263, 20, -29, 270, 23, -83, 174, 160, -150, -77, -11, 10, -205, -34, 47, -51, -197, 113, 199, -78, 137, 213, 72, -5, 50, 90, -138, -102, -11, -90, -182, -46, 106, -205, -210, -114, 120, -137, -114, -22, -69, -33, 276, 203, -26, -12, 359, 135, -3, 99, -56, -37, -156, 133, 33, -88, -49, 10, -151, -121, 112, 104, 3, -42, 101, 225, -78, 64, 239, -83, -256, 34, -205, -75, -44, 168, -26, -297, -26, 2, -171, -115, 187, -20, -152, 184, 218, 10, -6, 339, 142, -195, 124, 25, -20]
2053b0p5l3Q6j26O7K45k34J6J10O4l31M05J22l10k7K85j83j11p9L58k70l6J35
2076E8o8k49J14L53k60j42K01J44j74l2M3or1K48m7m8R5k7p9M0j28J92k06q1K30
2101H0p9k40J52L1O5n6q8K46j96P9R5nj5K19k03k5j23M8j06N3K22j04j81n6J15
2126g2J7k9J16P8j72l2Q6m8J02M9K1n4r5J5K00k09K0J27j53j67L08k1j77k13L96
2151I3r5k76K26L23k58P0J3J04j45Q9l3rk14L9K09k37o5J90k27k2L6J39Q3j31
2175i8P3J69k38K38J21P1j53k21J62k09q2K63q0j05j36J88M2ml5N4Q0j25r5J26
2199FN4o7p4l9Q6L2L5j6J56l5o2j40K26k24k35K84n4MM0r5J32k61K87J96k97p
2225f8J39M0j75J17M3j03j95J40J34k02M9J83j68j4jJ89l5k00J69J3j01J11J3
$$ y = [-20, -95, -128, -42, -168, -101, 144, -90, -74, 36, 100, -231, 174, 296, -14, -41, 244, 61, -50, -129, 229, -41, -77, 58, -10, -259, -145, 208, -52, -194, 7, 151, -23, -55, -12, -18, -109, 139, 92, 44, 139, 112, 33, 73, -55, 137, -69, -150, 80, 1, -239, -87, -56, 9, -47, -135, 111, -85, -6, 89, 84, 69, 288, 85, 60, -63, -15, -121, -68, 154, 50, -131, -187, -72, -55, -84, 32, 110, -62, -94, -8, -56, 46, 95, 116, 62, -33, -18, 182, -27, -7, 120, -33, -200, 108, 87, -90, -303, 93, -2, -278, -52, 271, 13, 83, 96, 200, 55, 144, 111, 102, -112, -73, 136, -101, -166, 24, -203, -225, -189, -50, 33, -98, -25, 144, -94, 144, 265, 336, 183, -38, 124, -85, -167, 96, 16, -89, -225, -37, 5, 1, -34, 20, 100, -25, -120, 6, 60, -7, -81, -120, -34, -2, 33, 17, 173, 138, 76, -64, 162, -62, -297, -13, -67, -63, -23, -118, 14, -247, 40, 236, -61, -68, 71, 111, -64, 53, 96, -7, -202, -62, 72, -130, -81, 102, -66, -80, -81, 108, 73, -127, 42, 55, -46, 65, 78]
2248G8p5n9J67J6k03N1N7K5k61J13R2p8n3NK09r1m5K20r2j93J43R7k45K04R0j97
2274b5K9J4O2k39k4J35lj10Q1M7q6q1K23o3J37j35J74L6l69J89J83j31j25N0p4
2299a05j13J92J10j22p9J33j46K12j51J87q0j05oJ22N6j77P2P7j21O5J02k12K15
2322A26r7j08j30K40P5k77J3K35j9j33j7J27K3K0J03o4q1j38K89j19j05J54P7
2345A94j55k18K73j58k19K93Pj46J83m2J76j92o6J61n4q2J08l8N6j31No2J01J32
2369A26j81k16J54J48j25P6o9J66j41pJ33j53P2j2J07l3PJ5R3j59n8J75l10j03
2393b95L68n5J15k59K33l0Oj26k4K28j91L74j08k76l9J15o4%k1R6L1n1j73L2N3
2418f1K1q7R9n6J15N5j11Jo9J26k4J94j3k75L1O5n6j33K67k9r9K5kl2R6p8n5N4
$$ y = [78, 3, -56, 111, 127, -76, -25, 32, 57, -204, -91, 1, -77, -130, -125, 84, -7, -52, 168, 76, -117, 26, 123, -122, 82, 172, -25, 4, 18, 80, -159, -183, -48, -51, -161, -80, -33, -119, -200, 23, -40, 97, -38, 136, 172, -197, -8, 175, 44, -81, -31, -105, -218, -26, 84, -38, -117, 16, -130, 82, -69, 118, 38, -67, -73, 49, 105, -72, 0, 77, -44, 21, 123, -89, 126, 29, -79, -209, 31, 106, -171, -158, 77, 58, -75, -92, 35, 58, 78, 181, 117, 36, -102, 187, 68, -37, 117, 194, 39, -179, 94, -64, -283, 10, 17, -129, 54, 12, 188, -4, -70, 91, 37, -45, 63, 25, 81, -50, -45, -107, -6, 126, -55, -271, -117, 31, -94, -18, -87, 79, -62, -69, 64, -89, -17, -29, 78, 45, 52, 67, 160, 1, -57, 118, -192, -295, 73, 18, 133, -126, 107, 77, 83, -43, -67, 161, -30, 344, 236, -40, -79, 36, -28, -28, -49, 47, 78, 27, -146, -114, -61, -40, -127, -28, -84, 31, 86, -25, -24, -93, 33, 9, 203, 190, -85, -54, 11, -45, -178, 89, 60, -39, -14, -16, -48, 48, -30, -85, -31]
2446c1j22L21k19Q3j60K87P5k87J97k12O1K6Pn6j45J15j04K7P5K36j6k99J54j1
2470BJ14j59K11j85M2J5l8m9n2K09k68n7J87j32L8j01L35j08OQ4K2l2n4J33j92
2495b9K7Ro9J40j61m0J29N1m5j07K02k25J40R0j71j04L32%p2m9OJ39Ml16K00n1
2521C0j37q5L8K19k65K50L7j30l3P0No0M5l2q2K19J45l39J16j0L9j00J2J62K6
2546A40k30J65K6j16r1k2R1NJ71k19j45J01J20n8P3Rr5J21%J03j41mN3l7o7q6
2572a33J41J11k5j40J27p7M3j31J65l6J3R1p2j80J82Kjj74K92k94Q0j27K27r1
2596gm3J52jj45M2P7k39K44l4n6m6LK75q0k45O1J25j76P6J16k8j85Q2N8r7J73
2622A02r3K8qn5M6J6q1R9r9J9j37J12Q3n8p7Q7j21J9J78r5M6k9K3q1M7j32J86
$$ y = [-31, -153, 168, -51, 32, -128, 159, 234, -53, 144, -68, -7, 19, 26, -30, -175, -60, -164, -137, -62, 174, 158, -141, 13, 2, 116, -43, 168, -17, 25, 40, 2, -47, -99, 110, -158, -215, -28, -160, -122, -223, 112, 4, 10, 94, 116, 84, 30, 163, -29, -2, 7, -62, 78, -83, -123, 6, 57, 12, -95, 107, -118, 22, 112, -59, -163, 169, 169, 97, 48, 54, 193, 197, -119, 81, 30, -107, -192, -154, 65, -200, 50, 87, -43, -76, -6, -1, -61, -16, -48, -130, 89, 234, -105, 11, 1, 40, -60, -48, 114, 140, -90, 75, 101, -15, -106, -128, -37, -32, 139, -80, -225, -124, -4, -62, 11, 20, -75, 46, 46, 149, 8, 4, 57, 20, -47, -133, 8, 119, 94, -46, 81, 4, 47, -84, 81, 45, 58, 149, 77, -103, 79, 81, 80, -94, 198, -96, -16, -143, 84, -7, -50, 102, 101, -44, -2, 75, -164, 80, 46, -10, -56, -53, 222, 142, -103, -42, 83, -93, -17, 99, 71, -114, -32, 26, -71, 102, 9, 37, 29, -26, 20, 36, -45, 54, -45, -26, -163, -51, 32, -26, -103, -16, -137, -118, 60, -35, 11, -18, 5, -76, -29, -161, 25]
2649B5r6J7L11j67m9J66j51j0o8j25R3j94K92k20J18O1j64K13J3NMk87K72j6p
2674C6j6P6m9q4p8rr9K44j27J13k0l7j51K59%j55J05J94k80L4J06j1M5j57J54
2699I3j92Qk3K50j47P7M3j04j65O6J72k31J02R0P9j74J14j4m1j6PO8j76L9Q1N1
2725E7p0k2K3K5k36K16L7m5K38l0j55r5K35j39j06K4L33l04J42j09o6j42L7J77
2749B5j2o4p7J62N8Kq0r8k8J54j07J75j81K7K15k18J07N0n1O0p4n9j94J70J07
2774F9j19j0J9p6K93K1r8k9j5N0o2O8j74J71q7N7oq2M3j27K4N6j90J46q4J37N3
2801D8m8k2J73j82J24j47M7J6R7m6r1J73k70L3J49j01M1O5k03K06m1kj14R7L9
2826D1q1n2K19o7Pk9J6n8j56mk9L06j79J6K5K0j40J31K5n3n7K27j36r0R3J0j25
$$ y = [25, -71, -54, 257, 90, 41, 207, 56, 46, -22, -147, -54, -248, 44, -176, -58, 3, -161, 52, 65, 70, 74, -213, 59, 43, 36, 20, 96, 47, -37, -115, -124, -223, 21, -106, 7, -13, -50, -201, 58, 58, -97, 8, 202, -78, -44, 62, 51, 96, -61, 93, -99, -91, -114, 136, -11, 66, 109, 5, -160, -94, 78, -153, -51, 39, 118, -56, 58, 44, 3, -13, -6, 62, -114, -75, 6, 57, -13, -35, -12, 13, -223, -7, 30, -15, 223, 193, 38, -57, 178, 39, -67, -43, 290, -14, 128, 19, -47, -189, -152, 25, 13, -51, -128, 34, 92, 94, 14, -84, -112, 42, -65, 110, -71, -44, 171, -47, 60, 110, 59, 119, 45, -14, -208, -38, 69, -50, -60, -41, -117, 176, 197, 99, 70, 55, 105, 43, 111, -63, 108, 21, 78, 72, -10, 33, -94, -70, -14, -204, -58, -142, -5, 48, 0, -22, 151, -31, 93, -54, -7, 9, 106, 60, -31, 142, -128, -95, 54, -47, -6, 59, -144, 62, 21, 19, -95, 2, 41, -40, -92, 127, 60, 67, 38, 54, -4, -160, -164, -193, 113, -66, -50, -25, -5, -145, -14, 11, -42, -99, 128, -8, -98, -5, 5, -120]
2853a20J05J10o8j21m8l2J57LK4n3n3j3J18j39J03j24J24R3J36j34n6Q1j78K20
2877A35k17j74K35J16l33J31N6L3M4m4J09k11O3k7j09K44j80K03k68L72j09k30
2899a61k2k6J31N1M8J20j38R9j53R8q7r1N2k2J30k8K36j72J02l38J77m0o2J59
2923F3o1j54J18n2J5P2j6o7J14j0r8J80j43J59j00R9j07j10M70m10k8R3j95K4
2947a44L0J42P3j52J29q8O0k6m7m6j64M44k62J19p2J64k00J72Jp3o6Q4q9q9o9
2972a69J10l5O0J85k12J12m4R0o5nm5M2L3l6J09l01L08j82J09Pj27J11K9k15n0
2997a81J09K17l4k8j36P4NJ7p9M2m8m9J98r2Q0j75K04j61O7p6J05nj38K76k33
3022d1K0j32J90q7K6k1m3oQ9K0k20K21K8L5j9m7L7l5R6k14J93l0M4j75M6k5J81
$$ y = [-120, -15, 95, 27, -94, -142, -174, -17, -14, 10, -43, -96, -109, 9, -130, -27, -151, -27, 66, 202, 68, 12, 93, -85, 135, -82, -256, -21, 95, -238, -107, -51, -18, 26, -18, 91, -120, -57, -84, -193, 51, -129, 74, -194, 178, 69, -161, -183, -209, -78, -27, 21, 141, 3, 102, -51, 47, -40, -131, -79, -101, 29, 1, 237, 65, 167, -171, 6, -34, -96, 63, 2, -152, -34, -86, -71, 1, -15, -82, 32, 22, -76, 104, -39, 120, 20, 119, 12, -98, 372, -38, -66, 27, -168, -144, -114, 28, 101, -51, 78, -10, 50, 24, -23, -69, -233, 211, -51, 68, -4, 160, -40, 132, 133, 60, -6, 78, -11, -100, -169, -59, -94, -34, 151, -61, 51, 7, 97, 32, 27, -18, 24, 57, 21, 130, -171, 137, -45, 64, 71, -56, 55, 84, -131, -181, -72, 145, 111, 83, -53, 21, 26, 43, -36, 6, -42, -91, 107, 15, 95, -80, 124, -37, 30, -46, 59, 54, -84, 192, -41, -21, -153, 37, -50, -24, -45, -88, -94, -5, 15, -205, 16, 44, 79, 60, 13, 50, 15, 111, -103, 90, 60, 104, -71, -25, -50, 131]
3049A31p8Q7R0j56j78Q8j6O6k9j86L87k2k15M2r4K25j5J28l80J55j39P3J02j53
3073h7J97m9n1Q0J4l13K53j14lL6l9M4p5M5m0Q5j51J60J75k64N5M4K0j44J68p9
3099c3L4j72K39Oj96N3m0rpK06J96j71k54J49j80L3K34k36J69R4j81K87j86R4
3123A29j06K3o7K59k25j20P7k0M7J13j14j14J63k0Kj5j13M2J58j80K39j89k7J75
3147A17L9j66j9L7J3N5J09j90J09j83J79O6k36J27o2k9nJJ11o2j35J15N5mQ0r5
3173B7j02N8L9j0j15J22j10J66p5m0k02J71M7N2n2P8K9j5J9Ok51J78m6J06K6m5
3199F1j45P8J1m7K69l48K50n7q5M4k53K42P4j73o6J37p6mn3nL09k65j7J55N2j15
3225b7j53J95P1j70N1r3J15QK9r3J25p4J2n6L3mJ59m4k3p3o5p5K42k16mN8J4P7
$$ y = [131, 53, 140, 230, 74, -104, -16, -32, 34, 5, -181, 206, 184, -31, 11, -83, 142, 127, 255, -125, 30, -109, -36, 66, -87, 110, 61, 10, 90, 104, -209, 44, -70, -73, -37, -76, -32, -107, -62, -102, -17, -168, -8, 167, -97, -42, 2, 22, -122, 46, -33, 1, -171, 68, 74, -122, -69, -109, -118, -125, 81, 277, 106, -148, 1, -179, -146, 88, -148, 21, 115, -66, 221, 35, 129, 23, 46, -21, 238, 13, -107, -30, -50, -3, 110, -4, -118, 45, 25, 27, 12, -101, -59, 99, -81, 158, -31, -58, 117, 156, -10, -29, 8, 21, 76, 185, -5, 104, -79, 100, 166, -70, 57, -5, -34, -39, -38, 73, 11, -124, -9, 46, 42, 122, 27, -75, -17, 22, 12, -103, 19, -91, 75, 0, -40, -242, -71, -24, 28, -24, 54, 83, 68, 87, 93, -158, 20, -26, 80, 106, 61, -84, -6, 5, -42, 227, -121, 129, 72, -13, 31, -222, 20, 94, -79, -145, -8, -84, -88, -141, -146, 163, -102, -119, 36, 88, -27, -180, 15, 86, -84, -33, -126, -11, -3, 26, -67, 58, -16, -4, -60, -27, -31, 128, 84, 61, -12, -77, -152, 90, -126, -130, -72, -58, 19]
3253A9K1j39K73l27O7J69r4o9O4J24j74nj39J10oK31j51J86k21K23j18J8m7p3
3277e8p2N2K0K3K1K8l6j24J15J2R0j39O7J38o8j93J55J15j53J71k15J70j68p9
3301a28J42J01k11J34J0J9j33o8J15m0O6k9O1J73k02Q9p6j62K17j2oj75o5J55
3325b5n0J06o1J52j18J54j12j44K69o6r1j82K24j03R5n1J19j09q2K9J35j69M6
3348c4J9K08n9J4r8k6m1J06j70J98J8k77K8J35R1m2Q6k28n9kL9J80j48R4%k7P3
3375G8q3j43K17p4j4k0J8R4m8o8q8L02J9k17k0J23k2JN4j39j8J25j93N4r3N3J49
3402D7J47j41j58J57j07J79l24J43J36q3J05k17K17o4r3M8k50K56Q5o4q2N9M5
3425D1n4L2P8j61n5N6M2N0o7J75j12M4r2k7Q6nj45K5L2L5q1J86l6j03o4J33RJ56
$$ y = [19, 40, -99, 174, -153, -86, 83, -11, -80, -16, 108, -66, -71, -210, -100, -106, 125, -26, 160, -61, 162, 44, 62, 15, -58, -130, -78, -58, -35, -14, 14, -22, -146, -31, -19, 71, -68, -1, 137, 69, -124, 31, 146, -7, 164, -51, 119, -49, -128, 14, 115, -96, 38, 48, 67, -66, -134, -19, -59, 7, -22, 39, 212, 10, 99, 23, -139, 78, 66, 60, -115, -180, -25, -75, 31, -30, 122, 4, 158, 46, -98, 171, 105, 14, -168, 56, -47, 48, -3, 116, 7, -75, -46, 89, -80, -34, -15, 193, 134, 148, 50, 24, -17, 89, -81, 117, 135, -142, -114, 21, 112, 70, 156, -72, -131, -133, -94, 86, -62, 32, 32, 5, 78, -5, -148, 69, -5, -19, -39, -21, 73, 25, -43, -131, 171, 190, -27, -47, 76, 54, 55, 109, -30, -48, 77, -116, -62, -155, -102, 47, 194, 53, -105, 52, -55, 124, -200, -57, 79, -4, 101, -116, 101, 37, -56, -8, -258, -2, 83, 19, -63, -4, 41, -13, 19, 97, -64, -119, -63, -21, 29, -38, 137, 25, 69, -23, -50, 36, 31, -114, -89, -57, -22, -103, 83, 47, -56, -120, 13, 22, 178]
3453A78j38j20P6P1j02R3M7m4O2p8o6O6j78J68k6j77J27j84K77K2r1N9j25j9O7
3478c5kn8PJ11k59L40j32p1K30rm5j65K3R6n2R5j72K66k00L0L5P6k36J77l7p7
3504f4K0J39q6J3o2n5l0R9J4J57k24p1L4J73m4Qj2Q2j95J23j09q1K78j97J55R
3530G4k03K03M3j79O2N3j23k4K13j39n4J09J1O3j91Om0J16q3N7L2m0j11K45M8
3555A48k76K06l6N9l4k4p4j3j2P6J7j29K2nJ10J00M4j69j72K93j19k22K12PO8
3580G7m6J29k11oJ10r8O2o8Ll7j0J79r4r5L4l8J47k17J64Pqp7Q6j83N8J61J01
3607A30o9Pj05R4j7%P8j14o6P4K8j59J86k18J52kK7J3j1k18L35J07j31j12O7R
3633H5l22K76J43p3p5lO8q9k7m5lQ5l7K2M3J7j81J53P0k36J59j53J16m0K03k36
$$ y = [178, 40, -80, -4, 67, -35, 58, 105, 61, 123, 45, -21, 45, -133, 35, 9, -168, -41, -225, 52, 74, -17, 42, -83, -102, -35, -37, -95, -88, 23, -236, 104, -28, -99, 131, 122, 77, -88, -65, 31, -21, 74, -98, 168, -32, -2, 33, 109, -127, 50, 13, -64, -44, 95, 9, 22, -40, -95, -125, -26, -12, 145, -79, -150, -116, 57, 13, 21, 9, 91, -104, 19, -90, -171, 107, -90, 65, 74, -129, 74, 117, -62, 0, 53, -70, -94, 119, -20, -74, 35, 46, 109, -82, -76, -116, 0, -83, -26, 6, -34, -145, 100, 148, -128, 78, 42, 101, 67, 43, -31, -44, -56, 20, 37, -92, -70, -75, 35, 135, 179, 10, -162, 131, 12, -210, 2, 9, 77, 31, 160, -51, -57, 53, -45, 17, -51, -48, -85, -95, 84, -10, -105, -71, -109, 38, -179, -15, -8, -16, -93, -7, -190, -132, 29, 130, 61, 68, -37, 57, 40, 40, 118, 4, -62, 12, 40, -119, 67, -151, 1, -1, 26, 39, 28, -190, 145, 252, 121, 9, 76, 85, -237, 39, 182, 109, 34, 31, 99, 10, -17, -62, -65, 20, -17, 5, 48, 65, -116, 37, 107, -129, 30, -123, -7, -47, 156, -80]
3659h0J01P3j98J7M1O1K9j57J57l9J23q8Q3l8j84p2K34N9k39J14j22J96j73J41
3683C9J9k71J01L0R6N6O6l31J15K6J58j10pJ14Pr7j0J21j01mq6K51k69N0R4M4
3709A01O5n0l88K78J92k79J49O7j80J19qn5j15J45K0p6J09j35N6j58K53N6p5j47
3733e6J00o3j66K77m3n6K2p3K33k20P6J2J70k99O3K5M2m6Q4j45P5P3j62q3J23
3758c7K85k08p7jN1M0j89J57j21J75K7j50J26j62j9J38O4q0n7k9N4J7O6j12o8
3783a10J58r6J70Oj67j29J67K3j72L19j10j73nM5R8q9K19q7L4j63qj8J9J08m6
3808gm1MN8p8qJ57j46J25P6j40j31K00r2l5mm7P1q8K23p6M2J05n5j63J07O7j92
3835f8P3j9Q4Oq3p3J93j48P3q1kr1J55q7k0J29k6J04k06J88q3p4p3P4P1L8N5j88
$$ y = [-80, 21, 94, -104, -87, -46, 15, 44, -113, 44, 5, 128, 40, 123, 85, -99, -171, 63, 122, -117, -3, -125, 71, -102, 39, 58, -213, -112, -82, 14, 70, 136, -195, -80, -54, 104, -6, -13, 101, 108, 11, 1, 122, 21, 17, -69, 182, -87, -37, 57, 101, 166, 116, -272, 6, 198, -81, 68, 135, -45, 74, 66, 11, -104, 41, 61, -15, 94, -41, 15, -143, 110, 166, 91, -56, 44, -19, -185, 92, 49, -7, 15, -58, 175, -45, 31, 43, 213, -86, -23, 2, 44, -2, 82, -63, 12, 85, -77, -160, -37, 248, 40, -37, -38, 13, 53, -136, 21, -100, 75, 102, -48, 78, -84, -103, 35, 99, 19, -38, -67, -13, 4, 70, -42, -110, 48, -48, 122, 128, -39, -168, -1, 22, -150, 169, 59, -114, -119, -74, 24, -65, 154, 67, 101, -62, -70, -88, -69, 39, -7, -48, -44, 14, -64, -72, 85, -61, 64, 140, 0, -131, 69, -23, -58, -62, -109, -38, -126, 97, 21, 63, 168, 113, -50, 57, 124, -68, 5, -14, 70, 76, -7, -80, 113, -35, 38, -43, -45, -136, 19, -68, -88, 41, 15, 119, -87, 101, 18, -56, -129, -55, 16, 54, 109, -79]
3863g9r3K34j23K19k01n2n7K62j09poj09K05j04k8L1M4j82L9j6K89k6j35J8N7
3888G1J7j39j21J61j13Lq8J57K5Nj06J13o8K52N2k97Rl2K7J01K9j17m4J78k41
3913a66J74n3p9Q7k3K16k81P9M7K10k31r3K45r2M3n4J0j16M3j11J47j9m7j9J33
3938E0L6m5M8r8L7m6mQ4n2o8R9L2j47J07r8k4Q1j51J56j0j01J6J00J56k01k5p1
3965a39J61j09R5L2l4j06J97j74J05l4j80K14L3j17j03J74m8k9rLK06n6j21N1
3989A2j9qN4r1q3K69j21q8N6N2j06J39j8N3l0r3q1K10L5L7k63M6J15p1K1%j93
4016a66J28R6P6J0k04j6R4j43J36l1J73rj39J36j07k8%r1kJ91j00N5q5L2o8J35
4042G3j39J63o6J3p6J6J6K00k84J87k1p6P0j41N6N5L1j29K13qk19L3j22J34J24
$$ y = [-79, -172, 62, -61, 158, -43, -95, -152, 110, 1, -6, -12, -121, 84, -20, -48, -17, 27, -155, -116, -132, 157, 131, -4, 14, 71, 88, -51, -172, -11, -124, -121, -209, -52, -27, -22, -128, -15, -83, 169, 221, -76, -67, -99, -72, 29, 58, -59, -103, 75, -166, 8, -45, -124, -37, -60, 156, -125, -46, 1, 211, -20, -113, 132, 40, 83, 29, 39, -77, -34, -145, 2, -17, -64, -83, 50, 86, 41, 89, -9, 28, -18, -22, 62, 10, -58, 41, 73, -74, 33, -65, -89, -8, -159, -3, -13, -114, -98, 2, 158, -43, -68, -139, 22, -87, 8, 40, 6, -100, 97, -77, 28, -6, -186, 28, 61, -56, -159, 15, -33, -62, -71, -68, 138, 82, -39, 12, -7, -15, 39, -52, -135, 134, 13, -75, -19, 33, -73, 66, 48, 101, 71, -22, -103, 107, 142, 179, -84, -38, 77, 6, 27, 27, -166, -38, 58, 134, 144, -60, -76, 18, -125, 11, -20, 153, 144, 5, 141, 34, 6, 6, -85, -87, 104, 4, 59, -26, 6, -62, 73, -66, 97, 31, 44, -32, -16, 0, 200, -84, 103, 82, 6, 76, -65, -9, 46, 77, -52, 161, 153, -66, -33, -155, -21, 103]
4067A03r5p9M1J08q5q2L40j57l3q3j67J22Q0J04n3q7l5J35L9Jj48mJ68k79M7K98
4093A99k40o7N0j12K62k39R7L6J76j46n0kj14J05p4J5J04N7O2j69J24p6L5j75
4117a42L09p3n0j1K9m0Qm5j59J08K5J32k56J71k6O4L9j56j8Q7mk1J44J2k68J82
4143D1o3l4R7j32J03J08l23Q9J17j0n7q9J17P8q0l5P2J36p6o2P2j63o8J15j46
4168a93J43J38j50N0J23J1j82N7l3J33j56P8j75K27p6J06n6j98K20j35j3n6J69
4191C2J64l09p7K50r1j01J00N4N7j49J22r4J6ON9l5J87j40j68J48j38K3K64k90
4215a10J70P4j91R6O1n9q5O6J1n9J64j40j69K50p7K1j24N7J79j06j67K19l8j95
4239a52p2J95Q3j14oL5L3R4k36J86m2O3Lk0j6n3J11j36L3m4J11J05k29J23nk50
$$ y = [103, 8, -71, -30, 78, -7, -89, 251, 94, 61, -22, -189, -67, 13, 117, 64, -23, -58, 77, 116, 117, -31, -35, 133, -146, -99, 199, -41, -108, -58, -170, 92, -147, -50, -14, 162, 16, -34, -36, -150, -45, -119, -104, 0, 57, 119, -50, 74, -2, 33, -142, 167, 94, 44, 33, 62, 22, 30, -15, -174, -66, -41, 91, -165, 6, -20, 44, 83, -73, -91, -4, -8, -29, 115, 127, -141, 41, -22, -56, 41, -91, 12, 120, -203, -114, 3, -7, -64, -153, -36, 42, -38, -73, -1, 135, 59, -3, 69, -94, -162, -47, -193, -50, 88, -62, -12, 111, 122, -60, -3, -36, 97, -59, 19, -156, 71, -5, 101, 45, -153, 67, -68, -81, -137, 32, 196, -113, -190, 60, -31, -132, -32, 22, 79, -70, 52, -42, -26, -20, 39, 4, 191, 51, -117, 31, -107, -84, 180, -110, 60, 134, -57, 39, 100, 41, -44, 22, 33, -26, 138, -2, -171, 79, 2, 23, -101, -44, 135, 29, -138, 81, 43, -152, -224, -29, 54, -60, -66, -31, 2, 96, -140, 46, 4, 67, 70, 50, 34, -19, 92, -44, -11, -55, 56, 161, -68, 55, 50, -200]
4265b00M9K36j01L2j3o6J27j22p2J84N6q0q8J0K5m3Q5l0j03k1K21l6j59k2k1J39
4291a3J99j82L4k0n9L9l5O9J56j36M4J42k73Q9J2l3rL5p2K82l12k6P2J52o5p1
4317A9qR5P5k12J2R2n7M1J0j49K12j3m2J8j9r8J29q4o4J0J65l33J76J17rj10J54
4344A27j11rJ65k25K94j95k00K81P5l05M2K49j34r4q6J71K6k44R1J79k60N01l10
4367B8Pj91K66p4l2p8M8J05p1q7J18K4m7j3rK58j43l4r9P1J20j21M5r1J63l9k10
4394h6Q0J8M9j33L2J77j76P6m9p6R7K3J5j13J65j31Q3j02m1K9O1Q5n6j4K0J40
4420A73p6m4p8j21Q9M3q2J79r4O2L3j01j3o4R0np1J59j0p7JJ0J49j47J39j78Q8
4447E4j03k64M14k51J40l6K2%J8j56J41K12J9m46K91K7k4N7l9l3K3L4j34J55j94
$$ y = [-200, -151, 85, -16, 16, 3, -63, 64, -58, -130, 54, 110, 30, -58, -48, -23, -66, 19, -11, -114, -135, 86, 50, -109, -131, -152, -13, 186, 4, 38, 18, -41, -2, -37, 32, 188, 52, 96, 238, -35, 54, 66, 33, 24, 59, -13, 269, -43, -69, 3, 155, 90, 19, 11, 106, 181, -31, -19, 73, 16, 57, 67, -82, 130, 117, 75, 93, 74, -24, 105, 21, -43, -33, 132, -201, -25, 92, 83, -27, 127, 16, 7, 172, -53, 241, 46, -154, 127, 202, -103, -61, 188, 54, -40, -126, 45, 71, -173, -82, 97, -163, 338, 28, 35, -156, 110, 36, 4, -74, -26, 79, 8, -79, 39, 63, 16, 3, -6, 252, 109, 75, -24, 47, 167, 46, 91, 0, 163, 124, -86, -6, 12, 61, -72, -40, 137, -39, 37, -12, -88, 9, 32, 47, -66, 99, -32, 51, -51, -92, -63, -2, 83, 27, 13, 33, 173, 97, 53, -25, -146, -57, -14, -96, 83, -11, 51, 84, -17, -30, -94, -4, -9, -80, 79, 69, -8, -7, 3, 152, 5, 144, -34, 54, -49, -313, 101, -150, -10, -46, -24, -24, -6, -162, -21, 191, 210, -236, 55, 82, 58, 115, 76, 43, 66, 100, -34, 121, -73]
4472g3l6J02MJ5M2r3R9j74K04j33Q6j14or5J93K9mn0j1M8m1m2Q1J42k52k5M8K3
4500c3k16K00K52j67j04K9K3n5j2M0l7J07J16j98O2N5p1M5m7l2M0n6R1lj3J36
4526A52l65J38R9j81O8M6kj40L25k31R7m7Q1KK1j13R9p0J9o8M8K1Q3m0Rr5J67
4553A23k44J73q9K1MJ57M0l78J44j67J45M5m6k2J59J9j05N0k0k2o7J29k8m3Q6
4578F4j31J48P8k29J03J06l19J87oJ16j33j9Mj15J18R3J0j97J37O1k1k3P1j80
4602g7J02P5N1k1k63J39K03k44J39m09J56n0K46j5j17N1k7k7oN6KK08j11j74J12
4627aO1j80l2K53rl04M03j98L2k2j21J27N9o9j56J25R6lmm2J6k46L81j39j90J04
4653e9J10ol5m0n4rJ65j93J77j4j57Q2m8J98j04p0J13q9N0j01k6K33j09J7l3N7
$$ y = [-73, -109, -7, -3, 12, 54, -39, 60, -114, 90, -43, 43, -71, -77, -172, 21, 50, 46, -4, -15, 33, -8, -50, 31, 173, -79, -104, -56, -33, -249, -49, 203, 36, -68, -39, -16, -71, -83, -43, -80, 27, 143, -55, 7, 62, -9, 36, -11, -43, -3, -59, 32, 29, 16, 152, -213, -75, 24, -157, -89, -43, -45, -185, 140, -91, 6, -41, 40, 42, 63, -50, 49, -21, -2, -70, -22, -1, 82, 42, 51, -44, 123, -121, 52, -37, -16, -12, 145, 185, -193, -49, -216, -71, -26, -72, -94, 65, 84, -21, 29, 9, -13, -80, 49, 21, -22, 64, -67, 81, 159, -70, 33, 139, -180, 7, 1, 117, -16, -35, -31, -146, -28, 65, 75, -122, 15, 76, 55, 32, 103, -77, 25, 100, 151, 130, -133, 6, 209, -35, 104, -305, -149, -199, 47, 32, -85, -34, -61, -88, -94, -38, -36, 172, 61, -113, -1, 60, -120, -152, 101, 92, -212, 191, -7, 25, 3, -118, 9, 68, -1, -157, -32, 64, 61, 57, 15, 31, -215, 166, 27, -163, -59, 51, 45, 10, -30, -84, -93, 72, -121, 56, 42, -115, -33, -81, 117, 13, -57, 56, -33, 17, -84, -110, 123, 14, 31, -2, 55]
4679E5n0k5R6j34j4J19j10K03j73J3Ql0R4j25J10L8j53N1j7m0J73o6l9j13M7O2
4705b0J1O0L6p3O2p1M8j1j57j0J15o8K09j33o9O4n4K69j48p8P9j04mJ54k48L33
4731A92k57R4R5q7L7j2n4n6K36j23r8J05N8j67O8j08L2O0k8j16J04o4K17j05J18
4756A41J3j42l5L2l6J7o2Q2N8j27J48l6K2j24M3j05R9p7j54N2J16L1k6R5j47n3
4782a75J88l1KL2k2Lq1J33J2m1q6m9K58k26N8O0rm9pL1N0j25J40J18k26N9j13
4809i6J01J78k67O1j4M2j39L4M0J01J51j63p5J14k12J83Rj68Q4JN6N0r0O3p8k0
4835e4m7J24p0j1j0J95k13p7K47k22N0O3j6K3j35K28k28J49j04O5J67k0k21J62
4859D5j23J56j63J76j54o6J48j70K55j68j9j8J73j66l5J61k7j10O2M0J86j84o6
$$ y = [55, 5, -20, 76, -58, -72, 47, -63, 140, -33, -20, -12, -42, 52, -73, 37, 75, -78, -27, -44, -84, 89, 23, -16, -129, -82, -20, -9, 51, 87, 14, 76, 5, 53, 42, -115, -125, -10, -78, 131, -2, -71, -7, -61, 208, 60, -18, 61, -43, -47, 107, -141, 192, -65, 29, 124, 37, 74, 62, 8, -48, 188, 65, -33, 72, 130, -37, 31, -77, -45, 15, -13, -129, -25, -89, 128, 23, 141, 154, 12, -23, 9, -27, -10, -72, 10, 68, -59, 89, 53, 75, -49, -6, -111, -12, -89, -243, -191, -75, -44, -70, 25, -122, -175, 13, -18, -16, 16, -6, -3, -84, 49, 61, 20, -66, -115, 143, -83, -25, 35, 26, -23, -30, 1, 51, -74, 66, 184, -42, 17, -96, 5, 183, -84, -23, -37, 5, -134, -100, -60, 41, 192, 29, -46, 68, -144, 39, 48, -120, -36, -35, 21, 71, -19, 44, -34, -54, -101, 23, -47, -58, -68, 127, -86, -163, 84, -138, -88, -25, -41, -18, -153, 75, -153, -4, -108, -43, 124, 104, -117, 45, -78, 78, -85, 91, -63, -129, 19, -151, 104, -64, -83, -101, 72, -94, -129, 32, 5, -105, -43, -3, 183, -1, -67]
4882f7No6J89rj9lq8kL1O2j5j04K22p7k88J07J84r9J8J07j88J42P6k9k54J17K6
4909b2L5O1j58k0M1J55Po5j8l7L4Kj65K65q6m0O6P7o1j57K19j56O5k00J73r7L8
4936d4j0J2K2o9p5kL21j26j7r7L3P4P4j24K06k31J64j51M9q7J32KQ0l6j35J65
4962A30r9j26J78J0J5n4L8L8j14q1L7N2K8J3n2J0N5j13J37j4J17k36P5m2o4M1
4988b1M9mj26J18j57L07j60K1j5j46M2J08r1J48J7j44K24k09J5q1K2L11k54N4
5012B8M5j88K15j34r7K15k1L7n8P3j75J62L4k18K24j58J5m1M8q6J53N5j02L0p1
5037a5j00R4N1K9k8j01K24j08o3l3j08K12j22m0j31K41p7J15k9J64k23PJ00m2
5061A7JN4j32J47m1l3m2j67L86j57j27K38q1j95j1J68Jj87J03l6M00l79J35Jk0
$$ y = [-67, -62, -128, 61, 52, 33, 30, -58, -60, -29, 33, 18, -86, 136, 59, -229, -122, 62, -37, -19, 88, -100, 42, 118, 89, -165, -48, -22, 13, 74, -84, -104, -63, 92, 99, 34, 16, -21, 13, 15, -150, 115, 29, -11, 55, 132, 71, -86, 133, -23, 42, -158, 15, -82, -44, -54, -42, -20, -89, -164, -166, 155, 29, 12, -85, -52, 22, 96, -28, 178, -53, 111, -40, 9, -78, 54, 56, 136, 100, -35, 130, 31, -95, 83, 93, 108, 54, 92, 130, 16, -65, -28, 24, 52, 65, 13, 23, 78, -35, 102, 88, 205, -31, 44, 2, -62, -21, 28, 24, -102, 16, -141, 166, 6, 27, 12, -134, -92, 16, -75, 73, 90, -54, 170, -39, -24, -105, -83, 228, -26, 28, 73, -115, 100, -34, -131, 84, 63, 100, 42, 115, -60, 102, 136, -82, 142, -16, -1, -42, 6, -80, 73, 128, 26, 56, -15, -115, -21, 30, 59, 31, -70, 154, 46, -17, -50, -158, 54, -68, -108, -239, 2, -75, 40, 11, 175, -48, -41, 59, 17, 18, 72, -60, 87, 46, 13, -29, -196, 190, 33, -94, 144, 63, -132, -143, 25, 26, -161, -58, -94, 306, -73, 62, 63, 43]
5086D3k2M1o8J05q5JO3o9n6l9R8M6M2j64J08J56j95J8M2k11K09M1k0qj70K08j04
5113A0J21qm3r2L5r3n7J23j07J0n8J69j44J18J02jJ0k6j09N6j53N3O2J3k6J8P6
5140E9j49PK03j21j05J50J2k18N1K88k46Q4J86k14M8nJ27l5j03k6j0j48lJK7L7
5166a03J8Qm7J06k4R7j20K1p7Q5KJ31j24J63j12J4J63j26m4r8J14j76J45K9q7
5191d2O5m7Q6j17k0j18K90j05l0J25m0l8j1L4k32K20n3l0J95K8k42J62j10%O8
5216C8l4o2o4p5K74j08l8L6j4l7R1Q2q2J9o4L0n2O8J3j5J5r3J09n4n6K36j34K2
5244E1Jj15J52J1p8j07K35M3j45r5n3L6K4P6k30J34O6j18J0J92o6n5L6J27r7J42
5270A77j63N0j18J14l5O5n4j04J46q4M8k36J24N2N0l9J16l04K52j71P3rp1J23
$$ y = [43, 21, 62, -6, 99, 14, 15, 78, 9, -47, -86, 12, 58, 100, -64, 44, 200, 5, 23, 65, -146, 63, 104, 84, 76, -94, 114, 10, 131, 123, 80, -12, 23, -70, -127, -4, -111, -101, -159, 10, -134, -16, 86, 85, 95, 69, -40, 16, -137, -84, -22, -9, -35, -17, 59, -90, -83, 120, -1, -106, 44, 56, -162, -111, 177, -69, 15, 201, -13, 35, 30, 157, 122, 19, -7, -17, -165, -168, -167, -140, -103, -85, -77, -124, -18, -42, 55, -65, -44, -121, -36, -34, 97, -27, 136, 24, 38, 201, 75, 31, -67, 47, -129, 16, 45, -42, 23, -24, 62, -55, -75, -193, 97, -8, -38, 87, 47, 9, -2, 32, -200, 20, -33, -63, 132, 160, -82, 80, -30, -30, 38, 4, -58, -122, -197, 77, -31, -69, -33, -47, -84, 7, 89, 7, 26, -38, -8, -60, 8, 21, 6, 21, -72, 37, -17, -73, 163, 29, 51, 52, -63, 89, 100, 22, -85, 150, 193, 48, -47, -100, -64, -40, 36, -194, -60, 6, -112, -102, 90, 24, -31, 5, 132, 35, 177, 14, 64, -54, 60, 25, 90, 36, -68, 78, -6, 42, -194, -70, -18, 32, -7, 109, -195, 57, -114, -41, -50, -121, 2]
5294Bj32J69Kj29J4J56o9J6j76P7J09N7l2j8j00p7J93k04M3K03m5k5n2Q8m6J4
5320C8j98Q0J63q9p4Q4J31j84L3np4o2R7k1k0Q8O8J2o7q8L3J42j64M8J84r8J42
5347A99j15l9M2O0q1j22J92j60O5pQ5j59L3o8N9o1J15Q0k30N5o9J16PJ9n9L5n7
5374f5O8N4j96J30k7m3QL8l1J51j30j15Q5J60p6j59O6J21pk03M76k67r0jm0J45
5400E2N7n2m2N0j96J53P0r2K1O2k79P9o1P5L59k30p5J39j13n9MK47j30o6K40l90
5426a77J71m0k5n4J95m9q0J96j14qJ01k9r9r1J69j74J48J5o4J0L5j22K71k53O9
5451AR3j35L7k5q1K9M0J10j62kJ01rJ22k06Q1J0o3J63m3LM1k64J87lj57J32J7
5478A7J06j46R7k36J90J21j46Q4l6J09j93N2O1r7j32LJ74J8Rj36M8J49j35k6J16
$$ y = [2, -130, 39, 41, -88, -74, 82, 13, 29, -147, -70, 39, 96, 64, 46, -54, -131, 62, -142, -99, 104, 59, 34, -18, 70, 24, 38, -160, -80, 83, -6, -80, 4, 135, -49, -16, -21, -95, -157, -60, -81, -101, -13, 55, 67, 0, -88, -55, 87, -77, -29, 155, 57, 199, 84, 45, 87, 147, 66, -56, 136, -24, 41, 34, 119, -40, -7, -75, -16, -77, 38, 118, -112, -57, -126, -10, -3, 16, -43, -8, -65, 3, 57, -139, -9, -36, -79, -71, -33, -64, 87, -43, -158, -73, 87, 11, -148, -82, 39, 32, -171, 305, 38, -52, -53, -93, 52, 109, 57, 15, 65, -131, 22, 92, 0, 21, 83, -196, -117, -178, -103, 256, 26, -49, 90, -23, -82, -78, 169, 39, -27, 213, -177, -6, -46, -71, -125, 70, 21, -59, 137, 23, 15, 116, 87, -12, -103, 66, -108, 40, 55, -9, 1, 36, -86, 185, -68, 1, 94, -41, -4, -29, -110, -81, -41, 69, -93, -95, 6, -3, 119, -87, -6, 4, -59, 104, 61, 64, 105, -159, 28, 25, -132, 0, 17, 123, -23, 74, -162, 28, 149, 3, 87, 51, 160, -33, 19, 80, -17, -149, -146, 28, 46, 55, -81, -33, 116, -19, -45, 71]
5503G1p0N0j35q0n5K31M3o8P2j74o8J97ko5l6K51j45j29K7K20k51J34L0R1p4j57
5529i2J11j62OL9K47k48O0L2k00J78P1j43J03P8p0kk6O3J9L0q5k3Ql9R7j51l1
5556a30L6O0J50k04N8J12j84mJ69o4q9J76r8K19k81J0r3K37n9o3J14m7J17k95
5580a53J94j97J14j11K00J00j12k2m4nlJ33J4k50K13q3Mj06L03k42M3j22J63q1
5604e0J45j05L9k22K16rJ23l3j59J34j50P7K9J52j83L6jo2R3k5l1J48k81n7K87
5629A11r3j21K58O4j32J7j38R0M7k5k2O0j27l8m7J3p2R0J60qm8l8l9oM6l9R6j50
5657i1L03k59Q7j55J55j77J67Nk07J73j8k02K64J2rj44k4N6M2P4l5J00k52J85
5681E0m0J04k07L1K29j27p1O0j51J15m9L5J55j23J43j62J38j18p4L8j5J66k48
$$ y = [71, 1, 51, -84, -164, -219, 12, 55, -13, 59, -115, -183, 14, 12, -53, -89, 162, 17, -112, -85, 135, -116, 18, 48, 139, 65, -92, 19, -143, -137, -98, 149, -99, -39, -7, -207, -29, 42, -101, 2, 80, 10, 8, -18, 45, 64, 94, 9, -14, -6, -45, 52, -99, -130, -94, -34, 116, -88, -30, 82, -102, -106, 63, -1, -90, 86, -12, 207, -74, -64, -157, 80, 21, -42, 72, 25, 142, -153, 41, -156, -42, -153, 47, 147, 35, 13, -31, -36, -39, 94, 108, -142, 71, -12, -8, -114, 189, -53, -10, -132, 31, -50, 95, -10, 29, -193, 23, 14, 137, 104, -55, 79, -71, 6, 35, 187, 4, 40, 39, -23, 70, 45, 14, 162, -119, -176, 111, 18, -103, 155, 219, 87, 104, -34, 56, 103, 78, 56, 116, -11, -49, -96, -83, -155, -65, 95, 87, 39, 1, -38, -44, 2, -37, 59, -91, 212, -47, 40, -115, 40, -137, 30, 35, -172, 1, -17, -219, 45, 57, 48, -96, -120, -64, -22, 52, 17, 117, -135, 50, 10, 114, -93, -62, 167, 40, -31, 29, -122, -7, -56, -21, 134, 11, 154, -8, 130, 12, -62, -24, -39, 127, -121]
5704a21J09J8j62J76l7j07J0K30k66J36P1k52J84K15l30Q4Pm4O8R2o7p1J26M2
5728A11k32K07j12J0Q2Q0k50J09J55n5Mr7Q9j40n0m9J75r8K5Nn0q0K77j16q9J35
5754D6o5M3M4j10J59j1J5Kj82j4J40k4M4J9k70K38j56J11J2p5rr4K55j18N6o0
5780dN2k4L3j41J78J51k60Q2j20QP8Rk50L32k70J51J6j27J39j17o6J95j37J78
5804H6j65l2K30o5j1j80L11k64k6P9J04j58l2N4J49Oq8P4pk0p0k7L4q3k3J95%
5831G1n6J78p4n7o4j00J03K4k01J40P2m3rLJ87k31P5J12j65Pl6J22o2j20J48J75
5857A99j26j15M2p0J10j02J09j20J3J2N2p3oR8m0j03L02k01r7J73j78J39q7K36
5881A67k21J43k51J56J09j85LO9k4l8N4k0j17K04m0j24N1J52j49J13l4j19K24
$$ y = [-121, -12, 6, -156, 20, -17, -124, -114, 116, -150, -14, 57, -195, -11, 204, -126, -42, -35, -79, -11, 81, 14, -57, 69, 111, -121, 86, -26, -16, 66, 146, -104, 5, 160, 105, 109, 12, 101, -39, -89, -138, 37, -61, -36, -31, -81, -161, 116, 0, -89, 46, -19, 24, 68, -42, 117, 106, 121, 123, -59, -73, 67, 43, 87, 106, -164, 74, -82, 29, 41, -34, -43, -137, 118, 0, 56, -4, 48, 24, 57, -84, 94, 245, -15, 67, -53, -45, 33, 42, -208, 124, -146, 5, 21, -106, 33, -84, -150, 45, -92, 86, -79, -111, 119, 54, 43, -137, 174, -90, -116, -37, 67, -91, -123, -69, 80, 86, -2, 72, 65, 45, -25, -52, -18, -101, -124, 71, 71, 15, 193, 119, 62, -2, -102, 1, 25, -176, -36, 36, -7, -16, -13, 174, -57, 18, 130, -35, -28, -64, 58, -4, -124, 24, 199, 73, -42, 0, -70, 40, -62, 47, -73, -60, -48, 4, -69, -75, 23, -17, -120, 182, -19, -116, 57, -121, 18, -69, 167, -54, 89, -162, -6, 103, -82, -79, -10, -34, -72, -18, -38, -155, 49, 9, -115, -64, 88, -61, 52, 18, -101, 123]
5904A23j91K1K05l6m7j38R4j19N0J62k22P9N4M6k33K50Rj36M6r6nj0J10lj58J37
5930hr1J96j05o2M5j07J35K15k93J27N1j46J25j65J07m3N0n0K3p6P7l1n6R2J7
5955B7j24Q8L3K9N5p0J16j19r5L5lJ28rj04L0nj4j51J76l8n9N6j04M9P5n6O6K6
5983C8l7L5j98J97k2J69k7k17j9P5rm4M1J10k47K4J36%j43K78m5l0r8r9k5N0J37
6010C0J3r9P2j32K63j05m8k5J40j45M5q1O2J07q6Q1m7P9k20L17j28o1j0oKq9J14
6037D3L6l4o2%M5N7J17l48LJ39j1p4J39j53J53j29P3N1q2N6j19J75j20m3J58l1
6063C9m9J73r6o0l8J67j97J39j41J24%l43M02j21M8q4O5Nj05J05j6km6J3K29k44
6089c3J27k17P9P4Jk20m0K37m7K56ll80L24o3Rq8k63L28j25J94k72K43k28J1K38
$$ y = [123, -68, -47, 158, 122, 75, -63, 31, -88, -38, 124, -98, -19, 35, 81, -152, 98, 107, -29, 17, -79, -84, -94, 16, 13, -145, -8, -99, 97, -8, -70, -25, -132, 3, 218, -75, 52, 103, -43, 82, -83, 24, -19, 31, -19, 4, -72, 5, -26, -82, 10, 27, -97, -9, 24, 53, 108, 38, 154, 35, -60, -25, -28, 100, 91, -13, 17, 12, -2, -153, 23, -15, -74, -18, -122, -73, 2, -54, 12, 38, 1, 36, -162, 35, 13, 182, 155, -62, -81, -6, -15, -59, -18, 92, -155, -131, 5, 5, -138, 140, 95, 65, -33, -132, -157, -107, 30, 43, -56, 16, -116, 147, 42, -6, -31, 109, -36, 9, -72, -10, 97, 11, 92, 45, 124, -96, 221, 93, 32, 22, 16, 18, -71, 43, 79, 45, -17, -17, 28, 85, 202, -146, -143, -4, -15, -89, 50, -103, 50, -79, -6, 45, -37, 19, -100, 75, -45, -88, 70, 39, -10, 163, 67, 7, -31, 136, -61, 78, -63, 61, 61, -282, 120, -1, 47, -37, 28, 33, -72, 33, 17, 15, -31, -18, 211, -33, 94, -123, -44, 30, 31, -189, -229, 8, -39, 217, 214, -166, 158, 95, 104, 16, -247, 81, -44, 150, -122, 121, -107, -96, 142]
6114A42j07j1q9P2R3k06J51lJ3J18rj69m3J00j45O7j70K73l29K32k2mlJ3J82j53
6140gj89K08rJ4o5K01k41M1M5J34j91M5J8n5P3J12K13l00N9j71J06K0m9j01p9
6165a68L3K06j04M6J45j74R4l1o2M8k9j01m6J79j2r0J05l9o0K04j50o4J14n7Q8
6190G5Q1j26K7jJ43l12J55q9N9l7n4k3O2m6J93j94K53j35j99K63l6J2j48J12P1
6215A06L4n0j35O3j00o1K21r3R5q0k76K38J35q8p0J5J55jlj17P0M9l13J53P0j2
6241ELL6k2J14j61PJ68j15N9o7q6J12k13M34k81p5P9j00P7L9o0rR2l1n1J0j1J54
6269A07j6j43M7J56k12r4J67%q4P0j1PJ56p4lR3j76K29j52j06%p0J39r5O9Ok25
6296b15L10N2l48K61k6k4O7m4k4l1P8j5k3n3J8Q9J8o5p7o0Q5nO9PL6p8r7J43j27
$$ y = [142, 35, 24, -65, 7, 100, -106, 45, 42, 55, 173, 164, -5, -48, 52, -93, -26, -196, 77, -252, -20, -42, -46, -49, -36, 146, -7, -196, 12, 3, 17, -48, 153, -88, -47, -2, 132, -59, -14, 4, -51, 22, 134, 347, 47, 106, -65, 41, 61, 12, -89, -168, -135, 71, -33, 13, 158, -16, 78, 47, -15, 33, 4, -97, -143, 36, 24, -66, 39, 0, -60, 144, -6, -70, 44, -13, 75, 156, 30, 57, 56, 199, -113, 42, -47, 12, -25, -79, -102, -40, -86, 107, -87, 166, 31, -168, 95, 59, 71, -77, 35, 106, 140, 90, -45, 18, -82, -143, 78, -15, 80, 0, -276, -38, 97, 9, -61, -46, 109, 108, 105, -12, 58, 107, -206, -53, 17, 5, 8, 44, 22, 136, -25, -18, 150, 35, 94, 27, -59, 53, -160, 274, -7, -82, -3, -103, -26, 13, -47, -56, 36, 5, -46, -36, -47, 107, 91, -52, -5, 151, -61, -155, 12, 12, -72, -2, -13, -6, 150, 76, 73, 166, -10, 219, 67, -39, -39, -109, 30, -65, 4, 10, -215, 95, 147, -201, 60, 34, 10, 77, 33, 9, -22, 56, 41, 18, -35, -17, 72, 90, 25, -52, -112, -27, -32, 37, 44, 80, 2, -95, 48, -79]
$$ [...]
8191C7
##END NTUPLES=NMR FID
##END=
