##TITLE=1H_Pr Am 6 Am
 CDCl3, 8 sc, 
 1.02.2021
##JCAMPDX= 6.0         $$ Bruker NMR JCAMP-DX V2.0
##DATA TYPE= NMR FID
##DATA CLASS= NTUPLES
##ORIGIN= UXNMR, Bruker Analytische Messtechnik GmbH
##OWNER= root
$$ XWIN-NMR		Version 3.5
$$ Mon Feb  1 12:42:29 2021 Russian Standard Time (UT+4h)  she@DPX200
##.OBSERVE FREQUENCY= 200.1315066352
##.OBSERVE NUCLEUS= ^1H
##.DELAY= (6, 6)
##.ACQUISITION MODE= SIMULTANEOUS
##.ACQUISITION SCHEME= undefined
##.AVERAGES= 8
##.DIGITISER RES= 18
##SPECTROMETER/DATA SYSTEM= spect
##.PULSE SEQUENCE= zg30
##.SOLVENT NAME= CDCl3
##.SHIFT REFERENCE= (INTERNAL, CDCl3, 0, 15.7039)
##AUDIT TRAIL= $$ (NUMBER, WHEN, WHO, WHERE, WHAT)
$$ ##TITLE= Audit trail, XWIN-NMR		Version 3.5
$$ ##JCAMPDX= 5.01
$$ ##ORIGIN= Bruker BioSpin GmbH
$$ ##OWNER= she
$$ F:/spectra/data/she/nmr/H-F/1/audita.txt
$$ ##AUDIT TRAIL=  $$ (NUMBER, WHEN, WHO, WHERE, WHAT)
(   1,<2021-02-01 12:41:20.40 +0400>,<she>,<DPX200>,
      <created by zg, POWCHK disabled, PULCHK disabled
       configuration hash MD5:
       00 E9 B6 7A A2 85 ED C7 34 08 36 98 17 FE 4E 26
       data hash MD5: 16K
       DC 34 0F 56 BB 9E 70 B0 A2 39 55 71 B7 02 74 FB>)
$$ ##END=
$$ 
$$ hash MD5
$$ 36 61 26 E7 8E 69 4E 07 67 F9 73 4A 37 83 6D 79
##$RELAX= 
##$RELAX= 
##$RELAX= 
##$RELAX= 
##$RELAX= 
##$RELAX= 
$$ Bruker specific parameters
$$ --------------------------
##$DU= <F:/spectra>
##$EXPNO= 1
##$NAME= <H-F>
##$PROCNO= 1
##$TYPE= <nmr>
##$USER= <she>
##$AMP= (0..31)
100 100 100 100 100 100 100 100 100 100 100 100 100 100 100 100 100 100 
100 100 100 100 100 100 100 100 100 100 100 100 100 100 
##$AQSEQ= 0
##$AQ_mod= 1
##$AUNM= <au_zg>
##$AUTOPOS= <>
##$BF1= 200.13
##$BF2= 200.13
##$BF3= 200.13
##$BF4= 200.13
##$BF5= 200.13
##$BF6= 200.13
##$BF7= 200.13
##$BF8= 200.13
##$BYTORDA= 1
##$CFDGTYP= 0
##$CFRGTYP= 5
##$CHEMSTR= <none>
##$CNST= (0..31)
1 1 145 1 1 1 1 1 1 1 1 1 1 1 1 1 1 1 1 1 1 1 1 1 1 1 1 1 1 1 1 1 
##$CPDPRG= <>
##$CPDPRG1= <>
##$CPDPRG2= <>
##$CPDPRG3= <>
##$CPDPRG4= <mlev>
##$CPDPRG5= <mlev>
##$CPDPRG6= <mlev>
##$CPDPRG7= <mlev>
##$CPDPRG8= <mlev>
##$CPDPRGB= <>
##$CPDPRGT= <>
##$D= (0..31)
0 1.2 0 0 0 0 0 0 0 0.06 0 0.03 0 0 0 0 0.0002 0 0 0 0 0 0 0 0 0 0 0 0 
0 0 0 
##$DATE= 1612168879
##$DBL= (0..7)
120 120 120 120 120 120 120 120 
##$DBP= (0..7)
150 150 150 150 150 150 150 150 
##$DBP07= 0
##$DBPNAM0= <>
##$DBPNAM1= <>
##$DBPNAM2= <>
##$DBPNAM3= <>
##$DBPNAM4= <>
##$DBPNAM5= <>
##$DBPNAM6= <>
##$DBPNAM7= <>
##$DBPOAL= (0..7)
0.5 0.5 0.5 0.5 0.5 0.5 0.5 0.5 
##$DBPOFFS= (0..7)
0 0 0 0 0 0 0 0 
##$DE= 6
##$DECBNUC= <off>
##$DECIM= 32
##$DECNUC= <off>
##$DECSTAT= 4
##$DIGMOD= 1
##$DIGTYP= 9
##$DL= (0..7)
0 120 120 120 120 120 120 120 
##$DP= (0..7)
150 150 150 150 150 150 150 150 
##$DP07= 0
##$DPNAME0= <>
##$DPNAME1= <>
##$DPNAME2= <>
##$DPNAME3= <>
##$DPNAME4= <>
##$DPNAME5= <>
##$DPNAME6= <>
##$DPNAME7= <>
##$DPOAL= (0..7)
0.5 0.5 0.5 0.5 0.5 0.5 0.5 0.5 
##$DPOFFS= (0..7)
0 0 0 0 0 0 0 0 
##$DQDMODE= 0
##$DR= 18
##$DS= 0
##$DSLIST= <SSSSSSSSSSSSSSS>
$$ [...]
##$SUBNAM2= <"">
##$SUBNAM3= <"">
##$SUBNAM4= <"">
##$SUBNAM5= <"">
##$SUBNAM6= <"">
##$SUBNAM7= <"">
##$SUBNAM8= <"">
##$SUBNAM9= <"">
##$SW= 16.9725356469052
##$SWIBOX= (0..15)
0 0 2 0 0 0 0 0 0 0 0 0 0 0 0 0 
##$SW_h= 3396.73913043478
##$TD= 16384
##$TD0= 1
##$TE= 0
##$TE2= 300
##$TE3= 300
##$TEG= 300
##$TL= (0..7)
0 120 120 120 120 120 120 120 
##$TP= (0..7)
150 150 150 150 150 150 150 150 
##$TP07= 0
##$TPNAME0= <>
##$TPNAME1= <>
##$TPNAME2= <>
##$TPNAME3= <>
##$TPNAME4= <>
##$TPNAME5= <>
##$TPNAME6= <>
##$TPNAME7= <>
##$TPOAL= (0..7)
0.5 0.5 0.5 0.5 0.5 0.5 0.5 0.5 
##$TPOFFS= (0..7)
0 0 0 0 0 0 0 0 
##$TUNHIN= 0
##$TUNHOUT= 0
##$TUNXOUT= 0
##$USERA1= <user>
##$USERA2= <user>
##$USERA3= <user>
##$USERA4= <user>
##$USERA5= <user>
##$V9= 5
##$VALIST= <valist>
##$VCLIST= <CCCCCCCCCCCCCCC>
##$VD= 0
##$VDLIST= <DDDDDDDDDDDDDDD>
##$VPLIST= <PPPPPPPPPPPPPPP>
##$VTLIST= <TTTTTTTTTTTTTTT>
##$WBST= 1024
##$WBSW= 4
##$XGAIN= (0..3)
0 0 0 0 
##$XL= 0
##$YL= 0
##$YMAX_a= 207857
##$YMIN_a= -227075
##$ZGOPTNS= <>
##$ZL1= 120
##$ZL2= 120
##$ZL3= 120
##$ZL4= 120
##$ABSF1= 10
##$ABSF2= 0
##$ABSG= 5
##$ABSL= 3
##$ALPHA= 0
##$AQORDER= 0
##$ASSFAC= 0
##$ASSFACI= 0
##$ASSFACX= 0
##$ASSWID= 0
##$AUNMP= <proc_1d>
##$AZFE= 0.1
##$AZFW= 0.1
##$BCFW= 1
##$BC_mod= 2
##$BYTORDP= 1
##$COROFFS= 0
##$CY= 11.3945322036743
##$DATMOD= 1
##$DC= 2
##$DFILT= <>
##$DTYPP= 0
##$F1P= 15.9154993809931
##$F2P= -4.1035820241983
##$FCOR= 0.5
##$FTSIZE= 0
##$FT_mod= 4
##$GAMMA= 1
##$GB= 0.15
##$INTBC= 1
##$INTSCL= 1
##$ISEN= 128
##$LB= 0.24
##$LEV0= 0
##$LPBIN= 0
##$MAXI= 10000
##$MC2= 0
##$MEAN= 0
##$ME_mod= 0
##$MI= 1.114404
##$NCOEF= 0
##$NC_proc= 0
##$NLEV= 6
##$NOISF1= 3.799351
##$NOISF2= 2.8
##$NSP= 1
##$NTH_PI= 0
##$NZP= 0
##$OFFSET= 15.70392
##$PC= 1
##$PHC0= -10762.91
##$PHC1= 12.00095
##$PH_mod= 1
##$PKNL= yes
##$PPARMOD= 0
##$PSCAL= 0
##$PSIGN= 0
##$REVERSE= no
##$SF= 200.130013532006
##$SI= 16384
##$SIGF1= 3
##$SIGF2= 2
##$SINO= 400
##$SIOLD= 16384
##$SREGLST= <1H.CDCl3>
##$SSB= 0
##$STSI= 0
##$STSR= 0
##$SW_p= 3612.71676300578
##$SYMM= 0
##$S_DEV= 0
##$TDeff= 0
##$TDoff= 0
##$TI= <>
##$TILT= no
##$TM1= 0
##$TM2= 0
##$TOPLEV= 0
##$USERP1= <user>
##$USERP2= <user>
##$USERP3= <user>
##$USERP4= <user>
##$USERP5= <user>
##$WDW= 1
##$XDIM= 8192
##$YMAX_p= 0
##$YMIN_p= 0
$$ End of Bruker specific parameters
$$ ---------------------------------
##NTUPLES= NMR FID
##VAR_NAME=  TIME,          FID/REAL,        FID/IMAG
##SYMBOL=    X,             R,               I
##VAR_TYPE=  INDEPENDENT,   DEPENDENT,       DEPENDENT
##VAR_FORM=  AFFN,          ASDF,            ASDF
##VAR_DIM=   8192,          8192,            8192
##UNITS=     SECONDS,       ARBITRARY UNITS, ARBITRARY UNITS
##FACTOR=    0.0002944,     1,               1
##FIRST=     0,             0,               0
##LAST=      2.4114304,     0,               0
##MIN=       0,             -227075,         0
##MAX=       2.4114304,     207857,          0
$$ Real data points
##PAGE= N=1
##DATA TABLE= (X++(R..R)), XYDATA
$$ [...]
2307h65J428j570J399p26K33J63n13J319j648J463q33O19p96J24R81j192J099
$$ -865 563 -1007 392 -334 -101 62 -451 868 -780 683 -150 469 -327 -203 778 -414 685
2324F85j010J275j249N75L32l28L62j011J751j710J123n05K61q6o82R57q93J022
$$ 685 -325 950 -299 276 608 280 642 -369 1382 -328 795 290 551 465 -217 740 -153 869
2342H69j355J201n76k48J44n5P24j418J443j023O06n41K47J34r35J316j191J137
$$ 869 -486 715 139 -109 35 -20 704 -714 729 -294 312 -229 18 152 -783 533 -658 479
2360D79j587J132k7m34L40p86J372j666J429j007Q53m06n00J048j331J643j281
$$ 479 -1108 24 -3 -437 -97 -883 489 -1177 252 -755 98 -308 -808 240 -1091 552 -729
2377g29J039j087N71P0m87J038j229J464j400J064m93M47l95n97J501j325J427
$$ -729 310 -777 -206 -136 -623 415 -814 650 -750 314 -179 268 -127 -724 777 -548 879
2394H79j227J183p92J79j70j33J431j887J530j476R86k37K23K02p25N42j071J158
$$ 879 -348 835 43 222 52 -81 1350 -537 993 -483 503 266 489 691 -34 508 -563 595
2412E95r05M44M68m99N50j008J227j135Q53q86J04K48l74R68j085R12q95R97n49
$$ 595 -310 134 602 103 653 -355 872 -263 590 -296 -192 56 -318 650 -435 477 -418 579 30
2431C0j68J14o58J058j324J219k74N7p40P23n97J72Q17q82J727k202Q70r25P64
$$ 30 -138 -24 -682 376 -948 271 -3 54 -686 37 -560 -388 429 -453 1274 -928 -58 -983 -219
2450b19M92j207J378j541J303q46R79m78m77Q13j202J958j637J646j672Q29k90
$$ -219 273 -934 444 -1097 206 -640 339 -139 -616 197 -1005 953 -684 962 -710 119 -171
2467a71l41J045j109J774j101K24p45L83N59m87R49q59J388k038R44m7l27K56
$$ -171 -512 533 -576 1198 97 321 -424 -41 518 31 980 121 1509 -529 415 368 41 297
2485B97m78J113r55Q13l63K8r21K77N92m66o1j03J228q40j97r8o25J107m78P99
$$ 297 -181 932 -23 790 427 455 -466 -189 403 -63 -124 -227 1001 161 -36 -134 -759 348 -130 669
2505F69o37o2K0P6Q2j65M28r98M43j264K564j114L9Ll0k8p13R96p03J081j509
$$ 669 32 -30 -10 66 148 -17 411 -587 -144 -1408 1156 42 81 84 54 26 -687 309 -394 687 -822
2526h22R05q73L90M49p17J737k173J693q35J42J380k204J104p83J390j182j58
$$ -822 83 -790 -400 49 -668 1069 -1104 589 -246 -104 1276 -928 176 -607 783 -399 -557
2543e57O39k10j27p1O84l25Q40q29k44O13R54o62q69J010j867R78J2k31P08m27
$$ -557 82 -128 -255 -326 358 33 873 44 -200 413 1367 705 -164 846 -1021 -43 -31 -262 446 19
2563A9Q6J73L6j37J32o9q35J931j341O80j278M72N25r27J093K18J23j221m76J14
$$ 19 105 278 314 177 309 240 -595 1336 -5 675 -603 -131 394 -533 560 778 901 -320 -796 -682
2583f82J400j384L39o0l73J023j164J552r47J14k7M88n57m09Q95j743J049n81
$$ -682 718 -666 -327 -387 -760 263 -901 651 -296 -182 -209 279 -278 -687 208 -1535 -486 -1067
2601a067O79m37J71L40K69j65j94P63p96L47j94O67J81n16q0k30P46j329J234
$$ -1067 -388 -825 -654 -314 -45 -210 -404 359 -437 -90 -284 383 564 48 -32 -262 484 -845 389
2620C89q25R0L0j13Q02l46J3K97P38j363N45Q23j319O13k68M25m86Q3K86O2R9
$$ 389 -436 -346 -316 -429 373 27 40 337 1075 -288 257 1080 -239 374 106 531 45 128 414 476 575
2641E75o20J570j719J24Q6K1J6k98Q51r86Q35j855J947o25j82j14j09R25j735
$$ 575 -45 1525 -194 -70 16 37 53 -245 606 -380 455 -1400 547 -78 -260 -374 -483 442 -1293
2660a293J271o90Q59k91l93P40q26Q15r24J088r46P36q14K59Q19q54L32j95M40
$$ -1293 -22 -712 147 -144 -537 203 -623 192 -732 356 -590 146 -668 -409 410 -444 -112 -307 133
2679A33r02J008o86R48L34j099L51m06J322j432K41N04j025J399j044J704j671
$$ 133 -769 239 -447 501 835 -264 87 -319 1003 -429 -188 316 -709 690 -354 1350 -321
2696c21J431j633J267l12j020J506j885J360j00n3Q62j501r6MJ806j805J706j667
$$ -321 1110 -523 744 432 -588 918 -967 393 293 240 1102 -399 -495 -491 1315 -490 1216 -451
2714d51J452J00n02n2r75J014j305J666k513J956l59K41K55k69q7r12R14r87L57
$$ -451 1001 1101 599 547 -428 586 -719 947 -1566 390 31 272 527 258 171 -741 173 -814 -457
2733d57j26P76J42j404J706j584J217n6j168J023p38J333j681J733r44O18j071
$$ -457 -583 193 335 -1069 637 -947 270 214 -954 69 -669 664 -1017 716 -228 390 -681
2750f81q1J251j538P92q16J120l87K25r57N59j1l49M07r93J818m96L77l48p78
$$ -681 -762 489 -1049 -257 -1073 47 -340 -115 -1072 -513 -524 -873 -466 -1459 359 -137 240 -108 -886
2769h86J309p50J83M21J77j190O73J72j43O42q29J262k358J925k86k06O13j489
$$ -886 423 -327 -144 277 454 -736 -63 109 -34 608 -221 1041 -1317 608 322 116 729 -760
2787g60J528q15J72l82J413m78o63J08j69K40m79L45o56P96k97J62P06j660J207
$$ -760 768 -47 125 -257 1156 678 15 123 -46 194 -285 60 -596 200 -97 65 771 -889 318
2806C18o47J41n96J223m12j74L40j12Q2p74P98k49J5J76n20J092j587N91O7M99
$$ 318 -329 -188 -784 439 27 -147 193 81 163 -611 187 -62 -47 129 -391 701 -886 -295 -228 271
2826B71p5o86K35k68R66j249J819j206M19k34l38M54j06p4n26J304j140M15K3
$$ 271 196 -490 -255 -523 443 -806 1013 -193 226 -8 -346 108 2 -72 -598 706 -434 -19 4
2845Dn3J87o28R42p19J359j172K98k85L11m43L14P83q26P55l43M09k12q73M32
$$ 4 -49 138 -490 452 -267 1092 -80 218 -67 244 -199 115 898 72 827 484 893 681 -192 240
2865B40j164J504m00j5k07O55j54R6L96j712R16l03R62q09m5Pl25K80l17P15j148
$$ 240 -924 580 180 165 -42 613 459 555 951 -761 155 -148 814 5 -40 -33 -358 -78 -395 320 -828
2886h28J433o19o24N27l51J020j273R83q71J070j273Q67J17m09O81j286N75J65
$$ -828 605 -14 -638 -111 -462 558 -715 268 -603 467 -806 61 178 -231 450 -836 -261 -96
2904i6M03l91L20K75n49K88j293J899q96N99j76r4N8m65J042j861J656m92K63
$$ -96 307 -84 236 511 -38 250 -1043 856 -40 559 383 289 347 -118 924 -937 719 227 490
2923D90l40n34O94r96J334j849J578k96J57Q9l13Q88p55N27p45r4K09K99N1n71
$$ 490 150 -384 310 -686 648 -1201 377 81 238 327 14 902 147 674 -71 -165 44 343 394 -177
2943a77O40j099J472j350R44m20j33Q64r95P03o98J07m03O09L60m51M35p60Q98
$$ -177 463 -636 836 -514 430 10 -123 741 -254 449 -249 -142 -545 64 424 -27 408 -352 546
2962E46j173J247r89P72j04n57O53q44J303j476Q08k69k21L9J31O08j131J234
$$ 546 -627 620 -369 403 299 -258 395 -449 854 -622 186 -83 -304 -265 -134 474 -657 577
2980E77j119R53o34O9o5j75J030j443J051o62Q97l30l94P90n73j09l80J307q35
$$ 577 -542 411 -223 -154 -219 -394 636 -807 244 -418 479 149 -245 545 -28 -137 -517 790 -45
2999d5j09K12nM8j55J129j435R17q34Q70l33k32M91j036Q75l88N65m20j25k20
$$ -45 -154 58 53 101 -54 1075 -360 557 -277 593 260 28 519 -517 358 -30 535 115 -10 -230
3019b30O92K72j323J076q31O96j166R17J64l42J71k89K11l80M25l02J16L02q58
$$ -230 462 734 -589 487 -344 352 -814 103 267 -75 96 -193 18 -362 63 -239 -123 179 -679
3038f79J153j095Q46p83O59m25o6O51r68Q26p36N46l50J07j57K64M02q01O15l77
$$ -679 474 -621 225 -558 101 -324 -390 261 -707 119 -617 -71 -421 -314 -471 -207 195 -606 9 -368
3058c68O03q70P55j26l58P32r14J015r97J120p36M98k95j43O54r60J404r96J17
$$ -368 235 -635 120 -6 -364 368 -546 469 -528 592 -144 354 59 -84 570 -390 1014 18 135
3077A35j1k36M97n96N82o32O50p21P09j63j84J79m08Q42r33J017p14R5n1k98O21
$$ 135 124 -112 385 -211 371 -261 389 -332 377 214 30 209 -199 643 -290 727 13 108 57 -241 380
3098C80n34N43p80J177r04k9J72m35P76q34P20p48P88q41M42l7k96P47p68O45
$$ 380 -154 389 -391 786 -118 -147 25 -410 366 -468 252 -496 292 -549 -107 -144 -440 307 -461 184
3118A84p76P26l74J20K83o87J021j254Q73n94M94n25J74N33n76N58n68P59p82
$$ 184 -592 134 -240 -120 163 -524 497 -757 116 -478 16 -509 -335 198 -378 180 -388 371 -411
3137d11K85Q2k65Q21q23P18o31O73o61M23J23n10K91j94P33r30O06o66M78J63
$$ -411 -126 -44 -309 512 -311 407 -224 449 -212 211 334 -176 115 -79 654 -276 330 -336 142 305
3157C05l15M04n60Q32r73P63k89r2R5m00O48n73O96q76P18l93L36r1n28N33m87
$$ 305 -10 394 -166 666 -307 456 167 75 170 -230 418 -155 541 -335 383 -10 326 235 -293 240 -247
3178b47P05p13L97j98m44P50n90O12q27O69n44K26M7pK44o08R44r20M78k90K19
$$ -247 458 -255 142 -56 -500 250 -340 272 -555 114 -430 -204 -157 -164 80 -528 416 -504 -26 -316 -97
3199i7m6j20J98m85Q50q24P26l47k2mk16Q99j019O60n95N56l64J19N78n03M22
$$ -97 -143 -263 -65 -550 300 -524 202 -145 -167 -171 -387 512 -507 153 -442 114 -250 -131 447 -56 366
3220C66o16O63o60N11l40J46K09l13N41j043Q72m37L96j84k07O14n62O77q83O78
$$ 366 -250 413 -247 264 -76 70 279 -34 507 -536 336 -101 295 111 -96 518 -44 633 -250 428
3240D28l89J25J6l73L37o61J261j086N23m25L27J64l90L30m47O50o82N39j92q8
$$ 428 39 164 180 -193 144 -517 744 -342 181 -244 83 247 -143 187 -260 390 -292 247 55 -33
3260c3r9l03P75p67M70m12M12l31J24L38o77N78m27N29o32L45L7j78M64n88O20
$$ -33 -132 -435 340 -427 43 -369 43 -288 -164 174 -503 75 -352 177 -455 -110 -73 -251 213 -375 245
3281B45p31M28j07J99L2n66P94r00R46n71N65k53KK23n96O69n61P83p65M91j79
$$ 245 -486 -58 -165 34 66 -500 294 -606 340 -231 334 81 83 306 -290 379 -182 601 -164 327 148
3302A48N1J51n00O99p96O58l15J87j67r4K91o56R06p20O70n40K67j15k51L85o31
$$ 148 199 350 -150 549 -247 411 96 283 116 22 313 -343 563 -157 513 -27 240 125 -126 259 -372
3323c72J009r63P54n44L98k74k96M82l84M63p50P47n02R0O1l5K21p17N74n07O76
$$ -372 637 -326 428 -116 282 8 -288 194 -190 273 -477 270 -232 -142 -81 -116 105 -612 -38 -545 131
3344A31l98j59M16m59O20p42Q03o36L89M5o3q0o2M19o73O07l15K41j69P2J2l46
$$ 131 -267 -426 -10 -469 151 -591 212 -424 -35 10 -53 -133 -195 224 -449 158 -157 84 -85 -13 -1 -347
3366c47N40m46N74k82J68O1m27M73n83P43r34Q41l13J3M7m78P54m10N97q35Q27
$$ -347 193 -253 321 39 207 268 -159 314 -269 474 -460 381 68 81 128 -350 404 -6 591 -244 583
3387E83n05L3Ql01N82p69Q71p31N66l20j60M03l82N36n01L56o98N59j14l71N58
$$ 583 78 111 119 -182 400 -369 502 -229 337 17 -143 260 -122 414 -87 269 -429 130 16 -355 203
3408B03m24N91r57Q45m86N6K66n68O92o23P03o45N41n68K03k5k55N50n23N37n71
$$ 203 -221 370 -587 258 -228 -172 94 -474 218 -405 298 -347 194 -374 -171 -196 -451 99 -424 113 -458
3429d58N83l50J63J38o85R20p97O58n04N07j37k00L26o19Q71l38K42n76O92l02
$$ -458 125 -225 -62 76 -609 311 -486 172 -332 175 38 -162 164 -455 416 78 320 -256 436 134
3449A34j10J79n37O26m27K62j54R8j34q4N04m87N81l65N91o25K09r5l50N56o12
$$ 134 24 203 -334 292 -135 127 -27 71 -63 -147 357 -130 451 86 677 52 261 166 -184 372 -240
3470b40P50o53M53m92K24Q2m76P41p90P13p33O05l38q9K72m00M37m40O39o34J10
$$ -240 510 -143 310 -182 42 124 -352 389 -401 312 -421 184 -154 -243 29 -371 66 -374 265 -369 -259
3491b59l2J38K66p04P45m56N11p23O63k50k60J58n1P25p86M25r1j78L05m56O19
$$ -259 -291 -153 113 -591 154 -302 209 -514 149 -101 -361 -203 -254 471 -315 110 19 -159 146 -310 309
3512C09q33O70l99N59l70K03O0p70J065n45P15q29N95l15l57M48k83L93l50M89
$$ 309 -524 146 -253 306 -64 139 199 -571 494 -51 664 -165 430 115 -242 206 -77 316 -34 455
3532D55n24N11J4l39K80n21M14n79P29n63M20n9m30N01q22P66o59O95r8j20k90
$$ 455 -69 442 456 117 397 -124 290 -289 440 -123 297 238 -192 309 -513 253 -406 289 191 71 -219
3553b19k98Q02r72O00k76N29m37M45J34o95N35o93M26l16j09j87J024j83r40P90
$$ -219 -517 285 -687 -87 -363 166 -271 174 308 -387 148 -545 -119 -435 -544 -731 293 110 -830 -40
3573d0n53Q37j13M67p66j59Q7J48J19j43M35r97L68L58j14J64k68M41m55M7K92
$$ -40 -593 244 131 598 -168 -327 -240 -92 27 -116 319 -678 -310 48 -66 98 -170 271 -184 -137 155
3594A55L72p12J95j1k42L22r4N90n42J58k84l33Q60q73P22n20M20M0r9Q7j39L19
$$ 155 527 -185 10 -1 -243 79 -15 575 33 191 -93 -426 434 -439 283 -237 183 223 124 211 72 391
3616C91n34O26n69K64K53j71p3k11L92l31K28l52L26k07l22N49o75O90m77L87
$$ 391 -143 483 -86 178 431 260 187 -24 368 37 265 -87 239 32 -290 259 -416 274 -203 184
3636A84k84m2j51J29J11n49P65l56M99o47K72n5k15K94l35L55n31N26r9J4m0j83
$$ 184 -100 -142 -293 -164 -53 -602 163 -193 306 -341 -69 -124 -339 -45 -380 -25 -556 -30 -129 -115 -155 -338
3658c38N62m44N26n54M05l80J04K38l52N43o53N58n71O70J08l25K5n05M96m30
$$ -338 224 -220 306 -248 157 -223 -119 119 -233 310 -343 215 -356 314 422 97 122 -383 113 -317
3678c17M66l26M83l73k29L84O2L17n89L02j19k40N06j6L77j323J402p83K74l84
$$ -317 149 -177 306 -67 -296 88 150 467 -122 180 61 -179 327 311 688 -635 767 -16 258 -126
3698a26L41n50n7P84p95J047r06N89n67M81m58p07J239o38Q14q84Q99o34l14N38
$$ -126 215 -335 -392 392 -403 644 -262 327 -240 241 -217 -924 315 -323 491 -393 506 -128 -442 96
3718I6l27R21p20m00L23K58j20k59n8K9L40o38R76l40K30n84J34N27p25j77j78
$$ 96 -231 690 -30 -430 -107 151 31 -228 -286 -257 83 -555 421 81 311 -273 -139 388 -337 -514 -692
3739f92Q33o21K71J48J69J79n26p69O23R04j120Q07p1m37R73J07j144J80J301
$$ -692 141 -480 -209 -61 108 287 -239 -1008 -385 519 -601 206 135 -302 671 778 -366 -186 1115
3758A115j394L27r5M51k12R1J133j181k11P76o46l57J55P98j370M68K91N76r81
$$ 1115 -279 48 -47 404 192 283 1416 235 24 800 154 -203 -48 750 -620 -152 139 715 -266
3777b66J39J01o34J306j095M38k15K87O78o18j32k57N86l98M23k25J0L69o77J148
$$ -266 -127 -26 -660 646 -449 -11 -226 61 739 121 -11 -268 318 -80 343 118 128 497 -180 968
3797I68r20p8n39P39kk24P11j313J435j576R22m94K54J45k03K52r13J061n31O70
$$ 968 48 -30 -569 170 168 -56 655 -658 777 -799 123 -371 -117 28 -175 77 -836 225 -306 364
3817C64q66L98J74k19L18k89L08n50N78l8O6J78p61K63n18N21K45L26k66K01J97
$$ 364 -502 -104 70 -149 169 -120 188 -362 216 178 244 422 -339 -76 -594 -73 172 498 232 433 630
3838F30j018Q57m00P77o46l42M06l79L61q21P67m30L66l33N05o1k81P6q9R4m64
$$ 630 -388 469 69 846 200 -142 264 -115 246 -575 192 -238 128 -205 300 239 -42 34 -55 39 -425
3859d25J67l8k12P55q86J128j063O89l35Q95n03m49K93l99L4j2P9j97O99m82l13
$$ -425 -258 -296 -508 247 -639 489 -574 115 -220 675 172 -277 16 -383 -349 -361 -282 -479 220 -262 -575
3880e75J72M14L0m59L48m97P81q04M02nm51R94o40J165j365J730j032l45J082
$$ -575 -403 11 41 -418 -70 -567 214 -590 -188 -193 -644 350 -290 875 -490 1240 208 -137 945
3899I45j552J065l39k6j08L26k29m12J79P29K86o13K20l71o31J07P40K91j294
$$ 945 -607 458 119 93 -15 311 82 -330 -151 578 864 251 471 100 -531 -424 316 607 -687
3918f87L33M59Q42j60r87J01n09J063n16L90o00j68J2K1P07l15J58J1k13m78P15
$$ -687 -354 105 947 787 -200 -99 -608 455 -61 329 -271 -439 -427 -406 301 -14 144 155 -58 -536 179
3939A79J11n11K63l71M13k50k18K62K19m52Q3M01J34l58%K03M3j68K69l51L05
$$ 179 290 -221 42 -329 84 -166 -384 -122 97 -355 -272 129 263 -95 -95 108 151 -17 252 -99 206
3960B06m30L99l38M73l84k70K89l55N47l23K84o67O46j60j36M37k63M41n91L57
$$ 206 -224 175 -163 310 -74 -344 -55 -410 137 -186 98 -569 77 -83 -219 218 -45 396 -195 162
3980A62o0K82j63l14N96n06J40l90O42n72L78n3k97L15j18K51n84L75j17j22L40
$$ 162 102 384 221 -93 503 -3 137 -253 389 -183 195 142 -155 160 42 293 -291 84 -33 -155 185
4001A85l69N11n87K78j92O15n57k89J52k88M55j81M42l13J64l72K67K12n74P96
$$ 185 -184 327 -260 18 -174 441 -116 -405 -253 -541 -86 -267 175 -138 26 -346 -79 133 -441 355
4021C55n87K92j39L23l73q6K22l15K13J49j11k22J18K52j60P34r65M61k90O27
$$ 355 -232 60 -79 244 -129 -215 7 -308 -95 54 -57 -279 -161 91 -69 665 -300 161 -129 498
4041D98p62L55r5j78N49n79K35p97N99k83M80O9j64N22l60R4j59K30l39K95K58
$$ 498 -264 91 -4 -182 367 -212 23 -774 -175 -458 22 91 -73 449 89 183 24 254 -85 210 468
4062D68p82M57r8J73n63K87L36l61M48m00J81o2K04j75Q4k26N7L22o86N44l87
$$ 468 -314 143 45 218 -345 -58 278 -83 365 -35 146 84 288 113 197 -29 28 350 -336 208 -179
4083a79K65l02L45l31p2M54j89K79q09O09k79J63L1l77N42l01M17n98N43k45o4
$$ -179 86 -216 129 -202 -274 180 -9 270 -539 70 -209 -46 -15 -392 150 -151 266 -332 211 -34 -98
4104i8P4l58L03m38O18n23L16RR5J92m23N27m37K68k92L82l38k1L16j79K62m31
$$ -98 -24 -382 -79 -517 101 -422 -106 -97 -2 190 -233 294 -143 125 -167 215 -123 -144 172 -7 255 -176
4126a76N25j7k58k49J96M41p89L89l42M33j71j1K65j26J31l14O71o30M44no52
$$ -176 349 332 74 -175 21 462 -327 62 -280 153 -18 -29 236 110 241 -73 598 -32 412 407 -245
4147b45L99m66K57n2K39o23M85k16P3M93n48R31r46K67j10J18l05L90j85l07K59
$$ -245 154 -312 -55 -107 132 -491 -6 -222 -149 344 -204 727 -219 48 -62 56 -249 141 -44 -351 -92
4168i2J56R6n78K10L60l57N5J33L63o96J74l34K66J204j440K14K45J53o36K26
$$ -92 64 160 -418 -208 152 -205 -150 -17 346 -350 -176 -510 -244 960 -480 -266 -21 132 -504 -278
4188b78k41P32l52j96J54j6K49o34R47k70K2O4k48o62P74L26m4m0o71O33k51k10
$$ -278 -519 213 -139 -335 -181 -197 52 -582 365 95 117 181 -67 -729 45 371 327 287 -384 249 -2 -212
4210b12K02m85Q81l76J8k29M60j02M04M54j014O21j39k70n9p73J196p34M2l15
$$ -212 -10 -495 386 10 28 -201 259 157 561 1015 1 622 483 213 154 -619 577 -157 -115 -430
4230d30Q09J08j449J320j560R35N91k40m59J9L59q5J50o18M2M76M92l14j40n3
$$ -430 379 487 -962 358 -1202 -267 324 84 -375 -356 3 -82 68 -550 -508 -32 460 146 6 -47
4250d7k58N36m21j64J05n85O70J16N00r41N1K34P72r87J136o21l33J38l01M71
$$ -47 -305 231 -190 -354 -249 -834 -164 -48 452 -489 -438 -204 568 -419 717 96 -237 -99 -400 71
4270G1J02J07P0J78j84r37J39K27P42j154J051n35J57O21j004O10l8L34q74K89
$$ 71 173 280 350 528 344 -593 -454 -227 515 -639 412 -123 34 655 -349 261 223 557 -317 -28
4290b8J42RN65o32O28p96J39r3J74l56l51J113p52L27N1M5l76J12k6m34L97L04
$$ -28 114 123 688 56 684 -112 27 -66 108 -248 -599 514 -238 89 140 185 -191 -79 -105 -539 -142 162
4312A62K8n80L51n77P13m77M97K19o22L53l56M25L4R4n20p2R03q06L33m37L08
$$ 162 190 -390 -39 -616 97 -380 117 336 -286 67 -289 136 170 264 -256 -328 575 -231 102 -335 -27
4333b7o51K77M56q84J158q78M90m01O59j2n8oL02m23P02m89m66Q52q49M40l00
$$ -27 -678 -401 55 -829 329 -549 -59 -460 199 187 129 123 425 2 704 215 -251 601 -248 192 -108
4354a08N9O33n84j27M53j30K15j23j95l62L73J64m40k63J132K3q54j51L32L9j56
$$ -108 -49 584 0 -127 326 196 411 288 93 -269 104 268 -172 -435 697 720 -134 -285 47 86 -70
4375g0M66p24M68P6k8p4j13l53N22l9o7k54N73n86M77n61N70o98K79j9o2J51M4
$$ -70 396 -328 140 216 188 114 1 -352 170 131 64 -190 383 -203 274 -287 283 -415 -136 -155 -217 -66 -22
4398b2J1j10J73k37K57j44k44Q6K60K04l17j3k81J46k9J10J94k11M69o40M01l01
$$ -22 -11 -121 52 -185 72 -72 -316 -230 30 234 -83 -96 -377 -231 -260 -150 44 -167 302 -338 63 -238
4420b38L32N0k00K24l38M43l62K82k66P5MO7L53m63L54l82J63k94K2L06o9J87
$$ -238 94 144 -56 168 -170 273 -89 193 -73 2 6 73 426 -37 317 -65 98 -196 -174 132 63 250
4442B50k38K51r14Q41j16j0J12l22K47l6K80k10K04m60lK17m16M75k28J70j96
$$ 250 12 263 -651 190 74 64 176 -146 101 65 345 135 339 -121 -124 93 -323 152 -76 94 -102
4463a02o6K57k57K37l69L49j10J79j41N5m07N06r2o83O97p2J38l45Q7J49n2K16
$$ -102 -168 89 -168 69 -300 49 -61 118 -23 32 -375 131 39 -644 53 -19 119 -226 -139 10 -42 174
4485A74k21O8l63M64l41L53j68j48M22k94M0k57O21k51l05M59j44J66n03N89l57
$$ 174 -47 21 -342 122 -219 134 -34 -182 240 -54 -14 -271 350 99 -206 253 109 275 -228 361 4
4506DJ1J2J26q6j41N36m68J86j52K31k49l3J94j9k7k52M44n13L96j87j31L24m06
$$ 4 15 27 153 67 -74 462 -6 180 28 259 10 -23 171 152 125 -127 317 -196 200 13 -118 206 -200
4529b00K38k39L53j88J3K06l63M75m27L04n18K39j51K26l30l4M97k19k6J69l9
$$ -200 38 -201 152 -36 -23 183 -180 295 -132 172 -346 -107 -258 -32 -362 -396 101 -118 -144 25 -14
4550a4N4l18M35k08J46m65M31m9K08k22J3J23n00M31q7K29k52J62K7l04K50k13
$$ -14 40 -278 157 -51 95 -370 61 12 220 -2 11 134 -366 65 -22 207 -45 117 144 -160 90 -123
4572a23M5l4L21j06J44j66j65M08j92Q2l77J51o0L11j09l59N53m49L43k01J98
$$ -123 -78 -112 209 103 247 81 -84 324 132 214 -163 -12 -72 239 130 -229 324 -125 218 17 215
4593B15q7j65M54o21L67j00K51j36K93p63J80L16j26j44R6j17KJ73K02p79N58
$$ 215 128 -37 417 -204 163 63 314 178 471 -292 -112 204 78 -66 30 -87 -85 88 290 -489 69
4614F9j28j74J94L6Q9k42Q2m3J20j28N8j38K69j09p1J59m09K26k93M70m13M75
$$ 69 -59 -233 -39 -3 86 -156 -74 -117 3 -125 -67 -205 64 -45 -116 43 -366 -140 -433 37 -376 99
4636I9n5l05L16k11L61n45J15O09m38J69j79P04j233M89K49L61L10o15j59k0J30
$$ 99 44 -261 55 -156 205 -340 -225 384 -54 115 -64 640 -593 -104 145 506 816 201 42 22 152
4657A52m52J75N57l43P8K91j09m57N87n04m7P5p3L47j28j80K18K04n38J11L7J10
$$ 152 -300 -125 432 89 167 458 349 -108 479 -25 -72 3 -70 277 149 -31 187 391 -147 -36 1 111
4679A11k55M80k57j59M2l7K14m23J14j39K90K46m01J34j91N25n05K51j88K07N6
$$ 111 -144 336 79 -80 -38 -75 139 -284 -170 -309 -19 227 -174 -40 -231 294 -211 40 -148 59 115
4700A15j48N1r1J41j44K52l37J44J7k74J80l09K80J14mJ6L8J18j59j65k14M92
$$ 115 -33 18 -73 68 -76 176 -161 -17 0 -274 -94 -403 -123 -9 -13 3 41 159 0 -165 -379 113
4722A13k37o6M75n58M36n26K97J18r1J96j22j30j01K82k89K67j55M23l14p4K50
$$ 113 -124 -190 285 -273 163 -363 -66 52 -39 157 35 -95 -196 86 -203 64 -91 332 18 -56 194
4743A94p2N9l15M28l45R8J08l85M82j28k13k9K65j28M2L9k11P2J55N2m00K35j5
$$ 194 122 181 -134 294 -51 47 155 -230 252 124 -89 -118 147 19 61 100 -111 -39 116 168 -232 3 -12
4766a2M6Q1J35j09m45L69j96K50l09r7L64j18k33R4L12j27K0N9k56K05j52K31
$$ -12 34 115 250 141 -304 65 -131 119 -190 -287 77 -41 -274 -180 132 5 25 84 -172 33 -119 112
4788A12k13J84P3k56Q9j39L8J70J82m03J0p4K83j23J93R3n07L28j23O9j58M41
$$ 112 -101 83 156 -100 -11 -150 -112 58 240 -163 -153 -227 56 -67 126 219 -288 40 -83 -14 -172 269
4810B69ro86N70j68r1K07r7M2J06j50j8K97m06N73p02N6M75m22K32j77K69k99
$$ 269 260 -426 144 -24 -115 92 -5 37 143 -7 -25 272 -134 439 -263 -207 268 -154 78 -99 170 -129
4832a29M29k19K50j50k8Q2o87N00J44j30q0j31m3K7L9MK53j95K05l37O6M54p13
$$ -129 300 81 331 181 153 235 -452 48 192 62 -18 -149 -192 -165 -126 -122 131 -64 141 -196 -130 324 -389
4855c89L54N2n3o13P94k2k50J29j22K55K14k80l6o9q1J94K90m67j79J70N97p12
$$ -389 -35 17 -36 -649 145 123 -127 2 -120 135 349 69 33 -36 -117 77 367 -100 -279 -109 488 -224
4877b24M3M00k08J70m97K15L56J35o45P82J43k31p12k42J086q07P6N2K09J48m30
$$ -224 -181 219 11 181 -316 -101 255 390 -255 527 670 439 -273 -515 571 -236 -160 -108 101 249 -181
4898a81j11J27M90P6p20L42j66P3R1o7K62J06l66M27r5p46Q42l81K8l59k1M66
$$ -181 -292 -165 325 401 -319 23 -143 -70 21 -46 216 322 -44 383 288 -458 384 3 31 -328 -349 117
4920A17k92n02J043K37r93O69p63L03K03m7k92n0L61k98M86l34k23qM78j70m89
$$ 117 -175 -677 366 603 -390 279 -484 -181 22 -25 -317 -367 -6 -304 182 -152 -375 -383 95 -75 -564
4941e64q8K0O18j02J64l91O60n4o40N16l96O50p99M07N51m52J72n27O73k66O8
$$ -564 -652 -632 -14 -116 48 -343 317 263 -377 139 -257 393 -406 1 552 100 272 -255 418 152 220
4962B20j77M9k58M38m74k1L68l34l8j55J71J81K09R3m83K18k70K93J24k96J72
$$ 220 43 92 -166 272 -202 -223 145 -189 -227 -382 -211 -30 179 272 -211 7 -263 30 154 -142 30
4983C0o17Q24j64j9j26J56L50l49J0o86N75k77N32j90K2J19k08K67l83m9j51K73
$$ 30 -587 237 73 54 -72 84 434 85 95 -591 -16 -293 239 49 71 190 -18 249 -134 -183 -334 -61
5005f1j5J34j7K8j54J78j7l46K69M59o14M09m43K54l92J24k5P34o31k6np9J02
$$ -61 -76 58 41 69 -85 93 76 -270 -1 458 -156 253 -190 64 -328 -204 -229 505 -126 -152 -157 -236 -134
5028a34lL44M6r4K09k69K16j39L9j62q0k99M98j32k10p6j20N50k28M0J43R7k96
$$ -134 -137 207 253 159 368 99 315 176 215 53 -27 -326 172 40 -170 -246 -366 184 -44 -4 139 236 -60
5051f0lj36o0N13n23K34j69Q54p92m7P10r33M33n0j8j40k65Q09m43L69p77O09
$$ -60 -63 -199 -259 254 -269 -35 -204 650 -142 -189 521 -412 21 -29 -47 -187 -452 357 -86 283 -494 115
5073A15r90J086k48j86N84n67L90j7q30L82Q95j45r00J0K50N59o80J033r91R53
$$ 115 -875 211 -37 -223 361 -206 184 167 -663 -281 614 469 -431 -421 -171 388 -292 741 -250 703
5093G03j357N73N28j486J191q73J082r67J443L02k168J480m69P37j247J6Q53m90
$$ 703 -654 -81 447 -1039 152 -721 361 -606 837 1139 -1029 451 -18 719 -528 -512 341 -149
5111a49J126n58o50K53K07k10K41m77l6N90o98l83L96Q43l48K81j28j52q82J98
$$ -149 977 419 -231 22 229 19 260 -217 -253 337 -361 -744 -348 495 147 428 300 148 -734 -536
5131e36R00j064N16J22l70J45K66j57K95j79L00n83O25k17q9o23O77q86K19J115
$$ -536 364 -700 -184 -62 -432 -287 -21 -178 117 -62 238 -345 280 63 -26 -649 28 -858 -639 476
5151D76l86m54n66J058k60J97R4m15O76l95m69P93p70N68N4k25l96R18M6j31j487
$$ 476 90 -364 -930 128 -132 65 159 -256 420 25 -444 349 -421 147 201 -24 -420 498 544 413 -1074
5172a074R65j25J45O59q5L19j377J514n28n32P05q5q53R35q99L9M29r51J468o05
$$ -1074 -109 -234 -89 570 485 804 -573 941 413 -119 586 501 -352 583 -316 -277 152 -799 669 64
5192F4m95O13j68j81J37l98O63Qj36M77n44K90l13n22J502j365p34R68m91N86
$$ 64 -431 182 14 -167 -30 -428 235 243 107 584 40 330 17 -505 997 -368 -1102 -134 -625 -39
5212c9O13l17k74K68n68M40n45N04n06M86r49L62P46J54J38j168J15Q7K85J39
$$ -39 574 257 -17 251 -317 123 -422 82 -424 62 -887 -525 221 375 513 -655 -540 -453 -168 -29
5232b9j83M04j105J09M03P23k50j78J34O19q70J34l93l23R94M21l94j33j13K95
$$ -29 -212 192 -913 -804 -401 322 72 -106 28 647 -223 -89 -482 -805 189 610 216 83 -30 265
5252B65l02N47K67p80R8k66L06k93L97m55J019n83k26n50N26n74K55R24j43q98
$$ 265 -37 510 777 -3 95 -171 135 -158 239 -216 803 220 -6 -556 -30 -604 -349 575 432 -466
5272d66j60M43N38p74j93K14P75n70Q4m20O7q8j88J005l53L56L3J87n06p16P84
$$ -466 -626 -183 355 -419 -612 -398 377 -193 -109 -529 -462 -550 -738 267 -86 270 303 490 -16 -732 52
5293E2j00o7K47n73J032r42O89n27Nl37J92o0J29o1j40k81J040k97j90j12l37
$$ 52 -48 -115 132 -441 591 -351 338 -189 -184 -521 -329 -389 -260 -321 -461 -742 298 1 -189 -301 -638
5314f38P26m78k39P42j45j26l82K63K68m86K85O36pq04P18J27L70j36p13k18J06
$$ -638 88 -390 -629 113 -32 -158 -540 -277 -9 -495 -210 426 419 -385 333 460 830 694 -19 -237 -131
5335a31l31N44L61j065L56J8K26l41N17k18M33l69o00R48j095Q59o9M17p31K68
$$ -131 -462 82 443 -622 -266 -248 -22 -363 154 -64 369 0 -600 348 -747 112 43 460 -271 -3
5355cK90k67K24k25n41K06j37O54n62O63n24j8j6N81j39m80O40p99M33l94J68
$$ -3 287 20 244 19 -522 -316 -453 201 -361 302 -222 -240 -256 325 186 -294 346 -453 -20 -414 -246
5376b46L19RK95j32l93K35J27n64L95m42L97J43m35M04m3K90n34j39q5K42J48
$$ -246 73 82 377 245 -148 87 214 -350 45 -397 0 143 -292 112 69 359 -175 -314 -399 -157 -9
5397iK1J3m70J78N27L1m33O2M18k64j81l49J015l05l99P32j080N33l5M41n14K8
$$ -9 12 25 -445 -267 260 291 -142 -80 338 74 -107 -456 559 254 -145 587 -493 40 5 446 -68 -40
5419d0P39j377J80K22M96l90N7O50j96k62j76L92l28K21j65k46J81L98J53p36
$$ -40 699 -678 -498 -276 220 -170 -113 537 341 79 -97 295 -33 188 23 -223 -42 356 509 -227
5439b27N95n13L99r44K03N76o04O85J6l36K95L84o28N02p72O75j71l93J178m97
$$ -227 368 -145 254 -690 -487 89 -515 170 186 -150 145 529 -99 403 -369 306 135 -258 920 423
5459D23o98j3K44o7j96J70M06o59K79R53j206O2K60l11n48J318o15K06l49k95
$$ 423 -275 -288 -44 -111 -307 -137 269 -390 -111 842 -364 -302 -42 -353 -901 417 -198 8 -341 -636
5479f36Q99n67M32P0J58l86j31R5l55P01j78L9M53j644J632j128N00P8m21O39
$$ -636 263 -304 128 198 356 -30 -161 -66 -421 280 102 141 594 -1050 582 -546 -46 32 -389 250
5499B50n77J153r73L50p69j52Q18j2K7k6L4M26m64Q8m07R28q99P0j42K32n0J02
$$ 250 -327 826 -147 203 -566 -718 100 88 115 89 123 549 85 173 -234 694 -205 -135 -277 -45 -95 7
5521Gj011R66J47n72Q07p91l4N03P47j246O45k13j38J25J067j088J57m02J536
$$ 7 -1004 -38 109 -463 344 -447 -481 22 769 -477 168 -45 -183 -58 1009 -79 78 -324 1212
5540A212j848O54m09K45j073J739r39J21M60m20P06j103O43j30M64l85K05J69
$$ 1212 -636 18 -391 -146 -1219 520 -419 -298 162 -258 448 -655 -12 -142 322 -63 142 311
5558C11k2l24k70N83J09m54l49J23N6l85P68l25K86q3j92j5k98Q1J04M15k11N09
$$ 311 289 -35 -305 278 387 -67 -416 -293 -237 -622 146 -179 107 24 -168 -183 -481 -400 -296 119 -92 417
5580D17j06q32J20J238j207R40l73r5n56M62j30K54n31J8N4P5L18k08l8O98j080
$$ 417 311 -521 -401 837 -370 570 197 102 -454 8 -122 132 -399 -381 -327 -252 66 -142 -180 518 -562
5601e62m35J553j001N44j81R74j200N28n32N4j56J85n47L19K81o6L8l40P7L09
$$ -562 -997 556 -445 99 -82 892 -308 220 -312 -258 -414 -229 -776 -457 -176 -242 -204 -544 -467 -158
5621a58J17p9L40o83K03p4O92r18M34J42L87o53J38J44j92M78j029R22p76O4k39
$$ -158 -41 -120 220 -463 -260 -334 358 -560 -126 16 403 -250 -112 32 -160 318 -711 211 -565 -501 -740
5642g40O71m26K5N33n48N18o91J097p44L37K13j256J114n88P31k54K61m96k86
$$ -740 -69 -495 -470 63 -485 33 -658 439 -305 32 245 -1011 103 -485 246 -8 253 -243 -529
5661e29N04k75m37J161m30j022R32L84k41r72R54L3o98J432p94K88l57K51n05
$$ -529 -25 -300 -737 424 -6 -1028 -96 288 47 -925 29 62 -636 796 2 290 -67 184 -321
5680c21M00K28j8n47M85n06n2N04l82K02l17L92j89J44O30l74j018O20m26J250
$$ -321 79 307 289 -258 227 -279 -331 173 -209 -7 -324 68 -121 23 653 279 -739 -119 -545 705
5700G05m13m22n75J037p4l66%m99J068m94L90l00r24R19M43j69n59K51l14O65
$$ 705 292 -130 -705 332 258 -108 -108 -607 461 -33 357 57 -867 52 495 326 -233 18 -296 369
5720C69n9n85K59j63P82p32k56J16N79k56M51j11n79j04r53J880j296J173K42
$$ 369 310 -275 -16 -179 603 -129 -385 -269 310 54 505 394 -185 -289 -1242 638 -658 515 757
5739G57j021K01j55P7N8JK09q01J317l17o69O7N87m45N16p41L96N4k2q50M58o0
$$ 757 -264 -63 -218 -141 -83 -82 127 -674 643 326 -343 -276 311 -134 382 -359 37 91 69 -781 -323 -383
5761c83L23j76K92J36j17m21L99O6o91P10k31L39P9n5m50K50p29O46n4P5l15M10
$$ -383 -60 -236 56 192 75 -346 53 119 -572 138 -93 246 325 270 -180 70 -659 -13 -67 8 -307 103
5783A03m15N42k85j2l52L06L12k07L35o61O14j16k00k31p9M06J03R1m27J43J15
$$ 103 -312 230 -55 -67 -419 -113 199 -8 327 -334 280 164 -36 -267 -346 60 163 254 -173 -30 85
5804H5k75L48k73O48p14L20j92k57M19j87N30m24l38O61k07l43K66k48N0n9J01
$$ 85 -190 158 -115 533 -181 139 -53 -310 109 -78 452 28 -310 351 144 -199 67 -181 -131 -190 -89
5825h9M6J43kj41K35N7j64k46l7P4J44j81M6j31O81j82m68K23K9K09n01lJ85q4
$$ -89 -43 100 98 -43 192 249 85 -161 -198 -124 20 -161 -115 -246 435 253 -215 8 37 246 -255 -258 -73 -157
5849a57J07M25j43Nn92K52K33j5j04j87P9L65k36J6m23M34K89n78P28q9l47K29
$$ -157 -50 375 232 237 -355 -103 130 115 11 -176 -97 268 32 48 -375 59 348 -230 498 409 62 291
5871B91n2k75M99l27L56k30m76L09k22Q3k10N18l30K20n0J40L43r43N00J68l36
$$ 291 239 -36 463 136 492 262 -214 95 -127 -44 -254 264 -66 154 104 244 587 -356 144 312 -24
5892b4L14l18oJ43M24p10O25m07l49K80p8k17N27Rk60l79N24K4j43k05K34p4k22
$$ -24 290 -28 -34 109 533 -177 448 41 -308 -28 -106 -323 204 213 -47 -426 98 122 -21 -226 8 -66 -288
5915b88L48M34o74L03L03o54M18n96K74N27n00j16K73n6k08o3m57Q22l4J56n67
$$ -288 60 494 -180 123 426 -228 190 -406 -132 395 -105 -221 52 -4 -212 -275 -732 90 56 212 -355
5936c55R08j257R95M1J18o7l53O9J64l42Q07q19l72O77m5l51K20j37J56j07J62
$$ -355 553 -704 291 332 450 383 30 99 263 -79 728 -91 -463 214 169 -182 38 -99 57 -50 112
5957A12k44K81j03q21k09J228p3k62M23q39P33L15m82M89j413O38M25k29m98P32
$$ 112 -132 149 46 -775 -984 244 171 -91 332 -507 226 541 59 548 -865 -227 198 -31 -529 203
5977B03m92P52m40K2L28p99J143p54n9L43n18n9L70k84N9j4Q43p4k72n63O8L71
$$ 203 -289 463 23 45 373 -426 717 -37 -96 247 -271 -330 40 -244 -185 -199 644 570 298 -265 -197 174
5999A74k62k05j36M52l30M07J09p46L41L10N46q29N46J37J46q64P74o94r4K57
$$ 174 -88 -293 -429 23 -307 100 209 -537 -196 114 660 -169 377 514 660 -204 570 -124 -218 39
6019C9J13m57L35o8p2p6k4K17P30j584J096n71r1p6P91j28p43P38m96O98r63Q97
$$ 39 152 -305 30 -38 -110 -186 -210 7 737 -847 249 -322 -413 -489 302 174 -569 169 -327 371 -592 305
6041C05k24K00m68r9P0K0J69J83k41L12J4O4jl27rj60Q2q6N20l37K53p75M95o
$$ 305 81 281 -187 -286 -216 -196 -27 156 -85 227 241 305 304 -23 -32 -192 -110 -196 324 -13 240 -535 -40 -46
6065d6O7k2k73P18l28K5k2q8k02J31m4j04k00P11K18k98k57j14j87J85K48Q7l7
$$ -46 21 -1 -274 444 116 141 119 31 -171 -40 -84 -188 -388 323 541 243 -14 -128 -315 -130 118 205 168
6088A68Q6J25k8l72j08L45j74o1J36k98j65N14k11M29n2k95j63J08K15m8MJ53
$$ 168 254 379 351 -21 -129 216 42 -19 117 -181 -346 168 -43 386 334 39 -124 -16 199 151 155 308
6110C08k70j38J38J52j30J7j29J04k03K49J91l75O8J38N0J30L8o07L39k05k21
$$ 308 38 -100 38 190 60 77 -52 52 -151 98 289 -86 -18 120 170 300 338 -269 70 -135 -356
6131c56O60k76k43LK4J97J07ln20N33p7l62J80L32j39l83N98n17J37r6P06m80
$$ -356 304 28 -215 -212 -188 9 116 113 -407 126 49 -313 -133 199 60 -323 275 -242 -105 -201 505 25
6153B5J54m17o1N39m01K58Q5j50n7M17o6k33K54m07L84K9P8p71L48j39J54J03
$$ 25 179 -238 -299 240 -161 97 182 32 -25 392 326 93 347 -60 324 353 431 -340 8 -131 23 126
6175A26n36O37k4p9R9n69Q40o06m0M17j75j77j9J77l70P80p87O03o39K84K36l11
$$ 126 -410 227 203 124 223 -346 494 -112 -152 265 90 -87 -106 71 -299 481 -306 297 -342 -58 178 -133
6197a33L13m54N30j8n50J68k09K27M58k32K79N9n22J59n32M80j40l6Km79O21k37
$$ -133 180 -274 256 238 -312 -144 -353 -126 332 100 379 438 -84 75 -457 23 -117 -153 -151 -630 -9 -246
6219b46n5L94k50M83m46L33m40j93O14k74J15q9q0l1p5l72Q86p86O87m60O00l12
$$ -246 -301 93 -157 326 -120 213 -227 -420 194 -80 35 -54 -134 -165 -240 -612 274 -512 175 -285 315 3
6241Cm41j38J46j92Q57o76K16Q73n69L53j4p29P08n3ql00jM3j08P50q64n64R2
$$ 3 -438 -576 -430 -622 235 -441 -225 648 79 432 418 -311 397 344 336 36 35 78 -30 720 -144 -708 -616
6264f16J061o63J99n93J384r44k9o17R51M6p00O06N54j272R74l28R72j095J35
$$ -616 445 -218 -19 -612 772 -172 -201 -818 133 179 -521 85 639 -633 341 13 985 -110 25
6283B5j5p5K68m43N31j225L70L19Q6N5K40r9k01O3K43l52K50k13lK66JK0L4o30
$$ 25 10 -65 203 -240 291 -934 -564 -245 -159 -104 136 37 -164 -101 142 -210 40 -173 -176 90 91 111 145 -485
6307d85M70J04J95o04P86l74j65J1M28M47J21q06J29q38K36L83Q0N65r37j38M85
$$ -485 -15 89 284 -320 466 92 -73 -62 366 813 934 128 257 -581 -345 38 118 683 -254 -392 93
6328I3l36j22P82m48N3o67J673j371M94J10o8k8J45j85k30k85J0j5M62j24J8K65
$$ 93 -243 -365 417 -31 22 -645 1028 -343 151 261 193 165 310 125 -105 -390 -380 -395 67 -57 -39 226
6350B26k1N3r48P17q56M35Q0O22l34l55R24qq88l75P49P80n31p3o13M75j17M25
$$ 226 205 258 -690 27 -829 -394 -314 308 -26 -381 543 535 -353 -728 21 801 270 197 -416 59 -58 367
6372C67j233J154r5j05k08l19P08m07K20o31L15J4M58l80j27K10j06K08LJ99q63
$$ 367 -866 288 193 88 -120 -439 269 -138 82 -549 -234 -220 238 -142 -269 -59 -165 43 46 245 -618
6393f18L81M03O9p01L40R16j221N04K99l66r1M3N74m95P62j63p82o11J317o54
$$ -618 -237 166 235 -466 -126 790 -431 73 372 6 -85 -42 532 37 799 636 -146 -757 560 -94
6413i4m42P10K94k3m81J5o35P97N1o7l08j59k00N09K16j90k4n28J71O0M07j09
$$ -94 -536 174 468 445 -36 -21 -656 141 192 125 -183 -342 -542 -33 183 -7 -31 -559 -388 -328 79 -30
6435c0K55j64r30J025k42J42K41l93J8k06M65r06P33Q5P7k80O83j006j07P12L97
$$ -30 225 61 -869 156 -86 56 297 -96 -78 -284 181 -725 8 93 170 -110 573 -433 -540 172 569
6456E69o09m05L70L09n30Q8o83Q14m5k83M93o42J078j039M32O47k65M86l22l05
$$ 569 -40 -445 -75 234 -296 -208 -891 -77 -122 -405 88 -554 524 -515 -83 564 299 785 463 158
6476A58K19L60p47m15l64J458l02p49K29k90P43k84j14k0l61N42K0k32n39P24
$$ 158 377 737 -10 -425 -789 669 367 -382 -153 -443 300 16 -98 -118 -479 63 83 -149 -688 36
6496C6n5m72N59l39N37o01N20K75J84q00r6P26o22K67j11l51N65o97L72j97M46
$$ 36 -19 -491 68 -271 266 -335 185 460 644 -156 -252 474 -148 119 8 -343 222 -475 -103 -300 146
6517A46Q1l62K44L3n98M32N66o32L98l11M74Q4l25q5k89M49l18L38m5l83Q9K26
$$ 146 227 -135 109 142 -456 -24 542 -90 308 -3 471 555 230 145 -144 305 -13 325 280 -103 -14 212
6539B12oOM6m30K04M3m4k16M36o62R7L70p55O89q6JQ3J81L1o7N04j054O48q14
$$ 212 206 212 258 -172 32 75 31 -185 251 -411 -314 56 -699 -10 -96 -95 -12 169 200 133 637 -417 231 -583
6563e83N38J62M5l95j83J25r6L0J17J72n34P49k17l39J1K88j00r3O16j89k27k4
$$ -583 -45 117 162 -233 -416 -291 -387 -357 -240 -68 -602 147 -70 -409 -398 -110 -210 -303 313 124 -103 -127
6585a27j38N25n56J92O1q3rl8P8n6J93k85n9K97M4l31J91M76o72L02J52k03n5
$$ -127 -265 260 -296 -104 -43 -126 -135 -173 -95 -151 42 -243 -302 -5 39 -292 -101 375 -297 5 157 -46 -101
6608a01K6K0k2M02n30K08j42K15r6Qk03J08J38J12o14K14J07K3J2j16P57n55N2
$$ -101 -75 -55 -77 325 -205 3 -139 76 -20 -12 -215 -107 31 143 -471 -257 -150 -127 -115 -231 526 -29 23
6631B3J80q7P5r4qJ06k36p4K44l82L54Q7l43N9J79j50K4j39J60P1K5o8o6j9N6
$$ 23 203 116 191 97 89 195 -41 -115 129 -253 101 188 -155 -96 83 -67 -43 -182 -22 49 74 6 -60 -79 -23
6656b3K96j62k20k30O04m67K96k41m46Q80m00K35k75J1M21m68K48p3j26J78J95
$$ -23 273 111 -109 -339 265 -202 94 -147 -593 287 -113 122 -153 -142 279 -189 59 -14 -140 38 233
6677B33m17N9L18k00P5J90j72J19Q5l24J32lk08K4j9N19n75L30l97K9K04j83K86
$$ 233 -184 -125 193 -7 68 258 86 205 290 -34 98 95 -113 -89 -108 411 -164 166 -231 -202 2 -181 105
6700A05j76K08k14K2O7L36o0k31j75K62K1R7j48L50j86j12k26k04L98o17M56k89
$$ 105 -71 137 -77 -55 12 348 288 57 -118 144 165 262 114 464 278 166 -60 -264 134 -483 -27 -316
6722c16K17j83M60j60J03o8J07K15l49q9p6k08j0M32K6k23p3j51M94n54L74k02
$$ -316 -99 -282 178 18 121 53 160 375 26 -63 -139 -347 -357 75 101 -122 -195 -346 148 -406 -32 -234
6744b34Q9K18O5k06p6NJ62k86k7P50p13J69O37m31M03l46M98r7m63K22l57J24
$$ -234 -145 73 138 -68 -144 -139 23 -263 -290 460 -253 -84 553 122 525 179 677 580 117 339 -18 106
6766A06l66O31K02r44K09Ro4l86J303r78M78k6l18J68j50P05k23q84L61K60l00
$$ 106 -260 371 573 -371 -162 -153 -217 -603 700 -278 200 174 -144 24 -126 579 356 -528 -167 93 -207
6787b07k29P73k61M68j82n30L86K31o45P27m36M01j129K15O38q4L82m65N62n05
$$ -207 -436 337 76 544 362 -168 218 449 -196 531 95 496 -633 -418 220 136 518 53 615 110
6807A10j17M4K02o9n16P66l76M62n85j92P36n03j51l85N59j6j03N6M06j022M94
$$ 110 -7 37 239 170 -346 420 44 506 -79 -271 465 -38 -189 -574 -15 -31 -134 -78 328 -694 -200
6828b00J66j18L39l46R1J42j36j73k06N25J33k21l46K12L09k01K75j55J61K26
$$ -200 -34 -152 187 -159 -68 74 -62 -235 -441 84 217 -4 -350 -138 171 -30 245 90 251 477
6848D77m76K75l82O0m8J86m41N03j63kL31m57n4L1L37m09L69o4m00M43j54L99
$$ 477 1 276 -106 -46 -94 92 -349 154 -9 -11 320 -137 -191 -160 177 -232 137 73 -327 116 -38 361
6870C61k28J49j91j61K0m5K77k04j8J55l51m7O29o55N18k51n1O54r14L99Q4k25
$$ 361 133 282 91 -70 -50 -95 182 -22 -40 115 -236 -283 346 -309 209 -42 -93 561 -353 46 130 -95
6892i5l28M56k57j74M23j93L95k08j16K22k39M9j65R1l58Q05k39n31M10PM03m98
$$ -95 -423 33 -224 -398 25 -168 227 19 -97 125 -114 -65 -230 -139 -497 308 69 -462 -52 -45 358 -140
6914a40J82j29J00O0l35L05j62M59m37J98j55L17j15N2j32M7R2m94J98L8L7P4
$$ -140 42 -87 13 73 -262 43 -119 340 -97 101 -54 263 148 200 68 115 207 -287 -89 -51 -14 60
6936F0j58L37m72M08j28J18m09M52j77p9J3k9K70j30k4j52L9l8J4J34k63L1J91
$$ 60 -98 239 -233 175 47 165 -244 208 31 -48 -35 -64 206 76 52 -100 -61 -99 -85 49 -214 -183 8
6959Hn4r4o1J94o0L06m31J83l30L39j39J33R7k64L06k00MM55l40m4M9r9O5J64
$$ 8 -46 -140 -201 -7 -67 239 -192 -9 -339 0 -139 -6 91 -173 133 -67 -63 392 52 8 57 -42 23 187
6983A87k63J62j85J27k51L70m5N9K9l23J91%M7j07j9J13k81K49j60O9J70j19j71
$$ 187 -76 86 -99 28 -223 147 102 161 190 -133 58 58 105 -2 -21 92 -189 60 -100 -31 139 20 -151
7006a51K73j78N3J95j27K61m89J46m2O6q5J15n8j23J45M2k13L00P7j23P3Q8l57
$$ -151 122 -56 -3 192 65 326 -163 -17 -59 7 -78 37 -21 -144 1 43 -170 130 207 84 157 245 -112
7029a12o6J37K17j97R5L3j04M6k25k7L00r1j61J6J01j08J35k05L73m7m49K37J50
$$ -112 -178 -41 176 -21 74 107 3 49 -176 -203 97 6 -155 -139 -38 -146 -11 -216 157 110 -339 -102 48
7052D8O4l42J34P5L6k68J38K64k81M21l55N2p4K47o9m5J49j17J2l7Mj18j37K27
$$ 48 112 -230 -96 -21 15 -253 -115 149 -132 289 -66 -14 -88 159 90 45 194 77 89 52 56 -62 -199 28
7076B8J01j50q4j02K37k11J22o1j05L43j79J14n3P3j95J98j67L8j14J08N2K52
$$ 28 129 -21 -105 -207 30 -181 -59 -120 -225 118 -61 53 0 73 -122 76 -91 -53 -167 -59 -7 245
7098B45m35M0K42p9j25J1l4J29R5r8J72j46N5J11p6o5l5k15J47j25L12k62K18
$$ 245 -190 -150 92 13 -112 -101 -135 -6 89 -9 163 17 72 183 107 42 7 -208 -61 -186 126 -136 82
7121H2k77L96j96J17Kk74K23J9o0j43Q2j85P4K84j34j02J19J22k69P8L7J44p5
$$ 82 -195 201 5 122 124 -150 73 92 32 -111 -29 -214 -140 144 10 -92 27 149 -120 -42 -5 139 64
7144F4j48K24k14J63m8JR8j48j57n4M08q4jk41Q8J4Km2J16M1j58K48r3J03p5r3
$$ 64 -84 140 -74 89 41 42 140 -8 -165 -219 189 105 104 -137 -49 -35 -33 -75 41 82 -76 172 79 182 107 14
7170A4j42N7J60k99K32k27K29J7k08K40j8Mj23J31n3J03k24j47J63J10R7j36M5
$$ 14 -128 -71 89 -210 22 -205 24 41 -167 73 55 59 -64 67 14 117 -107 -254 -91 19 116 -20 25
7193B5m3j56J74J34q0j44Kj35K39p0K04k47q8L40q6r6N6k47J20L97l24m1Q9j05
$$ 25 -18 -174 0 134 54 -90 -88 -223 16 -54 150 -97 -185 155 69 -27 29 -218 -98 299 -25 -66 23 -82
7217h2q3K64j09Q5J63k28J4j19J95j41p2L66j21j45r2K7j6j5K25j19k1pK7J26
$$ -82 -165 99 -10 75 238 10 24 -95 100 -41 -113 253 132 -13 -105 -78 -94 -109 116 -3 -24 -31 -4 122
7241A22j47O5k5L4j52j13Q7j4r3L73p2n5p0Q6j83M5o3L42k56K10np3m4q0j24Q6
$$ 122 -25 40 15 49 -103 -216 -129 -143 -236 137 65 10 -60 26 -157 -112 -175 167 -89 121 116 43 -1 -81 -205 -119
7267a19m7J31p6K98j43R4j62l00R7K47j40j14J84Q2kk26K50j62R7n6o5n4J62R4
$$ -119 -166 -35 -111 187 44 138 -24 -324 -227 20 -120 -234 -50 32 30 -196 54 -108 -11 -67 -132 -186 -24 70
7291G0j30O0Q1p2j15m1K82K6l9j0k12rMK27jJ2l93L15k08p8K33J23o27O42m71
$$ 70 -60 0 81 9 -106 -147 135 161 122 112 -100 -109 -105 122 121 133 -260 55 -153 -231 2 125 -502 140 -331
7316c31K23K50j26J37J15j14l30P4L00k86pK4J18m30P28k06jj91n2LLL69l82n65
$$ -331 -108 142 16 153 268 154 -176 -102 198 -88 -95 -71 47 -383 345 139 138 -53 -105 -102 -99 270 -112 -677
7340f77O53K9M58n51P7K44j03k71L82j28p0J13m3k7L88l96k45K27j75l4N62j99
$$ -677 -24 5 463 -88 -11 233 130 -141 241 113 43 156 113 86 474 78 -167 60 -115 -149 413 214
7362B14m5j79K7P2J95n52M18J5K71m03k7K80m30J64k06K25l47M57M9K54l52K65
$$ 214 169 -10 17 89 284 -268 150 165 436 33 6 286 -144 20 -186 39 -308 149 198 452 100 365
7384C65l11l58l08J061n02l2M56K27l28l84K55j4j75j07K09k96K01J8K99k44m70
$$ 365 54 -304 -612 449 -53 -85 371 598 270 -114 141 127 -48 -155 54 -242 -41 -23 276 32 -438
7405d38M77p7p96Q26l68O7l10R22k31J98k0j70k05L82j82R6j68j06O41J21l41
$$ -438 39 -38 -834 -8 -376 -309 -619 303 72 270 250 80 -125 257 75 171 3 -103 538 659 318
7426C18q78N42o1k10K40O37K20j410n76R31J63J45j02M60l4r23P07P8n09L94m03
$$ 318 -560 -18 -79 -289 -49 588 808 -602 -1178 -247 -84 61 -41 419 385 -538 169 247 -262 132 -271
7447b71O10j66k73N91j072M20K95R61o92q47N83J63k29l97M70P13p84k45J75O29
$$ -271 339 173 -100 491 -581 -161 134 1095 403 -444 139 302 73 -324 146 859 75 -170 5 634
7467F34l33O0l38J51Q1L31k17k9J56j47o14Q28K22j738J117m5l51L73l57O07R
$$ 634 301 361 23 174 255 586 369 340 496 349 -265 563 785 -953 164 119 -232 141 -216 391 400
7488D00J38j52m58N49J10l17l95o76L98P54K12q9k38O0k68M15o72P84L33n18n
$$ 400 538 386 -72 477 587 270 -125 -801 -403 351 563 474 236 296 28 443 -229 555 888 370 365
7509C65k75j68L52q49R20j08o07O62l88K32j01K21j28J51r7k38K18p08L39K80
$$ 365 90 -78 274 -575 345 237 -370 292 -96 136 35 256 128 279 182 -56 162 -546 -207 73
7529G3K35j31k8k93N20m50J00J71l55M74o9j22k60L6J68l09J24k38K64L2J53N2
$$ 73 308 177 149 -144 376 -74 26 197 -158 316 247 125 -135 -99 69 -240 -116 -354 -90 -58 95 147
7551A47j65L6l63L77r7q0K39k14K10n1r1q9K49p7J35o8l9R4l61M41l81J46j9J03
$$ 147 -18 18 -345 32 -65 -145 94 -120 90 39 -52 -141 108 31 166 98 59 153 -208 233 -148 -2 -21 82
7575H2o0O9m14M63l7J19J88n26j43L51K03k20j84L18p79L76J06J25L1o29L59l66
$$ 82 22 91 -323 140 103 222 410 -116 -259 92 295 75 -109 209 -570 -194 -88 37 68 -561 -202 -568
7597e68J190o38L0L80l07j51J10N2J64k57k92j86N35k80L55k69J93R9M48o74Q52
$$ -568 622 -16 14 394 87 -64 46 98 262 5 -287 -473 62 -218 137 -132 61 160 608 -66 786
7618G86j447K28M24kJ80l29k36Q19L9K58p76j28l7l14p6N72M30r07L16J8P0RJ051
$$ 786 -661 -433 -9 -11 169 -160 -396 423 462 720 -56 -184 -221 -535 -611 -39 391 -516 -200 -182 -112 -103 948
7641I48j548L30M71j06n45k93N15M12j14L78m53N17m37j04O6L49n00K90l57N61
$$ 948 -600 -270 201 95 -450 -743 -228 184 70 448 -5 512 75 -29 37 386 -114 176 -181 380
7661C80m80p3L23j82j57M70k64q7J79J25k54K51MJ52l10n26N03j8Oj59J71J58
$$ 380 -100 -173 150 -32 -189 281 17 -70 109 234 -20 231 235 387 77 -449 54 36 42 -117 54 212
7683B12k67N33n67Q9r1O0l82Q18p62N50k90lL44m29Q45m41n90K0N53k44k19M86
$$ 212 -55 478 -89 0 -91 -31 -413 405 -357 193 -97 -100 244 -185 660 219 -371 -351 202 -42 -261 225
7705B25Q8k89K53q37M11M7K40r15M78O09p66qN05L89n11M21l90P17o22L63m08
$$ 225 313 24 277 -560 -149 -102 138 -777 -299 310 -456 -464 41 430 -81 340 -50 667 45 408 0
7726@j36n07J004p00J28K60k82m61N61J107n46j69k11N37l01M55j17l80k35L85
$$ 0 -136 -643 361 -339 -211 49 -233 -694 -133 974 428 259 48 585 284 739 622 242 7 392
7746C92j55m79K69l90M54M02j385K78Q53l29%j37L44k13K90p7M51j59q41L87q5
$$ 392 237 -242 27 -363 91 493 -892 -614 239 -90 -90 -227 117 -96 194 117 568 409 -432 -45 -130
7767a30M59l90P9l7J29L68l2p00m43M82rK16j51J22n55M20n9l65M03j06N87l55
$$ -130 329 -61 18 -19 110 478 446 -254 -697 -215 -224 -8 -159 -37 -592 -172 -231 -596 -193 -299 288 -67
7789f7J90K9m22k3K69K91l19J016l56p23J6N84k94m91M19l02L10J43n62O4K92
$$ -67 123 152 -270 -293 -24 267 -52 964 608 -115 -99 485 191 -300 119 -183 127 270 -292 -228 64
7810F4p1J33j90J58j57J7J53J25l72N53o8j04L04p6r85M57K57j80K64n84M22j88
$$ 64 -7 126 -64 94 -63 -46 107 232 -140 413 345 241 545 469 -516 -59 198 18 282 -302 120 -68
7832f8L59p0k05k84j85N38p1M91n33n1J23j04K60l58K76j80K06j66l2J99Lj30
$$ -68 291 221 16 -268 -453 85 14 505 -28 -79 44 -60 200 -158 118 -62 144 -22 -54 145 148 18
7854A8J9r4M5L0Q4J67l57r0K18j87M91o16K27M56n94J0L66j66O4n39N33j07p3
$$ 18 37 -57 -12 18 102 269 -88 -178 40 -147 344 -272 -45 411 -183 -173 193 27 91 -448 85 -22 -95
7877i5J26L0j18L29l3j10k37o1K18r3K22k60K07k47J40k61L78k52J64k32nL23
$$ -95 31 61 -57 272 239 129 -108 -169 49 -44 178 -82 125 -122 18 -243 135 -117 47 -185 -190 133
7899A33j46Q03p16K95j21p1l03J28n66O69J34l67J08M55n69J45N46m36q9j19L80
$$ 133 -13 790 74 369 248 177 -126 2 -564 105 239 -128 -20 435 -134 11 557 121 32 -87 293
7920B93L74o46j4jJ6j45J17N63l88rL94j595J069K81m03L10k30K07r76Q76l34
$$ 293 667 21 7 6 22 -123 -6 557 169 160 554 -1041 28 309 -94 216 -14 193 -783 93 -241
7941b41N53l52L99n56j61J67K65m46P33k37l56N54n28L24m85J061n30J18o99L85
$$ -241 312 -40 359 -197 -358 -191 74 -372 361 124 -232 322 -206 118 -367 694 164 282 -417 -32
7961c2K91j48m55q1Q68m88p6N36J82j053J37O01n95J61L90k89o3q6mK45P2j90
$$ -32 259 111 -344 -425 443 -45 -121 415 597 -456 -319 282 -313 -152 238 -51 -114 -200 -204 41 113 -77
7983g7rq2P5L43k56k35M1M53l08o3K30k11oK80k15J00k63J20Q5j04J68Q0j45j95
$$ -77 -86 -168 -93 250 -6 -241 -200 253 -55 -118 112 -99 -105 175 -40 60 -203 -83 2 -102 66 146 1 -194
8007a94K32l4J52j49K36k88Q4k35J64j38O9L28k76Jj90M18j29J5k55K6K8jNk1
$$ -194 38 4 156 7 243 -45 39 -196 -32 -170 -101 227 -49 -48 -238 180 51 66 -189 -163 -135 -136 -131 -152
8031a52K79l21J86P8j78K64l05K83Q6j48m0l56M30j83R1m0N1p2J04Q0p0k8k71
$$ -152 127 -194 -8 70 -108 156 -149 134 220 72 32 -324 106 -77 14 -26 25 -47 57 137 67 39 -232
8054b32J61j5J25J37j42j35j8J27j02M9J12o7r8j3J51j75K07lj30K01j78k49L06
$$ -232 -71 -86 39 176 34 -101 -119 8 -94 -45 67 0 -98 -111 40 -135 72 69 -61 140 -38 -287 19
8077A9k0rN5M3M6k18P0m7k36M75k80K18k71K57k56K52M2m1j5l30K47p8J13%k53
$$ 19 -1 -10 45 88 134 -84 -14 -61 -297 178 -102 116 -155 102 -154 98 140 99 84 -246 1 -77 36 36 -217
8102b17M08J6l29KJJ99j10J2k1j16J21R3J48j79j32L64k20j62K34n8J8r7K90j75
$$ -217 191 207 -122 -120 -119 80 -30 -18 -39 -155 -34 59 207 28 -104 260 40 -122 112 54 72 -25 265 90
8126I0p0J00l82M46k18m0p5K08n9J20J76m26PJ42j39K04j11R8K8m0q2Q6k02J85
$$ 90 20 120 -262 184 -34 -74 -149 59 0 120 296 -130 -123 19 -120 84 -27 71 99 59 -23 63 -139 46
8150D6k45K26q2m8K51k23o2K34R0r5j19KJ21n8q6P4j40K24k40J9Q3n2K4m2O2j94
$$ 46 -199 27 -55 -103 148 -75 -137 97 187 92 -27 -25 96 38 -48 26 -114 110 -130 -111 -28 -80 -56 -98 -36 -230
8176b30L07l7k62J14J20j69j11N15l58qK47j18L92n69M56
$$ -230 77 40 -222 -108 12 -157 -268 247 -111 -119 128 10 402 -167 289
8191B89
$$ Imaginary data points
##PAGE= N=2
##DATA TABLE= (X++(I..I)), XYDATA
0@%%%%%%%%%%%%qJ6j6J6k4L2m0M8n6P2q7J02j19J36j59J86k13K48k86L27l74M24
$$ 0 0 0 0 0 0 0 0 0 0 0 0 0 -8 8 -8 8 -16 16 -24 24 -32 40 -47 55 -64 72 -87 99 -114 134 -152 175 -199 225
34B25m82N46o15O92p74Q63r65J077j198J328j469J627j799J985k188K412k658
$$ 225 -257 289 -326 366 -408 455 -510 567 -631 697 -772 855 -944 1041 -1147 1265 -1393
51a393K926l224L552l915M324m783N303n897O586p391Q351r523J0981j2861J5401
$$ -1393 1533 -1691 1861 -2054 2270 -2513 2790 -3107 3479 -3912 4439 -5084 5897 -6964 8437
66H437j9044K4792l5738R4412k45282J17651K62629k49254m0981J25228j3789
$$ 8437 -10607 14185 -21553 72859 -172423 -54772 207857 -41397 -82378 42850 29061
77B9061m2871n659k1613J42548j43688j2950J25241n5388r1929R0991M5037j38535
$$ 29061 -13810 -19469 -41082 101466 -42222 -55172 70069 14681 -77248 13743 58780 -79755
89g9755N4860O7140l4824p3353O1028N5092q2657J3192o876N8474l6018m0609
$$ -79755 -24895 42245 7421 -65932 -4904 50188 -32469 -19277 -26153 32321 -3697 -44306
101d4306L8907M0739m5226l4562P0628k9710J6211n0116K6329N5997o9440J469
$$ -44306 -5399 35340 -9886 -44448 26180 -3530 12681 -37435 -11106 44891 -24549 -23080
113b3080M7067o367o2619P7653l3304k5139M0481k3055J1366j0477J2497p865
$$ -23080 23987 17620 -44999 32654 -650 -25789 14692 -8363 3003 -7474 5023 -2842
125b842L3832n5159J9882N5913p5537K139M6135O631p3356N9685Q363l4600L0277
$$ -2842 30990 -24169 -4287 51626 -23911 -21772 24363 30994 -42362 17323 25686 -8914 21363
138B1363k5648J1704Q688l243m1645O1153j8351m0598N0296k2167O023q578N991
$$ 21363 -4285 7419 16107 12864 -28781 32372 14021 -26577 23719 1552 7575 -1003 4988
151D988j3117K3597k2596n347L3572m3241K8679n508m986j0974K2470o901k2441
$$ 4988 -8129 15468 -7128 -12475 21097 -22144 6535 1027 -3959 -14933 7537 636 -21805
164b1805K7267q697J0500l6412M0436k006k9438J4615M878O863k8550K9534j5240
$$ -21805 5462 -3235 7265 -29147 11289 9283 -20155 -5540 -662 6201 -22349 7185 -8055
177h055Q965n585N488j247j7167L7966l7701Q142J1442N656k5547R355K4018k4139
$$ -8055 910 -4675 813 -434 -17601 20365 -17336 -9194 2248 7904 -17643 -8288 15730 -8409
191h409R760j9129L7835k2999j1185K1840k653o862n147K9152l3427J9317k086
$$ -8409 1351 -17778 20057 -2942 -14127 7713 5060 -1802 -6949 22203 -11224 8093 6007
204F007l99m203k363K2220k9243J5671n043J4802j8691j546J3881m633J806k4632
$$ 6007 5608 1405 -958 21262 -7981 7690 2647 17449 -1242 -2788 11093 6460 8266 -16366
218a6366L6274j8263n51j953M266P788k0623J1575o400J8203l0136J6393O932
$$ -16366 19908 1645 1094 -859 3407 11195 -9428 2147 -4253 13950 -16186 207 7139
231G139j1824O517q689J8429k4814J6472n351J901r425M623J7858k8672J5954
$$ 7139 -4685 1832 -6857 11572 -13242 3230 -2121 -220 -9645 -5022 12836 -15836 118
244A18l606J4521k7536R183J8593k0395n87q78K6233l1410R579N062M853r157
$$ 118 -3488 11033 -16503 -7320 11273 -9122 -9709 -10587 15646 -15764 -6185 -1123 3730 -5427
258e427r998K8075k2476N753m388J8026j6185k180J7251j1269O544j4777K4063
$$ -5427 -15425 12650 -9826 -4073 -8461 9565 -6620 -8800 8451 -2818 3726 -11051 13012
271A3012j5980K322J895M402L100j9119K4399j1484M561j3438J6918k279j4486
$$ 13012 -2968 -646 1249 5651 8751 -10368 14031 2547 7108 -6330 10588 8309 -6177
284f177J3430m624J1107k5300K1783j722p050n194N811J3127k7682J6998k950
$$ -6177 7253 2629 13736 -11564 10219 8497 1447 -3747 2064 15191 -12491 4507 1557
297A557P817j7665R563R712j7054Q709p889J6792k0715R686J681k588k89m059
$$ 1557 9374 -8291 1272 10984 -6070 2639 -5250 11542 -9173 513 2194 -394 -683 -4742
311d742J5766k2470J4335o360P068j0011j505J4027j2849N586j0977K0471j5729
$$ -4742 11024 -11446 2889 -3471 3597 -6414 -7919 6108 -6741 -1155 -12132 8339 -7390
324g390K92L566K226J715j6538K1971j1400N576r263R441Q83q750J0332q992J2109
$$ -7390 -7098 -3532 -1306 409 -16129 5842 -5558 18 -9245 196 1079 -7671 2661 -6331 5778
339E778j5038J5686p625q03N701m749P751j3765J6065j0895O773p154O072M785
$$ 5778 -9260 6426 -1199 -2002 3699 -1050 6701 -7064 9001 -1894 4879 -2275 3797 8582
353H582j3072J1553r104J3397j5477P800k09j471K818q323J3276j3426J1578j0722
$$ 8582 -4490 7063 -2041 11356 -4121 3679 3470 1999 4817 -3506 9770 -3656 7922 -2800
367b800P644j680m270O780j0234J3441j2267Q509q471P881j947o652R864j0168
$$ -2800 4844 3164 -1106 5674 -4560 8881 -3386 5123 -3348 4533 2586 -4066 5798 -4370
381d370J0544j2936J1786o883J72K343m036O572j2782J3806j1431P130n458L814
$$ -4370 6174 -6762 5024 -1859 -1687 656 -3380 3192 -9590 4216 -7215 -85 -5543 -1729
395a729K780j1810J3104q638Q052j2679J0983j182m316L021k961J2184j8182J3230
$$ -1729 1051 -10759 2345 -6293 1759 -10920 63 -1119 -5435 -2414 -5375 6809 -11373 1857
409A857k539K425p111K032J1493j4434P623m631J1985j4426N948M820n727K626
$$ 1857 -682 1743 -5368 -3336 8157 -6277 1346 -3285 8700 -5726 222 5042 -685 1941
423A941o282J5068j5671O293j049M161l928l421J2613j2697N715o343J4074j1056
$$ 1941 -4341 10727 -4944 1349 300 4461 533 -2888 9725 -2972 2743 -3600 10474 -582
437e82j388Q064l960K967j0341J5436r095J434m197O740L98j2435J4476o949N016
$$ -582 -1970 6094 2134 5101 -5240 10196 1101 2535 -1662 5078 5476 -6959 7517 568 5584
452E584j1286R832j914o065M843l032O824j4496J3254m846N54m199J938P938j4370
$$ 5584 -5702 4130 2216 -3849 994 -2038 4786 -9710 3544 -1302 -748 -4947 -3009 4929 -9441
467i441R460m333P597j1742N571N950r086L376l864J3541j5619O249J639L12j771
$$ -9441 19 -4314 3283 -8459 -2888 3062 -6024 -2648 -6512 7029 -8590 -2341 -702 -390 -2161
482b161l187J1469j1875O339n121J0284p833k400Q554o375L844p227J3773j1788
$$ -2161 -5348 6121 -5754 585 -4536 5748 -2085 -4485 4069 -2306 1538 -5689 8084 -3704
496c704L136K878j41p55n775J2957j1763P826o434O259j381n246P937m774N861
$$ -3704 -568 2310 2169 1414 -4361 8596 -3167 4659 -1775 4484 3103 -2143 5794 1020 6881
511F881j1291J1334n527M58N97j295N736j0324J0957p926M859o006L502K363p603
$$ 6881 -4410 6924 1397 1855 2452 1157 6893 -3431 7526 -400 4459 -1547 1955 4318 -3285
526c285P093p297Q917j0935P675j746k350K313l351O581j1490J0395m672K509
$$ -3285 3808 -3489 5428 -5507 2168 422 -1928 385 -2966 3615 -7875 2520 -2152 357
540C57m098K036L728r224R321p411P439p241L828J5j033L401q341J0509q886O852
$$ 357 -3741 -1705 2023 -7201 2120 -5291 2148 -5093 -1265 -1250 -2283 1118 -7223 3286 -5600 1252
556A252n042L265m20k874P052r420R603p467N327m573L620P57m202Q093j0041
$$ 1252 -3790 -525 -945 -3819 3233 -6187 3416 -4051 1276 -3297 323 1080 -3122 4971 -5070
571e070R966o681M487l146J619K296n506P150p825R376p171L912j695J81L519
$$ -5070 4896 -1785 2702 -444 1175 3471 -2035 5115 -2710 6666 -505 3407 1712 1893 5412
586E412p043P790p466P279p054M678j168j602L283p362R531q301N181n186L956
$$ 5412 -1631 6159 -1307 5972 -1082 3596 2428 826 4109 -3253 6278 -2023 3158 -2028 1928
601A928r17m165P102p149O044p647R269o516j47M062m276L999p469J0481r428
$$ 1928 1011 -3154 3948 -3201 2843 -4804 4465 -2051 -2198 1864 -2412 1587 -5882 4599 -4829
616d829L591m74J590p6o023Q254n413M993p926Q123k895l697M770l746N424q533
$$ -4829 -1238 -1712 -122 -198 -6221 2033 -3380 1613 -6313 1810 -1085 -4782 -12 -3758 1666 -6867
632f867Q777n314L559k654j08N629q285O838n088P486q289M964K946n337K866
$$ -6867 1910 -3404 155 -2499 -2607 3022 -5263 1575 -3513 3973 -4316 648 3594 -1743 1123
647A123k350Q019j0551N856k10J609l480j081Q715r205L992k654P180p867J269
$$ 1123 -1227 6792 -3759 2097 1887 3496 16 -1065 7650 -1555 2437 -217 6963 -904 365
662C65N161n032L604p453J0688p574J472p52K893j185o723J0354o653L324n784
$$ 365 5526 494 4098 -3355 7333 -241 1231 479 3372 2187 -4536 5818 -835 2489 -3295
677c295P775l675m880O966l398L751j0019J0608m241q63j134K369L421j1403J0182
$$ -3295 4480 805 -4075 2891 -507 3244 -6775 3833 -408 -1271 -2405 -36 3385 -8018 2164
692B164m150L359p437M803L463o602L324k817P370r720O127n14r15q24j040Q298
$$ 2164 -1986 1373 -6064 -1261 2202 -4400 -1076 -3893 3477 -6243 -116 -630 -1545 -2369 -3409 4889
708D889j0894O585k447M706n921O53O294o227K604l544R310q977K453K153k87
$$ 4889 -6005 580 -1867 2839 -3082 -2429 3865 -2362 242 -3302 6008 -2969 -516 1637 1350
723A350N05n257R405p270M015m137M998j633l356N408m457N217p151O755l962
$$ 1350 1855 -3402 6003 -1267 2748 -1389 3609 1976 -1380 4028 -429 4788 -2363 4392 430
738D30N44O73r70L520p505Q525n486L315m658L586J791o528N566l831N291q325
$$ 430 974 1647 677 4197 -3308 5217 -269 3046 -1612 1974 3765 -2763 2803 -1028 4263 -4062
754d062N999j059r45K15k973P013q439O235n159M176k331q49L001n166O099o398
$$ -4062 1937 878 -67 148 -2825 4188 -4251 1984 -3175 1001 -1330 -2179 822 -4344 1755 -4643
770d643O098n681L659p41k054M100n426O793o767N363l502K637o18k384M642n011
$$ -4643 1455 -4226 -567 -1308 -3362 738 -4688 2105 -4662 701 -2801 -164 -782 -3166 1476 -3535
786c535O575p017N387k567J405O91l542N942n642M985n811O523k955j114K558
$$ -3535 3040 -3977 1410 -1157 248 939 -2603 3339 -2303 2682 -3129 3394 439 -675 1883
801A883k440N126p937P292m211K592k419J093K988n725N926n327N971o418L792
$$ 1883 -557 4569 -3368 3924 -287 2305 -114 979 3967 -1758 4168 -1159 4812 -1606 2186
816B186L40k701K876l790O058p483N699l149J985j874j566N907p193M376m198
$$ 2186 2526 -175 2701 -1089 4969 -2514 3185 36 2021 147 -1419 4488 -2705 1671 -2527
831b527O525o051K11L395k711J491n148Q967p110J668p65K086j53n087P546n518
$$ -2527 3998 -2053 -1842 1553 -1158 333 -4815 4152 -2958 -1290 -2055 31 -122 -5209 2337 -3181
847c181L557n292O473k635k760M078k389L652p342Q080l693L34j015K096K308
$$ -3181 376 -4916 1557 -1078 -3838 240 -2149 1503 -5839 2241 -1452 -1118 -2133 -37 2271
862B271p604P363l078L332o419N096J737m984K702j548O242r121N144L89K27k506
$$ 2271 -5333 2030 -1048 2284 -4135 961 2698 -2286 416 -1132 5110 -4011 1133 1522 1749 -757
878g57k23O571p957M843k903M477m742J081L540m237K676l777P458p361K220O52
$$ -757 -980 5591 -2366 2477 -426 4051 -691 390 3930 -307 2369 -1408 6050 -1311 909 1561
894A561R01r81m336Q503o659J924k944N461k722l253M441k640K893p133P688l112
$$ 1561 2462 1481 -2855 5648 -1011 913 -2031 3430 708 -2545 1896 -744 2149 -4984 2704 -408
910d08q27k08O41K819o961O871m129K450m028L862J58m210N071l701M122o100
$$ -408 -1235 -1443 -802 2017 -4944 1927 -2202 248 -3780 82 240 -3970 1101 -2600 1522 -4578
926d578N134j388o05m04p90N751p717M935k512M010m574R50M124m760L592l939
$$ -4578 556 -832 -1437 -1841 -2631 3120 -4597 338 -2174 1836 -2738 -1788 2336 -2424 1168 -2771
942b771O240n514K616l18j95J581m285O874o216M038k754L019q88k359M695m698
$$ -2771 3469 -2045 571 253 58 1639 -2646 4228 -1988 2050 -704 2315 1427 -932 3763 -935
958i35M340n100N901m518J639P76k204K935m917N930m474L304l256K025P08l693
$$ -935 3405 -1695 4206 -312 1327 2103 -101 2834 -2083 3847 -627 2677 -579 1446 2154 -1539
974a539M147m391N350n697L995k163k13J389k765M189m898M169m883M008j574
$$ -1539 2608 -1783 3567 -2130 1865 -298 -511 878 -1887 2302 -2596 1573 -3310 698 -876
989h76l16J828l412M329n118M349l086K396j353j032L393m443M437m376M400l815
$$ -876 -1192 636 -2776 1553 -3565 784 -2302 94 -1259 -2291 1102 -3341 1096 -3280 1120 -2695
1005b695J272J559k430K871m026N962n383L213j413J291k2l041N468m534L733
$$ -2695 -1423 136 -2294 577 -3449 2513 -2870 343 -1070 221 199 -2842 2626 -1908 1825
1020A825m333N353k125k186K672j076L260o227O027k660J121k275J229L227o048
$$ 1825 -2508 2845 720 -1466 1206 130 3390 -2837 3190 530 1651 -624 605 3832 -2216
1035b216N438l488L748m661K780J127l158K894k538L874o415M970j615j37j034
$$ -2216 3222 -266 3482 -1179 1601 2728 -430 2464 -74 3800 -2615 2355 740 603 -431
1050d31m71N163o756M468l385M289m811J273K816l022J187l787O436n040J545
$$ -431 -902 4261 -2495 1973 -1412 2877 -1934 -661 2155 -867 320 -3467 2969 -2071 -526
1065e26n94J253k26l565N827m787K811l732M836k419j841L540k368K507n096O307
$$ -526 -1120 133 -93 -3658 2169 -2618 193 -3539 1297 -1122 -2963 577 -1791 716 -4380 1927
1081A927l519M97n90J351J689n766O215k984K442m494M273P79l477K411j346M255
$$ 1927 -1592 -1095 -1685 -334 1355 -4411 1804 -1180 1262 -3232 1041 1820 -1657 754 -592 3663
1097C663o908M624l98J95j511k67M953o577M431k611L594l929J265K638l818K516
$$ 3663 -3245 1379 981 1176 -335 -602 4351 -2226 2205 -406 3188 -741 524 3162 -656 1860
1113A860l010N621n737K181N49l4n94k657O161n264J920k421L925k142k210L805
$$ 1860 -1150 4471 -1266 915 1464 1430 836 -1821 4340 -924 996 -1425 2500 358 -1852 1953
1129A953k503K381m990N875l518P5K82K53J573n114N501m003K666k519J809l5
$$ 1953 -550 1831 -3159 2716 -802 -727 -445 -192 1381 -3733 1768 -2235 431 -2088 -279 -314
1145c14k880L820k986L469m746M386j730m94P16j448L963n227M331k609K679k665
$$ -314 -3194 626 -2360 1109 -3637 749 -981 -1475 -759 -2207 1756 -3471 860 -1749 930 -1735
1161a735N34K383k940K909l687M872l952K009j62k79J364k810M298m344L719l071
$$ -1735 -1201 1182 -1758 1151 -2536 2336 -1616 393 231 -48 1316 -1494 2804 -1540 2179 -892
1177h92K204n82r40K644l839M277l712L431l011J477L20j655K967m115M048l356
$$ -892 1312 730 -210 2434 -1405 2872 -840 2591 -420 1057 1377 -278 2689 -1426 2622 -734
1193g34L497k437l7J247k210K916l796M245m074K371j441P67J420l542L691l454
$$ -734 2763 326 289 1536 -674 2242 -1554 2691 -1383 988 -453 314 1734 -1808 1883 -1571
1209a571L146l756K411j88j083J133k462M074m673L328j736J538j356o29K987
$$ -1571 1575 -2181 230 42 -1041 92 -2370 1704 -2969 359 -1377 161 -1195 -1824 1163
1224A163m012L463l030L242k938J378J101k168J883k562M702m582K136o56J330
$$ 1163 -2849 614 -2416 826 -2112 -734 367 -1801 82 -2480 2222 -2360 -224 -880 450
1239D50n92k286M423l524K717l480M292k136p45K246j553K222m559N079k621J050
$$ 450 -142 -2428 1995 -1529 1188 -2292 2000 -136 -881 1365 -188 2034 -2525 2554 -67 983
1255I83r77R91R64l616M209k763K472l423K835o7k377K092j179K879n436M525
$$ 983 6 997 1961 -1655 2554 -209 2263 -1160 1675 1608 -769 1323 144 3023 -2413 2112
1271B112j373O7r22k09L338m862L171k017L020l985J191J933k472J327k483M992
$$ 2112 739 806 -116 -325 3013 -1849 1322 -695 2325 -1660 -469 1464 -1008 319 -2164 2828
1287B828m986J721j84N89m87k044M586m154K089j995L209k413j210L218k234J583
$$ 2828 -2158 -437 -621 -32 -519 -2563 2023 -2131 -42 -2037 1172 -1241 -2451 767 -1467 116
1303A16l374N148l342J08K52J027J014m224M703k649K024k963K955l7k268K071
$$ 116 -3258 1890 -1452 -1344 -1092 -65 949 -3275 1428 -1221 803 -2160 795 758 -1510 561
1319E61j173K766m505L511j031L11m02l74K699m200L812j900J779k625J479J359
$$ 561 -612 2154 -2351 1160 129 440 38 -336 2363 -1837 1975 75 1854 -771 708 2067
1335B067k524J951j974L529m184K358k05j84Qj798L840l779K170k209K549j361
$$ 2067 -457 1494 -480 3049 -1135 1223 1018 834 842 -956 2884 -895 1275 -934 1615 254
1351B54j134K371k323K382l351L690k899O99L39m00J164l211L911l223K021j593
$$ 254 -880 1491 -832 1550 -1801 1889 -1010 -311 28 -372 792 -2419 1492 -1731 290 -1303
1367a303J531k75k085K858k488K665l306K500j095L39J81j126K588l429L226k775
$$ -1303 228 -47 -2132 726 -1762 903 -2403 97 -998 -659 -478 -1604 984 -2445 781 -1994
1383a994K665j661j94J451j782K452k924L248k447J762r62J13J603k746L315l196
$$ -1994 671 -990 -1184 267 -1515 937 -1987 1261 -1186 576 -386 -273 1330 -1416 1899 -1297
1399a297K834k257J510j79n95J465k489L308k937K596j800Q31k21r84K365k904
$$ -1297 1537 -720 790 611 16 1481 -1008 2300 -637 1959 159 990 769 -215 2150 -754
1415g54K508k306K503j735r5J016j280J542l053L841k870J466j027O22M12k270
$$ -754 1754 -552 1951 216 121 1137 -143 1399 -1654 2187 -683 783 -244 378 790 -1480
1431a480K624j856J966l011K421o08q48Q03j421K582l471K708j516J209j241K74
$$ -1480 1144 -712 1254 -1757 664 56 -792 11 -1410 1172 -2299 409 -1107 102 -1139 -865
1447h65J848l532K701j918K789l037J247J300j621P36j354L442m004K211m09O44
$$ -865 983 -2549 152 -1766 1023 -2014 -767 533 -1088 -352 -1706 1736 -2268 -57 -466 178
1463A78n29j381L291k659J822k030L050j890n16J729j123J047k548L859k458P15
$$ 178 -351 -1732 1559 -1100 722 -1308 1742 -148 -664 1065 -58 989 -1559 2300 -158 557
1479E57m14P09O86k943L644k097J034k224K742m68j817J848r12J958l859L187
$$ 557 143 852 1538 -1405 2239 142 1176 -1048 1694 1226 -591 1257 345 2303 -1556 1631
1495A631j214L97r74K16J769l148K439j861K323k748J037J304j980R05j484L162
$$ 1631 417 814 -160 56 1825 -1323 1116 -745 1578 -1170 -133 1171 -809 96 -1388 1774
1511A774l560J741q0j4l70j428L741l638J824j749K675k125o34K284j490J085
$$ 1774 -1786 -45 -125 -139 -509 -1937 1804 -1834 -10 -1759 916 -1209 -1843 441 -1049 36
1527C6k131L214k345N46O1L1Q00k380L288k287J711j873J641p8j147J490j363
$$ 36 -2095 1119 -1226 -680 -619 -588 212 -2168 1120 -1167 544 -1329 312 234 -913 577 -786
1544g86K300l267L188j327K1P4l53J834l050K704j342J465j792Q93R00j904J812
$$ -786 1514 -1753 1435 108 129 203 -150 1684 -1366 1338 -4 1461 -331 562 1462 -442 1370
1561A370k019K892k783J561l45q3K57j358K458k549K131j831J476j043l98J430
$$ 1370 -649 2243 -540 1021 676 593 850 -508 1950 -599 1532 -299 1177 134 -264 1166
1577A166j883K024k907K839j697L99J12p26J492k244K471k312J987j995J242J6
$$ 1166 -717 1307 -1600 1239 -458 -59 53 -673 819 -1425 1046 -1266 721 -1274 -32 -16
1593a6j038J458j960K012k273J904j161L10O27j284J921j861J793k020J746o96
$$ -16 -1054 404 -1556 456 -1817 87 -1074 -764 -137 -1421 500 -1361 432 -1588 158 -538
1609e38k45J113j382K031k827K525j489Q83l66n2J103j858K173j882K029j976
$$ -538 -783 330 -1052 979 -1848 677 -812 71 -295 -347 756 -1102 1071 -811 1218 -758
1625g58J185K14o98J119j795K875k685J713j244J367q17p12K138j968J233j541
$$ -758 427 641 -57 1062 -733 2142 -543 1170 -74 1293 476 -236 1902 -66 1167 -374
1641c74K232j751J56R23j097J298k447K823j927M47l91M21Q3j783K727k292J707
$$ -374 1858 107 263 1186 89 1387 -1060 1763 -164 283 -108 313 396 -1387 1340 -952 755
1658G55j917J956j049m21R07q62J599k662K046j116P72r77k18J613k243K150j445
$$ 755 -1162 794 -255 -676 231 -631 968 -1694 352 -764 8 -969 -1187 426 -1817 333 -1112
1675a112J474k146J573L84j148O02l59J867k754J051L78j01q0j380K930k653K060
$$ -1112 362 -1784 -211 173 -975 -373 -732 1135 -1619 -568 -190 -291 -371 -1751 1179 -1474 586
1692E86j199J764j877M02K038k143J417k585L234j800K80J01O47J27k591K988
$$ 586 -613 1151 -726 -324 1714 -429 988 -1597 1637 -163 117 218 865 992 -1599 1389
1708A389j331J143k018K044m17j259J872j073J579l649L098j721Q68l96m03J435
$$ 1389 58 1201 -817 1227 810 -449 1423 350 1929 -1720 1378 -343 525 129 -274 1161
1724A161k799L298k153R61j760J224P58j884J263j118K810k749R52j57J12o9j257
$$ 1161 -1638 1660 -493 468 -1292 -68 690 -1194 69 -1049 1761 -988 -36 -193 -81 -150 -1407
1741a407K688k523P93m26J819j649m62J819j302O91j562K476k377Q31N4m12P53
$$ -1407 1281 -1242 -449 -875 944 -705 -1167 652 -650 41 -1521 955 -1422 -591 -537 -949 -196
1758a96j409K817j878J217j662J629p25q46J654j733K359j892J331q03N70q36
$$ -196 -1605 1212 -666 551 -1111 518 -207 -1053 601 -1132 1227 -665 666 -137 433 -403
1774d03m47J690k307K398j468J499j007K54O00j094J104j459J577o86M96k71j88
$$ -403 -850 840 -1467 931 -537 962 -45 209 809 -285 819 -640 937 251 747 476 288
1791B88P39j383J724j983J685j403J446r91n0O55j405K459k621J913j634J321
$$ 288 1027 -356 1368 -615 1070 -333 1113 122 72 727 -678 1781 -840 1073 -561 760
1807G60o18n98J338k330K297j950J889j771M49Q15j268J260j937K229k151J818
$$ 760 142 -456 882 -1448 849 -1101 788 -983 -534 281 -987 273 -1664 565 -1586 232
1823B32j203O84J45j169J726j690J850j955J507m47m23Q27r27J577k328K479j509
$$ 232 -971 -287 -142 -1311 415 -1275 575 -1380 127 -320 -743 84 -843 734 -1594 885 -624
1840f24P48p85L69Q52j705J842j401J690j668J218K63j064J112j714K256k049
$$ -624 124 -661 -292 560 -1145 697 -704 986 -682 536 799 -265 847 -867 1389 -660
1856f60J417n95P40k54r11J947k034J657j754K065j599M7R82o89P63j978K457
$$ -660 757 162 902 648 -263 1684 -350 1307 -447 1618 19 66 1048 359 1122 -856 1601
1873A601k125R28l80O68l3j805K250j550J133j484J746p72q21R30q06J210k487
$$ 1601 -524 404 24 692 659 -1146 1104 -446 687 -797 949 177 -644 286 -520 690 -1797
1890a797K248q51K17n15L0J343k231J970j350J573j965Q36M52r76R41j056J797
$$ -1797 451 -400 -183 -698 -668 675 -1556 414 -936 637 -1328 -492 -40 -1016 -75 -1131 666
1907F66k308J750o62L20n0n60J828k114J530j255J711j210j94J192j010P83j589
$$ 666 -1642 108 -554 -234 -284 -844 984 -1130 400 -855 856 -354 -548 644 -366 417 -1172
1924a172K810k116R04l93K03N49j662K392j929J421j667J626j51j011J267j267
$$ -1172 1638 -478 426 33 236 785 -877 1515 -414 1007 -660 966 815 -196 1071 -196
1940a96J556k379K082p28J27r3n13J408k206K161j482J083j371P49N58j652J520
$$ -196 1360 -1019 1063 335 462 369 -144 1264 -942 1219 -263 820 -551 198 756 -896 624
1957F24j475J831k125J285l77J9K09j191K206k040J592j759J515j062j27J264
$$ 624 -851 980 -1145 140 -237 -218 -9 -1200 1006 -1034 558 -1201 314 -748 -875 389
1973C89j482J414j809K152j697P65j66k9L28r58J698j697J402j062P64q0p57J542
$$ 389 -1093 321 -1488 664 -1033 -268 -434 -463 -135 -1093 605 -1092 310 -752 12 -68 -825 717
1991G17j878J865j834J804j152O36J6p60J726j792J763j941J505p90M31O85j219
$$ 717 -1161 704 -1130 674 -478 158 174 -586 1140 -652 1111 -830 675 -115 316 1001 -218
2008b18J652j856J665j305O88k42m06J039j353J710j939J961j833R23O7o59R88
$$ -218 1434 -422 1243 -62 626 384 -22 1017 -336 1374 -565 1396 -437 486 553 -106 882
2025H82j295J713j957J515j085P31m60k93J113j689J574j687J574j356M26N48
$$ 882 -413 1300 -657 858 -227 504 44 -249 864 -825 749 -938 636 -720 -294 254
2041B54p43P36j662K134j727J171o32K65K52j341J694j457J517j821J648p60j11
$$ 254 -489 247 -1415 719 -1008 163 -469 -204 48 -1293 401 -1056 461 -1360 288 -472 -583
2058e83N81p63J324k007K024j053O08n35P7J002j919K011j368J503j644J093m9
$$ -583 -2 -765 559 -1448 576 -477 131 -404 -327 675 -1244 767 -601 902 -742 351 302
2075C02p65J176j421K201k213J338m54N13m59l74J564j805J438j656J767j102
$$ 302 -463 713 -708 1493 -720 618 164 677 218 -156 1408 -397 1041 -615 1152 50
2091E0p5P55r11J164j461J822j632P77m54M02K71j519J929j294P98j212J289m99
$$ 50 -25 730 -181 983 -478 1344 -288 489 35 437 708 -811 1118 -176 622 -590 699 200
2109B00r31J001p49J268k099J726r40L70k40j96J068j950J699j128J186j487Q44
$$ 200 -731 270 -479 789 -1310 416 -524 -154 -394 -590 478 -1472 227 -901 285 -1202 -358
2126c58M34j048J249j349J702j982J461o62K19n8l49J525j858J424j007J311j090
$$ -358 76 -972 277 -1072 630 -1352 109 -553 -334 -392 -741 784 -1074 350 -657 654 -436
2143d36L1R68j110J233j385J690j527P73k53l0O03j194J663j511J490j349J163
$$ -436 -405 563 -547 686 -699 991 -536 237 -16 -46 557 -637 1026 -485 1005 -344 819
2160H19o26n17J318j004R22j292J437j024L02j37k90J132j776J807j379J131j129
$$ 819 193 -324 994 -10 912 -380 1057 33 335 198 -92 1040 -736 1071 -308 823 -306
2177c06L37N69j031J094j424J685j494R53o91P8J75m60J083j672J564j463J176
$$ -306 31 600 -431 663 -761 924 -570 383 -308 -230 -55 -515 568 -1104 460 -1003 173
2194A73n11k88P25r03J138j795K004j526Q50k20p2M88j131J621j785J397j031
$$ 173 -338 -626 99 -804 334 -1461 543 -983 -133 -353 -425 63 -1068 553 -1232 165 -866
2211h66J155k65o59J138j406J572j399J259p44J64L22j105J634j428J390j450
$$ -866 289 24 -635 503 -903 669 -730 529 -215 -51 271 -834 800 -628 762 -688
2227f88J641j105K79O51j096J211j697J925j240P60m96J08N28j174J473j387J110
$$ -688 953 -152 127 778 -318 893 -804 1121 -119 641 145 253 781 -393 1080 -307 803
2244H03j226J040k42l98N96p63J352j774J473q59M24l28k79R90j570J283j038
$$ 803 -423 617 375 -23 573 -190 1162 -612 861 2 426 98 -181 809 -761 522 -516
2261e16R07r31O0M30m64J218j558J368j492R29m00N0L38j029J794j810J300j163
$$ -516 391 -540 -480 -50 -514 704 -854 514 -978 -49 -449 -399 -61 -1090 704 -1106 194 -969
2279i69R63l46j0L08n73J088j939J963q47M38k66KQ52j519J420j218J376j276
$$ -969 -6 -352 -362 -54 -627 461 -1478 485 -362 76 -190 -188 664 -855 565 -653 723 -553
2297e53P88J33p42O36n80J564j871J102o73P97m79k29J154j397J388j492J327
$$ -553 235 368 -374 262 -318 1246 -625 477 -196 601 122 -107 1047 -350 1038 -454 873
2314H73q20K6O04p59P49j291K026j568M40j99N5J75r62J652j461Q41q24R62n56
$$ 873 53 79 683 -76 673 -618 1408 -160 280 81 136 311 -651 1001 -460 381 -443 519 -37
2333c7k97O97o13P28j417J209n78K42j78n12J131j194J243j061N74n89M84M5p05
$$ -37 -334 363 -250 478 -939 270 -308 -66 -244 -756 375 -819 424 -637 -63 -652 -168 -123 -828
2352h28Q52j018J401j526J273n32Q7J60m29J085j459J013o72Q40n87%M54p32J269
$$ -828 24 -994 407 -1119 154 -378 -291 -131 -560 525 -934 79 -593 247 -340 -340 114 -618 651
2371F51j494J345j016J014k44j83K39j230J852j156J191j419Q97k81m24J130j267
$$ 651 -843 502 -514 500 256 73 312 -918 934 -222 969 -450 447 166 -258 872 -395
2388c95J467j376J059k38k46l9Q3M38q30Q59j463J753j293J69L07n26N47o39R54
$$ -395 1072 -304 755 517 271 232 315 753 -77 782 -681 1072 -221 -52 255 -271 276 -363 591
2407E91j425P34j85J80J94q47J289j312Q22o46O24m11k96N86r19J298j295R97
$$ 591 -834 -100 -285 -105 89 -758 531 -781 41 -605 19 -392 -688 -102 -1021 277 -1018 -21
2425b1n55N78m32K31N6k99P66j489J649o63Q6M04p61O10r60J011r10O16l24L27
$$ -21 -576 2 -430 -199 -143 -442 324 -1165 484 -179 -93 311 -450 160 -800 211 -699 -83 -407 -80
2445h0K03o79J070j061J107q36L91m23O74R1p31R09j085J500j147P29m96k57Q24
$$ -80 123 -556 514 -547 560 -276 115 -308 366 457 -274 635 -450 1050 -97 632 136 -121 703
2464G03j096P82p13J445j051R56l11n18N72j471J142j476J762j170L92p1q3Q01
$$ 703 -393 389 -324 1121 70 1026 715 197 769 -702 440 -1036 726 -444 -52 -123 -206 595
2482E95j451J324j096P64n80M33L78j84p3r87J082l68Q18j209K61j00j43Q71j981
$$ 595 -856 468 -628 136 -444 -11 367 183 110 -877 205 -163 655 -554 -293 -393 -536 335 -1646
2501a646J830j161J338q65K64j73L63J84j519K650j965R18r23k79J141r41Q54
$$ -1646 184 -977 361 -504 -240 -413 -50 134 -1385 1265 -700 218 -705 -984 157 -784 70
2518G0o88J467j424J301n48p70R71j145O85j37J308q90p7L2m42Q08j551J332k07
$$ 70 -618 849 -575 726 178 -592 379 -766 -81 -218 1090 200 123 155 -287 521 -1030 302 95
2537I5N23o09R6J010j461J055n91J065k395J795o38R09n65j281Q52j202J938o09
$$ 95 618 9 105 1115 -346 709 118 1183 -1212 583 -55 854 289 -992 -140 -1342 596 -13
2555a3J92J057p01q4j189J939k942J476o04J3J053j122Q67r01R83j388J840j115
$$ -13 179 1236 535 451 -738 1201 -1741 -265 -869 -856 197 -925 -58 -959 24 -1364 476 -639
2573f39Q71r3o73P05j790J479j327J251l54K78J17l75J318j384J103j060O39q52
$$ -639 232 139 -534 171 -1619 -140 -1467 -216 -570 -292 -175 -550 768 -616 487 -573 66 -786
2591g86L52L69m5K29j737J492K21M90j55j27M00j410J137o42k27k36J682p28k71
$$ -786 -434 -65 -110 119 -1618 -126 95 585 430 303 703 -707 430 -212 -439 -675 1007 279 8
2610HO82n97M69o00J008j031J56J71k67R02j176Q39r01P77m90M69m77j23L92r1
$$ 8 690 93 562 -38 970 -61 95 266 -1 901 -275 564 -337 440 -50 419 -58 -181 211 120
2630A20O65j785J677p98L34o0q24J112o34Q18j162R22l17m46N01j165J222r32
$$ 120 785 -1000 677 -121 213 153 -671 441 -193 625 -537 385 68 -378 123 -1042 180 -752
2648g52R33j084J548p34m98O41j157J506j218O54n57O63n31J0N84n20J006j043
$$ -752 181 -903 645 -89 -587 54 -1103 403 -815 -161 -718 -55 -586 -576 8 -512 494 -549
2666e49M14n30P16K9l3L90j542J191k24R05q25K80L10j352J552j051O37m22N55
$$ -549 -135 -665 51 80 47 437 -1105 86 -138 767 -58 222 532 -820 732 -319 318 -104 451
2685D51k35lJ21k12R67j096N87j367J503j182N48P24q40P61q81J047j166O04O
$$ 451 216 213 334 122 1089 -7 580 -787 716 -466 82 806 -34 727 -154 893 -273 331 337
2704C37K8l61j043J033m97J398j134K12q22r7J329q96P49k69R8o24j10L52o18
$$ 337 365 4 -1039 -6 -503 895 -239 -27 -849 -946 383 -513 236 -33 65 -559 -669 -317 -935
2723i35R95k75K95n34K81o09l54J788j958J511j570J690j157L72O77J09M31j358
$$ -935 60 -215 80 -454 -173 -782 -1136 652 -1306 205 -1365 325 -832 -460 217 326 757 -601
2741f01J280j477p8k84J562k87m30lo81J443j659J116l56Q09K9j499K123j245
$$ -601 679 -798 -876 -1160 402 115 -315 -318 -999 444 -1215 -99 -455 354 383 -1116 1007 -238
2759b38J055j175O16J86l27P24n58L26q09O44j71L6l14p3J67m85P21l10R33j389
$$ -238 817 -358 258 444 117 841 283 609 -200 444 273 309 -5 -78 89 -396 325 15 948 -441
2779d41N35m84m5J647j002L48j319J407p53p5j58O52n7j580J165r20J366o89M6
$$ -441 94 -390 -435 1212 210 558 -761 646 -107 -182 -340 312 255 -1325 -160 -1080 286 -403 -357
2798c57m09L81k9j37K81J70N47m87l69K42o30M11n56J928j195N72j194Q07l1j05
$$ -357 -766 -385 -414 -551 -270 -100 447 -40 -409 -167 -797 -386 -942 986 -209 363 -831 -24 -55 -160
2818a60O02j039Q72r20J255k82j507R29r0R47q30R38j383J653n95m74M06o07J364
$$ -160 442 -597 275 -645 610 328 -1179 -250 -340 607 -223 715 -668 985 390 -84 322 -285 1079
2837A079o46N51j085J24K58m28R24q29O49q40O02j147J015N6o41R02p98J124j461
$$ 1079 433 984 -101 23 281 -147 777 -52 597 -243 359 -788 227 283 -358 544 -254 870 -591
2856e91Q65j048O60j43k20R57o03K48n93R43p15m17N05m57P87o46J041p24P9k74
$$ -591 274 -774 -114 -257 -477 480 -123 125 -468 475 -240 -657 -152 -609 178 -468 573 -151 -72 -346
2876c46L8Q89j346Q37o71P27q66K48K74j94P78p19N98r34R74n37L12L15q04Q26
$$ -346 -308 581 -765 72 -599 128 -738 -490 -216 -410 368 -351 247 -687 287 -250 62 377 -427 399
2896C99n03M78o71O93n89M19K7p96J163r92J202r38K37j50L32J6r55J377j064
$$ 399 -104 374 -297 396 -193 226 253 -543 620 -372 830 -108 129 -21 311 327 -628 749 -315
2915c15R74l86k68L07M28k60n34M07j404J719j184P50J63J76j60j598J712n50
$$ -315 659 273 5 312 740 480 -54 353 -1051 668 -516 234 397 573 413 -1185 527 -23
2933b3J14k08j5N83j124Q79q68J330j208M53o69Q26J43o55R62j557J350n70k75
$$ -23 91 -117 -132 451 -673 206 -662 668 -540 -87 -756 70 213 -442 520 -1037 313 -257 -532
2952e32L08j02L72j185Q01l81J369r93M96m09p1N00o48Q60j184J621j511P18K69
$$ -532 -224 -326 46 -1139 -338 -719 650 -343 153 -256 -327 173 -475 385 -799 822 -689 29 298
2971B98o13N96n62L31k00N80j089J260k65q99J152r33O99q40Q72qk65J34l62J099
$$ 298 -315 281 -281 50 -150 430 -659 601 336 -563 589 -344 355 -485 387 379 114 248 -114 985
2991I85j337Q59l85M22m13j42N44p67J359j180K44p87J023n13l03P75j188J276
$$ 985 -352 507 122 544 131 -11 533 -234 1125 -55 189 -598 425 -88 -391 384 -804 472
3009D72q24J231r30J40n98J217l87r06P68o33Q35n70p2J70l16M63m38M95p47M37
$$ 472 -352 879 -51 89 -509 708 321 -585 183 -450 385 -185 -257 -87 -403 60 -378 117 -630 -193
3029a93l16j70P99p89J026r97P99n56O42q41M90K97o87P66p01J228j166P76k63
$$ -193 -509 -679 120 -669 357 -640 159 -397 245 -596 -106 191 -496 270 -431 797 -369 407 144
3048A44k39L59n03Q72n76M74n61K96k69j52L44m01P11p90R30p78L05J77p4M08
$$ 144 -95 264 -239 633 57 531 -30 266 -3 -155 189 -212 499 -291 639 -139 166 343 269 677
3068F77j177R75n04N64p36M84P7n88N01n08R42j145Q40p29M81J54l80M75j278
$$ 677 -500 475 -29 535 -201 283 360 -228 273 -235 707 -438 402 -327 154 308 -72 403 -875
3087h75J363j079R87k72n6kl78O55j145J669j241J14k11m5M64o20O91o70Q65q01
$$ -875 488 -591 396 124 68 66 -312 343 -802 867 -374 -260 -471 -516 -52 -672 19 -651 214 -587
3107e87K98K11k64L97l33N09n46O36m36L89n42oL54n26Q05p87P02l43M37k62l53
$$ -587 -289 -78 -342 55 -278 231 -315 321 -115 274 -268 -274 80 -446 359 -428 274 -69 368 106 -247
3128b47N70p22Q32j058J088l56o2M94n84N04m24O21n42J62k13L53m5n55O63q76
$$ -247 323 -399 433 -625 463 107 45 539 -45 459 35 656 114 276 63 416 371 -184 479 -397
3148c97R28q20N85k78K2M03p95Q56o74P32o45n7Q9j50L2k56P47n94M53m83M2K23
$$ -397 531 -289 296 18 40 443 -352 504 -170 562 -83 -140 -51 -201 -169 -425 322 -272 181 -302 -260 -37
3170c7k92N49p88Q12o81N36l59k89N48n64J089j062Q35p02K11r2J31N12p32Q11
$$ -37 -329 220 -568 244 -437 99 -260 -549 -1 -565 524 -538 297 -405 -194 -286 -155 357 -375 436
3190D36p83Q90r50N43k27K22Kq12R43p46O75k57L07k09l58P03r14J221q67R45
$$ 436 -347 543 -407 136 -91 131 133 -679 264 -482 193 -64 243 34 -324 379 -535 686 -181 764
3210G64m22j70K34n89N84p07Q05o77N55k47J65n1o15J026r41J010p84O40n08J5
$$ 764 342 172 406 -183 401 -306 499 -178 377 130 295 244 -371 655 -286 724 -60 580 72 87
3230H7K8n62P67r44J059o25L99q5p6K13q50P62o68P49n75K11Kk27L70m32J063
$$ 87 115 -447 320 -624 435 -190 209 124 48 261 -589 173 -495 254 -321 -110 -108 -335 35 -397 666
3251F66j145M24j80J41J18n03M99m28N75o48J71m6L2M57m88N30m81P08p27L79
$$ 666 -479 -55 -235 -94 24 -479 20 -408 167 -481 -310 -356 -324 133 -355 175 -306 402 -325 54
3271E4j7j95L06j88N29p80P66p00M90l19M6M19n05O22p47P61m98K75j45k67N56
$$ 54 37 -158 148 -40 489 -291 475 -225 265 -54 -8 411 -94 528 -219 542 44 319 174 -93 463
3292D63p69J027q67O81n12J63m4l04O97p87O60q63P69m05J20K32j1l78k47N65
$$ 463 -306 721 -146 535 23 186 142 -162 535 -252 408 -455 314 -91 29 261 250 -128 -375 190
3312A90n36L32j25Q5K81n63N80o17N86p37M93j67j9K56m68O70q63P99l92P4n4
$$ 190 -346 -14 -139 -54 227 -336 244 -373 213 -524 -31 -198 -217 39 -429 241 -622 177 -215 -141 -195
3333a95l0O02q42P04m85M18m35L42K14n64O19m82M81n67M18k43K77j75k26N80
$$ -195 -225 377 -465 239 -246 172 -263 79 293 -271 348 -134 347 -220 198 -45 232 57 -169 411
3353D11q58R72q47N50l94J75J74l26O03p53R26p28M43j65j13L49o55Q51r09O34
$$ 411 -447 525 -322 228 -166 9 183 -143 460 -293 633 -95 348 183 70 419 -236 615 -294 340
3373C40m75M82l98j50M56o17O59n85Q39q03J56J48Q2Q4l77M60m96M49n20J27K09
$$ 340 -135 347 -51 -201 255 -362 297 -288 551 -252 -96 52 134 218 -159 301 -195 254 -266 -139 70
3394G0n84N92n14Q15r89N82k72J78K09o44P64o92O75o95L27K41j99K92n00N18
$$ 70 -514 78 -436 379 -610 -28 -300 -122 87 -557 207 -485 190 -505 -178 63 -136 156 -344 174
3414A74l96L05l63R3K77j95K78m71O17q82P85j84k53J52j0P76j016N96m33N38
$$ 174 -222 83 -280 -187 90 -105 173 -298 319 -563 222 38 -215 -63 -73 703 -313 283 -150 388
3434C88k02J2n7m7L44q40R38p87L77j12N4J31l46O39p87Q57m75K21k75L0J21m29
$$ 388 186 198 141 94 438 -402 536 -251 126 14 68 199 -147 492 -295 562 87 308 33 63 184 -245
3456b45Q02p66N07l15J98n26L63m3k93O82r91N74k21K27J6k67M65p60R59r35N69
$$ -245 557 -209 298 -17 181 -345 18 -25 -318 364 -627 -53 -274 -47 -31 -298 167 -593 366 -569 0
3477@p8m5n0k40P61n05O90q63M19o79M07K50k70L74m31M99n68M89m81L65J9l39
$$ 0 -78 -123 -173 -413 348 -157 533 -330 89 -590 -183 67 -203 171 -260 239 -329 160 -321 44 63 -276
3499b76O04p09Q85p06M97l32J39K05l49M17m98M19n24M88J30k32L67l90L62q45
$$ -276 328 -381 504 -202 295 -37 102 307 -42 375 -123 296 -228 260 390 158 525 135 497 -348
3519c48M13K04K1k32m74R78n27M05m42q4K0j34L80k61K47n75P27n51M75m93m6
$$ -348 65 269 290 58 -416 562 35 440 -2 -86 -66 -200 180 -81 166 -409 318 -233 242 -251 -297
3540b97N93m44N07p81M96n47P52m58j03K8o5Q01p61L82k22J79l81M46k76j23K63
$$ -297 296 -148 359 -422 74 -473 279 -179 -282 -254 -319 482 -279 103 -119 60 -321 125 -151 -274 -11
3561a1n08R12m90J07l99L76j38P57q4m10O85r25M93J39k54O58q8m39J07n35k05
$$ -11 -519 393 -97 10 -389 -13 -151 606 522 112 797 -128 365 504 250 908 820 381 488 -47 -252
3582b52K59K20L3j95j18qM61l6m17M64K87p45N67p22N29n16O37l51k08N53p79
$$ -252 7 227 260 65 -53 -61 400 364 -53 411 698 -47 520 -202 327 -189 448 97 -111 442 -337
3603c37N81n72O63k18L7rk57L73r34J187q23M92k29R9J1l55N06p87O18n60O80
$$ -337 244 -328 335 117 154 145 -112 261 -673 514 -309 183 -46 53 64 -291 215 -572 46 -514 166
3624A66k11k22K15j98K93l88L81k65K30j96q7N00n31L08k45N34p23O88l76k37
$$ 166 -45 -267 -52 -250 43 -345 36 -229 1 -195 -282 218 -313 -5 -250 284 -439 249 -127 -364
3644c64N30l96K95m15O78l18J69l3j69M01p22N04k16M61n62L06K57m78K43l70
$$ -364 166 -230 65 -350 328 10 179 146 -23 378 -344 160 -56 405 -157 149 406 -72 171 -199
3664a99P88q18P14m64K0K43k32L61o01N91m62K86k9m53L88l38L98o10Q59n26L01
$$ -199 589 -229 485 21 41 284 52 413 -188 403 -59 227 198 -255 133 -205 193 -417 442 -84 217
3685B17m66k24P18n71O09p07P77l61K70o5m04K04r3J78k94J47l83k38Q64p35N71
$$ 217 -249 -473 245 -326 283 -424 353 -8 262 197 -207 -3 -96 82 -212 -65 -448 -686 178 -557 14
3706A4m89P11n83M45j56J30O7n81R76j078P55j06M94p17L70l33j17J90j16Q30
$$ 14 -475 236 -347 98 -58 72 139 -442 534 -544 211 105 599 -118 252 -81 -198 -8 -124 706
3726G06q89k61N84k34O14j164J114q37N52Q5r9Q3q62Q28l92Q27o26L29l42m28
$$ 706 -183 -444 140 -94 520 -644 470 -367 185 270 171 254 -608 220 -172 655 29 358 16 -412
3746d12j62J76J106r28J00L30q4o30M91Q62j216J065j372J266j457L98K48K40
$$ -412 -574 -398 708 -220 -120 210 126 -504 -13 849 -367 698 -674 592 -865 -467 -219 21
3764B1J01l64N78p91N00j112P43O95q33n9O22q53O03M43p43J3M04p86Q85o40J516
$$ 21 122 -242 336 -455 45 -1067 -324 371 -462 -521 101 -752 -149 294 -449 -436 -32 -818 67 -573 943
3785I43r04N42q49R00p32n58L67J60J26jR85l66o49L15q05P68r59J045p60P74
$$ 943 39 581 -268 632 -100 -658 -291 -131 -5 -6 979 613 -36 279 -526 242 -717 328 -432 342
3805C42J18m65M38p24O47p95J183n75n94N85Q9K35m73j5K64l98l09P00m87L42
$$ 342 460 -5 433 -291 356 -439 744 169 -425 160 249 484 11 -4 260 -138 -447 253 -234 108
3825A08L95j175P74j31K42k56q8J2J03O8k91K08L3J47l80p1M92p28Q85q79N02
$$ 108 503 -672 102 -29 213 -43 -131 -119 -16 52 -239 -31 2 149 -231 -302 190 -538 347 -532 -30
3846c0k99O4J68m57O10n11R59j026N55l54N35p11p9Q82l48k63L93m10M7M74p1
$$ -30 -329 -265 -97 -554 56 -455 504 -522 33 -321 214 -497 -576 306 -42 -305 88 -322 -275 199 128
3867A28m89M26j10N2M1O7J28J59m58N9L26m1o4m76m03R03l03L34r15N39M24p2
$$ 128 -361 65 -45 7 48 115 243 402 -56 3 329 288 224 -252 -655 248 -55 279 -636 -97 327 255
3889B55k71k22J40n21O97L29N80r75j63L91J36J68l91J07n70K05J020p21o14P46
$$ 255 -16 -238 -98 -619 78 407 987 12 -151 240 376 544 153 260 -310 -105 915 194 -420 326
3909C26p57p9J105l08l82o86P54m43L52N37p61O59r79M23k89L36j03r46Q64M55
$$ 326 -431 -510 595 287 -95 -781 -27 -470 -118 419 -342 317 -662 -239 -528 -192 -295 -1241 -377 78
3929G8l43j4K18l52N79l33n26N28n01J72r6R47p52l4L95j40O1o2L51l77O87n71
$$ 78 -265 -279 -61 -413 166 -167 -693 -165 -666 -494 -590 357 -395 -429 -34 -174 -113 -175 176 -201 486 -85
3951h5L54k58K06q6m11Q62o37L71l98K22m6k18M79l26M05l76L86N1l56n9J66K83
$$ -85 269 11 217 131 -280 582 -55 316 -82 140 94 -124 355 29 434 58 444 495 139 80 246 529
3973E29o17M27m43M00l62m6K13j3j34P1J48j80j0l8M0K5m44N48m79O75l32J6J80
$$ 529 -88 339 -104 296 -66 -112 101 88 -46 25 173 -7 -17 -55 -15 10 -434 114 -365 310 -22 -6 174
3996A74m99M80p21N27l02N61k50k78M17o55L94m48R47n47J42n3LJ64m80M39j47
$$ 174 -325 155 -566 -39 -341 220 -30 -308 109 -546 -152 -600 347 -200 -58 -111 -108 56 -424 15 -132
4017a32M49l36j60L30J14l24l56O89n87M13l69K64P5j01M2k24K33l45N59j55l7
$$ -132 317 -19 -179 151 265 -59 -415 274 -313 100 -269 -5 70 -31 11 -213 20 -325 234 79 42
4038D2n6M15j54j34J89l91J05j08K41L11o92N61k88K79m94N13m85K70j06R9L9
$$ 42 -14 401 247 113 302 -89 16 -92 149 460 -232 329 41 320 -174 339 -146 124 18 117 156
4059A56n40M16l20N15k73p0k45M8M87o57M59j48J94j09k5J55k40M26o29P33q39
$$ 156 -384 32 -288 227 -46 -116 -361 -313 174 -483 -24 -172 22 -87 -112 43 -197 229 -400 333 -506
4080e06L90R4l95L94l51O89q51M91j57K92j32j17K02j75J13l99P14k66r6O9j60
$$ -506 -116 -22 -417 -23 -374 315 -536 -45 -202 90 -42 -159 43 -132 -19 -418 296 30 -66 3 -157
4101a57L11m97O20l58L8K88k92K16m59O13n77M85m18L78k3j96J29j29M33n88M94
$$ -157 154 -343 277 -81 -43 245 -47 169 -290 323 -254 231 -187 191 168 -28 101 -28 405 -183 311
4122C11n36J08K05M9L45o83N07n56M13l83L88l0r9R6l49M26l74L21k94R3J22j73
$$ 311 -225 -117 88 137 482 -201 306 -250 163 -220 168 138 39 135 -214 212 -162 159 -135 -42 80 -93
4144i3J3j71L44l70Q4j56M07K71m35N24m00j45n22Q80m89K4K6J67l12N32j32k97
$$ -93 -80 -251 93 -277 -193 -349 58 329 -106 418 18 -127 -649 231 -258 -234 -208 -41 -353 179 47 -250
4166b50M93n60O36m79nN96r48M65l27M94L14o77M99l81J59k29M17j21j75L99o72
$$ -250 243 -317 319 -160 -165 431 -517 -52 -379 115 429 -248 251 -130 29 -200 217 96 -79 320 -352
4187c52Q67n30K32j46K20m57J70Q9K3L51n59N34k75j08J51k08L67r19M26J91R72
$$ -352 515 -15 217 71 291 -166 4 93 116 467 -92 442 167 59 210 2 369 -550 -124 67 1039
4208A039j156O46m35K79K23q41J038j048N12l61n04P07j14L61o34L93q80O6N43
$$ 1039 -117 529 94 373 596 -245 793 -255 257 -104 -608 99 -15 346 -288 105 -775 -709 -166
4227a66q9J124r13J74q93J219r36J411j471P51N9m08O21M51o32m05l02N58p7l12
$$ -166 -255 869 -44 130 -763 456 -480 931 -540 211 270 -138 483 934 302 -103 -405 153 76 -236
4247b36M37m89j25O31p69J97m36O85M04m55n4Q12Q3m13K05l48n28Q99r55R08m46
$$ -236 201 -288 -413 218 -551 -354 -790 -105 299 -156 -210 602 685 272 477 129 -399 500 -455 453 7
4268GP9j0Rj65L92Oj72L64r42N99k26R51j16r03K11J01L10r80K49N16m48J36l79
$$ 7 86 76 85 -80 312 318 146 510 -432 167 -59 892 776 -127 84 185 495 -485 -236 280 -168 -32 -411
4291d11K38jO18r33J66KL48q2m48M87P0L01k94l38J04P86q31p86R22o2K36l77
$$ -411 -173 -174 444 -489 -323 -321 27 -55 -503 -16 54 355 61 -277 -173 613 -218 -1004 -82 -144 92 -285
4313b85J29M56k61L9r37J110p80O49n3m0L9j77K87j133J094m27L32l81M66Q2l63
$$ -285 -156 300 39 78 -859 251 -529 120 67 27 66 -111 176 -957 137 -290 42 -339 127 209 -154
4334a54q0N45j57l26K99m23J78o88J146l44l59Q99j90k67J86n40M50j20J97p43
$$ -154 -234 311 154 -172 127 -296 -118 -806 340 -4 -363 536 346 79 265 -275 175 55 252 -491
4354d91M54l20P23K95r28J77j17N42j27k83m52M00L82r3J10j9K0n1j56k25M88
$$ -491 -37 -357 366 661 -267 -90 -207 335 208 -75 -527 -127 255 162 272 253 273 222 66 -159 329
4375C29m57j41O08o43P19n12k34N06m25K18r1K22k16O03m24o15P21k6Q8n91L93
$$ 329 -128 -269 339 -304 415 -97 -331 175 -250 -32 -123 99 -117 486 62 -553 168 142 230 -361 32
4396C2l14L90p1J5n12L06L50o95J104o54K31p00N57p4j13M35j88J22l92K01J14
$$ 32 -282 108 37 52 -460 -154 196 -499 605 -49 182 -518 39 -35 -148 287 99 221 -171 30 144
4417A44r3K35n33J48r7M98r9k5l5l36M44l74M35m90L34m46M19O5j55K53l33O9
$$ 144 51 286 -247 -99 -196 302 203 178 143 -193 251 -123 312 -178 156 -290 129 194 39 292 -41 28
4439B8n06Q60n50K06k58L6K91k97K71l56J66P0o2k1K54o3l61J23J55q2r0M8K49
$$ 28 -478 382 -168 38 -220 -184 107 -190 81 -275 -109 -39 -101 -122 132 69 -292 -169 -14 -96 -186 -138 111
4462A11j65J50j07L6j01J30k81K41J99k94Ok24K61L19l25l4O5R7k93N21l98J65
$$ 111 -54 96 -11 25 -76 54 -227 14 213 -81 -75 -299 -38 281 -44 -78 -13 84 -209 312 -86 79
4484G9j6Q2r2k34K61j0lk06M32l51J10Jj52K63l87L85m9j5j32M0J93k42L5o8K35
$$ 79 63 145 53 -181 80 70 67 -139 293 -58 52 53 -99 164 -223 162 113 98 -34 6 199 -43 -8 -76 159
4509A59l95L90o5j36M8j61L48l13J73P2l0j18p5o4o4L99m13M57o34M04k17J58
$$ 159 -236 154 89 -47 1 -160 188 -125 48 120 90 -28 -103 -167 -231 168 -245 212 -422 -18 -235 -77
4531g7K98k01J01j96L05k88K77m00o0L74k69K57k07L4l02J78K94l97M21k43K76
$$ -77 221 20 121 -75 230 -58 219 -181 -241 133 -136 121 -86 -52 -354 -176 118 -279 142 -101 175
4552A75m3k97O3J8m2NL11l66L98l11J42pk0L19l37K39m31L44R9j92K28k60J62
$$ 175 132 -165 -102 -84 -126 -121 190 -176 222 -89 53 46 26 345 8 247 -184 160 259 67 295 35 197
4575A97m33L27n5Q8l81N41k3k17Q5k19K3j74L56l74L14o9j28Q2o1N13k46j70K26
$$ 197 -236 91 36 124 -257 284 261 44 129 -90 -67 -241 115 -259 55 -14 -142 -60 -121 392 146 -24 202
4598B02j71J04k85K07k54M69m05K05l41K02N6j91K1k6K70l02m3J14L96n7k91j9
$$ 202 31 135 -150 57 -197 272 -133 72 -269 -67 -11 -202 -181 -207 63 -239 -282 -168 228 171 -120 -139
4620a39K19j42j02M57k37j72J88j13L81l12j81K14J38j18K3N5k06L26l60J87Q0
$$ -139 80 -62 -164 293 56 -116 72 -41 340 28 -153 61 199 81 104 159 -47 279 -81 106 186
4641A86k98J7k34O52o14K42p3K85M19j47q8J77p22O51j76m72J94l39P73l89P53
$$ 186 -112 -95 -329 323 -291 -49 -122 163 582 435 347 524 -198 453 277 -195 -1 -340 433 44 797
4662G97o00k57N34k41m57J16K22K51k11J99m08O96p20j3k59J58L37k18n2j2j23
$$ 797 197 -60 474 233 -224 -108 114 365 154 353 -55 641 -79 -92 -351 -193 144 -74 -126 -138 -261
4683b61O0K86m89L14Q9j62L01k18po7K42L7n07K97K49k22p8M7M2N2L0k49M24l07
$$ -261 -201 85 -404 -90 -1 -163 138 -80 -87 -154 88 125 -382 -85 164 -58 -136 -89 -47 5 35 -214 210 -97
4707i7P8k5K08j26k45K46L9K37m32M32k45j50M1o0J93k38K30j18L1l1J14J05j78
$$ -97 -19 -44 164 38 -207 39 78 315 -117 315 70 -80 -39 -99 94 -144 86 -32 -1 -32 82 187 9
4730IK37m55L66l07K72j35n0L23l26J96n08J80q8M48k47l6J31Q7q5j15j02n8J41
$$ 9 246 -209 157 -150 122 -13 -63 260 -66 130 -378 -198 -286 162 -85 -121 10 97 12 -103 -205 -263 -122
4753a22K79k56K3j82K96l41M50l41K61L2j76K75n05M32l7J87k52j89J23K92o6
$$ -122 157 -99 -76 -258 38 -303 147 -194 67 99 -77 198 -307 125 88 275 23 -166 -43 249 183
4774A83l38J80j76J41o2K64j18k74L46j68P9n3J72j15Q0R8r8q7J0J69m00L44r4
$$ 183 -155 25 -151 -10 -72 192 74 -200 146 -22 57 4 176 61 141 239 141 54 64 233 -167 177 83
4797H3pJ31k95L42q6j2p2J41K19j74q3k31J00J26o7l19J37J67j37L20o58O78k57
$$ 83 76 207 -88 254 168 156 84 225 444 270 187 -44 56 182 115 -204 -67 100 -37 283 -375 303 46
4820D6k9R8L9o4j54J65l36M56j69l0j47r1L85l60L5k01N19n62o0L98l70L40l51
$$ 46 17 115 154 90 -64 101 -235 221 52 22 -125 -216 169 -191 -156 -357 162 -400 -460 -62 -432 -92 -443
4843d43N96k75J68K02n04K48k03K98n8J65o11qN08j5q8j7J73m87N30l0K24o2n38
$$ -443 153 -122 46 248 -256 -8 -211 87 29 194 -417 -425 83 68 -20 -37 136 -351 179 149 373 311 -227
4866b27R5N3N4n21P85m23L56O7l11O8k61M18r9L4j54K83k5m94Q60m66K13n62O10
$$ -227 -132 -79 -25 -546 239 -184 172 239 -72 -4 -265 153 54 88 -66 217 192 -302 558 92 305 -257 353
4889C53r5n54M47m0K89j061N69K71o39K02p3L01k80K17k47P19m48J62R1k05k91
$$ 353 258 -296 151 111 400 -661 -92 179 -460 -258 -331 -30 -310 -93 -340 379 -69 93 184 -21 -312
4910c12n1P54p35M32J86n04K94k63L99m81P15m02K5l25O19m68P9L10p21O63r29
$$ -312 -363 391 -344 88 274 -230 64 -199 200 -281 434 32 57 -268 351 -117 -38 272 -449 214 -715
4931g15O02j7j40L8J091p66j30rl0q6M27n59M53l63L59L9m7m57K29m28M49O5l88
$$ -715 -113 -130 -270 -232 859 93 -37 -46 -76 -162 265 -294 159 -204 155 194 147 -310 -81 -509 -60 5 -383
4954c83M60l49J52l55P49o4j94P4J66k56l52K89J87j02L75l17q8k75L96l67N45
$$ -383 77 -272 -120 -475 274 210 16 90 256 0 -352 -63 124 22 397 80 -8 -283 113 -254 291
4975B91o25N18k72j53N33l82N0n66N50L44k34L25l57o6m7J16j33J98N45q24j55
$$ 291 -334 184 -88 -241 292 -90 -40 -606 -56 288 54 379 22 -44 -91 25 -108 90 635 -189 -344
4996c44l89O62N11l03l12k72N86k40P6k09O2N44n27jM80o16Q2J84j57K48J69k91
$$ -344 -733 -71 440 137 -175 -447 139 -101 -25 -234 -172 372 -155 -156 324 -292 -210 -26 -183 65 234 -57
5018e7r2L79K73k75q2O1j6o66O78n43K13K03m1M00j89k81m86O33k38p4J31L22
$$ -57 -149 230 503 228 146 207 191 -475 203 -340 -127 76 35 435 246 -35 -521 112 -126 -200 -69 253
5040B53J70j274J271m15J53L9m94P01k28n63Q64O5p63L6M60l91Q03r56M46m48
$$ 253 423 -851 420 5 158 197 -297 404 176 -387 477 542 -221 -185 275 -116 687 -269 177 -271
5060b71N00q49L49J02k20J12L66k29k28K47j5K06R1l33L38J63l03l22J39L32m44
$$ -271 229 -620 -271 -169 -389 -277 89 -140 -368 -121 -136 70 161 -172 166 329 26 -296 -157 175 -269
5081b69n0J42L90j96M35r98N75k38m6K14L04k24l08Q30q27m09J053n28O21p58
$$ -269 -319 -177 213 17 452 -546 29 -209 -255 -41 263 39 -269 561 -266 -675 378 -150 471 -287
5101b87L00l42O70n01J025p25j3K89m31K25J75o62P88j031M51K44n42M19j009
$$ -287 13 -329 341 -160 865 140 127 416 -15 210 385 -277 511 -520 -69 175 -367 52 -957
5120i57O07o6J070j207P90o60N65J58l55jM45j83j13L40r68P07K56Pm21o79L95
$$ -957 -350 -416 654 -553 237 -423 142 300 -55 -56 389 206 93 433 -535 172 428 435 14 -665 -270
5141b70K1K17k68M97m50R73j284J174j047R02r24J45N46K68K51q47K13N04p49
$$ -270 -249 -32 -300 197 -253 720 -564 610 -437 465 -459 -314 232 500 751 -96 117 621 -128
5160a28K82k70Q8K88n25PL21M66j089m4O89k98J48P23k64K35r80j50N93l77k36
$$ -128 154 -116 -28 260 -265 -258 63 529 -560 -604 85 -213 -65 658 394 629 -351 -501 92 -285 -521
5181e21N42K44j20l34K83l42O91q59Q03m11J52l75m4n1K65P56r22L2J80Q5n33
$$ -521 21 265 145 -189 94 -248 443 -416 387 -24 128 -247 -291 -342 -77 679 -243 -211 -31 54 -479
5202d79N78k80k82K44k28M1j19M36O54m43m85J7M8J36M57K82k48q01k71M07j45
$$ -479 99 -181 -463 -219 -447 -406 -525 -89 565 122 -363 -346 -298 -162 295 577 329 -472 -743 -336 -481
5223d81R78J45J25m93l23J33n66P73j238J223M8q23k85P52k0k96R23p95N11Q6
$$ -481 497 642 767 274 -49 84 -482 291 -947 276 324 -499 -784 -32 -52 -348 575 -220 291 377
5243C77j45q40R94o4j36N62p23l49M28m69L04n29J96l12M22k66M59n9J38k82O07
$$ 377 232 -608 386 322 186 748 25 -324 104 -365 -61 -590 -394 -706 -284 -550 -91 -150 -12 -294 313
5264C13N71r76K97o60LJ15M13J29m88O70O5l22J032q54q99K17O32o03j00M10N22
$$ 313 884 -92 205 -455 -452 -337 76 205 -283 387 452 130 1162 308 -591 -374 258 -345 -445 -35 487
5285D87r48J306r94L76k95N3n1J90n66M32K53m13P59r67J63L03N9J36j80m26O20
$$ 487 -461 845 -149 227 -68 -15 -66 124 -442 -10 243 -170 589 -378 -215 88 147 283 103 -323 297
5306B97K91n52J85L68j289j12J30J156j464J404q25L72l17M29M87j75j42m05k70
$$ 297 588 36 221 589 -700 -812 -682 474 -990 414 -411 -39 -356 73 560 385 243 -162 -432
$$ [...]
8191g6
##END NTUPLES=NMR FID
##END=
