##TITLE=1H_Pr All
 200.13MHz, CDCl3,
 8 sc
 
 20.1.2025
##JCAMPDX= 6.0         $$ Bruker NMR JCAMP-DX V2.0
##DATA TYPE= NMR FID
##DATA CLASS= NTUPLES
##ORIGIN= UXNMR, Bruker Analytische Messtechnik GmbH
##OWNER= pz
$$ XWIN-NMR		Version 3.5
$$ Mon Jan 20 15:35:24 2025 Russian Standard Time (UT+4h)  she@DPX200
##.OBSERVE FREQUENCY= 200.1313
##.OBSERVE NUCLEUS= ^1H
##.DELAY= (6, 6)
##.ACQUISITION MODE= SIMULTANEOUS
##.ACQUISITION SCHEME= undefined
##.AVERAGES= 8
##.DIGITISER RES= 18
##SPECTROMETER/DATA SYSTEM= spect
##.PULSE SEQUENCE= zg30
##.SOLVENT NAME= D2O
##.SHIFT REFERENCE= (INTERNAL, D2O, 0, 14.3821)
##AUDIT TRAIL= $$ (NUMBER, WHEN, WHO, WHERE, WHAT)
$$ ##TITLE= Audit trail, XWIN-NMR		Version 3.5
$$ ##JCAMPDX= 5.01
$$ ##ORIGIN= Bruker BioSpin GmbH
$$ ##OWNER= she
$$ F:/spectra/data/she/nmr/H-C/1/audita.txt
$$ ##AUDIT TRAIL=  $$ (NUMBER, WHEN, WHO, WHERE, WHAT)
(   1,<2025-01-20 15:33:09.68 +0400>,<she>,<DPX200>,
      <created by zg, POWCHK disabled, PULCHK disabled
       configuration hash MD5:
       00 E9 B6 7A A2 85 ED C7 34 08 36 98 17 FE 4E 26
       data hash MD5: 16K
       1F 4C 98 BE 29 91 13 EB 9F 40 20 71 41 F5 D0 E0>)
$$ ##END=
$$ 
$$ hash MD5
$$ 59 32 B4 0A 6D AB CB 66 B5 C5 26 B2 9B BB 51 56
##$RELAX= 
##$RELAX= 
##$RELAX= 
##$RELAX= 
##$RELAX= 
##$RELAX= 
$$ Bruker specific parameters
$$ --------------------------
##$DU= <F:/spectra>
##$EXPNO= 1
##$NAME= <H-C>
##$PROCNO= 1
##$TYPE= <nmr>
##$USER= <she>
##$AMP= (0..31)
100 100 100 100 100 100 100 100 100 100 100 100 100 100 100 100 100 100 
100 100 100 100 100 100 100 100 100 100 100 100 100 100 
##$AQSEQ= 0
##$AQ_mod= 1
##$AUNM= <au_zg>
##$AUTOPOS= <>
##$BF1= 200.13
##$BF2= 200.13
##$BF3= 200.13
##$BF4= 200.13
##$BF5= 200.13
##$BF6= 200.13
##$BF7= 200.13
##$BF8= 200.13
##$BYTORDA= 1
##$CFDGTYP= 0
##$CFRGTYP= 5
##$CHEMSTR= <none>
##$CNST= (0..31)
1 1 145 1 1 1 1 1 1 1 1 1 1 1 1 1 1 1 1 1 1 1 1 1 1 1 1 1 1 1 1 1 
##$CPDPRG= <>
##$CPDPRG1= <>
##$CPDPRG2= <>
##$CPDPRG3= <>
##$CPDPRG4= <mlev>
##$CPDPRG5= <mlev>
##$CPDPRG6= <mlev>
##$CPDPRG7= <mlev>
##$CPDPRG8= <mlev>
##$CPDPRGB= <>
##$CPDPRGT= <>
##$D= (0..31)
0 0.7 0 0 0 0 0 0 0 0 0 0.03 0 0 0 0 0 0 0 0 0 0 0 0 0 0 0 0 0 0 0 0 
##$DATE= 1737372789
##$DBL= (0..7)
120 120 120 120 120 120 120 120 
##$DBP= (0..7)
150 150 150 150 150 150 150 150 
##$DBP07= 0
##$DBPNAM0= <>
##$DBPNAM1= <>
##$DBPNAM2= <>
##$DBPNAM3= <>
##$DBPNAM4= <>
##$DBPNAM5= <>
##$DBPNAM6= <>
##$DBPNAM7= <>
##$DBPOAL= (0..7)
0.5 0.5 0.5 0.5 0.5 0.5 0.5 0.5 
##$DBPOFFS= (0..7)
0 0 0 0 0 0 0 0 
##$DE= 6
##$DECBNUC= <off>
##$DECIM= 32
##$DECNUC= <off>
##$DECSTAT= 4
##$DIGMOD= 1
##$DIGTYP= 9
##$DL= (0..7)
0 120 120 120 120 120 120 120 
##$DP= (0..7)
150 150 150 150 150 150 150 150 
##$DP07= 0
##$DPNAME0= <>
##$DPNAME1= <>
##$DPNAME2= <>
##$DPNAME3= <>
##$DPNAME4= <>
##$DPNAME5= <>
##$DPNAME6= <>
##$DPNAME7= <>
##$DPOAL= (0..7)
0.5 0.5 0.5 0.5 0.5 0.5 0.5 0.5 
##$DPOFFS= (0..7)
0 0 0 0 0 0 0 0 
##$DQDMODE= 0
##$DR= 18
##$DS= 0
##$DSLIST= <SSSSSSSSSSSSSSS>
##$DSPFIRM= 0
$$ [...]
##$SUBNAM0= <"">
##$SUBNAM1= <"">
##$SUBNAM2= <"">
##$SUBNAM3= <"">
##$SUBNAM4= <"">
##$SUBNAM5= <"">
##$SUBNAM6= <"">
##$SUBNAM7= <"">
##$SUBNAM8= <"">
##$SUBNAM9= <"">
##$SW= 18.0517328524113
##$SWIBOX= (0..15)
0 0 2 0 0 0 0 0 0 0 0 0 0 0 0 0 
##$SW_h= 3612.71676300578
##$TD= 16384
##$TD0= 1
##$TE= 0
##$TE2= 300
##$TE3= 300
##$TEG= 300
##$TL= (0..7)
0 120 120 120 120 120 120 120 
##$TP= (0..7)
150 150 150 150 150 150 150 150 
##$TP07= 0
##$TPNAME0= <>
##$TPNAME1= <>
##$TPNAME2= <>
##$TPNAME3= <>
##$TPNAME4= <>
##$TPNAME5= <>
##$TPNAME6= <>
##$TPNAME7= <>
##$TPOAL= (0..7)
0.5 0.5 0.5 0.5 0.5 0.5 0.5 0.5 
##$TPOFFS= (0..7)
0 0 0 0 0 0 0 0 
##$TUNHIN= 0
##$TUNHOUT= 0
##$TUNXOUT= 0
##$USERA1= <user>
##$USERA2= <user>
##$USERA3= <user>
##$USERA4= <user>
##$USERA5= <user>
##$V9= 5
##$VALIST= <valist>
##$VCLIST= <CCCCCCCCCCCCCCC>
##$VD= 0
##$VDLIST= <DDDDDDDDDDDDDDD>
##$VPLIST= <PPPPPPPPPPPPPPP>
##$VTLIST= <TTTTTTTTTTTTTTT>
##$WBST= 1024
##$WBSW= 4
##$XGAIN= (0..3)
0 0 0 0 
##$XL= 0
##$YL= 0
##$YMAX_a= 234344
##$YMIN_a= -364203
##$ZGOPTNS= <>
##$ZL1= 120
##$ZL2= 120
##$ZL3= 120
##$ZL4= 120
##$ABSF1= 10
##$ABSF2= 0
##$ABSG= 5
##$ABSL= 3
##$ALPHA= 0
##$AQORDER= 0
##$ASSFAC= 0
##$ASSFACI= 0
##$ASSFACX= 0
##$ASSWID= 0
##$AUNMP= <proc_1d>
##$AZFE= 0.1
##$AZFW= 0.1
##$BCFW= 1
##$BC_mod= 2
##$BYTORDP= 1
##$COROFFS= 0
##$CY= -3
##$DATMOD= 1
##$DC= 2
##$DFILT= <>
##$DTYPP= 0
##$F1P= 0
##$F2P= 0
##$FCOR= 0.5
##$FTSIZE= 0
##$FT_mod= 4
##$GAMMA= 1
##$GB= 0.15
##$INTBC= 1
##$INTSCL= 1
##$ISEN= 128
##$LB= 0.25
##$LEV0= 0
##$LPBIN= 0
##$MAXI= 10000
##$MC2= 0
##$MEAN= 0
##$ME_mod= 0
##$MI= 1.114404
##$NCOEF= 0
##$NC_proc= 0
##$NLEV= 6
##$NOISF1= 3.799351
##$NOISF2= 2.8
##$NSP= 1
##$NTH_PI= 0
##$NZP= 0
##$OFFSET= 14.38212
##$PC= 1
##$PHC0= 260.6542
##$PHC1= -3.807801
##$PH_mod= 1
##$PKNL= yes
##$PPARMOD= 0
##$PSCAL= 0
##$PSIGN= 0
##$REVERSE= no
##$SF= 200.129724274929
##$SI= 16384
##$SIGF1= 3
##$SIGF2= 2
##$SINO= 400
##$SIOLD= 16384
##$SREGLST= <1H.CDCl3>
##$SSB= 0
##$STSI= 0
##$STSR= 0
##$SW_p= 3205.1282051282
##$SYMM= 0
##$S_DEV= 0
##$TDeff= 0
##$TDoff= 0
##$TI= <>
##$TILT= no
##$TM1= 0
##$TM2= 0
##$TOPLEV= 0
##$USERP1= <user>
##$USERP2= <user>
##$USERP3= <user>
##$USERP4= <user>
##$USERP5= <user>
##$WDW= 1
##$XDIM= 8192
##$YMAX_p= 0
##$YMIN_p= 0
$$ End of Bruker specific parameters
$$ ---------------------------------
##NTUPLES= NMR FID
##VAR_NAME=  TIME,          FID/REAL,        FID/IMAG
##SYMBOL=    X,             R,               I
##VAR_TYPE=  INDEPENDENT,   DEPENDENT,       DEPENDENT
##VAR_FORM=  AFFN,          ASDF,            ASDF
##VAR_DIM=   8192,          8192,            8192
##UNITS=     SECONDS,       ARBITRARY UNITS, ARBITRARY UNITS
##FACTOR=    0.0002768,     1,               1
##FIRST=     0,             0,               0
##LAST=      2.2672688,     0,               0
##MIN=       0,             -364203,         0
##MAX=       2.2672688,     234344,          0
$$ Real data points
##PAGE= N=1
##DATA TABLE= (X++(R..R)), XYDATA
$$ [...]
2257g102j746K519N572M911J818k285m528l868j202L228N106M009M78l362m909
2272a361l580M1L347N276L396p22l858n354l422N0L771M664K619j141m181m777
2288e232k198J966M583N206K699j806m206m817j743K187M601M000J441k923n074
2303a316m132j132K981M896L898M76k929n232l191M8L550M971L179l64l658m807
2319b762l123J003L917M854K357j518m204m501k284J496M233M307J900j790m503
2334f18m166j354K166M657M169P24k082m618l655p85L006M753L413L23l086m749
2350a902l566J43L218M622K783n87l647m443k655R68L895M114K493j357l718m185
2366c824j891J733L874M467J630k151m200l870j152K219M070L475J096k409m455
$$ plain form
2257 -7102 -8848 -6329 -757 4154 5972 3687 -841 -4709 -5911 -2683 2423 6432 6910 3548 -1361
2272 -1361 -4941 -4900 -1553 3723 7119 6397 2539 -2815 -6237 -6187 -2416 2248 4867 3726 -455 -5232
2288 -5232 -7430 -5464 -881 4325 7024 5218 1012 -3805 -5548 -3361 1240 5240 6681 3758 -1316
2303 -1316 -5448 -6580 -3599 1297 5195 5671 2742 -2490 -5681 -5633 -2083 2888 6067 5703 2045 -2762
2319 -2762 -5885 -4882 -965 3889 6246 4728 524 -3977 -6261 -4765 -532 3775 5675 3885 -618
2334 -618 -4784 -6138 -3972 685 4854 5578 3496 -1122 -4777 -5562 -2556 2197 5610 5933 2847 -1902
2350 -1902 -5468 -5325 -2107 2515 5298 4711 1064 -3379 -6034 -5066 -1171 2943 5436 4079 361 -3824
2366 -3824 -5715 -3982 -108 4359 5989 3838 -362 -4232 -5384 -3165 905 4380 5476 3067 -1388
2381a388l509m51K696M316L156L56k696m538l099M11L106M316K424m79l371m233
2397b983k272R82L615L923J980j149l626l693k096J724L473L352J398j935m094
2412a401l093n53K158M114L180Q47k132l709k923M3K240L565K450k05l028l916
2428b363k294J90K561L484K215p56k799l476j878Q40L081L495K101j005l004l263
2444b871j185J562L423L252J564j779l582k702j101J646L117K176K15k330l349
2459a944k677o93K384L303K508k17k058k890j721N92K912L177J828l20k556k917
2475a289j618O42K607K482J361j335k938k632j086J140K409K510R13j465k780
2490a079k334m32J548K565K315P17j807k858j530%J869K856J903l95j635k738
$$ plain form
2381 -1388 -4897 -5348 -2652 1664 4820 5176 2480 -2058 -5157 -4746 -1640 2676 5100 4621 1250 -2983
2397 -2983 -5255 -4273 -658 3265 5245 4096 470 -3223 -5319 -3595 -122 3230 4628 2693 -1401
2412 -1401 -4494 -5047 -2889 1225 4405 5252 3120 -589 -3512 -3469 -1229 2336 4786 4581 1553 -2363
2428 -2363 -4657 -4467 -1906 1578 3793 3037 238 -3238 -5116 -4276 -1195 2300 4401 3396 392 -2871
2444 -2871 -4056 -2494 929 4181 5745 3966 384 -2318 -3419 -1773 1344 3520 3735 1405 -1944
2459 -1944 -4621 -5314 -2930 373 2881 2664 606 -2284 -4005 -3413 -501 2676 4504 4184 1628 -1289
2475 -1289 -2907 -2265 342 2824 4185 2850 -88 -2720 -3806 -2666 -257 2253 3166 1701 -1079
2490 -1079 -3413 -3845 -2297 268 2583 3300 1493 -1365 -2895 -2895 -1026 1830 3733 3338 1703 -1035
2506a035j864M00J715K467J176p18k011k227j231P67K019K548R07n91k030k133
2522a841r65J105K114J937M69j341k105k053l43J201K577J373N69j183k102j805
2538b393qJ569J636J478k88j528j816j107M76J697J858R57j81j531j836j051N14
2555a554J812J418P56j002j832j259q27R31J424J346N98p48j971j468p2R55J756
2572B63J020K86o50j110j100L0J054J473J054p4j094j277q56m77J007J276O75
2589A500n85j055j341n00O42Q76J257O89o36j143r63m35N99R92J071M32l59r94
2607D7o04j10O12J189M71J8r86j146q34k61L34J185L49J27o69n91j00L27O49J058
2627A065N41n32m61j028o18J67N64L62N49l60n58k03l47N11O03P34K17n15q41
$$ plain form
2506 -1035 -2899 -2499 -784 1683 2859 2141 130 -2097 -3328 -2561 -542 2006 2913 2322 292 -1841
2522 -1841 -2806 -1701 413 2350 2819 1478 -627 -2680 -3023 -1822 755 2128 2697 1514 -588 -2393
2538 -2393 -2401 -832 804 2282 1994 466 -1350 -2457 -1981 -284 1574 2531 2350 819 -1017 -2068 -1554
2555 -1554 258 1676 2432 1430 -402 -1661 -2488 -1557 -133 1213 1811 1063 -908 -2376 -2448 -1493 263
2572 263 1283 1569 919 -191 -1291 -1261 -207 1266 2320 2246 1152 -125 -981 -1458 -451 825 1500
2589 1500 915 -140 -1481 -1981 -1339 -463 794 1483 847 -296 -1259 -1694 -1095 -103 968 1400 1041 47
2607 47 -557 -667 -55 1134 1605 1623 637 -509 -1343 -1604 -1270 -85 264 391 -278 -869 -969 -642 7 1065
2627 1065 1606 1074 613 -415 -1033 -866 -302 60 609 249 -309 -512 -859 -348 255 989 1206 691 -150
2646a50p65K32n4O64N75p6j43n72k09j4N17M58N33l9m67p30o66J37K63L42L02
2667A38k0j15k92n8L07M84L27O4k34n90j26m88K26J21J37K14m4l17j93J60J78
2688a21L25K77J12j81k95j22m09M43pK26j48m2Nj73K6O8RK07k00j95p7j49L44
2711g7k11L04Q2j58J48J08J39l6j02r7K4jj49j93J34j26k43K48N5Q2n2J69N9l3
2735G4j17Q5j39J13PRN1k77lm3M8M10Rk19J74k85k44m2K47K33L3J34j88j81j48
2760b59k9L40Q1K75L2k23o0l01m8K82R7n2l3k92j26m24J33L40L99R2M7k89l8k43
2784b99N39J06L81k56j24l56m83J17k67K00N77k07M7m72j97K26N31L54K66J6m39
2805B60k98k38Q5J35K45K07N5l68l22j08K94K95M33n8j45m25l84m92N3K32L32
$$ plain form
2646 -150 -915 -683 -737 -73 502 426 283 -289 -498 -512 5 463 996 957 490 -240 -906 -769 -506 -164 138
2667 138 118 3 -289 -347 -40 444 771 835 601 11 -115 -603 -377 -256 -119 95 51 -266 -459 -299 -121
2688 -121 204 481 593 412 117 -5 -414 29 22 248 100 58 63 -110 -84 -16 -7 200 0 -195 -272 -421 -77
2711 -77 -288 16 98 -60 88 196 335 299 197 100 124 123 -26 -219 -85 -211 -454 -206 -151 -69 -121 48 107 74
2735 74 -43 42 -97 16 23 32 83 -194 -197 -240 -192 218 227 8 182 -103 -347 -389 -142 91 124 258 70 -111 -259
2760 -259 -288 52 133 408 440 217 157 -144 -192 90 187 135 102 -190 -316 -740 -607 -267 132 224 271 -18 -56 -299
2784 -299 240 346 727 471 347 -9 -492 -375 -642 -442 135 -72 -25 -497 -694 -468 63 417 683 699 260
2805 260 -38 -276 -191 -56 189 396 451 83 -239 -347 -53 242 675 617 472 47 -337 -829 -776 -544 -212
2826b12J01l1m04j9Q2K07Q53K74p6l10n28j10l04J51M35J80M2m6m18r2K15J82
2848A72L06J78j18o88k15m56j6M59J58J45k0j97k69j76O13M14L43Q0K5m76k24
2869C8k17L29K49N26j29m72O4m70j66J88K61J18l35n33n07m05K74R9P64L31J93
2890B00j02j73J17M3P82M41j8m18j8j097K57l42M68J89j01o9l23k56l59J85K00
2911c94L81j00k76l62l12J15M20K67R69N8k6k46j23p2K14M16q5j30p40k93m24
2932g43O5M7M38J94N7r4k46M3K11P4M10j74P3l55n48o8J80L12M45NO1k91j09o6
2956g9J85Q8J68j47n17lk95J65ON65J37J16k52L49k29J6J18p2J54k1m45j40j76
2979c09K1K73K43n4p7j6n43Q1J26l0K83r4m57L98n61N02M1L36J74J27L60j49J24
$$ plain form
2826 -212 -111 -142 -546 -565 -483 -276 577 851 775 465 -63 -173 -477 -326 109 289 331 285 -133 -225 -10 172
2848 172 478 656 538 -150 -365 -821 -837 -378 -220 -75 -95 -292 -561 -737 -124 290 633 713 738 262 38
2869 38 -179 150 399 925 796 324 388 -82 -248 -60 201 319 -16 -549 -1056 -1461 -1187 -1088 -324 7 200
2890 200 98 -75 42 85 867 1308 1290 872 854 -243 14 -328 140 329 228 159 -164 -420 -779 -594 -394
2911 -394 -13 -113 -389 -751 -1063 -948 -528 -261 708 766 740 494 371 299 513 929 844 714 -26 -319 -743
2932 -743 -678 -631 -193 1 58 -36 -282 -239 -28 46 456 282 355 0 -548 -616 -436 -124 321 326 387 96 -13 -79
2956 -79 106 194 362 215 -302 -305 -600 -435 -429 136 273 389 137 486 257 273 391 319 473 452 7 -133 -309
2979 -309 -288 -15 228 174 97 81 -462 -381 -255 -285 -2 -96 -553 -155 -716 -214 -173 163 337 464 824 675 799
3002G99j87M8o8j06N2m43l06l49pj48N02r6K97n72o8L8j88M16Q0j9J54j74K99
3025d6J0M18K51J93K66o8p7L6l49j1k08l22j23l12q1l99j23j8J63K62j17j1L54
3048c12J17K4K84m7K40J20k10Q2j95k2R0J7J49K68j46j91k92j38p7L0J35k68J86
3071a56m53RM6J94L23K22k47K71J98k16q7J9k26J11PQP9o71J09J00K78q3K66m4
3095E7K2j02l7J98K08j45J0lr2k41P5J57j10o7K01k88J35j12k50J72J37r3L7J14
3119a7j9o3j01p0j6L43K94k08J37j17j26K3P8J14j04kk57k61J54J38N7n8J36q1
3143b6k47J05J82j99J89J38j99O0n4K4j56Q0M51j96j60Q5J78n8j45J27j82L8n5
3166b0M8k61J32q7J78r9J35o6M6rj04j43L04J12J09R3j96k34j36o0K35J08J13
$$ plain form
3002 799 612 660 592 486 538 95 -211 -560 -567 -715 -213 -309 -12 -584 -652 -614 -802 -386 -306 -325 -171 -345 -46
3025 -46 -36 382 633 826 1092 1024 947 983 634 623 415 93 -30 -342 -423 -822 -945 -963 -800 -538 -655 -666 -312
3048 -312 -195 -171 113 66 306 426 216 298 103 81 171 188 337 605 459 268 -24 -162 -239 -209 -74 -342 -156
3071 -156 -609 -600 -554 -360 -37 185 -62 209 407 191 104 123 -103 8 15 23 102 -569 -460 -360 -82 -165 101 57
3095 57 79 -23 -60 138 346 201 211 208 116 -125 -50 107 -3 -70 131 -157 -22 -134 -384 -212 -75 -168 -131 -17
3119 -17 -36 -99 -200 -270 -286 57 351 143 280 163 37 60 138 252 148 146 -111 -372 -218 -80 -23 -81 55 -26
3143 -26 -273 -168 14 -185 4 142 -57 3 -51 -27 -183 -103 348 152 -8 77 255 197 52 179 -3 35 -20
3166 -20 28 -233 -101 -188 -10 -109 26 -40 6 -3 -107 -250 54 166 275 368 172 -62 -198 -258 -23 85 198
3189A98q8l77k20k00M50l3J94k81J39J26l25K63L00K22J17J7K08j44k55J12j33
3210B90J20q5l41M6n24J29k35J86l2j36N4Jl27N80l5J25J24K89j02Q2J4K38k0
3233D41L22J04j16L52l77k56k05j30l57p5l7l33l52Q0j54L09J71J72J10J99LK54
3255A25k11P36j1j74R6o7j20o0O4j1L20j12j01l3n99J1j04MK29m52k01j16j07
3278h94M17j07K28J82J66J89K6j3M05j40o3O9l0j35j2O3j81l39K30k73J84J07
3300G9m31K22J10p9J9k73K8j38J25j01N4J41N6K54Q5k14Q7J86J50Q9M1k4j91J3
3324B88lr1j35lM6k35k65J84n0j84J57JK94N3l31K51m3L4J60n1J71k11J94k24
3348GJ8lj05L52r4j26qj67J82r5r4K38j75j47K16kOL8j01q5K87m9J36K2q1k28
$$ plain form
3189 198 110 -267 -487 -687 -237 -270 -76 -357 -218 -92 -417 -154 146 368 485 502 710 566 311 423 290
3210 290 410 325 -16 30 -494 -365 -600 -414 -446 -582 -528 -527 -854 -274 -309 -184 -60 229 127 209 223 461 441
3233 441 763 867 751 1103 726 470 265 135 -222 -297 -334 -667 -1019 -939 -1093 -784 -613 -441 -331 -132 -129 125
3255 125 -86 650 639 465 561 494 374 314 378 367 687 575 474 441 -158 -147 -251 -247 -18 -470 -671 -787 -894
3278 -894 -477 -584 -356 -174 -8 181 207 194 599 459 396 465 435 300 288 351 170 -169 61 -212 -28 79
3300 79 -352 -130 -20 -99 -80 -353 -325 -463 -338 -439 -385 -244 -188 66 151 -63 24 210 360 449 490 466 275 288
3324 288 285 194 59 56 102 -133 -398 -214 -264 -448 -291 -290 4 57 -274 -23 -66 -32 128 77 248 37 231 7
3348 7 25 22 -83 269 175 49 41 -126 56 -39 -133 105 -70 -217 -1 -3 3 41 -60 -145 142 93 229 251 170 -58
3374e8n2Q7r2O8j20P4n3k8L00k02j58K67k27L15j92L18J6j08N0m7P9j90J05k25
3398g3p0Qj25Q0J50l26R7o3K01M9J61R7j2J19kr6K2l59J8n0J30j1j89m6p9P1K11
3425h7J21J22J66k91K22j97J58m6L4k19k48J44j51N9j01M38q2N5J46M8J19l12
3447I8J75l48K96k13k55r4j28O3L54j57R1L18K2L4J42J65R2j70k82l32j68k25
3469e22k7L27l80L32j68K35L23J38J67k8L18j58M4l17k8m66k24P6pR1k97J78J23
3492b70K48J96K57J81l11J5k41K07p1j54k08l38q5J21J59K00R6L5LL48J42P9p9
3515E30j70k12Nk16p1r2l40N2K81O9L11n5J46r5K79P4J90l21q7k78m40j03J82
3538c61m3R9n7k7K33J59J31J64M27o3k32J62l99p8l41k68J90p7J28j02k00k3K04
$$ plain form
3374 -58 -110 -23 -115 -47 -167 -93 -146 -174 126 -76 -234 33 -194 121 -71 247 263 155 205 158 237 47 152 -73
3398 -73 -143 -135 -260 -180 -30 -356 -259 -322 -121 -72 89 186 174 293 291 195 217 -142 -124 -174 -44 -55 -244 -290 -369 -298 -87
3425 -87 34 156 322 31 253 56 214 168 202 -17 -265 -121 -272 -213 -314 124 42 97 243 291 410 98
3447 98 273 -75 221 8 -247 -341 -469 -406 -52 -209 -118 200 222 256 398 563 655 485 203 -129 -297 -522
3469 -522 -549 -222 -602 -270 -438 -203 120 258 425 397 715 557 601 284 256 -210 -434 -358 -365 -274 -571 -393 -270
3492 -270 -22 174 431 612 301 316 75 282 211 57 -151 -489 -574 -453 -294 -94 2 37 40 388 530 609 530
3515 530 360 148 153 -63 -134 -226 -566 -514 -233 -164 147 92 238 143 422 496 686 365 278 0 -440 -543 -361
3538 -361 -404 -305 -362 -389 -156 3 134 298 725 662 430 592 193 115 -226 -494 -304 -381 -253 -355 -555 -578 -374
3561c74M52L84K64k36l66k32R8j1k0j78N0j34k34J99J17L76M5L4J51j98j15n0
3583B2K0j25o1L41k4l02n50J49L39K64N72m54K07l1n67Q5q8L56J45l5j99l62Q9
3606b09j14K88J55M8P9j73l33k18M1J74K46K23J18n0l66j29O3L21N72J1m90k55
3628Bn92l13L74M09R8K55rl72K9K27K21L73K9k36l91q72l36j80K17N20K24L93
3650G0j13PR0M10Q27L87Q3j88q73q99l71l12J89K39k68Q7l78n3N61M41M47M57
3672H40J87l63p05n40j28j01K36N63j26o0k93q2M66Q54R65L09J00q73o72j058
3692d81k90L48N6k72l71m42l16O6P48Q89P04M61K43o16n04r7J53J22L05j70n02
3713C4r28j83J68O36P70N24M2n95k57n00k0L38L34p1l22n83q75k12J78P27Q60
$$ plain form
3561 -374 78 462 726 490 124 -108 -10 -21 -41 -219 -169 -303 -537 -338 -221 155 200 234 385 187 72 22
3583 22 42 -83 -144 197 173 -129 -679 -530 -191 73 645 191 398 367 -200 -115 -203 153 298 263 64 -298 -209
3606 -209 -323 -35 120 168 247 74 -259 -477 -436 -262 -16 207 325 275 -91 -220 -157 164 736 747 257 2
3628 2 -590 -903 -529 -120 -22 233 224 -148 -119 108 329 702 731 495 104 -768 -1104 -1284 -1067 -547 -323 70
3650 70 -43 -36 54 464 1291 1678 1761 1573 700 -199 -570 -882 -693 -454 -722 -635 -1013 -1066 -505 -64 383 840
3672 840 1027 664 -41 -581 -709 -810 -574 -11 -137 -197 -490 -572 -106 748 1713 2022 2122 1249 577 -481
3692 -481 -771 -423 -367 -639 -1010 -1452 -1768 -1702 -954 -65 639 1100 1343 727 223 126 279 401 706 536 34
3713 34 -894 -1077 -909 -273 497 1021 1063 468 211 -289 -309 29 363 292 -30 -613 -1488 -1700 -1522 -795 65
3734F5N30j55l01j55r7L67O80N48L18q89q54q42m62O51M69N65J7n95o27l35M34
3755f68N79J007J83op59j027m01RM91R35L79m79m48o22j74N68J070O92J38j87
3775A280r22q05l14K30P08M91k86o13o06p75K82P43J012Q07K7p59o06n19J83L98
3795d4R02L39m45p18j054l87K38P90R78M01m76o57o29k60O65N82R39L26n82j023
3815a15o98j56N95N20P52k54o10o43p35J88O80J207N65j79m22p84n23k82J070
3834A76Q62Ol29r70j072m01K70J085J136L68J4r81n19k72R2J070P96j64p44j161
3854g38j129j76Q66J067J104M29m98o53n35M72N80Q31L9m00j162j216j195K29
3872b085Q25Q73N69L9n72m31m9M60J197J009M50o13j169j376m98K46Q37R34M65
$$ plain form
3734 65 595 440 139 -16 -113 254 934 1482 1800 911 57 -785 -1247 -596 -127 438 455 -140 -767 -1102 -668
3755 -668 -89 918 1101 1095 336 -691 -1092 -1083 -592 343 722 243 -205 -827 -1001 -433 637 1329 1467 1280
3775 1280 358 -447 -761 -531 177 668 382 -231 -837 -1612 -1330 -587 425 1232 1259 500 -106 -625 -442 -44
3795 -44 858 1197 752 34 -1020 -1407 -1169 -379 599 1000 524 -133 -762 -1022 -357 225 1164 1490 908 -115
3815 -115 -813 -969 -374 146 898 644 34 -609 -1344 -1156 -476 731 1296 1117 695 -89 -612 -894 176
3834 176 1038 1044 715 -255 -1327 -1728 -1458 -373 763 1131 1145 164 -355 -627 -535 535 1331 1167 423 -738
3854 -738 -1867 -2043 -1177 -110 994 1423 925 272 -263 209 789 1620 1659 1259 97 -1119 -2314 -2085
3872 -2085 -1260 -387 182 221 -351 -782 -831 -371 826 1835 2285 1672 503 -873 -1371 -1125 -288 646 1111
3891A111q35o54p92K79R88J132N62j46r36j349o37j44M92N70N44L7r00o68m46
3910a792M21J547J028R39l65p06q68m74K14O55R24q6j052j013j240J9L10R98J045
3929E04J13k77o65m71J8P62Q46M91j24j089j022r84Q1P94J256O75K79o49l42l32
3949a36M43J010J018l3p60j175j655q60p4P94R83R2k29m46j87M69Q59J249J027
3968B389J36p99r94j248o68J26O57N66On97m87k25P89J217Q54O37p5j166j489
3987c71q21k88N01N70J09M4p99m46K10Q79J280J322J88m09j011j231p12J44M48
4006c93M59Q4o84m99l42L27R15J182P28k69o07r57p41K0K74O84L11j88o08m29
4026g33l35M13R83Q56J88l37j144q23l42J63M33R64N08l49o76k64L75M51P31N29
$$ plain form
3891 1111 276 -378 -1170 -891 97 1229 1791 1645 709 -640 -1277 -1421 -929 -359 185 222 -678 -1346 -1792
3910 -1792 -1371 176 1204 2143 1778 1072 204 -270 -56 599 1523 1437 385 -628 -1868 -1849 -1539 -541 504
3929 504 617 340 -325 -796 -778 -16 830 1321 1197 108 -914 -1898 -1817 -1023 233 908 1187 538 196 -136
3949 -136 307 1317 2335 2302 1542 367 -1288 -2148 -2222 -1428 -445 -353 -582 -1028 -1215 -746 113 1362 2389
3968 2389 2525 1726 732 -516 -1184 -1058 -401 165 171 -426 -913 -1138 -349 868 1722 2359 2284 1118 -371
3987 -371 -1192 -1480 -979 -409 -300 -256 -1055 -1501 -1291 -412 868 2190 2378 1969 958 -273 -985 -841 -393
4006 -393 66 150 -534 -1033 -1375 -1048 -133 1049 1777 1508 901 -56 -797 -777 -503 181 492 304 -304 -733
4026 -733 -1068 -655 328 1184 1372 1035 -109 -932 -1274 -1111 -678 286 794 445 -231 -495 -120 331 1062 1591
4046A591l65r18j001q61j69O66P39L17M52k84k28J10K66N33Q15j61n03q27j537
4065a365o95L8P41O57O81K78j76j98L01R02N56M10l64j049j144r32m57K42L90
4084a184L01O23N8M7K00L31P64O98K55n09r39j284q40l43K51P64L01J03n9k04
4104f66O42P76O47O54K10o55q61q89q59k03O1K14J42j59k03K77K74R16N87P91
4124A696J07m58n90o29k82j88K5M5l45m83k62J63O66O15Q54K23J1j86n89j61p9
4145A53k8j22k66k11o58j93j3M32P25N29O29j83o4k13j56L07k8j38l97o12l58
4166h65m38Q6J97N31M28M41r6L70Q1Q3J31j59p1l08o46m56n24J24R0L63K76L01
4188f1M7J60M41J36q1K06r1m15l98m41P6l80J85J70K11K6K02P7J34M11k10o7k35
$$ plain form
4046 1591 1226 308 -693 -1554 -1723 -1057 -318 -1 451 167 -61 49 315 848 1663 1502 999 172 -1365
4065 -1365 -2060 -2022 -1281 -624 57 335 159 -39 262 1164 1720 2130 1766 717 -427 -1359 -1816 -1574 -1184
4084 -1184 -883 -260 -202 -155 45 376 1140 1838 2093 1584 645 -639 -1479 -1822 -1571 -807 -506 -403 -462 -666
4104 -666 -24 752 1399 2053 2263 1608 747 -142 -1001 -1204 -1143 -929 -787 -946 -1149 -872 -598 318 905 1696
4124 1696 1803 1345 755 126 -156 -344 -319 -274 -619 -1102 -1364 -1201 -535 80 934 1157 1168 982 393 232 153
4145 153 125 3 -263 -474 -1132 -1325 -1338 -906 -181 348 977 794 730 517 361 668 640 502 105 -507 -865
4166 -865 -1303 -1217 -1020 -489 -61 380 284 654 735 818 949 790 719 411 -235 -691 -1215 -1091 -1001 -638 -362 -61
4188 -61 -14 146 587 723 642 848 757 342 -56 -497 -421 -801 -616 -446 -235 -209 -7 70 204 615 405 338 103
4211A03M0k60k3l71M17m6KK38J92j23K5p5j82nn0k71L5r5M14J3L6k4K51K91l5
4236D97j77k7q2m80k17j03Pq4L32K10L12N7J56K71L37r9k29j76j76q07n04j60
4258a142J55j8N07K93M74J24K03J69M84K35o15m77n34o80l20k90K98M5O03K01
4278b85K96K85P04K45L20Ll12n35q38o02k45m07J94M70Q7J32K61L58M43K08O88
4299A470j42m80n17n25n62j96L59M8K90k08J31OJ79M43N53L07l24j66p73l44j18
4320e69P5J68J46k1k25K53j81K92L96K02J27k3p44k79k71M0N99N30J53Q4l68m67
4342h3k24K9M31J03j42l95o60r1J67O70O86L38K30r3p17k54m5j57J57J90n45o79
4364a084j25M1N07P27Q78N65K0r2o66o04q0M4j15n21n53m86k92J34Q77J039Q99
$$ plain form
4211 103 143 -117 -140 -511 -94 -140 -138 100 292 169 194 119 -63 -68 -118 -389 -354 -449 -35 -22 14 -10 241 532 497
4236 497 320 293 211 -269 -486 -589 -582 -666 -334 -124 188 245 401 672 1009 910 681 505 329 -478 -982 -1142
4258 -1142 -987 -1005 -498 -205 269 393 596 765 1249 1484 869 392 -142 -822 -1142 -1432 -1134 -1089 -486 -285
4278 -285 11 296 1000 1245 1565 1568 1256 721 -117 -719 -964 -1371 -1177 -707 -620 -488 -227 131 574 782 1470
4299 1470 1328 848 331 -194 -756 -952 -593 -545 -255 -463 -332 -326 -147 296 849 1156 832 666 -107 -451 -569
4320 -569 -494 -326 -180 -201 -426 -173 -354 -62 334 536 663 640 -104 -383 -654 -614 -15 515 668 752 384 -83
4342 -83 -307 -278 153 256 114 -281 -941 -1032 -865 -195 491 829 1059 966 249 -5 -50 -207 -50 140 -405 -1084
4364 -1084 -1209 -1168 -661 66 944 1509 1529 1437 771 167 87 131 16 -505 -1058 -1544 -1836 -1702 -825 214 1113
4385A113J33N7l78k71m85J33j32j01n21o51n52j38M62O64J374O74L44k35n65l17
4405F08l47L98l56l75n38q65m97j57Q55R73J083N68q0l48m29m7r6L49r2m04m26
4426b23q87o09J54N85J088O10N10n16l69l75k6L61K88J62l44q92o97r2L63P31
4446a78R34L79k96k76q57J37ON11L03j34n85l83l59l72P51Q80L61P9k84p32m66
4467e81r3K66P62L62n27l01o05r2J92P50P84N68o19o44m24p79K48L58P18J5j97
4488A61o02l20Q6O37O23P58L19q23n96q15j47m0O98L70k65k73n06k95J89P69R15
4509H43N68q6o15o92n81P2K23L00M62m28m88o86j19K73R99P23M44k27n44n32j70
4530b61K18L41M00j29n40q10l28r5N32P63M81K38l62m73j02m1O53N34k2k56o42
$$ plain form
4385 1113 1246 1303 925 654 169 302 170 69 -452 -1103 -1655 -1793 -1331 -667 707 1381 1725 1490 925 608
4405 608 261 659 303 -72 -610 -1475 -1972 -2129 -1274 -301 782 1350 1270 922 493 446 350 699 607 203 -223
4426 -223 -1110 -1719 -1565 -980 108 718 1228 712 343 -32 -58 303 591 753 409 -483 -1180 -1272 -909 -178
4446 -178 756 1135 839 563 -294 -157 -151 360 663 529 -56 -439 -798 -1170 -419 461 822 901 617 -115 -581
4467 -581 -674 -408 354 716 189 -112 -717 -809 -617 133 917 1485 866 222 -202 -981 -733 -375 343 358 161
4488 161 -441 -761 -675 -38 585 1343 1662 839 243 -572 -719 -759 -61 309 44 -229 -735 -1030 -841 -72 843
4509 843 1411 1325 710 18 -563 -491 -268 32 494 66 -422 -1108 -1227 -954 45 768 1212 985 441 -91 -261
4530 -261 -43 298 698 569 29 -781 -1109 -1204 -672 91 572 810 448 -25 -127 -168 485 1019 997 741 99
4551I9q65m52M6N70N80N39J67m41n00k3M22N26M05lm83p91o59l07K7O52N53N10
4573E72k12k81j5k9N39O70K69k73o48j017q09l69N59K36O00p8j09j81J02L57Q22
4594G05Q15J36l74q12p96p64L27J86L82L00Q1n52J4J93K31O68N64k92n63q29p35
4615a115k64K39N40N83P5j76r4j67O42O80K76m9j56m90r15m97k52M77M98N83o3
4636C55l46m78K85Q8O61K12J21n63q01o10k5J97K80R71J84k06j50nj9L67L65k6
4658H57l28o38o49m95k6M21P63L74J28N3m34K70j4M46K13k11n02p08o01k12J62
4679a131N74L67N64K7J21o1qKK88J2l78n75o77l80j68L43P21N14K19L2j02J84
4701D88J8J13K20J19p33m81o58j37m7N74O29K29J73j1k97m08M51K34p3j81n41
$$ plain form
4551 99 -766 -1218 -1172 -602 -22 517 684 243 -257 -280 142 668 1073 1070 587 -204 -863 -1170 -1143 -491 62 572
4573 572 360 79 64 35 574 1244 1513 1240 592 -425 -1234 -1603 -1044 -808 -208 -286 -395 -576 -474 -117 705
4594 705 1520 1656 1282 470 -326 -1090 -763 -577 -195 105 186 -366 -352 -159 72 740 1304 1012 449 -380 -1115
4615 -1115 -1379 -1140 -600 -17 58 -118 -212 -379 263 943 1219 1170 1014 524 -391 -888 -1140 -663 -165 418 355
4636 355 9 -469 -184 -96 565 777 898 335 -466 -1076 -1101 -904 -624 347 531 325 175 170 151 518 883 857
4658 857 529 -109 -758 -1253 -1279 -858 -95 279 407 460 26 296 282 728 941 730 228 -480 -1081 -1293 -1131
4679 -1131 -557 -190 374 401 522 461 453 455 743 755 377 -198 -875 -1255 -1423 -1080 -359 155 374 406 304 488
4701 488 506 619 839 958 225 -256 -914 -1051 -1098 -524 105 334 507 496 199 -209 242 476 403 222 -319
4722c19n14l95qN09L41O54K47Q0j44j57L60o7p2K31k57o43m94j67J31K50L05K96
4744A67P0o1j94r3J49J58j48K96l41m20j02o3L69L95N06l5J36m88k13m9j8R0J6
4767A27j06m62j44k82J01M22M22L52J88j03j69m81l5M8K04k09r8K6l56K5L75L71
4789B16L26K87q2j72l56m17j47K42o2J24l89n6k00N22K65p2K49L25j64l26k44
4810a31p4j03K25p9j08M9j99J4J54N38q1N32o5k73k27j99k43n7K97p1j42k40K36
4833b47l66M21L30L9K30%k48L3j06k50J14J9M5j62j46K5J9K55P3P8J20l00K7q5
4857h2o5K76l81J58J86k83j50L6J30L35L2K5m2o8l6j01J7K4J08j02q0N5j64n6
4881b28J48k36K94K66n2p8q4k3J14jq9J29L7l33k04J19J36p7m7L96k57q1L58m75
$$ plain form
4722 -319 -833 -1228 -1236 -727 -386 268 515 595 451 294 654 587 515 746 489 -154 -648 -815 -684 -434 -129 167
4744 167 237 176 -18 -111 38 196 48 344 3 -417 -519 -582 -213 182 688 653 789 301 88 39 21 111 127
4767 127 21 -441 -585 -867 -766 -344 78 430 618 515 346 -135 -170 -122 82 -127 -225 -199 -555 -530 -155 216
4789 216 542 829 747 575 219 -198 -345 -103 -165 -41 -430 -486 -686 -164 101 29 278 603 439 113 -131
4810 -131 -205 -308 -83 -162 -270 -221 -420 -406 -252 286 205 737 672 399 172 -27 -270 -327 -30 -101 -243 -483 -247
4833 -247 -613 -192 138 177 407 407 159 192 86 -164 -50 -31 14 -148 -294 -269 -250 5 78 156 276 -24 3 -82
4857 -82 -147 129 -252 -94 92 -191 -341 -305 -175 160 192 217 175 107 71 -30 -13 11 119 17 -63 -8 -172 -228
4881 -228 -80 -316 -22 244 192 114 30 7 121 120 31 160 197 -136 -340 -221 -85 -162 -209 187 -70 -151 207 -268
4905b68N6L56O2l04j7j7J86l22l3K07p3K76j50K07n5R9J8pk49o7j03KJO1J58M3
4931F7k51M7L26k4n3M0j56K82Nk95j81r9k7n2K44j49L07j22l2L63Q6j3j02l2k46
4956f7P7j63k21P2L4L16j48Q2R8J71M1K96n88p6Rk72%J40l05K9R8K39N7J12J12
4981A43K47m8M4k52N5m28J87k76q5J1m0J36J77J42K17M7J81r5J5j30k65N1k58
5004b24j00J78l1j34J11J46%K46J77J63j29j91k07j30j85RJ08l1j53K62kK85m3
5027A25n6P6K05k00j93J7j20j85kj01J59p6Q5L75J29j36J03J56m8q6k52o7k61
5050c53J70m3Q7p3L03N4r1J18j2K70l15j12n0Kq3j54%j79Q3l7M34L10n8l5k7J96
5076D05k03j28m1k00j44J16j13j4K78M5k28M01Q3J55k39J89k47k27J10k43k6J40
$$ plain form
4905 -268 -212 144 206 -98 -115 -132 54 -268 -301 -94 -167 109 -41 166 111 210 228 221 -28 -95 -198 -196 -195 -134 24 67
4931 67 -184 -137 189 165 112 152 -4 278 283 -12 -193 -292 -319 -371 -127 -276 31 -91 -123 240 326 313 211 179 -67
4956 -67 10 -153 -374 -302 -268 48 -100 -18 80 251 292 588 0 -76 -67 -339 -339 -199 -504 -475 -377 -138 -81 31 143
4981 143 390 342 386 134 189 -239 -52 -328 -413 -402 -442 -306 -129 13 230 277 458 363 378 248 -17 34 -224
5004 -224 -324 -146 -177 -311 -200 -54 -54 192 369 532 403 212 5 -125 -310 -301 -193 -224 -377 -115 -117 168 125
5027 125 69 145 350 150 -43 -26 -146 -331 -333 -434 -275 -351 -266 109 238 102 205 361 313 227 -25 -92 -353
5050 -353 -183 -226 -139 -212 91 145 54 172 160 430 115 3 -47 -45 -128 -282 -282 -461 -378 -415 19 329 271 236 209 405
5076 405 202 74 33 -167 -311 -195 -308 -322 -44 1 -227 174 257 412 173 362 115 -112 -2 -245 -271 -131
5098a31j27K5K05J06J6j22K68j09Ml56K73k13P2k38N8R3P9J1j67L53J28O1k14
5121G5L40k26j05j76j12m1k39K62K01o4k6J02Q2P0J51m7k07K60l34j4O2q4k7k2
5145a19Q3N7j8j9J60K3J0j7j47j6Q4j01r8P8j62L03j04K5j9K42l14pK03q6j01
5170f0J60J00l14J93j29L3r0K33N0r5Q1J7r6P9j91q5K87j39K5j53n5M3j5P7j3
5195e7O9r8kj90J84P2R9j0Nj61j44J23q1J79j7P9j81K5M8k64L30j7P6L3q4m4k11
5222b39N0R2K17j30l2K69k49k51J35JJ10N6j43K76m59J31K57j39K6L8K1O9j71
5245f5N6L0K6R6j75J10j4j01n5NL1j7L71k70q6J77j34j71L70l9j35K1j61j74L8
5270b66K8L77l30J60J24p1k35J44J58j03M7J54k11n9M9Lq6j27L37j34K13j48N4
$$ plain form
5098 -131 -258 -233 -28 78 94 -28 240 131 135 -221 52 -161 -89 -327 -269 -176 -97 -86 -253 100 228 289 75
5121 75 415 189 84 -92 -204 -245 -484 -222 -21 -85 -111 -9 73 143 294 247 40 300 -34 -48 14 -70 -97 -119
5145 -119 -36 21 3 -16 144 167 177 160 13 -3 81 -20 -118 -40 -202 101 -3 22 3 245 -69 -76 127 41 -60
5170 -60 100 200 -114 79 -50 -17 -107 126 176 81 162 179 83 162 -29 -114 173 34 59 -94 -149 -106 -121 -44 -57
5195 -57 12 -86 -88 -278 -94 -22 77 67 72 -89 -233 -110 -191 -12 -29 50 -131 -106 -58 -322 8 -9 67 100 16 -28 -239
5222 -239 -189 -97 120 -10 -42 227 -22 -273 -138 -137 -27 29 -114 162 -297 -166 91 -48 -22 16 37 106 -65
5245 -65 -9 21 47 143 -32 78 64 -37 -92 -87 -56 -73 298 28 -58 119 -15 -186 184 145 10 31 -130 -304 -266
5270 -266 -238 139 -191 -31 93 22 -213 -69 89 -14 33 187 -24 -83 -34 -31 -117 -244 93 -41 172 24 78
5293G8j52K8K52j21Rj17l1j08o0L82k10J44k40P7j5J14n1K95n4k30L50m77J20
5316a7k94K89kM1P1j54J3j47J52J91j16J9j9R2j54r5J85J5J30k13M7p8K44q5k00
5341h5J0J69n6j19j07K9J06j18J55J95k5o6K4j29M0M9JJ96k03%j12j06J38P9K6
5366I1l1O4k29oj32M5k89K65P1O7j41J79q5j05L79K2M08k17J8j14j96L54r4J22
5390D46m17j57N8j49j37L39l41J70K69j7j65j00J56j83O7L21m06K8L4k08K24J89
5412B1J87J37J93l67K14K18j32j6k04k69r8j66J48k44J05J53j06J5J45k0R8R1
5434A03q4R5J01j77rk15J03P2j16L00k24K40k47L12J38j75R9j23j81M4j63j0k60
5457c77o3P9P3m6J10M2N4Q7Q9J78J83j01qk09k29K42k76J53j44J60j36mP9K95
$$ plain form
5293 78 -74 -46 206 85 94 -23 -54 -162 -222 160 -50 94 -146 -69 -84 30 -21 274 220 -10 340 -137 -17
5316 -17 -311 -22 -24 17 88 -66 -53 -200 -48 143 27 46 27 119 -35 -130 55 70 200 -13 34 -44 200 115 -85
5341 -85 -75 94 38 -81 -188 -159 -53 -171 -16 179 154 88 112 -17 23 72 73 269 66 66 -46 -152 -14 65 91
5366 91 60 124 -105 -111 -243 -198 -487 -222 -151 -84 -225 -46 -131 -236 143 165 573 356 374 260 64 418 324 446
5390 446 29 -128 -70 -219 -356 -17 -358 -188 81 64 -101 -201 -45 -228 -161 160 -246 -218 -184 -392 -168 21
5412 21 208 345 538 171 385 603 471 455 251 -18 -116 -282 -134 -378 -273 -120 -226 -211 -66 -86 12 103
5434 103 19 114 215 38 29 -186 -83 -11 -127 173 -51 189 -58 254 392 217 316 193 12 56 -107 -117 -377
5457 -377 -440 -361 -288 -334 -224 -182 -128 -41 48 226 409 308 300 91 -138 104 -172 -19 -163 -3 -139 -143 -64 231
5481B31K0k53j7Q5Nqm42J23K78j74K8J33j35j4j23J64J20K54j25l0k60R6R2N2
5505A00K51l76j23R0P3o3k37J00L71l66Q6J39o6j6K05j29m9J76l44K22j3k04J41
5528c2L1J40j20j28j22L2L5J28J03J92q8Nm5K0J74r8l0k96k4O6J04j4q2j9o0p8
5554b06K27n2J81k31J76N7J40j11J7j47N1j82j30Q5j58o9K63r8K01K03j89l7k0
5577b9K67j19R0l03K6J10j28k83J58J2K10j81K18J9J73k1P2P4k66j20J56p8j57
5600a00j14j39r1K56J84R7J6K6n6K8K44l25M5j03k7j81l4l4%j09J63O0K80P2J6
5625A74J19Po8J36l9m99L52k97O2l29K36k2j0j80J45J19L71J78l3l40P9p4L35
5648D22l83o0l9l31L14r0QM5J24O0o6M17k62J1m2r3j63J0M2k26J6k72L13m1K89
$$ plain form
5481 231 251 -2 -19 66 71 63 -379 -256 22 -152 -124 9 -126 -140 -263 -99 21 275 150 120 -140 -44 48 100
5505 100 351 -25 -148 -58 15 -48 -285 -185 186 -180 -94 45 -21 -37 168 39 -10 166 -178 44 31 -173 -32
5528 -32 -1 139 19 -109 -231 -199 -164 -36 67 259 171 176 131 151 325 227 197 -99 -123 -57 47 33 -49 -68 -128 -206
5554 -206 21 -31 150 -81 95 152 292 181 198 51 102 -80 -210 -125 -283 -352 -89 -187 14 217 28 -9 -29
5577 -29 238 119 209 -94 -68 42 -86 -369 -211 -199 11 -170 48 67 240 219 291 365 99 -21 135 57 -100
5600 -100 -214 -353 -444 -188 -4 93 109 135 79 107 351 26 71 -32 -59 -240 -274 -308 -308 -417 -254 -194 86 158 174
5625 174 293 300 232 368 329 -170 182 -115 -53 -382 -146 -168 -178 -358 -213 -94 277 455 422 82 161 87 422
5648 422 39 -21 -60 -391 -77 -167 -159 -114 10 70 4 421 159 170 128 35 -128 -118 -76 -302 -286 -558 -245 -286 3
5673CJ14K7L0j02K9J50n8pk9l16R9m4j98J85k20J80j40P1M22j13O0q7P8N1j94
5698iJ59j47MOj85K33m08J85K2j99J01K66j4N6OK34k02k7J40m40K14l17Q5Q2j27
5723b82K06J61j20K5K13k2l1R8l70m0J22M9M4nj51o2L1Q8j31L86l21kK8J76j62
5748g2K65j71j52J95l06J96P7J33k38l2J65k00J73q1P9j84J67o8K02Pr4J32Q2
5771B75k50O4q5q4J87m71L66J74j76j67L2J10L24k83L13L9j36j5j1k02K0k77N3
5794b00k78K5K85k6K94p8L8J15K75j9M6l35J64m60L2j65J54P7j26l2N3q2K00K21
5818A78R2J45l5k39k1kn9k17j41J69l37m4J69j12L69L32R7J23L4o7j62j17j97
5841d2Q4l43j15j6L7j78K64Q1K21L94M2j48k2Kl7l5k69J5J9m01MRJ43K5K80J14
$$ plain form
5673 3 117 144 174 72 101 251 193 186 157 -159 -60 -104 -302 -117 -337 -157 -297 -226 196 83 143 56 134 185 -9
5698 -9 150 3 7 13 -172 61 -347 -162 -140 -339 -238 28 14 70 76 310 108 81 221 -219 -5 -322 -237 -155 -282
5723 -282 -76 85 -35 -10 203 181 150 248 -122 -162 -40 9 53 48 -103 -165 -134 -46 -177 209 -112 -114 -86 90 -72
5748 -72 193 22 -130 65 -241 -45 32 165 -73 -105 60 -140 33 -48 31 -153 14 -54 148 155 61 193 275
5771 275 25 89 4 -80 107 -364 2 176 0 -167 -135 -25 299 16 329 368 232 217 206 4 24 -253 -200
5794 -200 -478 -453 -168 -194 100 22 60 175 450 431 477 142 306 -154 -122 -287 -133 -56 -182 -214 -161 -243 -43 178
5818 178 270 415 380 141 120 118 59 -158 -299 -130 -467 -511 -342 -454 -85 247 344 467 501 434 272 155 -42
5841 -42 42 -301 -416 -432 -395 -573 -309 -228 -7 387 429 281 259 261 224 189 -80 -65 -46 -447 -443 -434 -291 -266 14 128
5867A28L53k56q6K14N2k09L02j59o03n8l9K08k36K00K49J30j28J43j88L3O8J92
5889C10rn4m56p7L5j04L8L94r0rJ91k82R3K27O6jQ8l42r7q0q6J0J84J61k38o5
5915a93o0J04Q3RK29J63J0k59j12l8o1J87j91J63J17l45j21n9J22L28PO2O1k91
5939h5j5q3R7J62K09j51j34j56k95K74R6lK31J12j97k24M9l3K15L34k10j92J24
5962A25k89l1R4J4L50J0k29l45p5l3QM14N3m4J74j20k49j9J31M71J35l90nl33
5986a83p0n5L21R9N0J19j44k17o1J47L37R4Q5k52k98m29p5r3J84K84K72P6k41
6009e0k38J29M51J89K37J6m08l21l99j21O9J52J27J9J09l12P5L8L04N56r5l9l18
6032A70j82k25o2n2J77J40p8n4k13J01L57K24K93L31k56n50m44P9l8RJ96J33m33
$$ plain form
5867 128 481 225 139 353 405 196 498 339 -264 -322 -361 -153 -389 -189 60 190 62 205 17 50 118 310
5889 310 301 247 -209 -286 -251 -355 -317 77 -13 -22 169 -113 -20 207 273 272 360 18 -79 -159 -245 -235 -51 110 -128 -193
5915 -193 -253 -149 -66 -57 172 335 345 86 -26 -64 -125 62 -129 34 151 -194 -315 -374 -252 76 83 145 206 -85
5939 -85 -100 -183 -86 76 285 134 0 -156 -451 -177 -81 -84 147 259 62 -162 -113 -146 69 403 193 1 125
5962 125 -164 -195 -101 -87 263 273 44 -301 -376 -409 -401 13 66 22 196 76 -173 -192 -61 410 545 155 150 -183
5986 -183 -253 -308 13 112 162 281 137 -80 -141 6 343 437 522 270 -28 -457 -532 -625 -441 -157 115 191 -50
6009 -50 -288 -159 292 481 718 734 326 5 -394 -515 -446 -294 -167 -148 -39 -351 -276 -238 66 622 527 488 170
6032 170 -12 -237 -299 -351 -174 -34 -112 -166 -379 -278 79 303 596 927 671 121 -323 -244 -282 -273 -77 56 -377
6055c77p8j44j1L03O72Q6P3Ql30m42J99L2K44N4q3m14k82J97m1O59p1K62j35k17
6079A64l41j75K61k01M20%l48k82m3J64OPO15J36m4m10k05K33N18j9K2j31j36
6102B11j21j57k48M03J68p4l19r4j05k64J50M75J47N79k97l37k80m00O10q2L32
6123B97R0l20j55l62q9M00N33J44j03k77k08j70j41L31L8L09j43l74l88k76K19
6144f45N90K19L78j21j01l07j78K27Q7J08L03n30l75k59p0M18J60M77J7j60k86
6165d8l59P8J78K72K21N7k42m41j49r7M05J19O25l37k88j87n5J6J23M29Q2j61
6187B41j47n68J34n6L73M29K5j50l88o7k56K71J94K32N9p4m46j21L19K05o2L17
6209D64J74l09m49k63j70J68L24L55j52k54k89J02K69K93J72K38j02m64l43q1
$$ plain form
6055 -377 -455 -599 -610 -307 365 451 524 532 202 -240 -41 -9 235 289 206 -208 -490 -293 -334 325 254 516 381 164
6079 164 -177 -352 -91 -292 128 128 -220 -502 -545 -381 -375 -368 247 383 339 -71 -276 -43 475 456 478 347 211
6102 211 90 -67 -315 88 256 182 -137 -231 -336 -600 -450 25 172 751 454 117 -163 -563 47 -35 297
6123 297 387 67 -88 -450 -539 -139 394 538 435 158 -50 -220 -361 -30 8 317 174 -200 -588 -864 -645
6144 -645 -55 164 542 421 320 13 -165 62 149 257 560 30 -345 -604 -674 -256 -96 381 398 238 -48
6165 -48 -407 -329 -151 121 342 399 157 -284 -433 -530 -125 -6 619 282 -6 -193 -248 -232 -109 320 402 241
6187 241 94 -474 -340 -396 -23 406 431 281 -107 -174 -430 -159 35 267 326 252 -194 -315 4 209 147 464
6209 464 638 329 -120 -383 -553 -385 -61 294 142 -112 -401 -299 -30 263 435 673 571 107 -236 -317
6229c17J45KL83j54k1k17N1j60L09L98K4k8j84r9m48j59P1J99K88k14ok81k5P4
6253c69O18K36J12J40m93j53j54j46J75n6K64l53j61l30K55P0N23R9J48J40m91
6274G4j84n8K22j55K38q3j54l45j53J34K61L99J22O4j63l8l15K31L7J2K76m54
6296c2l60Pr7J52K93J20K23k60q8J13k00R5P5J34J41j43m09j23p5J17L35K13j09
6319A22n5j07p6J04J27K57J15k00j38k70j17r0JJ66J06J19j15j95J88o5K53J73
6341C03K44k39j9l82j50k09K55L05j19J54j12k74r2N30J16N1J02m56J39k85k3
6362a61l4K90P2O1k58k10l7K97N3M28k06n7j64l15p7J5J69J75k6J20j13k44m7
6385b69K53L00j0j34J53k99k16J91l79K94J1J03J32j58j39L00j42J19j6p3R5m70
$$ plain form
6229 -317 -172 -170 213 59 38 -179 -128 -288 21 419 443 415 231 132 -316 -475 -404 -205 83 -131 -137 -418 -443 -369
6253 -369 249 485 597 737 244 91 -63 -209 -34 -90 174 -179 -340 -670 -415 -345 178 277 425 565 74
6274 74 -110 -168 54 -101 137 54 -100 -445 -598 -464 -203 196 318 382 219 181 -134 97 134 146 422 -32
6296 -32 -392 -385 -482 -330 -37 83 306 46 -42 71 -129 -34 41 175 316 173 -236 -359 -434 -317 18 231 122
6319 122 67 -40 -116 -12 115 372 487 287 149 -121 -238 -328 -327 -161 -55 64 -51 -246 -58 -123 130 303
6341 303 547 308 289 -93 -243 -452 -197 108 -11 143 31 -243 -335 195 311 362 464 8 147 -138 -161
6362 -161 -195 95 167 228 -30 -240 -277 20 73 501 295 238 74 -241 -318 -303 -134 41 15 135 22 -222 -269
6385 -269 -16 284 274 140 293 -6 -222 -31 -410 -116 -105 -2 130 -28 -167 133 -9 110 94 21 116 -354
6407c54J53J4o3J30J45J15K3j19j13K89j30L6J06k37k77q4K48o3j30K17K46p4
6429G8J05K67k16o7Q8k00J01j42m1k80j44kJ68K89o0N9J98k72L13Q7j02L1K8m2
6453B44m96o2j61J03K77mj40J32K65K64l25J14Nj68Lk07J06r0o6k1R9K26k2M7
6477A23K39j71j0J6K5l54K71J6m73K92j61n7K39l04L45j61K95o4r6q7L07k27L0
6500C3J6k89J87o9J18J30j1pQ9l2j23P0j50j82P3o1K14j44M2M3Pk1o3K67np3p5
6527a6J37j73KM6j9J44n3o5k65J84K21j11r2k1Ro7MK69k82r0K80J66j99Nj1J67
6553A70n7J2j42j55L09j57nk89K07p4K52M0r8O1l7J51NJ49l65J24r0l27K14K7
6577g5j44J87pn0O3O9j10P9q0K47k6K1j58k43NM95k26o7K98k39j55q8J70K67l55
$$ plain form
6407 -354 -201 -187 -250 -120 25 140 163 44 -69 220 90 126 232 -5 -282 -366 -118 -181 -311 -94 152 78
6429 78 183 450 234 167 255 55 156 14 -27 -307 -451 -453 -285 4 -56 3 201 -71 242 329 227 258 286 244
6453 244 -252 -314 -475 -372 -95 -99 -239 -107 158 422 97 211 216 48 51 -156 -50 -140 -206 -227 -128 98 76 123
6477 123 362 191 181 197 222 -132 139 155 -318 -26 -187 -244 -5 -309 36 -125 170 106 10 -77 230 3 33
6500 33 49 -240 -53 -122 -4 126 115 108 197 165 42 112 -38 -220 -147 -208 6 -138 -96 -53 -46 -67 -130 137 132 59 -16
6527 -16 121 -52 -50 -4 -23 121 68 3 -262 -78 143 32 -60 -81 -72 -139 -135 134 -148 -238 42 208 9 14 3 170
6553 170 113 125 -17 -172 137 -20 -25 -314 -107 -181 71 111 13 74 37 188 193 342 -23 101 11 -316 -102 -75
6577 -75 -219 -32 -39 -89 -26 43 -67 12 -68 179 153 174 16 -227 -222 273 47 -20 278 39 -116 -204 -34 233 -122
6602a22K14Q5q8j82L4j46J33J23j90L75j84j30J2R5J28p8k13K26j19j85R2J22
6624Bm0O4N0J4j87r9K36l7J6N2k8J06k3l28M5o9L01m7J00J64m63k26J87J79J13
6649H2r4O4k27k0j06L60L5J27j31J02l27PR9Qk8J80ol07J19p8L09l42K86p5J14
6674A51L9j56l49O5J76L91k17J66l26o2k68K69L36j80J1j29J95l90K34p7n8M20
6696B41m3n0q0o1j59q2M76l3j92P4k48K8%l4L75j6r4j12j54j04N2K38RJ79l05
6721i5p3p5O7R6N7K88q9K20j76k60j50J53l5J1K00l11j3j05L6L07N9K60q7j32
6745A53k59o5K4K4K41J17k00Qm6k29K64O0J63QN8k86N4k69K02j55K06J75m35J57
6769c0r0k17L58K05K33j83l12K57k18j77K75q7j2J75k49k40N84k34o6J07K8J27
$$ plain form
6602 -122 92 177 89 -93 -59 -205 -72 51 -139 236 52 -78 -66 29 157 79 -134 92 -27 -212 -120 2
6624 2 -38 26 76 90 -97 -196 40 3 19 71 43 149 126 -202 -157 -226 75 28 128 292 -171 -397 -210 -31 82
6649 82 -12 52 -175 -195 -301 59 94 221 90 192 -135 -128 -29 -21 -49 131 125 -182 -63 -141 168 -174 112 37 151
6674 151 190 34 -315 -250 -74 317 100 266 -60 -122 -390 -121 215 35 46 -83 112 -278 -44 -121 -179 241
6696 241 198 148 68 7 -152 -234 242 209 17 91 -157 -129 -129 -163 212 196 102 -10 -164 -268 -216 22 31 210 -95
6721 -95 -168 -243 -176 -80 -23 265 176 396 220 -40 -190 -37 -72 -61 139 -172 -185 -290 -254 53 112 372 285 153
6745 153 -106 -171 -147 -123 118 235 35 43 -3 -232 32 92 255 263 321 35 89 -180 22 -133 73 248 -187 -30
6769 -30 -120 -337 21 226 459 276 -36 221 3 -174 101 14 2 177 -72 -312 272 38 -28 79 107 234
6791B34l03o5j14O4K49P5k81J23j44j11J23L8P4K31n3J17k73p9r4K07j7l1J79
6814A49r9j31q0q9K42J24K61k83K7k50k6O0k4L2J48J65m48J44Lr4L59J9L7L4k17
6839F3m15J68J83j74mJ8J19k12pK30o7L77m7m4l2R2m54K37o5%K46jj35k24O7M9
6865c2j8K17l8j83l9k09j48J06J18J29J25P9n5M8j26P5J11J35N7j58l60J19R6
6888D9o7K3o0J14l52K21J06k42J70M1O7k6n0j29j06K01j22J31m3P4K0k48K44j49
6912a33J32K44j16K27l92j58J29J06j00OKo7K23l72J34m2K28j38L6q8R0j20j5
6935a84L66k21J27Q5J8J3k08o9p6L45m0J45r5q3r9j82K31j09J96n4n2r0n7K9j77
6960b41M32l42J43J38k66J90P8j32N6K5J01j26k3j64K32j04J53q8P6o4k48J32
$$ plain form
6791 234 -69 -134 -248 -184 65 140 -141 -18 -162 -273 -150 -112 -38 193 140 257 -16 -95 -189 18 1 -30 149
6814 149 50 -81 -161 -250 -8 116 377 94 121 -129 -155 -95 -119 -87 61 226 -222 -78 -75 -169 190 209 246 280 63
6839 63 -352 -184 -1 -175 -179 -161 -42 -254 -261 -31 -98 279 232 188 156 248 -206 31 -34 -34 212 211 76 -148 -81 -32
6865 -32 -50 167 129 -54 -93 -302 -450 -344 -226 -97 28 107 52 100 -26 49 160 295 352 194 -166 -47 49
6888 49 -18 5 -55 59 -293 -72 34 -208 -38 3 70 44 -6 -135 -241 -40 -162 -31 -74 0 20 -228 16 -133
6912 -133 -1 243 127 354 -38 -196 -67 39 -61 -55 -53 -120 103 -269 -135 -177 51 -87 -51 -139 -49 -169 -184
6935 -184 182 -39 88 173 191 204 -4 -73 -149 196 156 301 206 123 24 -158 73 -36 160 106 54 -36 -93 -64 -241
6960 -241 191 -151 -8 130 -136 54 132 0 56 81 182 56 33 -131 101 -3 150 62 138 74 -174 -42
6982d2j27K42o5J98k66j30N6P5J93j76L34j02o9jj39n6J18J79k85M8J81q8j4l
7006F1k80K66j5n2L13j31j88R7j42j05o4K46l9q3L2q4K27O5j83K3kQ7j76L64l36
7031i9J61j64J06J9K6P5o6L6o1M1q2J41k14K20j07m4k34K32J1r7K6j55M17k38
7055e0j8Q4K4l1JM6m1k48K30J83k82J66P4r7j15J83m1p0o8N0j9o6K67j85J86j4
7081A49k19J57LK1j34j12O2R3J2j59J32mj2L4J67j15l26J89j66K26L5k11m6J99
7105b5j7J01n7j09J78Oj05K08R9j19N3j10k9K93m58N1J46j71M2J13l14J33K25
7128A34l29j27L67j59k0J80M4m1J2k33l0M7LL5l5K00j35J82j64n7K01j85L25k28
7152a3P8j93K89mk45K26j12M3j47K1j13J8p1K92J3j61J02J4o0P6J4k6O7l28K37
$$ plain form
6982 -42 -169 73 8 206 -60 -190 -134 -59 134 -42 292 190 121 120 -19 -75 43 222 -63 -15 166 78 64 61
7006 61 -219 47 32 -20 293 162 -26 71 -71 -176 -240 6 -33 -116 -84 -168 59 124 -59 -36 -38 49 -127 237 -99
7031 -99 62 -102 4 23 49 124 58 94 33 74 -8 133 -81 139 32 -12 -246 -14 -3 -100 -74 -229 188 -50
7055 -50 -68 16 40 9 10 56 15 -233 -3 180 -102 64 138 41 -74 109 68 -2 -70 -20 -39 -105 162 -23 163 149
7081 149 -70 87 90 111 -23 -135 -73 20 32 -127 5 1 -11 23 190 75 -251 -62 -228 -2 33 -178 -224 -25
7105 -25 -42 59 2 -107 71 77 -28 180 279 160 213 103 74 367 -91 -40 106 -65 -23 90 -224 -91 134
7128 134 -195 -322 45 -114 -134 46 90 49 61 -172 -202 -155 -152 -117 -152 48 -87 95 -69 -126 75 -110 215 -13
7152 -13 65 -128 161 157 -88 138 26 69 -78 -57 -170 -152 -223 69 82 -79 23 37 -23 53 67 41 108 -220 17
7177A7q9J62J3k32J73k13J99J1p0l7o6K97o2j23K7j59J47j52K78K5o7j68K42l7
7201A16l67K56j2j74K79m9p9j20K1J13R5j19jR4q3J92k54M37m59L24n41K68J05
7224D2j27q2K21q1n3QO4j02P6j50M10j71j30K03k03J01L8J73j84Q7p8kq5K13j30
7249E8j02PJ52j93K03j26J2M5j07J7j72M43k21j21N8R6n4q2K90o7mQ8k38J34k95
7274a79Q6J48O3j34j54L79j52Q1j52J72p7k17r7K96j33K84l10K34r3o9L2J02P4
7297A84L8l29P9j28J16k2J60q4j5K7Q8N4Kj54j18J88Jj47J9k02L89m9j58j86J98
7322d9R4j70J53k68K15K75O9m82l1M24k09J16k35o0J45o8K20j37j0q7J75k55J24
7345e1kK30j35j8O8K6kj26j77K64p0l5p0M0r3K06o6j61K67r8n6J44j0q2j86K92
$$ plain form
7177 17 -72 90 103 -129 44 -169 30 41 -29 -66 -132 165 103 -20 7 -152 -5 -157 121 146 79 -89 153 116
7201 116 -251 5 -7 -181 98 49 -30 -150 -129 -16 79 -40 -41 53 -30 162 -92 345 -114 210 -331 -63 42
7224 42 -85 -167 54 -27 -80 -72 -8 -110 -34 -184 226 55 -75 128 -75 26 64 237 53 140 62 60 -25 188 58
7249 58 -44 -37 115 -78 125 -1 11 56 -51 -34 -206 237 16 -105 -47 49 -5 -87 203 136 132 220 -18 116 -179
7274 -179 -93 55 118 -16 -170 209 57 138 -14 158 81 -136 -233 63 -70 214 -96 138 45 -24 8 110 184
7297 184 222 -107 -28 -156 -40 -62 98 14 -1 26 114 168 170 16 -102 86 87 -60 -41 -243 146 97 -61 -247 -49
7322 -49 45 -125 28 -240 -25 250 319 -163 -194 230 21 137 -98 -158 -13 -81 139 2 -8 -95 80 -175 -51
7345 -51 -53 177 42 24 92 118 116 -10 -187 77 7 -28 -98 -58 -151 55 -11 -172 95 -3 -59 85 75 -7 -193 99
7371I9n0k05j8N1J93J22j99n1MR1k4P8k65J64j94K06l7p2J91l9j01K4K32k04n8
7396f2K07rj76Q1k66J75J10k02K46q1q8R1J27m7r1J5J85j02j91k86L67p1K30j52
7420A0LJ31j69K3j35J85L6L6p2j80K8J43p1m5J23O5N6j54L85m24K1J40j76l6K89
7445B12k00J3k03L86J4j26q3Q3j77j04J1K42j6K2q1K4j2k32K7n4L63J36n3l44
7469a52L13j23k07L30O7k24j25O7J77k49QP3K3o0L11k21m6J52j51O1R3N6m0j01
7493C2l38J33j26J38J18J51M3k10kl9j58L99n9M9m0J2k12K30Q1l01J84k29K15
7516G1j79J32NJ7q4R0k96P5J2Q3j54J82K38k75J07q7n2K8P1P3J03Q2j68j25K76
7541B25l10J74M0k47J02P1O1j68p8J16m7J24P2J8l23oJ48r9K67r0m7pQ6k05J28
$$ plain form
7371 99 49 -156 -174 -123 70 192 -7 -58 -54 37 13 91 -174 -10 -204 2 -35 -107 84 45 -56 -32 200 -4 -62
7396 -62 145 136 -40 41 -225 -50 60 -142 104 23 -65 26 153 106 15 30 215 113 -78 -364 3 -68 162 10
7420 10 13 144 -25 -2 -137 48 84 120 48 -132 -104 39 -32 -77 46 111 167 13 398 -26 -5 135 -41 -77 212
7445 212 12 25 -178 208 222 96 13 96 -81 -185 -174 68 52 74 -7 17 5 -227 -200 -254 109 245 192 -152
7469 -152 161 38 -169 161 228 4 -121 -54 123 -126 -118 -45 -22 -82 229 8 -38 114 -37 24 117 173 133 32
7493 32 -306 -173 -299 -161 -43 108 151 -59 -61 -100 -258 141 82 131 91 103 -109 121 202 -99 85 -144 71
7516 71 -108 24 29 46 -38 52 -244 -169 -157 -74 -228 -46 192 -83 24 -63 -115 -87 -16 57 160 242 74 -51 225
7541 225 -85 89 129 -118 -16 55 116 -52 -130 -14 -61 63 135 153 -170 -176 -28 -127 140 50 3 -4 82 -123 5
7566EJ1K2k5j9j56J01J09O4L49m17J02o1l05M15l53p2J62K4l6k7j75J56O2K03
7590A39k76J49N1J05m07M5M64j23M1J18r9j9j16P0k62J26K8M7O6j59k38J72l21
7613c99J21K54qm2P5r5J54m9J18J59K4k29M6k02O5Q6P2L0k02J17k66K50k17R0
7637d8kJ05k4k39N3Q8K67k25RJ34k15J00o3o3J2K15l29j01K91m4n1j63M12k70
7661a51J13N6j12J71j1o5q0J86r4j17L3j34K59j59K28r6L9j19J79k41p2J42J77
7684A32k18J48k05O2j53K49n5j1J22j15R1J00q5R7J82l17k7J32k6M7j51l4Q4j08
7708e9J27l60K71J02q9J87%q6j09o2J20J65j53j30o3K37j53j03o9R9K38k76K75
7731A09j28J6k2J0R1j1j40J45j11j65K68j53k24L47j12J99N7j40N5o1N1J51Qj04
$$ plain form
7566 5 16 38 13 -6 -162 -61 48 112 461 44 146 85 -220 195 -158 -230 -68 -44 -80 -107 -282 -126 -64 139
7590 139 -137 12 63 168 -239 -194 270 147 188 306 207 188 72 142 -120 6 34 81 147 -12 -250 -78 -399
7613 -399 -278 -24 -32 -74 1 -94 60 11 129 288 312 83 129 -73 -8 78 150 180 -22 95 -171 79 -138 -48
7637 -48 -50 55 31 -208 -155 -67 200 -25 -16 118 -97 3 -60 -123 -111 104 -225 -326 -35 -79 -130 -293 119 -151
7661 -151 -38 18 -94 77 66 1 -79 107 13 -104 -71 -205 54 -105 123 27 66 -53 126 -115 -187 -45 132
7684 132 -86 62 -143 -81 -234 15 -40 -51 71 -44 47 147 62 159 341 24 -3 129 103 150 -1 -35 49 -59
7708 -59 68 -292 -21 81 -8 179 179 93 -16 -78 42 207 54 -76 -139 98 -55 -158 -227 -128 110 -166 109
7731 109 -19 -3 -25 -15 76 65 -75 70 -41 -206 62 -91 -315 32 -80 119 176 36 91 30 81 232 240 136
7755A36k82j16K75j81K1K08l32M32k06L0N4J11k68J18m2k5j75L09j55K22m21J64
7777a23J3O6JL6M1K60Qj37j47K22j55j92J17j78k2J11j26K66k34J76J66j78J50
7800A41k45J17Q6l4K0j54j43J88j46K29k09J44j20J25q2J69O8k93J27L9K7p0j7
7823c3J09j27n4m3l7J59L0L1q1L0k2J82K6j04j12p8J10K5k13K25j44P7J8n2K78
7848B00k89Nq6L4K13j07K1L4N4n0j94nK53k14R4n5j76K49j22O2R6J58Rk35L0j7
7874c8M6K11k73K55k71j5j00K13q7J01J2k0nJ43m3j75L30k76nm1J94m69M60l77
7898b30J15J4J20r0J11l7J26M8l89L81j11N8j58O8Q3Q6p6k04k0O3O4k55M0L29
7922A36j03R9m0l7M2n3J43m1l22J9n0K93l10J35j29J31J97Q8N5k40KJ08j19q1
$$ plain form
7755 136 -146 -262 13 -168 -147 61 -271 161 -45 -15 39 150 -118 0 -42 -67 -242 67 -88 134 -287 -123
7777 -123 -110 -44 -43 -7 34 294 302 165 18 240 85 -107 10 -168 -190 -79 -205 61 -173 3 169 -9 141
7800 141 -104 13 99 65 85 -69 -212 -24 -170 59 -150 -6 -126 -1 -83 86 154 -139 -12 27 54 -16 -33
7823 -33 76 -51 -105 -148 -185 -26 4 35 -46 -16 -38 144 170 66 -46 -124 -14 11 -202 23 -121 -44 -26 -78 200
7848 200 -89 -84 -170 -136 77 -30 -9 25 79 29 -165 -170 83 -131 -37 -92 -268 -19 -141 -79 17 175 184 -51 -21 -38
7874 -38 8 219 -54 201 -70 -85 -185 28 -59 42 54 34 29 172 129 -46 284 8 3 -38 156 -313 147 -230
7898 -230 -115 -101 19 -71 40 3 129 177 -212 169 58 116 -42 26 109 195 119 -85 -105 -42 22 -233 -193 136
7922 136 33 132 92 55 97 44 187 146 -176 -157 -207 86 -224 -89 -218 -87 110 198 253 13 15 123 4 -77
7946g7l4K06k96q5J40L6J48j57J00R2K1R8r3QKj33Jl7J42n1l26O9m6QP8J20P2
7973FJ57j1J2L2J22k57o5K51l26q6N2NO8k58L31r1J63J56k76J31ol0N3j32l01
7998c00K50J15j39k9J0J07r7R7L8P5Q8l8J63k86J02j09N7ok02j41M9k5n7M55k12
8023c5P4k5NJ1k4P7M5p9p6M3j19M7j34K92k21k1J13J53j32P1M7j14J60k74L06
8048A90j08k05N8P8QL4j78K18oR2k28K6kj00l3K04k4J0o7J75j92J10j42q7K17
8073D8j6J39j87p5J16P7n9j80m1K29q5J73q1P8j48k9j16K35K7j64p5L6j4J26q4
8098g0J81k54L35j83N7q7r9J51J76j09j12q8N2l4j6P8K14J32j38J13k94J37P0
8121B12j71K1ok72k5j3K21J00j69K54l19J41M0l5L7K32p8J7m6l46l5K21k59J57
$$ plain form
7946 -77 -111 95 -201 -286 -146 -110 38 -119 -19 73 94 192 99 107 109 -24 -23 -60 82 31 -295 -226 -272 -264 -186 -66 6
7973 6 163 152 164 196 318 61 -4 247 -79 -165 -113 -108 -40 -298 33 -58 105 261 -15 116 110 80 133 1 -300
7998 -300 -50 65 -74 -103 -93 14 -83 14 52 127 215 177 340 54 156 47 104 98 -104 -245 -196 -221 -278 177 -35
8023 -35 39 14 19 30 6 83 128 49 -27 16 -103 -56 -190 102 -119 -140 -27 126 -6 65 112 -2 158 -116 190
8048 190 82 -123 -65 13 21 55 -123 95 89 181 -47 -21 -23 -123 -156 48 24 34 -33 142 -50 60 -82 -169 48
8073 48 32 171 -16 -91 25 102 43 -137 -178 51 -34 139 58 136 -12 -41 -157 78 105 -59 -134 -98 -112 14 -70
8098 -70 111 -143 192 9 66 -21 -120 31 207 98 -14 -102 -50 -84 -100 -22 192 324 186 299 5 142 212
8121 212 41 62 56 -216 -241 -254 -33 67 -102 152 -167 -26 14 -21 16 248 170 187 141 -205 -240 -19 -278 -121
8145a21m0J38j63K5J84k72M91j00L1P6j92j06k8j04Q3k37L53J8r8j39K27n9J33
8168A00L53k32L2j50j61J30k55m9J34o9j74J04P7J2R8K94r6L38k37k21q2j50L1
$$ plain form
8145 -121 -161 -23 -186 -161 23 -249 242 142 173 249 57 -49 -77 -181 -98 -335 18 36 -62 -201 26 -33 100
8168 100 453 221 253 103 -58 72 -183 -232 -98 -167 -341 -237 -160 -148 -50 244 148 486 249 28 -54 -204 -173
8191a73
$$ Imaginary data points
##PAGE= N=2
##DATA TABLE= (X++(I..I)), XYDATA
0@%%%%%%%%%%JrJ6j6J7k5L2m0M9n7P2q7J04j22J39j63J90k18K55k95L37l85M37
33B32m94N59o31P10p96Q90r95J109j232J367j515J678j855K048k260K490k745
50a440L025l330L671m052M475m948N484o101O816p654Q651r862J1376j3330J5961
65H742j9714K5553l5990O0459k31003j72250K48429J32403J21775j3148m1591
76H3665o7029K4678O8307R0550K0600m1015j27164j41756j02494L200P9956J22492
88A3990R4440L7807m3148p6499n4886Q670M8619N7516J0734o3484j27333j23053
100b16627n4350M3365J08276J26248Q2464N908m9770m6045p49N1444P3645N5446
112A79255n575p9100j14168q9843l1342L6653Q4028P9768K6375l9098p1586n5725
$$ plain form
0 0 0 0 0 0 0 0 0 0 0 0 1 -8 8 -8 9 -16 16 -24 25 -32 40 -47 57 -65 74 -89 101 -117 138 -157 180 -205 232
33 232 -262 297 -334 376 -420 470 -525 584 -648 719 -796 882 -973 1075 -1185 1305 -1440
50 -1440 1585 -1745 1926 -2126 2349 -2599 2885 -3216 3600 -4054 4597 -5265 6111 -7219 8742
65 8742 -10972 14581 -21409 39050 -191953 -364203 -115774 16629 138404 125256 83665
76 83665 16636 41314 109621 200171 220771 179756 52592 -89164 -191658 -188458 -108502 13990
88 13990 108430 146237 103089 26590 -28296 -19626 28993 86509 97243 33759 -93574 -216627
100 -216627 -270977 -227612 -119336 6912 89376 95284 45514 -531 -1280 50164 123809 179255
112 179255 173680 94580 -19588 -109431 -140773 -104120 -20092 59676 86051 46953 -24633 -80358
124h0358o931N1568Q0900N1318j7230p6154r2035n4133J5416P8883R7877N6586
136A05707j1865n9483o6513l1485K5464O5381O1527J5071m1831p3638o6925k5081
148a03671L5316P4785O8333K2139l4555o9206o5745k2868L5979O7624N0228K917
160F1276m6364o8205m4341J2728O6692Q1183M9361m508n2468p1255m5383L469
172e7815M0079M5295J9351k0831n1354n3145j9111L0773O3752O5602L5882j3391
184H5087n2612n8124k8216J7705M5213M0871P838l7368o2364m6208j931M4218
196d5891O5602N1345J0540l4385n3924l6260j124L1052M3444K5219j3009m6281
208c672n2536k8127J1198M4935N7575L6552m575l6807m2351k0436J6512M3440
$$ plain form
124 -80358 -87289 -35721 45179 96497 79267 3113 -88922 -143055 -127639 -48756 49121 105707
136 105707 93842 34359 -32154 -63639 -38175 27206 88733 103804 61973 -11665 -78590 -103671
148 -103671 -68355 6430 74763 96902 62347 -6859 -72604 -95472 -59493 8131 58359 61276
160 61276 14912 -53293 -97634 -84906 -18214 62969 112330 107822 55354 -15901 -61284 -57815
172 -57815 -17736 27559 46910 26079 -25275 -78420 -97531 -66758 -3006 62596 98478 85087
184 85087 32475 -25649 -53865 -36160 9053 49924 57762 20394 -41970 -88178 -90109 -45891
196 -45891 19711 71056 81596 47211 -6713 -42973 -44097 -13045 30399 55618 42609 -3672
208 -3672 -56208 -84335 -73137 -28202 29373 65925 61350 24543 -17808 -38244 -21732 21708
220B1708M3267J1322l1975n6553n1454j9825K1097M6106M0159J0907k2055l5187
232b2483k3343N719L6475M9007L2483p61l3322m8265l8162j0977J9228L2849K0846
245A9294n011k6449l2885j4849J7831M4978M9028K6157q150l5456m3638k6573
257c5723L469K3748K3034N000j9517l3103k6175J25L0288M5239L8858J4781j5512
270E4512l4650l2751j3556R657K0547J3643o199k6639l3572j7965R586L5181M3760
283B1554L1283N588j8712k9239j8363J632J5964J8023L875j7896l1799k8960j0196
296e7246J3762K9584L1144J6053o146k0063j9201o553J1215K1057J6958O56j9183
309A2037k7288k0125l155J5982K5851J9291K964j3748k1016j2753K813J7825K3137
$$ plain form
220 21708 64975 76297 44322 -12231 -63685 -83510 -62413 -16307 23852 34759 12704 -22483
232 -22483 -45826 -40107 -3632 45375 77858 77097 43775 -4490 -42652 -53629 -34401 -1552 19294
245 19294 14283 -12166 -45051 -59900 -42069 2909 51937 78094 69944 34488 -9150 -35723
257 -35723 -32254 -8506 14528 19528 11 -33092 -59267 -59142 -28854 16385 55243 70024 54512
270 54512 19862 -12889 -26445 -16788 3759 17402 11203 -15436 -49008 -66973 -57387 -22206 21554
283 21554 52837 58425 39713 10474 -7889 -6257 9707 27730 31605 13709 -18090 -47050 -57246
296 -57246 -43484 -13900 17244 33297 27151 7088 -12113 -18666 -7451 13606 30564 31220 12037
309 12037 -15251 -35376 -38531 -22549 3302 22593 25557 11809 -9207 -21960 -19147 -1322 21815
322B1815J3751l095j7872k2097j3584J419J3478J5854N412r838j9487j8500o967
335c9711J0743K2692K2650J2654j919j1164j2063m968O173J0695N506n483j6358
348e53k1746j5973k566J2998K1562J9231J0215j218q782o207P74P013P366j089
362B1025j2713k1069k1118j1005L893J5481J9756J5139P186O56j511L87M966N143
376B6216M40p030j5532j9935j7059p607L997J2776J5657J3239N548L40R4K816
390A3960N666N385o84r079j5863j6296r876j408O447J0557Q804N488K753J554
404G408J434K429J810R5l054o930q267q130n301O32O509R587Q996L810k09k907
420G912k757n11P05j660m539o971o440j754K748O990Q139O010L947K347n11j983
$$ plain form
322 21815 35566 32471 14599 -7498 -21082 -19663 -6185 9669 15081 5243 -14244 -32744 -39711
335 -39711 -28968 -6276 16374 29028 27109 15945 3882 -1086 5087 15782 21288 15805 -553
348 -553 -22299 -38272 -40838 -27840 -6278 12953 23168 21950 13168 6961 7735 14748 22114 21025
362 21025 8312 -12757 -33875 -44880 -40987 -25506 -5750 9389 16575 17231 15720 16107 21073 26216
376 26216 26656 19626 4094 -15841 -32900 -40507 -36510 -23734 -8077 5162 10710 11050 11144 13960
390 13960 19626 25011 24327 15248 -615 -16911 -26787 -28195 -21748 -11191 -2387 3101 5854 7408
404 7408 8842 11271 13081 13176 10122 3192 -5075 -13205 -18506 -17874 -11365 -1778 7218 11028 10819 7912
420 7912 5155 4644 5349 3689 -850 -7821 -14261 -16015 -13267 -6277 1862 7872 11819 14166 13655 11672
436A1672m423o315o401n461k663n92O60K415M786O482Q525Q189M383J66m752p291
452I380p561q322p962o662m524L33N544Q933J0276Q750O719O110N412K952j644
467B7734r118j4053j6092j2981n564Q60M445O343O499P233R276J1329J0071O831
481C2813N24n363j0585j4429j4240j2106p430m25M751P186P815O056O148Q327
495I042J0195J0206M655m420j2572j6612j4051p053n81L182L344J594J116M326
509g629P722J0185J0220O490N88n717j0344j2122j1739p733j020L529M354K646
523a0570j29q38K721Q867J3610J1202L224o212j2874j2479n497J300M532K991
537a52k093n120n004j201N048Q864Q660N867J40n666p937p550k400L206O040N249
$$ plain form
436 11672 7249 934 -5467 -10928 -13591 -14183 -13523 -11108 -6322 160 8685 16874 21257 21423 16671 9380
452 9380 1819 -6503 -14465 -21127 -25651 -25318 -19774 -10841 -565 8185 14904 21014 26426 29378 27734
467 27734 18616 4563 -11529 -24510 -30074 -29214 -24769 -18426 -11927 -4694 4582 15911 25982 32813
481 32813 33337 27974 17389 2960 -11280 -23386 -30816 -31241 -26490 -19304 -11489 -5433 715 9042
495 9042 19237 29443 34098 29678 17106 494 -13557 -20610 -21191 -18009 -14665 -13071 -11955 -7629
509 -7629 93 10278 20498 26988 27576 21859 11515 -607 -12346 -20079 -21099 -17570 -13216 -10570
523 -10570 -10699 -11537 -8816 51 13661 24863 28087 21875 9001 -3478 -8975 -7675 -3143 -152
537 -152 -2245 -7365 -12369 -13570 -8522 342 9002 14869 15009 9343 1406 -6144 -8544 -5338 702 5951
553E951o68p070q691m814L379J0427J1343N333l878j0354r007j798N282R678O724
568A1837m70o473q845n857m5M668P196N422K29m506o801o112m97N514R000P000
584A1260N50o162r449p807M28Q152R341N804k740r546r813l758M939R769Q667
599I635K616l916q404p188j709L366P328P024K004l983q559q545l020L476R418
614d57Q893K541n583r697p512N87Q995J2059Q334j682j0094j1798o632J458Q071
629b517P149K193m476q783o507j341N527J0235R826N020j886p736r052n712M45
644g615N710O385P91n278r787p561P94R313J4374J1583K897n498r938p624j009
659b463L517M040O09n836r962r028l927L481J0015J1389Q384K534m383o988m883
$$ plain form
553 5951 5283 -1787 -10478 -15292 -11913 -1486 9857 15190 11312 958 -8049 -9847 -4565 5113 11837
568 11837 11367 4894 -3951 -9808 -9853 -5185 2011 7433 7662 3156 -3645 -9757 -10254 -4740 4260 11260
584 11260 11810 5648 -3801 -11608 -11180 -3028 6313 12117 9377 -169 -9982 -13740 -8801 968 9635
599 9635 12251 8335 -69 -7257 -8966 -5600 1728 8752 10756 6773 -1786 -10331 -13351 -9875 -457
614 -457 8436 10977 5394 -4303 -11815 -11228 -2233 9826 18160 16478 6384 -5414 -12046 -10588 -2517
629 -2517 4632 6825 2349 -6434 -12941 -14282 -8755 1480 11306 16326 14440 6704 -2348 -8060 -7615
644 -7615 -1905 4480 5271 -7 -9794 -17355 -16561 -7248 7126 18709 21606 16108 6170 -1454 -2463
659 -2463 1054 5094 5703 -133 -10095 -19123 -23050 -19569 -9554 1835 10219 12753 8370 1382 -3501
674c501O28N965O592J953m928j0453r113k144O963J3049J1896M105l940r391q274
689e93k845K169L722R97n404r825r984n898J975Q557J1462J0080M097j368l779
704C363k268K660O919P647L263l561r778j0267n170K419P783O735K064m857r543
719b591q416l252K361N680L947p23m812o773m344J483O989R902Q878L697j267
734A0759m863m035O21N372O761M671j375p013q568o143j24M649M864J099m644
749B031r655q609m386J578O255O336L368m44l258k020J827O392Q493P188K024
764A7120l333o880o367k251K449N543L804r6n012o148m329K88M180M812J744l260
780B264p469p361m751R23N035O280M439J090j516j440J903M290O945N250J038
$$ plain form
674 -3501 -2873 3092 9684 11637 6709 -3744 -12857 -15001 -8038 5011 16907 21012 17072 7681 -593
689 -593 -3438 -1269 2453 3450 -1954 -11779 -21763 -27661 -25686 -17129 -5667 4413 8510 7142 3363
704 3363 1095 3755 10674 18321 21584 18023 8245 -2022 -7192 -4773 3010 9745 11809 6952 -2591
719 -2591 -11007 -14259 -11898 -6218 -2271 -2994 -7806 -14579 -18923 -17440 -10451 -549 8329 12026 10759
734 10759 5896 1861 2482 7854 14615 19286 17911 10898 2330 -3813 -3937 712 5576 6675 2031
749 2031 -7624 -16233 -20619 -19041 -12786 -6450 -3082 -3526 -6784 -8804 -6977 -585 7908 15096 17120
764 17120 13787 6907 540 -1711 738 6281 10085 9989 4977 -1171 -5500 -5212 -1032 3780 5524 2264
780 2264 -5205 -12566 -17317 -16394 -11359 -5079 -640 450 -1066 -2506 -603 3687 10632 15882 16920
795A6920l771p449p146m100j65L169L333M90k672m197k657J023M362N532L996
810F668om069n222m393L4L603M810L525L29k656l287j582J568L870L413Q38l363
827D080o149n742k971Q90L849M144K306J25j914j169J307L594M758L664M43k949
843H266m846m098j416J026K832J944r54l047m050l023Q4K359K565J191j415l138
859e720k541p37K222M550M603L374J124q04p37j71R63J923J446n98k663m605m691
876c062k555q7K217J910L74j550k605k079K42K248K756K001l71j767j547m01J799
893b477K988L120K810Q06m95j111r35l42N91M41j08j706l921l631k261n01J762
910d970K331O82n38j661q18P32J746K841J818N6j319j276p96R34J519J567R67
$$ plain form
795 16920 13149 5700 -1446 -5546 -5711 -2542 791 1281 -1391 -5588 -8245 -7222 -2860 2672 6668
810 6668 6662 2593 -2629 -7022 -6988 -3385 1425 4950 5279 2623 -664 -2246 -678 3192 6605 7443 4080
827 4080 -2069 -7811 -10782 -9892 -6043 -1899 407 532 -1382 -2551 -1244 2350 7108 10772 11215 8266
843 8266 3420 -678 -2094 -1068 1764 3708 2754 -293 -4343 -7366 -7282 -4923 -2358 -1167 -2582 -5720
859 -5720 -8261 -8998 -6776 -2226 2377 5751 6875 6071 5334 5163 6126 8049 9495 8897 6234 1629 -3062
876 -3062 -5617 -5704 -3487 -1577 -1203 -2753 -5358 -7437 -7195 -4947 -2191 -190 -561 -2328 -3875 -4276 -2477
893 -2477 511 3631 6441 7247 6752 5641 4706 4364 4955 5396 5288 3582 -339 -3970 -6231 -6732 -4970
910 -4970 -2639 -1957 -2495 -4156 -4974 -4242 -2496 345 2163 2219 900 -376 -1172 -238 1281 2848 3815
927C815J21j99j094j150j95K8L42L28r26j782k009k070j91R31J968J201P1q49
945a660n00P84J537K009J236k87o12j159n93l22k54Q0p0k93j29l76q36l99j05
964a949Q40J530Q00k65q71j276j99J033J843P87j09j119j147n55O55J064N72p86
982H48r82j029l05P1m85L75j80j27O57K48j8M01PR02J215J088K48q18j285k67
1002E64J75L53L46p53j442r68l58Q22M65P9j36m58k7O84P39L81J75o37oO93L57
1023A048J10j08j014M2K07J48L99m58j204r23lO42N00p6O9m39KP67J116M63J05
1044A393m21J48J20J03j23m30q41j14J12r6K58q41n62N8N4O51L68n43l92j35O2
1065a171R05P67Q7j14j67K52J101J56J02j61j040m56J67N0Jn37r31k24O7M80N51
$$ plain form
927 3815 3936 3737 2643 1493 1298 1326 1668 1996 1070 -712 -2721 -4791 -4982 -4051 -2083 -882 -811 -1660
945 -1660 -2160 -1376 161 2170 3406 3119 2507 1348 755 433 179 259 189 -104 -233 -609 -1445 -1844 -1949
964 -1949 -1109 421 1221 956 85 -1191 -1390 -357 1486 2273 2164 1045 -102 -657 -2 1062 1634 848
982 848 -134 -1163 -1468 -1397 -1882 -1507 -1687 -1814 -1157 -909 -927 -526 -519 383 1598 2686 2934 2116 831 564
1002 564 739 1092 1438 685 -757 -1725 -2083 -1261 -796 -717 -853 -1311 -1338 -654 85 466 641 4 -2 691 1048
1023 1048 1158 1050 36 78 285 433 832 374 -830 -1753 -1756 -1114 -614 -690 -621 -1060 -1058 -291 825 1288 1393
1044 1393 972 1120 1240 1343 1220 790 -51 -165 -53 -149 109 -732 -1294 -1236 -1182 -531 -163 -706 -1098 -1233 -1171
1065 -1171 -266 501 588 474 307 559 1660 1816 1918 1757 717 261 428 478 479 -58 -989 -1213 -1146 -666 -115
1086a15n4m84k99L3O52J33M0j99p21n7Q13J82M29N3j42J56Q74J76K68l21p80k48
1108C89K32k2m47q05q11j15O9O88Rj80k69l2K30J113M13L3k23k82K01N35O32K89
1130A647m68n59M1K94M17k9o38p41o19j05K20j15m93m01k80k15O88O80K59J82
1150b35p2L63Q58L56O20n07m27lJ68j41r1m92o62j76N4l2K4n47j7k95M49O69n0
1173a86K7k1l58M09P44K5N5j85l94K75L10r6k61l09n99K76k23L27K59k14n14K23
1195d30L38L92J84L3O2n50Q6J04j50O2j88l73K11k12J42K30k79p3J13J8K47K24
1217A91Q4j56J72j39L52j03k39RJ18r3M58l19l90O5m51K03L7O5J6j99m08J78K32
1240c17M80J68k38mK80L1J45j4k40q6j41j56K44l12n73J3k66K32K29L63p9k0J6
$$ plain form
1086 -115 -169 -653 -952 -919 -267 -134 -94 -293 -1014 -1071 -258 -76 353 406 264 420 1294 1470 1738 1417 637 389
1108 389 621 599 152 -653 -1464 -1579 -1510 -822 -813 -993 -1262 -1294 -1064 49 462 495 272 -10 191 726 1358 1647
1130 1647 1179 620 661 955 1372 1343 705 -36 -655 -760 -540 -655 -1148 -1549 -1829 -2044 -1356 -676 -417 -235
1150 -235 -307 56 914 1270 1890 1383 956 953 1121 980 889 397 -265 -441 -387 -419 -395 -942 -959 -1254 -805 -136 -186
1173 -186 -159 -180 -538 -129 615 640 695 510 116 391 701 605 344 35 -564 -288 -511 -184 75 -139 -653 -430
1195 -430 -92 300 484 517 579 29 115 219 69 131 -57 -430 -219 -431 -289 -59 -338 -411 -298 -280 -33 191
1217 191 275 119 291 152 504 401 162 171 289 196 654 335 -55 10 -441 -238 -201 -136 -120 -319 -727 -549 -317
1240 -317 163 331 93 89 369 400 545 531 291 205 64 -92 152 -160 -733 -720 -986 -754 -525 -162 -241 -261 -245
1263b45K36J95Q27L1r7l70j55k72n2J38k93k26m45l47J64j08L17J71M84K89N4
1284B96k06K51K33j09N54p3l03l25p85k1P1J22J71J16k20m2L4l94M94P14K4p1
1306E31n59m95k27k38M49O42K47L19j65l22m2M7Q16P9J50l20q19j231o44K52J71
1327a359O96L92o1j78l4K85O76R38J095k3l42q27r47q85J40K45K3l28r10r50k27
1348b581L87J146J501N16L03m86q68J0m8O50N78j5m91r83j079J61O12J218J591
1367B122O47o85p86j088j11R7M76J39p28j439j407j515j6J396J563J488N72m01
1385C24k35J3L03J220J575J35n15j465j880j076L89R95J605N50k37j077j430q0
1403h86N27J147R05l98j860k536j867m50J363K150J788P99m40o32J13J148J975
$$ plain form
1263 -245 -9 186 1013 1044 947 577 422 150 98 236 -57 -283 -728 -1075 -911 -1019 -702 -531 -47 242 296
1284 296 90 341 574 465 1019 946 643 318 -467 -488 -417 -295 -124 -8 -228 -270 -236 -630 -136 578 602 531
1306 531 -28 -523 -750 -988 -539 103 350 669 504 182 140 187 1003 1082 1232 912 93 -1138 -1782 -1530 -1359
1327 -1359 -663 -271 -332 -510 -544 -259 417 1355 2450 2427 2085 1258 311 -574 -434 -189 -166 -494 -1404 -2354 -2581
1348 -2581 -2194 -1048 453 969 1272 786 -82 -72 -120 530 1108 1093 602 -381 -1460 -1299 -687 531 2122
1367 2122 2769 2084 1298 210 99 196 672 811 83 -1356 -2763 -4278 -4294 -2898 -1335 153 725 324
1385 324 89 102 405 1625 3200 3335 2820 1355 -525 -1601 -1212 -217 1388 1938 1701 624 -806 -886
1403 -886 -359 788 1693 1295 -565 -3101 -4968 -5418 -4055 -1905 -117 682 242 -390 -277 871 2846
1420B846K023J172j045j960k893j558m54J089J350M23p30j833j702p15J265K131
1436e91K141M40j367j789k042k37J673K104K291N59q22j915j304K5J808J445J270
1453C689m98k630k835j888l15J970K490J671K80j957j796p94J071K655K488J089
1469D690j338k622k824r53J383K522K687K79j893k787k395p13R67K108J797l09
1485E99k298k607j661M47L229M033L233J140j557k261j457P66K132K048K92j891
1501D187m334l991k076M66K834K883J150p50k641k409o46J702L053K434M24j735
1517E51l214k536K75L004M624L954J134j179k785k276K32K112K465O73k136n142
1533b44n025l411k19K699L350J918n12k509k355m24K645M211M428J722j351l150
$$ plain form
1420 2846 4869 6041 4996 3036 143 -1415 -1869 -780 570 993 263 -1570 -3272 -3987 -2722 -591
1436 -591 1550 1990 623 -1166 -3208 -3445 -1772 332 2623 3182 2360 445 -859 -834 974 2419 3689
1453 3689 3191 561 -2274 -4162 -4477 -2507 -17 1654 1934 -23 -1819 -2613 -1542 1113 3601 4690
1469 4690 3352 730 -2094 -3047 -1664 858 3545 3824 1931 -856 -3251 -3964 -2997 -889 908 599
1485 599 -1699 -4306 -5967 -5520 -2291 1742 4975 6115 4558 2297 840 1606 3738 5786 6078 4187
1501 4187 -147 -4138 -6214 -5748 -2914 -31 1119 369 -2272 -4681 -5327 -3625 -572 1862 2286 551
1517 551 -2663 -5199 -4924 -1920 2704 6658 7792 6613 3828 1552 1784 3896 6361 7034 4898 -244
1533 -244 -5269 -8680 -8899 -6200 -2850 -932 -1444 -3953 -6308 -6732 -4087 124 4552 6274 4923 1773
1549A773l199p56K280L670L603N68k143l822l423o56K171L310J828j356m185m976
1565e313l712l78K915L721K502l86k705k961q23K656N017N333L002l75l053l557
1581A883j620J313L059L211k63l249n156m917j818J657L832L378R07k382l645
1596c810l194K48L437M579L240J75l323m305k901P99M328M553L208J21l727l853
1612d25k171J248M013L472J206k872n334n389k322J600M202M073J683j870l739
1627b625k873K26L518N285L579N93l715m944m050l01K555M125L248k88l371m306
1643c344k127R57M308M782K729j364m394n066k368P13M047M361J421j773m523
1658a641l892q79K524N152M162J208k541m590m083n14K716M704L400j35l426n055
$$ plain form
1549 1773 -1426 -2182 98 3768 7371 7939 5796 1974 -1449 -2105 66 3376 5204 3848 -337 -5313
1565 -5313 -9025 -9403 -6488 -2767 -265 -651 -3356 -6317 -7140 -4484 533 5866 8868 8493 5440 1883
1581 1883 263 1576 4635 7846 7583 4334 -822 -5739 -7557 -5900 -2068 1310 2217 -165 -3810
1596 -3810 -7004 -6756 -3319 1260 4500 4675 1352 -2953 -5854 -5055 -727 3826 7034 7155 3428 -425
1612 -425 -2596 -1348 2665 6137 7343 4471 -863 -6252 -8574 -6974 -2772 1301 2984 1114 -2625
1627 -2625 -5498 -5272 -1754 3531 7110 7703 3988 -956 -5006 -5307 -2752 1373 4621 4333 962 -3344
1643 -3344 -5471 -4514 -206 4576 7305 5941 1547 -3519 -5887 -5174 -1127 3234 4655 2882 -1641
1658 -1641 -5533 -6412 -3888 1264 5426 6634 4093 -497 -4580 -5094 -2378 2326 5726 5591 2165 -2890
1674b890l399J77L920M388L295n17l789m404k593J318L972M660K381j078m700
1689G41m728k158J152M316M131J694j619m553l799o60K458N058M118J052k778
1704D425m749m095j277K774M137L250m93l165m502l133N99L844N298L126n29l332
1720B178m494k937J015L920L973K117j673l953m238j710J890M716M510J606j750
1735E170m679m022j298K025L841L269P6k790m921l979j52K696M563L593L86k478
1751A300l769k098J080L987M621L119q22l428m699k609L62L014K984J158k187
1766B013m260m061j124J789M740M199J406j523l628l186r08J770L651K622J33
1781C633k606l763k643P41L690M851L538O25k620l746l344o23K039K318O08k117
$$ plain form
1674 -2890 -6289 -6112 -2192 2196 5491 4974 1185 -3219 -5812 -4494 -522 4138 6519 5441 741
1689 741 -3987 -6145 -4993 -677 3454 5148 3529 -1024 -4823 -5483 -3025 2033 6151 7203 4425
1704 4425 -324 -4419 -5696 -2922 1215 4465 3972 807 -3695 -6828 -6229 -2385 2913 6039 5510 2178
1720 2178 -2316 -5253 -4238 -318 3655 5772 4099 146 -4092 -5802 -3912 804 5314 6920 5170
1735 5170 491 -3531 -4829 -2804 1037 4306 4382 1592 -3329 -7308 -7460 -4764 -201 3392 3778 1300
1751 1300 -2469 -4567 -3487 500 5121 8240 7418 3990 -709 -3318 -2956 58 3042 4200 2013
1766 2013 -2247 -6308 -7432 -5643 -903 3296 4702 3179 -449 -3635 -4543 -2773 878 3500 3633
1781 3633 1027 -2736 -5379 -4638 -948 3903 7441 8066 5446 1700 -1644 -2267 -228 2090 2698 581
1797E81m309m233j598J794M563M916L094J40k476k393r55J212K942J741o11k881
1813A527m278l602n66K470M198M085J285j089k633j851lJ576K177R16j880l927
1829a595m068k187O94L202L822L040O31j496j585j002R53K183K058J8k402l713
1845a447l294j200J353L194K888J494m15j858j881J06J484J936J301q07k570l293
1861c009k139K06J986L002K218O44j373j753j100Q19J754J586P05j243k746k576
1877c019r72J205K053K077J039k63j513j912m18P24J518J191k7j469j799r60o
1894b551J376K169J908K96j045j634j256m28N30P52M74n48j390j302m01J002J777
1911b71J831J267K46p92j438q88j45M83K20k52j017j179p11J83R61J647J564M93
$$ plain form
1797 581 -3728 -7961 -9559 -7765 -3202 1714 4808 4948 2472 79 -876 336 3278 5019 4408 1527
1813 1527 -2751 -6353 -6919 -4449 -251 3834 5119 4030 1397 -454 -457 1119 3296 4212 2332 -1595
1829 -1595 -5663 -7850 -7156 -3954 -132 2908 3539 2043 458 -544 409 2592 4650 4668 2266 -1447
1845 -1447 -4741 -5941 -4588 -1394 1494 2988 2573 715 -1166 -1060 424 2360 3661 2854 284 -3009
1861 -3009 -5148 -4942 -2956 46 2264 2908 1535 -218 -1318 -499 1255 2841 3546 2303 -443 -3019
1877 -3019 -3991 -2786 -733 1344 2383 2120 607 -1305 -1723 -999 519 1710 1683 214 -1585 -2545 -2551
1894 -2551 -1175 994 2902 3198 2153 519 -737 -1165 -635 117 591 43 -1347 -2649 -3050 -2048 -271
1911 -271 1560 2827 3073 2281 843 -45 -190 293 513 261 -756 -1935 -2646 -2463 -1502 145 1709 2202
1929B202O9j009n73j24rk92k24p80o24p24l6M64R67P46J029N29O7j68k55l95l37
1950E23j81n30r11o55O8l41O22O73N17P44M98O53J87K81k34m74q37r49l25k09
1970h80l55Q7p83j05J66N29J111N84Q67N14o30n6m87j55J94K80k19n27r90q42
1990a697k15K23J002J118P25M56q48p97q9L46P34J005m61j189j396j328k53Q33
2008a831J220J515K73m34j001n27L21J050J336N21m24j465k280j223j39J369J813
2025I4J306J32j243j478m40J149J927J847M44j376k465k346p91P34J595J946L59
2042A394j087j674j165K64J908K370J866j01j707k536k074l09J703K173J585o88
2058A922j897k344j401P92K440K616J280q38k385k691o98J341K395K612N82j367
$$ plain form
1929 2202 2271 1262 689 565 556 264 40 -740 -1364 -2088 -2124 -1660 -693 53 1082 1611 1678 1510 1255 860 523
1950 523 342 -188 -1099 -1754 -1686 -2027 -1405 -732 -215 529 1027 1680 1867 2148 1914 1440 603 -346 -671 -880
1970 -880 -1235 -1148 -1931 -2036 -1870 -1341 -230 354 1221 1735 1105 1049 562 407 601 881 662 135 -855 -1697
1990 -1697 -1912 -1689 -687 431 1156 1612 764 -33 -122 224 958 1963 1502 313 -1083 -2411 -2664 -1831
2008 -1831 -611 904 1177 743 -258 -785 -464 586 1922 2443 2019 554 -1726 -2949 -3088 -1719 94
2025 94 1400 1532 289 -1189 -1629 -480 1447 3294 3738 2362 -103 -2449 -3240 -2506 -911 1035 1394
2042 1394 307 -1367 -2532 -2268 -360 2010 3876 3775 2068 -468 -2542 -2851 -1148 1025 2610 1922
2058 1922 25 -2319 -3720 -2928 -488 2128 3408 2570 185 -2506 -3204 -1863 532 3144 3726 2359
2074B359k575k635q22J945K490K234L71j746k883k493M5J932L370K260k4k013
2090A815l510k174j42K440L712J613o05k740k985j843J253L489L525J237j233
2105C852l149l634j660J093L051K866P48j830l287k800l36K693M216L544O06k175
2121C798l992k900o41K604L142K198m96l356l886k441Q02L651M295K398q47l267
2137A062l803k060Q78L095L718J596j438l598l488j362K300M454M051J361k176
2152D590m180l946q92K186M005L034J61l295m713l297J92L167M482L022k21l607
2168F88m280k336O38L831M622K649o62l709m054j582J514M510M305J573k388m568
2184G51m729j909K201L879L620Q59k877m492l987o12L131M713L643J47k952m765
$$ plain form
2074 2359 -216 -2851 -3673 -1728 762 2996 3367 1621 -1262 -3755 -3710 -1778 1592 3852 3828 1815
2090 1815 -1695 -3869 -4011 -1571 2141 3754 3149 409 -2576 -4419 -3166 323 3848 5085 3852
2105 3852 703 -2931 -4591 -3498 -447 2419 3167 1337 -1950 -4750 -5086 -2393 1823 5367 5973 3798
2121 3798 -194 -3094 -3735 -1131 2011 4209 3713 357 -3529 -5970 -5168 -1517 2778 5176 4329 1062
2137 1062 -2741 -4801 -3923 -828 2890 4486 3048 -550 -4038 -5400 -3100 1354 5405 6766 4590
2152 4590 410 -3536 -4428 -2242 1763 4797 4958 1663 -3050 -6347 -6155 -2988 1494 4516 4295 688
2168 688 -3592 -5928 -5290 -1459 3163 5812 5150 1441 -2613 -4195 -2681 1829 6134 7707 5319 751
2184 751 -3978 -5887 -3686 193 3813 4672 1795 -2697 -6684 -7296 -4165 548 4191 4338 1386 -3379
2200c379k920M69L922N290L706j2l113m486k595J111L813M538J830k417n198n684
2216e125k858J196L946M504J819k086m470l281q79L117N195M641R03k607m910
2231h95l884o70L333N169L915N76l419m713l413K99L461M400K763j352m773n876
2247e079l219M20M284M660K623p39m290m192q64K334N322M765K085k406n092m602
2263c990j536K623M548M235P45l161n084l849l76L361N146L386l42l924n368l511
2279g097N14L580M746L205p93l563m510k811K100M705M947K451j707m733m811
2294c777j741J741M426M304J268k451m968m442j145K972M878L960P16k816m875
2309a950l720J15L009N077L555j76l872m789l036O52L823N020K409r93m248m591
$$ plain form
2200 -3379 -6299 -5830 -1908 3382 7088 7076 3963 -523 -3118 -2007 1806 6344 8174 5757 559 -5125
2216 -5125 -7983 -6787 -2841 1663 3482 1396 -3074 -6355 -7234 -4117 1078 5719 6622 4015 -895
2231 -895 -4779 -5449 -2116 3053 6968 7544 4125 -588 -4001 -3702 -241 4159 6922 5570 797 -5079
2247 -5079 -8298 -7878 -3594 1066 3689 2950 -1340 -5532 -6396 -4062 1260 6025 8110 5704 612 -3990
2263 -3990 -5526 -2903 1645 5880 6625 3464 -1620 -5469 -5845 -2484 2662 6048 5706 1782 -3586 -7097
2279 -7097 -6583 -3003 1743 4948 4155 592 -3918 -6729 -4629 76 5023 7474 5767 1034 -3777
2294 -3777 -5518 -3777 649 4953 6221 3770 -1198 -5640 -6785 -3813 1065 5025 5741 2925 -1950
2309 -1950 -5670 -5555 -2546 2531 6086 5910 2038 -2751 -5787 -5135 -1312 3708 6117 5124 876 -3715
2325c715k551J243M171M571K074j772m285m492j260K080M399M380J413k266m524
2340e34l786j037K801M604L730L09l253m859l524m07L089M714K937k26l550m764
2356c756k414J040L843M659K273r13l779m112k027J429M297L801J768j820m176
2371A13m268j404J899M126L764P22k045m326l661n82L148L999L728J53k783m233
2387a650l098J29L074M143K548l39l537m123k593P95L386M024J992j124l361m167
2403c901j625J193M012L762J761j675l527l400p51J869M038L191O61k242m048
2418f82l373m85J993L505K617k06k782l280k772M49K788L862K439j82k479l539
2434b127j888P61L187L433J870r41l403l151j683J241L036L329Q79j147l644l104
$$ plain form
2325 -3715 -6266 -5023 -852 3719 5793 4021 -264 -4756 -6016 -3936 463 4843 6256 3990 -534
2340 -534 -4320 -5357 -2556 2048 5778 6087 2834 -2025 -5549 -5956 -2867 1847 4784 4558 1008 -3756
2356 -3756 -6170 -5130 -1287 3372 5645 4732 953 -3159 -5186 -3757 540 4341 6109 4289 113
2371 113 -4155 -5559 -3660 466 4230 4952 2907 -1419 -5080 -5662 -2514 1485 5213 5366 2583 -1650
2387 -1650 -4748 -4619 -1545 2598 5146 4807 1270 -2853 -5446 -4651 -1265 2759 4751 3627 266 -3901
2403 -3901 -5526 -4333 -321 3441 5202 3527 0 -3400 -4151 -2282 1756 4947 5608 3366 -682
2418 -682 -4055 -4540 -2547 958 3575 3369 587 -2693 -5465 -5016 -2228 1634 4073 3891 1412 -2127
2434 -2127 -4015 -3254 -67 3366 5236 4295 892 -2259 -3942 -2701 335 3664 4543 3396 -248 -3352
2450c352j230J669L063K686L49j792l353k379k28K172L269K721K45j971l095j947
2466c173N87K138L283K007o82k744l284j553P77K191K797J490j360k581k993j043
2482d143J224K528K313J134j382k568k594l64J602K522K587R08j729k364j894
2497b220l19J817K719J733L8k361k508j791l87J994K132J608n04k075k396p69
2513c289O75K278K291J181o35k283j982j042J001J973K206N05j214k070j947m40
2529b792J057K274J824N3j330k036j576l12J482J977J529J23j424j963j104L58
2545a860J867J865J101m32j886j769r61j67J659J544Q08p55j715j258n95P64J594
2562a96J590P20p41j591j143m11R80J576J294K79r25j575j195J41R34J086Q45
$$ plain form
2450 -3352 -4582 -2913 150 2836 3185 1393 -1960 -4339 -4567 -2395 874 3595 3840 1869 -1226 -3173
2466 -3173 -2586 -448 2835 4842 4160 1416 -1868 -3421 -2644 -453 2344 3834 2474 -107 -3100 -4143
2482 -4143 -2919 -391 1922 3056 1674 -894 -3488 -3852 -2250 272 2859 3767 2038 -326 -2220
2497 -2220 -2539 -722 1997 3730 3768 1407 -1101 -2892 -3279 -1285 847 2455 1951 -124 -2520 -3289
2513 -3289 -2614 -336 1955 3136 2501 218 -1764 -2806 -1805 168 2374 2879 1665 -405 -2352 -2792
2529 -2792 -1735 539 2363 2416 1086 -950 -2526 -2838 -1356 621 2150 2273 849 -1114 -2218 -1860
2545 -1860 7 1872 2973 2541 655 -1114 -2075 -2242 -583 961 1769 1014 -701 -1959 -2554 -1790 -196
2562 -196 1394 2114 1373 -218 -1361 -1772 -792 784 2078 2357 1432 -143 -1338 -1197 -263 823 1668
2579A668j25j070j629j138K25J103J294Q20j2q30j048p95M49J035J338N45l90
2596A440j321j193m50L07J480O85P12l85r53j100L5N54Q17Q41J6j084j260p62
2614a621j27O63J035P76J71o29p28l09J13O73Q02L66j25j044r11l92K12O63R31
2633E19M07j92m85m34j37L53M25N98r1m89q17r25rK39O69O49K31m7l78m6j49M82
2655C73M19K50j33n10p74n12k60N27L81N60Jk74l76J6K4N17J48O4O5l06n25m9
2677c74J13K69L97k8j17j47j13L0N5J68J01k92K9n06j21J60L6M8L31J62k3r6q
2700G4n8K15j35J42j02J12l94k5j41J3L65q7P1J6k00Q3K09l84L50j32K49k67K30
2723B04p2j20L3o4p0K99Q0q2j29p6l24o2L09p4k9J40oN0l42R7K03K54R6O3J7l73
$$ plain form
2579 1668 1543 473 -1156 -2294 -2069 -966 328 1148 1136 306 -742 -1537 -1088 -53 1285 1830 1440
2596 1440 119 -1074 -1524 -1217 263 948 1660 1275 322 -778 -743 -189 628 1469 1485 401 -859 -1621
2614 -1621 -1748 -1085 -50 726 897 268 -460 -769 -656 17 819 1185 1060 16 -895 -1287 -1075 -412 519
2633 519 926 734 249 -185 -322 31 456 1054 963 474 -343 -1268 -1277 -1038 -369 280 511 464 86 40 -109 373
2655 373 792 1042 909 399 -375 -887 -1147 -620 -239 321 322 48 -328 -312 -288 229 377 441 506 200 -325 -374
2677 -374 -261 8 405 377 260 113 0 30 85 253 354 62 91 -415 -536 -376 -340 -292 39 201 178 82 74
2700 74 16 231 96 238 136 248 -146 -171 -312 -299 66 -21 50 66 -134 -51 158 -226 124 -8 241 -26 204
2723 204 132 12 45 -19 -89 210 290 208 79 3 -321 -383 -74 -148 -177 -37 -43 7 -335 -238 -35 219 315 378 395 22
2749B2j6l12J27R8J55J13q8l63k18k69N67M02PJ86l84J9j73J01K21P6J51p5j81
2772A66l26l51K89K68K66N1l12nl99r8K69J46K83R3k88j67q6m56L41K09M79J12
2794D84k71j01j95l6Q9K88J76o9k22p46J9j17M95M02N07l9l70k05l15K44K72M63
2816G53k41l39m31o95j46K44L32M51N16m20j72p5M9K88O54J87l6l61o31k30%J87
2838a16J03L91K06m73l63r6p7rM04K62m58k11l09l93L10K82Q06M53j18j1n01K96
2860C78L2L63J61K54m59n66m40m19K22L72K12O4m30j75k78N1J91M52m0R3j72l81
2882e15l65L61J91Q24M09J01j25m62j2j20l1M77N0m05m89m10m64K97M21M03J70
2903C06k68l62j97m9N7M19j81K29Q6n93J5L7L74O55L16K34m8k82l61p4M1L52j02
$$ plain form
2749 22 6 -306 -179 -81 74 187 99 -264 -482 -751 -184 218 225 411 27 46 -127 -26 195 271 422 347 166
2772 166 -160 -511 -222 46 312 363 51 46 -353 -451 -182 -36 247 340 52 -115 -201 -657 -316 -107 372 484
2794 484 213 112 -83 -119 -30 258 434 365 143 -603 -584 -701 -206 196 703 664 294 89 -226 18 290 753
2816 753 512 173 -258 -953 -1099 -855 -523 -72 444 24 -148 -223 -174 114 768 955 919 558 -73 -303 -303 -116
2838 -116 -13 378 584 111 -252 -348 -425 -434 -30 232 -226 -437 -746 -1139 -829 -547 259 712 594 583 82 378
2860 378 410 773 934 1188 729 163 -277 -696 -474 -102 110 174 -256 -431 -709 -658 -467 -15 -55 38 -134 -515
2882 -515 -880 -519 -328 496 905 1006 881 419 407 287 256 733 783 378 -111 -521 -985 -688 -267 136 306
2903 306 38 -324 -521 -570 -513 -94 -275 -46 40 -553 -538 -501 -127 528 844 1078 1030 748 387 313 354 706 604
2926F04n43l17m40m46L76L97K91K26o1j34j3m09R1L29M6M15l03Ml47j95M05L88
2948C64K65J63On21j14n16J11K45l3q1n40J7m2J71L44N05K45J08j35J9l82J17
2970C16j17J41l2j08l63k13n0j80L78K9J10j48n1j89p0L23M0K21L31q8p6p5K78
2993D07L22R6L66j56k73j42k86m43k60k85J47k3k13l60J31p8J83O97J0J07R0j03
3015f6N5J36K46J54J48l25R3j49J99K17J5J4k13n3k22m72q1k85j40M1J8k56j5
3038i41J33j3N54R0M26k9L8M5m10M16o8J17J19k24j42J46P3L0k36M71j55l58O8
3061A50O5k78k11j92L9o7M3J10j94r4M15J35J01K43K4p2J74k32MJ38N8l22J42
3084A79j79j81J49j23j45K5K75O2j33Q9J09j11p3J12l8K72n9r7j87K08n8J24j79
$$ plain form
2926 604 61 -256 -696 -1142 -766 -369 -78 148 87 -47 -60 -469 -378 -49 -3 412 109 113 -234 -429 -24 364
2948 364 629 792 798 277 163 -353 -242 3 -30 -111 -651 -634 -676 -505 -161 344 589 697 562 581 199 316
2970 316 199 340 308 200 -163 -376 -426 -606 -228 -199 -89 -237 -288 -477 -547 -224 -184 37 368 280 204 129 407
2993 407 729 825 1191 1035 762 620 334 -109 -369 -654 -507 -530 -743 -1103 -972 -1050 -867 -170 -160 -53 37 -66
3015 -66 -11 125 371 525 673 348 441 292 491 708 723 737 524 471 249 -223 -304 -589 -729 -688 -670 -926 -941
3038 -941 -808 -821 -267 -177 249 220 258 303 -107 309 241 358 477 253 111 257 330 360 124 595 440 82 150
3061 150 215 -63 -274 -466 -427 -494 -451 -341 -535 -629 -214 -79 22 265 289 217 391 159 163 301 359 37 179
3084 179 0 -181 -32 -155 -300 -275 0 62 -71 18 127 16 -57 55 17 289 230 133 -54 154 96 220 41
3107D1j24K67l5k76J03n28M11kj58O1Q9p7K7N1K09R9L59q4m2k62Q7Q3q7%j66j71
3133a25l04J21j17J14K51j08j33J8Q3O0o9L32Rj04L25k70K55j32k65J99Q0PJ22
3156C49m19n5K61k33j03J25Jk44K03j04O7j36J47K07L14k50K5M9r9nj71M47j10
3179B66k62l69R1l75K38K96mP6j12j52M7N7J93K86j9K21J31l34PL8p0K65j78M6
3203C83J4l28l1m48J93r7j49r4l9j16p8L81O4L34n1Q1j9K3rL16Q6N0J00j45N0
3228D71J8l17K34n2M2L1l94J8k06l54k5L6k18J21j9o1N8K4L53K61J27K32j17L64
3252F27k64J14J97rj17j6j94K4k87m7K34j88Q1l47k50Q4n05J01j9K12p8RQ7j8
3276e69K60L99L30m3J59J52K40m7l85L13k51p1k69l93Q4k85k4j60k09N01k14J50
$$ plain form
3107 41 -83 184 149 -127 -24 -552 -141 -143 -301 -240 -151 -228 -201 -150 59 158 517 433 391 129 216 299 212 212 46 -125
3133 -125 -429 -308 -425 -311 -60 -168 -301 -283 -200 -140 -209 123 132 28 353 83 338 206 -59 140 220 227 349
3156 349 -70 -125 136 -97 -200 -75 -74 -318 -115 -219 -152 -288 -141 66 380 130 155 204 105 100 -71 376 266
3179 266 4 -365 -274 -649 -411 -115 -119 -43 -155 -307 -260 -203 -10 276 257 478 609 275 282 320 250 515 337 383
3203 383 397 69 38 -410 -217 -314 -463 -557 -596 -712 -790 -409 -345 -11 -62 19 0 23 14 330 416 466 566 421 471
3228 471 489 172 406 354 396 427 33 51 -155 -509 -534 -498 -716 -595 -614 -675 -617 -593 -240 21 148 380 263 627
3252 627 363 477 674 665 548 532 338 362 75 28 262 74 155 -192 -442 -358 -863 -762 -781 -569 -647 -638 -551 -569
3276 -569 -309 90 420 377 536 688 928 881 496 809 558 487 218 -175 -91 -376 -400 -560 -769 -268 -482 -332
3298c32J92l49L22j91KK06N8M7J7Q8L8K9K16m6j44K87r7p3o5r2j65Q6n9l45j04
3323d74j9J58nP2K7K80r0J1J12l1J56K55l05Mm4J14l28r7P8K0K9K07j41o5L26
3348B50k01M8j83J14J10K1q4J1j81J05j17L0j05M8N3O7j81N3N7R6L36l28Q7k55
3372a49J42M6k21L91j19m0p9q8m4Q5j33J91j90J66m9R5M2M5l41L54K38k05j4k15
3396i2O2o8k1J80o5R5k46J6O3R2L06n6j86J31k24j20J11k4j26J00j56J7L06J61
3420B56k47K9Q4nP4J09j83k34j72L35m27Q4J4m3N5P6L36l8L03L5k0n6R1pj99j15
3446A35j93o4j42J26k99JJ88O7L33l5O3J41j24j1K78m47R9j85k15j18j92L22j3
3469b85K7J81K6J7N1O67l78L32m47j10r5j10k08J07m00L03K16k08N31N9j21p5
$$ plain form
3298 -332 -140 -489 -167 -358 -356 -150 -92 -45 -28 60 98 127 343 297 153 440 343 270 205 113 -52 34 -25 -370 -474
3323 -474 -493 -335 -340 -268 -241 39 -51 -40 72 41 197 452 147 151 107 221 -107 -204 -126 -106 -77 130 -11 -76 250
3348 250 49 97 -86 28 138 159 75 86 -95 10 -107 -77 -182 -134 -81 -14 -195 -142 -85 11 347 19 106 -149
3372 -149 -7 39 -182 209 90 50 -29 -117 -161 -76 -209 -18 -208 -42 -91 4 46 91 -250 104 342 137 123 -92
3396 -92 -30 -98 -119 61 -4 91 -155 -139 -76 16 322 266 80 211 -13 -133 -22 -46 -172 -72 -228 -211 95 256
3420 256 9 38 122 117 191 300 117 -117 -289 46 -381 -297 -283 -326 -271 -195 141 103 406 441 421 365 456 449 250 135
3446 135 -58 -122 -264 -138 -437 -436 -248 -181 152 117 180 321 197 186 464 17 116 -69 -284 -402 -594 -272 -285
3469 -285 -258 -77 -51 -34 17 684 306 638 191 81 -14 -124 -332 -225 -625 -322 -106 -314 217 276 155 80
3491H0N70r6qj91l80k85p1j23Q1o7K61l37L88J94J74K96L4J83n9m12L15k93j07
3514A47k59k25j77m5k8j13L08K61J70L09p8J96L3j76j10J5J23k91l33k06j65k13
3536h57N70J23P9K7Q8M7M01k1K28m13p1l29j52J79m80J41J8M82J96m9j89j75K84
3559A27R3K25J53%n85m91jP6J96o5K65l08k4K33J75L21K05m5o1k04k50l05m7L07
3583a0k20N2R2k8l72N9RK07N51J22ol51l23J68R5K27N1Kl48k92N0j6O1L35N9r2
3609H2l29k04J9j52M11N24o1K58j4k96q4m56M39L83O0l14p19j18j26m5M61M90
3631B09R7l58l8j34J09K83J39J42k57m30m55l88J42L74M90O43J91K2j90M1k5K47
3653H54L36j93n32p70q64m31L03K83M46K81J46q7K30l9M72N07J45q0l77q87k25
$$ plain form
3491 80 650 554 546 355 -25 -310 -381 -504 -423 -490 -229 -566 -178 16 190 486 520 703 644 232 547 254 147
3514 147 -112 -337 -514 -559 -587 -700 -392 -131 39 348 270 466 499 323 213 228 351 60 -273 -479 -644 -857
3536 -857 -287 -164 -85 -58 30 77 478 457 685 272 201 -128 -280 -101 -581 -440 -422 60 256 207 18 -157 127
3559 127 220 445 598 598 13 -478 -479 -403 -207 -272 -7 -315 -339 -106 69 390 595 550 489 285 35 -270 -317 -10
3583 -10 -230 -178 -86 -114 -486 -427 -418 -211 340 462 456 105 -218 -50 45 272 323 325 -23 -315 -265 -281 -220 115 174 82
3609 82 -247 -451 -432 -584 -173 351 290 548 534 238 154 -302 137 520 580 266 -453 -571 -697 -742 -281 209
3631 209 306 -52 -90 -224 -115 168 307 449 192 -238 -693 -1081 -939 -565 -75 568 759 781 591 632 607 854
3653 854 1190 997 465 -305 -1169 -1600 -1297 -1014 -568 -287 -141 -228 2 -37 435 942 1087 1007 630 -257 -482
3674d82m61N9L63N51K64O2k9k81L42N20O68O8m46q22q01r10j62QN74L51k43l25
3696a132K67J99P09P40O20O31m69q97n15l72j65M71K41J41l43p00l20J8M38J277
3716H39L81O5q62q17k99k41K64N64J29l39m00m18j48N48Q42R28L68J44p48m20
3736C80j11j37N64L40k29n49j151o49p1K06J012O65K94k55p79j65K19N82P40N13
3756A419k29q49j157l18K3O34N95N37k11n14o94%L71Q22O04L83k80j198p87m77
3776a326M25R28J66L64o06m38n35l1P07J083P87J0q95p85p81Q3N61O47L51k09
3796E06o15q94l45M86O15J126L19j51r02p56m06M38Q14N24L85o86q65p67n9N68
3816f65R62O17N4l37r89n21m4O16J015Q48r3o11j161q89K9P81O74L77k79r12o54
$$ plain form
3674 -482 -943 -884 -521 30 294 356 327 46 388 908 1576 1644 1198 376 -425 -1335 -1497 -1489 -915 -564 -807 -1132
3696 -1132 -865 -666 43 783 1403 2034 1565 668 153 -219 -384 87 328 469 126 -574 -894 -876 -438 839
3716 839 1220 1285 423 -394 -693 -934 -670 -106 23 -316 -716 -1134 -1282 -734 108 1036 1404 1548 800 380
3736 380 269 132 696 1036 807 258 -893 -1542 -1613 -1407 -395 270 564 309 -470 -635 -416 166 906 1419
3756 1419 1190 341 -816 -1134 -1111 -477 118 655 444 -70 -764 -764 -393 429 1033 1416 1136 -62 -849 -1326
3776 -1326 -901 27 193 557 -49 -487 -1022 -1053 -346 737 1524 1534 639 -146 -927 -844 -283 364 715 506
3796 506 -109 -1003 -1348 -862 -247 879 1198 1047 145 -611 -1017 -579 235 759 1144 458 -407 -1174 -1233 -665
3816 -665 297 914 968 631 -358 -879 -923 -307 708 1556 1463 852 -309 -1198 -1169 -388 286 663 384 -528 -1182
3837a182j89M42R61R62P76l59q76r25l00K15N51O75Kp03j050n07k60R86J191R67
3857A377M39n06q90n28j46J00P58J28k75j085j093o54K98R94J271R27P9n21o77
3876dk92M52N84R26r0p50j052j132m24M31J234R49R3j07q16o53O4O22Q05L09p
3897A142p89j567r23J44P22P86Q19M73o54k97n31K99J330Q73Q93o34j177r69q95
3916i55q0N72O47J85n31j069q12j09O39J108J409K39j26r74o36k74P97P51N11
3935A292M7j010j183n36RP91J308P46K61n56q77m61j35P44O96k57m96j433j180
3954b230m37N28Q41J320P85M6l60l62K16O18P18O05k49j171j517j062n08O14Q22
3973g83R39M37m80l27n21P29Q96Q68M07o44j363j514q65K16N30R41P41K2l21j63
$$ plain form
3837 -1182 -1371 -929 32 994 1770 1411 535 -390 -690 -475 76 751 753 50 -1000 -1507 -1767 -781 410 1377
3857 1377 1816 1310 420 -108 -254 -154 604 732 457 -628 -1721 -2375 -2077 -1083 188 1115 1194 673 -4
3876 -4 -296 156 740 1666 1576 826 -226 -1358 -1782 -1351 -117 832 925 818 2 -651 -587 35 840 1149 1142
3897 1142 353 -1214 -2137 -1993 -1271 -485 334 807 153 -144 -675 -376 954 1827 2720 2086 909 -60 -955
3916 -955 -1035 -463 184 369 -162 -1231 -2043 -2152 -1513 -405 1004 1243 1117 143 -493 -767 30 781 1292
3935 1292 1339 329 -854 -1390 -1381 -590 718 1464 1725 1169 292 -169 -304 440 1136 879 383 -1050 -2230
3954 -2230 -2667 -2139 -1298 22 807 853 493 131 347 965 1683 2288 2039 868 -649 -1711 -2219 -1605 -783
3973 -783 156 593 113 -214 -735 -6 890 1758 2165 1521 158 -1356 -2221 -2005 -1475 -534 207 229 -92 -255
3993b55J6Q10J035N97k1o77j410j223o52K02Q72O08M51j98n47m23L45P78Q91O51
4013A850l18j096j137p98J21N50R11M95k83k20o01nM45N01N57K91n19o76j247
4032a179l75J83R80N53P27j49m68n67j32M84P57M29m95p66r94n39RP04R88M47
4052E97N68j42p91r3l42N66K81l54k92p49p38o92M98J015J194Q13P5R7o74k45
4072E92J9M61l1n80p70j073r70J6L95J208R63P21j24l5j73J59L85J74o4q82p43
4093c52r80q21J91N70R31N15O79j44K9K52Q7N15J41k00q77j089r33n06L25N94
4113a073K96O07n5Q6K55L29M10P33j3l07o27q27q85k07n4L32L73J57J00l29M35
4134b64L32P70O61m2j10o24q45m11j68j05K05l9k34j21O5L1O10R87L33L84l24
$$ plain form
3993 -255 -239 571 1606 2203 2182 1505 95 -1128 -1780 -1578 -706 -98 353 155 -392 -815 -470 308 1199 1850
4013 1850 1532 436 -701 -1499 -1378 -828 83 578 295 75 -526 -531 -86 415 972 1263 744 68 -1179
4032 -1179 -1554 -1371 -391 162 889 740 272 -295 -427 57 814 1243 748 -18 -1012 -1551 -1542 -838 150 597
4052 597 1165 1023 232 139 -203 363 644 290 -2 -751 -1489 -2181 -1683 -668 526 1339 1414 1511 837 592
4072 592 611 1072 1041 461 -309 -1382 -2352 -2336 -1941 -733 230 951 827 792 619 778 1163 1337 1273 391 -352
4093 -352 -1332 -2153 -1962 -1392 -461 54 733 589 618 870 957 1472 1613 1413 536 -553 -1486 -1992 -1667 -1073
4113 -1073 -777 -170 -225 -139 116 445 855 1588 1575 1268 641 -186 -1071 -1278 -1332 -1000 -627 -470 -370 -699 -264
4134 -264 68 838 1499 1457 1347 723 -122 -533 -701 -806 -601 -640 -874 -995 -930 -899 -289 698 1031 1415 1091
4155A091j16l82o13K26l11k15J14n22m70r8N45M09M46P52j1k1k14p5j03m8k09
4176A75j17n27j06n63Q3J59M42P55r8P40n29J70n4j2q2k58k13l47j50j70p0M01
4198c71m9N82L5J41J36k08L69l90J14k57j78l47j3jJ42M3q4N90M4j08Q9j43r2
4221D4K7j3k65K80k20J86M4J37J93j23L26m87P7o3k89k90N9j42l4J57L17K32J03
4244B56J30M47l2j52r6j92m22k80m09l41j14Q9L21O38K16N20K38k0K02l01J00
4265G98l47m80k04n32n17M9L3N32N26N13K81J85M2P1J52r7k94o58p27l91l74n
4287a444L21O73L80J07O14J8K9J35J36P2l45j31j193l57n92K37M16O26K29K28
4307A59K45j56J10K67O3K03j79m22o61n13k85M19L35O08q9l3p4j48R2K15L10M3
$$ plain form
4155 1091 975 593 -20 206 -105 -320 -206 -728 -1198 -1296 -751 -342 104 856 845 824 610 535 432 384 175
4176 175 58 -469 -575 -1138 -1055 -896 -454 301 203 943 414 584 530 518 436 178 -35 -382 -532 -702 -772 -371
4198 -371 -420 162 197 338 474 266 635 245 359 102 -76 -423 -436 -437 -295 -252 -336 254 298 190 279 136 44
4221 44 71 58 -207 73 -147 39 83 220 413 290 616 129 206 143 -146 -436 -377 -519 -553 -396 -79 153 256
4244 256 386 833 801 649 553 361 -61 -341 -750 -1091 -1205 -1116 -795 -157 59 579 817 797 999 698 798
4265 798 451 -29 -233 -765 -1282 -1233 -1200 -668 -142 371 652 837 879 950 1102 1005 711 53 -674 -1065 -1439 -1444
4287 -1444 -1123 -450 -70 37 651 669 698 833 969 1041 696 565 -628 -985 -1577 -1340 -924 -298 -69 159
4307 159 404 248 358 625 688 891 712 290 -371 -884 -1169 -750 -415 193 104 71 -3 -151 -59 156 466 509
4329E09r2m80m20N6K40K66L25N31l03n09k46l71n4K28J58O4j61n24N0K60N13M76
4351E16P14K5o07o95m24j76J93k2M37j80n2k42J26M21P57Q62j7j29r13p80o26
4372h12j32j3K27j26k04j29K31M16M75J259O86l5l32p16r59k87l09J09J89j32
4392e94k99l83k9Q22Q78J030M67J05q92p08o77m03J88k6J27m98l70j93K23P52
4412d80J070J070K79k17p43j033m43k8K10j0K14o87k95j85N12O41Q27P09j10l26
4432I75p34o19l01L33L03K06l2p51l94j05M65R52Q43K84k33o70p23m03j67P77
4452FJ64O1Qq01l04L29K8R21O43O7m61p08o78j01L11N59N58J52m43o67k89K36
4474d09O99L98M37m77o51p73l49j99Q86N61M07l30k56l60oM62P61N95k29l91j056
$$ plain form
4329 509 417 -63 -483 -427 -187 79 404 935 632 123 -123 -494 -548 -320 -162 -98 -259 -783 -733 -473 40 516
4351 516 1230 1255 648 -47 -471 -647 -454 -476 -39 -219 -271 -513 -387 34 791 1653 1636 1507 594 -186 -812
4372 -812 -944 -957 -730 -856 -1060 -1189 -958 -542 -67 1192 1878 1843 1511 795 -164 -451 -760 -651 -462 -594
4392 -594 -893 -1276 -1305 -483 395 1425 1892 1997 1105 397 -280 -683 -495 -521 -394 -892 -1262 -1455 -1232 -480
4412 -480 590 1660 1939 1722 979 -54 -497 -525 -315 -325 -111 -798 -1093 -1278 -766 -125 702 1411 1301 975
4432 975 241 -378 -679 -346 -43 163 131 -620 -1014 -1119 -654 298 1141 1425 1192 522 -201 -604 -771 6
4452 6 170 231 239 -562 -866 -537 -509 412 1055 1122 661 -47 -725 -826 -515 44 602 754 311 -356 -645 -409
4474 -409 290 688 1125 648 -3 -776 -1125 -1324 -438 123 530 200 -56 -416 -422 40 801 1396 1167 776 -280
4495b80o62k17M74K63Q63j45k75n71l5Q3N56R80L85l79q16o60m26P3J95O55L11
4516C72j88l37m43k41P17N25P07J65n53k89p61l87J34O31P9J66q5r43k63J4O78
4537c02J067N35j2l35o16o88J11K74L56J22l53o39o45n15N00Q33M73Q00pl87k33
4558C39m07j82O17M82m8m79q74n16k43K38P71O13M99k07k41k22m2K2N50K6k30
4579D66o78r73m78J83L28O95P74L95k03m9l17K29L28L76j29l27o90j000m92J61
4599a401P35N63N58J7l22j65n4J79Q89k38j20o37o88q51O5L29P79O14K94m3j47
4620C56j91K20J13L34L64n33o95p69l02K33N35N13L67j25j90l37j77L11J48M46
4640F21k07n36m21p85K64L19P63O43J80J01m52k09k46K55Q5L0k44p43k16o88K70
$$ plain form
4495 -280 -942 -1159 -685 -422 441 296 21 -550 -585 -502 54 1034 1419 1040 224 -436 -862 -789 -594 61 372
4516 372 184 -153 -596 -837 -120 405 1112 1277 724 435 -326 -713 -579 52 131 297 212 -731 -994 -980 -302
4537 -302 765 1300 1288 953 337 -351 -240 34 390 512 159 -480 -1125 -1640 -1140 -307 166 966 959 572 339
4558 339 -68 -250 367 849 801 322 -552 -1068 -1311 -1073 -302 311 810 603 362 140 98 120 670 696 466
4579 466 -212 -1185 -1663 -1480 -1152 -457 317 712 509 460 143 372 700 1076 947 620 -70 -1070 -1562 -1401
4599 -1401 -666 -103 455 472 150 -15 -69 110 999 761 641 4 -684 -1535 -1470 -1141 -362 252 546 503 356
4620 356 165 385 498 832 1196 663 -32 -801 -1103 -870 -335 178 545 420 230 -107 -284 27 175 621
4640 621 414 -122 -543 -1328 -1064 -745 18 661 841 942 490 281 35 290 375 405 161 -582 -798 -1486 -1216
4661a216O30P67N89J97k37l62j54k87L23Q3k58l02n33l56k09N12R79M55L31l8
4681I14k06m00k44j11J46j0l97l50l50j18J13M27Q54Q59O8J36p01m59L44l00m9
4702A66qm08o21k51j32M16O02N74L00J16n1m64j46j49O7J37m52r3j06l09M9L20
4724d43P14N18K22k07k54l41k36k7N1J35m24j77k49k15K57M22L69M88p5n7k93
4745A78k20l80K75R4O3n7j74l80L59J29M96L49O2m6n90j99j28l03R4m5J90j07
4767c40k83K91K10RN05K97j57k15l16l47m1J77K58k06J7j08L05k3K50L5M21J04
4789H43m55j01o74Rm09K56N4n6J35qK26j52O50j1K91K35m96l02l62j9j12j2J65
4812c05J60j31J56j31L34M1J82K13j55j05n36N8k17J17J4K34j59n1K30J40J75
$$ plain form
4661 -1216 -586 181 770 967 730 368 214 -73 250 333 75 -227 -760 -1116 -1325 -813 166 621 952 914
4681 914 708 308 64 -47 99 89 -308 -658 -1008 -1126 -1013 -586 268 1127 1195 1331 630 171 515 215 166
4702 166 158 -250 -871 -1122 -1254 -838 -236 338 638 754 703 239 93 -56 11 148 -304 -397 -503 -812 -763 -443
4724 -443 271 789 1011 804 550 209 -27 -54 -3 132 -292 -469 -718 -933 -676 -254 115 603 528 471 178
4745 178 -42 -422 -147 -53 10 -47 -221 -601 -242 -113 383 732 794 748 158 -41 -169 -472 -378 -423 -233 -340
4767 -340 -623 -332 -122 -113 392 689 532 317 1 -346 -387 -210 48 -158 -141 -249 56 33 283 318 739 843
4789 843 388 287 -387 -378 -787 -531 -477 -533 -398 -406 -180 -332 318 307 598 833 337 35 -327 -346 -458 -470 -305
4812 -305 -145 -276 -120 -251 83 124 306 519 364 259 -277 -219 -436 -319 -305 -71 -230 -281 -51 89 264
4833B64J81p8J35j68k61j27j35j82J64J68j65Q9M2k79K80K61J01M4j47J3k72j12
4855a84J86j67R4J98j8r6k55M5R9J20o5L14j28k33J43j59q4K92K36j95k91L38
4877A90j23l2j18J5M7J59j4j14j21J70m1J79j45Qn9j00j5J92pj64L45l22k4J87
4901I3j41k79N33k41O6m9%Nj41R5j11L9J39O5Q2Q4l12J72o9J16m1l42J40k51K21
4926a27N1k6J81j40K16P1j06j70J27j3L6q5k33j73J6L34k00J47K12j02L68k71
4948A13Q2k64K38j41pj62l72K00QJ95J65J81m5l7M8J13Q4k19m9j21k61j34J46
4971b39m7Ql2K40J25K7L0K96k72L70m81J30m05j40R1m0J36M5J90J7K42P8lj14
4995B52J14l73l7J20l25j60O5K18k7K12j1O3J66L0K18k80m8j30j11k34L6K7j34
$$ plain form
4833 264 445 367 502 334 73 -54 -189 -371 -207 -39 -204 -115 -73 -352 -72 189 290 334 187 200 -72 -184
4855 -184 2 -165 -71 127 109 13 -242 -197 -98 22 -43 271 143 -90 53 -106 -190 102 338 143 -148 190
4877 190 67 35 -83 -68 -21 138 124 10 -111 59 18 197 52 60 1 -99 -114 78 71 -93 252 -70 -94 93
4901 93 -48 -327 206 -35 31 -18 -18 -13 -154 -59 -170 -131 8 73 155 239 -73 99 30 146 105 -237 -97 -348 -127
4926 -127 -76 -102 79 -61 155 226 120 -50 77 64 100 15 -218 -391 -375 -41 -241 -94 118 16 384 113
4948 113 195 -69 169 28 21 -141 -513 -313 -305 -110 55 236 191 154 202 315 399 180 131 10 -251 -385 -239
4971 -239 -286 -278 -310 -70 55 82 112 408 136 506 25 155 -250 -390 -299 -339 -203 -158 32 49 291 369 366 252
4995 252 366 -7 -44 76 -249 -409 -344 -126 -153 59 48 111 277 307 525 245 197 67 -44 -278 -242 -215 -349
5018c49L8N2J22L93p6K35j51Nmj99J74n46J48n7M4J34j08P3J58J56n1j20J05Q8
5042B64k35K3k25J33j74O4L4j82L48K9r8L16J10j02j47r5J1j35j16J05l91K08
5064b55K0j64M08m1K63P8LJ4lk02k43J08j85J24j15M6J60l4K12l3K40j11j69l
5088A18l2M8k91J14m04J87Q2J4J19Q3J13R5J24j97J16P9l64j96m4j09P6J71r5
5111a93m0K61R0J58j79O7R5q2m9o9j21P8k69mJ27J30j92K80Q7j37J43r0R1j20
5135F2p6K9j57j48m5J21r5QL79K4Q4J31q3k20J29j47J62l32K14l01J60Q9k57K18
5159e1M9j42J09J21J96k49k0j05k5J00R6j08j80Q1J9J60J22m7M0Q6l14J97o1J7
5183I1j18j47J48n5j58K10p2L04k89q7J23K28j09k22P8J28j54Q8J28O9Q0L3m56
$$ plain form
5018 -349 -311 -259 -137 256 180 415 264 269 265 66 240 -306 -158 -215 -171 -37 -145 -72 86 242 191 71 176 264
5042 264 29 52 -173 -40 -214 -150 -116 -298 50 79 -19 297 407 305 158 63 74 -61 -177 -72 -463 -255
5064 -255 -235 -399 9 -32 231 309 312 326 323 121 -122 -14 -199 -75 -190 -144 16 -18 194 161 401 290 121 118
5088 118 86 134 -157 -43 -447 -260 -178 -164 -45 38 151 246 370 173 289 368 4 -192 -236 -345 -269 -98 -193
5111 -193 -233 28 118 276 97 164 259 177 128 59 -62 16 -253 -257 -130 0 -192 88 175 38 181 91 182 62
5135 62 -14 15 -142 -290 -335 -214 -309 -301 78 102 186 317 234 14 143 -4 158 -174 40 -261 -101 -12 -269 -51
5159 -51 -2 -144 -35 86 282 33 13 -92 -117 -17 79 -29 -209 -128 -109 51 173 126 166 252 -62 135 74 91
5183 91 -27 -174 -26 -81 -239 -29 -101 203 -86 -173 -50 178 69 -153 -75 53 -101 -13 115 184 264 297 -159
5206a59M47j0j69J29k84%j33K01p1LJ07p7J0j13J50j12J39p0oQ1j07J22j09j37
5230a68K49j94J64j3l12K86p8J3j75L70n1j97O0pJ23j47j69J61J17j53J35j47
5252a33R6M2L83l83J60j96P6j08R7ok13J77K6k37J10Q4p0J58K3K46j16m23L02
5275I5J26j09J44o6q1k27O1j38m1K23P4o2QOL8R1j57PJ06j50L40l87M1m5R0l8
$$ plain form
5206 -159 288 278 109 238 -46 -46 -179 22 -49 -46 61 -16 -6 -119 31 -81 58 -12 -18 63 -44 78 -31 -168
5230 -168 81 -113 51 38 -274 12 -66 -53 -228 142 91 -106 -46 -53 70 -77 -246 -85 32 -121 14 -133
5252 -133 -37 5 388 5 165 -31 45 -63 34 28 -185 -8 18 -219 -109 -25 -95 63 86 332 216 -207 95
5275 95 221 112 256 190 109 -118 -57 -195 -236 -13 61 -1 7 13 51 142 -15 -8 98 -52 288 -99 -58 -103 -13 -51
$$ [...]
8191a88
##END NTUPLES=NMR FID
##END=
