##TITLE=1H_Pr Adam 
 CDCl3, 8 sc, 
 8.04.2021
##JCAMPDX= 6.0         $$ Bruker NMR JCAMP-DX V2.0
##DATA TYPE= NMR FID
##DATA CLASS= NTUPLES
##ORIGIN= UXNMR, Bruker Analytische Messtechnik GmbH
##OWNER= root
$$ XWIN-NMR		Version 3.5
$$ Thu Apr  8 11:21:23 2021 Russian Standard Time (UT+4h)  she@DPX200
##.OBSERVE FREQUENCY= 200.131506
##.OBSERVE NUCLEUS= ^1H
##.DELAY= (6, 6)
##.ACQUISITION MODE= SIMULTANEOUS
##.ACQUISITION SCHEME= undefined
##.AVERAGES= 8
##.DIGITISER RES= 18
##SPECTROMETER/DATA SYSTEM= spect
##.PULSE SEQUENCE= zg30
##.SOLVENT NAME= DMSO
##.SHIFT REFERENCE= (INTERNAL, DMSO, 0, 15.7039)
##AUDIT TRAIL= $$ (NUMBER, WHEN, WHO, WHERE, WHAT)
$$ ##TITLE= Audit trail, XWIN-NMR		Version 3.5
$$ ##JCAMPDX= 5.01
$$ ##ORIGIN= Bruker BioSpin GmbH
$$ ##OWNER= she
$$ F:/spectra/data/she/nmr/H-F/1/audita.txt
$$ ##AUDIT TRAIL=  $$ (NUMBER, WHEN, WHO, WHERE, WHAT)
(   1,<2021-04-08 11:20:02.73 +0400>,<she>,<DPX200>,
      <created by zg, POWCHK disabled, PULCHK disabled
       configuration hash MD5:
       00 E9 B6 7A A2 85 ED C7 34 08 36 98 17 FE 4E 26
       data hash MD5: 16K
       15 7E 77 F9 6D B3 72 B6 55 D7 4E 0C 9A 1D E8 83>)
$$ ##END=
$$ 
$$ hash MD5
$$ E8 54 7F 13 63 53 31 DC FC 80 07 97 91 F2 7E 38
##$RELAX= 
##$RELAX= 
##$RELAX= 
##$RELAX= 
##$RELAX= 
##$RELAX= 
$$ Bruker specific parameters
$$ --------------------------
##$DU= <F:/spectra>
##$EXPNO= 1
##$NAME= <H-F>
##$PROCNO= 1
##$TYPE= <nmr>
##$USER= <she>
##$AMP= (0..31)
100 100 100 100 100 100 100 100 100 100 100 100 100 100 100 100 100 100 
100 100 100 100 100 100 100 100 100 100 100 100 100 100 
##$AQSEQ= 0
##$AQ_mod= 1
##$AUNM= <au_zg>
##$AUTOPOS= <>
##$BF1= 200.13
##$BF2= 200.13
##$BF3= 200.13
##$BF4= 200.13
##$BF5= 200.13
##$BF6= 200.13
##$BF7= 200.13
##$BF8= 200.13
##$BYTORDA= 1
##$CFDGTYP= 0
##$CFRGTYP= 5
##$CHEMSTR= <none>
##$CNST= (0..31)
1 1 145 1 1 1 1 1 1 1 1 1 1 1 1 1 1 1 1 1 1 1 1 1 1 1 1 1 1 1 1 1 
##$CPDPRG= <>
##$CPDPRG1= <>
##$CPDPRG2= <>
##$CPDPRG3= <>
##$CPDPRG4= <mlev>
##$CPDPRG5= <mlev>
##$CPDPRG6= <mlev>
##$CPDPRG7= <mlev>
##$CPDPRG8= <mlev>
##$CPDPRGB= <>
##$CPDPRGT= <>
##$D= (0..31)
0 1.2 0 0 0 0 0 0 0 0.06 0 0.03 0 0 0 0 0.0002 0 0 0 0 0 0 0 0 0 0 0 0 
0 0 0 
##$DATE= 1617866402
##$DBL= (0..7)
120 120 120 120 120 120 120 120 
##$DBP= (0..7)
150 150 150 150 150 150 150 150 
##$DBP07= 0
##$DBPNAM0= <>
##$DBPNAM1= <>
##$DBPNAM2= <>
##$DBPNAM3= <>
##$DBPNAM4= <>
##$DBPNAM5= <>
##$DBPNAM6= <>
##$DBPNAM7= <>
##$DBPOAL= (0..7)
0.5 0.5 0.5 0.5 0.5 0.5 0.5 0.5 
##$DBPOFFS= (0..7)
0 0 0 0 0 0 0 0 
##$DE= 6
##$DECBNUC= <off>
##$DECIM= 32
##$DECNUC= <off>
##$DECSTAT= 4
##$DIGMOD= 1
##$DIGTYP= 9
##$DL= (0..7)
0 120 120 120 120 120 120 120 
##$DP= (0..7)
150 150 150 150 150 150 150 150 
##$DP07= 0
##$DPNAME0= <>
##$DPNAME1= <>
##$DPNAME2= <>
##$DPNAME3= <>
##$DPNAME4= <>
##$DPNAME5= <>
##$DPNAME6= <>
##$DPNAME7= <>
##$DPOAL= (0..7)
0.5 0.5 0.5 0.5 0.5 0.5 0.5 0.5 
##$DPOFFS= (0..7)
0 0 0 0 0 0 0 0 
##$DQDMODE= 0
##$DR= 18
##$DS= 0
##$DSLIST= <SSSSSSSSSSSSSSS>
$$ [...]
##$SUBNAM2= <"">
##$SUBNAM3= <"">
##$SUBNAM4= <"">
##$SUBNAM5= <"">
##$SUBNAM6= <"">
##$SUBNAM7= <"">
##$SUBNAM8= <"">
##$SUBNAM9= <"">
##$SW= 16.9725357007746
##$SWIBOX= (0..15)
0 0 2 0 0 0 0 0 0 0 0 0 0 0 0 0 
##$SW_h= 3396.73913043478
##$TD= 16384
##$TD0= 1
##$TE= 0
##$TE2= 300
##$TE3= 300
##$TEG= 300
##$TL= (0..7)
0 120 120 120 120 120 120 120 
##$TP= (0..7)
150 150 150 150 150 150 150 150 
##$TP07= 0
##$TPNAME0= <>
##$TPNAME1= <>
##$TPNAME2= <>
##$TPNAME3= <>
##$TPNAME4= <>
##$TPNAME5= <>
##$TPNAME6= <>
##$TPNAME7= <>
##$TPOAL= (0..7)
0.5 0.5 0.5 0.5 0.5 0.5 0.5 0.5 
##$TPOFFS= (0..7)
0 0 0 0 0 0 0 0 
##$TUNHIN= 0
##$TUNHOUT= 0
##$TUNXOUT= 0
##$USERA1= <user>
##$USERA2= <user>
##$USERA3= <user>
##$USERA4= <user>
##$USERA5= <user>
##$V9= 5
##$VALIST= <valist>
##$VCLIST= <CCCCCCCCCCCCCCC>
##$VD= 0
##$VDLIST= <DDDDDDDDDDDDDDD>
##$VPLIST= <PPPPPPPPPPPPPPP>
##$VTLIST= <TTTTTTTTTTTTTTT>
##$WBST= 1024
##$WBSW= 4
##$XGAIN= (0..3)
0 0 0 0 
##$XL= 0
##$YL= 0
##$YMAX_a= 105163
##$YMIN_a= -89157
##$ZGOPTNS= <>
##$ZL1= 120
##$ZL2= 120
##$ZL3= 120
##$ZL4= 120
##$ABSF1= 10
##$ABSF2= 0
##$ABSG= 5
##$ABSL= 3
##$ALPHA= 0
##$AQORDER= 0
##$ASSFAC= 0
##$ASSFACI= 0
##$ASSFACX= 0
##$ASSWID= 0
##$AUNMP= <proc_1d>
##$AZFE= 0.1
##$AZFW= 0.1
##$BCFW= 1
##$BC_mod= 2
##$BYTORDP= 1
##$COROFFS= 0
##$CY= 11.3945322036743
##$DATMOD= 1
##$DC= 2
##$DFILT= <>
##$DTYPP= 0
##$F1P= 15.9154993809931
##$F2P= -4.1035820241983
##$FCOR= 0.5
##$FTSIZE= 0
##$FT_mod= 4
##$GAMMA= 1
##$GB= 0.15
##$INTBC= 1
##$INTSCL= 1
##$ISEN= 128
##$LB= 0.24
##$LEV0= 0
##$LPBIN= 0
##$MAXI= 10000
##$MC2= 0
##$MEAN= 0
##$ME_mod= 0
##$MI= 1.114404
##$NCOEF= 0
##$NC_proc= 0
##$NLEV= 6
##$NOISF1= 3.799351
##$NOISF2= 2.8
##$NSP= 1
##$NTH_PI= 0
##$NZP= 0
##$OFFSET= 15.70392
##$PC= 1
##$PHC0= -11123.5
##$PHC1= 18.00092
##$PH_mod= 1
##$PKNL= yes
##$PPARMOD= 0
##$PSCAL= 0
##$PSIGN= 0
##$REVERSE= no
##$SF= 200.130013532006
##$SI= 16384
##$SIGF1= 3
##$SIGF2= 2
##$SINO= 400
##$SIOLD= 16384
##$SREGLST= <1H.CDCl3>
##$SSB= 0
##$STSI= 0
##$STSR= 0
##$SW_p= 3612.71676300578
##$SYMM= 0
##$S_DEV= 0
##$TDeff= 0
##$TDoff= 0
##$TI= <>
##$TILT= no
##$TM1= 0
##$TM2= 0
##$TOPLEV= 0
##$USERP1= <user>
##$USERP2= <user>
##$USERP3= <user>
##$USERP4= <user>
##$USERP5= <user>
##$WDW= 1
##$XDIM= 8192
##$YMAX_p= 0
##$YMIN_p= 0
$$ End of Bruker specific parameters
$$ ---------------------------------
##NTUPLES= NMR FID
##VAR_NAME=  TIME,          FID/REAL,        FID/IMAG
##SYMBOL=    X,             R,               I
##VAR_TYPE=  INDEPENDENT,   DEPENDENT,       DEPENDENT
##VAR_FORM=  AFFN,          ASDF,            ASDF
##VAR_DIM=   8192,          8192,            8192
##UNITS=     SECONDS,       ARBITRARY UNITS, ARBITRARY UNITS
##FACTOR=    0.0002944,     1,               1
##FIRST=     0,             0,               0
##LAST=      2.4114304,     0,               0
##MIN=       0,             -89157,          0
##MAX=       2.4114304,     105163,          0
$$ Real data points
##PAGE= N=1
##DATA TABLE= (X++(R..R)), XYDATA
0@%%%%%%%%%%%%%%qJ6j6J6j6K4l2L2m0M8n6O4p2Q8j04J20j36J52j68J92k19K43
36A28k72L06l44L84m26M73n26N83o45P12p86Q66r53J050j155J273j403J548j712
55h99J895k104K343k619K946l338L819m426N214o284P825j0243J4578k4630Q7323
70G1400L3763j94320J04204P3325j09363k2230P0505m2485J2138j1598j3414O7977
82C9902j6015n2598N5367K9709p4304J4295K1408k9157Q707k2540J0618L4662
94B0054k2154k5763O9552j6154m9804N0827j1703l5559J8497m17k9170L3233n962
107d523j8363M2416j9008l73K3648k5802j2862M4009m6533l0929P7552l8383m3550
120e2701O8355J2563o2935M3170K8742n4362J9429Q712k4280k33J3449j8400P368
$$ y = [0, 0, 0, 0, 0, 0, 0, 0, 0, 0, 0, 0, 0, 0, 0, -8, 8, -8, 8, -8, 16, -16, 16, -24, 24, -32, 32, -40, 48, -56, 64, -72, 80, -88, 104, -115, 128, -144, 162, -182, 202, -224, 249, -277, 306, -339, 373, -413, 453, -500, 550, -605, 668, -735, 813, -899, 996, -1108, 1235, -1384, 1562, -1776, 2043, -2383, 2831, -3453, 4372, -5871, 8707, -15923, 71400, 105163, -89157, 15047, 88372, -20991, -43221, 27284, -15201, -3063, -14661, -28075, 39902, 23887, -28711, 26656, 56365, -17939, -3644, 17764, -11393, -2686, -25226, -14608, 20054, -2100, -27863, 41689, 25535, -24269, 26558, 14855, -20704, -2207, -2624, -31794, 1439, -4523, -22886, 19530, 522, 149, 23797, -2005, -14867, 29142, -17391, -48320, 29232, -9151, -52701, 15654, 28217, -34718, 8452, 37194, -17168, 2261, 10973, -13307, -13540, -91, -18491, -11123]
133a1123J5536r038J3108p494J1678L222j8312k212J6990j7686j9291L2068j3106
146e660l246J6257l429N74J7933j6291j6922L8494k4322k8146K5622J1263k6412
159a4285K15K6018p02l012j7235K6114J1559m2654k154M0128k0242m3799M5754
172E705J0985l1650O991K4211m876j2832N395l338R480j8995o512J5400k040j0286
186a2362L298J7417o449O98o155J2936n6k4325R682J1307j6829j1779L0462j0274
200b429j1112K1483j253p906L927N263j4281O941n270m155O740o027N873L526
214A320O28j445J2867j1449k306J2269j6706o61P623m327r563J8578m424p426
228e022J7038m649l909J408L424j0317L161l979j633P441r467P937M687j639m137
$$ y = [-11123, 4413, -4625, 8483, 989, 12667, 15889, -2423, -4635, 12355, -5331, -24622, 7446, -5660, -8906, 7351, 3922, 4496, 22429, 6138, -10784, 27710, 3388, -24758, 864, 12127, -14285, -14070, 11948, 11246, 8234, -9001, 17113, 28672, -13982, -16136, 23992, 3750, -40049, 5705, 16690, -14960, -7969, 16242, 11366, -1466, 3929, 591, 10071, -8924, -15436, -36, -2076, -12362, -9064, 8353, 1904, 2602, -3553, 9383, 9327, -14998, -5316, 5991, -10838, -22617, 7845, -2429, -13541, 7942, 6689, -1217, 2710, 7973, -6308, 633, -4637, -8792, -2052, -8079, -2206, 1320, 1948, 503, 13370, 1921, -385, 11884, -4822, -5483, 2140, -2187, -11750, 6828, 2404, -5022, 12016, 7367, 3458, 4866, 8290, -2027, 1134, -2845, -4478, 2963, -6504, 1433, 6120, 4481, 344]
243C44J0646o220o633R126j2300K280J677l430l091J2445l738o756J5807o371
257C786l944J87L730p979j393J017j324M917p858R659K348l480n49O622m336q083
273f680R308q503Q8R23O79m35M031J994m026R187o027Q40j187R6l385j588L053
290a632k974N199l921O792O98k044J567J295j373p066P071n820m49Q71J979J097
306A290o92N206l630M660m568J161j424j785p43k665M176l771M504j559L690j68
322C682j837K767k991N94n403M493m865k48K118K45J574j642N615l587J407k371
338d49J270j761m240L470l033K367k716N411j250Q06J805k109K874m784J525l122
354c936K545l171K12L626j665L410k003M241j993N52k533R44J524o712L981k77
$$ y = [344, 10990, 4770, -1863, 7263, -5037, -2757, -1080, -4510, -7601, 4844, 1106, -5650, 10157, 3786, -158, 29, 3759, -4220, -5613, -4596, -5920, -1003, -8861, 798, 3146, -334, -883, 5739, 1403, -6680, 2628, -5875, -5787, -4864, -4185, -4620, -589, 1405, -2621, 6566, 539, 1379, 192, 288, -3097, -4685, -1632, -4606, 593, -3328, 3464, 4162, 2118, 3685, 4980, 3607, -3459, 3612, -2208, -2657, -1786, 193, 1290, 598, 5804, 2174, 6834, 2266, 3427, 2003, 218, -525, -3190, 986, -2785, 1719, 160, 3850, 3682, 1845, 4612, 1621, 2215, -3188, 1305, -3560, -3808, -1690, -1445, 129, -1513, 4102, 515, 1922, -449, 821, -940, -5180, -1710, -4743, -2376, -5092, 319, -931, -125, 1680, -429, 2445, -2339, -814, -3936, -1391, -4562, -4350, -724, -2389, 1021, -982, 3259, 1266, 1818, -715, 229, 1753, -4959, -978, -1255]
370a255J624k991M591J072r63J412l029M529m594r96o51L466l468j681O328k093
386A301K258l053L891l67j987k033Q62K338p853M842L40n61r59L553k43j903M437
403D863n798J735p98j58l767J864K642m050L275j262M427l283o30Q99J110j788
419g19n562O246j488j109l419O804J252n688K418L483J146q889M611J911k722
434a725l151J673N347m383Q65L04N949m332k492M297j59l133k900O739m712R57
450h56J557k99J134J135P09n300P460k978m598J149M066k832m743P287j071L45
466B165k345K405J557j111l532j314Q738q313l739N824N585r226j695J2325m632
481B692n504Q00P586o236l830L102J718l0o305N658K124q89n059M564L503o835
$$ y = [-1255, 369, -2622, 1969, 3041, 2078, 3490, 461, 4990, 396, -600, -1251, 2215, -1253, -2934, 3394, 1301, 3559, 506, 4397, 4030, 2043, 10, 872, 3210, -4643, 199, 539, -22, -981, 2572, 2329, 426, 4863, -935, 800, 2, -156, -3923, -2059, 583, -3467, -192, -1454, 2973, -310, -940, -41, 1069, -719, -6281, -35, -1523, -2632, -6051, 753, 2005, -3683, -1265, 2218, 3364, -5525, -914, 997, -1725, -4876, -3203, 2144, -2239, -1374, -1070, 4879, 547, -1945, 2352, 2193, -940, -3840, 2899, -1813, -856, 701, 402, 1536, 2671, 3380, -1920, 5540, 2562, -2036, -887, 3179, 347, -4396, 2891, 1820, 2165, -180, 2225, 3782, 2671, -861, -2175, 6563, -1750, -5489, 335, 5920, -3306, -5001, 7324, 2692, -2812, -2012, 5574, -662, -4492, -1390, 328, 298, -6007, -349, 1775, 886, -4173, 391, 3894, -2941]
497b941N24J887J217o244M402L85k355L459p92l34L6M691o833J168L690l270j796
514c106J497L244m278L677j974J776K734l900j238M215J918j1036O127N455n927
529h16l780P647K998r251M380K935p26m892K021J759k239L77k526M730j383n13
545G21j061L352j37m314L691j503K9k180J861k244J783J634m634M293Q69j555
561F05l476N203j295m269K079m29J971l121R10O83M029m538k776P831k274n191
577d058L20P825o304l755O093J824l575l117Q190k479l002N50L242j400l164K892
593H2j326K865l528J211K090Q09k969L60M886n748J290R35J78k213J168J378k172
610g04L406k877K490j144J11k8j98k27j395L314m471K217J117p73j341K171J250
$$ y = [-2941, -2417, -530, 687, -5557, -1155, -770, -3125, 334, -458, -792, -756, 3935, -2898, -1730, 1960, -1310, -3106, -1609, 1635, -2643, 1034, -940, 836, 3570, -330, -1568, 2647, 4565, -6471, -344, 5111, -816, -4596, 3051, 6049, -3202, 1178, 4113, 3387, -1505, 516, 2275, 36, 413, -2113, 2617, 1234, 721, -340, 3012, 2875, -1439, 2252, 749, 778, -1402, 459, -1785, -2, 1632, -3002, 1291, 2160, 605, -2871, 2332, 1037, -3232, -1153, -1582, 389, -2732, -1822, -1139, 2890, -1648, -4424, 3407, 1133, -4058, -3738, 4087, -2217, -5972, 121, 1945, -1630, -4747, 3443, 964, -2038, -1488, 1754, 354, -2810, 82, -1244, 1621, -1907, -696, 1394, 2203, -766, -406, 4480, -1268, 22, 957, 1135, -1078, 90, 1468, -704, 2702, -175, 2315, 1171, 1282, 1254, 1056, 829, -566, 2748, -1723, 494, 1611, 838, -503, 1668, 2918]
627B918m246K630j002O99k131P44P83j320Q05p52K534l388K433l35j605J386j227
644a074L7j486L583m052J546J686j492M70oJ458k674K615k527R72M81j560J129
661h94l49J675k002K245j265J334o13j757K844j368q23m32M040l972L04L111j480
678E98o2m27K700l103J566j109O89Nj544K261j504J417j231J841j309K21N10k237
696g18K343j499N3n48K103k504M08K787k755R13m55J503k469J036j58p11N50j842
714a963K509j656P65l49J120j044l47J217k147K023j898O46n4R42j195p8K620
731A111k835J451n59J049j444L33P46j119J090j375K446k013P85P01K51o05p73
748g60K576l066J542n83P50m12J00O04p45K092k626K089q53K15m43o5R04j569
$$ y = [2918, -1328, 1302, 300, 999, -1132, -388, 395, -925, -120, -872, 1662, -1726, 707, 372, -1233, 153, -1074, -1037, -2523, 1060, -2992, -1446, 240, -1252, -782, -788, 670, -2004, 611, -1916, -944, -463, -2023, -894, -1243, 432, -1570, 675, -590, 744, 131, -1626, 1218, -150, -973, -1405, 2635, -1337, -1033, 2078, 598, 536, 109, 2809, -294, 1272, 163, 852, 857, -687, 1574, 70, 1487, 256, 2097, 788, 1009, 1519, -718, 1625, 126, 179, -369, 1734, -770, -362, 2425, -330, 583, 128, 1631, -838, 198, 40, -671, -121, -1963, 546, -1110, -345, -694, 426, -618, -965, 252, -1895, 128, -1770, -1124, -1178, -236, -1431, -1509, 1111, -1724, -273, -832, 217, -1227, -894, -148, -1267, -177, -1552, 894, -1119, -334, 367, 618, 13, -760, 1816, -1250, 292, -291, 459, 47, 147, 751, 6, 2098, -528, 1561, 708, 923, 480, 415, 1319, -250]
766b50J833j956J843j028J57R80r88K20q81J892k579J476p30K10q5j99P64j694
784a015K432j737R12n58j53j40r40J765k077J533j246J439p51o18J444j306J201
801A85j937J923j569N01K47n14Q27r47J577j406J450j302P40J18r17J014j346
818a356J713j513J555p92Q93J23q55R96r95J510j835J415n82J30k9o43J816j425
836A26J352j773J957o94n85M46m67J175k228K079p81L86r22M87P74j481J263j337
854b23J644j697L16J53l44N40j180J762j515J315j355P15J89j088M72p68J756
871F92k325J254l98L67J3r88J516q52J066k162J658k16q50J58N40R08k708K439
889A12l21N58j162K50J179j496R58j379K151j458J22L85O45j00j463K613j276
$$ y = [-250, 1583, -373, 1470, 442, 599, 1579, 591, 811, -70, 1822, -757, 719, -11, 199, 114, -85, 679, -1015, 1417, -320, 592, 34, -119, -259, -1199, 566, -1511, 22, -1224, 215, -536, -1154, 290, -1016, 185, -1752, 171, -1398, -897, -650, -1164, -337, -1284, 293, -1113, 337, -965, -225, -107, -1024, -10, -1356, 357, -1156, 399, -393, 500, 623, -232, 764, -231, 1279, -556, 859, 277, 407, 378, -265, 1551, 126, 1478, -295, 1662, 968, 383, 829, 362, 1537, -691, 1388, 607, 993, 71, 558, 1332, -149, 1114, -223, 1421, -276, 40, 193, -151, 389, -791, 971, -544, 771, -584, 131, 320, -768, -296, -1064, 692, -1633, -379, -777, -410, -397, -1385, 131, -721, 345, -1817, -159, -375, -1225, -1067, -527, 381, -2327, 112, -209, 349, -813, -563, 616, -880, 78, -1301, 850, -608, -486, -101, 544, 444, -1019, 1594, 318]
906C18M81r37Q16m81j47J142j759J984r93N87j011J480m91j504J626j016Q75j536
924e66J626p77K46m8j057K255j479j03p15K326j935j024J850j97l93j588K858
941A279j618m9L3L31N1j377J362j162J735k183O48Q27m51k66m4J837k672J700
959a9k32k89k75M84J73j324K320j909J072m46N73o16K09Q63j417J419j376J253
977D63l44r8j21K02J307k315J646j02O54j792P34J335k130R05n4J784k667J318
995G25K94o76N18r09J068j049O75j272J697k75j389J242k54K11j322J938j591
1012c69Q5M33p23M42m54J172k017J667q69P5M91n59R08j221J087j415J302p74
1030g39l09P91o28Q84j394J702q31J21m65P62M1j076J513r83O72p79J106o60j29
$$ y = [318, 799, -138, 678, 197, 50, 1192, -567, 1417, 424, 1011, 0, 1480, 989, -515, 1111, 95, 970, -566, 1060, 283, 529, 481, -576, 1679, 200, 97, -618, 1708, -227, -1251, 599, 402, 9, -1579, 1279, -339, -388, -355, -24, 27, -1350, 12, -1150, 585, -1598, -950, -123, -574, -840, -884, 953, -1719, -19, -251, -540, -815, -331, -158, -1482, 838, -1071, 1, -445, 128, -488, -279, 584, -833, 586, -790, 463, 119, 21, -100, 102, 1409, -906, 740, 638, 1292, -500, 234, 1569, -561, 344, 290, 2074, -593, 725, 1019, 343, 861, -48, 1020, -29, 646, -626, 1071, 796, -593, 649, 395, 606, -716, 1222, -369, -284, 149, -574, -132, -586, 586, -1431, 236, -633, -558, -67, -626, 282, -939, 148, -1267, 35, -739, -1048, -257, -885, -1, -1395, 307, -524, -403, -868, -106, -65, -1141, 372, -611, 61, -718, 388, -272, -401]
1049d01Q20j004J395j314J104j035J145n68k22J352j591J417r70R67j233N58J05
1066E25m39R36j256J321j224J337j101N22Kn68J101j765J333r55J030q80M2M73
1084D34o47P41j025J381j542Q19m4k44J02o82R75j033J015j129P08k48k37M36
1102b20o54J267j675J578j160M52k27K7N86j039J240j399J341o80N07N7p06J068
1120C63r56R93j161J161n65J70L21n56O44p47J155j303J332q23Q5N71o86N85n50
1139C3J167j395J089m08l22R23r48O79o48P67j321R74m1k57M67p14O92r80J120
1158H77j227P53o9p70J008q50M20o28Q39r53O39qn25Q64j126O48q14Q92r50O71
1178c09J69p15J343j044L59m76M18o28L71N76r62Q10r54R79l44M02m24j5Q31j163
$$ y = [-401, 419, -585, 810, -504, 600, -435, 710, 142, -80, 1272, -319, 1098, 128, 1095, -138, 420, 525, 86, 1022, -234, 1087, -137, 1200, 99, 621, 623, 55, 1156, -609, 724, -231, 799, -81, -39, 434, -213, 528, -497, 884, -658, 161, 117, -127, -25, -707, 268, -765, 250, -879, -171, -419, -656, -220, -874, 393, -1282, 296, -864, -412, -639, -612, -26, -1065, 175, -1224, 117, -563, -56, 1, -705, 363, -593, 400, -761, 400, -165, 5, 326, -230, 414, -333, 822, -481, 851, 28, 113, 684, -2, 583, 33, 1200, -195, 894, 486, 164, 1087, 139, 818, 170, 937, -384, 590, 549, 292, 759, 45, 737, -243, 877, -350, 403, 334, -436, 572, -278, 142, -486, 353, -600, 39, 31, -494, 370, -756, -108, -922, -30, -980, -309, -140, -855, 488, -556, -197, -673, -255, -883, -512, 64, -898, -88, -1042, -63, -407, -5, -429, -444, 387, -776]
1198g76J310r25Q10o68L86m1m59J107j295J269j062Q99m68L12r3k35P38j159J277
1217I27j005P14o9J56m25o6P87j215J240r65M08k81Q8o1m10Q56q86Q63r57M91
1237A90q4k77L19n67O65j002J088j003O64N6o40N81n27P50j213J202q40K29K46
1256a63o55O90o83R36j101J012n64J99L17n94K56l46R39j202J077l92J30J72m75
1275d47O65o76Q30q39R01o06J91N14p19Q30r33J033p74N00l77J62M13p40R93r84
1295f3R50p18M23k86k70N18p12P79l52M27r42N58j3l17O92j043J051r71O93l84
1315B0K07j15n45P87j023P62o34O85n35J63K51l19M03j040R05l59L53m26N3M53
1335D6o11N97p40N26j65K19j82J91K33q49J107j145J063o00L49j37K1P7p58J254
$$ y = [-776, 534, -391, 419, -249, 137, 96, -363, 744, -551, 718, -344, 555, 87, 399, 306, 71, 809, -350, 927, -78, 636, 567, 723, 298, 232, 1019, -196, 1044, 79, 487, 206, 294, 233, -177, 679, -207, 656, -301, 190, 106, -171, 148, -419, 246, -756, 332, -671, -7, 49, -591, -10, -537, 213, -1000, 202, -638, -409, -163, -818, -128, -811, 125, -976, 36, -528, -329, -12, -606, -350, -696, 243, -959, 118, -274, -144, 28, -447, 218, -458, 372, -467, 434, -172, 19, 533, -186, 644, -289, 744, -30, 470, 93, 255, 668, -72, 921, -63, 887, 169, 592, 306, 36, 554, -158, 621, 269, 696, -246, 312, 299, -18, 674, -369, 682, -289, 404, 20, 227, 112, -433, 354, -669, 93, -541, 144, -391, -228, 23, -296, 107, -933, -28, -387, -34, -460, -407, 46, -565, 32, -708, -182, -347, -128, -310, -119, 114, -735, 372, -773, 290, -310, 39, -98, -77, 0, -758, 496]
1355D96p30N39p53Q28o8m14N04m36M79n85O45l44J94K78n59N61n73P36r03N92
1375D87j76k0K67n78N15o58Q61o82M46n38J51l7l02N96j134J401q23K69q6j68
1395b09K91o57P84n95N73q61O90l43j77M51p74Q60o82N17m06O56m25k85N73o85
1415g04O89p65P77o49M39L60n12M95q11Q08l39K63l36M08k2n10P36p16O54m22
1435a57L79k86J37L06m16M29p51R83n97L14J71l03L06m76O94q33P59o21K00K11
1455D49k12K81p40J000j046Q02l41j25Q2r3K59p52P24p94Q28n11P7J80m36O35
1475B67p29N84m89L83k15j74J86n38Q70j003Q03p30O18p7l39N02m31O67n99L90
1495e4l62L73k67n5M71n81O53n14O05m27J61o6j18M70o83Q03m71M70l61J16p7
$$ y = [496, -234, 305, -448, 380, 312, -102, 402, -34, 445, -140, 505, 161, 355, 633, 74, 635, 62, 798, -105, 487, 311, 291, 558, -20, 495, -163, 698, 16, 462, -76, 75, 38, -264, 332, -802, 599, -224, 45, -41, -209, 82, -575, 209, -386, 187, -674, 16, -327, -504, -53, -827, 33, -649, -132, -538, 118, -307, -592, -19, -704, -15, -780, -3, -652, -213, 147, -365, 130, -681, 127, -212, 51, -285, 123, 101, -409, 327, -389, 265, -157, 222, -64, 73, 379, -37, 392, -359, 624, 27, 341, 512, 209, 515, 39, 733, -100, 659, 38, 238, 449, 237, 518, -222, 778, -268, 534, 193, 68, 150, 57, 316, -436, 288, -506, 322, -189, -112, 68, -368, 267, -462, 122, -367, 16, -199, -373, -187, -725, 145, -858, -55, -785, -167, -244, -583, -81, -512, 155, -444, -54, -416, -43, -310, -365, 106, -475, 178, -336, 269, -158, 3, -63, -181, 289, -394, 409, -62, 408, 47, 163, 86]
1516H6%M92o69O26p24L93J73j67L19m93N98p94O20m91M32m38L09M5j11J04n30
1537b20N63m61K21R1l2J85n92O41p02K66j26K01ok02J51m69Q14p18L51l83K58
1558a69j7k24L95n08O18m18M17n06L64m19J38N39o30O01p44O60k82JL52m22N77
1579C23o77N37m62M88j59l4L74o50N25n19Q58p66K76J5j24L84k60K90o17N98l97
1600CM13j68j89L94q03P31m00L28j57J13k68j13K78l31N65n50L02j25j4M52o57
1621a96M25n99N45m27L06k01m3J32n79O91p09P49o60N90m32K2Q8j73N08l95O71
1642C13n83J66O6n67N20l62O48n50M15l41M50l02j84M41m05M93n42P19n95L22
1662A22J28l90L46l33K95k59N07k91J43K9l07M57j22J11m69M32k86r9J99l7L35
$$ y = [86, 86, 578, -91, 535, -189, 204, 377, 210, 529, 36, 634, -160, 460, -31, 401, -37, 272, 317, 206, 310, -220, 343, -118, 103, 194, 162, 347, -245, 396, -306, -40, -166, 35, 29, -173, -22, -491, 323, -395, -44, -427, -169, -186, -410, -15, -523, 95, -323, 94, -412, -48, -467, -329, 210, -420, 181, -563, 97, -185, -184, 168, -254, 323, -354, 183, -279, 209, 50, 16, 390, -260, 265, -254, 604, -162, 114, 129, 5, 389, 129, 419, -198, 400, 3, 416, 248, 59, 453, -350, 381, -19, 309, 152, 265, -3, -116, 162, -169, 396, -154, 148, 23, 9, 461, -196, 229, -370, 175, -252, 54, -147, -190, -58, -637, 54, -655, 94, -566, 24, -408, -386, -298, -471, 37, -358, 313, -270, -104, -38, -605, -85, -447, 201, -349, 66, -275, 175, -127, -311, 130, -275, 218, -324, 395, -200, 122, 250, -140, 206, -127, 168, -91, 416, 125, 268, 297, -10, 447, 325, 436, -33, 399, 113, 14, 213, 176, 511]
1683E11o75N84n74N63j95k94M52o64L46k86kJ7K71M3k40K51o69O46l16L60k80
1704a51r7L4k2K76m63N77m41J44r8j3J1P8R7m76N94k84R9Q6j20M3j16M05l52N18
1728C29o25J83J23j14J24k05K49k16N70m67L86Pj69K01l08J96k57K63o7k23L20
1749C00q1J15l5L79n31M30l88j6Q1m8J13m91O54n81N11m39K52j09l11M55l61N61
1771D60n74L77l76L4K63m63M61o04K47jP5j79K88J90m42K32k26L44n26M96m83
1792d07N3M50o20M60m50L35k87M47o7jQ1k39J84k36M66l64K91j5j6K88n91O87
1814D49l89J13q8LN7k35P25p80N44l63J33j20M2J40q4L98p00Q33o45J82K19n32
1836i8M23m50K61k61L45j10l25L91l65K79n15O16n06O47n49K71n4k83M36o45O79
$$ y = [511, -164, 420, -154, 409, 214, -80, 372, -292, 54, -232, -234, -217, 54, 97, -143, 108, -561, 85, -231, 129, -151, -248, -214, -236, 40, -423, 154, -287, -143, -241, -254, -243, -165, -68, -544, 50, -234, -135, -49, -169, -126, -242, 163, -189, 329, -296, -113, 10, -104, 20, -185, 64, -152, 418, -49, 337, 344, 175, 376, 68, 264, 7, 270, 203, -20, 300, 219, 334, 299, 678, 147, 577, 189, 173, 254, 206, 319, -172, 482, -99, 412, -27, 225, 116, -195, 260, -101, 460, -114, 263, -113, -79, 184, -279, 182, -422, -175, -176, -101, -280, 8, 198, -244, -12, -238, 106, -420, 76, -407, -354, 96, -524, -64, -514, -179, -466, -19, -86, -87, -6, -245, -61, -297, 169, -195, 96, 81, 65, 353, -238, 449, 60, 173, 85, 88, 145, -90, 635, -145, 399, 36, 169, 49, 91, 231, 147, 545, -155, 678, 33, 215, 434, -98, 325, -125, 136, -125, 220, 110, -215, 176, -189, 90, -425, 191, -315, 332, -217, 54, 0, -283, 153, -492, 187]
1857A87q11N77l08L78j30k78N02o00N05m13L72k19j8j90N8L88j57M11m81L08k65
1878a84p3K97r1J75k88N65n28L92q2l04L29r3M78q63M39k32M20k13o9P3l22M84
1900C10q9J81k44j41J47k6K61m19L06m21J90K01m1J1m21L44j71L59n80K34j75
1921a84r9L59l85M91n08L90k41L7J46m68N21m98N26m39M00m75K51R2k47J92k02
1942c41N32n44M11o60L71J92k04L22l06L66m68L95k33K60l5k5m3l09O26k34k72
1963a99R6k3L66k24J06l28N98l77K31k14lJ33j05M11l37K91n08N34m92K39J15
1984C10k91J17j05L01n50L54O5j59p2j03L88m07K71n18L79m3Q2n8k89N25o06M47
2006C8j88J7Q5j26j5j24M90l32M5N4jJ83m50K27j85K31l97N46k50j4J59n9K1k87
$$ y = [187, -624, -47, -355, 23, -107, -385, 117, -483, 22, -391, -19, -238, -256, -446, -388, 0, -157, 254, -227, 81, -184, -257, 40, -51, 124, -164, 401, -127, 265, 183, -121, 208, 115, 593, -270, 169, -63, 357, 144, 75, 148, -174, 310, 221, 402, 158, 17, 164, 138, 399, -20, 286, -135, 55, 256, 215, 226, -195, 149, -22, 337, -243, -9, -184, -283, 76, -309, 182, -326, 64, -177, -140, 6, -462, 59, -439, 87, -352, 48, -427, -176, -84, -331, -139, -341, 191, -353, 58, -602, -231, -39, -243, 79, -227, 139, -329, 66, -167, 93, 58, 33, -10, -319, 307, 73, -199, -103, -126, 240, 16, 122, -206, 392, 15, 246, 32, 29, 162, 57, 468, 131, 422, -86, 448, -44, 195, 310, 19, 136, 31, 332, -218, 136, 201, 42, -30, -133, 255, -152, 119, -399, -20, -63, 19, -39, -328, 197, -409, 38, -150, -133, -48, -174, -189, -313, 177, -155, -110, -56, -57, 126, -324, -97, -282, -51, -448, 98, -152, -166, -7, -66, -45, -332]
2030c32L25n60O46k08R2J41k73L87k35L40m41R4J73l02N26n30N01k61K43o1J57
2051D22j88J73j01o48O45l74M35p2q6r5q2P2j67J57j65K60%P5o4k40R3j25K13
2074A38l37L90j30k60K32k59K53k13L08n33K76J21p3j09k3K07k20K79k96P1k3
2095b01R2n1k03M98k11J81l60J78Q8q1K87n04K65m60P40l17k2R9K5O0l76N30l95
2118a38M02k93K50Jj92J35l47L69k75J85N6n7j0q8J67k53N35k81L6L0P0m5l70
2141a13M48j87j0l51L31j08K2J4k18L67m53N91o00L99m0j35J24m01N32l66J86
2162C2j81L12k97k5J85n00N41n02N39l17J67j0l10N60l50K56l62J42J19l0N5k7
2184cR9k56L39k79J86Pl0N7j83K59k58L68l27L97k36m07N60k49J45l11J18J5L5
$$ y = [-332, -7, -567, 79, -129, -37, 104, -169, 218, -17, 323, -118, -24, 149, -153, 373, -157, 344, 83, 326, 265, 422, 234, 407, 306, -342, 303, -71, 364, 292, 206, 111, 29, 101, -66, 91, -74, 186, 186, 261, 197, -43, 50, -75, 138, -199, 191, 61, -199, 33, -226, 27, -186, 122, -411, -135, -14, -87, -196, -219, -12, -232, 47, -249, -178, -201, -109, -160, -363, 135, -76, 105, -255, -77, 11, -70, 217, -287, -22, -482, 258, -59, -81, 18, 43, 103, -273, 257, -138, 264, -29, 221, 222, 30, 165, -182, 187, -88, 97, 153, 96, 86, -2, 165, -88, 447, 166, 202, 232, 302, 257, -113, 335, 148, 138, -213, 118, 10, 32, 46, -172, 195, -258, 333, -267, 132, 92, -43, 81, -320, 212, -154, 32, -149, 163, -134, -159, 26, -474, 67, -435, 104, -213, -46, -56, -366, 194, -156, 100, -262, -120, -1, -31, 24, -3, 96, -160, 179, -100, 86, 93, 63, 120, -63, 196, -62, 306, -21, 376, 140, -267, 293, 44, 189, -122, -4, 11, 46]
2207D6p2j14K54j67O34n42L41m30J8L08l06L33l15N42o45J4l2J03O7r1L31l08
2229c1K75j23k01J11k0j09l51O41n89J40M6K93k20l2K48m25L73m44N65k25j66
2250b44K79k58L94k12K84n87N04k44L18l65J68L4n8J19r7M4j13P2Q0j11M49p65
2272c09L71j92p2J63J61K46l34N3k63L33j98K10j03J14k7k15J06j39L5M61l50
2293E1Pn3l2qJ95j75m5PJ9J19k01R1O1J19n33O65l56j35j49J38J52J9Rj17L0J33
2319A1p2Q5k69J44j75J42j06K65O8k94N5J5L04m61L51p2K05k92J26Q8J4j10r1
2342f9K86k35Q5q8kR8j76M81m56L19k63K93k79K3L55k58K44l20K37j89J74m3p7
2365A40k26K31J85l41J61%k39K32N3P9m30M24l77L40m42J52R8q1m6l7K3q0L49
$$ y = [46, -26, -140, 114, -53, 581, 39, 380, -50, -32, 276, -30, 303, -12, 530, -115, -101, -133, -30, 37, -54, 277, -31, 244, 121, -80, 31, 11, -98, -449, 192, -397, -257, -211, 82, -138, -170, 78, -347, 26, -418, 147, -78, -244, 35, -223, 171, -41, 243, -344, 160, -84, 234, -131, 37, 71, 13, 132, 35, 79, -34, 38, 118, 7, 456, -309, 62, -130, -202, -39, 122, 368, 34, 87, -176, 157, -41, 169, 66, 180, 153, -62, 44, -95, -60, 401, 51, 58, 5, -27, -35, 160, -15, -60, -53, -34, 85, -116, -25, 36, 155, -378, 287, -69, -204, -353, -215, -63, -44, -35, -152, -122, 11, -61, 24, -245, -101, -276, -134, -240, 25, 93, -201, -146, -131, 173, -288, 63, -9, 196, -96, 30, 118, 132, 22, -69, 217, -18, 67, -21, -23, 75, -101, 380, -76, 243, -20, 273, -6, 17, 372, 114, 358, 38, 275, 86, 260, 217, 140, -86, 145, 330, -11, 150, 150, -89, 143, 196, 275, -155, 269, -108, 232, -210, -58, 40, -41, -87, -124, -101, -181, 168]
2388A68k83K5J1k95O14l86L36m51K94k73J7K03l86M52l63K88Q9O9r4l61M14l71
2410b83K71k6J97l95L96j31J30j70l45M48j7j51K08K60j92j48o5K31j12k75M03
2431B34j43o0L3J5J64l45k0J41K03j55j29J79k52L29k41J70k82J96J8j36K28l34
2453a87J61l40M34q0%n3J9j26o3M72m22J38j22M7R6K0j50j57L98l18K35j99M9
2476a48n1J53n0O8N3l88L15j17J06R1j48K83l43L14q4P5J51m12M15j64k48oL09
2499A74k58K95j0k33L31l13J72m51N19j83K33k35l21N51n43O27l63J62k86L35
2519B03O9j97K77m30J07J26J89k95k20L00l23K54l5j09j15J72M0j49Q3j63K65
2540D9j79K30m03M67m77K57J96j92j95j03K16n4j55L30l29K94k47M04l86J76O6
$$ y = [168, -115, -90, -79, -374, 240, -146, 190, -261, 33, -240, -223, -20, -406, 46, -317, -29, 60, 129, 35, -326, 88, -283, -12, -38, 159, -236, 160, 29, 159, -11, -356, 92, 75, -76, 132, 392, 200, 52, -13, 218, 106, -169, 234, 91, 31, 64, 79, 243, -102, -122, 19, 222, 67, -62, 117, -135, 194, -47, 123, -159, 37, 55, -81, 147, -187, -26, -366, 68, -12, -12, -65, -46, -172, -235, 237, -185, -47, -169, -122, -26, -6, -156, -313, 85, -233, 2, -197, -148, -199, -46, -96, -28, 25, -363, -48, -165, -59, 32, -116, 167, -176, 138, 54, 129, 280, -132, 283, 119, -129, -135, 174, -84, 211, 201, -32, 299, -14, 158, -293, 226, 43, 276, 41, -280, 271, -272, 355, -8, 154, -132, 203, 272, 75, 352, -78, 29, 155, 344, 49, -171, 129, -194, 60, 25, -84, -199, -27, 13, -136, -53, -216, 49, -130, 100, -303, 164, -313, -56, 140, -52, -247, -350, -134, -188, -343, -13, -342, -48, -295, 109, -277, -101, -35]
2561c5j40K52j77M76o44N27n35L78k27J42m9p6N07l60j5J82j38K1j6j18K57K4
2583B36k54R1k03K32J08m4J74l36l2K26k88J33J70n63K59L52m43Q4lj6J8K02m1
2606F2m42K75k09O35k99j45j59K23q6R7o7j42J91k98L15j27K20j36kL1r4K13P8
2629A34j03m49K55K91j04O8k09J86j44O3k14Q1J18j24J16M4M09l62L42k13j40
2650D5m8J7J6N3p4M6J12K21n31K66L2K05n24L81Pp3K7l41K39k63L97k48K56j48
2674G0Q3k08j29L06o5O4o3q4J50j98J61k06Kj91M58m47N16j51p0m4Q9j21j17J56
2698c9p3K40J03m72J76j6Ok65K67j6L7J76l56J83j07R4K10j02J05j20O6K67k78
2721H6L2r5L1L01k74K2j3k31Q8q4K86p2J58k13R1J40j46l0r3K57k91R5k54P4J62
$$ y = [-35, -175, 77, -100, 376, -268, 259, -276, 102, -125, 17, -32, -108, 399, 39, 24, 206, 68, 89, 73, -45, 212, 236, -18, 73, -130, 102, 210, 166, 340, 4, -28, 198, -90, 43, 213, -350, -91, 261, -182, -98, -101, -117, -99, 103, 62, -380, -105, -314, 321, 22, -123, -282, -59, -145, -48, -115, -257, -66, -364, -49, -176, 44, -92, -94, -63, -157, 56, 134, 31, -418, -163, 128, 24, 92, -117, 69, -75, -12, -226, -145, -27, -151, -35, 9, 418, 56, 398, 185, 45, -3, 14, 30, 83, 9, 55, 167, 388, -143, 123, 155, 360, -164, 217, 224, 151, 178, -163, 76, -187, 210, -38, 218, 70, 153, -55, -184, 122, 57, 121, 58, -26, 124, -74, 87, -119, -117, -308, 150, -297, 219, 68, -2, -46, 43, -78, -195, -39, -112, 128, 231, -241, -65, -81, -75, -340, -73, -89, -52, 124, -232, -49, -156, -62, 148, 46, 151, 31, 97, 364, 86, 118, 23, 54, 355, 81, 103, 90, -141, -53, -137, 149, 77, 235, 22, 113, 253, 107, 77, -16, 241, -50, 45, -209, -135, 27]
2746B7o9L60k49J8pk22L13l27K77l87P0j88N71l07K32j94M2j44J07K21l07O9j29
2769b23j10M30j89j72J88R5k35M6P2k17M28l18RkM12j47L3k07J99j8oJ89m53M26
2793B30l00J8k8J20k48K45J0k30L01J04j81k44K52K80l19L55m75K94j04J33k94
2814h1L0N2j56K82j90K10j48J79j39m6L0j99K10m6K43j69k56J96k00O2K18p6k24
2837b18K27j84j42L22k60L21l27L73k92P7K38j90q6l9K14k86Q1K04l5j99J01N5
2859d5O8j5j07J62m1NK5k25J05N1J17q8R8j08N6j77j10J96P3n3k1J14j60N2m6
2884g4O3O2l1j77J61K32k42p7O9j39K93l29K58j11J76k69K90k55n6K42R5k60K23
2907A44n2k00j67M21PK2m15M56k69J64j68R9J2l55J37j1k3J80j18K65l65K55k35
$$ y = [27, -42, 318, 69, 87, 80, -142, 171, -156, 121, -266, -196, -384, 187, -120, 112, -82, -40, -184, -77, 144, -163, -94, -223, -333, 97, -92, -264, -76, 19, -216, -170, -98, -315, 113, -205, -196, -198, 214, 67, 100, -107, 92, 74, 68, 257, -196, 230, -70, -52, -80, 40, -208, 37, 47, -183, 118, 222, 41, -203, 49, 329, 10, 365, -110, 184, 80, 213, -81, -51, 1, -155, 127, -63, 147, -1, 178, 39, -7, 23, -176, 34, -12, 231, 62, -194, 2, -198, -136, 82, 6, -218, 9, -175, -317, 5, -255, 66, -261, 112, -180, -103, 135, -55, -141, -180, 34, -252, -171, 33, -2, -201, -100, -45, 23, 8, -99, 63, 22, 27, 52, -173, -68, -17, 100, 12, 110, 2, 58, -119, -229, -33, 40, -13, -34, 80, -80, -28, -74, -11, 51, 20, -157, 4, 236, -6, -83, -14, -153, 140, -189, 69, -42, 134, -135, 155, -100, -156, 86, 181, -79, 144, 92, -108, -275, 146, 153, 175, -240, 216, -53, 111, -57, 42, 54, -301, -164, -175, -198, -18, -136, 129, -236, 19, -216]
2930b16K67K8p9m16L48p4k8J91j04k2j0R6J29k50J03Q8P8k29M10j35k56J13m2
2953a0K99m25l2K17K88k36j80K55j28q8O4J98l03J97l5j89K08k90K75j64L01k41
2975a9o0q1k8J08n1P1L6Q7M5j11K3k61K26J38k6J85k22r4j66J66J22j06k57L92
2999A17k08L46k79j04L43m34K75p3m9L7L5J01l1k95pJ98N4k8k17L04j19L01l49
3022h2J19K5k20K34j8J48k12J7l0L34k60j60j7l7J06k1J4qO2J56l85P8l4L79l64
3047a76K75j38k36N68l09j32J49J67k49K4j02Q8J30j5j78R9J19j21O7J9k09K42
3069H2j5J31l69O7K90j23J4k06L1p1k9J90o1l3M6L6J90j17l42K14k2L12j98k47
3093b30M43q9j11J4p2K22j34N0k19Q2j14L55l11L16j26m3R1q3J05l28L10j37O9
$$ y = [-216, 51, 79, 0, -416, -68, -142, -170, 21, -83, -105, -115, -19, 110, -140, -37, 51, 129, -100, 310, 175, -81, 32, -10, 289, -136, -168, 49, 337, 101, -79, 176, 48, -40, 24, 222, -81, 116, 81, -108, 100, -190, 85, -79, 222, -19, -79, -160, -188, -80, -131, -60, -24, 63, 108, -3, 20, -241, -15, 123, 97, 282, 60, -34, -200, -34, 88, -18, -275, 117, -91, 255, -24, -128, 215, -219, 56, -17, -66, -29, 6, 107, 76, -219, -226, -28, 26, -2, -219, 85, -34, 267, -82, 37, 62, -158, 76, 58, 206, -6, 11, -19, 315, 55, -105, -122, -159, -53, -74, -60, -68, -6, 150, -235, -157, -191, 188, -176, 99, -39, -275, 293, -16, -148, 1, 168, -81, -57, -159, -71, 59, 44, -134, -35, 84, -37, 30, 49, -160, 82, 67, 198, -171, -104, 186, 63, 77, -129, -98, -169, -198, -8, -69, -102, -56, -20, 170, 53, -289, -75, -97, 215, 17, -230, 213, 124, 13, 27, -45, 177, 43, 93, -126, -44, -158, 197, -114, 202, 76, 33, 124, 41, 146, -182, 128, -9, 60]
3116F0j34J65K4k88K42k61N5J6J04%j62L04k11K43l84L88j35j64J69m0P2j40J27
3139E0j38K2J19M1l07J21L81k93k46K14K2J31o9j33M8j30K94j63R5J66q4n18M42
3162F5m39L89k78K31J22j76L98n97M62k49J54j16oJ41j93P7J2J63r0q1M1J52l19
3185a37J39Mq2J62o6J33k19q9K57j37K3J33Nk67J16kP2J00j69J47j58Q6k45M25
3209B31k31q5p9K3R9N2J2j21l9J97O5k47j9K42k04Q6p8J66N1j22k7p4K42k22k55
3234c37L28J73k01p3K90l37K53L7K7J13n40M58j37j04K32l10j13N05l36J43l3
3255C8J01j53j18L82j61j35o9p8J55j70M64j35L21m14P8J9k32K44k00J84l82M52
3277A91l22R3J29r2OJ19j78j85K41q3%J86k07K75m18J56k5j6P5Q2n6m5L29k26
$$ y = [60, -74, 91, 115, -173, 69, -192, -137, -121, -17, -17, -179, 125, -86, 157, -227, 161, 26, -138, 31, -9, 63, -77, 50, -88, -66, 53, 94, -213, -92, 289, -4, -250, -36, -14, 117, 48, -85, -37, -167, 127, -36, 59, 225, 141, -377, 65, -374, 15, -263, -32, 90, -86, 312, -285, 177, -72, 82, -34, -40, 101, -92, -15, -3, 160, 70, -11, 30, 182, -137, 2, 6, -76, 86, 20, 153, -66, -155, 102, -35, -12, 121, 126, -141, -25, -27, 45, 145, -24, 123, -35, 51, -194, 231, 0, -85, -164, -141, -42, 10, 22, -99, -138, 59, 124, -123, -142, 100, -104, -18, -96, 70, 121, -1, -28, -102, 140, -82, -337, -9, 164, -37, -110, 180, -157, 96, 133, 160, 273, -267, 191, 54, -50, 182, -128, -241, 264, -72, 71, 38, 139, -14, -132, 250, 89, -46, -115, -193, -38, -208, 256, 121, 442, 28, 106, 125, -107, 137, -63, 121, -261, 191, -131, -38, 91, -1, 5, 124, -54, -239, 2, -81, -81, 105, -102, 173, -245, -89, -114, -130, -55, 27, -29, -74, 255, 29]
3301B9k48K03j64R2J09J7Q1j97n4J69j42L09m13M48l25p7M74k10q8K45l21J66
3323A03J83j96j48J11j57K14l13K00r7K04L3j92p7j46J79J39j49K33N5N4k31Q3
3345H5k49J23j75L73r3k30M08m09M31o01L22j79K18J8lpk08R2P8J16j07j79P0
3368a06J83M9j15N8l69M21j73j00J95j12q5J24K54o8k46lJ4J64l4j49K9J69r4
3391FO2j05J55j68q7J69N9j4l7j55K84l20J39k2Q1r9mM40n42N1K85j37j64J84
3415F1j41L30k35j64Q4M4K45n7K08k67j28J75j21n0k81K37K12j31l2L8J02O8n5
3438A42j28k85L10Jj81L95l85J46J72k33Q8k24J16J62j05m4j30M9J47j67J40j4
3460b8m4L1K24j89Q1j30J80k0K89o91rK5L26J19P7nj40j74LJ06Q8m3k36K15l4
$$ y = [29, -219, -16, -180, -88, 21, 38, 119, -78, -132, 37, -105, 204, -209, 239, -86, -163, 311, 101, 13, 258, -63, 103, 286, 90, -58, 53, -104, 110, -203, -3, -100, 104, 137, -55, -132, -278, -99, 40, -109, 124, 179, 233, 2, 85, -164, -41, -216, 157, 64, -166, 242, -167, 264, -337, -15, -194, 24, 42, 39, 32, -176, -84, -6, 110, 3, -176, -106, 77, 126, 11, 69, -300, 121, -52, -152, 43, -69, -154, -30, 224, 156, -90, -93, -79, 85, 51, -98, -69, 100, 6, 68, -37, 118, -50, -137, 32, 91, 77, 40, -115, 169, -151, -12, -34, 47, -52, -56, 384, -158, -107, 178, 41, -123, 61, -80, 250, 15, -149, -65, -21, 224, 167, 375, 108, -20, 155, 34, -16, -297, -60, 152, 21, -11, 27, 129, 197, 142, 14, -271, 39, 40, -141, 254, -131, 15, 187, -46, 42, -182, -66, 96, -9, -53, -183, -134, 13, -154, -14, -28, -72, -41, 183, -6, 75, -55, 125, 105, 394, -297, -306, -281, 45, 164, 241, 236, 96, -78, -75, 31, 119, 76, -160, 55, 21]
3485B1N1k28J46j27nJ94r2K97k15q2P5l7K07j76k15J70J41k04J65K46l56Q0O6
3508A22k68L42l3j50K5K16k39j03J03m0m8N5M4o0O3m8j02J21k45J37K01Q9k19
3531c7J0k6j7J13j4j33L38k99J74r5J86l37k8J31J74k75k6n5L09J41q9k34k1J84
3555G4K18j31k35N1m3MJ14r9J38j52M6M3q3K8n9J26m7m5Q6j88M3P8j17J22p9k6
3581a33K65n4q0l3K30N5j39l8j62J60j12J56n1j63k5k8J96no4J97j54j08L1j55
3605b14J92J3j81p6J17J12N8J27j43R3k63J88%O3o7k15J14l3K8J92r7j94K05p
3629A2l8RJ2k27K18J6k1K04j42J4j04l4L71n7j75j11q0J82J71m02j87M64j48K22
3653A69m33O0K93Lk80K74k2L3k44k6J46n6L39m08K6J4m1K52j7j82j5J20j07R2
$$ y = [21, 72, -156, -10, -137, -142, 52, -40, 257, 42, -40, 35, -2, 205, 29, -186, -16, 125, -79, 86, 332, -24, 56, 122, -146, 196, 163, 13, 38, 254, 15, -88, 15, -25, -73, -18, 26, -34, 29, -19, -121, 0, -245, -108, 93, 182, -37, -27, -53, -70, 43, 29, -104, 234, -65, 109, 14, 200, -137, -165, -34, 140, -135, -161, -216, 93, 234, 145, -89, -110, 74, 292, 161, -74, -23, -66, -62, 52, -47, 91, -61, -15, 28, -55, -27, -86, 40, -7, -52, 34, -154, -111, -33, -150, -28, -107, -133, 132, 78, -2, -35, 195, 250, 111, 73, -89, 71, -41, 115, 64, -99, -124, -152, 44, 39, -25, 172, 18, -90, -59, -214, -22, -9, -190, -266, -149, -37, 21, 148, 5, 98, -165, 23, 23, 86, 19, -196, -82, -115, -87, 105, 8, -186, 19, 12, -26, -17, -5, -232, -14, 2, -19, 185, 43, 57, -47, -81, 290, 233, 58, -53, -133, 49, 220, -182, -369, 95, -53, 169, -264, -204, 89, 92, -188, 86, 64, 97, -147, -173, -27, -83, 256, -152, -126, -112, -153, 99, 82, -100, -115, 5, -102, -10]
3677a0m5J22j12P4J21qj74K2K14l11r0K82n4J29k46p9J58lO6j97M8r8L05N2n6
3702A10n9j2Q6j89J46j97L03Oj95R3k33j64L17J74l04JL60k12j42J06L9K4m6m3
3726c1k3K63j81p8l4j27R6L25j10Q0j68J49l98M24l02J97n8J66m22J50L22l71
3748a31kJ48k12R3O7L21p4j87J12j26r5l8K20l9M6k7l27K65K10j96P3k72M52j39
3772A42k72K42j49o9J83j50jj15N6K74%N8L2j24k7o9OJ40N0k1k24l0q6J53k8n1
3798h0Q2J68r6l12J71J68k46J87J56j90N4l1j93L32p7q5j8J02M8k00j95K32Q7
3821F4M2k10K16l39M32o10K99j64L53K00l33R0r3k19M12q1J01j74j08P4k60J56
3843a52Q3J57oR9p9j02Q9M3k41j3j03L62j41O3j43J70j51j97K43k47J66J87j14
$$ y = [-10, -55, 67, -45, 29, 150, 142, -32, -10, 204, -107, -197, 85, 31, 160, -86, -165, -7, -10, 56, -141, -93, -191, 114, 166, 110, 51, 39, 125, -64, 82, -115, 188, 194, -1, 92, -141, -305, 12, 186, -118, -117, 243, 31, -111, -5, 34, 58, 12, -31, -54, 209, 28, -50, -84, -211, -115, 210, 100, 180, 12, 161, -237, 187, -115, 82, 24, 190, -232, -82, 240, -131, -133, 15, -197, -104, -37, 284, 210, 23, 135, 9, -86, -124, 96, 57, 103, 76, -251, 14, 224, 28, 101, -171, 281, 142, -130, 112, -37, -106, 77, -73, -74, -189, -133, 141, 141, 199, 231, 107, 80, 11, 17, 157, 207, 186, -38, -68, -154, -1, -29, -80, 2, 170, 74, -238, -67, 101, -145, 42, 198, 8, 62, 31, -162, 170, 93, 8, -10, 92, 140, -60, -255, -23, 64, 106, -104, 112, -227, 205, -405, -106, -270, 83, 283, -50, 40, -53, -272, 140, 59, 160, -14, -122, -48, -308, -152, -69, 88, 82, 181, 102, 0, 89, 132, -109, -122, -225, 137, -4, 59, -84, 86, -65, -262, -19, -266, -100, 87, -27]
3866b7k2j02L87l03L73l08k51K94k26K40p3pJ88o8N5j9j06Q2q9P9O6m33P1K19
3890B0l8K30k17N0N1K6k2Q1k30K51l59K63J4j19j20J40p9J49m6M8n4J10j23N6
3914H2N2J4p9q1P4j05o3K72k02O9k6J7j5j69M28j33j04l6J06q9j42q9J83n3m0
3939a29J90J5j19nL5o0%k8P0Q6r2oK72j05M3J13m44J3j23L20j61K47J28j02p8
3964H0j48k09K71J27j19P3k17K30l5J0M3L0j40R3j52r3J50MJ92kk09j37J98l13
3988b73M47k99J4k4J57j65L57l00o3M21k81J01m28M29m4P6l19J48J11O7j7k44
4010a29k1K49l8P8l82K27J81k11j9ql9K63N0n1j65J23j3j44L2jO2j84K69j09j16
4035i6k16J51J28M7J15k34K99j89J55j74jP8j38j21j28M12r5k09N9L28r9n8O8
$$ y = [-27, -49, -151, 236, -67, 306, -2, -253, 41, -185, 55, -18, -25, 163, 95, 150, 131, 25, 107, 18, 97, 163, -270, -199, 20, -18, 212, -5, 45, 96, 122, 100, 181, -49, 202, -157, 106, 120, 1, -119, 21, -58, 91, 45, 93, 39, 149, 26, 82, 134, 148, 69, -12, 62, -43, -106, 166, -36, 33, 7, 24, 9, -160, 268, 135, 31, -5, 101, 12, -130, -219, -36, -89, -129, 61, 76, -43, -48, -13, -73, -73, -101, -31, 55, -37, -43, 229, 124, 167, 280, -164, -151, -274, 46, -115, 132, 260, 158, 80, -68, -277, -6, 121, 2, 75, -142, 88, 53, 63, 106, 136, -4, 89, -63, -156, -6, -2, 190, 188, -21, -158, 40, -273, 174, -125, -111, -135, 22, -143, 214, -86, -149, 272, -9, 92, -336, 93, 49, 125, -194, -46, 65, 132, 115, -129, -150, 99, 61, 139, -243, -16, 165, -46, -65, -73, -112, 151, 201, 150, -15, 108, 95, -49, -17, -18, 44, -140, 129, 20, -96, -312, -161, -33, 14, 129, -105, 194, 5, 160, -14, -15, 63, -75, -196, -324, 88, -7, -216, -157, 171, 72, 14, 82]
4058H2j38R4r3J51k05j03Lj3mK33j85K77o8J57p0qr7j91K14Q9q0l5jqJ5R3m2J2
4086G9j71J69R9o5q8K27k11j20J6J93j40J0j26N7r5L21k58Q3k54L23r3J06K3j33
4110d8J11l13K68j0R7j51J6K07N4k88R5J20l05J04R3Lr8J49j45p6K9M5k5k3J42
4135E1K21j90J0O9j80M0m1OJ14q1K52k92JK62j48l6M9k48M02l53M44m38K43K5
4159A82k75j07K56j80k6K55l26L08q6M9n5o1J82Pj08J5k23K98q3n2J50K4j90J2
4183c4l31M28K19l06n9L3J02l10L06k65K06K07q4l44K60J51k81o3K42k63K91k42
4205a37nN00k50k87K88j11K03k70k6L30l49k00O84n10J28K13j80m7R2Jj67K15
4227A15j17J22k38J26j39K03o4J4O2k10J50k34L28l43n0K72j3j1J58N9k42J39
$$ y = [82, -56, 38, -55, 96, -109, -212, -209, -222, -226, 7, -178, 99, 31, 188, 118, 110, 13, -178, 36, 125, 45, 10, 9, 1, 16, 109, 67, 79, -92, 77, 176, 111, 23, 250, 39, -81, -65, 128, -12, -2, -128, -71, -166, 155, -103, -20, -274, 49, -44, 62, 85, -48, 63, -250, 18, 8, 105, -46, -30, 177, 231, -57, 38, 158, -147, -43, 50, 53, -45, 104, -41, -117, -88, -43, -68, -91, 51, 272, 82, 92, 161, -19, 21, -20, -14, 100, 19, 271, -21, -20, 242, 94, 58, 107, -141, 261, -92, 352, -86, 157, 182, -93, -200, 56, -124, -150, 105, -221, 87, 1, 50, -5, -66, 116, 123, 15, 30, -193, 105, 22, -30, 120, 144, -46, -34, -365, 63, 282, -24, -83, -50, 52, -258, 48, -217, -11, 196, 112, -232, 28, 179, -102, -165, 77, -186, 105, -137, -142, 358, 108, -179, 109, -2, 201, -69, -95, 235, -114, -314, 370, -140, -12, 201, 21, -26, 66, 67, -100, 115, -2, 120, -118, 8, -131, 72, 8, 22, 84, -126, 24, -210, 118, -225, -275, -3, -16, -27, 131, 190, -52, 87]
4249H7j12q0Q7j0pj41L46j69m0jN3M7m17M54k89L62j03j73j28L77j3k72pN6R2
4274aJ50j78K4M1m5n3j21K55k7j56M0r6M4Q6mJ36p1j15j16J67J28J06m48L34j32
4299e2Q6K88j39j27q6j78J6NK00PM6m2L9o2l5N2K0n6J0J90j06L0J75r5k13O5J71
4326B09k40K17l46K46M5j91o2K4J8p2O9k02L00Or6q7M52j54J24j74L9j99N7Q4
4350F7j27K4rR6j19K19m7l1j35O0J82j94r8J00J6j20K79l03R9J13m0l33L21M7
4374F7k04L29p9Q0m32J31Q8J92j14j44K86%j84o5K5Q2J45j55K3j53o6J54l53N47
4398B00k07l1j65Q7K54l52J76n3l6Q9K36l04K35j29K39k79P3j83M1J69k11K08
4420E7L03k17j98j22K17K1m3J56l13j27L43KR9l12J70j07J69k54L18l8j76N7O6
$$ y = [87, -25, -105, -18, -28, -35, -176, 170, 1, -39, -40, 13, 60, -357, 97, -192, 170, 67, -106, -234, 143, 130, -142, -149, -93, -1, 149, -29, -5, 36, -9, -62, -183, 72, 45, -111, -71, -167, -123, -37, -41, 95, 24, -91, -207, -40, 88, 194, -254, 80, -52, 34, 322, 183, 56, -30, -208, -192, -187, 13, 20, 66, 24, 63, 1, -34, 18, 38, -18, -8, 182, 76, 106, 281, 186, -27, 38, 209, -31, 186, -160, 86, 131, -60, -122, -98, -80, -152, -83, -285, 15, 21, -75, -162, 290, 136, 260, 86, 125, -74, -17, 67, -60, -36, -45, 51, -68, 151, 104, 73, -62, -2, 180, -14, -112, -12, 4, -116, 163, -140, -41, 72, 32, -301, 20, 67, -137, 192, 113, 193, -239, -108, -20, 172, 58, -86, 200, 200, 16, -49, -24, 58, 203, 48, 71, -82, -148, 6, -347, 200, -7, -38, -203, -116, 138, -214, -38, -91, -127, -38, 198, -106, 129, 0, 239, -40, 33, -150, -109, 60, -151, 57, 360, 143, -55, -177, 40, 61, 18, 174, -139, -266, 77, 79, 178, -134, 36, -71, 98, -156, 162, 124, -52, 5, 71]
4443G1K18l51L74m41J65O4P6q3l4j52J61l6PKj40K1K3M1n4J84l89N17m15L65j80
4468A4j21K21j09J14Jr2n1K60j83J3j00J33R4K9j64K39j67j29j59%K18p4O4m5
4492Fj33J09N3J31j54J50k9q9q5J01M3n0K5j23J32m9J41j55mj9J01l2r5K56k2
4517B09P0k27l1k16M4M7Q0l1M6k07K87p6j07J74j06j80J57K65k30J3L8l18K37
4540f2j79K86p0K24j15l0J1j5R9l0l47J95r8J95J93j80j00k3M2O9j06r2J32J31
4564A30n4k2pj47r2J5K65k11L95j77m1j19o0K29j78l60J00K42L3k0J54k32M25
4587B68k55JJ33k99J68k14K71o5o2pn6j84L81j65NJ91j0o1l12J28k0J02J0J55
4611A03o0l5J03r0L7j4K8j03RL6K47k21J20l51J89M6r3K28k19K4ll1P0n1J92k5
$$ y = [71, 289, -62, 312, -129, 36, 100, 176, 93, 59, -93, 68, 32, 39, 41, -99, -78, -55, -14, -68, 116, -273, 244, -171, 194, 14, -107, 114, 5, 119, 120, 28, -23, 237, 54, 67, -33, 100, 194, 223, 59, 298, 131, 2, -157, -157, 61, -13, 51, 6, -127, -18, 35, 166, 12, 162, 133, 44, -41, 60, 103, 53, 78, -45, 87, 38, 179, 24, 20, 1, 102, 70, -25, 231, 209, 279, 52, 21, -195, -151, -104, -24, -55, -9, -216, 71, -5, -112, 62, -44, -224, -67, 198, -32, -19, 19, -299, -62, -241, 45, -25, 199, 84, 54, 65, 50, 149, 119, -228, -33, -131, 64, 257, 77, -23, -46, -4, 65, -41, -133, -1, 130, 76, 54, 47, -100, -192, -177, 88, -123, 272, 95, 54, -65, -125, 104, -74, -434, -334, -92, -59, -79, 75, -157, 268, 13, 14, 147, -152, 16, -198, 73, 8, -54, -61, -117, -301, 80, -85, -80, 111, 101, 40, -272, -144, -164, -62, -52, 103, 43, 8, 111, 21, 58, 44, 72, -31, -22, 14, 261, 40, 160, -191, -2, 44, -49, 179, -40, -16, -19, -50, 20, -31, 161, 136]
4637A36k24M1Q2M2J06k77K4j14Q5l13K56o2J46k28K18n3Q8JK03j68o0K2M5r7K30
4662A29k55m9K50J11l39r7L05p3o4P7pL2j31J4J64r5J08n3p6J6K4J37p9p0K8j10
4688a03o7l8J27j5l0K44Pk35K85k12K6R9j34m4L9K59l75M29l06oL6Q9j01O1m7
4713a2J7O0l68M13n1k21J42m9J4K90m02J63M6l24O1L66l21M17l82R8N3K20k21
4736Ij06j1p6K25k38J24q0J25J97q8j68J6p2q2J40NK67j36j24K47rj50J86j60
4760D1l87M65n4q0r2n9K09K5k52J59Q4j72K42K7j92J24j29%j9q8K67K9o8l00O03
4785C83k41l5j81J20j23L73n66R3J46k27K57N0N0j85k87K39k4K63k10J18N0m1
4807B2k5p7K33oj37j3j2q2K46j52L5L85m16q8M0K21k35O4J52j03j33K13l78J43
$$ y = [136, -88, -47, 35, 77, 183, -94, -70, -184, -99, -412, -156, -218, -72, -300, -82, -135, -47, -46, 157, -11, -71, -49, -4, -101, 129, -126, -175, 75, 186, -153, -250, 55, -18, -82, -5, -12, 20, -111, -97, 67, -28, 80, 27, -49, -33, -9, 128, 49, -21, 7, -103, -170, -208, -81, -96, -126, 118, 125, -110, 175, -37, -11, 88, -46, -90, -51, 208, -167, 262, -44, -50, -14, 75, -26, 35, -12, 5, 65, -303, 110, 59, -162, -20, -69, -55, 235, -167, -4, 42, -282, -221, 145, -176, 241, -141, -43, 10, 230, 9, -97, -108, -184, 41, -197, -73, -153, -28, 169, 81, -87, -71, -143, -225, -85, -80, 187, 51, -73, 174, 165, 15, 201, 41, -346, 119, 65, -15, -107, -166, 43, 68, -184, -25, 59, -113, 129, 156, -36, 88, -41, -41, -60, -148, 119, 148, 80, -220, 383, 142, 107, -74, 46, -77, 296, -270, -177, -31, -258, -1, 49, 99, -86, -373, -134, -158, 105, -105, 13, 63, 22, -3, -80, 153, 147, 10, -3, -15, -97, 149, -3, 32, 417, 1, -87, -47, 174, -61, 3, 155, 52, -81, 132, -246, -103]
4831a03J12K1p7p3J94j58Q7Q0j68Q1k6j07O9j3J11J44m49J54J05J45l04K69K03
4854B97j95k83M90j70k21K03N1j57j31K52j22j1j87J50l8q6K93k73J78Q7r3p0
4876c6J08J01k02L7k86N06l65P1L5P6J41j93N3k12L43j72R5l5l2l1M1Q8j20j1
4900@k4j1j6K40m27J46R1n7J49l76L28k3J78j32J26Q9l95Q0L7k1k49L66j92k8
4924a21J32j97L69k82K17j14j16J38r3R7j44j8J88k92K70k6J06m0q1R0j10J50
4946A23l0k09P2L3m3j1M8j11N2kK00k36J50q2j2L9lJ78j71M5M1K48l56Q5J43j75
4972A6J84Rj72K47m13N6oK79l19J26J86J91l16m8m2m8J6j10K42j85K02J00k72
4995g7K07k18J32k28J03J80j7M0k46l21N82p4j8j35J22j46K46m3j19J2j51J99
$$ y = [-103, 9, 30, -47, -120, 74, -84, 3, 83, -85, -4, -30, -137, -68, -81, 30, 174, -275, -121, -16, 129, -175, 94, 297, 102, -181, 309, 139, -82, 121, 172, 15, -116, 136, 14, 3, -184, -34, -72, -158, 135, -138, 40, 127, 34, -36, 72, 173, -29, 8, -278, 228, -137, -66, -31, 45, 186, -7, 46, -166, 177, 5, 100, 65, 33, 2, 43, 131, 11, 0, -24, -35, -51, 189, -238, -92, -1, -58, 91, -285, 43, 20, 198, 66, 192, 281, -114, -34, 3, -18, -267, 99, -93, -121, 11, -186, 183, -99, 118, 4, -112, 26, -67, 30, -114, -132, 56, -236, 34, 8, 114, 74, -7, 83, -27, 123, 93, -116, -44, -11, -54, -65, -17, -128, -76, -78, 122, -114, 36, -46, -58, -19, -22, 156, -15, 30, 71, 319, -37, 48, 191, 16, 200, 209, 37, 284, -129, -73, -79, 200, -119, 7, 193, 384, 68, 20, -22, -70, -54, -164, 78, -107, 95, 195, -77, 130, -88, 44, -184, -81, 99, 82, 122, -124, -445, 137, 63, 45, -90, 32, -114, 132, 89, -30, -18, -169, 30]
5017C0k23K08q7P7J30n5n4j5J17r7k2oo8M43k63L18m26l11L46j98K46P7j65j13
5041a11r6J45Q4q3k5M8L15l46m5p0K27k60K72r7r1L08l27K16K46n29o2K33L5K30
5065B17m32K53O0ml7J76l16k10K52r8L03L7m3k26N7n3n9J55j13j57K00j44K11
5088B9k8p8K10j72kJ1K2P3j62OK28l28P9P3L9k78M56k37J45J0r0N6m2p7J38j89
5114a08K16j29j36J33q2J13L8r8k6k1%J31j98K29l50K21K95N2l14J62p3K6OQ8
5138A75j93o2R6L7l03M12j36J0q4K04l86J30j24K23J0Njm1j7L8j34m3L00j21K1
5163A6R8l31N32k78m3k6p8L12k80j89K17m8K42j46k8J10j16K3j41K51l34J32R6
5186iL13l90O8j75K45OJ52j76k4Mk66L12j10l8J15j87L39kn3M7j20k9J03l60K18
$$ y = [30, -193, 15, -72, 5, 135, 80, 26, 11, 128, 31, 9, 3, -65, 378, 115, 433, 7, -304, 42, -156, 90, 167, 2, -111, -207, -62, 22, -61, -86, -38, 277, -69, -114, -184, 43, -217, 55, -42, -133, 175, -152, 64, 310, -219, -281, -48, -13, 217, -215, 38, 98, 94, 57, 233, -83, -293, -41, -139, 164, 201, 158, -68, -11, -64, -123, 32, -81, -238, -38, -182, 29, 1, -77, 133, -39, -41, -30, -8, 65, -97, -91, 137, -191, -112, -39, 0, -278, 178, -59, 86, 96, 6, 62, 20, -57, 81, -108, 108, -21, -157, -24, -106, 7, 45, -53, -79, -100, -100, 31, -167, 62, -288, -67, 228, 280, -34, 128, 55, 81, 87, 175, -18, -80, 16, 53, -250, 162, 26, 36, -48, 156, -230, -100, -224, -1, 9, 14, 13, -28, -45, -7, -141, -184, 116, -5, 16, 114, -217, 315, 37, -6, -32, -110, 202, -78, -267, -50, -98, 144, -2, -30, 80, -36, -13, -154, 97, -237, -105, -9, 304, -86, -18, -193, 52, 58, 210, 34, 10, 14, -252, 60, -50, -88, 27, -160, 179, 177, 124, 171, 51, 22, 125, -235, -17]
5211a7j00K54Q7k05J58r5O5O3m65L57k12J62j66K7J94J26j4l53J87p4q6r2L42
5234A43M5j47N9m2J92j79p5O7k42K94l11M28l40L32j03l97L18m5n3k4J10k00J37
5257c3J70r8j92J08j96J88K03j8o5j12OR3o7k54K46l7K37j06p6K9l50M35q7o2
5281c8J39k62J72j42K64J25l56N0j3J69j79k07M58j95j15J72jJ98l24m8K05M0
5303A12k5p9p2j4j38J34J33j9k49J73J61l24O1J32K08mk09M5K4n4m2K20k87J82
5327F9r7J64j48j37j06J48L59l80J63M2J80l13P4R8j12L4J00j41%j27L42k77J56
5350I1j28J5J93l95L01J72k56j25L13j44K28l51K67p8J52o6j12j63Op4J10nOJ00
5374E7j91K82k23J42K1nj01l6n4J41q7nr0M7M4Q2K5j44l7m5L60p7L05m71J97k95
$$ y = [-17, -117, 137, 224, 19, 177, 82, 147, 210, -255, 102, -110, 52, -114, -87, 107, 233, 219, -134, 53, -21, -107, -199, 143, 188, 41, 100, 58, 250, 71, -4, 63, -179, 115, -196, 232, -108, 224, 121, -276, 42, -3, -56, -80, 30, -170, -33, 137, 39, -153, -45, -241, -53, 150, 132, 67, -45, -39, 54, -13, -267, -21, -58, 179, 73, -3, 26, -324, 111, 24, -38, 101, -161, 11, -131, 133, 258, -98, -48, -61, 108, -71, -278, 180, -15, -130, 42, 41, 239, -85, -133, 72, 112, 87, 8, -64, -78, -216, -82, 51, 32, -217, -44, 117, -207, -146, -14, 194, 190, -19, 26, 50, -4, -46, 174, -113, 69, -28, 136, -12, -149, -255, -107, 252, -128, 35, 77, 257, -56, 18, 116, 4, 38, 138, -3, -3, -130, 212, -65, 91, -37, -22, 171, -224, 77, 249, -7, -132, 181, 37, 265, -86, 181, 103, 255, 189, 77, -86, -80, -154, -44, -49, -43, 57, -134, 148, -75, 67, 88, 83, -18, -54, -108, 33, -54, -59, -149, -102, -58, 24, 49, -95, -132, -177, 183, 106, 411, -60, 137, -158]
5400a58K65j8j97L7N6P6m5o9j30J28P4j28O2J98k91L58l80L51l45K42j33r7N0
5423i4K18k51J24k4j67o0M92k07l67M53j2J47m57L76j95j85J74N6l5j25L78q9
5445A50Qj90J61J17k18K9k3k6k22J36J99l7J55l51J86L5q7O1j10r%P9o5Q3o2k33
5471b34J70j9Q5j75K25k01P1k4M3J12p0J09Ol01O3P6m9J34%l26L96k60K12j12
5495f9K1J97l56R0J83n6J43m02L74p4oJ11L1Qj67J56L5l73J09J93j42K06m73J64
5519i7OM6J91r5q2p1M01k48m8K20l93mR7J49K1Q0k18N6J24j82L20m06K20J17k31
5544b7l79O37Ol07L41l93n9L4O4K54n3m0j18k13M2J19J82j29R7j24l2J96Nk08
5568a05J63k58J25K22M5L1k37J6P7l43K01J1N9k62O5K53p8J02M9k63O8O8j23p
$$ y = [-158, 107, 89, -108, -71, -15, 61, 16, -53, -183, -55, 19, -109, -47, 151, -140, 218, -162, 189, -156, 86, -47, -144, -94, 124, -127, -3, -27, -194, -254, 238, 31, -336, 117, 105, 252, -205, 171, -24, -209, -35, 21, -14, -139, 239, 150, 158, -32, 129, 246, 28, 57, 34, 8, -214, -78, 121, 84, 239, -112, 74, 109, 22, 83, -27, -36, -36, 43, -22, 61, -1, -234, -64, -83, 2, -173, 52, -149, -78, -102, -59, 53, -17, 92, 98, -203, -140, -64, -113, 21, 21, -305, 91, -169, 43, -69, -48, 149, -207, -117, 66, 10, 153, -249, 125, 51, 45, 156, 187, 195, 28, 184, 219, -154, -45, 148, 6, 212, -261, -97, -91, -45, 146, 51, -31, -102, 299, 51, 3, 223, -170, -174, -77, 72, 93, 173, -45, 11, 135, -47, 273, -133, 87, 204, -27, -406, 231, 237, -70, 271, -122, -181, -147, -83, 171, 118, 78, -40, -253, -211, -92, 90, -39, 58, -66, -98, 98, 103, -105, 58, -200, -75, 147, 192, 223, -14, 2, 79, -264, -63, -52, 7, -255, -190, 63, -15, 87, 136, -127, -59, 9, -114, -121]
5592a21P6j8m4m2K93m9J97k26k09P8m0K40K44n30J88J02l37M52m95M06k89J08
5614a6J31mqj41j10K47l7j90J49q7Q7L12m06J16l48m0K10L0M2J65m4O2k04J46
5638F2k08o6N4J8K08P4j4q5k17L94K1k67J15j28j16J25j40L04k85Q8J92m4L0m7
5662F8j91K92l19p5L8lL64l58L65k9o6j6k52J16N0PJ29m1r5jj5J73m0k40J6R2
5688c1R3lRn5m4K12j31J04j33p8K20j75J4J23k27K35Pj69M8p7Q0m1L9k15J77J43
5714A25k81J87Q5k53R3q6M1p2K49n5N5q7L5O5k4Q3j33J79l50J73K0L0j25R1K47
5739B92k53j08J73j5k4j22OL2j5L9m6J05j87o4N1J93j13J97k24OJ75o8k6k75L37
5764F6j32MK8M1p0K59l50j29L03L4l0j60j35K63J85j88n8n8J96pn7n9P0j00J32
$$ y = [-121, -45, -63, -107, -149, 144, 95, 292, 66, -143, -65, -105, 135, 379, -151, 37, 139, -198, 254, -241, 165, -124, -16, 115, 111, 103, -38, -148, 99, 62, -128, 21, -66, 21, 333, -73, 43, -305, -345, -135, -105, -63, 102, 58, 120, -84, 62, -146, -212, -158, -140, 68, 142, 128, 43, -174, 220, 241, -26, 89, -39, -155, -30, -170, 134, -151, -63, 129, 85, 115, 68, -123, 169, -150, -225, -187, -190, 174, -184, 181, 152, 86, 70, -182, -66, -16, -9, 120, 79, -16, -17, -32, 141, 101, -139, -123, -31, 62, 59, 68, 13, -31, 181, 50, 154, 21, -57, 163, -12, 2, 125, -102, 133, 140, -29, 19, -58, 22, -19, 20, -195, -18, 125, -156, 31, 116, -137, -44, -130, -89, -161, 88, 33, 88, 1, 36, 101, 77, 160, 27, 206, -144, 29, 49, 79, -46, 45, 292, 39, -69, 104, 89, 65, -57, -51, -19, -34, 5, -41, 64, -123, -187, -136, 57, -56, 141, -83, -77, 98, 30, 4, -271, 66, -66, -62, -34, 7, -63, 196, -154, -283, 20, 54, 24, -136, -271, -8, 177, -11, -69, -127, 69, 62, 5, -54, 16, -84, 48]
5789D8P8P4l52J45j6J60j29O2J40M2l81q1J41K20J6j66o6Nj03k8K52J4k14P3q
5814g4q7J17J62j05n1P1j68J2o1l1M06o2r6j31q2L18N2l95K0J08J09j32K32j08
5838B4J33k15J69k57L49o1j20%l2K4K01L8q6j9k11K83l00J26O3j26m0K6P3l13
5862b71L23j2J9M6j87k8j1J84j07j15M59k91q8K5j0M3m3m2J35j36J61N8j62J94
5886A44j9k89L07j48O1j56J65Nj35L0J7J0L4J49j89K2N4k36Q8oOM1J51J01p7j95
5912f5j94L47K28k43q7p8L8N8m6P4k50K08RJ54k22j00J68p5J36k21K79k82j58
5935c22n0M12j94r5L23j27N7O8k63J21n4J82j1lk2q4m5K42r6j22J93j47K76k34
5959Ej65L65l64K35k65M01j01k36M8J06j12R0J29k87J43K14j13j46k09kL77j46
$$ y = [48, 126, 200, -152, -7, -23, 137, 8, 70, 210, 252, -129, -210, -69, 151, 167, 1, -65, -60, -163, -191, 61, 75, -139, -66, -74, -161, -44, 118, 13, -38, 33, -135, -123, -184, -215, 191, 129, 33, -98, -180, 138, 190, -205, -185, -77, 32, -100, 132, 24, 157, -58, 111, -146, 203, 142, 22, 22, -10, 14, 215, 253, 167, 148, -63, 220, -80, 46, 109, -17, -57, -31, 42, -271, 52, 40, 59, 105, -82, -110, -121, 63, -44, -159, 300, 9, -79, -54, -64, -21, -64, -106, 29, -107, 54, 112, -50, 144, 125, -164, 143, -5, 56, -100, 65, 70, -65, -35, -18, -8, 26, 175, -14, 8, 62, -174, -86, -92, -86, -45, 106, 207, 130, -65, -259, 88, 316, 73, -14, -92, -54, 4, -42, 32, -218, -10, -1, 153, -69, -169, -1, -76, 60, -161, 118, -164, -322, -372, 40, -154, -249, 74, -53, 4, 72, -191, -70, -124, 58, 47, 44, 22, -62, -107, 135, 39, -83, 110, -37, 239, 5, -160, 205, -159, 76, -189, 212, 111, -125, -77, 29, -83, 7, 136, -151, -8, 206, 93, -53, -262, -264, 113, -33]
5981c3K5O3J07q9o2J17ok31r2J48L79j30N2n03J74J71n5j86K79R0m08J04O4Q2
6005F0m1j58J09O2p9pJ84k66N5N29n82J21J62j38q0J32o5J17j37L4j52K34l38
6028b44L84k30J51k29K68j70N9R5k0J59J8l48J35M5J87j53m7J38k68K63k1j96
6050b4R8l8L7n8l4q4N6m1q0NJ26M2N9rq7o2JJ87k1J24j40j36j17K85k40K10J12
6077A71j06J0M3n9k21M7J73J5o4p3L6J38j40M7j22l8L63r8O4j60j10L3R4M2k23
6102a38L77j41J21m60K72L5K0J44j60j04Rj84LJ99j01KM2N1j06J05j54K22j66
6125a12J23L44K2o72K27j11J63jKj97J18P2l32L48J3J8j60R3J65j13j99J27j52
6148b14K08j78K58L8l72M48j9k30j07J55K90m37L96l02J17p0j24J27k9J22l8K1
$$ y = [-33, -8, 55, 162, 73, 11, 128, 122, -109, -201, -53, 326, 196, 248, -255, -81, 90, 35, -151, 128, 218, -190, -86, -22, 60, 19, -139, -30, 32, -47, -54, 130, -136, -81, 448, -134, -13, 149, 11, -69, 63, -2, 115, -22, 12, -140, 94, -244, 140, -90, 61, -168, 100, -70, -11, 84, 64, 223, 241, -107, 28, 73, 260, 107, 60, 198, -70, 193, 172, -24, 74, 36, 73, 15, -19, -103, -47, -88, -168, -163, -37, 5, 64, 55, -32, -94, -93, 94, 73, 197, 57, -79, -196, 89, -151, 59, 171, 65, 75, 118, 59, -162, -115, 58, 73, 9, -64, -28, 110, -30, 17, -105, -143, 220, 122, 186, 26, -84, -51, 43, 85, -138, 239, 98, 219, -241, 31, 66, 86, 230, 70, -34, -25, -209, -206, -7, -108, -106, -64, -13, -119, -14, -168, 54, -112, 11, 355, 377, -295, -68, -179, -16, -17, -15, -212, -94, -22, -354, -6, 7, 25, -135, -42, 123, 10, -189, -62, -214, -6, -184, 74, 112, -260, 188, 169, -61, -168, -13, 277, -160, 236, -66, 51, -19, -143, -16, -45, 77, 39, 60]
6170F0j28q5J33oM3R3N5p7K03j53mP7l25j1J10J7K9j22q3L15j44rJ9m3j8L29j76
6197I9k2n3O3K5lm0l10L80%J1k18J15J86l34J03j52J88m2p9l5O2p9J24K81m69
6222a99J34j26K91p0Rj7J86j06l38J32l3J84q8J7L4J55j80P2N0J3j67J57O5k24
6246d9ok39M36L3p7O3j61k06J84k6K57k37l5j11J98R3j93J1p0J0j9J68j85L5O6
6271f0J66kj06K1L9k15J36M9M8o6oJ8J09k75M8K38l9k70L38j54k59K65J58o7j15
6296aJ23p2J22j88J2j3k0K14j50Qj82K21M5j35n3j03O8J22J03j13q9L39m44K72
6320H6J2p2J29r8L06m80P0o7j80J52J60o2j26J05k1J08j9Q4M3p8R9j28j06K82
6344A99l27L98k90k94M13K93m86O2J56q5n2R6J2m5K34l73M5J81k4k16m5J93k31
$$ y = [60, -68, -153, -20, -26, 17, 110, 165, 88, 291, 138, 134, 211, -114, -125, -15, 2, 31, -91, -174, 141, -3, -12, 7, -36, -54, 275, 99, 77, 24, 87, 112, 109, 69, -241, 139, 139, 150, -68, 47, 233, -101, 2, -150, 38, -4, -83, -118, -56, -135, -11, 270, -199, -65, -191, 100, 30, 39, 22, 208, 102, -236, -104, -137, 47, -41, -24, 10, 165, -15, 57, 107, 120, -47, 110, 175, -49, -55, -294, 142, 175, 98, 161, 0, -206, -22, -48, 209, -28, -63, -174, 24, 117, -76, -65, -135, -125, -144, 24, -161, -126, -60, 106, 104, -2, 19, 58, -157, -21, 28, 76, 10, 4, 22, 131, -144, -96, 142, 103, -167, 171, 17, -242, 23, 181, 114, -1, 122, 50, 172, -16, -4, -17, -37, 177, 27, 35, -147, 74, 119, -16, -69, -172, -104, 18, 121, 8, -81, 258, -186, 86, 98, 26, 155, 57, 363, -117, -47, -114, -294, -142, 18, -44, -170, -65, -86, 22, 3, 87, 130, 52, 151, 23, -83, 199, -128, 270, -20, -314, 99, 392, -94, -32, 124, 39, -13, 83, 95, 50, 284, -89, -44, 137, 113, -103, -148, 45, -186]
6367a86p7K03O7Q2k20Q1K99j57l7K3j57J08j7l5j16K40j53O1l0P1l51J3M79k40
6391d9K29k20L13k61k89K57j00K07rn6K25m27K17r4J25j1J65m06K13p0o4R6O3
6414E4J00k04p5N6J70k05J9N8k01K53j38R6j20K85o2k78K03N3L5k18K08k67J67
6437a1J52L3j22R0j51o9MN2o4q7L97j88l5P6j5p7j52J89J50k89K81q8k03k5M67
6462C15j38j57p8K3J7j91N4K21j07N6J59l88J55J17q6p9p5J99k8J19k2QO1l92
6486b37K76k0k63K89L6j41j79K90oo7K33m14K05m5n7K46o4m8j6L3L2j79P4J32
6510A10o4j30j48M04j02j41J58J2j32M4o2j52J97p8K72m14J58K35n7l08K77l8
6532D1p4n9o9K02j45J09m8l37N55l5p9p9r9J36qN3k03J67l1j63K19m9Q2j32K74
$$ y = [-186, -263, -60, 7, 89, -131, -50, 249, 92, 55, 78, -79, 29, 12, -23, -139, 101, -52, 9, -21, 50, -301, -288, 191, -49, 180, -40, 273, 12, -277, -20, -120, 87, 78, 22, 247, -180, 37, -57, 68, 57, 222, -184, 29, -41, -105, -9, 54, 154, -50, -125, -69, 101, -104, -85, -27, -228, 25, -113, -17, -137, 148, 86, -192, 11, 64, 99, -119, 89, -178, -11, 141, 174, 52, 142, -9, -78, -74, -22, -86, -173, 224, 36, 1, 77, 62, -15, -167, 22, 172, -117, 164, 76, -127, -152, 315, 177, 20, -58, -35, -18, -209, -155, 66, -41, 15, 174, -214, -59, 58, -28, -107, -182, 17, -11, 108, 86, 94, 155, -237, 39, 19, -244, 45, 81, -60, -239, 51, 45, -22, 211, -203, 2, -43, -100, 146, 82, 34, 18, 51, 83, -96, -22, 110, 46, -84, -232, 172, 70, -71, 87, 99, -33, 11, -51, -203, -6, -84, 188, -226, -68, 167, 110, -198, 79, 41, -33, -92, -161, 41, -104, 5, -43, -380, 175, 140, 61, -18, -117, 19, 11, 64, -139, 28, -3, -166, 53, 4, 86, -46, 228]
6557B28m58L37j67l35L32n2J62K5N1j08n7J65r3l46L32K17j40K11l57j24L27m34
6579b84L50o9J08p6L4J38k16J16j35N0R0M4j72K93k36K03m02N1Q3J48n9k54L31
6602A36j59J1J88k49O4r9J42o0r6J17R1P8j59n0J54k01N0M2m1J28J11l3j58M51
6626D58n10J09P3k17J95k4k01J41O8o9k06L83k17n7K65j48O3L9J13l27l1K35j
6649A34J32l62J02R3l88N07k88J23J97m18k4J91J5l20L34K6J56k57nk7K03k20
6671i6J18m6J61o4J1J2P1l25J62k30K78j85M8K26j70J85k48Q2J31P0p1l61K34
6694gJ38n2P6k20J39N9J2nk01j5J67L1j7j72LK66k06j85m6P6k0R9j48J27M8j86
6720b39M43L7k49O7J13j02k35N0K21Q2n7k44j10L99j92l3J43k53K67j14j01j76
$$ y = [228, -230, 107, -60, -395, -63, -115, 47, 72, 123, 15, -42, 123, 30, -316, 16, 233, 93, 304, -53, -177, 150, -284, 66, -3, 105, 29, 63, 201, -15, 101, -34, 16, 106, 150, -22, 271, 35, 238, -164, -113, -30, 118, 59, -195, 136, -23, -12, 176, -73, -9, -108, 34, -26, -122, -5, 86, 164, 5, -45, 109, -92, -42, 0, -41, 87, 198, 165, 7, 458, -52, 57, 130, -87, 108, 84, -117, 24, 92, 23, -183, 200, -17, -74, 191, 43, 106, 145, 258, -69, -100, 135, 134, 266, -96, 6, 99, -289, 218, -70, 53, 250, -168, -192, -1, 14, -306, 28, 54, 210, -47, -52, -79, 124, -96, 22, -24, 137, 73, 84, 96, 167, -158, 4, -226, 52, -133, -85, 141, -29, 156, -92, -10, 121, 191, 120, -241, -7, 131, 79, 155, -65, 74, 133, 145, 140, -61, -76, 91, 122, 105, -67, -64, 202, -4, -189, -235, -159, -179, -80, -228, -101, -53, -239, 204, 241, -8, 59, 172, 70, -165, -115, 106, 188, 131, -113, -223, 176, -16, -49, 94, -159, 108, -6, -107, -283]
6742b83J93J91k98K11k06K37r0j55l0L15k61K73j27P9Nj02K13l50K97o7rK8o2
6765Bo5K79l17J40J93k59j27K96j35j0j16N1p4K53j31O8j13Q7J55k02L70l45R2
6788I2k83K36oj32p7J92N5m8j6j67J79k9q0r0J99j85J64j02J39l1m5q2J8j61M64
6813B04j93j1k7j17L11j57j97m4J84o5l0N3nJ10J44r8k04Q5j4O8R2j66J37n8j80
6838a78N6R2L76k18j84l2LJ03k03K70l14q7K99J28J33j90N8k09k10L59o5k18K12
6861a9J6j33j04M46l56j4J31r9O3J86q6j70J29pK23k22m4J25L9o4m4L8k00o4M02
6886A72k20K05q7j46lQ2K9K7J23l14M1O6J63q6j27J48j10k5j73J38J96j79Q2J21
6910A23o1K4j66O1J28j0mk02N8J91k7m5R7j35J0k1Jm9j5R1k8j19M6M33m33j28
$$ y = [-283, -90, 101, -197, 14, -192, 45, -45, -200, -230, 85, -176, 97, -30, 49, 54, -48, 165, -185, 112, 45, 36, 64, 2, -63, 216, -101, 39, 232, -27, -154, 142, 7, -3, -119, -68, -142, 111, -20, 48, -65, 22, 177, -25, 345, 0, 92, -191, 45, 39, -93, -170, 22, 77, 29, 13, -154, 25, -4, -84, -174, 25, -160, 4, -98, 41, 10, -35, -117, -99, -260, 204, 11, 0, -27, -144, 167, 10, -187, -231, -47, -112, -142, -89, -94, 16, 160, 62, -142, -57, -71, -3, 89, -77, 60, 2, -178, -122, -30, 346, 128, -56, -88, -85, 18, -185, 85, -229, -316, -17, 111, 244, 54, 112, -97, -307, 52, -13, -231, -19, -3, -136, -240, 206, -150, -164, -33, -132, -69, 117, 31, -139, -10, -17, 206, -16, -60, 65, 104, 40, -4, 34, -166, -230, 172, -48, 157, 70, -76, -79, 3, 32, 59, 182, -132, -91, -25, 138, 52, -75, 73, -37, -62, -235, -97, 99, -80, 2, 123, 62, 86, -80, -19, 109, 99, 95, -107, -49, 142, 115, 70, 167, 32, 42, 21, 22, -27, -42, 49, 21, -98, -52, 381, -52, -180]
6936a80J63k1N9J99j12J49k47J31l29M3J53p6O6Q2q0k17K77k66K37N1q5j02J74
6959F9j99j17L37l10K51j8j37J59j95J23j08K81r2k06J24o7J64j90K42k68J29
6980b8L32l98R5j01J12r2o0K13j81J40j54P0J57k3l00L30l08J92LJ75j01j81l9
7003a47K57k42J5q7O09l48j85J28N9r0j02K65k84K31j37K11j12j08J23J30l44
7024a58O8p4J57l1L7j91J20MK12l40J82L7q1N3o3k4J29J75m39J51N4j72L16j2
7048A10k87K65j28q3j14L54r2j31J54l8k60j19M96J16j48m1J17k90J34N6n2r7
7070g8o5OK40o6Q0k83m6K06j87K01J52O2m03K55l33K17K64j44m7k0k00K52k61
7093a98K22M0n0J78j75J21r1j6k5Q2lj57j84K10L3J17O2l6%r2k0K00m46J69Q5
$$ y = [-180, -17, -38, 21, 220, 108, 257, 10, 141, -188, -145, 8, -68, -2, 80, 0, -217, 60, -206, 31, 82, -3, -105, 69, -130, -247, 90, -220, 31, 13, -124, 35, -160, -37, -145, 136, 44, -162, -38, -105, 59, -131, 111, -157, -28, 304, -94, 1, -100, 12, -80, -140, 73, -108, 32, -122, -52, 105, 82, -218, 112, -196, -4, -1, 174, 73, -108, -147, 110, -132, -117, -204, 405, 57, -128, 0, 59, -31, -133, 132, -152, 79, -58, 153, 41, -67, 56, 186, -158, -90, -164, -7, -38, -1, -192, -72, -68, 144, -196, -14, 23, -58, -5, -68, -92, 37, 212, -227, -76, -22, -194, 122, 110, -177, 88, -40, -123, -237, 117, 25, -106, 48, 10, -250, -369, 127, 243, 95, 54, 171, -119, 15, 71, 19, -78, -143, -137, 103, 37, 117, -166, -212, -6, -193, 8, 160, 222, -181, 74, -259, -42, 222, 78, 31, 11, -189, 63, -198, 24, 64, 14, 192, 17, 138, 47, 31, 6, 88, 85, -72, -256, -46, -13, 104, 166, 130, 130, 38, 18, 218, -228, -59, 26]
7118B6O7j38j82L87k02l3n1o6L21mk98J11K10l25J55KK03l72L9J46L1o6J01j16
7142e4N9k01J70K89k74j74K12N1j52K51k03j28P1J03j06J46k70K3L86j90K72k75
7164Fk16K57J87m20L99M2k07O7j6l6O0KO7j59r5R9Jm7N4J2j39P9j40J59j84M04
7190B36l08j07J32q6M02l24m5K17k90K45k21K46r0M7L2j21L25n21K18l2R3Q6n
7213A29j81J31k96K45l17J00L41m9R2l65K49L8p0m2M0R7Q9j95k30K13n8Q0j64
7236a23nL14j33RPJ44k01K37j96k93K22N7n8n3M9l6K26J11l82R3q3l6K39J9k0
7261A08r8M1j69j02J61J49l83K50K42j82j20J61q6K0j03J13q2M7J02J4o2L7p5
7284a7K94m28k6K62j86J67r1L09o35K10J84j51J86K28j44l49P4K80j9k12m1J28
$$ y = [26, 93, -45, -227, 160, -42, -75, -126, -192, 129, 125, -173, -62, 148, -177, -22, -20, 183, -189, -150, -4, 27, -39, 62, -54, 5, -196, -26, 263, -11, -185, 27, 78, -74, 177, -26, -154, -83, 20, -86, 60, -210, -187, 199, 9, 281, 6, -210, 47, 234, -186, 213, 255, 48, 115, 99, 63, 123, 125, 192, 33, -62, 37, 38, -9, 45, 57, -82, -3, -143, 16, -168, 236, -72, -179, -47, -133, 269, -55, -100, 117, -173, 72, -149, 97, 7, 54, 86, -35, 290, -231, -13, -45, 48, 134, 129, -52, 79, -217, 28, -289, -189, 152, 103, 195, -170, 79, 117, 47, 5, 45, 142, 231, 36, -194, 19, -39, 41, -123, -128, 186, 53, 62, 69, 213, 12, 249, 53, -240, -18, 39, -19, -72, -23, -59, 167, 278, -104, -11, -94, -130, 109, 128, 108, 10, 51, -118, -220, -59, 90, -293, -43, 199, 17, -103, 58, -28, -8, -111, 2, -80, -33, 69, 83, 21, 58, -17, 277, -151, -177, 85, -101, 66, -25, 284, -351, -141, 43, -108, 78, 306, 162, -187, -113, 167, 148, -64, -105, 23]
7306B3o9Q9k81L41p0K5nJ2j99J23j34R3N1N8m9j60J65j28J0M0K14M5l11o2J07
7331g2k3J42k06J39P3J22l19K66m1J01J9m3j29r7j04o9K21r5J1L31n4j05k09l8
7355a79K89j68K14k14OJ30k32L16j68j13k1J43J0J7L00k6l07J1L72j62m2l0J25
7378B71m73J02j9J89K15m54L75j62l51K56O0j0k90K49M0j47J01J12O5k00K68l85
7400a88J41K88k59J75l78M12k72K02k94L07j49LO4j32K21k66J7J23j68L2J88k96
7422b29K52k27J20P0r1L2j9K88nL9k47M4L6m3o6K4n4J98p9k9o5j99L34j03l1j36
7448a86K53O3j18j25J31N0om4R3J1k8O6l01q5K24R5o7rj0m7J46o7j21J88j81P1
7474do0J83j49J79n5j62K14p3Q0k56K98l82J43O1j02PK9k6p6J73o9Q7j52P0Q7
$$ y = [23, -46, 43, -238, 103, 33, 58, 53, 65, -134, -11, -145, -52, -1, 57, 8, -152, 13, -115, -105, -65, 149, 194, -117, -179, -72, -95, 47, -159, -20, 53, 175, -144, 122, 81, 182, 201, 158, 29, -68, -172, -241, -20, -115, -104, 227, 173, 68, -141, -179, 110, -58, 156, -58, -52, 78, -154, 162, -6, -119, -140, 3, 13, 30, 330, 304, -3, 8, 380, 218, 176, 146, 271, -202, -100, -119, 70, 285, -169, 206, 44, -307, -51, 9, -1, -291, -42, -2, -149, -48, 64, 129, -71, 197, -188, -47, 241, -18, 157, -221, 191, -81, 121, -173, 134, -15, -12, 52, -80, 141, -125, -108, 15, -153, -121, 67, -229, 23, -204, -84, -14, -105, -73, -92, 196, 191, 230, -17, 27, 63, 20, -46, -22, -76, 122, 43, 14, -51, -250, 84, -19, -50, -186, 67, 130, 12, -113, 18, 68, 62, 18, 111, 122, 94, 160, -141, -226, -2, 93, 26, 17, 7, -40, 106, 39, -82, 106, -75, -4, -64, 119, -30, 149, 94, -68, 146, 73, 153, -103, 195, -187, -44, 17, -85, -78, -49, -75, -151, 22, -47, 40, -112, -42, 45]
7499D5j30k9K11M2k52J55j48L21l04j7K10j78O3J54l62J54J26l51M21j2k17m1
7521a39R1q1j52M08Q6k17J15R7m43J88K3R9N5J21l67K28n9Q4j27K27l08o4r8L73
7545A40L7j68Q1l33K75Q0j47o4N7p0J97q1l9J28k64k6M7P7M02j78p9jNj60N1l1
7571f4J51n9m3j47K31j98N4lP3J68q0k55K18l5K4q9J26rj89M3j15N1K58o0k11
7596a60K49j75LK90m11M74k46J11j37j8k38L81j70j43J26K16k48K19j47j88J02
7617a10R2l5J54p5O1R7j32J14j02k17J79K34m21J74j71O4K8J05J89j93p9K04k25
7640f5M9J34l9k61K03K22p1k83LK44j29J34k90J54l4o4nO9K40p8j23J2L48o08
7664b38M91l18L5K1K8j51O6K07m2K2M4l27J6k01K86O4K7j57J7J26j72K10%r3O4
$$ y = [45, -85, -114, 97, 139, -113, 42, -106, 215, -89, -106, 104, -74, -11, 143, -219, -65, 61, -290, 131, 119, -98, -139, -48, -129, -281, 127, 213, -4, 111, 208, -235, -47, -24, 75, 130, 251, -116, 112, 53, 137, 10, 237, -71, -135, -233, 140, 177, 9, 90, -243, 32, 112, -35, -99, -42, -112, 85, 4, -35, 93, -171, -197, -150, -73, 329, 151, 72, 71, 76, -84, -33, -64, 87, 28, -15, -162, 69, -129, -75, -78, -5, 163, 83, -172, 46, 11, 35, -54, 72, 63, -126, -83, -198, -147, 111, 51, -160, 89, -86, -83, 207, -204, 270, 24, 135, -2, -20, -258, 123, -47, -190, -64, 152, -96, 123, -24, -212, -110, -18, -53, 101, 26, 87, 184, 52, 166, 64, -153, 26, 260, -161, 13, -158, -94, -66, 39, 228, 35, -44, 160, -65, -16, 118, 79, -182, 21, 243, 172, -111, -108, 136, 7, 141, -149, 5, -29, -93, -98, -29, 211, 133, 10, 22, 370, -238, 253, -65, -30, -9, 19, -132, -66, 141, 99, 121, 165, -162, -146, -347, -61, 3, 30, -127, -110, 16, -156, 54, 54, -39, 25]
7689B5j64J13J19j37R5J11j58j34L02j01j98K26k32Np2J05J68p4q3J80m5j35J74
7712I0o1k0R0l04J95M5K0o5j50M33k56r4j17J94Q8P5o3k87N9k0J88j35L6J80j83
7737f2l0Q2J99j75mo9j69K34Q9k1l42K50j9P6M8J98k65M8k4Q0j96K16l13L31k29
7762f7K5J35j85J32o7K09k02j88J72K06m02K33o1K24Q0k23J20q0j87n6K20Oj60
7785a16O1N6j36L2J54j22N5o8R5j22K28r7K93k85j01m4J9j07J25k9J87q2j34P6
7809f2K9n8N3j27NK13k82K56j28J05n4j28K86p3O2R1k28l0L7J41k9k55l0L11j56
7834e1m1J71k75J09N1q9K34k92o1L07j33M5K53k05Q6k4o4M7N8k06J73j06K62k80
7858c1J44J22j92J4j77K24L9j41P2q2r5J79O2l50L5J09J63j88k4k41L99J06l36
$$ y = [25, -139, -26, 93, -44, 51, 162, 4, -130, 172, 71, -127, 99, -133, -128, -200, -95, 73, -1, -84, 96, 51, -84, 90, 29, 9, 99, -205, -10, 35, 55, -10, -160, 273, 17, -77, -194, 0, 88, 163, 100, -187, -128, -148, 40, -95, -59, 121, -62, -92, -10, 189, 14, 10, -59, -228, 6, 95, 74, -268, -18, -37, 39, 87, 285, 20, 68, 44, 124, -72, 144, -169, 162, -67, -42, 93, -92, 40, -27, 182, -20, -208, -36, 170, -232, 1, -60, 164, 244, 21, 141, 61, -126, -182, 38, 44, -116, -55, 1, -135, -103, 51, -71, -16, -84, 11, -111, 117, 20, 313, 28, -73, -117, -98, -205, -80, -109, 78, -4, -138, -62, -33, -91, -38, -165, -160, 53, -229, 27, -101, 4, -50, -178, 108, 35, 97, 188, -40, -70, -33, 108, 79, -176, -206, 105, -51, -92, 79, -196, -87, -36, -125, 109, -183, -244, 63, -70, -25, 228, 23, 109, 85, 21, 68, 126, -80, 93, -13, 249, -31, 113, 235, 43, 57, -120, 104, 143, 2, 74, -8, -103, 76, 138, -212, -177, -68, 95, -93, -117, -358, 41, 147, -189]
7881a89K36j07K6J46l43K70M1l5pj0K2l3P5K0J34j42j08q6r4K57l9%P8j39k65
7906b92M35Q0l06K09j22j23M4J97k45J3J52n6O1O1j58p4Q0J1j01J78Lj33k3J51
7930D2m6L72m16J42p1l4J67j10j02Q2N7j65j95L66k23j5K90m32K80K18j77j50
7952a20J61j91L20k63K84m9l46J80N7j62M5r6M64m29P7J30M6J0j66K5k45K92r3
7975f9K64l09L08N1k3n38K15K47j44J6l7l1P4n5M1P2L1K8m62K25J77k23L85j99
7999D4R9l17L25j43k36J32j01J42J08L3m4k97M93j30j46J14q8J64o8J69m22J31
8021c8K7K0j73P4J86l68L24k4r5J75j90J31k89J2L50k26R0j12K2K73k41k5J07
8044A0J22Q6l07q1N03m18J8N9P3k7k0q8LQ6L01l92q7L4J48J64k92l6L36k05N1
$$ y = [-189, 47, -60, -34, 112, -231, 39, 80, 45, 38, 28, 50, 17, 92, 112, 246, 104, -4, -90, -184, 73, 34, 34, 112, -27, -292, 143, 223, -83, 126, 4, -119, -75, 122, -123, -110, 42, -14, 47, 108, -50, -124, -44, -33, -134, 44, 47, -86, -109, 42, -4, 368, -48, 94, 23, -11, 156, 46, -56, 26, 83, -82, -277, 89, -134, -149, 141, -291, -11, 207, 30, -120, 41, -150, 170, -93, 191, 142, -204, -24, 33, -129, -84, -180, 284, -145, -68, 62, 108, 118, -48, -23, -268, 24, -69, 195, -114, 194, 245, 222, -316, -101, 146, 2, 18, -19, -50, 24, -31, 10, 82, 113, 141, -321, -96, 81, -142, 243, 44, 143, -174, 151, 8, -228, -96, -197, -55, 53, 86, 42, -255, 238, 108, -38, 76, -12, 152, 84, 253, -169, -38, -11, 9, -164, -90, 96, -272, 52, 28, -67, 108, -82, 49, -240, -228, 122, -104, -14, -126, -104, 169, -72, -97, 10, 132, 218, -89, -170, 333, -85, -67, -8, 65, 38, 18, -70, -67, 19, 320, -72, -159, -125, 23, 187, -105, -141, 195, -10, 41]
8069D1K38K2k97K76l79N2K32m5Oj98J22K44l59j27J98Jj57q6K22k4k33R3J31j18
8093a45J58R8j46Q0k37O2J96k42K91l07N0R4J41l91L50J26k67J05M4k6j43j8P4
8116e3M7L1J14p9lJ25j53L6Pk21L29r5k9q2P7M1m3p3J13j31P1j1k2J12k76M4Q5
8143c9k21K99k7Pj0m1p9K50k85J73j36L4K67l59J73P6k6j39M1J06L7j6j68m8N8
8168g3K7p5J75p1j39Q6J63j45j93K68o9N0j74J31K54m3J58k10k18k29J93O1R4
$$ y = [41, 279, 301, 4, 280, -99, -47, 185, 140, 146, -52, 70, 314, -45, -172, 26, 27, -130, -216, 6, -18, -251, -158, -27, -145, 13, 111, -35, 45, -192, -130, 66, -176, 115, -192, -142, -48, 93, -298, 52, 178, -89, 16, 60, 34, -109, -127, -53, -6, 25, 139, 60, 57, 182, 29, 65, 72, -149, 180, 85, 56, -26, 51, 92, 49, -24, 89, -42, 29, 18, -4, 108, -168, -124, -39, -260, 39, 12, 19, 9, -32, -111, 139, -146, 27, -109, -75, 192, -167, 6, 82, 56, -83, -42, 64, 101, 85, -83, -131, -73, -46, -121, 54, -17, -156, -70, 93, -52, -245, 23, -46, 4, -170, -39, 215, 172, 330, 120, -98, -327, -134, -73, 21]
8191B1
$$ Imaginary data points
##PAGE= N=2
##DATA TABLE= (X++(I..I)), XYDATA
0@%%%%%%%%%%%%%%qJ6j6J6j7K5l2L8m6N4o2P2q8J02j16J34j53J75j99K24k54K86
36A51l24L64m06M56n08N66o31P00p74Q56r48J046j152J268j397J540j697J870
54I80k062K278k522K799l118L488l922M444n084N889o941Q382j0496J3955k0934
69a2864O2892j15162J8485J43720j28657l8686Q9962j0265l1523L4229k7749N4013
81C8395n084o1560L0884M3321p5142r901N2807l2429K519N217P50L5156j4404
94A0529l1555M3992J0403p4590L9934J3433m7740J8483J9016k3951J9572K0773
106A8299l3210L4007l159k5596K3609j7663k1834L3650j1662m6935P3112k201
118B0417o2926O0964K9429o7970J3051N0894o0494j172L0476k6360n49J9542n930
$$ y = [0, 0, 0, 0, 0, 0, 0, 0, 0, 0, 0, 0, 0, 0, 0, -8, 8, -8, 8, -9, 16, -16, 22, -24, 30, -32, 40, -48, 54, -62, 72, -81, 94, -105, 119, -135, 151, -173, 191, -215, 241, -267, 299, -332, 368, -406, 450, -498, 548, -604, 664, -733, 807, -890, 980, -1082, 1196, -1326, 1473, -1645, 1843, -2079, 2365, -2719, 3170, -3771, 4611, -5885, 8070, -12864, 50028, -65134, -46649, 97071, -31586, -70272, 19690, 9425, -22098, 12131, -15618, 38395, 33311, -28249, 2635, 45956, -29186, -39087, 13720, -18709, -16190, -10973, -10223, 24933, 10529, -21026, 22966, 33369, -41221, -1287, 12146, -35594, -17111, 1905, -22046, -2474, 18299, -14911, 19096, 15937, -9659, 13950, -3713, -25547, 8103, -3559, -50494, 22618, 20417, -42509, 18455, 47884, -20086, -7035, 43859, -16635, -17807, 12669, -13691, -14240, 5302, -628]
131f28l653K4905j3086L349p64n127P112k0667k233J4195l566k2445L1246M719
145A3357j9230K0658l388o562P191o947k5335K9489m370l7296L0237J7691k2013
158f518o136L1271m482j2353q725Q287J7810m0010o481L9275m986m4713L6848
171i13L0645m1769L317K5003n125k2507O887K32J565o087j1641K3054L17q629
185e651K276J6575o184q375P70O26O475k3757O960J7268j1018j1579K6072M294
199A4752k4767K1688J021j3965K98O525j1684M00P508r425J1680k553K625N039
213I142j902l364M796l997j3062J5300j1184n600J2777j084p585J2291O016j7227
227d683J4721k252j0671J736J866o194j652O324n940J0791n663J591Q382n766
$$ y = [-628, -4281, 20624, 7538, 10887, 10123, 4996, 12108, -8559, -10792, 3403, -163, -22608, 8638, 13357, -5873, 14785, 11397, 4835, 12026, 5079, -20256, 9233, 4863, -32433, -2196, 15495, -6518, -12654, 18617, 14135, 1782, -6943, 1344, 19154, -20856, -27337, 11938, 6952, -37761, -913, 29732, -12037, -8720, 16283, 11158, -11349, -4462, -4230, -2665, -8752, -20393, 2661, 2978, -5651, -3375, 13200, 7016, -1359, -589, 37, 6512, -17245, -10285, 6983, -4035, -15614, 10458, 14752, -10015, 11673, 12694, -1271, -973, 5552, -6132, -5732, 1776, -7649, 4031, 1478, 4103, 9142, 7240, 3876, 8672, 4675, -8387, 6913, -4271, -9871, 2906, 1822, -5763, 6528, 12544, -4683, 10038, 7786, -2885, -1149, 717, -5477, -7129, -805, -6745, 4046, -1617, -26, 8356, 2590]
241B590m264L669J10j3371J0520n661k572Q545l291l4P332K776j3083J2949k608
256C607j0819L327J354k336m423Q063k345N779l855L014O739q393l17K556l86
271A565j0706Q877j041m457O871m87K499P6M217o493M511k331n639L652l290J281
287h95k678O486k436L585j38M5M372p552K272j478l41o561M747Q89m188O018k92
304A855K534l018M088l795l09q19m088L036m538L193k600M994q74N86K358k280
320C23K803o035L270l383j61k197K007J423l471O228j273K104k456L307j987l188
336b686J617k965K661m769M970m57Q45R39J494K439m817M133m183J665k521o59
352b294J076M8K119k944O599k869J749p97L52M27l843J115k688M598n844L090
$$ y = [2590, -1674, 1995, 2105, -11266, -746, -6407, -8979, -434, -3725, -3759, 3573, 6349, -6734, 6215, 3607, -7212, -3885, -2531, -4867, -9290, -1227, -3572, 2207, -1648, 1366, 8105, -288, -605, 1951, 1565, -9141, -264, -1305, -5762, 1109, 622, 3121, 3197, 7414, 921, 5432, 3101, -2538, 1114, -2176, -895, -3573, 2913, 477, 4062, 3924, 3969, 8341, 789, 3061, 1583, 1242, -5319, -572, 317, -3871, 2147, 1855, 4389, 1371, 5459, 1664, 1355, 536, -3552, -516, -5054, -1861, -4461, 533, -341, 245, 2603, 323, 3126, -2909, 361, -3022, -3183, -5380, -3373, -1950, -5421, 807, -466, 1638, -818, 2489, 502, -2686, -1069, -4034, -1373, -6142, -1172, -1629, -784, 155, 1649, 4088, -729, 3404, -779, 886, -1635, -2294, -1218, -1170, 949, -1995, 4604, 1735, 3484, 2687, 3039, 3466, -377, 738, -1950, 2648, -3196, -106]
368a06L133q65k37K54L903n241J940l673K676j874l404K886R42R72m543P258j285
385B736j253r81n0J736n144N50j064M278n535K218M713l579J266o2K683n432L656
402G36l362j093K581j979n1n53N896m468K182O45J015m85m357L355j111M55n314
419e908N515J856l529L54L188M487p989K167K851j86o538J171O591n218l28P79
435g37O268l943j124K144J748j323o530O232r37k378k597N851m36l503M748k161
451A322J384q03P68m558L126J261p250L603K847l58o021O794J081l618L41o35
467g16L502m239j224j930P024l445o555Q267L694n733n360J2481l097q416K331
482c416O035l147p035O753R60L28m512L529L982l603k252J112N641p741j76L821
$$ y = [-106, 3027, 2162, 1925, 2179, 6082, 841, 2781, -892, 1784, -90, -3494, -608, 334, 1306, -3237, 4021, 2736, 1483, 502, 452, 2188, -2956, -2406, -3470, 808, -4727, -2509, 2204, -1375, -109, -171, 2512, -2920, 736, -2626, -3719, -1138, -3117, -3168, -3721, 2175, -2293, -111, 534, 1549, 1064, -3293, 62, -1049, -594, -5908, -393, 1463, -2066, -1712, 1476, 5963, -2026, 141, 2992, 2806, -3732, -2561, 4030, -1188, -1516, -737, 5531, 1588, 464, 2608, 4356, 3033, -3497, 2735, 1798, -580, -3177, 2674, 2238, -1265, 3483, 1322, 2706, 1903, 2671, -1887, 1239, 2500, -4750, -1147, 1700, 1342, -4679, 2115, 3196, -422, -81, -716, 2786, -1453, -2677, -4607, 2417, -1028, -7583, 684, 4378, -1355, -6715, 5766, 2669, -5747, -3416, 2619, -528, -7563, -810, 150, 478, -4034, -505, 3477, -126, -2378, -1266, 4375, -3366, -3542, 279]
498B79P85l811J367N073n136L718p09j026j42K595l361k946P249m222j103J522
514A32L714l340O39J956k711L863m298j276K928K298q002J621R778p359l273N806
530B476M487r786J370N482l331k700j02M245l374O59j229K775R30k925O68M20
546F5K197o286K829R01j885L28jJ311j399L806m656K226K503l126k257K775K215
563A546o273L672N80N37j018o28K513Q15j022n529P541p13o012J346O309k518
579A146p096Q178J613l279l172O497O8o472K598J542L39m313L695l95P65k94j678
596b58L674j294j493j832N294l779k355L836j276k79o05K865l071J963n96o28
612A66J245k633J617j310R16k093K956j964p04M027l064j54K91K520m470J152
$$ y = [279, 1064, -2747, -1380, 3693, -1443, 2275, 1566, 540, 398, 2993, -368, -3314, 3935, -287, -1390, 132, 3846, 506, 1145, 3101, 390, 4253, -45, -1321, 1607, 3905, -4097, -2476, 7302, -57, -3330, 2476, 6963, -2823, -1453, 4029, 698, -2002, -2104, 2141, -1233, -574, -1803, 972, 1902, -1023, -355, 65, 2262, -4024, -1195, -294, -2179, -1851, -1852, -541, -1940, 1866, -2790, -564, 1939, -1187, -3444, -669, 1546, -4727, -1055, -475, 62, -956, -1584, 929, 1744, 722, -4807, 2734, 2021, -3991, -2645, 3664, 1146, -5950, 2228, 3841, 562, -2610, 3887, 3955, -2517, 81, 1623, 1962, -2351, 1344, 949, 1714, 1420, -258, 3416, 2122, 629, -1203, 4091, 312, -2043, 1793, 517, 238, -367, 2498, -573, 1390, 794, 166, 1411, -1222, 395, -915, 1, -2092, 864, -1100, -1804, 2223, -841, -995, -704, 1816, -2654, -1502]
628a502J409j839M24r38L320k668J450m94J519j617n77K396l641K581q84J45j052
645a968K805j125j639M333l020O68j10J390k307Q56O48k055L109k397J460N8Q78
662A584j097L00J056j663J708l203K915o58j377O45J997m64l195M647k004n13
678F78n37J561j311r81J389j191J719k448K210n11m79Q9J04K06j780K276k841
695a847J823l19j215J037M98J38k557M093k814N9M96o0l59j102K121j812J940
712A20j976K263m77j259J660j023J074k524K659k061R24O13j087J538o21P70j448
729h55K984k256k92J464r73J28j084K512j904J243n98Q99Q2j677K242j265M82
746A132j675K541k044JJ280j198J363j301J501j647J516j248k43J338j858J107
$$ y = [-1502, -93, -1932, -1508, -2446, 874, -1794, -344, -838, 681, -936, -1513, 883, -2758, -177, -1061, -916, -1968, 837, -288, -1927, 2406, -614, 54, -56, 1334, -973, -117, 531, -1524, 1585, -812, 648, 706, 1584, 487, 787, 1843, 180, 1888, -1315, 1600, 942, -435, 210, 2207, 1743, -1452, 3195, 1191, 678, 141, 1702, 391, -590, 799, -392, 1327, -1121, 1089, 578, 99, 188, 292, 498, -1282, 994, -1847, -24, -343, -1558, -521, -23, 115, -2442, 1651, -1163, -1104, -608, -668, -1027, -2129, -8, -1820, 120, -1856, 407, -70, -1329, 331, -692, 382, -2142, 517, -1544, -620, -7, -1094, 444, -177, 593, -855, 2129, -127, -419, 1045, 72, 200, -884, 1628, -276, 967, 369, 1268, 1350, -327, 1915, 650, 1132, -543, 1998, -46, -45, 1235, 37, 1400, 99, 1600, -47, 1469, 221, -22, 1316, -542, 565]
762E65j450J751j602J049m49nQ13j840J872j584P28j458J741q57p50J750j710
779a436J480j101J576j745O30K40j136J535j658J607j678J899j161K19M88m22
795f63J232j969K117j528O41n80P19K09j245J718j089J523j604J604p12J09K41
812G23j169J715j692J655j175Q87r8l24Q60j120J615k260J819j039K55k48n18
829a14J288j165J373j931J902o10k94j69l82J283k500J719p27P13j190N09R61
846F66j488R61j196J732k118J091m46N7J95j079J852j522J368j522J471k99l87
863f64L10j032J630j484Q03o72J528j095n10J830j326J264j653J251k90K31q59
880g38J61J943k222P51M01J298k107R54J025j055K96j008J916j517M36n56J271
$$ y = [565, -885, 866, -736, 313, -136, -141, 672, -1168, 704, -880, -152, -1610, 131, -726, -1476, 274, -1436, 44, -1057, 519, -1226, -596, -356, -1492, 43, -1615, -8, -1686, 213, -948, -729, -241, -663, 569, -1400, 717, -811, -170, -750, -31, 178, -1067, 651, -438, 1085, -519, 1085, 373, 482, 723, -446, 1269, -423, 1232, 57, 944, 846, 522, 1382, 262, 1877, -383, 1436, 397, 652, 404, -114, 1174, 9, 1382, -549, 1353, 743, 449, 280, -102, 1181, -1319, 400, -327, 386, -804, -295, 666, -822, 139, -1057, 675, -1443, -352, -798, -741, -546, -1625, 227, -1295, 73, -1449, 22, -277, -664, -354, -1386, 244, -1240, -437, -1109, 419, -676, -1186, 644, -682, 582, -1071, 180, -110, 121, -738, -577, 1366, -856, -105, 296, 1594, -513, 441, 1466, 411, 707, -301, 1615, 98, 534, -22, 1249]
897A249Q2j844J952o08N91k106J832j37r31L87k28Q16j538J748j323N34J27o10
915gJ66m07J385k685K107q99J29k23k9Q04j277J538k001J826o46p30J11P37K49
934A48k433K762q25k50j024J955k43j511J269o35R57j621J337k39L47j71j106
951a283K477j354l24j14J755j235m50J702j817J050l20Q06j507J757n65r66J816
968A428j078K75o82J625j678O84j62j39R56j328R77j108J824j427K02P17r42O7
986B11j035K373k122N09J76P66j014n23J743j934J180j016N09j43j48r2j39J544
1004H45k597J861k25j83p82Q08qj282J842j537Q19l44P27j032M93Q36j482J660
1022D19j196J116j033M03j54R4Q75j517J703j209Q54p75Q63N5j160J311o40J004
$$ y = [1249, 1331, -513, 1439, 831, 1422, -684, 1148, 1011, 80, 467, 239, 1055, -483, 1265, -58, 476, 603, -7, 159, -248, 1137, -1548, 559, -340, -211, -434, -463, 341, -936, 602, -1399, 427, -219, -949, -838, -101, 148, -2285, 477, -348, -598, -1622, 333, 90, -1421, -152, -787, 170, -1451, -114, -353, -6, -177, -1283, 1194, -160, -484, -598, 1157, -78, -528, 1174, -643, 407, 87, 893, -614, 1143, 578, -388, 1428, 350, 625, -57, 1568, -110, 574, 412, 273, 1229, -99, 878, -230, 1594, 167, 369, 1086, 144, 211, -824, 1549, -573, -64, 112, 878, -136, -659, 1084, -850, 330, -686, -177, -320, -468, -560, -699, 845, -1752, 109, -116, -299, -1081, -273, -281, -1563, 279, -1258, -439, -783, -56, -1088, -595, 241, -1241, 419, -777, 339, -694, -291, -445, -351, 524, -993, 710, -499, 355, -420, 443, 498, -662, 649, 9, 1013]
1040A013j806J635j45n55K81O0P71j293J273j174Q96n15k17P82p89P61j267J657
1058A368j590N79N29p12M23r21J137j348J371j015K88N0m46P69j202J311j415
1075h24J125r87K21J25m40O34r28J487j435R22q20M80K05q00J297j131J024j156
1093a001J287r73L61N92j211J275j209J041q90P90k83J2N69j409J545q28Q47p67
1111b52O52m67J02N55o25J083j027O18n29N83j98n12J047j178J302j050P94q41
1129E7K04K50k70O52j628J732j045P42l96J70l84j19P93j239J142j203O65l83
1147b60P2k3l83J223j471J239o20j92l3M8L14p99J091j559J427o57k92L68J75
1166c32J22q44J095j102J094p27nM26n0M34q82J154j045P19r1o3J33j69N48q79
$$ y = [1013, -793, 842, 697, 142, 423, 483, 1254, -39, 1234, 60, 956, 441, 224, 1006, 217, 978, -289, 1368, -222, 357, 886, 174, 597, -324, 813, -535, 836, -179, 109, 159, -287, 482, -720, 591, -824, 301, -686, -465, -340, -780, -146, -1074, 413, -1022, -100, -920, -440, -235, -1035, 262, -869, 155, -1001, 286, -687, -326, 266, -945, 330, -879, 162, -728, 62, -221, -209, 360, -1049, 496, -332, 515, -252, 400, -67, 35, 590, -35, 1048, 21, 639, 110, 693, 495, -17, 1030, -148, 1154, 104, 898, 57, 261, 511, 241, 893, -735, 997, -48, 694, 298, 468, 84, -35, 758, -481, 661, -542, 123, -260, -188, -211, -594, 629, -842, 397, -223, -415, -448, -400, -86, -885, 206, -1353, 74, -583, -875, -507, -332, -210, -1054, 41, -1061, 33, -694, -699, -273, -323, 111, -771, 383, -662, 57, -34, -97, 36, -133, 415, -464]
1186d64J122j063P43k26NL03m21O56q44J304j121N99l09j42M08j94M90r42J017
1205I21p84M83k43j64N11p44Q30j200J204j122O43L1m50Q15j217J040q84R09q56
1224b77L09r1m93Q10p19P35r61Q75r16L13K23n76P60q35O19q01J023l47j58J60
1244c47m72Q19q46P70m07N40m74l3M60q93J100o64M12l88N80k90J78N99j316J511
1264H39j069N06m58N59l43J08P91j355J523j119P42n69M15l00R4N04j188J155
1282H35q90P91l50l63M65l12L39q39J087j058O62k99l07M90k97M65j073J204j274
1301g24L88N85m34J95n03P39j317J197o77L61j42k97M59m13Q59j205J216q73K38
1320c48J8nJ19m35O48q80J162p25J26K45k21N67p03R26o96O58l77M6K89n21Q61
$$ y = [-464, 658, -405, 338, 112, 117, 420, -1, 655, -189, 1115, -6, 593, 284, 142, 550, 356, 846, -96, 921, 137, 620, 377, 213, 724, -20, 810, -390, 814, -308, 335, 366, -84, 731, -486, 554, -330, 579, -277, 32, -59, -552, 258, -461, 274, -687, 188, -728, -415, -192, -768, -8, -843, -224, -1025, -2, -349, -507, -347, -819, 0, -846, -76, -483, 57, -417, -450, 10, -883, 217, -447, -35, -423, 157, -133, 45, 644, -672, 839, -230, 276, -182, 377, 34, 142, 933, -422, 1101, -18, 724, 155, 570, 270, 364, 868, -320, 835, -55, 736, 386, 23, 488, 176, 515, -324, 763, -295, 367, 68, -239, 251, -46, 419, -654, 550, -724, -336, 249, -185, 10, -493, 246, -1071, 126, -551, -190, -332, -629, -170, -583, 276, -929, 287, -586, -348, -330, -335, -216, -651, -3, -883, 279, -446, -320, -75, -296, 271, -432, 494, -202, 456, 79, 125, 414, -107, 754]
1341G54q18O45p25N23o6q3N04o37O83q29R86r58M58J32n05M38n49P05q28P22m86
1362F6L44m2j37K43r97J117o57M62p16N09k05k03P12r23P26p29M14m86M74M0m84
1383d72M44o69P31o12N28n56J04L92o55P40p50Q63q31P88l53PL44n39N02n45M33
1404a06k74K47j5j66N17m31M35n84P14n99L10J1l06P03o04R20r00P07n51K66L08
1425F02l98N5r5N45p42M28j99J49J30l03L90m25M79n86K65l8J70j91n10P87n93
1446h0L89m09L64o39P9M16n65Q22r18O73o50P16n30l41O77o12P75o02N72q46O53
1467e6k21k54P03p85N43o12P37n66N11jk98M87o08M99m44M58j04j5L09n33O76
1488D26p68O34n48L90j7j52M03k84N22r30R62n80K41j72J26J31l89O71n49O66
$$ y = [754, -64, 581, -144, 379, 313, 230, 734, 97, 780, -49, 937, -21, 437, 569, 64, 502, -47, 658, -170, 552, 66, 410, 368, 231, 474, -523, 594, -63, 399, -317, 192, -13, -216, 496, -427, 299, -430, -16, -502, -28, 12, -472, -28, -697, 34, -578, -50, -606, -502, -110, -765, -25, -775, 88, -743, 45, -308, -301, 43, -496, 6, -539, -106, -380, -133, -148, -314, 203, -228, 207, -377, 337, -262, 48, 59, -247, 456, -148, 772, -128, 579, 28, 294, 602, 204, 259, 164, 709, -33, 395, 196, 345, 475, 172, 562, 137, 616, 30, 295, 257, 427, 236, -274, 513, -80, 309, -100, 264, -375, -296, 120, -445, 377, -541, 132, -518, 198, -332, -673, 4, -608, 167, -435, 137, -709, -56, -277, -531, 172, -613, -70, -682, 55, -511, 0, -1, -299, 188, -420, 79, -365, 93, -11, -26, 283, -250, 426, -342, 292, -256, 134, 117, -35, 368, 84, 606, -324, 638, 58, 299, 127, 253, 384, -5, 666, 117, 783]
1508G83o69K22J27j78o0l38P82q09P02n52K29l57m0L08k46N67p89N56m08m3L86
1529A73o11N84m83O38q88L90j06K48J72o18N36n91O82q51N58k13Q8J89l99N44
1549D2p94Q31m49K63j17M7J33l67O28o56N42j96Q8l7l10N38l12M28n26N76l87
1570c5K73Jl37N15o57P03l37L54m41J52K10m31N80m85P05p74L89l98Q4L49j98
1591B22J48n52O57m80K10j87J25P9n00M25o26P70o30M93l57r3K86n49P13n78N75
1612A51n67K38R4l38N88q15O82m45L93m13L25j0l02N50n99O03o12N36l73K07K77
1633A70k47L57o15Q06q60M45j62K6J86k26N02q32R56m96L58m8M6p4k08M07n01
1654a0O67n22J63J17o45Q21p02N58q51Q33m01K15J75l36J51l65M24m03K66j41
$$ y = [783, 114, 336, 463, 285, 225, -113, 669, -140, 562, 10, 239, -118, -158, 150, -96, 471, -318, 238, -170, -213, 173, -438, 146, -337, 301, -587, -197, -303, -55, 117, -501, 35, -556, 126, -725, -167, -380, -292, -103, -502, 42, -752, 79, -370, -107, -224, -177, -44, -411, 217, -439, 103, -93, -5, -42, -352, 186, -126, 302, -224, 352, -35, 238, 239, -98, 417, -240, 463, 126, 480, 39, 191, 401, -30, 550, 65, 770, -4, 385, -13, 71, 420, 222, 370, -182, 475, -5, 205, 18, 143, 222, -278, 147, -479, 291, -339, 154, -203, -296, -10, -559, 154, -424, 151, -416, -178, -84, -422, 166, -649, 33, -412, -19, -432, -107, -117, -419, 131, -468, 135, -477, 59, -314, -107, 170, -77, 280, -335, 471, -389, 56, -106, -80, 106, -120, 382, -450, 506, 10, 368, 320, 366, 292, 84, 491, -10, 657, 135, 298, 415, -230, 591, -111, 447, -404, 429, 28, 243, 418, 82, 233, -132, 292, -111, 155, 14]
1674A4p5J78j42L05n43O34j037Q82k97n8L19n12O04p89O25m57K34k36J17J44m35
1695e25N35l59M86o59O36n1l15L80l90K03l10L11l06N08k96j46M57m25L03l83
1715c46P00l75P9j91N2M18m58N19n32M32j71p0M42l48K26l10L19m36N31m11O0
1736A30M1j54L08m96N98k48K39k47q1K4l85P48q38O33k81N2J09l07K04n88Q20
1757B81n67N23n95L30j62J7J76n06N57m91K24N2J6J73o74N40l89M97m29L23q4
1778a88K1L60m42M07m45M85m52L82k25J22j96R9K55l42L28k49L46j11q9L29m66
1799g1L74n79M01m9J66k9k30K75j61N4o7L09k55J08j32K4K97m94J90k38M26n10
1821a91J96K09n74O49m01L13j57Q8m69M84j81m28O76m02L38n19M81j67q8J44k85
$$ y = [14, -61, 117, -25, 280, -263, 371, -666, 216, -81, -139, 180, -332, 272, -517, 108, -349, -115, -351, -234, -90, -525, 10, -349, 137, -522, 114, 63, -252, 128, -262, -59, -369, -58, -364, 144, -152, -298, 159, -266, 37, -346, 354, -21, 58, -133, -81, 337, -121, 398, -134, 298, 127, 57, 499, 151, 377, 67, 386, -50, 481, 70, 130, 171, 17, 325, -171, 427, 179, 418, 171, 90, 114, -271, 477, -361, 272, -9, 43, 152, -155, 49, -539, 281, -286, 237, -358, -28, -190, -173, 3, -503, 54, -437, -213, -161, -145, 28, -646, -106, -495, 2, -427, -104, -188, -167, 193, -249, 158, -287, 198, -254, 128, -97, 25, -171, -72, 183, -159, 169, -80, 266, 155, 66, 395, -71, 303, -276, 125, 76, 242, 213, -17, 258, 97, 151, 84, 393, 138, 246, 114, 138, 435, -59, 131, -107, 319, -191, 5, 214, -360, 289, -112, 201, 44, 132, -337, 147, -34, -462, 214, -188, 150, -369, 112, -55, -143, 1, -284]
1842b84J37k51N05p11P14m30K34J17m58M44l31N13m44J89j20q3M21m13L64m37
1862c24N05l09pL2L9K28l29M98o91L21K44K2J62m49J11o6M39l25L79o25J88N66
1884F09l30M9l01K43k80R7j02J53p6n6K40k70J59k65M09k28k75M68j57K36m60
1905a37K11r7r4r8P6K2j80M50l49K77k53L02j3l42K39l71L55l36J75O9jj3j64
1928b72K23o12N33k87M55k91J12J69k94L82l38L11l02K72j35l0J34m8L37n93K89
1949A5k31L92k40J28J35p8O5m30N11k67J89J80m06L77n14N13k0lk2l11K10j42
1971E1K26k68K94l36L42m15K74k33j69J00j06L28Nj54j72q3K31j81M78m58J14
1992a32k96J27J41N7J38m72K85k00K83j59J32k94L73j68j21M06k23K81l13J91
$$ y = [-284, -147, -398, 107, -604, 110, -320, -86, 31, -427, 17, -314, 199, -245, -56, -176, -259, 162, -251, 113, -324, 181, -128, -135, -103, -64, 164, -165, 333, -358, -37, 207, 229, 391, -58, 53, -13, 426, 101, 480, -145, 43, 609, 279, 328, 27, 270, -10, 87, -15, 138, 62, 6, 246, -24, 135, -130, 279, 51, -224, 244, 87, 323, -137, 74, -23, -117, -215, -139, -117, -297, 153, -196, 81, -172, 130, 117, -225, 14, -357, -2, -338, -163, -94, -95, -108, -272, -49, -661, -128, -415, 40, -251, -139, 30, -264, 118, -220, 91, -211, 61, -74, -104, 30, -18, 319, -274, 15, -216, 176, -64, 64, 199, 121, 186, -244, 267, 0, 189, 369, -37, 340, -174, 339, 319, 316, 294, -17, 193, 51, 277, 9, 303, -33, 309, -106, 168, -65, -234, -134, -240, 88, 93, -61, -233, -316, -85, -266, 212, -246, -132, -428, -301, -160, -103, 35, -437, -152, -352, -69, -228, -96, -390, -17, -185, -306, 100, -123, 158, -155, 36]
2012C6j37N2K56n69N02j85J23j85K14n2k77O41k09Jl53rJ28J03O5k81K34m1J43
2035B00m10M23p6j5J3l29N52m52N72m72J71m94J99L64q6K21l03L62r10M95p9k49
2057c03K51l7J23k51J97m14N27k43j66L47m13M22l35J89j30K50j40k17P0k06M69
2078a0l88M17j77kK94l47L84o61P11l42L37k43P1r5J70K38o29N88k96K28j77K51
2100C22q2l09L41n84P17l47j7j01K31Kr2N21p22L31p4m7J14k26J77j67J11j76
2122g7M49m60O9J29k10L69n46L80o2pj96K24K3Q0P6n81L03j21m3l75L61J03o8
2145a80L17o09O27l04J28j55j07K05j16K49l49L38p8l67L33J04J06k13J76m40
2165c35N61m27O5K8K66N0k77K50l80M08j43k17K21N5M00n84L93k55J40M5j47R1
$$ y = [36, -101, -49, 207, -362, 140, -45, 78, -107, 107, 55, -222, 419, 210, 211, -142, -151, -23, 80, 145, -136, 98, 57, 200, -210, 213, 137, 122, 135, -194, 358, -94, 478, 6, 177, -317, -118, 246, 160, 381, 78, 440, -470, 25, -54, -303, -52, -89, 34, -217, -20, -434, 93, -150, -316, 31, -382, 40, -295, -106, -236, 14, -126, -343, -273, -479, -10, -398, 19, -158, -160, 134, -213, 171, -490, 221, -121, 216, -27, 44, -51, 119, 357, -272, 316, 20, 248, 71, 322, 240, -69, 272, -312, 405, 58, 41, -60, 171, 173, 81, 602, -120, 211, 137, 90, 204, -22, 155, -12, 99, -77, 372, -88, -19, 110, -100, 269, -277, 103, 41, 34, -162, 62, 85, 165, 241, -340, -37, -158, -201, -576, -215, -112, -180, 137, -472, 155, -149, -21, -176, -283, -78, -194, 55, -294, 44, -34, -401, -68, 36, 142, -71, 105, -335, 226, -201, -136, -108, 158, 208, -69, 181, -199, 209, 66, -151, 70, 125, 525, -59, 334, 79, 219, 264, 117, 208]
2187B08l31M76l54L27m51K05q3k4L32m21L41m48L24j88L35k12l20K74j55K47n13
2208d31P60o74K75O5m40P54o64O29m99K12k47K52j47m73M44J1L61n04L99l09K40
2229A4j3j42N9l86M43j42q9J22J46J82l16L11l70K39r5k7l3J9K40j87K01k85J55
2252D6l8k2j22K32R2j89J41k87N25l07j03K76k68K14Q3m6m2l0N5n1m8k35O92p61
2276a93L74k44L0J49M0j19j01k8j28L49n18N97k22j49K13m07L65l11J90K8R9j65
2298a51J10P0k76K30l83M30l54M42j76J9O0j69L68l79L0J0L15k2k21Q1j46L37
2320B25m31L51k48P2j02r4K51k0K21l23M02l75L27p7j44j0M5J53j6J11l50K21
2342A89K05n85O11m86J32K63k04k42J46J37k63K87m37K06r2L88l68N9J96q4j94
$$ y = [208, -123, 353, -1, 326, -125, 80, -3, -27, 305, -116, 225, -223, 101, -87, 248, 36, -284, -10, -165, 82, -431, 329, -345, -70, -5, -445, 309, -355, 274, -225, -13, -260, -8, -155, -628, -184, -173, 188, -316, 83, -226, 14, 1, -141, -82, -468, -25, -167, -256, -134, 12, 194, -122, 189, -181, 58, -37, -64, -97, -78, 162, -25, 176, -109, 46, 8, -14, -136, 96, 188, -1, 140, -147, 378, 71, -32, 244, -24, 190, 273, 227, 185, 155, 210, 159, 111, -124, 568, -193, 181, -63, -33, 116, 156, 37, -64, -92, -220, 129, -389, 208, -14, -163, 50, -357, 8, -303, -113, -85, 14, -151, -41, 29, -247, -17, -400, 30, -324, 118, -58, -39, 21, -148, 220, -159, -129, -119, 196, 174, -47, 34, -112, 225, -206, 145, -103, -31, -133, -227, 24, 4, 225, -98, 304, -71, 256, 179, 35, 25, 70, 223, 207, 318, -32, 189, 394, -191, 420, -66, 66, 329, 125, -117, 29, 166, -97, 190, -247, -41, -133, 255, -113, -54, 142, 58, -136]
2363a36J40P9n10K61K9j48J52l39N00n4K50k61N5j9j12J44j44j8o6K08j13J74
2385G2o1k76M20l57K55j87J84pk93K03q6K04k27K22k09J32J97j94M86n54K49j42
2407C1L17k04r9j68J02j8j63L14q9K74k15m1O5m4Q9j28N0j10K17k31K71k10j13
2430a03K93k27N5R4J0j11J29l96K06K44l71J61KR0j93J98k45J24J64l50k6LM01
2453A52l71n6L70j87p4m9J83l9j24J66k23J26K0M60m87L64k98N3Qm1L81m10K34
2476A58r3J49n6p8j88M2Q0j17K98j62J05O4j47J52l24L26j49J59k74J38%j31J37
2499H9j4j85M8K08n34N27Qk6r8l53M00q2P4j99o5L91k54K02l58k0J31J0k8K37
2523A09l62J66j20j04M1K02Rk96J43K40j63R6p0L64l75N4j18RJ61k4J2m59O08
$$ y = [-136, 4, 83, -427, -166, -137, -285, -133, -472, 28, -26, 224, -37, 18, -1, -113, 31, -113, -131, -197, 11, -102, 72, 11, -265, 155, -202, 53, -134, 50, 43, -250, -47, -133, 71, -156, 66, -143, -11, 186, -8, 478, -76, 173, 31, 348, 144, 45, -123, -21, -39, -202, 112, 23, 297, 82, 41, 106, 62, 151, 23, 73, -37, 180, -51, 220, 10, -103, 190, -37, 18, 112, 122, 11, 140, -256, -50, 194, -177, -16, -14, 76, -117, 81, -164, -40, 124, -226, -252, -249, 152, -219, -275, 95, -92, -166, -215, -32, -71, -195, -29, -252, -126, -106, 354, -133, 231, -67, -14, -6, -47, 334, -76, 158, 65, 214, 158, 80, -108, -66, 14, -103, 195, 33, 138, 202, 55, 207, -117, 209, 60, 219, -55, 83, 83, -48, 89, 75, -110, -62, 146, -388, 139, 147, 121, 23, -330, 70, -12, 62, -137, -202, 189, -65, 137, -221, -241, -110, -100, -128, 109, -253, -87, -207, -311, -270, -68, -59, -355, -212, 28, -135, -39, -109, 255, -120, -66, -184, -175, -14, -38, -26, -485, 123]
2546A23j53L67m62N6J16n6J40k58J13k74L58l4k24L86l1j64J1K93j86p6L29l68
2568FL62m70N47l83K78k41o1R7p3K42o48M16k32K99j78KK31m61K74N1j24q2J24
2591b4j1j30L31j42r6NK81l17J4j55P0J45q4K10l29K04k29K49q7Q5P6k49K65l30
2615b48L08j75J17J51j62O6k2J42m07N0L29l24L1J25J47l45L38r9J55o1J70j77
2637A09q8J26l00M14m15M95j97j5j77M4K71l19J90K5j03N3j05K24j21J02j79P8
2659A12k47K34k43J04R0k09J30j08lJ22j10O4M5K9jM1l36L29q2n2O7j25K48k15
2683a16L68k43K6k71K88j48K3J82l49L76j45J92l32J11J13j14l5M8L36k26j86
2704a02m5K97O5j80J35j06PPMj11p3L23k27J33j93K01j21K53q6j81k45J95L80
$$ y = [123, -30, 337, -125, -69, 47, -9, 131, -127, -14, -288, 70, 36, -188, 198, 167, 3, 14, 307, 121, 45, 374, 6, 368, -102, 445, 62, 340, 99, 38, 135, 62, 304, -344, 72, -160, 139, -39, -37, 194, -267, 7, 58, -66, -148, -24, -35, -165, 166, 24, -72, -67, 214, -103, -89, -244, -174, -29, -113, 97, -232, -28, -257, -8, -95, -10, 66, -183, 82, -248, 60, -115, 2, 153, -9, 57, 35, 177, -230, -180, 149, -175, -144, -19, 128, -217, 121, 22, 177, 116, 286, 109, 21, 147, -153, 261, -154, 341, 144, 129, -48, -4, 267, -52, 138, 163, 60, 113, 8, 232, 111, 213, 34, 112, -135, 99, -144, -40, 50, -159, -29, -137, -140, -18, -128, -64, -19, 10, 9, 50, -286, 43, -39, -91, -24, -149, 99, -116, 252, 9, 35, -236, 52, -96, -73, 109, -240, 136, -9, 183, -149, -38, 75, -39, -74, -26, 310, 84, -102, -147, 150, 215, 35, 170, 64, 71, 78, 82, -29, -102, 221, -6, 127, -66, 135, 14, 267, 181, 0, -245, -50, 330]
2727C30n26J67L80l81J17N6j46K2M2j81R2J38n5r7P5k81K8K46j95L61k68j38K93
2750G9k89M38l40J13L2j26J8k0n4o1L38l9l55M06j44N9j35J88j46L9M0m9o0Q3
2774A5J96k43K64j99J4j17M5p2K95r8m9N0k34M46m53L70j17J12l03j22N45l13
2796C2R7r0p7K4Q2J27l07J62k10L60K7j30k08J20r1K06k7k46J17k1J1Q8j80L0
2820a04J73Mp5j06k50J97R3j15L83l92R2Q0N6J93k19n8q6N4k56P67n29J53p4j31
2844a50K15j12Q9k48N04k06k80Q4j34M77j24J4j02J61j89J31k7j04J45j33j18
2865a07P1J62j03j21L92k97L28l41O5j63M82k97K19j83q2K38k67J51l07L59l92
2886a93O4K64l18L94m4k9k25q1nJ9M18l33R1p7L09o92O23n17K86r2K10R2l29K28
$$ y = [330, -196, -29, 351, -30, 87, 143, -3, 19, 61, -120, -28, 110, 55, -42, 33, -248, -220, 26, -169, 192, -76, -214, 79, -210, 228, -112, 1, 33, -93, -75, -95, -149, -210, 128, 89, -266, 140, -4, 55, -80, 108, -38, 1, 41, -8, -68, 15, 211, -32, 232, 33, 47, -70, -25, -97, 198, 100, 51, 101, -133, 313, -140, 230, 113, 225, -78, -200, 345, 32, 129, 39, -38, -14, 68, 195, -112, 50, -160, 200, 227, 97, -111, 9, -82, 124, 97, -149, -32, -53, -42, 46, -134, -104, 69, 73, -2, -108, -358, -161, -68, -183, 200, -192, -100, -20, 36, 229, 10, -48, -134, -80, -336, 431, -98, 55, -19, -150, 65, -47, 42, -206, 298, 92, -188, -104, -238, 239, 115, 129, 27, 188, -1, 130, 103, -1, 144, 11, -107, -36, 126, 23, -98, 294, -3, 325, -16, 49, -114, 368, 71, 290, 107, 25, 263, -4, 147, -160, 199, -193, -129, 135, -183, 211, 167, 138, -87, -168, -173, -154, 264, -69, 22, -55, 254, -438, 185, -332, -46, -138, 72, 164, -165, 63]
2910F3l13N3Q6R9j49j0N3J12k0l9J46p8J3J15k46O6OP2O5L4M1k39K32k39J49p3
2936aK9r2jJ11j14J76q5J99l15Q9J66j00jk40L32j78K82m4k29R6k58K3J68q9J19
2961D3QJ11j37o1o6M4j06K8K25k24K40k26NN6J8j71L75m51r4L95j44J53k86L39
2985G4k4l86M3J07J39J7k95M57r7k06J98k23K84q0k69K81j12J51J01q5k03P7O0
3008In0K22j85K61m71N06o73M00J65N1k48j07K97k50k06M46j51l6l0k9K46o9k68
3031a70J31K4j81L08k80K01j23J04o8K68k02j32N33p28L86k83K81k0j00jL3J8
3053aO2Q6m63L98j73N1L1r4j03O1Q0j9J90j98n4K27r0N3n2m1r9K84m11M73j13
3078H5j46l8J77J43k77K84R4m77K10k07Q8N6J85k66J54k83M9J60m1j7J61l02L44
$$ y = [63, -250, -197, -111, -12, -161, -171, -118, -6, -26, -65, 81, 3, 16, 131, -115, -49, -43, 29, 94, 128, 169, -70, 162, -77, 72, -1, 28, -64, -65, 46, -68, 108, 23, 222, -93, -4, 162, 62, 61, -179, 153, -25, 257, 213, -16, 80, -178, -155, 13, -76, 43, 51, 162, 25, -36, -102, -58, -164, -136, 89, -135, 105, -121, -116, -60, -42, -213, 162, -289, -383, 12, -132, 21, -265, 74, 50, -336, -293, -186, -47, -30, -325, 132, 35, -171, 27, -196, 88, 8, -261, 20, -92, 59, 160, 75, -128, -51, 9, -41, 181, -4, 257, -214, 292, -381, 19, 184, 235, -13, -120, 177, -73, -279, 167, 16, -20, -50, -79, 167, 98, -170, -39, -15, -196, 112, -168, 33, -90, 14, -54, 214, 12, -120, 413, -315, 71, -212, 69, 49, -51, -52, -19, -1, 61, 147, -316, 82, -91, -40, -9, -103, -206, -145, -65, -84, 106, -92, -146, 81, -9, 44, -8, -49, -148, 136, -275, 198, 85, -61, -99, 78, 221, -56, 228, 322, -155, 55, -152, -64, -8, 177, -89, 65, -218, -169, -9, -50, -67, 94, -208, 136]
3101A36k1j97L57l42J06J55k25J09j8Q2j08j77P1j10J52m8j53J09K70n53K25L11
3123A31j62pj08J29J7N6k99K05l4M8J1k89M86k02jp8l02O2L51q3n1Q9K87k88j23
3148a55J98J5Om9L2K70k13j05J95j59m4K40m17Q1J84k31J3L19n4J52k4q2m64L44
3172E2J08k30%J93p7pj29K69j60L0Q8o8N9o5r0n1M3J07j36j28n5K22M8l47N3K18
3198e3o6J28p2J83k75O8j36J77L23l82K79k98K3j93K31L40j75k82J75K00l07R8
3220a4K0p0l5J68%M2j70Q5m1p0J66J03j8j53l7M1r7Q0n6n2m5J78K95k79p9M0K6
3247B8K07j23k84o6J77K45j07k16J10j9L35k27j41K4K12o4N6n65M81n0l04N0K8
3270b13M49k11o1P3k11r2J27l0K32k77J67q3K54l71J85K27l29K81l29M37l97J24
$$ y = [136, 115, -82, 275, -67, 39, 194, -31, 78, 60, 142, 34, -143, -72, -182, -30, -78, -231, -122, 148, -405, -180, 131, -31, -38, -146, -17, 0, 56, -243, -38, -72, -24, -13, -302, 184, -18, -19, -97, -399, -337, 14, -69, -120, -31, 256, -32, -155, 43, 58, 64, 15, 47, 317, 104, -1, 194, 35, -9, 231, -186, -105, 79, -152, -139, 180, 126, 278, 254, 172, -292, 52, 160, -70, -70, 123, 46, 39, -90, 179, 19, 49, 137, 69, 128, 63, -27, -78, -35, 72, -64, -192, -247, -25, 23, -324, -271, -53, -119, 9, -63, 120, -155, -87, -223, -46, 277, -105, 174, -124, -101, -294, -63, 277, 102, -180, -5, 195, -112, -14, 6, -64, -99, 69, 69, 111, -59, 26, -15, -85, 81, 184, 166, 13, -24, 17, -80, 0, -56, -108, -153, 25, 320, 41, -38, 2, 28, 235, 112, -172, -238, -61, 184, 77, -139, -29, -48, 287, 60, -81, -57, 155, 91, 147, -418, 63, 13, -291, -241, -213, 236, 25, -36, 37, -174, -266, -139, -169, 63, -214, -47, -130, 124, -247, -62, 165, -164, 117, -212, 225, -172, -48]
3292d8L8l1K16j20J00l76J0L08j72j01J6J48j20K40j19Q9k37j46K45Q3O9q6J60
3315A66l50J93n8k22J65M2P3o0L8m9K76j00J22J25q6k07p1Lj61M19k51J6rK83
3339B97k4l18k50M31J2m28J07K05j35Q6K71j18j62N5Q3k66J30Nj78%L14o0L9Q
3363A04j19P8K8o0P7k33J9K32l28OK32j76J04M7m10M71Q8j41J11j12m1r1K85k6
3387A45p8K8L0o6l8j72M49k50l9L19k99j59Q3J91j40J15j9k00L40k67n6j43L91
3410A65j59m0J83k99L7K7J41j93Q9Q1J95k29J90j46k78m3K05K24j12r4j2J35N6
3433A23o5l2J56k81qO2K12j92j1j64K90q7l1J10N3k11OJ2j64K54K4pM8p1K9K0
3459G5l4k0k1m7L4nm0L23l67Q9j7K30j69R6Q1k30M6J81n1k32J17j38O6K37j07
$$ y = [-48, -10, -41, 175, 55, 155, -221, -211, 97, -75, -176, -160, -12, -132, 108, -11, 78, -159, -305, -60, 23, 92, 6, 166, -184, 9, -49, -271, -106, -64, 9, -51, -13, -62, 214, 114, 236, 361, 275, 68, -3, 0, -161, 258, 7, 23, 14, 297, 273, -45, -295, 136, 148, -280, -173, 32, -103, -17, 254, 136, -26, 29, 112, -154, -24, -19, -197, -197, 117, 57, 96, 104, -15, 63, 91, 31, 108, -125, -106, 126, -202, -196, 36, -140, -36, 11, -399, 72, 160, 19, 130, 18, -23, -114, 171, 145, 67, 95, 125, 59, 21, -151, 298, 48, 9, 328, 29, -130, -47, 144, 4, 119, 100, -100, 240, -27, -83, -226, 165, 6, -34, 149, -150, -113, -86, 55, -138, -49, 32, 227, -2, 188, 42, -236, -279, -74, 150, 38, -56, -68, 67, 123, 58, 26, 182, -99, -107, -45, 167, -25, -36, -200, 90, 3, -28, 82, 135, -76, -70, -58, -222, 32, 56, 49, 97, 26, 55, 75, 41, 21, 0, -47, -13, -18, -58, 265, -102, -13, -30, 200, 31, 127, 208, -22, 24, 205, 154, -78, 39, -99, -33, 204, 97]
3484I7j15J68o5Qj12k64K42O2Pm22N13j92K0j33J38J19r8j08L2o8K20Rj72QM02
3509B96p5k86r4P6N4k55J74L85m42R8J70km8j84J98Q4j78o0K67l22N90o48L02
3532A00k19KK32l8pk55L44L1j64k40L43j80Q0O8o0j21J11J01k55K52m04K38J79
3555A38n10L95J87p2N3k69K65Q4j53J27l85J62j10%q6J42J34o7j3q9rp1J37j51
3579a61K09q5J36p4j00k7K78l92L58j76J22M9j19J0K48l34k13K12r1J68K62l77
3601i7J72j4N6K6j6O8j78J17j45n1O5K4l8j8Q6m9R7j55K14m36L69p0j74L11r0
3626G4k71J70J51Ql13M20K34l82l19L35k67O3J61m09L99k33L33l15J39J31l64
3647b55J70M45j92L1o1l9k11M6j8L6J42n7P6m1j53Q4Orj73K79k5j76J48j21LN7
$$ y = [97, -18, 150, 85, 93, -19, -283, -41, 21, 28, -394, 119, -73, -53, -186, -48, 71, -27, -135, -103, -171, 49, 58, -114, -106, 296, 221, -65, -159, -83, -29, -284, -110, 275, -167, -69, 101, 99, 51, -133, 65, 149, -29, -89, 178, -144, 446, -202, 100, -119, -117, 115, 77, 70, -185, 159, 190, 26, -214, 129, -51, 29, 97, 37, -84, 27, 128, -127, 125, -279, -41, 138, -372, 23, 210, 138, 191, -78, 187, 271, 118, 245, -140, 22, -88, -88, -174, -32, 102, 35, 22, -67, -76, -147, -10, -161, 48, -37, 99, 25, -75, -102, 176, -216, 142, -34, 88, 137, 18, 28, 276, -58, -271, -59, -150, 18, 280, -97, 75, 61, 117, 143, 127, 195, 17, 134, -11, -62, 3, 27, -11, -29, 57, 8, 105, -50, 164, -272, 97, 27, -147, 164, 74, -197, -27, 124, 132, -181, 239, 473, 91, -228, 107, -160, -97, 64, -345, 54, -179, 154, -161, -22, 109, -255, -85, 360, 168, 199, 138, 99, -112, -66, -84, -48, 94, 37, 113, 72, -81, 3, 9, 0, -173, 106, 81, -95, 53, -68, -65, -8]
3673hn1k8m8k2K56j56n2J95J9o7j94R3K15n3j9k9M5j17J68j49j68M02n06J47J68
3698D1n0J24Q9l22QL04l44Q4J03J85l13J15k31J62K8m2J5K2J02q3n4K56j60K08
3722B47l24K08j42P3J28j55k30K62K33L2k64J19q2l41L92m63J76k3K09Kj02J77
3744A32k30N6j7J18L1J4O0j27p0l16K37J30j58M2krJ99J1K8j18R3k17J18O5J2
3769H2L9l40K19j77J81J74nk49k15L24J0J52l79K74J14j36k44J22J30R6p7l2j47
3792h4K19j50j36J94o5j13l6J36J15k38nl7K51L74m23q5J77M8l08J14l23N48j52
3815B1j5l2J8j41Q2R4J47j16KL07k99r1J91j46p6R6k9Kp0lj36n4J70Q9Q0p2j40
3842a21L2M11l44k72L71k28O5P2J84j38K0Q0k24L19q4j63j7J76k42L9j18J84J91
$$ y = [-8, -59, -87, -135, -157, 99, -57, -109, 86, 105, 38, -156, -63, 152, 99, 80, 51, 96, -21, 147, -2, -170, 232, -274, -127, 41, -9, 115, 204, -118, -110, 194, -150, -66, 37, 222, -91, 24, -207, -45, -17, -59, -44, -22, 80, -3, -57, 199, 39, 247, -77, 131, -11, 62, 190, 35, -195, 67, 300, 332, 68, 187, 105, -236, 156, -307, -131, -154, 55, 57, -45, 132, -98, -42, -59, 59, 90, 104, 164, 37, -33, -349, -112, 18, -140, -98, -100, -109, 90, 101, 129, 11, 104, -113, 5, 70, 82, 121, -219, 0, -177, 4, 178, 173, -76, -291, 33, 43, 195, -184, 90, 204, 68, -176, -54, 76, 172, 95, 63, -84, 135, -15, -151, 43, -22, -135, -171, -35, 80, -158, -163, -200, 51, 425, 2, -83, 94, 142, -166, -52, -375, 173, 21, 6, -26, -8, -149, -67, 27, 174, 58, 60, 367, 68, -23, 168, 22, -54, 42, 13, 15, -55, -58, -194, -248, -78, 11, 91, 19, -121, -89, 322, -22, -294, 77, -151, -86, -14, 170, 32, 52, 132, -92, 227, 143, -20, -37, 139, -103, -64, -182, 2, 193]
3865A93l09M8N7r5K53K18k98J21j03M9Rm45K03J76k71K37O6j17O5o0r2j21K11
$$ y = [193, -116, -68, -11, -106, 147, 365, 67, 188, 85, 134, 143, -302, -99, 77, -194, 43, 109, -8, 57, -3, -95, -216, -5]
$$ [...]
8191a67
##END NTUPLES=NMR FID
##END=
