##TITLE=1H_Pr Adam-m 
 CDCl3, 8 sc, 
 8.04.2021
##JCAMPDX= 6.0         $$ Bruker NMR JCAMP-DX V2.0
##DATA TYPE= NMR FID
##DATA CLASS= NTUPLES
##ORIGIN= UXNMR, Bruker Analytische Messtechnik GmbH
##OWNER= root
$$ XWIN-NMR		Version 3.5
$$ Thu Apr  8 11:34:53 2021 Russian Standard Time (UT+4h)  she@DPX200
##.OBSERVE FREQUENCY= 200.131506
##.OBSERVE NUCLEUS= ^1H
##.DELAY= (6, 6)
##.ACQUISITION MODE= SIMULTANEOUS
##.ACQUISITION SCHEME= undefined
##.AVERAGES= 8
##.DIGITISER RES= 18
##SPECTROMETER/DATA SYSTEM= spect
##.PULSE SEQUENCE= zg30
##.SOLVENT NAME= DMSO
##.SHIFT REFERENCE= (INTERNAL, DMSO, 0, 15.7039)
##AUDIT TRAIL= $$ (NUMBER, WHEN, WHO, WHERE, WHAT)
$$ ##TITLE= Audit trail, XWIN-NMR		Version 3.5
$$ ##JCAMPDX= 5.01
$$ ##ORIGIN= Bruker BioSpin GmbH
$$ ##OWNER= she
$$ F:/spectra/data/she/nmr/H-F/1/audita.txt
$$ ##AUDIT TRAIL=  $$ (NUMBER, WHEN, WHO, WHERE, WHAT)
(   1,<2021-04-08 11:33:39.40 +0400>,<she>,<DPX200>,
      <created by zg, POWCHK disabled, PULCHK disabled
       configuration hash MD5:
       00 E9 B6 7A A2 85 ED C7 34 08 36 98 17 FE 4E 26
       data hash MD5: 16K
       31 32 A8 F3 89 95 E0 02 C7 F9 C7 54 7C 8A E0 29>)
$$ ##END=
$$ 
$$ hash MD5
$$ 08 7C 6C 0A 73 82 37 6F 67 9E BC 41 D3 97 2A 72
##$RELAX= 
##$RELAX= 
##$RELAX= 
##$RELAX= 
##$RELAX= 
##$RELAX= 
$$ Bruker specific parameters
$$ --------------------------
##$DU= <F:/spectra>
##$EXPNO= 1
##$NAME= <H-F>
##$PROCNO= 1
##$TYPE= <nmr>
##$USER= <she>
##$AMP= (0..31)
100 100 100 100 100 100 100 100 100 100 100 100 100 100 100 100 100 100 
100 100 100 100 100 100 100 100 100 100 100 100 100 100 
##$AQSEQ= 0
##$AQ_mod= 1
##$AUNM= <au_zg>
##$AUTOPOS= <>
##$BF1= 200.13
##$BF2= 200.13
##$BF3= 200.13
##$BF4= 200.13
##$BF5= 200.13
##$BF6= 200.13
##$BF7= 200.13
##$BF8= 200.13
##$BYTORDA= 1
##$CFDGTYP= 0
##$CFRGTYP= 5
##$CHEMSTR= <none>
##$CNST= (0..31)
1 1 145 1 1 1 1 1 1 1 1 1 1 1 1 1 1 1 1 1 1 1 1 1 1 1 1 1 1 1 1 1 
##$CPDPRG= <>
##$CPDPRG1= <>
##$CPDPRG2= <>
##$CPDPRG3= <>
##$CPDPRG4= <mlev>
##$CPDPRG5= <mlev>
##$CPDPRG6= <mlev>
##$CPDPRG7= <mlev>
##$CPDPRG8= <mlev>
##$CPDPRGB= <>
##$CPDPRGT= <>
##$D= (0..31)
0 1.2 0 0 0 0 0 0 0 0.06 0 0.03 0 0 0 0 0.0002 0 0 0 0 0 0 0 0 0 0 0 0 
0 0 0 
##$DATE= 1617867218
##$DBL= (0..7)
120 120 120 120 120 120 120 120 
##$DBP= (0..7)
150 150 150 150 150 150 150 150 
##$DBP07= 0
##$DBPNAM0= <>
##$DBPNAM1= <>
##$DBPNAM2= <>
##$DBPNAM3= <>
##$DBPNAM4= <>
##$DBPNAM5= <>
##$DBPNAM6= <>
##$DBPNAM7= <>
##$DBPOAL= (0..7)
0.5 0.5 0.5 0.5 0.5 0.5 0.5 0.5 
##$DBPOFFS= (0..7)
0 0 0 0 0 0 0 0 
##$DE= 6
##$DECBNUC= <off>
##$DECIM= 32
##$DECNUC= <off>
##$DECSTAT= 4
##$DIGMOD= 1
##$DIGTYP= 9
##$DL= (0..7)
0 120 120 120 120 120 120 120 
##$DP= (0..7)
150 150 150 150 150 150 150 150 
##$DP07= 0
##$DPNAME0= <>
##$DPNAME1= <>
##$DPNAME2= <>
##$DPNAME3= <>
##$DPNAME4= <>
##$DPNAME5= <>
##$DPNAME6= <>
##$DPNAME7= <>
##$DPOAL= (0..7)
0.5 0.5 0.5 0.5 0.5 0.5 0.5 0.5 
##$DPOFFS= (0..7)
0 0 0 0 0 0 0 0 
##$DQDMODE= 0
##$DR= 18
##$DS= 0
##$DSLIST= <SSSSSSSSSSSSSSS>
$$ [...]
##$SUBNAM2= <"">
##$SUBNAM3= <"">
##$SUBNAM4= <"">
##$SUBNAM5= <"">
##$SUBNAM6= <"">
##$SUBNAM7= <"">
##$SUBNAM8= <"">
##$SUBNAM9= <"">
##$SW= 16.9725357007746
##$SWIBOX= (0..15)
0 0 2 0 0 0 0 0 0 0 0 0 0 0 0 0 
##$SW_h= 3396.73913043478
##$TD= 16384
##$TD0= 1
##$TE= 0
##$TE2= 300
##$TE3= 300
##$TEG= 300
##$TL= (0..7)
0 120 120 120 120 120 120 120 
##$TP= (0..7)
150 150 150 150 150 150 150 150 
##$TP07= 0
##$TPNAME0= <>
##$TPNAME1= <>
##$TPNAME2= <>
##$TPNAME3= <>
##$TPNAME4= <>
##$TPNAME5= <>
##$TPNAME6= <>
##$TPNAME7= <>
##$TPOAL= (0..7)
0.5 0.5 0.5 0.5 0.5 0.5 0.5 0.5 
##$TPOFFS= (0..7)
0 0 0 0 0 0 0 0 
##$TUNHIN= 0
##$TUNHOUT= 0
##$TUNXOUT= 0
##$USERA1= <user>
##$USERA2= <user>
##$USERA3= <user>
##$USERA4= <user>
##$USERA5= <user>
##$V9= 5
##$VALIST= <valist>
##$VCLIST= <CCCCCCCCCCCCCCC>
##$VD= 0
##$VDLIST= <DDDDDDDDDDDDDDD>
##$VPLIST= <PPPPPPPPPPPPPPP>
##$VTLIST= <TTTTTTTTTTTTTTT>
##$WBST= 1024
##$WBSW= 4
##$XGAIN= (0..3)
0 0 0 0 
##$XL= 0
##$YL= 0
##$YMAX_a= 866998
##$YMIN_a= -930962
##$ZGOPTNS= <>
##$ZL1= 120
##$ZL2= 120
##$ZL3= 120
##$ZL4= 120
##$ABSF1= 10
##$ABSF2= 0
##$ABSG= 5
##$ABSL= 3
##$ALPHA= 0
##$AQORDER= 0
##$ASSFAC= 0
##$ASSFACI= 0
##$ASSFACX= 0
##$ASSWID= 0
##$AUNMP= <proc_1d>
##$AZFE= 0.1
##$AZFW= 0.1
##$BCFW= 1
##$BC_mod= 2
##$BYTORDP= 1
##$COROFFS= 0
##$CY= 11.3945322036743
##$DATMOD= 1
##$DC= 2
##$DFILT= <>
##$DTYPP= 0
##$F1P= 15.9154993809931
##$F2P= -4.1035820241983
##$FCOR= 0.5
##$FTSIZE= 0
##$FT_mod= 4
##$GAMMA= 1
##$GB= 0.15
##$INTBC= 1
##$INTSCL= 1
##$ISEN= 128
##$LB= 0.24
##$LEV0= 0
##$LPBIN= 0
##$MAXI= 10000
##$MC2= 0
##$MEAN= 0
##$ME_mod= 0
##$MI= 1.114404
##$NCOEF= 0
##$NC_proc= 0
##$NLEV= 6
##$NOISF1= 3.799351
##$NOISF2= 2.8
##$NSP= 1
##$NTH_PI= 0
##$NZP= 0
##$OFFSET= 15.70392
##$PC= 1
##$PHC0= -11123.13
##$PHC1= 15.00092
##$PH_mod= 1
##$PKNL= yes
##$PPARMOD= 0
##$PSCAL= 0
##$PSIGN= 0
##$REVERSE= no
##$SF= 200.130013532006
##$SI= 16384
##$SIGF1= 3
##$SIGF2= 2
##$SINO= 400
##$SIOLD= 16384
##$SREGLST= <1H.CDCl3>
##$SSB= 0
##$STSI= 0
##$STSR= 0
##$SW_p= 3612.71676300578
##$SYMM= 0
##$S_DEV= 0
##$TDeff= 0
##$TDoff= 0
##$TI= <>
##$TILT= no
##$TM1= 0
##$TM2= 0
##$TOPLEV= 0
##$USERP1= <user>
##$USERP2= <user>
##$USERP3= <user>
##$USERP4= <user>
##$USERP5= <user>
##$WDW= 1
##$XDIM= 8192
##$YMAX_p= 0
##$YMIN_p= 0
$$ End of Bruker specific parameters
$$ ---------------------------------
##NTUPLES= NMR FID
##VAR_NAME=  TIME,          FID/REAL,        FID/IMAG
##SYMBOL=    X,             R,               I
##VAR_TYPE=  INDEPENDENT,   DEPENDENT,       DEPENDENT
##VAR_FORM=  AFFN,          ASDF,            ASDF
##VAR_DIM=   8192,          8192,            8192
##UNITS=     SECONDS,       ARBITRARY UNITS, ARBITRARY UNITS
##FACTOR=    0.0002944,     1,               1
##FIRST=     0,             0,               0
##LAST=      2.4114304,     0,               0
##MIN=       0,             -930962,         0
##MAX=       2.4114304,     866998,          0
$$ Real data points
##PAGE= N=1
##DATA TABLE= (X++(R..R)), XYDATA
0@%%%%%%qJ6j6J6j6K4m0M8n6P2q8J11j39J65j95K33k75L24l83M47n17N96o84P85
$$ 0 0 0 0 0 0 0 -8 8 -8 8 -8 16 -24 24 -32 40 -48 63 -76 89 -106 127 -148 176 -207 240 -277 319 -365 420
30D20r01J028j166J316j483J669j875K100k345K612k904L226l577L959m374M830
$$ 420 -481 547 -619 697 -786 883 -992 1108 -1237 1375 -1529 1697 -1880 2079 -2295 2535
46B535n330N875o472P128p852Q651r535J0521j1626J2876j4302J5940j7848K0102
$$ 2535 -2795 3080 -3392 3736 -4116 4535 -5000 5521 -6105 6771 -7531 8409 -9439 10663
60A0663k2812K6144l0350L5840m3328N4162p1208J01811j72180N85927M4436j450067
$$ 10663 -12149 13995 -16355 19485 -23843 30319 -40889 60922 -111258 474669 519105 -930962
72i30962J431203j1256j257530J120903J11020j158560J057178J8967j000364
$$ -930962 500241 488985 -768545 352358 463378 -695182 361996 380963 -619401
81f19401R57255N5152r78127Q58164J09657q93251O73752J64884p37447N29076
$$ -619401 337854 393006 -585121 273043 382700 -510551 163201 328085 -409362 119714
91A19714J21559n40791L94810R0984m28973L13751N6679l10567J97333N9228j73447
$$ 119714 241273 -299518 95292 186276 -242697 71054 127733 -182834 14499 73727 -99720
102i9720P0909N1760l2721k4893N494Q4249j00666l8914J91994j79122m4582K71978
$$ -99720 -28811 22949 -9772 -34665 -29171 55078 -45588 -84502 107492 -71630 -116212 155766
114A55766k28739o5053L43553k69827r6543M03943l07265j13887M22843l08797
$$ 155766 -72973 -138026 205527 -64300 -160843 243100 -64165 -178052 244791 -64006
124f4006j17803M29134l05716j06901M29500l33795p4442M05860l49901m5947
$$ -64006 -181809 247325 -58391 -165292 264208 -69587 -144029 261831 -88070 -134017
134a34017L84524l49073k5798L60924l45280K6486L03223l47650Q6122K49422
$$ -134017 250507 -98566 -124364 236560 -108720 -82234 220989 -126661 -40539 208883
144B08883l75977J36603K47168m17120J74038K50638m20105J74035K26683l81605
$$ 208883 -167094 -30491 216677 -200443 -26405 224233 -195872 -21837 204846 -176759
154a76759J75825J77178l67921K19402J26563l71416K64957J13379l75471K63682
$$ -176759 -934 176244 -191677 27725 154288 -217128 47829 161208 -214263 49419
164D9419J22374l77222K50727J11096l47914K42101P9721l11187K34845P0360
$$ 49419 171793 -205429 45298 156394 -191520 50581 130302 -180885 53960 124320
174A24320k92403K31637N7070k71747K11042L9454k35772J81584M7265k14023
$$ 124320 -168083 63554 120624 -151123 59919 99373 -136399 45185 92450 -121573
184a21573J54306N9517j89631J10357P2725j39594L6272Q0369q3715j6333O6973
$$ -121573 32733 92250 -97381 12976 85701 -53893 -17621 62748 -20967 -37300 29673
195B9673k2318m2060M2633K9324p7921L4929O2173j07573K9418R6192j33135J2238
$$ 29673 7355 -34705 7928 37252 -40669 -5740 56433 -51140 -21722 74470 -58665 -46427
207d6427J41545j55511Q895J62331j70530J1414J64934j90686K0637J88118k30182
$$ -46427 95118 -60393 -51498 110833 -59697 -48283 116651 -74035 -53398 134720 -95462
218i5462M0788K13176k65698M7269K39658k82855L1104K65656l00101K4219K76518
$$ -95462 -54674 158502 -107196 -59927 179731 -103124 -72020 193636 -106465 -82246 194272
229A94272l02951K4175K80986k95659J1017K89951k96490K980K88139k86674l468
$$ 194272 -108679 -84504 196482 -99177 -88160 201791 -94699 -91719 196420 -90254 -93722
240i3722K71777k59320j1893K58554k39822n224K34856k27982M233K04925k07195
$$ -93722 178055 -81265 -93158 165396 -74426 -79650 155206 -72776 -68543 136382 -70813
251g0813K937J91635j91320N457J74775j73922J0807J48721j48528K599J35115
$$ -70813 -67876 123759 -67561 -62104 112671 -61251 -50444 98277 -50251 -47652 87463
262H7463j32803n287J25167j10302j0919J05375p0412l1508Q5073l7472m1855
$$ 87463 -45340 -50627 74540 -35762 -46681 58694 -11718 -43226 41847 4375 -37480
273c7480N7992q675l7746K4451K3676m0978N586M7215m5092r653O2147m6796l3316
$$ -37480 20512 11837 -25909 -1458 22218 -18760 -13174 34041 -11051 -20704 41443 -5353 -38669
286c8669Q7995n5853m2109J07058o3720m5613J15397o7827n3957J33602q5817
$$ -38669 49326 -6527 -48636 58422 -5298 -50911 64486 -3341 -57298 76304 -9513
297i513n5071J49341j03678n3401J64733j07599o4471J84289j19412p3517J98025
$$ -9513 -64584 84757 -18921 -72322 92411 -15188 -79659 104630 -14782 -88299 109726
308A09726j27324p5763K03187j23775q9142K15008j21999r5876K20647j19270
$$ 109726 -17598 -93361 109826 -13949 -103091 111917 -10082 -105958 114689 -4581
318d581r9003K07984j05554j04101K00831r4739r9525J89510r1404q7250J70039
$$ -4581 -103584 104400 -1154 -105255 95576 837 -98688 90822 -582 -87832 82207
329H2207p9883q3459J57802p5457q0381J48369p0904o9261J33372n6260p2639
$$ 82207 2324 -81135 76667 1210 -79171 69198 -1706 -70967 62405 6145 -66494
340f6494J22393m5078p6300J13382l3367p3962R1603r878p7384P2698J4602p6827
$$ -66494 55899 10821 -65479 47903 14536 -59426 32177 22299 -55085 17613 32215 -44612
352d4612N1331K8016o7384K0815M7054n8470q62O1449n1732j6606O6288l7417
$$ -44612 6719 34735 -32649 -11834 35220 -23250 -24112 37337 -14395 -31001 35287 -2130
364b130l6641P5571l1212n1458Q0075k7664n3935P9346j8954o1595Q4482k0853
$$ -2130 -38771 36800 5588 -45870 34205 6541 -47394 31952 12998 -48597 35885 15032
376A5032o7355R1783k4765o7988R2026k1210p6360J00861k1191q3422J11888k4539
$$ 15032 -52323 39460 14695 -53293 38733 17523 -58837 42024 20833 -62589 49299 24760
388B4760r0210J12113j5010j03263J12701l535j08193J07475J038j00843R4328
$$ 24760 -65450 46663 31653 -71610 41091 37556 -70637 36838 37876 -62967 31361
399C1361P672r9275Q7938J1812j00600Q3371J4698r1229O7763K3498q2824N5661
$$ 31361 39033 -60242 27696 39508 -61092 22279 36977 -54252 13511 37009 -45815 9846
411I846K1898p4302N3799J2338o4726M9698J5627o6245M6544K3078o7263M2820
$$ 9846 31744 -42558 11241 23579 -41147 8551 24178 -42067 4477 27555 -39708 3112
423C112K3280o0568L1612K8057n8437K5063L7497n8396J6772M1736m6252k676
$$ 3112 26392 -34176 -2564 25493 -32944 -7881 29616 -28780 -12008 29728 -16524 -19200
435a9200M6164l2626j5893M4778k6042j7681L9527j7034k2665M2199j2890l2532
$$ -19200 26964 -5662 -21555 23223 -2819 -20500 19027 1993 -20672 21527 8637 -23895
447b3895M3646p116l5946L4677O688l7913K6209J0155l4286K7571K855k8591K7735
$$ -23895 19751 12635 -23311 11366 18054 -19859 6350 16505 -17781 9790 12645 -15946 11789
460A1789J44l5566L5649L289m6402M4298P112n2721L9220J9256n8926L3833K9361
$$ 11789 11933 -23633 12016 15305 -31097 13201 20313 -32408 6812 26068 -32858 975 30336
473C0336o1736K8207K8682n2815K2867L1232n1504K0222L4680n5866J7734L8861
$$ 30336 -31400 -3193 25489 -27326 -4459 26773 -24731 -4509 30171 -25695 -7961 30900
485C0900m9313M478M3677m0345n276M0727l2059P22K6378k7836M807K2209k9848
$$ 30900 -18413 -13935 29742 -10603 -15879 24848 -7211 -6489 19889 -7947 -3140 19069 -10779
498a0779O654K7148l4357O952K6330l0856J849K9672k9234n026L6708l3661q740
$$ -10779 -4125 23023 -11334 -4382 21948 -8908 -7059 22613 -6621 -11647 25061 -8600 -17340
511a7340L9280k3887j8724L7852j3133k5793L4484j0522k1119K7668m875k5361
$$ -17340 21940 -1947 -20671 17181 4048 -21745 12739 2217 -18902 8766 3891 -21470
523b1470K6510L847l2506K5544J1838l0738R838K0132k1903j343J7956j2682K466
$$ -21470 5040 8887 -23619 1925 13763 -16975 -7137 12995 -8908 -10251 7705 -4977 -2511
536b511N866q839P244N597j4676Q976J2293k2256Q039J4237j7845J941J6538j4815
$$ -2511 3355 -5484 1760 7357 -7319 1657 13950 -8306 -267 13970 -3875 -1934 14604 -211
550b11k000J8758j7232j766J7611j3527o192J7796j0328j0269K1021j1669q630
$$ -211 -2211 16547 -685 -2451 15160 1633 -4559 13237 2909 -7360 13661 1992 -6638
563f638J7712p184j3404J6587j680j8558J6585J694j4344P122M820q800K556K240
$$ -6638 11074 3890 -9514 7073 5393 -13165 3420 5114 -9230 -2108 2712 -6088 -3532 -1292
577a292n693P425o816j224Q439o633l655J0973k506j0060J3617l526q984J1799
$$ -1292 -6985 440 -6376 -7600 839 -5794 -9449 1524 -982 -11042 2575 -951 -9935 1864
591A864N8j1078J0685M164j5027J2877L086j2810R921N689j3723L945J2390j4227
$$ 1864 1922 -9156 1529 5693 -9334 3543 6629 -6181 3740 9429 -4294 -349 12041 -2186
605b186J432J2295q303n840J1460j737r841R412q21m017J198l40p02P07k23j439
$$ -2186 -754 11541 3238 -2602 8858 7121 -2720 6692 5871 1854 3052 2712 2010 2717 2494 1055
621A055L091m138k29J389k057P45J71k355k17M295p767K208P161p059k918Q473
$$ 1055 4146 8 -221 1168 -889 -144 27 -2328 -2545 1750 -6017 -3809 3352 -3707 -6625 1848
637A848l701r117J2841j748j0117R802L189j2262O139R245j4327M627R401j0766
$$ 1848 -1853 -10970 1871 123 -9994 -192 2997 -9265 -3126 6119 -8208 -3581 5820 -4946
651d946k356J2074m887o776J1942l864n428O302N57n017M306R90m850N262l248
$$ -4946 -7302 4772 -115 -6891 5051 1187 -4241 2061 2618 -2399 1907 2897 -1953 3309 61
666F1k75L935k376j540M737l258m884R652n123m661R438l077p673R599L12j1893
$$ 61 -214 3721 1345 -195 4542 1284 -3600 6052 929 -3732 5706 2629 -5044 4555 4867 -7026
682g026J1992M78j2715Q682N649j4292N844J1635j6958L908J1950j2893j977J3690
$$ -7026 4966 5444 -7271 1411 7060 -7232 -1388 10247 -6711 -2803 9147 -3746 -5723 7967
696G967r121n776J3898p430n270R847k184p268Q945q88q780R626k464n314O014
$$ 7967 -1154 -6930 6968 -462 -5732 4115 1931 -5337 3608 2720 -6060 3566 1102 -4212 1802
711A802j90m963N661j224n756Q721m367m195Q249k668p996J0262j27j2630J3061
$$ 1802 1612 -3351 2310 1086 -4670 4051 -316 -4511 3738 1070 -6926 3336 3209 -9421 3640
726C640J260j3533R510N875j5595O756J1079j8184O415J1431j5538J373J4676
$$ 3640 4900 -8633 877 6752 -8843 -2087 8992 -9192 -2777 8654 -6884 -5511 9165
739I165j3655k810J6995j3706l102J3649p469n880J3116n910p604J3429o870m289
$$ 9165 -4490 -7300 9695 -4011 -7113 6536 -933 -6813 6303 393 -7211 6218 -652 -4941
753d941J0208m689n626J0396m784o265J2906p564l421J0933p140n126J2905o758
$$ -4941 5267 578 -5048 5348 564 -5701 7205 -359 -3780 7153 13 -5113 7792 1034
767A034p915J6549q369q973J5691m160j2707J5195J197j7333J4199K251j4847
$$ 1034 -6881 9668 1299 -7674 8017 3857 -8850 6345 7542 -9791 4408 6659 -8188
780h188R791O121j3904N530Q709j4626N144P820j0325J252P973q318p77P890p559
$$ -8188 1603 7724 -6180 -650 8059 -6567 -1423 6397 -3928 -2676 5297 -3021 -3798 4092 -3467
795c467J863M584n548N16M486n638O07O971q885K342O206q496J228Q987q696k136
$$ -3467 -1604 2980 -2568 -2052 2434 -3204 -2597 4374 -4511 -2169 4037 -4459 -3231 5756 -2940 -5076
811e076J2523j0629k671J2326p331n691J2696m475r935J4506m604q531J1944j519
$$ -5076 7447 -3182 -5853 6473 -858 -6549 6147 1672 -8263 6243 1639 -6892 5052 3533
825C533j0142R499J090j0811J0431l24p819P388l01o597O904m45p989J0422m069
$$ 3533 -6609 2890 3980 -6831 3600 3276 -4543 2845 2544 -4053 2851 2406 -5583 4839 770
840G70n768R727l754o547J0559k960r603J3622m348j0281J3842j093j3210J2119
$$ 770 -4998 4729 975 -5572 4987 2027 -7576 6046 1698 -8583 5259 4166 -9044 3075
854C075L702j6405J1653M754j3828P380O029j1981M225Q296j2741N054O835j0156
$$ 3075 6777 -9628 2025 6779 -7049 331 6360 -5621 -1396 6900 -5841 -787 6048 -4108
868d108J981P453p625j149Q572p655Q31N255o371J459N010p112J209Q495j0919
$$ -4108 -2127 5326 -2299 -3448 5124 -2531 -1700 3555 -2816 -1357 3653 -3459 -2250 6245 -4674
883d674J441R367j0664p5J1567r930l896J5417j2006m565J6783r863q048J6866
$$ -4674 -3233 6134 -4530 -4605 6962 -2968 -6864 8553 -3453 -8018 8765 -1098 -9146 7720
897G720n734j3341J8701m417j2975J6257j422j4303J4608M71j5643J6019j0j5046
$$ 7720 1986 -11355 7346 2929 -10046 6211 4789 -9514 5094 5565 -10078 5941 5931 -9115
911i115J3744J294j3540J1561K875j4028J1922R93j2651J1375Q88j2577J1586
$$ -9115 4629 5923 -7617 3944 6819 -7209 4713 5706 -6945 4430 5318 -7259 4327
924D327L131j7018J3801K989j6794J2263N966j7660P970J0709j8770O121J2093
$$ 4327 7458 -9560 4241 7230 -9564 2699 8665 -8995 -1025 9684 -9086 -2965 9128
937I128j5636K086J2446j3088j955J5334j2932k662J4972j0654n979J4615n661
$$ 9128 -6508 -4422 8024 -5064 -7019 8315 -4617 -7279 7693 -2961 -8940 5675 14
950A4r709J5145n101r000J1991k527q376J0912j014j0540J3016k999r966J3206
$$ 14 -9695 5450 349 -8651 3340 813 -7563 3349 2335 -8205 4811 1812 -8154 5052
964E052j740j1081J2289M64j4228J4834K34j5044J4914J996j7351J3022O822k0125
$$ 5052 3312 -7769 4520 4984 -9244 5590 5824 -9220 5694 7690 -9661 3361 10183 -9942
978i942J2676P651j8578R425Q450j7004P029J1630j8875O984J0823j7259M646
$$ -9942 2734 10385 -8193 1232 9682 -7322 -293 11337 -7538 -554 10269 -6990 -2344
991b344J2008j4548J382J2267j3700K313R561j1763L073P748j0840J556J0882
$$ -2344 9664 -4884 -3502 8765 -4935 -2622 6939 -4824 -1751 5997 -4843 -3287 7595
1004G595j3454J849J2330j3230J55J2674j1390k970J5024j1703l493J4639r775
$$ 7595 -5859 -4010 8320 -4910 -4755 7919 -3471 -6441 8583 -3120 -6613 8026 -1749
1017a749m718J2899n224r332J4680m059j0530J3016j296j0932R907L092j3379
$$ -1749 -6467 6432 1208 -8124 6556 2497 -8033 4983 3687 -7245 2662 5754 -7625
1030g625R772L307j1677P216M040r853M334N905j0520M908M471q726M510M129
$$ -7625 2147 5454 -6223 993 5033 -4820 -486 5419 -5101 -193 4278 -4448 62 4191
1044D191q663L615N599j0663N482N564j0871N170O213j1230L509R437j3218L225
$$ 4191 -4472 -857 4742 -5921 -439 5125 -5746 -576 5637 -5593 -2084 7353 -5865 -2640
1058b640R927j2597K463J0052j1061n3J2240j1542o50J1430r888j188J0133o995
$$ -2640 7287 -5310 -2847 7205 -3856 -3909 8331 -3211 -3861 7569 -2319 -3507 6626 -369
1072c69l803J0724p440k428R344p002r81P578o575j837Q738p400j153Q678p691
$$ -369 -4172 6552 -888 -3316 6028 -974 -1955 5623 -952 -2789 5949 -1451 -2604 6074 -1617
1087a617j168Q112n958l215R993o871m127J0596o359m503Q964k295p343R381j995
$$ -1617 -2785 5327 -631 -3846 6147 -724 -4851 5745 -614 -5117 3847 1552 -5791 3590 1595
1102A595p908Q439P4p108N024L004q615M610L989p595L460L784n890J102N027
$$ 1595 -6313 2126 2200 -4908 116 3120 -5495 -885 3104 -4491 -1031 2753 -3137 -2035 2992
1117B992o372J893M524n627J365M051n517N67O561p369J364O767q670J340P582
$$ 2992 -3380 -1487 3037 -2590 -1225 2826 -2691 -2124 4437 -2932 -1568 5199 -3471 -2131 5451
1132E451p664r87J0402r325k003J1552q791k962J1284o604o319J3279o210o979
$$ 5451 -2213 -3200 7202 -2123 -4126 7426 -1365 -4327 6957 353 -5966 7313 1103 -5876
1146e876J2536m900p440J0798k172q911J0619j952q006R572k381o371P221l99
$$ -5876 6660 1760 -5680 5118 2946 -5965 4654 2702 -5304 4268 1887 -4484 2737 2338
1160B338p265P590j292o009P803k563m871O366q76o199P380j130o752P611q39
$$ 2338 -4927 2663 1371 -4638 3165 602 -4269 2097 1221 -4978 2402 1272 -5480 2131 1292
1175A292o111N771J680p727N304K693p630N059K595o182J880M554o105J003N127
$$ 1292 -4819 952 2632 -5095 209 2902 -4728 331 2926 -3256 -1376 3178 -2927 -1924 3203
1190C203n135L83M028k896j899M926k832j532M361k820r27K795j067j915L736
$$ 3203 -1932 -1549 2479 -417 -2316 2610 -222 -1754 2607 -213 -1140 1655 588 -1327 2409
1205B409k397j383M423l485p79L997k387k123N187l257k795O117l293k518N032
$$ 2409 12 -1371 3052 -433 -1212 2785 398 -1725 3462 205 -2590 3527 234 -2284 2748
1220B748j490m525O188j492n058O157j094m476M026J052n225M496R44n205L912
$$ 2748 1258 -3267 2921 1429 -3629 2528 1434 -3042 984 2036 -3189 1307 2251 -2954 958
1235I58M2l360K655Q97l595L187J87l744M007q54k763L424M3m165L796O61n156
$$ 958 1000 -2360 295 1192 -2403 784 971 -2773 1234 380 -2383 1041 1084 -3081 715 1376 -3780
1252c780M869M63m534K742L011o305L010L857o774L120L103m997Q2N467m929o41
$$ -3780 1089 1552 -2982 -240 2771 -3534 -524 3333 -3441 -321 2782 -2215 -2133 3334 -1595 -2236
1268b236N538m318j412M632k353k398N451k519k704M925k723j562L963j490k711
$$ -2236 3302 -1016 -2428 2204 -149 -2547 2904 385 -2319 2606 -117 -1679 2284 794 -1917
1283a917M490k330k440M976k615j896M321j861k877M830j861l846O147j720m208
$$ -1917 2573 243 -2197 2779 164 -1732 2589 728 -2149 2681 820 -3026 3121 1401 -2807
1298b807N007N1n525M924J094o288M935R18n180L136K421n334K459L040n349K171
$$ -2807 2200 2251 -3274 1650 2744 -3544 1391 2309 -2871 265 2686 -2648 -189 2851 -2498 -327
1314c27K312l674L29L384l445L07K676l238J157J677k029j17K532k703k3L167
$$ -327 1985 -1689 -1360 2024 -1421 -1114 1562 -1676 -519 1158 -871 -988 1544 -1159 -1182 1985
1330A985l546P12K479k464n69L248k927o61M180l373p32L253j676k470M483j367
$$ 1985 -1561 -849 1630 -834 -1403 1845 -1082 -1743 2437 -936 -1668 1585 -91 -2561 1922 555
1346E55l146M300j477k245L135M0l247K708Q76l682K959J14k129J405J016k405
$$ 555 -2591 1709 232 -2013 1122 1162 -2085 623 1499 -2183 776 890 -1239 166 1182 -1223
1362a223J430R46k617J765P87j983J218Q41k600J787J115k975K054R06k957J655
$$ -1223 207 1153 -1464 301 1088 -895 323 1164 -1436 351 1466 -1509 545 1451 -1506 149
1378A49J903l318R40K746l773Q48K657k894j66L479l018r75L416k307q70K315
$$ 149 2052 -1266 -326 2420 -1353 -505 2152 -742 -908 2571 -447 -1422 1994 -313 -1183 1132
1394A132l89k178K404l03k460K509n82r94J037J07j297J005K32j448J853j058
$$ 1132 743 -1435 969 666 -1794 715 133 -861 176 283 -1014 -9 223 -1225 628 -430
1410d30j53M61m12n26J299j78j678K242j159o70J703l89j470J561N22k457J889
$$ -430 -583 -122 -534 -1060 239 61 -1617 625 -534 -1204 499 110 -1360 201 723 -1734 155
1427A55K00j430Q96J238j955N62J648j861N74Q14o90n40J160l81n87P89m6l7q8
$$ 155 355 -1075 -179 1059 -896 -334 1314 -547 27 841 151 -389 771 390 -197 592 546 509 421
1446D21L2j77K20k77j9J043j261N10j6p27P64J93r57N3O88j053O21K81l64l36
$$ 421 453 276 496 219 200 1243 -18 492 476 -251 513 706 -251 -198 490 -563 58 339 -25 -361
1466c61P99n91p89J512o92o29Q21n5q81N43L85j007Q87k34k27j05N19k36j42M16
$$ -361 438 -153 -942 570 -122 -751 70 15 -866 -323 62 -945 -58 -292 -519 -624 -105 -341 -483 -67
1486f7o41O17l17K4o0L01o2K9L49o83R14k85n98N63N51r81M17Q82j922J235N39
$$ -67 -708 -91 -408 -384 -444 -143 -205 -176 173 -510 404 119 -479 84 635 -346 71 953 -969 266 805
1507H05r22n9J022n95p21J702j256k04J115m29p72O42j5p74J314p65O1J59M7L4
$$ 805 -117 -176 846 251 -470 1232 -24 -228 887 458 -314 328 313 -461 853 88 149 308 355 389
1527C89q6k50N0M10p31M02J19p43M76L85p03j92J183j029j68Q72l12n81N16J91
$$ 389 303 53 103 513 -218 184 303 -440 36 421 -282 -474 709 -320 -488 384 72 -509 7 198
1547A98j125J033j38l70K91L12q51k59J542j060O1J54N5n10M51L14r12Q98N2n21
$$ 198 -927 106 -32 -402 -111 201 -650 -909 633 -427 -366 -212 -157 -667 -216 98 -814 84 136 -385
1567c85L5P21p64J91M80n26K44q3J68j16K92l31Q1M77n93M03k23J96p7L00p22
$$ -385 -350 371 -393 -202 278 -248 -4 -87 81 -35 257 -74 7 484 -109 294 71 267 190 490 -232
1588b32L68N50q72O25mo65K73Q23q93m0J143j260L40N45p98JQ47l77j010J426
$$ -232 136 686 -186 439 435 -230 43 866 -27 -67 1076 -184 156 701 -97 -96 751 374 -636 790
1608G90p57j29K51o0j51J38J16n19M80l14M64k67l7l69L54N2m12O57n25J51J42
$$ 790 33 -96 155 95 -56 82 198 -321 159 -155 309 42 5 -364 -10 42 -370 287 -238 -87 55
1629E5l36j5K85J16m83O11k71l59L78j21l43K46M25n09m1P64q04j03P40k42p03
$$ 55 -281 -296 -11 105 -378 233 -38 -397 -19 -140 -483 -237 188 -321 -362 402 -402 -505 235 -7 -710
1650g10J232o16L8J4J31k09K93J29m06K28n8j09P2m4n8M01k81k27Q93r26M13M41
$$ -710 522 -94 -56 -42 89 -120 173 302 -104 124 66 -43 29 -15 -73 328 47 -180 713 -213 200 641
1672F41m32k79N77j92n77J071p15k69N94M8p66N28J27q13O84O5o45L27M36o70
$$ 641 209 -70 507 315 -262 809 94 -175 419 467 -299 229 356 -457 227 292 -353 -26 410 -260
1692b60J2O78r37N42m9j9j34L00j65k78K70k69J73j2J43O5m69J91j73L15l89L57
$$ -260 -248 430 -507 35 -14 -33 -167 133 -32 -310 -40 -309 -136 -148 -5 60 -409 -218 -391 -76 -465 -108
1714a08K8m40L28K72l54k48J067j186N61M12n75M0M75k53n76R09n07k44O03J90
$$ -108 -80 -520 -192 80 -274 -522 545 -641 -80 332 -243 -203 272 19 -557 352 -155 -399 204 394
1734C94o56L01L57q25Q60n41K31M2Jl63L86J13l52M52l35j34L79j16l55M97K95
$$ 394 -262 39 396 -429 431 -110 121 163 164 -199 187 300 -52 400 65 -69 310 194 -161 336 631
1755F31r80O34P4l81L72p2l88p4R91j139M87J75n82K94L56m98j15L63m77K91K83
$$ 631 -349 285 359 -22 350 278 -110 -184 807 -332 155 330 -252 42 398 -100 -215 148 -329 -38 245
1776B45k99k70K34j88q5O17o27J97j06K44J5L7l63J8O18p53L88p1r0j68N13k05
$$ 245 -54 -324 -90 -278 -363 254 -373 -176 -282 -38 -23 14 -349 -331 287 -466 -78 -149 -239 -407 106 -99
1798i9k61J052m60o17M41J23n29N56J41q46J050l80m48L53M55n18p6L00l14J06
$$ -99 -360 692 232 -385 56 179 -350 206 347 -499 551 171 -277 76 531 13 -63 237 -77 29
1818B9N00n19L05P6m54q8M48j60Q8k28l2J91k35J31j15L77n86L72k09j6J42K25
$$ 29 529 10 315 391 -63 -151 297 137 225 -3 -35 156 -79 52 -63 314 -272 100 -109 -125 17 242
1840B42k35j73M88o10J47L01l24j99O62k29m15N51o01K40K31k01j15K82ql85M31
$$ 242 7 -166 322 -288 -141 160 -164 -363 299 70 -345 206 -395 -155 76 -125 -240 42 34 -351 80
1861H0m04K51J30j94R8j03J63o29P44j05l93P25o97K13OJ92l87N75j68k63K12
$$ 80 -324 -73 57 -137 -39 -142 21 -608 136 31 -362 363 -334 -121 -115 77 -310 265 97 -166 46
1882D6J51l83L35M1o38P52l19j16J11L21m62J98N42o75J20L26k92l1J02j49j11
$$ 46 197 -186 149 190 -448 304 -15 -131 -20 301 -161 37 579 -96 24 350 58 27 129 -20 -131
1903a31O42o76L81l0k1k20K45j90K04J11n62M20J17n94J17L44m9l33N08n07P2
$$ -131 511 -165 216 186 165 -55 190 0 204 315 -247 173 290 -304 -187 157 108 -225 283 -224 -152
1924a52K01l08J43L12K72r16M71j91j96K22qN7P0j01j78K23P2j97K63J3j56j98
$$ -152 49 -259 -116 196 468 -448 23 -168 -364 -142 -150 -93 -23 -124 -302 -79 -7 -204 59 72 -84 -282
1946b82P7k81L44J24j6j4r9j58O7L74l23j03O85l60p9k47P9n1M98m97L25R7l92
$$ -282 -205 -486 -142 -18 -34 -48 -147 -305 -238 136 -187 -290 395 35 -44 -291 -212 -263 235 -262 63 160 -232
1969b32K81K13j98k53N70k95m5N86o66lN9J85k96K75Mj93J81j39o0K29Qk94J29
$$ -232 49 262 64 -189 381 86 41 627 -39 -42 17 202 -94 181 185 -8 173 34 -26 203 211 -83 46
1992D6rK46r4r1Ol22M29l66J52o2J93j53R2N1j52L88o37L76k33j46J92p7j23n2
$$ 46 37 283 189 98 104 -218 211 -155 -3 -65 128 -25 67 118 -34 354 -283 93 -140 -286 -94 -171 -294 -346
2016c46O56o92O05l38m4J69k58J93j37J80j87L04J36n63K83P1j18l3K89m88L84
$$ -346 310 -382 223 -115 -159 10 -248 -55 -192 -12 -199 105 241 -322 -39 32 -86 -119 170 -318 66
2037F6K9l66M94j30j42J18K68m42J28K33l02k9L64j45J17K93m85J18J14m17L03
$$ 66 95 -271 223 93 -49 69 337 -105 23 256 -46 -75 289 144 261 554 69 187 301 -116 187
2058A87l77K88RN9q0j51O8q9K22l26M19k16J93l82J94m67M82K8k09J67n4J82l94
$$ 187 -190 98 107 166 86 -65 3 -86 136 -190 229 13 206 -176 18 -449 33 61 -148 19 -35 147 -247
2081b47J97j01l6L35l03K78k35l19M23P6J22n1l95o9O54m20Q5O5k67L67k52l5
$$ -247 -50 -151 -187 148 -155 123 -112 -431 -8 68 190 139 -256 -325 329 -91 -6 59 -208 159 -93 -128
2103a28J77j09K02j71K04q4K00l51J26N9k61R7L01q3j50l9p8L66o11M73j30J03
$$ -128 49 -60 142 -29 175 91 291 -60 66 125 -136 -39 262 179 29 -10 -88 278 -333 140 10 113
2125A13M4k45O4K48o2m4J22l46K54J53m18M5J21nJ28j93J43M2R1n06J91o4Q5P0
$$ 113 157 -88 -24 224 162 118 240 -106 148 301 -117 -72 49 44 172 -21 122 164 255 -251 -60 -124 -39 31
2149C1q2j04m1L33m59L21n7J80n6jo03O53r2k15N24o61L50J38k06J69k30K8l4
$$ 31 -51 -155 -196 137 -322 -1 -58 122 66 65 -538 115 23 -192 332 -329 21 159 -47 122 -108 -80 -114
2172a14J10j74P3J79m26N35l54M6J01R5Q8j54j32NJ46L8m1k31J50R7J79k35r9
$$ -114 -4 -178 -105 74 -352 183 -171 -125 -24 71 159 5 -127 -122 24 62 21 -210 -60 37 216 -19 -118
2195a18O6K10p8K2N8k73K6j62J62J79l02L94m9l37R7N4k8K19k3j89l3j11L81k97
$$ -118 -52 158 80 102 160 -113 -87 -249 -87 92 -210 184 135 -202 -105 -51 -79 140 117 -72 -105 -216 165 -132
2219a32K39n8m7k16K40j01J3j60k7K15l3l5J29j71L5J09m7K75k23J06l48L70r8
$$ -132 107 49 2 -214 26 -75 -62 -222 -249 -34 -67 -102 27 -144 -109 0 -47 228 5 111 -237 133 35
2242C5Q4j62P5j02K7Kj1KQ2J47m79K27JKJ22J1n2j2K45k81N5l9J06k12L20l35
$$ 35 119 -43 32 -70 -43 -41 -52 -50 32 179 -300 -73 -72 -70 52 63 11 -1 244 -37 18 -21 85 -127 193 -142
2268a42M06L5n69K75M2j33L33j95O8K4k10N3J69Q8k34J35k8k9j32K12k99J92J14
$$ -142 264 299 -270 5 47 -86 247 52 120 144 -66 -13 156 244 10 145 117 88 -44 168 -131 61 175
2291A75L4l3j9K0j06q9J2l1JJ9j5R7k98L70j48N4L2l61K88p5O1o1rK34l04J14
$$ 175 209 176 157 177 71 -18 -6 -37 -36 -17 -32 65 -233 137 -11 43 75 -286 2 -73 -12 -73 -82 152 -152 -38
2317c8r3K3L8J99k01j68J27J22j91J39j18o9j65L11j13J74K42k33J26j44K65j87
$$ -38 -131 -108 -70 129 -72 -240 -113 9 -182 -43 -161 -230 -395 -84 -197 -23 219 -14 112 -32 233 46
2339D6l24L03K35l42JL72n44J57K63j2N8l45O8K11k22Q0J37k50J81j66L63j11
$$ 46 -278 25 260 -82 -81 291 -253 -96 167 155 213 -132 -64 147 -75 5 142 -108 73 -93 270 159
2361A59l00K04n5L3L7j1k17J4L12j95K2p1J42L9L1l65J91J43l40J6L08q2k92J19
$$ 159 -141 63 8 41 78 67 -150 -136 176 -19 3 -68 74 113 144 -221 -30 113 -227 -211 97 15 -277 -158
2385a58j87K03J72rK6O4K6k20J02j51m8J22o1%O3J8Q8j96J34rq5J01O3lj48Q0
$$ -158 -345 -142 30 21 47 111 137 -83 19 -132 -180 -58 -119 -119 -56 -38 50 -146 -12 -21 -106 -5 58 55 -93 -13
2411a3M2r0K68rl09J92M4J72k10k98J83o7L3J99Q1k49J10j18M7J0J90j39J05k25
$$ -13 29 -61 207 198 -111 81 125 297 87 -211 -28 -95 -62 137 218 -31 79 -39 8 18 208 69 174 -51
2435e1q8J55J02N3j66k18L22j29o1R6n4k1jJ07POj3R7j08N7j54j43M06l41J65
$$ -51 -139 16 118 171 5 -213 109 -20 -81 15 -39 -60 -61 46 53 59 46 143 35 92 -62 -205 201 -140 25
2460B5J03q8j68J69k5m5j9j38J30j14J73j13K08%K0j11k43J62J37m7k23K49J1
$$ 25 128 40 -128 41 16 -29 -48 -186 -56 -170 3 -110 98 98 118 7 -236 -74 63 16 -207 42 53
2483E3k25K69m3p5N4qj5K15j52l26L35j03K26j31J24pk78J73m7n0K28j90o2M4
$$ 53 -172 97 54 -21 33 25 10 225 73 -253 82 -21 205 74 198 191 -87 86 39 -11 217 27 -35 9
2507Ij19mJ78j59K36k98L84O5k71J11j54J57L1k55r5L99m24K49K25j83L0r6K05
$$ 9 -110 -114 64 -95 141 -157 227 292 21 132 -22 135 166 -89 -184 215 -209 40 265 82 112 16 221
2530B21l05K03k66J60O9k9k17o6K37K4m4J23o2k60K40J67k49k18K06Jj38L63j71
$$ 221 -84 119 -147 13 82 53 -164 -230 7 31 -13 110 48 -212 28 195 -54 -272 -66 -65 -203 160 -11
2553a1Lj0j2k0o6K88q5K2r5J47j68k7K6QJ44j22K24l24j20L01N1N9j41Q1l47K30
$$ -11 -8 -18 -30 -50 -116 172 87 109 14 161 -7 -34 -8 0 144 22 246 -78 -198 103 154 213 72 153 -194 36
2579C6N0j9k25j3J63p7R9r7J16R1l2r8K17j39k11J89J30o9J44k13m6j04J34q4
$$ 36 86 67 -158 -171 -8 -85 14 -83 33 124 92 -6 211 72 -139 50 180 111 255 42 -4 -108 26 -58
2603e8J64q5j13K4l5lmJ89j26m9Lo7J28LO7Q7q9j47K73m7j98M4J18o5k84L78q4
$$ -58 106 21 -92 -68 -103 -106 -110 79 -47 -96 -93 -160 -32 -29 38 125 36 -111 162 115 -83 -39 79 14 -270 108 24
2630B4j57J77k34j5K21j30K24J21k37R9J94k17j74R5P8J59k96N5j51kM61m27J75
$$ 24 -133 44 -190 -205 16 -114 110 231 -6 93 287 70 -104 -9 69 228 -68 -13 -164 -166 295 -132 43
2653D3L22l08K1K0j71K53l81J16q2J98o8j3P2k32L77n6J23l21J36r2j6l0P2K11
$$ 43 365 57 78 98 -73 180 -201 -85 -167 31 -37 -50 22 -210 167 111 234 -87 49 -43 -59 -89 -17 194
2677A94j37j44R7j1n7j33K77j96Qj28L19q3l3O7n5o6J22K0j91K4q4K65K2l75L10
$$ 194 57 -87 10 -1 -58 -191 86 -110 -102 -230 89 6 -27 40 -15 -81 41 61 -130 -106 -190 75 97 -278 32
2702C2J83J9m38J65JJ48j22K72k06k98M84j78J2J57l6k36j64L95ql16J38p0O8
$$ 32 215 234 -204 -39 -38 110 -12 260 54 -244 240 62 74 231 195 -41 -205 190 182 -134 4 -66 2
2725BP0n1K00k17k49K35p4J73n2k65m0K76O5n8J3J46k54j1L20l54K12J66l27J11
$$ 2 72 21 221 4 -245 -10 -84 89 37 -228 -268 8 73 15 28 174 -80 -91 229 -125 87 253 -74 37
2749C7j37OOmN7LL8k99M75r2l13KJ09J27K6j51pJ40K09j15p1J0j27p4L14N8m26
$$ 37 -100 -94 -88 -92 -35 -32 6 -293 182 90 -223 -221 -112 15 41 -110 -117 23 232 117 46 56 -71 -145 169 227 -199
2776a99J60o2NL0K25j24j86K21J46l51j34N95j49n3J5L9k40O6oj43N38n43J75
$$ -199 -39 -101 -96 -66 159 35 -151 70 216 -135 -269 326 177 124 139 178 -62 4 -2 -145 393 -150 25
2799B5j03J92Plk37O9K42k76J24O6k34R8J20j24J84l05J5K54r4r5j07J85j60J31
$$ 25 -78 114 121 118 -119 -50 192 -84 40 106 -128 -30 90 -34 150 -155 -140 114 20 -75 -182 3 -157 -26
2823b6J26m4j41K20j50K6j01J98j53j74J99o0N1J40k69K05L4k0k2k44J98JJ12
$$ -26 100 56 -85 135 -15 11 -90 108 -45 -219 -20 -80 -29 111 -158 47 81 61 39 -205 -7 -6 106
2846A06qm9l67K85k30L48j87O6q1J44r2J64k63L99j04j97J31J28j28R8k96L24
$$ 106 98 49 -318 -33 -263 85 -102 -36 -117 27 -65 99 -164 235 131 -66 65 193 65 163 -133 191
2868A91Jm2K03k45Q8k47Q2J66k15p1L8R9M2k29K58P3k27j20K17q4Q6R6j50j8J18
$$ 191 192 150 353 108 196 -51 31 197 -18 -89 -51 48 90 -139 119 192 -35 -155 62 -22 64 160 10 -8 110
2893A10j46J79j64K58k35K75m00J38j05p3O1k4J40j98J60J27j08q8Q6j18P0M25
$$ 110 -36 143 -21 237 2 277 -123 15 -90 -163 -102 -126 14 -184 -24 103 -5 -93 -7 -125 -55 370
2915C70k01j50j74K25j07M7k4l3K73l72K55k13o0jR9J09n4L41p0l36K11l7k02
$$ 370 169 19 -155 70 -37 10 -14 -47 226 -146 109 -104 -164 -165 -66 43 -11 330 260 -76 135 98 -104
2938a04J99j97J81K6J8j25k25K38NJ04k6M1k45K93r7j26J22k60L10r3j55J92J73
$$ -104 95 -102 79 105 123 -2 -227 11 16 120 94 135 -110 183 86 -40 82 -178 132 39 -116 76 249
2961B49j92R1q6p0Q3k73j44K20J66j46r2J12R7j12L33n12N95k53j55L95j92j13
$$ 249 57 148 62 -8 75 -198 -342 -122 44 -102 -194 -82 15 -97 236 -276 319 66 -89 306 114 1
2983Aj20J10J4on6n8k7L30q7O0k91O1n8J90oj30L17m35J05L4J8J06l6j33P3J01
$$ 1 -119 -9 5 -1 -57 -115 -142 188 101 161 -130 -69 -127 63 57 -73 244 -191 -86 -52 -34 72 36 -97 -24 77
3009G7M1j7N3j46J3m5j70M24j25RJ34o8l22L7L1l6L38k19K7R1J41k96J65j53L3
$$ 77 118 101 154 8 21 -24 -194 230 105 114 248 180 -142 -105 -74 -110 228 9 36 127 268 -28 137 -16 17
3034A7O3L4j51j60K6R6m5J01Q5j63M9J02J04j71J91j47j68J46J26r8M5j43R1j34
$$ 17 80 114 -37 -197 -171 -75 -120 -19 66 -97 -48 54 158 -13 178 31 -137 9 135 37 82 -61 30 -104
3058a04K05M6j72r7J3j00K36r6L0j46L19l1j87M3J12l09J78K05n70L57J41l92
$$ -104 101 147 -25 -122 -109 -209 27 -69 -39 -185 134 103 -84 -41 71 -238 -60 145 -425 -68 73 -319
3080c19Q8L05p3K48n26L23j06R7k10K15j50L0P6j49M98n14L51j39j17J44Q3n9
$$ -319 -231 74 1 249 -277 46 -60 37 -173 42 -108 -78 -2 -151 347 -167 184 45 -72 72 155 96
3102I6L6j27j73L6K99j44N3j92J12J9L2J21m7k5l8p1j16L4J78k21p0M41k69Q5
$$ 96 132 5 -168 -132 167 23 76 -116 -4 15 47 168 121 96 58 -13 -129 -95 83 -138 -208 233 -36 49
3126D9l6R7pJ58r4j53jm0J43j55P2K6j02K9j29p4J58KN9L3k03n2J25J41k29J53
$$ 49 13 110 103 261 167 14 13 -27 116 -39 33 59 -43 -14 -143 -217 -59 -57 2 35 -168 -220 -95 46 -183 -30
3152c0j23J61Q9J8P1kj08k28K17L5j79K22k69J74p3OL7R5j0j07K06j80j46K38
$$ -30 -153 8 97 115 186 184 76 -152 65 100 -79 143 -126 48 -25 -19 18 113 103 -4 202 22 -124 114
3176A14M8o79M99j84N54o53O33m19J61M72j83J0M97j030K16M89n57J54k67L55
$$ 114 162 -517 -18 -202 352 -301 332 -87 74 546 363 373 870 -160 56 545 -12 142 -125 230
3196B30j22r2j54J00r3K63l23J55P0N6j32M0N1r6J70l6Lj00K13l37J8J91m6k74
$$ 230 108 16 -138 -38 -131 132 -191 -36 34 90 -42 -2 49 -47 123 87 90 -10 203 -134 -116 75 29 -245
3220b45L50j6Q9o4J20m70K31J20K1J9jj8k5l65L31j4m3R1k53N2L49k50o2K35J1
$$ -245 105 89 178 114 234 -236 -5 115 136 155 154 136 111 -254 77 63 20 111 -142 -90 259 9 -53 182 193
3245A93l23K28m2j9l8J51l49K03R3j0j52o4K25k07L41j61J38l88L42k59J42j98
$$ 193 -130 98 56 37 -1 150 -199 4 97 87 -65 -129 96 -111 230 69 207 -181 161 -98 44 -154
3267a54K67m3k56J17k4O8J6n0J57k24K12N0j82R6j70P9j0j4l3J83j8j53n2L3L4
$$ -154 113 70 -186 -69 -93 -25 -9 -59 98 -126 86 136 -46 50 -120 -41 -51 -65 -98 85 67 -86 -138 -105 -71
3292g1J95l43J68m0O9j9k1R7n4J87Q9O9l28m7J69j2j42L5r2j36L89o5l7l4q5R3
$$ -71 124 -219 -51 -91 -22 -41 -62 35 -19 168 257 326 -2 -49 120 108 -34 1 -91 -227 162 97 60 26 -59 34
3318C4q4j31K49p9o9R6q8J57K56m23N5p3J20Q1k27m5R0K40j10l32L57Q0j52k70
$$ 34 -50 -181 68 -11 -80 16 -72 85 341 -82 -27 -100 20 101 -126 -171 -81 159 49 -283 74 154 2 -268
3342b68L33O2l56L07j4q4o2K62l13j20K48j10K69l78J91kj42L5J62Ql2l5k56J65
$$ -268 65 127 -229 78 64 -20 -82 180 -133 -253 -5 -115 154 -224 -33 -35 -177 -142 20 28 -4 -39 -295 -130
3366a30R6N4J22j61N5j7j23p5K37j38J35m3J46k59L02j84M9L1j14k61J68J95j03
$$ -130 -34 20 142 -19 36 19 -104 -179 58 -80 55 12 158 -101 201 17 66 97 -17 -278 -110 85 -18
3389a8J14j14L6Kq0j39J19J29P3l65L04p3j07L89j17%p1j61J59j43o5P4j35K22
$$ -18 96 -18 18 20 -60 -199 -80 49 122 -243 61 -12 -119 270 153 153 82 -79 80 -63 -128 -54 -189 33
3413C3l6q6p2J44P2j29J90k99K35R0l6q7k12J45N9j49r4K76k94L01j64j1pL20
$$ 33 -3 -89 -161 -17 55 -74 116 -183 52 142 106 19 -193 -48 11 -138 -232 44 -250 51 -113 -124 -131 189
3437A89j92L31l20K1j44L37j47L1j6j17o6j41R8J42q0n9J70j54p1P5J08M2j8j41
$$ 189 -3 328 8 29 -115 222 75 106 90 -27 -93 -234 -136 6 -74 -133 37 -117 -188 -113 -5 37 19 -122
3461a22J98kj31L0k19L55p1nLN2PP7k3m32M23n4k0k62N3L46n30N28m2r2j83K09
$$ -122 76 74 -57 -27 -246 109 38 33 36 88 95 172 149 -283 140 86 66 -196 -143 203 -327 201 159 67 -116 93
3487I3M5p4l94L14K7k09K36n7J25k04K4L35j48l63L57J10j89rR8l06P2K31j28
$$ 93 138 64 -330 -16 11 -198 38 -19 106 -98 -74 261 113 -250 107 217 28 19 117 -189 -117 114 -14
3510a4j3J40r8Q1K22k60j1p9j38J54n4O0p3P1k48K14M5J61k3j14o2L07m21N3J15
$$ -14 -27 113 15 96 318 58 47 -32 -170 -16 -70 -10 -83 -12 -260 -46 -1 160 137 23 -39 268 -153 -100 15
3535A5NO1l7M1k56K26k78l8J90P1j7q1J89k20J71J54j67P7j6r9j66K29o9k9K69
$$ 15 20 81 44 85 -171 55 -223 -261 -71 0 -17 -98 91 -129 42 196 29 106 90 -9 -175 54 -15 -44 225
3560B25k52N9k34K94q4j6qJ72j80N0j09k33J86J10qK09m92L08j88K18P8j53l9
$$ 225 -27 32 -202 92 8 -8 -16 156 -24 26 -83 -316 -130 -20 -28 181 -311 -3 -191 27 105 -48 -87
3583h7r7M8M2L2k4J32k31K90j88k4L93k35L6P0j30L9M0n5j35M2p4o6K54j97K44
$$ -87 -184 -136 -94 -62 -86 46 -185 105 -83 -107 286 51 87 157 27 66 106 51 -84 -42 -116 -182 72 -125 119
3608A19r7K35l11Om4n2KQ8O5Q8R2r9j16J17k62K19k52J45rp0M34j97j3j71J77
$$ 119 22 257 -54 -48 -92 -144 -142 -54 11 99 191 92 -24 93 -169 50 -202 -57 -66 -136 298 101 88 -83 94
3633I4j32j23J1o2J61j57K87l32M05j63J94j09j92K75l53N82l30j20J05j56K14
$$ 94 -38 -161 -150 -212 -51 -208 79 -253 152 -11 183 74 -118 157 -196 386 56 -64 41 -115 99
3654I9j73P7L1Q7l60L31p0j4n6q0K24j14j01L70l37J23K0J50l11n8N3J9K07m5
$$ 99 -74 3 34 121 -239 92 22 8 -48 -128 96 -18 -119 251 -86 37 57 207 -104 -162 -109 -90 117 72
3678G2n3Q2k5j68R5k85M72m31K31l9n3J34m2L3r3L5K93j63L9O7j57J78P7k05J60
$$ 72 19 101 76 -92 3 -282 190 -241 -10 -49 -102 32 -10 23 -70 -35 258 95 134 201 44 222 299 94 254
3703B54o59N58j68l6k02K6J93J16k04K27R8l64L17j67J5j10M08m25K85l69L72
$$ 254 -405 153 -15 -51 -253 -227 -34 82 -122 105 203 -161 156 -11 4 -106 302 -123 162 -207 165
3724A65n14L25L72k73k08M4r9K91j05L2N3j51J97k8N4m8p1j44K42l42K04m4J45
$$ 165 -349 -24 348 75 -133 -89 -188 103 -2 30 83 -68 129 101 155 107 36 -108 134 -208 -4 -48 97
3747I7j01p9R1mj56K80j89P7j40J44j48l0K02o0k2J2Q8J34j21J48k53lk3j79L09
$$ 97 -4 -83 8 4 -152 128 -61 16 -124 20 -128 -158 44 -16 -38 -26 62 196 75 223 -30 -33 -56 -235 74
3772G4K2J32ll33K29j80J58K1k20J71pk46j0K21l9p3k29K48J8J05K3lk96L01k34
$$ 74 96 228 225 -108 121 -59 99 120 -100 71 64 -182 -192 29 -10 -83 -312 -64 -46 59 82 79 -217 84 -150
3797a50K56j0j70O1O6R5j73j73J39m0K65k65K56l79J58r1L55k22j72K87j17r1
$$ -150 106 96 -74 -13 53 148 -25 -198 -59 -99 166 -99 157 -222 -64 -155 200 -22 -194 93 -24 -115
3819a15K27j59J84J05k34J59l32Q0K18J48l36J21N2Q1j79j01N8QQ8k1l75K12K01
$$ -115 112 -47 137 242 8 167 -165 -85 133 281 -55 66 118 199 20 -81 -23 -15 73 52 -323 -111 90
3842I0m27L59N1k16K21m0J8n1J7K7L04j28m00L39o6k70L6K20oO8k21K07K5P0j94
$$ 90 -337 22 73 -143 78 38 56 5 22 49 353 225 -175 164 98 -172 -136 84 78 146 -75 132 157 227 33
3867C3l40K61K70n26K56J42l3J09j02j80J9K70j97L11j73l2q6N3J31j43lL9ml4
$$ 33 -307 -46 224 -302 -46 96 63 172 70 -110 -91 179 -18 293 120 88 2 55 186 43 40 79 75 41
3891D1k35L24nj01o9K85k00p3LJ59j09r8PJ23q3K14k77J42k13J17o5L2K22l0j54
$$ 41 -194 130 125 24 -45 240 40 -33 -30 129 20 -78 -71 52 -31 183 -94 48 -165 -48 -113 -81 141 111 -43
3916d3J7K3j92K01l0J66k13J87k54K12p6K44l58K04R6l45P3K01j58j29p0L08m4
$$ -43 -26 -3 -195 6 -24 142 -71 116 -138 74 -2 242 -116 88 184 -161 -88 113 -45 -174 -244 64 20
3939B0j34jJ12k5N9J85j22j34K91j88o4j37L47Mk66K26j75j87K26N3J02j86K22
$$ 20 -114 -115 -3 -28 31 216 94 -40 251 63 -1 -138 209 213 -53 173 -2 -189 37 90 192 6 228
3962B28k35OQ9j03j03J7J37j78L57l72K45k59K77j52K6M3o3J16j22J72k91N7O1
$$ 228 -7 -1 88 -15 -118 -101 36 -142 215 -157 88 -171 106 -46 -20 23 -40 76 -46 126 -165 -108 -47
3985d7j01q4K94M8M2l16J10J06J58k31l9k1J97m3ll4l18L00J79j44J50k98k00
$$ -47 -148 -232 62 110 152 -164 -54 52 210 -21 -60 -81 116 73 70 36 -282 18 197 53 203 -95 -295
4008b95K51J1O2r2k79L68P8M9k40r6L5J26j93p1J45J39l7P2j15l0M9O7qr8J86
$$ -295 -44 -33 29 -63 -342 26 104 153 -87 -183 -148 -22 -215 -286 -141 -2 -39 33 -82 -112 -63 4 -4 -102 84
4033H4r1N9k61J31J58q1o4J72k8l9N1j69K5m2J66j44j16Q9K72k93L08k85K39l35
$$ 84 -7 52 -209 -78 80 -1 -65 107 79 40 91 -78 -53 -95 71 -73 -189 -100 172 -121 187 -98 141 -194
4057a94K70j14j59R2r0M7m7J93k2K40r3j56J40l9n1p8N9k25J35R8M4k51K86j82
$$ -194 76 -38 -197 -105 -195 -148 -195 -2 -24 216 123 -33 107 68 17 -61 -2 -227 -92 6 50 -201 85 -97
4081i7J1l3J42K27k64K07j27O7k52Q3K23j04j35q9J26K0J5J13l05J59Q2o1J25
$$ -97 -86 -119 23 250 -14 193 66 133 -119 -36 187 83 -52 -141 -15 5 20 133 -172 -13 69 8 133
4104A33j8j00L3pO7l78L10m54N32k44M7J0q6K7L48j42j19N5k53L18J86j74m3K14
$$ 133 115 15 48 41 108 -270 40 -414 118 -126 -79 -69 -155 -128 220 78 -41 14 -239 79 265 91 48 262
4128B62m57M03j51j5k68J50k08K94J05j77PJ46Mj8l4j09n4m7J40J14L6l82J65
$$ 262 -195 208 57 42 -226 -76 -284 10 115 -62 -55 91 95 77 43 -66 -120 -167 -27 87 123 -259 -94
4151i4k5K42k16J42Kj96K08J53Q2m06J09J13J37r2o9q5O6j39M11m61K98j43j01
$$ -94 -119 123 -93 49 51 -145 63 216 298 -108 1 114 251 159 90 5 71 -68 343 -118 180 37 -64
4174f4n2j94N03j31j14J0j51J86J74k94K04k12J24jK3r3p3R0K19l27j3L89k18
$$ -64 -116 -310 193 62 -52 -42 -193 -7 167 -127 77 -135 -11 -12 11 -82 -155 -65 154 -173 -186 203 -15
4197a5K58n65J64J31J31n2q2Pr5k27L1M73l64J03J06J41k46J13Q8k58J45L0m35
$$ -15 243 -322 -158 -27 104 52 -30 -23 -118 -345 -314 159 -205 -102 4 145 -101 12 100 -158 -13 17 -418
4220d18L01L01j21M6j42J48o8j43L6J38k69L01p0qj32L0O3j09N1J2J29q6r0J87
$$ -418 -117 184 63 109 -33 115 47 -96 -60 78 -191 110 40 32 -100 -70 -7 -116 -65 -53 76 -10 -100 87
4244H7j11q2K23O9j97j41L10j7j06%J70m38R7KJ99q4l6O5n1k55L13M0j46m1k48
$$ 87 -24 -106 117 186 -11 -152 158 141 35 35 205 -233 -136 -134 65 -19 -55 10 -41 -296 17 57 -89 -130 -378
4269c78L66R7Q4p2j8j24k66J24L10k01k54l6L03J44l2nJM1j67K6Q1k26N13l32
$$ -378 -12 85 169 97 79 -45 -311 -187 123 -78 -332 -368 -65 79 47 42 43 84 -83 -57 24 -202 311 -21
4293b1L9l2J9q0M66k64j42K17l77pJ19m6K04j85J80K29k04k06K99j00j74j28J54
$$ -21 18 -14 5 -75 391 127 -15 202 -175 -182 -63 -109 95 -90 90 319 115 -91 208 108 -66 -194 -40
4316d0M5j72L67j50p5K08k49J51k66K29J24l22J89j04j71L05rq1k0n0O4P7j87
$$ -40 5 -167 200 50 -25 183 -66 85 -181 48 172 -150 39 -65 -236 69 60 -21 -41 -91 -27 50 -137
4339a37o0O6m3J03J79Qj66m4j2J20p5J45j17n1o6K56j88J8k8l7K9j1k4K23L9j74
$$ -137 -197 -131 -174 -71 108 116 -50 -94 -106 14 -61 84 -33 -84 -150 106 -82 -64 -92 -129 -100 -111 -135 88 127 -47
4365d7J8N4q5K26k98M2%j41M6L45l26J33N4m7j64L7nM5J33J23j68K29o4l57M01
$$ -47 -29 25 -60 166 -132 -90 -90 -231 -185 160 -166 -33 21 -26 -190 -153 -158 -113 20 143 -25 204 140 -217 184
4390A84l32J22J26n9K44k96k08K36K5j91K46j72OK30j84J31J55j49j84P1l33L00
$$ 184 -148 -26 100 41 285 -11 -219 17 42 -149 97 -75 -69 161 -23 108 263 114 -70 1 -332 -32
4412c2L1n8R7R7l52M94j01l25p1K99j85O3J28J42k51J55j39j01O3P2j50J19O4
$$ -32 -1 -59 38 135 -217 277 176 -149 -220 79 -106 -43 85 227 -24 131 -8 -109 -46 26 -124 -5 59
4435E9r5k6K55k09P0J55l16k2K15q2K42r5o0j77k1LN7J70k91K34r2J38J01j17
$$ 59 -36 -62 193 -16 54 209 -107 -129 86 4 246 151 91 -86 -107 -104 -47 123 -168 66 -26 112 213 96
4459I6J83k49m0O4k7j80L44k72J8L0j03N0J83o5L20l41j57J66R7R3o3n7J72l62
$$ 96 279 30 -10 54 27 -153 191 -81 -63 -33 -136 -86 97 32 352 11 -146 20 117 210 147 90 262 -100
4483a00P7N2j67K52P8j13j74K91k78n4L12j82q9K8j2q8L33n8lM0j12j37K4P2K37
$$ -100 -23 29 -138 114 192 79 -95 196 -82 -136 176 -6 -95 -67 -79 -167 166 108 105 145 33 -104 -80 -8 229
4508B29k75L02l12r6j8R5k0K83k72J12J40l91j73J58J30J22J65k68J5Pj0K68r2
$$ 229 -46 256 -56 -152 -170 -75 -95 188 -84 28 168 -223 -396 -238 -108 14 179 -89 -74 -67 -77 191 99
4531I9l00J10K9J11m6j48L76J3j35l3j31K50k08J30j81K4n4L26k91J59j15K93
$$ 99 -201 -91 -62 49 3 -145 231 244 109 76 -55 195 -13 117 -64 -40 -94 232 -59 100 -15 278
4553B78k44k41J28K8R4n8L19m75J09M29j82k6j60j9J1r8J5M2K2j28K20k62L79
$$ 278 34 -207 -79 -51 43 -15 304 -171 -62 367 185 159 -1 -20 -9 -107 -92 -50 -28 -156 64 -198 181
4576A81k08J12j48o6j17K26m6K26J70m46j36L03J83k47pJ5K0l00K93J79l24J80
$$ 181 -27 85 -63 -129 -246 -20 -66 160 330 -116 -252 51 234 -13 -20 -5 15 -285 8 187 -137 43
4598D3m3O8J83j53K11k81J84n9o1J4k89K91p3k72M73j17j32k11q8M37j34P9j79
$$ 43 0 68 251 98 309 28 212 153 92 106 -183 108 35 -237 236 119 -13 -224 -312 125 -9 70 -109
4621a09R8K73k13j82K20j59P4n7L49j56j41j64L40Q5l78Q0J43n0j38j29K51k10
$$ -109 -11 262 49 -133 87 -72 2 -55 294 138 -3 -167 173 258 -120 -40 103 53 -85 -214 37 -173
4643a73J93R8p1P4j04k2PNj08k3J14n3j4K61p8k1p4p0l1K40k38O2j3k8N2J91k48
$$ -173 20 118 47 121 17 -5 2 7 -101 -124 -10 -63 -77 184 106 85 11 -59 -90 150 -88 -26 -39 -67 -15 176 -72
4670g2M1Om1j1n5N6Q1N4j9j52L72m31Q5J42j58R2Q8M2l83K96L2r4Q8j69J42K5
$$ -72 -31 -25 -66 -77 -132 -76 5 59 40 -112 260 -171 -86 56 -102 -10 78 120 -263 33 65 -29 59 -110 32 57
4696E7n4j80j89L34P4K13k25o2L2J50k81L42k91J02l3J53j16j51N5p6L2J55o8
$$ 57 3 -177 -366 -32 42 255 30 -32 0 150 -131 211 -80 22 -11 142 26 -125 -70 -146 -114 41 -27
4719b7o0J6n4J14j08p1J23j2N0R9k12J04J66j59p9RJ17l18N40l35J5J91j72J67
$$ -27 -87 -71 -125 -11 -119 -190 -67 -79 -29 70 -142 -38 128 -31 -110 -101 16 -302 238 -97 -82 109 -63 104
4743A04k29J60j8o4J94k31O0n4K66J03j4j84n4J49m21J07K20l02M2K09R9l77K41
$$ 104 -125 35 17 -47 147 -84 -24 -78 188 291 277 93 39 188 -233 -126 94 -208 -166 43 142 -235 6
4766Fq0J30j42K43j79L2J52k55K37j49j63K05J2j8k18K37n0j30K47r7J30o9k32
$$ 6 -74 56 -86 157 -22 10 162 -93 144 -5 -168 37 49 31 -187 50 0 -130 117 20 150 81 -151
4789a51J14J67m54L80k26o6K01J63j84j3k81L87j00K8N1q7L4Q0P7k06n5J61R4
$$ -151 -37 130 -324 56 -170 -236 -35 128 -56 -69 -350 37 -63 -35 16 -71 -37 43 120 -86 -141 20 114
4812A14m8N6l0n0l09M39k46K56k29j50P0K41l0j41K10k43J47J52P6m02P3j76K94
$$ 114 66 122 92 42 -267 172 -74 182 -47 -197 -127 114 84 -57 153 -90 57 209 285 -117 -44 -220 74
4835G4j94K65N4j60J80l49K14j26o4K81m0k24K96m97K90P5j6J51j32J43j21P3
$$ 74 -120 145 199 39 219 -130 84 -42 -106 175 135 -89 207 -290 0 75 59 210 78 221 100 173
4857A73j34r7l45P92k32l72J66M5J4j69J99l55L96j14o6P4J31l53K45O2j29n6
$$ 173 39 -58 -403 389 157 -215 -49 -4 10 -159 40 -315 81 -33 -99 -25 106 -247 -2 60 -69 -125
4879a25L8J23nR1j43R3L6l38J40J75p2R2j73J93l42K9L93j78k45j84O24k73K34
$$ -125 -87 36 31 122 -21 72 108 -230 -90 85 13 105 -68 125 -217 -188 205 27 -218 -402 222 -51 183
4902A83j52J1j0J67k21j73K46m6o8j2L03o5j91PJ29j5k2j91K23k3J93k59n7O5
$$ 183 31 42 32 199 -22 -195 51 5 -63 -75 228 163 -28 -21 108 93 71 -120 103 80 273 14 -43 22
4926B2l0J0j18L7L11j90l33K87q4K77k87J68k10J53j18R0o0OQ1N8o6R7q8k2j25
$$ 22 -8 2 -116 -79 232 42 -291 -4 -88 189 -98 70 -140 13 -105 -15 -75 -69 12 70 4 101 13 -9 -134
4951a34n0Q6j56J79L3N5j23K73j36k3J09j33j31K65k92N9P5J17Mp8J67L4k21P8
$$ -134 -184 -98 -254 -75 -42 13 -110 163 27 4 113 -20 -151 114 -178 -119 -44 73 77 -1 166 200 -21 57
4975E7L21l89j57L65p1m83K46j19J96p7L22k54J91J07k48j34J35P4J93l43O2Q
$$ 57 378 -11 -168 197 126 -357 -111 -230 -34 -111 211 -43 148 255 7 -127 8 82 275 -68 -6 2
4997BJ66j11j66N7J45j67L3r7L04k79J28j11Pq6J57J77p8m8K1L4j69J95k13nr9
$$ 2 168 57 -109 -52 93 -74 -41 -138 166 -113 15 -96 -89 -175 -18 159 81 33 54 88 -81 114 -99 -104 -203
5022b03J58n9R7j27J68j45M68n25J88j02j15M3J15K44l32K57r6lk81K61j83K36
$$ -203 -45 -104 -7 -134 34 -111 357 -168 20 -82 -197 -154 -39 205 -127 130 34 31 -250 11 -172 64
5044F4Q0q1K24k50j24k6K42o2q9J78k18N5J08j1k41J50Q9J2J21k46J2j98J89J81
$$ 64 144 63 287 37 -87 -113 129 67 -22 156 -62 -7 101 90 -151 -1 88 100 221 -25 -13 -211 -22 159
5068A59K0p0k87J24L72l85K58k69o7J32nJ29n7j35%L4K21j75o4o5j0O9J2K86l04
$$ 159 179 109 -178 -54 318 -67 191 -78 -145 -13 -18 111 54 -81 -81 -47 174 -1 -65 -130 -140 -71 -59 227 -77
5093g7mQ5j19P7J25m7j06J27j83l0OK15J11k84O9J92k49pl3J90k6m7J18k96J17
$$ -77 -81 4 -115 -38 87 40 -66 61 -122 -152 -146 69 180 -104 -35 157 -92 -99 -132 58 32 -15 103 -193 -76
5118g6R6l4P6j96J21r4L75k88l1J08j17k94M03l3j53K04j89K69j78R7M8j05j43
$$ -76 20 -14 62 -134 -13 -107 268 -20 -51 57 -60 -354 49 16 -137 67 -122 147 -31 66 114 9 -134
5141a34PQ8o1L21k78J94p3j69N5J18j36j13J91l0J4j6r1J94J4m3j10R9j12m0K62
$$ -134 -127 -39 -100 221 -57 137 64 -105 -50 68 -68 -181 10 -20 -6 -22 -113 81 95 52 -58 41 -71 -111 151
5166A51J5j14J3j47P4K44l94K51j83oJ32J96m18L04j02K59n24J91J15J62l81K76
$$ 151 166 52 65 -82 -8 236 -158 93 -90 -96 36 232 -186 118 16 275 -249 -58 57 219 -162 114
5188A14j52j9O6J1L1j52K75k48J64j76J4l2o7j60M67k77J71K4k26P7K91j35l1
$$ 114 -38 -57 9 20 51 -101 174 -74 90 -86 -72 -104 -171 -331 136 -141 30 54 -172 -95 196 61 30
5211C0j20j9K41j10J85k99L01pk81m0J32p3K13m35J76jJ72lk43K18j96K37q5j10
$$ 30 -90 -109 132 22 207 -92 209 202 -79 -119 13 -60 153 -282 -106 -107 65 62 -181 37 -159 78 -7 -117
5235a17J30k31K71J48l27J71q0R0k88J26J34r4Jp0K22j70K02M2J59k17j35J46
$$ -117 13 -218 53 201 -126 45 -35 55 -233 -107 27 -67 -66 -136 86 -84 118 160 319 102 -33 113
5257A13j66K9J79k11O5n6q4O4K02j10j54K3Q6P2j62o8J74K43l10QJ83Jm23J89
$$ 113 -53 -24 155 -56 9 -47 -131 -67 135 25 -129 -106 -20 52 -110 -178 -4 239 -71 -63 120 121 -302 -113
5281a13J17K14O3l26L5M0J26j89o0K66j41rn0J69k52J77j02Q7J37P8k12J08l0
$$ -113 4 218 281 -45 -10 30 156 -33 -93 173 32 23 -27 142 -110 67 -35 52 189 267 55 163 133
5304A33j58L73l64n3j27J23N1J18J4Ln5k0N2L2m1J45l01K7M2J75m08L06l24J63
$$ 133 -25 348 -16 -69 -196 -73 -22 96 110 113 58 38 90 122 81 226 -75 -48 -6 169 -239 67 -257 -94
5328i4K08j36l6K5O0j27J66r0rR4J42j75j96J8K2J77p4p6q5K93k28J85j32j74
$$ -94 114 -22 -58 -33 27 -100 66 -24 -33 61 203 28 -168 -150 -128 49 -25 -101 -186 107 -121 64 -68 -242
5352b42L9L75j1m4j33P6p2j33J89n6J16j11J80l35K99k37J07Oj01L3p5M73k09
$$ -242 -203 172 161 117 -16 60 -12 -145 44 -12 104 -7 173 -162 137 -100 7 13 -88 -55 -130 343 134
5375A34j22P0L0j15P4O6k94J96R0k70m5M04j26l0J24k28k5P6j63R6j76K70j47
$$ 134 12 82 112 -3 71 137 -157 39 129 -141 -186 218 92 62 186 -42 -67 9 -154 -58 -234 36 -111
5398a11J98k19K07q0Nj06J03m8K21N8k21k4m7r6M7M1P6k07J32J22r9j03N6M3o1
$$ -111 87 -132 75 -5 0 -106 -3 -51 170 228 7 -17 -64 -160 -113 -72 4 -203 -71 51 -48 -151 -95 -52 -113
5423a13P9P7k12J31J53k30Q7Ll13L55j72L17j33j5J94l25K67l36Q4L34k33J70
$$ -113 -34 43 -169 -38 115 -115 -28 -25 -338 17 -155 162 29 14 208 -117 150 -186 -102 232 -1 169
5445A69j04k58L71J30l23j6k48K42o2k0L60M7Pk65J32k96J46lq5p1N2o4K47o4
$$ 169 65 -193 178 308 -15 -31 -279 -37 -99 -119 241 288 295 30 162 -134 12 9 -76 -147 -95 -159 88 24
5469B4l8j46N6K34j64l06L78m6J74j30j27Q4k51K10J05j50k4M21k73m4K34j92
$$ 24 -14 -160 -104 130 -34 -340 38 -8 166 36 -91 -7 -258 -48 57 -93 -117 304 31 -13 221 29
5491B9j49J58K26k45M5q6j43K68J89n42M72k57k0j71L85l20J81J45k21K04j18
$$ 29 -120 38 264 19 64 -22 -165 103 292 -250 222 -35 -55 -226 159 -161 20 165 -56 148 30
5512C0o7O6J15J68j38m07K85j95L65k15M13l56l52R9K80O2Nj31R6k2q2L3Rn1j13
$$ 30 -37 29 144 312 174 -233 52 -143 222 7 420 64 -288 -189 91 153 158 27 123 101 19 52 61 10 -103
5537a03K27q3NM1k46j9J79J53k6p7K4m2r6pj5J87j46Q4q6J28j42l9K73p0k20J23
$$ -103 124 41 46 87 -159 -178 1 154 128 51 75 33 -63 -70 -85 102 -44 40 -46 82 -60 -99 174 104 -116 7
5563GJ18k87K40q7k64K34j08L55r9O8j23k32K56m2j36K39o4k75K96J30j28J9j99
$$ 7 125 -162 78 -9 -273 -39 -147 208 109 177 54 -178 78 36 -100 139 75 -200 96 226 98 117 -82
5586h2nK5m8PJ99j12k0K78j50k57K07j04J44j37n9L22l15J04j95L27J76l02N6
$$ -82 -87 -62 -110 -103 96 -16 -36 242 92 -165 42 -62 82 -55 -114 208 -107 -3 -198 129 305 3 59
5609E9K14k40L07j97m23J84K09j41M6J1j10J71k63L94l28P2L0L8J11j52l03K23
$$ 59 273 33 340 143 -280 -96 113 -28 18 29 -81 90 -173 221 -107 -35 -5 33 144 -8 -311 -88
5631h8K3J0J83n2q9p8K99k65K50j99j68J91p1N6ojK25l62Q7j64L61N1k53m6J75
$$ -88 -65 -55 128 76 -13 -91 208 -57 193 -6 -174 17 -54 2 -4 -5 220 -142 -55 -219 142 193 -60 -106 69
5656F9l38M80j64J36k71N1J00m19M82j59j1j29J11R7k18K96p7q5q1LN0L9J41l1
$$ 69 -269 211 47 183 -88 -37 63 -356 126 -33 -44 -173 -62 35 -183 113 36 -49 -130 -127 -77 -38 103 72
5680G2k37K27m5K18k22q1Q0J6j05J3K50o7k12J46l7j60k12O07k46k22J95J68r9
$$ 72 -165 62 17 235 13 -68 12 28 -77 -64 186 119 -93 53 16 -144 -356 251 5 -217 -22 146 47
5703D7j63J55r2o7r8K35j01N4J35j90j95K51N8j90l1K8J27j61K94p2j58n5K03
$$ 47 -116 39 -53 -120 -218 17 -84 -30 105 -85 -280 -29 29 -161 -192 -164 -37 -198 96 24 -134 -189 14
5726A4M9j0k58M84n07O4K14l8P1j66JJ32M7J60l43J83j19k0N1J19j84k2J64j26
$$ 14 63 53 -205 279 -228 -164 50 12 83 -83 -82 50 97 257 -86 97 -22 -42 9 128 -56 -78 86 -40
5750d0k31J14J77j15R1P3J77k75J70kMo3k13N8N5o6K61P8j26p4j02J08LK16l77
$$ -40 -271 -157 20 -95 -4 69 246 -29 141 139 143 80 -133 -75 -20 -86 175 253 127 53 -49 59 62 278 -99
5775i9L2J77j21n4L5m3N0K23l72J66j5j4J1j40J34o2R6j07J87M3l19J38rK08j74
$$ -99 -67 110 -11 -65 -30 -73 -23 200 -172 -6 -21 -35 -24 -164 -30 -92 4 -103 84 127 -192 -54 -63 145 -29
5800b9j62L09j31J04m0Q5j6j3k20j00J92L26n63L59k65J93J33k45j3N9K10n2j47
$$ -29 -191 118 -13 91 51 136 120 107 -113 -213 -21 305 -258 101 -164 29 162 -83 -96 -37 173 121 -26
5823b6j38J96j34N6l9QJ84P5l23K53K9k06n5j22L14k37J35k1r0J65O2Qj20k0m9
$$ -26 -164 32 -102 -46 -85 -77 107 182 -141 112 141 -65 -120 -242 72 -165 -30 -51 -141 24 86 94 -26 -46 -95
5848i5J21n0J1K3l9P3j21K83l82K13J0j11j27N1L41k83K68j59j74o5J62R7k21
$$ -95 26 -24 -13 10 -29 44 -77 206 -176 37 47 -64 -191 -140 201 -82 186 27 -147 -212 -50 47 -174
5871a74Q9nk36L59j43J70k5m85O06N5k96j0QP13o95j5K48m90M29K5n24O30r4k44
$$ -174 -85 -90 -326 33 -110 60 35 -450 156 211 -85 -95 -87 626 -69 -84 164 -326 103 128 -396 234 140 -104
5895a04M85k87k02J13k39K42K55j54j41l1j4j4K02n2l4j86J56J97m47L10j35R5
$$ -104 381 94 -108 5 -234 8 263 109 -32 -63 -77 -91 111 59 25 -161 -5 192 -255 55 -80 15
5917A5M3m9K80l82K20j39J36l25K61o1j89j3J86O1m33M08O2m38n75NN48N6K88
$$ 15 58 9 289 -93 127 -12 124 -201 60 -1 -190 -203 -17 44 -389 19 81 -357 -932 -927 -379 -323 -35
5940c5L39K4o33j26J77J6K62J11J27q68J13P49j13J47m66j51M52j97K43n28J41
$$ -35 304 328 -305 -431 -254 -238 24 135 262 -606 -493 256 143 290 -176 -327 125 -72 171 -357 -216
5961b16J42k2m9J1J19J42O2n0oL6k19j24N7k05M17j62K40k92q6Q7O2L00O7l47
$$ -216 -74 -96 -145 -134 -15 127 189 139 133 169 -50 -174 -117 -322 95 -67 173 -119 -205 -118 -56 244 311 -36
5985c6J46q1j0j48K0L03k03p0J57l06J29J61o6P5K5j68J10k73J32K36k2Qj04l5
$$ -36 110 29 19 -129 -109 194 -9 -79 78 -228 -99 62 -4 71 96 -72 38 -235 -103 133 111 119 15 -20
6009b0J48j69J46j47k19M12k61j82L28j13L3m97Q22l92k84L22K12j70n09N76j97
$$ -20 128 -41 105 -42 -261 151 -110 -292 36 -77 -44 -541 281 -111 -395 -73 139 -31 -540 36 -161
6030a61j11M05n09M28J85m57j86N68k88P2L2k48k0J22M80j31L06l16l19n21P39
$$ -161 -272 133 -376 52 237 -220 -406 162 -126 -54 -22 -270 -290 -168 312 181 487 171 -148 -669 70
6051G0m12J73J51m8k85L84J51j97Q3J97J12k61p07P82K99m77J03k60k25Q61p63
$$ 70 -342 -169 -18 -66 -351 33 184 -13 70 267 379 118 -589 193 492 15 118 -142 -367 494 -269
6072b69K60n2l73O6J03L90J94k49J30m75Q6J15n33L28K86J47ol91L70k0m09K43
$$ -269 -9 -61 -434 -368 -265 125 319 70 200 -275 -189 -74 -607 -279 7 154 148 -243 127 107 -302 -59
6094e9k54J69M05L30m09m91J29L5j60P60k30l6J12q3K1n48M74n37K42k71Q84p42
$$ -59 -313 -144 261 591 182 -309 -180 -145 -305 455 225 189 301 218 239 -309 165 -372 -130 -401 483 -259
6116b59K52J06o68M98l04K40M16o2n43K8M74j69j03J5R0K92m73J20K88n71O13
$$ -259 -7 99 -569 -71 -375 -135 281 219 -324 -296 178 9 -94 -79 11 303 -170 -50 238 -333 280
6137B80L61o06J01o24L02j71l6M3K07k47O08n52M67j53k41N09l65mk10J92L40
$$ 280 641 35 136 -488 -186 -357 -393 -350 -143 -390 218 -334 133 -20 -261 248 -117 -121 -331 -139 201
6158B01k46o5M54m27k4O0K89l38R5n9M0J19j07o8J14K35j95J43l45l47M87m0K01
$$ 201 -45 -110 344 -83 -107 -47 242 -96 -1 -60 -20 99 -8 -76 38 273 78 221 -124 -471 16 -24 177
6181A77l54J29L37o5q9j27K3K02j97j57P1O8n1K39j91Po0K11k77k1J89r2j60n3
$$ 177 -177 -48 289 224 135 8 31 233 36 -121 -50 18 -33 206 15 22 -38 173 -104 -125 64 -28 -188 -241
6205b41K42J5J21M6j14p5K7j0l19Q6L88j94J36k57J06J18o1R1k45J28K7J77r2
$$ -241 1 16 137 183 69 -6 21 11 -308 -222 166 -28 108 -149 -43 75 14 105 -140 -12 15 192 100
6228A00m05L22j03J74k14j01r6O97J28n37M78k31K63m42k06O2p2K29M3n4q0j63
$$ 100 -305 17 -86 88 -126 -227 -323 374 502 -35 443 212 475 33 -173 -111 -183 46 89 35 -45 -208
6250b08J92j02n8P1K48k26j13K16j23Q9K49l81K24k21L04M8n4j25L1r7k38L99
$$ -208 -16 -118 -176 -105 143 -83 -196 20 -103 -14 235 -146 78 -143 161 209 155 30 61 -36 -274 125
6272A25k02O5j9J83ok61J19k6J64j37l7J52j30N6j59oK62L1k79P3Q4n6j6j19K34
$$ 125 -77 -12 -31 152 146 -115 4 -22 142 5 -32 120 -10 46 -113 -119 143 174 -105 -32 52 -4 -20 -139 95
6297I5M1k56Q8N1J61k67O3J37j67J12k3l6M1j04o2M6K21k52n6K76j62L9j41J34
$$ 95 136 -120 -32 19 180 -87 -24 113 -54 58 35 -1 40 -64 -126 -80 141 -111 -167 109 -53 -14 -155 -21
6321b1J03k1m1j38J57l7j61J40Kj06R3l3j90J33K11Pj82L4j80J79L2l6K32k70
$$ -21 82 61 20 -118 39 2 -159 -19 -17 -123 -30 -63 -253 -120 91 98 -84 -50 -230 -51 -19 -55 177 -93
6345i3J96k21J09j10J60j8R8j37J00K24k23l39L04L2L52n23J1L13K5n92K66K42
$$ -93 103 -118 -9 -119 41 23 121 -16 84 308 85 -254 50 82 434 -89 -78 235 260 -332 -66 176
6367A76k93M3J12j5k1J36k0l65K49kK60k26o2M9j22q7O6J72k49j67K03K84j84
$$ 176 -117 -74 38 23 2 138 118 -247 2 0 260 34 -28 21 -101 -188 -122 50 -199 -366 -163 121 -63
6390f3J08m3m7J13k34K97j38J88k16J20j54M2L1Op0J6O7O8m09L91j51K61n47L73
$$ -63 45 2 -45 68 -166 131 -7 181 -35 85 -69 -27 4 10 -60 -44 23 91 -318 73 -78 183 -364 9
6414IJ20k79J97qJ63n67K13LJ86L6r2R5k77K96J35k04k13RK99l32R4K82K30m26
$$ 9 129 -150 47 39 202 -365 -152 -149 37 73 -19 76 -201 95 230 26 -187 -178 121 -211 -117 165 395 -31
6438c1O3l13M47m8j93J92k02J65j9K01j34j3J0l94M90l16J85k01q7M30m64L53
$$ -31 32 -281 166 118 -75 117 -85 80 61 262 128 115 125 -269 221 -95 90 -111 -198 232 -232 121
6460A21l15j04J26J11j2J00q0R8j2r3K23k65J09K23j26Jo4q4K41k95K65j59N5
$$ 121 -194 -298 -172 -61 -73 27 -53 45 33 -60 163 -102 7 230 104 105 41 -43 198 -97 168 9 64
6483F4p6k0K46j98j4O5J00k21p8K23l5j10j73J34jN6o3J89k82j5L20L3r2N5l53
$$ 64 -12 -32 214 16 2 67 167 -54 -132 91 56 -54 -227 -93 -94 -38 -101 88 -194 -209 111 144 52 107 -246
6508b46n6L07j27K43m3j42n0N83k95k69K08L0k9r0j1J4k2M3j51K26k45Q3r2M2
$$ -246 -302 5 -122 121 78 -64 -114 469 174 -95 113 143 114 24 13 27 5 48 -103 123 -122 -39 -131 -89
6532h9Qj00J93k6N6O9j66q0M8kNj08K43N0j89J11j24J45P9k37j7J08K39j54m5
$$ -89 -81 -181 12 -14 42 111 -55 -135 -87 -89 -84 -192 51 101 -88 23 -101 44 123 -114 -131 -23 216 62 17
6557A7o1j58K52L3K14j69Q2j86lJ54j19m42J75J56o1J68K01l55N5N0r6K64Q4k91
$$ 17 -44 -202 50 83 297 128 210 24 21 175 56 -386 -211 -55 -116 52 253 -102 -47 3 -93 171 255 -36
6581c6J53k15N7k5m1k12K86j05k2K1j41K41K14j30n6O5O3j44k11J32J9K56k38
$$ -36 117 -98 -41 -66 -107 -319 -33 -138 -160 -139 -280 -39 175 45 -11 54 117 -27 -238 -106 -87 169 -69
6604f9K5M5L9j6K33k41k8n1j62K13j55K72m6j6L18k80l5j4J34j2j63MK50j98j04
$$ -69 -44 1 40 24 257 16 -12 -63 -225 -12 -167 105 59 43 361 81 46 32 166 154 -9 -5 245 47 -57
6629e7J68l00K03P6j34Jn9J15j64P4j2J6N9P3q9j5K4L4L2k2j21K46j7j93J43J83
$$ -57 111 -189 14 90 -44 -43 -102 13 -151 -77 -89 -73 -14 59 -30 -45 -21 13 45 23 -98 148 131 -62 81 264
6655B64j79J49m25J02J1L92k52r8J30k51L58k30J6K5J3m9k25L58jj39J01Lj45
$$ 264 85 234 -191 -89 -78 314 62 -36 94 -157 201 -29 -13 12 25 -24 -249 109 108 -31 70 73 -72
6678g2O2j15K86m0k14k6M17m30m2L26r4Nj09K8N8K21l49Q3p5J17m1p6p9qL51k49
$$ -72 -10 -125 161 121 -93 -119 298 -132 -174 152 58 63 -46 -18 40 261 -88 -5 -80 37 -4 -80 -159 -167 184 -65
6704f5J13l00M41j28J6k09K93p9pj46N9K27k5J02l30p2r1L60l58K73N0j16k4J45
$$ -65 48 -252 189 61 77 -132 161 82 75 -71 -12 215 190 292 -38 -110 -201 159 -199 74 124 8 -16 129
6728A29k21L3J40j23N0P0r1J10J75r2J80n31M9Q8P9o9q1J6K8P3qjmQ4j30J97J08
$$ 129 -92 -59 81 -42 8 78 -13 97 272 180 360 -171 -122 -34 45 -24 -105 -89 -61 12 4 3 -1 83 -47 150 258
6755B58k92j46J26%jJ7L3O3j11J07J7l08J30p9K23J2k39K21j48P4r2L13j93J11
$$ 258 -34 -180 -54 -54 -55 -38 -5 58 -53 54 71 -237 -107 -186 37 49 -190 31 -117 -43 -135 178 -15 96
6779I6J5l19M50m17J03J82l89J44K2l3J13J83j07K3l0J73j1k51Q5N6j30N5n4k2
$$ 96 111 -208 242 -175 -72 110 -279 -135 -113 -146 -33 150 43 66 36 209 198 -53 32 88 -42 13 -41 -63
6803f3N2M1l10J74J29k85L79j16l0L13k48j96J28P2j34K64j81j49K22K1j71O9
$$ -63 -11 30 -280 -106 23 -262 117 1 -29 284 36 -160 -32 40 -94 170 -11 -160 62 83 -88 -19
6825a9K26l84K51K5j49J74m9j26J44l56K82j74M12k92J16j34K52j3Rk82r3O8R9
$$ -19 207 -177 74 99 -50 124 75 -51 93 -263 19 -155 257 -35 81 -53 199 186 195 -87 -180 -112 -13
6848a3j44M8j08L51j23J37j03o7j9R9o8K08J1q2k06J09P0m3l4K0k41K4K82j65
$$ -13 -157 -109 -217 134 11 148 45 -22 -41 58 -10 198 209 127 -79 30 100 57 23 43 -198 -174 108 -57
6872e7KP8J19j22K0KL1P9k90J03j48J55N5n6k5l3n5L90k02q9RN4j52J80L3m02
$$ -57 -55 23 142 20 40 42 73 152 -138 -35 -183 -28 27 -29 -54 -87 -142 248 46 -43 -34 20 -132 48 81 -321
6898c21J96K26j92J29j12j22K41k3l0k09K44l9R6j81J17j15Q2O7j42p6L8R8j30
$$ -321 -125 101 -91 38 -74 -196 45 22 -8 -217 27 -12 84 -97 20 -95 -13 54 -88 -164 -126 -28 -158
6921a58J90j04q6J38J24j08non6L05l10O2o2O2J49K45l90k01rK66J35p5j90M8
$$ -158 32 -72 -158 -20 104 -4 -9 -15 -71 234 -76 -14 -76 -14 135 380 -10 -211 -220 46 181 106 -84 -36
6945c6L05k61J55k64L04j09O3j49l2P8k09J21J83k7qj12J18j40k46J40J00N5n5
$$ -36 269 8 163 -101 203 94 157 8 -24 54 -155 -34 149 122 114 2 120 -20 -266 -126 -26 29 -26
6968b6K84l11kL5j08L12k38K25n9j16m3p7o4K41J9l80J68k1L83n08O6P6J51K95
$$ -26 258 -53 -55 -20 -128 184 -54 171 112 -4 -47 -124 -188 53 72 -308 -140 -161 222 -286 -220 -144 7 302
6992C02j07k01j17N8K61n4j43k05L98j40P8J2k95M05k31k41L80j23r4n5k2K67
$$ 302 195 -6 -123 -65 196 142 -1 -206 192 52 130 142 -153 252 21 -220 160 37 -57 -112 -134 133
7014A33l10K00J25j5j65j7O0Q3K40l51M2o9J46j12J00k17K07k3L4rK9q5n1O4n8
$$ 133 -177 23 148 133 -32 -49 11 94 334 -17 25 -44 102 -10 90 -127 80 57 91 82 111 26 -25 39 -19
7039a9j44n5L58j5j13m3q5J67R9r1j40J63kl38K19l1K73m29O5M84j29l81J94l2
$$ -19 -163 -218 140 125 12 -31 -116 51 150 59 -81 82 80 -258 -39 -70 203 -226 -161 323 194 -187 7 -25
7063b5R0J10k57Q6l8J19j57%K09k63K75k67j44K45J09k15j8K23K14j50J25j49
$$ -25 65 175 -82 4 -34 85 -72 -72 137 -126 149 -118 -262 -17 92 -123 -141 82 296 146 271 122
7085A22k42L73l60P2O6j19J98r5J3p1l5L1j77J08J85p3r8K49l65R1K68l64L35
$$ 122 -120 253 -107 -35 31 -88 110 15 28 -43 -78 -47 -224 -116 69 -4 -102 147 -218 -127 141 -223 112
7108A12m70L34k86K46L0j03pJ48K74l47QQ5k14K94j06q5L7K47k55J80m3k53K71
$$ 112 -358 -24 -310 -64 -34 -137 -144 4 278 -69 -61 24 -190 104 -2 -87 -50 197 -58 122 79 -174 97
7131I7m6oj96K10k1l13K63M6m2m4P1o8o4m9K46J26j17q2p9KJ3n2J79K0k62k9j8
$$ 97 51 45 -151 59 38 -275 -12 34 -8 -52 19 -49 -113 -162 84 210 93 11 -68 -66 -53 -105 74 94 -168 -197 -215
7158b15J19K4q3o3L47M2j77m3L2Pr9J13J70j08m18L16J25k03J65j8r3j4l9K43
$$ -215 -96 -72 -155 -218 129 171 -6 -49 -17 -10 -109 4 174 66 -352 -36 89 -114 51 33 -60 -74 -113 130
7182A30J44k23l6Q5j55m1K47m6j02q6L52n29L98k94J50j07J89P0j71N5m5k43L47
$$ 130 274 51 15 100 -55 -96 151 105 3 -83 269 -260 138 -156 -6 -113 76 146 -25 30 -15 -258 89
7205H9k61o8K02R9l5J74j26k54J93Nn8J52Ok59L89m09J38q5J35k23J26J70k79
$$ 89 -172 -240 -38 61 26 200 74 -180 13 18 -40 112 118 -141 248 -161 -23 -108 27 -196 -70 100 -179
7228a79M24k13J06l27J66J57k3k13P4P0o9N9N3k03R2M3J1J4R8k83K03L6k22K51
$$ -179 245 32 138 -189 -23 134 111 -102 -28 42 -27 32 85 -118 -26 17 28 42 140 -143 60 96 -126 125
7252A25o3l28J90K0J6L5N4O8k75N4M0K5Q0m8j37qK20Mk99lK19o2p7K72k95J70
$$ 125 62 -266 -76 -56 -40 -5 49 117 -158 -104 -64 -39 41 -7 -144 -152 68 72 -227 -230 -11 -73 -150 122 -173 -3
7278cj0p4L8J33O5j63o7J01K5p7j14L3K13o7L5k15J31j68K42k2j41J39J38j25
$$ -3 -13 -87 -49 84 149 -14 -81 20 45 -32 -146 -113 100 33 68 -147 -16 -184 58 36 -105 34 172 47
7302D7j01J24R2j48o2M5%J09j01pm3k6J45K8k56oJ25o9o0K22j98L65k72l0J25
$$ 47 -54 70 162 14 -48 -3 -3 106 5 -2 -45 -71 74 102 -154 -160 -35 -104 -164 58 -140 225 -47 -77 48
7327D8r9L1K48j00k04M17k36k23J89J73j27J60q4j08R4k51J18j36J30l15L69J4
$$ 48 -51 -20 228 128 -76 341 105 -118 71 244 117 277 193 85 179 -72 46 -90 40 -275 94 108
7349A08j97K8l5J13P5j32k37K74k66L37R1k97k15J74K12l4p5L0q6N5J08M4K18
$$ 108 -89 -61 -96 17 92 -40 -277 -3 -269 68 159 -138 -353 -179 33 -1 -76 -46 -132 -77 31 75 293
7372B93m94N9RJ20kJ54q0p2L4k2l0L5OP7k39P3o3N0K46j3k49m0N53k95j66n1J37
$$ 293 -201 -142 -133 -13 -15 139 59 -13 21 -1 -31 4 10 87 -152 -79 -142 -92 154 141 -108 -148 405 110 -56 -107 30
7399C0o3J86k03J40j45Nr7K44l5J28j55J89P0l81j19M13l62K41qPk38J0j5J20
$$ 30 -33 153 -50 90 -55 -50 -147 97 62 190 35 224 294 -87 -206 207 -155 86 78 85 -153 -143 -158 -38
7423c8r5O1p9L18m6j19n7RR8l25M48q9j52q3J42o7j2qK39j88p9J99j47pj4J52
$$ -38 -133 -72 -151 167 121 2 -55 -46 52 -273 175 86 -66 -149 -7 -74 -86 -94 145 -43 -122 77 -70 -77 -91 61
7449F1J3j76j68M30o8j7k37K10Pj16K20j08j64k9J8J98j83L44k54m6J84j03K0
$$ 61 74 -102 -270 160 92 75 -162 48 55 -61 159 51 -113 -142 -124 74 -109 235 -19 -65 119 16 36
7472C6k29K7J87m6r8K39k30MJ15j36J16j53oM33o16M92j80Q0n5l4P2n2k33L47
$$ 36 -193 -166 21 -25 -123 116 -114 -110 5 -131 -15 -168 -174 259 -357 135 -45 35 -20 -54 18 -34 -267 80
7496H0k30J79N8k30J27K85j80k8n7j8j72O9k5n1K68o9R4j32L47l36J39Q2k28n5
$$ 80 -150 29 87 -143 -16 269 89 61 4 -14 -186 -117 -142 -193 75 6 100 -32 315 -21 118 200 -28 -83
7520h3rJ03k17J07J03J40j81%l0r0J55J47lk19m4M5j80M17j34j59J39m5p1P4Q6
$$ -83 -92 11 -206 -99 4 144 -37 -37 -67 -157 -2 145 142 -77 -121 -76 -256 161 27 -132 7 -38 -109 -35 51
7545E1J96k78r5Q7j89K98r9J87j42O0j7QJ1l4rj12K64J2k78l6K2K88j18J05J44
$$ 51 247 -31 -126 -39 -228 70 -29 158 16 76 59 67 78 44 35 -77 187 199 -79 -115 -93 195 77 182 326
7570C26j59l31K65Ol5j50j59L41k14J17J8J58l73R5J56j36l4L1q3K15j49j15l5
$$ 326 167 -164 101 107 72 -78 -237 104 -110 7 25 183 -190 -95 61 -75 -109 -78 -161 54 -95 -210 -245
7593b45K87K14j27k14K11j75j71J19J66l4k74N66m34J69j43K6J41q6J90j30k63
$$ -245 42 256 129 -85 126 -49 -220 -101 65 31 -243 323 -111 58 -85 -59 82 -4 186 56 -207
7614b07M08R8j55k18L8K0o1O2k01J53K87k9k76L4K65o25L12j56J56J58J03R3j79
$$ -207 201 299 144 -74 -36 -16 -77 -15 -216 -63 224 195 -81 -47 218 -407 -95 -251 -95 63 166 259 80
7637H0L2j37O9k42K66Q8q0l51M14j25k86L69l23O9K60j81M2N8J55j25N8n8j11
$$ 80 112 -25 44 -198 68 156 76 -275 139 14 -272 97 -226 -157 103 -78 -36 22 177 52 110 52 -59
7660e9J42j30JJ43O4j10k59K72q9l1J04j11K01l98M42k68J05k70L38j20j21K4
$$ -59 83 -47 -46 97 161 51 -208 64 -25 -56 48 -63 138 -260 182 -86 19 -251 87 -33 -154 -130
7682a30J78m1j9K12q0m68L27k37J50M7j29J22n6p1K32q0j31R0J08J62k14k41J36
$$ -130 48 7 -12 200 120 -348 -21 -258 -108 -61 -190 -68 -124 -195 37 -43 -174 -84 24 186 -28 -269 -133
7705a33J62j03K26R9k44k0K66m26J82k72L75l01K34M1J19l17J43J04Rk9k93K37
$$ -133 29 -74 152 251 7 -13 253 -173 9 -263 112 -189 45 86 205 -112 31 135 144 115 -178 59
7727E9J98j52j9J42k43L1N9l4k79K45J26j23j8Q5J21Mm78K58K86j10k51J94j16
$$ 59 257 105 86 228 -15 16 75 41 -238 7 133 10 -8 77 198 202 -276 -18 268 158 -93 101 -15
7750a5q1K09k72j08J16P0Q7q2J08l2n0J89q5N1j87N8j8m8O1J5K76j88j49K01k04
$$ -15 -96 113 -159 -267 -151 -81 6 -76 32 0 -50 139 54 105 -82 -24 -42 -90 -29 -14 262 74 -75 126 -78
7775g8J7L6Kj11L46j23j94K44q9j8k15qL6M0L0p9N1K06Q0k43q3j23M17L1k52K92
$$ -78 -61 -25 -23 -134 212 89 -105 139 50 32 -183 -191 -155 -115 -85 -164 -113 93 173 -70 -153 -276 141 172 -80 212
7801B12l26K02J7j16Q4j61K58j04K2p4j47J24J30j53N9J09j85K14k47O6L6M4Q7
$$ 212 -114 88 105 -11 73 -88 170 66 88 14 -133 -9 121 -32 27 136 -49 165 -82 -16 20 64 151
7824A51k01K59k33J81q9l13R8J52k20J15R5l5J90k74J55J00j59m9K75k73L1k03
$$ 151 -50 209 -24 157 68 -245 -147 5 -215 -100 -5 -40 150 -124 31 131 -28 -77 198 -75 -44 -247
7846b47n6K36l2j93M38k34L37k04k26rK15J19j36j0Q6Q6p06M49J77Q4k17m2K34
$$ -247 -303 -67 -99 -292 146 -88 249 45 -181 -190 25 144 8 -2 84 170 -536 -87 90 174 -43 -85 149
7869A49r7J10k25N7J59j30j8j72J38J22k11L67j42JJ6k60J15l0L35j60n5l8j63
$$ 149 52 162 -63 -6 153 23 5 -167 -29 93 -118 249 107 108 124 -136 -21 -51 284 124 69 31 -132
7892a32J91J2l9rmK4j60R8J8PJ51l21K70Nj85J6J43k72K46k07K73k1k36K37J41
$$ -132 59 71 32 23 19 43 -117 -19 -1 6 157 -164 106 111 -74 -58 85 -187 59 -148 125 104 -132 105 246
7917B46k08l4q9J80r0p2N0q1o2J49k19M3J04j60J04k24M13k9J7j29K69j68k32
$$ 246 38 4 -85 95 5 -67 -17 -98 -160 -11 -230 -187 -83 -243 -139 -363 50 21 38 -91 178 10 -222
7940b22L25j25P4p2L9R1k36M83m51j10J17l6J72k46J82k36K31J45N8l00O9K54
$$ -222 103 -22 52 -20 19 110 -126 357 -94 -204 -87 -123 49 -197 -15 -251 -20 125 183 -117 -48 206
7962B06k42J28j65l3O2O6o8o1J84m3K7MM8k4j98J66j7k46K08j59J70Q2J39l03
$$ 206 -36 92 -73 -106 -44 22 -46 -107 77 34 61 65 113 89 -109 57 40 -206 2 -157 13 95 234 -69
7986f9J10R3k30k02Q8L00l4q0j89J12J37m0p2k57K91R7j58k23M50k14o9n9J64
$$ -69 41 134 -96 -298 -210 90 56 -24 -213 -101 36 -4 -76 -333 -42 55 -103 -326 124 -90 -159 -218 -54
8009e4K28J08m10J53L6j80J49q6J33j57K03L8o2k06P7r5K09j62L15k72j09M10
$$ -54 174 282 -128 25 61 -119 30 -56 77 -80 123 161 99 -107 -30 -125 84 -78 237 -35 -144 266
8031B66j91k36M00k81J59j43m8O3J2p0O7Q6o4K46p8k20K36l60M48m62K79k07L5
$$ 266 75 -161 239 -42 117 -26 -74 -11 1 -69 -2 84 20 266 188 -32 204 -156 292 -170 109 -98 -63
8054f3j86L07p6K69k61p3K16J45k87j11J00o6p5m5K71l91L44j50J83M7j93K71
$$ -63 -249 58 -18 251 -10 -83 133 278 -9 -120 -20 -86 -161 -206 65 -326 18 -132 51 98 -95 176
8076A76j30r4J30rQ4l64J88r0K88k9m8j60K56l04J61k71J99R9j26J86j05O3J62
$$ 176 46 -48 82 73 157 -207 -19 -109 179 150 102 -58 198 -106 55 -216 -17 82 -44 142 37 100 262
8099B62j17j41NJ37mk23M8J71J13j40n4r3pq7q7L08r2q8L04j74J15k25J4Q1L3
$$ 262 145 4 9 146 142 -81 -33 138 251 111 57 -36 -43 -130 -217 91 -1 -89 215 41 156 -69 -55 26 59
8124E9K4op4Q8j18j8J06j19j23m2J60J18O4O4j70l7L50m37J02k4o1J5J01q8J79
$$ 59 83 77 3 91 -27 -45 61 -58 -181 -223 -63 55 119 183 13 -24 326 -111 -9 -33 -94 -79 22 -66 113
8149A13j54J08j8l9lj47K26O3k21J36j69K6j43K56J03l57J90Q0j40l4K12j03P0
$$ 113 -41 67 49 10 7 -140 86 149 -72 64 -105 -79 -222 34 137 -220 -30 50 -90 -124 88 -15 55
8172E5p2J0R3r7J10j36J03l25K77k9k40J50J34j77R1k2P2Rl7
$$ 55 -17 -7 86 -11 99 -37 66 -259 18 -11 -251 -101 33 -144 -53 -75 -3 6 -31
8191c1
$$ Imaginary data points
##PAGE= N=2
##DATA TABLE= (X++(I..I)), XYDATA
0@%%%%%%%Mj2J6j6K2l0M0n6P2q8J07j32J67k06K46k92L43m04M78n62O54p55Q68
$$ 0 0 0 0 0 0 0 0 4 -8 8 -8 14 -16 24 -32 40 -48 59 -73 94 -112 134 -158 185 -219 259 -303 351 -404 464
30D64r95J141j304J481j676J891k132K397k685L003l351L729m144M596n091N632
$$ 464 -531 610 -694 787 -889 1002 -1130 1267 -1418 1585 -1766 1963 -2181 2415 -2676 2956
46B956o220O865p571Q342r189J0123j1151J2290j3557J4973j6569J8384k0465
$$ 2956 -3264 3601 -3970 4372 -4817 5306 -5845 6445 -7112 7861 -8708 9676 -10789
59a0789K2875k5707K9095l3232L8412m5117N4176o7168Q7562j25468L07991r42885
$$ -10789 12086 -13621 15474 -17758 20654 -24463 29713 -37455 50107 -75361 232630 -710255
71g10255O74077R03176j622878P39777P04859j272658N35154O86714j218817N78373
$$ -710255 -36178 866998 -755880 -16103 688756 -583902 -48748 637966 -580851 -2478
81b478N65053j091603M53472O16256j021304L57999N71308q07404K38489M75296
$$ -2478 562575 -529028 -75556 540700 -480604 -122605 448703 -358701 -120212 355084
91C55084o28914J90773L35618m74053J44450K69270l69821J13340J86448k08867
$$ 355084 -273830 -83057 252561 -221492 -77042 192228 -177593 -64253 122195 -86672
101h6672L3132J13544o1616j9119O878N4597l8233q5121J67315n9886j49358K62516
$$ -86672 -53540 60004 -1612 -20731 -13853 40744 2511 -82610 84705 24819 -124539 137977
113A37977r4089j98975L25201j02775k63483L85087j15604l05506M21439j11499
$$ 137977 43888 -155087 170114 67339 -196144 188943 73339 -232167 189272 77773
123G7773l09759M24953j06305l15753M27943j33273k98355M34457j67716k62754
$$ 77773 -231986 192967 86662 -229091 198852 65579 -232776 201681 33965 -228789
133b28789M25482j78752k37855M17883j91104j95910L85392k29999j26742L52736
$$ -228789 196693 17941 -219914 197969 6865 -189045 196347 -33652 -160394 192342
143A92342k71203p1109L67225l19846m7219L93098l46702l8075L73276l27370
$$ 192342 -78861 -149970 217255 -102591 -149810 243288 -103414 -141489 231787 -95583
153i5583k5930L26290l21107K5360K96541l48571Q2381K82795l69787Q8068K86156
$$ -95583 -121513 204777 -116330 -90970 205571 -143000 -60619 222176 -147611 -59543 226613
164B26613l69465P4304K81021l52328Q3181K45559l22382R5456K18038l06309
$$ 226613 -142852 -68548 212473 -139855 -56674 188885 -133497 -38041 179997 -126312
174a26312R4359K00705k95482R5498J72821k59958Q7343J56403k25175O5986J53204
$$ -126312 -31953 168752 -126730 -31232 141589 -118369 -31026 125377 -99798 -33812 119392
185A19392j98803L7190J38941j43642j0168J14100o7746m6726Q0732p762n0735
$$ 119392 -79411 -42221 96720 -46922 -57090 57010 -10736 -57462 23270 15508 -35227
196c5227L1952L9056o0428m832Q0573p8057k2053J15257q4058n3093J56813q9332
$$ -35227 -3275 35781 -24647 -29479 51094 -26963 -49016 66241 -17817 -70910 85903 -3429
208c429q1944J86064j01965q9233J93221j13506r0212K20570j38085r2834K60786
$$ -3429 -85373 100691 -1274 -90507 102714 -10792 -101004 119566 -18519 -111353 149433
219A49433j74109j00435K89715j85286j23690L14065j87131j43843L33202j89429
$$ 149433 -24676 -125111 164604 -20682 -144372 169693 -17438 -161281 171921 -17508
229a7508j44091L36203j82959j55315L34588j76634j67447L38423j70495j63965
$$ -17508 -161599 174604 -8355 -163670 170918 -5716 -173163 165260 -5235 -169200
239a69200L20404j50542j59449K98027j33007j50790K77694j35658j29720K49840
$$ -169200 151204 662 -158787 139240 6233 -144557 133137 -2521 -132241 117599
249A17599j26169j12094K30278j12908j05727K13377j08887q9400J86564r6284
$$ 117599 -8570 -120664 109614 -3294 -109021 104356 -4531 -93931 92633 -3651
259c651p9358J60503p9614p8320J49502o3558p1244J22540l9315p1821Q6104o400
$$ -3651 -83009 77494 -2120 -80440 69062 5504 -65740 56800 17485 -54336 31768 25368
271B5368o8568N5823J2399m9534J9082L0667l0697j2647M9225k7157l3418N7271
$$ 25368 -43200 12623 25022 -24512 -5430 25237 -5460 -18107 31118 3961 -29457 27814
283B7814j6816n5865P3879p102p9001R3805j0864q8529J02313j0101r9703J13218
$$ 27814 10998 -44867 29012 21910 -57091 36714 25850 -62679 39634 29533 -70170 43048
295D3048j4256j14219J37412k5440j18087J53528k9010j33039J65469k7247j51602
$$ 43048 28792 -85427 51985 26545 -91542 61986 32976 -100063 65406 38159 -113443
306a13443J83160l0753j58887J89358k5932j66759J92935j5766j81023J97488
$$ -113443 69717 38964 -119923 69435 43503 -123256 69679 53913 -127110 70378
316G0378j4732j82696J89038o298j77307J75487M763j73278J67793J386j58453
$$ 70378 55646 -127050 61988 55690 -121617 53870 58633 -114645 53148 54534 -103919
327a03919J52683N21j44311J36735M021j37316J31615K086j23647J19486M239
$$ -103919 48764 49285 -95026 41709 45730 -91586 40029 42115 -81532 37954 42193
338D2193j14842J01613J4466j14010R1695K1436j04891P3877L2378r1957M6117
$$ 42193 -72649 28964 43430 -70580 21115 42551 -62340 11537 43915 -48042 -1925
349a925N0233q3664K3425N5100o5259k477N9912m0906k7600O7469k7704m2778
$$ -1925 48308 -35356 -11931 43169 -22090 -24567 35345 -5561 -33161 34308 6604 -36174
361c6174O4500j1093n7018O1289N732p3136O3339J3000p5835O1189K0562p9492
$$ -36174 28326 17233 -39785 21504 27236 -45900 17439 30439 -45396 15793 36355 -43137
373d3137N7562K5528q9829O4692K4753r1719O7278K7264r6279O7507L4811j07571
$$ -43137 14425 39953 -49876 14816 39569 -52150 15128 42392 -53887 13620 48431 -59140
385e9140P6009L5291j16699P6950M2422j21886P0977N8526j26693O4390O0782
$$ -59140 16869 52160 -64539 12411 54833 -67053 3924 62450 -64243 147 60929
396F0929j19956N5380O0351j09796M5021O3517j09293M1894O5041r9642L3035
$$ 60929 -59027 -3647 56704 -53092 -8071 55446 -53847 -11953 53088 -46554 -13519
407a3519O3242q6036J8606N9663p6446K1073M9750o9713K2980M4338o4404J7132
$$ -13519 49723 -36313 -17707 41956 -34490 -13417 36333 -33380 -10400 33938 -30466 -13334
419a3334N2198o5278J2284N0874n9698O453M9112m9001k150N4985m7444j0800
$$ -13334 38864 -26414 -14130 36744 -22954 -16501 32611 -16390 -18540 36445 -10999 -21799
431b1799N5878l5366k2311M9817j6305l5741M4164n951l4293L7382m07l3641L1120
$$ -21799 34079 -1287 -23598 26219 9914 -25827 18337 12386 -21907 15475 15068 -18573 12547
444A2547O494m2737L2386J3745m5238K4044K1585l9499J0746K8456l6528J0878
$$ 12547 19041 -23696 8690 22435 -22803 1241 22826 -16673 -5927 22529 -13999 -3121
456c121K1051l4249J4888J6526l5778J8078K4273m7799K2212L1278n4332J8505
$$ -3121 17930 -16319 -1431 15095 -20683 -2605 21668 -26131 -3919 27359 -26973 -8468
468h468L9983n4300N949N1191n4359N22N2014m7233j672M6516m0786o966N0222
$$ -8468 31515 -22785 -16836 34355 -20004 -19482 32532 -14701 -16373 30143 -10643 -17609 32613
481C2613m3625r528N3292l8468j7490N1492k4735k7682M7364j7545k2591L5148
$$ 32613 -11012 -20540 32752 -5716 -23206 28286 3551 -24131 23233 5688 -16903 18245
493A8245j8484j1599K8098k0163j0040L3306k3558j1518L4496k2650j3042L1915
$$ 18245 -239 -11838 16260 -3903 -13943 19363 -4195 -15713 18783 -3867 -16909 15006
505A5006j6002k0939L7205j5588k6190M0668r213l0859L3641L884l5886K7051
$$ 15006 -996 -21935 15270 -318 -26508 14160 4947 -25912 7729 11613 -24273 2778
517B778P820l1181K2877Q811k8217J6562J7452l3164J2749K5013l0979J279K5785
$$ 2778 10598 -20583 2294 11105 -17112 -550 16902 -16262 -3513 21500 -9479 -8200 17585
530A7585j6579j1670K3312p449o904J1669q178R97P871j0869K32J6338j7986l259
$$ 17585 1006 -10664 12648 5199 -1705 9964 1786 2783 10654 -215 17 16355 -1631 -4890
544d890K0529j5237n614J7692q804j1216J8343r435j2209J9787p384j2654J5580
$$ -4890 15639 402 -5212 12480 3676 -7540 10803 1368 -10841 8946 1562 -11092 4488
557D488j821j6910J7920p35j7037J6754p14j6408J1484P831j9844J0783J1218
$$ 4488 2667 -14243 3677 2942 -14095 2659 1945 -14463 -2979 4852 -14992 -4209 7009
570G009j7771M466R731p604j170P325n999L663K14n629J0461l149n142Q797J472
$$ 7009 -10762 -6296 3435 -4169 -5339 1986 -4013 -350 -136 -5765 4696 1547 -3595 5202 6674
585F674j1904R372M778j3297R447M545j2032N202R559j4427M875J0613j5761M395
$$ 6674 -5230 4142 8920 -4377 5070 9615 -2417 2785 12344 -2083 2792 13405 -2356 2039
599B039Q940j2171j833J4769j0492o616J4576o341r070R819K109j2389O049L774
$$ 2039 10979 -1192 -3025 11744 1252 -5364 9212 2871 -6199 3620 5729 -6660 -611 3163
613C163p628K134R24o98m12P87k382K248j157k473L686k218K39P63n08m94L969
$$ 3163 -4465 -2331 -1407 -2105 -2517 -1730 -4112 -1864 -3021 -5494 -1808 -4026 -3787 -3024 -3532 -4026 -57
630e7l387k115Q713n537m235P784R88r971Q719M985j2867P414O906j1405J053
$$ -57 -3444 -5559 3154 -2383 -6618 1166 2154 -7817 902 5887 -6980 434 7340 -4065 -3012
645c012J2354j1304k140J3398q913m976J0817k02j0930J0159J205r930O435J757
$$ -3012 9342 -1962 -4102 9296 383 -4593 6224 6022 -4908 5251 6456 -3474 2961 4718
659D718n729J898M214n930L007O42l890M574j981k405L248k12o479O984l7q205
$$ 4718 -1011 887 5101 -829 2178 2820 -1070 3504 1523 -882 2366 2154 -4325 2659 2622 -5583
675e583Q833K06r026N751N094j2496O878P183j4013M510R333j1916o73J5165j2639
$$ -5583 3250 3456 -5570 181 5275 -7221 -343 6840 -7173 -2663 6670 -5246 -5919 9246 -3393
690c393m369J6221j0079o887J3796k828j1357J3265j632j0789J0532P90q567O156
$$ -3393 -7762 8459 -1620 -8507 5289 2461 -8896 4369 2737 -8052 2480 3270 -5297 859
704H59L489j0800O503K885q019O039J700n894K466L561p665O205J231q021P514
$$ 859 4348 -6452 51 2936 -5083 956 2656 -3238 -772 2789 -4876 1329 2560 -5461 2053
719B053j01q406O718N821j3265P068P691j5304N046J0486j2855j48J5387j4503
$$ 2053 1952 -6454 264 6085 -7180 -112 7579 -7725 -2679 7807 -5048 -5196 10191 -4312
733d312k610J6483j1895m530J5842p967j0353J7586o204j1120J5852k968j0629
$$ -4312 -6922 9561 -2334 -6864 8978 1011 -9342 8244 2040 -9080 6772 3804 -6825
746f825J1120J114j2595J1744J83j0292J0008j171q470Q445J095j0113J0649j038
$$ -6825 4295 5409 -7186 4558 4741 -5551 4457 3286 -5184 3261 4356 -5757 4892 3854
760C854r601J0838k787q204J0070O3j2457J2959K64j4835J3856J981j4726R135
$$ 3854 -5747 5091 2304 -5900 4170 4233 -8224 4735 4999 -9836 4020 6001 -8725 410
774D10Q107j8138P741J0754j6821M728J0893j2748q95J3763j1971j725J2433r397
$$ 410 8517 -9621 -1880 8874 -7947 -3219 7674 -5074 -5969 7794 -4177 -5902 6531 -2866
788b866k666R417m327n675R660m116l554P277m218j871M986k599k942P564n345
$$ -2866 -5532 3885 -442 -6117 3543 -573 -4127 3150 -1068 -2939 2047 -552 -3494 4070 -1275
803a275k523R156o667k760R395m336o862J2187m822q749J3358l184r242J0693
$$ -1275 -3798 5358 -1309 -4069 5326 990 -5872 6315 1493 -7256 6102 2918 -6324 4369
817D369J328j3076J0934K237j3268J0221L095j1304N646O330j2162N771O069j0641
$$ 4369 5697 -7379 3555 5792 -7476 2745 5840 -5464 182 6512 -5650 121 6190 -4451
831d451N146L259p680L778L728q686O182K452r869Q501N79q637P296L153j1936
$$ -4451 695 3954 -3726 52 3780 -4906 1276 3728 -6141 2360 2939 -5698 1598 4751 -7185
846g185Q653L929j4310J0787M844j4388O919R585j6090M032J2337j4760K310J0499
$$ -7185 1468 5397 -8913 1874 6718 -7670 -751 8834 -7256 -3224 9113 -5647 -3337 7162
860G162j0621j233J1516r447j551J1066r150k187R045m857m786R402l835m961
$$ 7162 -3459 -4692 6824 -2623 -4174 6892 -2258 -4445 4600 -257 -5043 4359 524 -4437
874d437Q100n011j626O462m080l386R050o181m856J2033o747n087J1819m754r212
$$ -4437 3663 -1348 -2974 3488 -592 -3978 5072 -1109 -5965 6068 -679 -5766 6053 1299 -7913
889g913J4177l684j1931J6754l326j3544J4279K243j7030J3569N534j8748J2518
$$ -7913 6264 2580 -9351 7403 4077 -9467 4812 7055 -9975 3594 9128 -9620 2898
902B898N613j6693R060Q559j7373Q684R288j8352Q936Q035j5035N792R093j4830
$$ 2898 8511 -8182 878 9437 -7936 748 10036 -8316 620 8655 -6380 -588 8505 -6325
916f325M893R137j4928P010O600j3336N390R350j5868N215J1777j8033N539J2493
$$ -6325 -1432 7705 -7223 -213 6387 -6949 -1559 7791 -8077 -2862 8915 -9118 -3579 8914
930H914j6461J002J6037j5304k851J7745j2935m785J5400q039q341J6270o275
$$ 8914 -7547 -6545 9492 -5812 -8663 9082 -3853 -8638 6762 -1277 -9618 6652 377
943C77j0377J6567n026j0564J3784Q7j3688J2024L084j3856J0230K959j0747P106
$$ 377 -10000 6567 1541 -9023 4761 4848 -8840 3184 6268 -7588 2642 5601 -5146 1960
957A960M710j2205P929M982j3479R153M086j2964P593P129j5888Q144Q780j7914
$$ 1960 6670 -5535 2394 7376 -6103 3050 7136 -5828 1765 8894 -6994 1150 9930 -7984
971g984Q805R326j7783N393J3746j8639L113J6044j8545J681J4858j5025j365
$$ -7984 821 10147 -7636 -2243 11503 -7136 -4023 12021 -6524 -4843 10015 -5010 -6375
984f375J6305j4547k807J7400j4824k990J6317j0525o267J5486q655o309J4238
$$ -6375 9930 -4617 -7424 9976 -4848 -7838 8479 -2046 -8313 7173 -1482 -7791 6447
997F447q880k901J0910p420m257J2665q183n600J5369r160o068J3933n979q625
$$ 6447 -2433 -5334 5576 -1844 -6101 6564 -1619 -7219 8150 -1010 -7078 6855 876 -7749
1011g749J4664m753j0506J5539m868j0322J2801K7j2510J0789L215j4751J0093
$$ -7749 6915 2162 -8344 7195 2327 -7995 4806 4833 -7677 3112 6327 -8424 1669
1024A669M582j2743O020P713j3177L843R475j2513K891Q396r372N4Q542q384m88
$$ 1669 6251 -6492 -472 7241 -5936 -2093 7382 -5131 -2240 6156 -3216 -3162 5380 -3004 -3492
1039c492Q839q148N96O951p279l83Q510q102j019J0521j0202J66R446q728j771
$$ -3492 5347 -2801 -2205 4746 -2533 -2916 5594 -2508 -3527 6994 -3208 -3042 6404 -2324 -4095
1054d095J1821q955m416J3668r322m060J2931p301o082J3198o315p635J3903o253
$$ -4095 7726 -1229 -5645 8023 -1299 -5359 7572 271 -5811 7387 1072 -6563 7340 1087
1068A087o553J0874l397p939J0077j591q071J0106l368n722Q337l269n650Q877
$$ 1087 -5466 5408 2011 -5928 4149 2558 -5513 4593 1225 -4497 3840 571 -5079 3798
1082C798l042o333R731m617m927Q713k740o275Q579j397q612J0575j922q069Q498
$$ 3798 756 -5577 4154 -463 -5390 3323 583 -5692 2887 1490 -7122 3453 1531 -6538 1960
1097A960O75q656O593L277j0246O345L835p937K493O068p418N33P456p754Q76
$$ 1960 2635 -6021 572 3849 -6397 -52 3783 -4154 -1661 4407 -3011 -2478 4978 -2776 -1900
1112a900O065n216j308N964m152k097O945m848j069N247l526k354O547l830l639
$$ -1900 4165 -1051 -2359 3605 -547 -2644 4301 -547 -1616 3631 105 -2249 4298 468 -3171
1127c171R046n926l254Q932m970m956J0209m342p616J1813l904q095J1078j789
$$ -3171 5875 -51 -3305 5627 657 -4299 5910 1568 -6048 5765 1861 -6234 4844 3055
1141C055r765J0709J90j2100J1064J080j0926Q513K502j1101P195M271j1164P206
$$ 3055 -6710 3999 4189 -7911 3153 4233 -6693 1820 4322 -6779 416 4687 -6477 729
1155G29K888r092N366L360q123M599L746q525N423J749o982N555J996p122M565
$$ 729 3617 -5475 -109 3251 -4872 -273 3473 -5052 371 2120 -4862 693 2689 -4433 132
1170A32L379q626N496L086p578L704M531p503J914O217p728J924N434o293l91
$$ 132 3511 -5115 381 3467 -4111 -407 4124 -3379 -1465 4752 -2976 -1052 4382 -1911 -2302
1185b302O206m201k449O805l774k152M761j932k850L959k12m166M741j286k628
$$ -2302 3904 -297 -2746 4059 285 -1867 2894 962 -1888 2071 1859 -2307 2434 1148 -1480
1200a480L120l56k534K572J57l504L895j155k672L649q49l164L814r5m952N319
$$ -1480 1640 1284 -1250 1322 1479 -2025 1870 715 -1957 1692 843 -2321 1493 1398 -3554 1765
1216A765l93m933M587O21n115M171K011o864M757J768n857L199K470m833J890
$$ 1765 1372 -3561 1026 1647 -3468 703 2714 -4150 607 2375 -3482 -283 2187 -2646 -756
1231g56L510n696K332K544m344J902K133l422J015K575m202K512J315l694K325
$$ -756 2754 -2942 -610 1934 -2410 -508 1625 -1797 -782 1793 -2409 103 1418 -2276 49
1246D9J621l654J325L590n301K302K990m991J278L755m524m29N786n306o47N773
$$ 49 1670 -1984 -659 2931 -2370 -68 2922 -2069 -791 2964 -1560 -1989 3797 -1509 -2156 3617
1262C617m311j665N587k410l864O319k419l449M954r00l633L991L82m910M814
$$ 3617 -694 -2359 3228 818 -3046 3273 854 -2595 2359 1459 -2174 1817 2199 -2711 2103
1277B103n03l724L931k02l544L180O39m459M225m05l441L801k85l811L334J265
$$ 2103 1600 -2124 1807 1605 -1939 1241 1880 -2579 1646 1241 -2200 1601 1316 -2495 839 2104
1293B104n520M565J069n689L898K158n708K319M367o767K314M006n857J209M277
$$ 2104 -3416 1149 2218 -3471 427 2585 -3123 -804 3563 -3204 -890 3116 -2741 -1532 2745
1308B745m544l26N216m959l44M517l086j127L845k344j844L930k408p67L088k117
$$ 2745 -1799 -2125 3091 -1868 -2212 2305 -781 -1908 1937 -407 -2251 1679 -729 -1496 1592 -525
1324e25q36K616j504j753L891k280j042L373k320j285L310j153k477M088j749
$$ -525 -1361 1255 -249 -2002 1889 -391 -1433 1940 -380 -1665 1645 492 -1985 2103 354
1339C54k498L697o57k726L036P30m455L468Q68l687K383J662l403J181K424l871
$$ 354 -2144 1553 896 -1830 1206 1936 -2519 949 1817 -1870 513 2175 -1228 -47 2377 -1494
1355a494J607J741k719P56J540j867j06K291k485M87J864k465J137J064k020J71
$$ -1494 113 1854 -865 -109 1431 -436 -542 1749 -736 -249 1615 -850 287 1351 -669 -498
1371d98K470k957N35K158k746N63K193j947j246L656l123o19L678k712j207L212
$$ -498 1972 -985 -450 1708 -1038 -475 1718 -229 -1475 2181 -942 -1561 2117 -595 -1802 1410
1387A410q75k796L452n49k703K782j23k279J556J218k787J452O60j547R84L61
$$ 1410 535 -2261 1191 642 -2061 721 598 -1681 -125 1093 -1694 -242 418 -1129 -145 216
1403B16j005L47R73j668J397J66j111P03Q6p12Q37M74j861J850j52j605J475L94
$$ 216 -789 -442 531 -1137 260 426 -685 18 104 -608 229 703 -1158 692 540 -1065 410 804
1421H04j353O44J204k046Q43J298j773M75J277j179q28K146j501m62J565q37k19
$$ 804 -549 95 1299 -747 96 1394 -379 96 1373 194 -634 1512 11 -451 1114 277 58
1438E8M44K36j415J070j12l74M69k08k22k31M94m74O13p58J14M73r39P29n2m06
$$ 58 502 738 -677 393 281 -93 376 168 -54 -285 209 -265 348 -410 -296 177 -762 -33 -85 -491
1458d91k42J008j153j40J208m94m77M52L28j445J392J1r20R27K42p09n5J148q08
$$ -491 -733 275 -878 -1018 190 -304 -781 -329 -1 -1446 -54 -43 -963 -36 206 -503 -558 590 -218
1477b18k67P69n67J01K30K6m74P70l47RK07l19L93j87K34j45N64p29J89O33q16
$$ -218 -485 284 -283 -182 48 74 -400 370 23 32 239 -80 313 126 360 215 779 50 239 872 56
1498E6L65K64m15k42J275j231M2J241j459k14R48l31j025J441l37r80J094m05
$$ 56 421 685 270 28 1303 72 114 1355 -104 -318 630 299 -726 715 378 -602 492 87
1516H7q64Q41M98j131P84k32o18O93n01L65JLj80K37m61R2O37r30L28K95m94j97
$$ 87 -777 64 562 -569 215 -17 -635 58 -443 -78 -77 -74 -254 -17 -478 -386 251 -679 -351 -56 -550 -747
1538g47J019n41o16J342n63o27M52M73r48O12N34j094M11O48o49j88J200q97l06
$$ -747 272 -269 -885 457 -106 -733 -281 192 -756 -144 390 -704 -293 355 -294 -482 718 -179 -485
1557d85R41l29l57L51L47q84Q21J44o79Q0L04K7n76J032q20O9L39j61J27j47O09
$$ -485 456 127 -230 121 468 -416 405 549 -130 -50 254 281 -295 737 -83 -14 325 164 291 144 753
1578G53p63M97o54L67J4j14M69n4l31K5K81p85M29N86r51M60j01l72N4P32n91
$$ 753 -10 487 -167 200 214 100 569 515 184 209 490 -295 134 720 -231 229 128 -244 -190 542 -49
1599d9m95R03o78k66N36J34m59L99k56l21M79j54kr8O48o97M5J22l8J58j7j61
$$ -49 -544 359 -319 -585 -49 85 -374 25 -231 -552 -73 -227 -229 -327 321 -376 -331 -209 -247 -89 -106 -267
1621b67N6K75n25K63J42l98P63l66k94O7N71o32N29K61q62M14K96k13l22Q79m58
$$ -267 -211 64 -461 -198 -56 -454 309 -57 -351 -284 287 -345 184 445 -417 -3 293 80 -242 637 179
1642A79l83Q28o92L1L77K18p34O54l70k27L62L08p27J38N11p03N65k82r8J78p5
$$ 179 -204 624 -68 -37 340 558 -176 478 108 -119 243 551 -176 -38 473 -230 335 53 -45 133 58
1663E8L49l75J27p1K19l23J15K95k73j30J69K35p51O57j39n79O53m4m67j12O97
$$ 58 407 32 159 88 307 -16 99 394 121 -9 160 395 -356 301 162 -417 236 192 -275 -387 310
1684C10r00K59L79n27NN80j66o25Q74m70l03N68n7k77j14M45n11N70j05j7Q9l33
$$ 310 -590 -331 48 -479 -474 106 -60 -685 189 -281 -584 -16 -73 -350 -464 -19 -530 40 -65 -82 7 -326
1706c26N06k03rj64M10l74K6L98n26M12P3j56k70O53m15k59N05m04K11J26J15
$$ -326 180 -23 -32 -196 214 -160 -134 264 -262 150 223 67 -203 450 35 -224 281 -123 88 214 329
1727C29n28M19K97p76O44M4l55l4M98o22L28j5l89L46Q3j96l96N98m57M09J18
$$ 329 -199 220 517 -259 385 429 74 40 538 -84 244 229 -160 186 269 73 -323 275 -182 227 345
1748C45o73M97jm75n8O92o33L09R2n90N98mm32m5M82l45J07M42m85l5K00k3m64
$$ 345 -328 169 168 -307 -365 327 -306 3 95 -495 103 99 -333 -378 104 -241 -134 308 -177 -212 -12 -35 -499
1771d99N14K3n56Q80k90n33M21K48m04L58j48q0K81l28O4K27o4j15Jmk53O67m15
$$ -499 15 38 -518 362 72 -461 -40 208 -196 162 14 -66 215 -113 -49 178 114 -1 0 -4 -257 410 -5
1794ek3K72J43o77P23l00l30O55p7m81J14M38q00O23J96n90J9N01n09j9N46k07
$$ -5 -28 244 387 -290 433 133 -197 458 381 -100 14 452 -348 275 471 -119 -100 401 -108 -127 419 212
1816B12r5J88n42J39K76j22k98M53l60k20M89l09N7Q1J40m74O82o00J03N81p44
$$ 212 117 305 -237 -98 178 56 -242 211 -149 -369 120 -189 -132 -51 89 -385 297 -303 -200 381 -363
1837c63K49j21J36k33M09j75m21R09p37K80L8N3m68M58J25m96M75k2l98L19j9
$$ -363 -114 -235 -99 -332 77 -98 -519 390 -347 -67 -29 24 -444 14 139 -357 118 96 -302 17 -2
1858bl57N46P3n48K97J68j66K30j53r5K51j0m49M95m01K0J35L16l44r1L86m90
$$ -2 -359 187 260 -288 9 177 11 241 88 -7 244 234 -215 280 -121 -101 34 350 6 -85 301 -189
1880a89K14K03k97K77J06o00K71L57m89K85N2Q3k95M18l29j04L60m65R4K31L6
$$ -189 25 228 -69 208 314 -286 -15 342 -147 138 190 273 -22 396 67 -37 323 -142 -48 183 219
1901B19m87N87l22KJ06l01L10K58k70k60L13q9l98N57k08l71N01k39l08O26k33
$$ 219 -268 319 -3 -1 105 -196 114 372 102 -158 155 66 -332 225 17 -354 147 -92 -400 226 -7
1922gn33N52j81J29k1J33l15K36J49m72K03K2o8J41K69l66l5K50l78K79n8L30
$$ -7 -540 12 -169 -40 -61 72 -243 -7 142 -330 -127 -105 -173 -32 237 -129 -164 86 -292 -13 -71 259
1944B59k75K15k21J4K01o2P7n6J45l06K62m2P1L84q95L46M19m42j16M89k50k46
$$ 259 -16 199 -22 -8 193 131 208 152 297 -9 253 211 282 666 -229 117 536 94 -22 467 217 -29
1966b9L28l20J43j2N3k84K98k33k77O05l28O7Q8O5j97O2J10n42M16k19q6J06k9
$$ -29 299 -21 122 110 163 -121 177 -56 -333 272 -56 11 99 164 -33 29 139 -403 13 -206 -292 -186 -215
1989b15j57M12K7m52N08j04k41J31p0r5R2J78l25L20m04J17K74R8m63K32N1j74
$$ -215 -372 40 67 -385 123 19 -222 -91 -161 -256 -164 14 -311 9 -395 -278 -4 94 -369 -137 -86 -260
2011b60L60KM3k88K47rk19M52m45J01J5J65m13O61l88j5K48l60L37kq5k84O30
$$ -260 100 102 145 -143 104 95 -124 328 -117 -16 -1 164 -249 412 24 9 257 -103 234 232 147 -137 493
2034D93o42K11M97m23o2K01l02RO0J76l59J74l02L4K88L29m16RJ87j82J46k39
$$ 493 -149 62 559 136 74 275 -27 -18 42 218 -141 33 -269 -235 53 382 -34 -25 162 -20 126 -113
2056a13k3M1k3O7m7J55j49J49j21p7M5R8j3k22J87j11k1m7L64n4l20K88j31j01
$$ -113 -136 -95 -118 -51 -98 57 -92 57 -64 -141 -96 2 -11 -233 -46 -157 -178 -225 139 85 -235 53 -78 -179
2080a79N5J08K13k16l5J7j3j97N19m36K12q4J62j2K87l64q7K27k31J36kj87J35
$$ -179 -124 -16 197 -19 -54 -37 -50 -247 272 -164 48 -36 126 114 401 37 -50 177 -54 82 80 -107 28
2103B8o2O3j40L68j64j22J17J3l5K38j00k49oML07k1j38M7n7j50J72R1k16J03
$$ 28 -34 29 -111 257 93 -29 88 101 66 304 204 -45 -51 -47 260 239 101 148 91 -59 113 204 -12 91
2127I1O7M1m55J88J12J16j61j25M36p02N8J96m9O8J58m5q7k0J32m1l83J16K67
$$ 91 158 199 -256 -68 44 160 -1 -126 310 -392 -334 -138 -187 -119 39 -6 -93 -113 19 -22 -405 -289 -22
2150b2j43J82q9j42P4K95Jk15N2k09K64J2J0j17J4J63j91L65l44l2K00m1p2N2
$$ -22 -165 17 -72 -214 -140 155 156 -59 -7 -216 48 60 70 -47 -33 130 -61 304 -40 -72 128 87 15 67
2174F7n3j59J87m3r8j02K74L9k6J4o5J35n9n7Q8k31L56l25P4K6Q0m5J4j27ll03
$$ 67 14 -145 42 -1 -99 -201 73 112 86 100 35 170 111 54 142 -89 267 -58 16 42 122 77 91 -36 -39 -342
2200c42K36K66m09L87l13J16k4J09j43q4M52n01J47j48L58k75K96j02l8Q2q8J63
$$ -342 -106 160 -249 138 -175 -59 -83 26 -117 -201 251 -250 -103 -251 107 -168 128 26 -12 70 -18 145
2222A45j73K48k73J85R2j58j69O5P0k51J34n1j2K41O0k74J95L9K3M5k47J2J64
$$ 145 -28 220 -53 132 224 66 -103 -38 32 -219 -85 -136 -148 93 153 -121 74 113 136 181 -66 -54 110
2245A10l7J44j50r4J15j84M6J16k2j38J09j76J74J21R1K0l45L38j16j94K08r1
$$ 110 73 217 67 -27 88 -96 -50 66 44 -94 15 -161 13 134 225 245 -100 238 122 -72 136 45
2267D5L70k57j15R3k74k6L71l87J20J79k65J74J02j31j1JR9j90J89n3j0N1j29
$$ 45 415 158 43 136 -138 -164 207 -180 -60 119 -146 28 130 -1 -12 -11 88 -102 87 34 24 75 -54
2290e4lM1j35K78R1k84K19j92j1j56L93m46J40K39m9J25k06K5kj17J95K9j96R5
$$ -54 -57 -16 -151 127 218 -66 153 -39 -50 -206 187 -259 -119 120 71 196 -10 15 13 -104 91 120 -76 19
2314A9K99n65J73k76L65J21q3L1n8lj41J69J0J8N1j21j7r3Q3K00M7p2j87O6R8
$$ 19 318 -247 -74 -350 15 136 53 84 26 23 -118 51 61 79 130 9 -8 -101 -18 182 229 157 -30 36 134
2339A34k27M4J26j7J56k05N3j37O6o8J23O6O2j20l9j45j16L85L7m1k23lK15j24
$$ 134 -93 -49 77 60 216 11 64 -73 -7 -75 48 114 176 56 17 -128 -244 141 178 137 -86 -89 126 2
2363Bj54J06j48J52N2M2k07L1j86K44J07j02P7j14m2J1j36M03l10N4J27N0k5J23
$$ 2 -152 -46 -194 -42 10 52 -155 -124 -310 -66 41 -61 16 -98 -140 -129 -265 138 -172 -118 9 59 34 157
2387A57k97L1M7J51O9k64M73n57J30J19j49L33j50j82j24K03J11j79J14j61J44
$$ 157 -140 -109 -62 89 158 -106 367 -190 -60 59 -90 243 93 -89 -213 -10 101 -78 36 -125 19
2408A9J93j89p6J25j0m2j33L78q0j96L9J09p5r1R5R7k39J17k6m5P2R7r1K0r1j0
$$ 19 212 23 -53 72 62 20 -113 265 185 -11 28 137 62 -29 66 163 -76 41 15 -30 42 139 48 68 -23 -33
2434c3J39j79q3K1r8K64j21J83j85K42n5j62L4kq6j2Q7j5J08j09j71K94k8p9K90
$$ -33 106 -73 -156 -135 -233 31 -90 93 -92 150 95 -67 -33 -35 -121 -133 -46 -61 47 -62 -233 61 33 -46 244
2459B44k39o1J43k33p8J94j29L09L3p5j77o4Q0m6n6M5K56j54j44P1K29M6l73J29
$$ 244 5 -56 87 -146 -224 -30 -159 150 183 108 -69 -133 -53 -99 -155 -110 146 -8 -152 -81 148 194 -179 -50
2483e0k56K42K19k85K31J26o2j12l11K44p2l9lPJ07PK63k07K41k20K3J20l02J32
$$ -50 -306 -64 155 -130 101 227 165 53 -258 -14 -86 -125 -128 -121 -14 -7 256 49 290 70 93 213 -89 43
2507D3k47J87j79K86j59L7l6J48M8l45P9K4K16j34j43J03Q2j7r2n5J71N4Pk92
$$ 43 -204 -17 -196 90 -69 -32 -68 80 128 -217 -138 -114 102 -32 -175 -72 10 -7 -99 -154 17 71 78 -214
2531b14L61k14J68j0ro7J4n7Q3J80j18j94K31Nl73K79j0N4K9j56j46J71K00k14
$$ -214 147 -67 101 91 82 15 29 -28 55 235 117 -77 154 159 -214 65 55 109 138 -18 -164 7 207 -7
2555gJ69l48L37l65K44j0N3P3m13M03r0k03q6K71J32k85K08J67j7k72J89n6k2
$$ -7 162 -186 151 -214 30 20 73 146 -267 136 46 -157 -243 28 160 -125 83 250 233 -39 150 94 72
2578G2o8q0n5J42O3L0k71k6L85k31j23J3N6L7J27j7J12k98R0J28o8k9j09p7M21
$$ 72 4 -76 -131 11 74 104 -167 -193 192 -39 -162 -149 -93 -56 71 54 166 -132 -42 86 18 -11 -120 -197 224
2603B24j80j52K18J05j74k2p0L6K44lj89J63j49R9k34N0L5M4k1n0j25OL28j24
$$ 224 44 -108 110 215 41 19 -51 -15 229 226 37 200 51 150 -84 -34 1 45 24 -26 -151 -145 183 59
2627E9%N8j26L4n8J63J97k41j33j86K00j29K79j10J73l25J8J02N3L4j10l6N8L7
$$ 59 59 117 -9 25 -33 130 327 86 -47 -233 -33 -162 117 7 180 -145 -127 -25 28 62 -48 -84 -26 11
2651A1r2o6N06k10p5p7J0mj09J17o0L65m51N3J30r5p3N2j4J29m8k11J32R4j05
$$ 11 -81 -147 359 149 74 -3 7 3 -106 11 -49 316 -135 -82 48 -47 -120 -68 -82 47 -1 -212 -80 14 -91
2676i1l4K94n9k24J55N8j97J73k09K6J67J68m33J41j0Q9O5q2k3m2L29k88J04q3
$$ -91 -125 169 110 -114 41 99 -98 75 -134 -108 59 227 -206 -65 -75 14 79 -3 -26 -68 261 -27 77 -6
2700fJ10j44J41L06l99Q0K9P0k7n8l8p0j86K68K40k74k2K59l32K36p2J5k67K48
$$ -6 104 -40 101 407 8 88 117 187 160 102 64 -6 -192 76 316 42 20 279 -53 183 111 126 -141 107
2724A07k40J84j47J84J44j53j69p1K58k46J46j84J30k3J94j0j04M6j43m4J84l03
$$ 107 -133 51 -96 88 232 79 -90 -161 97 -149 -3 -187 -57 -80 114 104 0 46 -97 -141 43 -260
2746b60L77l01J20p7J53k54K22j9m2P5L1K15m09J78J64p7M5M9o7k0l26L90p7m0
$$ -260 117 -184 -64 -141 12 -242 -20 -39 -81 -6 25 240 -169 9 173 96 141 190 123 103 -223 167 90 50
2770E0k0K0j80J71j10PK12j59k34L06J9j32K57l88K27J64j93j8O6j97J13K34k31
$$ 50 30 50 -130 41 -69 -62 150 -9 -243 63 82 -50 207 -181 46 210 17 -1 65 -132 -19 215 -16
2793a6qj9J38K2q2R6k39J6L5j04J81J53k37N4j42K76k70K15J7k40K93n2R7k09
$$ -16 -24 -43 95 117 35 131 -108 -92 -57 -161 20 173 -64 -10 -152 124 -146 69 86 -154 139 87 184 -25
2817b5k27J77J0j02K18ro3NR4j86P7j15L91j99P4k25o9J20L61k17N0m2j53K9J50
$$ -25 -252 -75 -65 -167 51 42 -21 -16 78 -108 -31 -146 245 46 120 -105 -174 -54 307 90 140 98 -55 -26 124
2842A24Q2m75K46j30J02J93k39J5K08j33r5K24j22j13J09l9J07j23M4J03j56O
$$ 124 206 -269 -23 -153 -51 142 -97 -82 126 -7 -102 122 0 -113 -4 -43 64 -59 -15 88 -68 -62
2864f2J65m8J93m26L09m5Nj24J7J82k26J87J92m79L18r2k65K45j45J12k4Q4k13
$$ -62 103 55 248 -178 131 86 91 -33 -16 166 -60 127 319 -160 158 66 -199 46 -99 13 -11 73 -140
2887a40K41j9k19K00p2j54K39j65nR1l2k3J8j15K28J4k74K14l0j11J81j85j00
$$ -140 101 82 -137 63 -9 -163 76 -89 -94 -3 -35 -58 -40 -155 73 87 -187 27 -3 -114 67 -118 -218
2910b18M01k28K2l9K3J18O4J37m60N6M4o2J12J85q6J11j38J74l9j31j84J41o0
$$ -218 183 -45 -23 -62 -39 79 143 280 -180 -124 -80 -142 -30 155 69 180 42 216 177 46 -138 3 -57
2933e7r3J20K30l01p5J10j17M88l11K48k47m3j08M38m15r0J47n4j38K21J24l51
$$ -57 -150 -30 200 -101 -176 -66 -183 305 -6 242 -5 -48 -156 282 -133 -223 -76 -130 -268 -47 77 -274
2955b74L81K9j31K32j0k93l03J10K86k41K60L09l77j1J74j65l6n7K61O1Lk64Q8
$$ -274 107 136 5 237 227 -66 -369 -259 27 -214 46 355 -22 -33 141 -24 -60 -117 144 205 208 -56 32
2978C2r4M9J59j18n6p0J2K25p7N5j30j20J06k15J67pL7K30m22K52p3j2J94k50
$$ 32 -62 -13 146 28 -28 -98 -86 139 62 117 -13 -133 -27 -242 -75 -82 -45 185 -237 15 -58 -70 124 -126
3002a26r9J64P3J76r0k33J76R0R9k25L40l54qQ6l25K02n0j2K62k95J52Q3q9r8
$$ -126 -225 -61 12 188 98 -135 41 131 230 5 345 -9 -17 69 -256 -54 -104 -116 146 -149 3 86 -3 -101
3026a01J07Qj79K03jL9j96J68pl7m3O3j38J03J20j63J92k35L63j49j30pj00L26
$$ -101 6 14 -165 38 37 76 -120 48 41 4 -39 24 -114 -11 109 -54 138 -97 266 117 -13 -20 -120 206
$$ [...]
8191D7
##END NTUPLES=NMR FID
##END=
