##TITLE=1H_Pr AdCl
 CDCl3
 8 sc, 
 15.04.2022
##JCAMPDX= 6.0         $$ Bruker NMR JCAMP-DX V2.0
##DATA TYPE= NMR FID
##DATA CLASS= NTUPLES
##ORIGIN= UXNMR, Bruker Analytische Messtechnik GmbH
##OWNER= root
$$ XWIN-NMR		Version 3.5
$$ Fri Apr 15 10:51:50 2022 Russian Standard Time (UT+4h)  she@DPX200
##.OBSERVE FREQUENCY= 200.13135
##.OBSERVE NUCLEUS= ^1H
##.DELAY= (6, 6)
##.ACQUISITION MODE= SIMULTANEOUS
##.ACQUISITION SCHEME= undefined
##.AVERAGES= 8
##.DIGITISER RES= 18
##SPECTROMETER/DATA SYSTEM= spect
##.PULSE SEQUENCE= zg30
##.SOLVENT NAME= CDCl3
##.SHIFT REFERENCE= (INTERNAL, CDCl3, 0, 15.7039)
##AUDIT TRAIL= $$ (NUMBER, WHEN, WHO, WHERE, WHAT)
$$ ##TITLE= Audit trail, XWIN-NMR		Version 3.5
$$ ##JCAMPDX= 5.01
$$ ##ORIGIN= Bruker BioSpin GmbH
$$ ##OWNER= she
$$ F:/spectra/data/she/nmr/H-F/1/audita.txt
$$ ##AUDIT TRAIL=  $$ (NUMBER, WHEN, WHO, WHERE, WHAT)
(   1,<2022-04-15 10:50:36.20 +0400>,<she>,<DPX200>,
      <created by zg, POWCHK disabled, PULCHK disabled
       configuration hash MD5:
       00 E9 B6 7A A2 85 ED C7 34 08 36 98 17 FE 4E 26
       data hash MD5: 16K
       21 A7 4B B9 0C 1F D2 56 C4 75 26 E1 31 14 03 BE>)
$$ ##END=
$$ 
$$ hash MD5
$$ 88 AF 9F 6B E8 54 25 43 39 F5 4F 19 18 99 C0 61
##$RELAX= 
##$RELAX= 
##$RELAX= 
##$RELAX= 
##$RELAX= 
##$RELAX= 
$$ Bruker specific parameters
$$ --------------------------
##$DU= <F:/spectra>
##$EXPNO= 1
##$NAME= <H-F>
##$PROCNO= 1
##$TYPE= <nmr>
##$USER= <she>
##$AMP= (0..31)
100 100 100 100 100 100 100 100 100 100 100 100 100 100 100 100 100 100 
100 100 100 100 100 100 100 100 100 100 100 100 100 100 
##$AQSEQ= 0
##$AQ_mod= 1
##$AUNM= <au_zg>
##$AUTOPOS= <>
##$BF1= 200.13
##$BF2= 200.13
##$BF3= 200.13
##$BF4= 200.13
##$BF5= 200.13
##$BF6= 200.13
##$BF7= 200.13
##$BF8= 200.13
##$BYTORDA= 1
##$CFDGTYP= 0
##$CFRGTYP= 5
##$CHEMSTR= <none>
##$CNST= (0..31)
1 1 145 1 1 1 1 1 1 1 1 1 1 1 1 1 1 1 1 1 1 1 1 1 1 1 1 1 1 1 1 1 
##$CPDPRG= <>
##$CPDPRG1= <>
##$CPDPRG2= <>
##$CPDPRG3= <>
##$CPDPRG4= <mlev>
##$CPDPRG5= <mlev>
##$CPDPRG6= <mlev>
##$CPDPRG7= <mlev>
##$CPDPRG8= <mlev>
##$CPDPRGB= <>
##$CPDPRGT= <>
##$D= (0..31)
0 1.2 0 0 0 0 0 0 0 0.06 0 0.03 0 0 0 0 0.0002 0 0 0 0 0 0 0 0 0 0 0 0 
0 0 0 
##$DATE= 1650005435
##$DBL= (0..7)
120 120 120 120 120 120 120 120 
##$DBP= (0..7)
150 150 150 150 150 150 150 150 
##$DBP07= 0
##$DBPNAM0= <>
##$DBPNAM1= <>
##$DBPNAM2= <>
##$DBPNAM3= <>
##$DBPNAM4= <>
##$DBPNAM5= <>
##$DBPNAM6= <>
##$DBPNAM7= <>
##$DBPOAL= (0..7)
0.5 0.5 0.5 0.5 0.5 0.5 0.5 0.5 
##$DBPOFFS= (0..7)
0 0 0 0 0 0 0 0 
##$DE= 6
##$DECBNUC= <off>
##$DECIM= 32
##$DECNUC= <off>
##$DECSTAT= 4
##$DIGMOD= 1
##$DIGTYP= 9
##$DL= (0..7)
0 120 120 120 120 120 120 120 
##$DP= (0..7)
150 150 150 150 150 150 150 150 
##$DP07= 0
##$DPNAME0= <>
##$DPNAME1= <>
##$DPNAME2= <>
##$DPNAME3= <>
##$DPNAME4= <>
##$DPNAME5= <>
##$DPNAME6= <>
##$DPNAME7= <>
##$DPOAL= (0..7)
0.5 0.5 0.5 0.5 0.5 0.5 0.5 0.5 
##$DPOFFS= (0..7)
0 0 0 0 0 0 0 0 
##$DQDMODE= 0
##$DR= 18
##$DS= 0
##$DSLIST= <SSSSSSSSSSSSSSS>
$$ [...]
##$SUBNAM2= <"">
##$SUBNAM3= <"">
##$SUBNAM4= <"">
##$SUBNAM5= <"">
##$SUBNAM6= <"">
##$SUBNAM7= <"">
##$SUBNAM8= <"">
##$SUBNAM9= <"">
##$SW= 18.05172834244
##$SWIBOX= (0..15)
0 0 2 0 0 0 0 0 0 0 0 0 0 0 0 0 
##$SW_h= 3612.71676300578
##$TD= 16384
##$TD0= 1
##$TE= 0
##$TE2= 300
##$TE3= 300
##$TEG= 300
##$TL= (0..7)
0 120 120 120 120 120 120 120 
##$TP= (0..7)
150 150 150 150 150 150 150 150 
##$TP07= 0
##$TPNAME0= <>
##$TPNAME1= <>
##$TPNAME2= <>
##$TPNAME3= <>
##$TPNAME4= <>
##$TPNAME5= <>
##$TPNAME6= <>
##$TPNAME7= <>
##$TPOAL= (0..7)
0.5 0.5 0.5 0.5 0.5 0.5 0.5 0.5 
##$TPOFFS= (0..7)
0 0 0 0 0 0 0 0 
##$TUNHIN= 0
##$TUNHOUT= 0
##$TUNXOUT= 0
##$USERA1= <user>
##$USERA2= <user>
##$USERA3= <user>
##$USERA4= <user>
##$USERA5= <user>
##$V9= 5
##$VALIST= <valist>
##$VCLIST= <CCCCCCCCCCCCCCC>
##$VD= 0
##$VDLIST= <DDDDDDDDDDDDDDD>
##$VPLIST= <PPPPPPPPPPPPPPP>
##$VTLIST= <TTTTTTTTTTTTTTT>
##$WBST= 1024
##$WBSW= 4
##$XGAIN= (0..3)
0 0 0 0 
##$XL= 0
##$YL= 0
##$YMAX_a= 493016
##$YMIN_a= -530191
##$ZGOPTNS= <>
##$ZL1= 120
##$ZL2= 120
##$ZL3= 120
##$ZL4= 120
##$ABSF1= 10
##$ABSF2= 0
##$ABSG= 5
##$ABSL= 3
##$ALPHA= 0
##$AQORDER= 0
##$ASSFAC= 0
##$ASSFACI= 0
##$ASSFACX= 0
##$ASSWID= 0
##$AUNMP= <proc_1d>
##$AZFE= 0.1
##$AZFW= 0.1
##$BCFW= 1
##$BC_mod= 2
##$BYTORDP= 1
##$COROFFS= 0
##$CY= 11.3945322036743
##$DATMOD= 1
##$DC= 2
##$DFILT= <>
##$DTYPP= 0
##$F1P= 2.36226072786647
##$F2P= -0.459571619588291
##$FCOR= 0.5
##$FTSIZE= 0
##$FT_mod= 4
##$GAMMA= 1
##$GB= 0.15
##$INTBC= 1
##$INTSCL= 1
##$ISEN= 128
##$LB= 0.24
##$LEV0= 0
##$LPBIN= 0
##$MAXI= 10000
##$MC2= 0
##$MEAN= 0
##$ME_mod= 0
##$MI= 1.114404
##$NCOEF= 0
##$NC_proc= 0
##$NLEV= 6
##$NOISF1= 3.799351
##$NOISF2= 2.8
##$NSP= 1
##$NTH_PI= 0
##$NZP= 0
##$OFFSET= 15.70392
##$PC= 1
##$PHC0= -18391.99
##$PHC1= 11.80074
##$PH_mod= 1
##$PKNL= yes
##$PPARMOD= 0
##$PSCAL= 0
##$PSIGN= 0
##$REVERSE= no
##$SF= 200.130013532006
##$SI= 16384
##$SIGF1= 3
##$SIGF2= 2
##$SINO= 400
##$SIOLD= 16384
##$SREGLST= <1H.CDCl3>
##$SSB= 0
##$STSI= 0
##$STSR= 0
##$SW_p= 3612.71676300578
##$SYMM= 0
##$S_DEV= 0
##$TDeff= 0
##$TDoff= 0
##$TI= <>
##$TILT= no
##$TM1= 0
##$TM2= 0
##$TOPLEV= 0
##$USERP1= <user>
##$USERP2= <user>
##$USERP3= <user>
##$USERP4= <user>
##$USERP5= <user>
##$WDW= 1
##$XDIM= 8192
##$YMAX_p= 0
##$YMIN_p= 0
$$ End of Bruker specific parameters
$$ ---------------------------------
##NTUPLES= NMR FID
##VAR_NAME=  TIME,          FID/REAL,        FID/IMAG
##SYMBOL=    X,             R,               I
##VAR_TYPE=  INDEPENDENT,   DEPENDENT,       DEPENDENT
##VAR_FORM=  AFFN,          ASDF,            ASDF
##VAR_DIM=   8192,          8192,            8192
##UNITS=     SECONDS,       ARBITRARY UNITS, ARBITRARY UNITS
##FACTOR=    0.0002768,     1,               1
##FIRST=     0,             0,               0
##LAST=      2.2672688,     0,               0
##MIN=       0,             -530191,         0
##MAX=       2.2672688,     493016,          0
$$ Real data points
##PAGE= N=1
##DATA TABLE= (X++(R..R)), XYDATA
$$ plain form
0 0 0 0 0 0 0 0 0 0 0 0 -8 8 -16 16 -16 24 -32 40 -42 56 -64 80 -91 112 -128 152 -176 201 -233 268 -306 348
32 348 -396 450 -508 572 -643 721 -806 899 -1001 1113 -1235 1367 -1513 1671 -1846 2034
48 2034 -2242 2470 -2720 2997 -3304 3646 -4026 4457 -4943 5505 -6154 6919 -7832 8949
62 8949 -10348 12163 -14618 18140 -23643 33482 -56354 221449 -147248 -530191 350680 391353
74 391353 -384781 -310717 468053 176084 -465622 -73690 466923 -49857 -417176 128910
84 128910 360252 -213823 -283309 247306 199067 -281312 -115889 269205 40174 -254050
94 -254050 21421 212112 -63887 -167335 96348 119721 -99797 -71346 99199 39740 -72225
105 -72225 -10086 54270 3187 -23406 -2387 4187 18209 10844 -40781 -14987 60256 1431
$$ packed form
0@%%%%%%%%%%qJ6k4L2l2M0n6P2q2R8j20J44j71K03k40K80l28L77m34N01n74O54
32C48p44Q46r58J080j215J364j527J705j900K114k348K602k880L184l517L880
48B034m276M712n190N717o301O950p672Q483r400J0448j1659J3073j4751J6781
62H949j9297K2511k6781L2758m1783N7125q9836K77803l68697l82943Q80871M0673
74C91353p76134P4064P78770k91969o41706L91932N40613n16780l67319N46086
84A28910K31342n74075o9486N30615m8239m80379J65423L85094k29031k94224
94b54050K75471J90691k75999j03448K63683K3373k19518K8451J70545n9459j11965
105g2225O2139O4356n1083k6593K1019O574J4022p365n1625K5794P5243n8825
$$ plain form
117 1431 -85422 14252 93951 -48128 -104489 75477 91092 -113210 -72683 139259 38928
128 38928 -159149 1215 168738 -43963 -159198 94902 142498 -131703 -102282 168694
138 168694 62271 -181979 -5296 189108 -47834 -174654 101197 144311 -146355 -102549
148 -102549 173879 44787 -194162 8918 187582 -72500 -172348 121138 131668 -167348
158 -167348 -86017 194336 29341 -205941 32268 202652 -88855 -176335 145479 143437 -181951
169 -181951 -90031 214020 37806 -221907 24918 219498 -80859 -197142 130557 160714
179 160714 -171369 -118888 194347 64434 -210120 -16967 201755 -35916 -188990 73938
189 73938 159438 -107709 -128548 128127 92272 -136836 -54669 138585 25931 -126270 3627
$$ packed form
117A431q6853R9674P9699j42079n6361J79966J5615k04302M0527K11942j00331
128C8928j98077J60364J67523k12701j15235K54100M7596k74201K9421K70976
138A68694j06423k44250J76683J94404k36942j26820K75851M3114k90666M3806
148a02549K76428j29092k38949K03080J78664k60082r9848K93486J0530k99016
158a67348Q1331K80353j64995k35282K38209J70384k91507q7480L21814k042l25388
169a81951R1920L04051j76214k59713K46825J94580l00357j16283L27699L0157
179A60714l32083N2481L13235j29913k74554J93153K18722k37671j53074K62928
189G3938Q5500k67147k0839K56675l5855k29108Q2167J93254j12654j52201J29897
$$ plain form
200 3627 116247 -17874 -95096 33374 81339 -34995 -63506 35672 53498 -31263 -48648
211 -48648 24652 45429 -23958 -52567 18967 55694 -27061 -67989 32833 71431 -51059 -76837
223 -76837 68332 73283 -90628 -63660 114361 48072 -131218 -19628 149182 -7875 -152005
234 -152005 46844 153407 -79683 -138001 117656 116671 -147108 -84464 169054 44758 -183723
245 -183723 -4404 182739 -43180 -176783 81291 151937 -121323 -124383 145989 84603 -165830
256 -165830 -43447 172431 441 -166164 42403 152507 -75092 -124093 106631 97182
266 97182 -121848 -57947 134079 24164 -129834 11620 120376 -40351 -102677 62458
276 62458 78028 -80231 -54725 84375 24659 -87402 -4659 76468 -18506 -67344 30956
$$ packed form
200C627J12620j34121p7222J28470M7965j16334k8511R9178J7826q4761j7385
211d8648P3300K0777o9387k8609P1534L6727q2755m0928J00822L8598j22490k5778
223g6837J45169M951j63911K6968J78021o6289j79290J11590J68810j57057j44130
234a52005J98849J06563k33090n8318K55657r85k63779O2644K53518j24296k28481
245a83723J79319J87143k25919j33603K58074P0646k73260l060K70372o1386k50433
256a65830J22383K15878j71990j66605K08567J10104k27599m9001K30724r449
266I7182k19030O3901J92026j09915j53998J41454J08756j60727o2326J65135
276F2458J5570j58259K5506J39100n9716j12061Q2743Q1127r4974m8838R8300
$$ plain form
287 30956 50043 -41477 -33836 44951 19029 -40811 -4141 37543 -1953 -26326 10890 20847
299 20847 -8144 -9841 8424 6984 -1054 -4172 -3800 6040 7937 -11993 -12886 16767 9955 -28534
313 -28534 -9236 32986 -2819 -42020 10766 42236 -26006 -41954 39614 35897 -52995 -23117
325 -23117 66201 10193 -70522 11407 76224 -28437 -69660 52160 63053 -68492 -45430
336 -45430 85002 26023 -94178 -3514 97123 -23170 -95963 45293 82742 -70459 -69549
347 -69549 85080 45201 -99561 -23853 103438 -3636 -102684 28701 94504 -50097 -79257
358 -79257 70222 63328 -80264 -39054 90878 19738 -88797 5207 86520 -22450 -75687
369 -75687 39514 63345 -51939 -48851 58434 30755 -63693 -17852 59421 977 -58277 7488
$$ packed form
287C0956J9087r1520P641P8787k5922n9840L6670M1684l9496k4373L7216R957
299B0847k8991j697J8265j440q038l118L72R840J897j9930q93K9653o812l8489
313b8534J9298M2222l5805l9201N2786L1470o8242j5948Q1568l717q8892K9878
325b3117Q9318n6008q0715Q1929O4817j04661m1223J21820J0893j31545K3062
336d5430J30432n8979j20201R0664J00637j20293p2793J41256L7449j53201R10
347f9549J54629l9879j44762P5708J27291j07074r9048J31385O5803j44601k9160
358g9257J49479o894j43592M1210J29932p1140j08535R4004Q1313j08970n3237
369g5687J15201K3831j15284L088J07285k7679r4448M5841P7273n8444n9254O5765
$$ plain form
381 7488 48884 -19057 -42899 23394 33260 -27083 -25401 28491 20100 -26234 -12653 27882 11726
394 11726 -22929 -6173 24772 7577 -21936 -4302 24380 3863 -25263 -2352 26304 -1190
406 -1190 -30348 3297 29801 -11631 -33031 15536 29479 -25050 -29345 30506 22861 -38685 -15863
419 -15863 44108 7152 -46069 4851 48475 -13406 -44132 27399 41633 -34654 -31085 45182
431 45182 23087 -48957 -10525 52267 -1609 -52922 13206 47865 -26715 -43789 34280 32182
443 32182 -44517 -24574 46803 10420 -51322 223 48649 -12556 -44902 22864 39303 -29495
455 -29495 -29400 37869 22473 -38738 -9767 42269 3162 -38454 7300 37075 -13736 -31497 20010
468 20010 25326 -24880 -20339 25312 11967 -28824 -8388 26067 155 -27253 1969 22337
$$ packed form
381G488M1396o7941k3842O6293R866o0343J682N3892q391m6334J3581M0535j6156
394A1726l4655J6756L0945j7195k9513J7634K8682k0517k9126K2911K8656k7494
406a190k9158L3645K6504m1432k1400M8567J3943n4529m295N9851p645o1546K2822
419a5863N9971l6956n3221N0920M3624o1881l0726P1531J4234p6287L569P6267
431D5182k2095p2044L8432O2792n3876n1313O6128L4659p4580j7074P8069k098
443C2182p6699J9943P1377l6383o1742N1545M8426o1205l2346O7766J6439o8798
455b9495R5O7269j5396o1211K8971N2036l9107m1616M5754K9775n0811j7761N1507
468B0010N316n0206M541M5651j3345m0791K0436L4455k5912k7408K9222K0368
$$ plain form
480 22337 -7462 -21084 9294 18323 -11448 -15081 14129 14100 -12759 -8941 16293 10245 -14872
493 -14872 -5407 18454 5126 -17246 -1344 18472 -1405 -19372 3669 18101 -8565 -19295
505 -19295 9867 14720 -15813 -15178 16244 10325 -21251 -8528 21915 2910 -23243 2089 24205
518 24205 -5705 -21877 12171 22199 -14673 -15924 21368 14258 -22169 -7266 25651 3823
530 3823 -24966 2733 24107 -8883 -23200 11950 18120 -17427 -16590 18063 9699 -22897 -7220
543 -7220 21418 752 -22286 2728 20487 -7188 -18179 12226 16739 -13314 -11050 17360 9410
556 9410 -15699 -2980 18748 2236 -16220 2967 15757 -5251 -13607 7498 11245 -10453 -10646
569 -10646 9646 6084 -12837 -5958 10967 1332 -13218 -1072 11628 -1691 -11259 3858 10162
$$ packed form
480B2337k9799j3622L0378R029k9771l633K9210k9k6859L818K5234o048k5117
493a4872R465K3861j3328k2372J5902J9816j9877j7967K3041J4432k6666j0730
505a9295K9162M853l0533O35L1422n919l1576J2723L0443j9005k6153K5332K2116
518B4205k9910j6172L4048J0028l6872j251L7292p110l6427J4903L2917k1828
530C823k8789K7699K1374l2990j4317L5150O170l5547Q37L4653q364l2596J5677
543g220K8638k0666k3038K5014J7759k7675j0991L0405M513l0053K264K8410p950
556I410k5109J2719K1728j6512j8456J9187J2790k1008q356K1105L747k1698j93
569a0646K0292l562j8921O879J6925r635j4550J2146J2700j3319r568J5117O304
$$ plain form
582 10162 -5355 -8006 7760 8613 -6139 -4885 9433 5297 -7977 -1604 10114 2313 -8945
595 -8945 43 9468 -1757 -9708 2759 7926 -5912 -8972 4949 5545 -8776 -6216 7711 2317
609 2317 -9952 -2145 8818 5 -8648 2109 9004 -2352 -7015 5882 8290 -4337 -4357 7375
623 7375 5479 -6916 -2468 8623 1523 -8055 -45 7399 -2325 -8060 2318 5812 -5715 -6807
637 -6807 4047 3118 -6740 -3752 5604 1803 -6675 -1035 6734 46 -5483 2365 6640 -1370 -4409
652 -4409 4145 5919 -3003 -2921 5943 3240 -4836 -1669 5300 895 -5994 -445 4742 -1890 -6034 613
668 613 3337 -3145 -5315 1810 2924 -4482 -3560 3632 2262 -3983 -1669 5047 1886 -3876 746 5943
684 5943 665 -3299 2056 5240 -997 -3201 2994 3762 -2896 -2883 3186 1999 -4169 -3067 2758 385
$$ packed form
582A0162j5517k651J5766Q53j4752J254J4318m136j3274O373J1718p801j1258
595h945Q988R425j1225p951J2467N167j3838l060J3921N96j4321K560J3927n394
609B317j2269P807J0963q813q653J0757O895j1356m663J2897K408j2627k0J1732
623G375j896j2395M448J1091p100r578Q010P444r724n735J0378L494j1527j092
637f807J0854r29r858K988R356l801q478N640P769o688n529P848M275q010l039
652d409Q554J774q922Q2Q864k703q076L167O969m405o889N549N187o632m144O647
668F13K724o482k170P125J114p406R22P192j370o245K314O716l161n762M622N197
684E943n278l964N355L184o237k204O195P68o658J3O069j187o168J102N825k373
$$ plain form
700 385 -5469 -1889 3576 -1092 -4981 -100 3451 -1936 -4514 2301 3914 -2428 -2375 4119 3368 -2447
716 -2447 -818 5166 2408 -3526 238 5524 602 -4072 903 4275 -1794 -4688 2241 3416 -4101
731 -4101 -4353 2451 1900 -5382 -3477 4012 896 -5884 -995 5054 -347 -5144 1489 6020 -1425 -4489
747 -4489 4062 5376 -3070 -2571 5860 4091 -4880 -1789 6884 1260 -6630 99 6161 -1895 -6827
762 -6827 1736 5243 -4944 -6308 4257 3357 -7086 -3881 6079 1479 -7322 -837 7618 -608 -6935
777 -6935 3095 7434 -3278 -5215 6008 6115 -5352 -2819 7767 2849 -6803 -368 7674 -674
791 -674 -7622 1691 6347 -4469 -6912 4182 3922 -6402 -4921 5450 1831 -7520 -1720 6718 -405
806 -405 -6769 1396 6478 -1700 -5283 4254 6183 -3551 -3375 5844 4382 -4503 -1837 6174 2241 -6083
$$ packed form
700C85n854L580N465m668l889M881L551n387k578O815J613o342N3O494p51n815
716b447J629N984k758n934L764N286m922m674M975L372o069k894O929J175p517
731d101k52O804n51p282J905P489l116o780M889O049n401m797O633M531p445l064
747d489Q551J314q446M99Q431j769q971L091Q673n624p890O729O062q056m932
762f827Q563L507j0187j364J0565r00j0443L205R960m600q801O485Q455q226o327
777f935J0030M339j0712j937J1223J07j1467K533J0586m918r652O435Q042q348
791f74o948R313M656j0816k443J1094k60j0324J481J0371l619r351N800Q438p123
806d05o364Q165N082q178l583R537J929r734J76R219j462q885K666Q011l933q324
$$ plain form
822 -6083 -693 6332 -923 -6915 670 5582 -3202 -7161 2647 5083 -5544 -5646 4898 3721 -7018
837 -7018 -3579 7483 2011 -8173 384 9237 -558 -7481 4037 9053 -4266 -6706 7630 7148
851 7148 -7686 -4406 9656 2662 -10373 -807 10025 -2283 -11123 3423 8897 -7303 -8967
864 -8967 7344 5592 -10468 -5047 10526 1849 -11318 915 11319 -2674 -9811 5913 10063
877 10063 -6588 -6618 10039 6139 -9053 -2319 11045 1232 -10101 1593 9880 -3456 -9402 4844
891 4844 6847 -7075 -6793 6594 3698 -8962 -3857 7497 402 -8460 -228 7420 -1585 -7134
905 -7134 2775 7167 -2984 -5138 5176 5967 -3986 -3380 6278 4314 -5485 -2228 6834 1937 -6774
920 -6774 -868 6887 -849 -8193 842 6753 -3777 -8059 3751 5826 -6516 -6536 6659 4531 -8719
$$ packed form
822f083N390P025p255n992P585M912q784l959R808K436j0627j02J0544j177j0739
837g018L439J1062n472j0184Q557Q853r795o923J1518N016j3319k440J4336m82
851G148j4834L280J4062o994j3035R566J0832j2308q840J4546N474j6200j664
864h967J6311j752j6060N421J5573q677j3167J2233J0404j3993p137J5724M150
877A0063j6651l0J6657l900j5192O734J3364r813j1333J1694Q287j3336n946J4246
891D844K003j3922K82J3387k896j2660N105J1354p095q862Q232P648r005n549
905g134R909M392j0151k154J0314P91r953O06R658j964r799L257R062m897q711
920f774N906P755p736p344R035N911j0530m282J1810K075j2342k0J3195k128j3250
$$ plain form
935 -8719 -3308 9674 1469 -9641 1411 10764 -2316 -9145 6296 9880 -7262 -6645 10236 6009
949 6009 -10412 -2796 11826 113 -12268 2123 11127 -5663 -11200 6373 7924 -10015 -7553
962 -7553 10262 3557 -12469 -2049 11662 -1244 -11320 4180 10762 -5765 -8454 8528 7465
975 7465 -8656 -3703 10947 2947 -9634 204 10179 -1816 -8778 3509 7652 -5461 -6794 5018
989 5018 4425 -7441 -4802 6294 1441 -7842 -1579 6557 -708 -7158 1253 6326 -2303 -5682 4091
1004 4091 5641 -3380 -3827 5454 4758 -4625 -2665 6744 2783 -6086 -1183 7140 377 -7469 603
1019 603 7332 -2907 -8419 3402 6150 -6332 -6898 6526 4507 -8818 -4085 9264 1410 -9944
1033 -9944 499 10149 -2378 -9469 5215 9876 -5928 -7105 9309 6731 -9362 -3800 11364
$$ packed form
935h719N411J2982q205j1110J1052R353j3080o829J5441L584j7142O17J6881m227
949F009j6421P616J4622j1713j2381J4391R004j6790n537J7573J551j7939K462
962g553J7815o705j6026J0420J3711j2906j0076J5500O582j6527k689J6982j063
975G465j6121M953J4650q000j2581R838R975j1995o962J2287M143j3113j333J1812
989E018n93j1866K639J1096m853r283O263Q136p265o450Q411N073q629l379R773
1004D091J550r021m47R281o96r383J960R409l961q869M903Q323o763p846Q072
1019F03O729j0239n512J1821K748j2482n66J3424k019j3325M733J3349p854j1354
1033i944J0443R650j2527p091J4684M661j5804j177J6414k578j6093N562J5164
$$ plain form
1046 11364 2279 -11506 911 11513 -3679 -10858 5677 9241 -8547 -8457 8934 4603 -11770
1059 -11770 -3521 10604 109 -11581 1592 10432 -4130 -9208 6342 8429 -7261 -5528 9147
1072 9147 4856 -8365 -1520 10090 678 -8858 2277 8933 -3187 -7245 4586 5951 -5879
1085 -5879 -5457 5670 2987 -7287 -2704 5674 291 -6657 -519 5784 -1053 -5620 1427 5531 -1757
1100 -1757 -4671 3413 5338 -2997 -3582 5006 4261 -4104 -2016 6045 2587 -5639 -803 6105 -121
1115 -121 -6385 1016 5606 -2814 -6586 3051 4806 -5422 -5313 5651 3012 -7502 -2352 7733
1129 7733 534 -7829 1550 8337 -2999 -6880 5909 6687 -5834 -3643 8413 3443 -7723 -413
1143 -413 9124 -1091 -8484 3002 7577 -5183 -7042 6032 4750 -8211 -3970 7841 818 -9167
$$ packed form
1046A1364r085j3785J2417J0602j5192p179J6535L564j7788R0J7391m331j6373
1059a1770Q249J4125j0495j1690J3173Q840j4562n078J5550K087j5690J733J4675
1072I147m291j3221O845J1610r412r536J1135O656j2120m058J1831J365j1830
1085e879M22J1127k683j0274M583Q378n383o948O138O303o837m567P047M104p288
1100a757k914Q084J925q335n85Q588p45q365K088Q061l458q226M836O908o226
1115a21o264P401M590q420l772R637J755j0228J09J0964k639j0514N150J0085
1129G733p199q363R379O787j1336l881J2789P78j2521K191J2056m970j1166P310
1143d13R537j0215p393J1486M575j2760j859J3074j282j2961M241J1811p023r985
$$ plain form
1157 -9167 79 8192 -2922 -8500 4110 6989 -5527 -4832 7212 4011 -7071 -1478 8333 988
1171 988 -6753 1986 7477 -2312 -5486 3806 5317 -4397 -4708 4863 2797 -6306 -2466 5233 299
1186 299 -6479 -727 5157 -1456 -5677 1608 4602 -2850 -4365 3214 4079 -3308 -3182 4743 3175 -4140
1202 -4140 -1436 5641 2014 -4678 -19 6110 -341 -5714 1429 5632 -2743 -5707 3151 4166 -5388
1217 -5388 -4588 4927 2495 -7117 -2318 6006 215 -7116 737 6898 -2338 -6375 4248 5975 -4285
1232 -4285 -3936 6511 4172 -6305 -1688 7876 1001 -7084 1460 7220 -2409 -6392 3595 5210 -5350
1247 -5350 -4751 5285 2272 -6792 -2356 5795 -353 -6723 589 5609 -2555 -5275 3536 4483 -3932
1262 -3932 -2903 5159 2966 -4485 -710 5673 697 -4246 1099 4978 -1402 -3994 2487 3692 -2992
$$ packed form
1157i167R246Q113j1114n578J2610K879j2516O95J2044l201j1082N593R811p345
1171I88p741Q739N491r789l174R292J511r714l11R571k066r103L840P699m934
1186B99o778N752N884o613m221P285K994p452j515P579Q65p387J26P925j568p315
1202d140K704P077l627o692M659O129o451n373P143M203q375k964Q858J015r554
1217e388Q00R515k432r612M799Q324n791p331P853O161r236m037J0623J727j0260
1232d285L49J0447k339j0477M617R564o875q085Q544N760r629l983R987J615j0560
1247e350N99J0036l013r064M436Q151o148o370P312N020q164k720Q811R47q415
1262c932J029Q062k193p451L775O383m976m943N345L879o380k592O481J205o684
$$ plain form
1277 -2992 -3023 3109 1808 -3867 -1878 3202 46 -4358 -442 3350 -1199 -3728 1194 3036 -2005
1292 -2005 -2773 2753 2763 -2395 -1312 3993 1948 -2666 -22 4105 688 -3474 1081 3702 -1218 -3490
1308 -3490 1903 2559 -2752 -2914 2677 1315 -3797 -1874 3227 62 -4231 -420 3672 -970 -4051
1323 -4051 2030 3482 -2491 -2706 3511 2867 -3188 -1022 4938 1131 -3810 735 4613 -638 -3606
1338 -3606 2138 3859 -2884 -3366 3584 1969 -4527 -1803 3800 -131 -5174 -312 4017 -1804 -4704
1353 -4704 2010 3218 -3089 -2751 3622 2412 -3569 -716 4842 955 -3783 1070 4443 -643 -3474
1368 -3474 2261 3686 -2282 -2575 2919 1628 -3272 -1356 2868 162 -3913 -488 2394 -1137 -3191
1383 -3191 638 2084 -1978 -2568 1909 1896 -2160 -1405 2484 1211 -1664 -321 2718 915 -1695 641
$$ packed form
1277b992l1O132j301n675J989N080l156m404L916L792m549k529M922J842n041
1292b005p68N526J0n158J083N305k045m614K644M127l417m162M555K621m920k272
1308c490N393O56n311j62N591j362n112J923N101l165m293L811M092m642l081
1323d051O081J452n973k15O217o44o055K166N960l807m941M545L878n251k968
1338c606N744J721o743m82O950j615o496K724N603l931n043M862M329n821k900
1353d704O714J208o307L38O373j210n981K853N558l887m738M853L373n086k831
1368c474N735J425n968k93N494j291m900J916M224k706m075L425K882l531k054
1383c191L829J446m062n90M477j3m056P55L889j273k875J343L039j803k610K336
$$ plain form
1399 641 2730 96 -1797 981 1833 -913 -2048 1338 1315 -2304 -1860 1497 180 -2796 -1489 1891
1415 1891 -201 -2960 47 2230 -1022 -2358 1238 2499 -1321 -1799 2641 1935 -2145 -380 3367
1430 3367 647 -2680 628 3395 -786 -2567 1864 2419 -2031 -2168 1992 1210 -3129 -1266 2240 -343
1446 -343 -3478 148 2468 -1437 -2700 1647 1959 -2147 -1398 2727 1197 -2300 404 3198 279 -1915
1462 -1915 1311 2693 -1104 -1301 1862 1391 -1785 -870 1905 179 -2219 -342 1336 -1106 -2486 565
1478 565 938 -1337 -1631 801 682 -1344 -417 1435 504 -1007 178 1361 450 -603 738 1554 -4
1495 -4 -332 651 1158 -84 -692 492 822 -666 -1017 423 442 -1280 -1133 657 -77 -2087 -736 1071
1513 1071 -15 -1257 2 936 -598 -1390 848 1410 -852 -545 1714 1089 -1077 -27 2124 501
$$ packed form
1399F41K089k634j893K778Q52k746j135L386k3l619M44L357j317k976J307L380
1415A891k092k759L007K183l252j336L596J261l820m78M440p06m080J765L747
1430C367k720l327L308K767m181j781M431N55m450j37M160p82m339J863L506k583
1446c43l135L626K320l905j263M347L12m106P49M125j530l497K704K794k919k194
1462a915L226J382l797j97L163m71l176R15K775j726k398J877J678k442j380L051
1478E65L73k275k94K432j19k026R27J852r31j511J185J183r11j053J341Q16j558
1495dl28R83N07j242o08J184L30j488l51J440J9j722J47J790p34k010J351J807
1513A071j086j242J259R34j534p92K238N62k262L07K259o25k166J050K151j623
$$ plain form
1529 501 -1485 444 1919 -553 -1355 1042 1140 -1715 -1453 1349 234 -2148 -510 1151 -1017 -2212
1545 -2212 294 894 -1294 -1559 1117 757 -1314 -271 1699 717 -1026 426 1985 118 -848 1260
1561 1260 1324 -600 -492 1235 479 -1121 -318 1151 -340 -1145 -186 346 -952 -1104 80 162 -714 -698
1579 -698 149 -80 -323 95 214 357 -160 120 756 522 102 500 543 490 160 161 797 262 -139 -203 107 -129
1601 -129 -484 -97 162 -499 -1078 -313 203 -1070 -896 494 30 -1127 -327 818 15 -758 780 1165
1619 1165 26 -291 1137 778 -394 133 1405 348 -659 184 1176 -138 -906 269 520 -1171 -866
1636 -866 503 -137 -1327 -714 270 -605 -1223 -6 722 -742 -455 671 310 -518 72 844 415 -92
1654 -92 485 848 372 315 613 637 -235 -214 358 163 -159 -52 30 -324 -498 -352 -512 -379 -452 -452 -511 -336 12
$$ packed form
1529E01j986J929J475k472q02K397R8k855K62K802j115k382J638J661k168j195
1545b212K506O00k188k65K676l60k071J043J970r82j743J452J559j867r66K108
1561A260O4j924J08J727p56j600Q03J469j491q05R59N32j298j52J184Q2q76J6
1579f98Q47k29k43M18J19J43n17K80O36k34m20L98M3n3l30JO36n35m01o4L10k36
1601a29l55L87K59o61n79P65N16j273J74J390m64j157Q00J145q03p73J538L85
1619A165j139l17J428l59j172N27J272j057j007Q43R92j314p68J175K51j691L05
1636h66J369o40j190O13R84q75o18J217P28j464K87J126l61q28N90P72m29n07
1654i2N77L63m76n7K98K4q72K1N72j95l22J07Q2l54j74J46j60J33p3%n9J75L48
$$ plain form
1677 12 -368 -71 281 250 -29 397 387 -11 -109 847 901 -154 308 968 115 -169 467 767 -628 -646 206
1698 206 117 -1043 -571 552 -390 -992 -129 273 -629 -905 106 376 -911 -341 509 408 -668 312 1355
1717 1355 140 -407 684 965 -86 181 777 700 -395 -190 1083 -12 -532 -89 154 -294 -933 -59
1735 -59 62 -928 -605 43 -229 -578 -366 322 45 -477 145 475 166 148 164 594 44 256 271 400 395 16
1757 16 165 262 73 -216 120 125 -559 -554 -39 -269 -476 -95 -230 -155 -692 -381 263 -69 -534 139 257 -155
1779 -155 -487 693 374 -71 145 946 276 -172 418 946 93 -560 593 812 -299 -422 518 177 -981
1798 -981 -393 554 -426 -1327 -322 682 -744 -859 175 309 -720 -619 688 487 -442 310 787 229
1816 229 -218 472 1042 64 -210 741 682 -412 -478 611 -56 -718 -258 332 -362 -803 -72 10 -638 -638 42
$$ packed form
1677A2l80K97L52l1k79M26j0l98r8R56N4j055M62O60q53k84O36L00j395j8Q52
1698B06q9j160M72J123r42o02Q63M02r02k76J011K70j287N70Q50j01j076R80J043
1717A355j215n47J091K81j051K67N96p7j095K05J273j095n20M43K43m48o39Q74
1735e9J21r90L23O48k72l49K12O88k77n22O22L30l09j8J6M30n50K12J5J29nl79
1757A6J49R7j89k89L36No84NN15k30k07L81j35P5n37L11O44l32m65O73J18m12
1779a55l32J180l19m45K16Q01o70m48N90N28q53o53J153K19j111j23R40l41j158
1798i81N88R47r80r01J005J004j426j15J034J34j029J01J307k01r29P52M77n58
1816B29m47O90N70r78k74R51n9j094o6J089o67o62M60N90o94m41P31Q2o48%O80
$$ plain form
1837 42 37 -633 -651 342 192 -405 -94 661 472 -98 296 938 358 -87 530 652 222 -540 282 565 -301
1858 -301 -606 331 343 -653 -625 328 -94 -720 -494 302 -451 -854 -10 480 -206 -617 469 685 -462 -182
1878 -182 977 435 -226 311 840 616 -319 277 855 -140 -431 395 642 -646 -484 486 238 -1191 -248
1897 -248 304 -372 -1091 -173 652 -486 -827 654 532 -568 -128 600 344 -380 234 986 566 -111 429
1916 429 972 51 -458 544 461 -557 -514 355 102 -718 -249 256 -588 -920 -417 579 -523 -716 190 175
1936 175 -517 -593 540 268 -663 -274 692 182 -293 371 825 277 -208 345 678 -79 -288 319 646 -394
1956 -394 -312 391 78 -804 -346 205 -204 -909 17 16 -345 -526 337 232 -405 -339 394 270 -337 113 875
1977 875 541 -534 395 1024 195 -289 695 401 -254 -316 400 151 -744 -243 316 -233 -909 -98 435 -338
$$ packed form
1837D2no70j8R93j50n97L11P55j89n70L94O42n80m45O17J22m30p62Q22K83q66
1858c01l05R37J2r96K8R53m22o26K26P96p53m03Q44M90o86m11J086K16j147K80
1878a82J159n42o61N37N29k24r35N96N78r95k91Q26K47j288J62R70k48j429R43
1897b48N52o76p19R18Q25j138l41J481j22j100M40P28k56p24O14P52m20o77N40
1916D29N43r21n09J002q3j018M3Q69k53q20M69N05q44l32N03R96j102j93R06j5
1936A75o92p6J133k72r31L89R66n10m75O64M54n48m85N53L33p57k09O07L27j040
1956c94Q2P03l13q82M58N51m09p05R26jl61j81Q63j05o37O6P33j24o07M50P62
1977H75l34j075R29O29q29m84R84k94o55o2P16k49q95N01N59n49o76Q11N33p73
$$ plain form
1997 -338 -786 29 427 -296 -339 471 552 -433 -67 599 628 -353 239 1074 170 -300 437 616 -213 -276 480
2018 480 465 -567 -395 328 -56 -468 -396 337 -136 -1024 -158 472 -636 -579 305 145 -248 -351 390 341 -354
2039 -354 203 739 282 -234 578 821 -114 -106 555 556 -240 -331 522 251 -495 -224 329 -206 -924 -345 147 -518
2061 -518 -650 -34 42 -453 -496 382 408 -417 -38 663 264 -117 195 734 77 -96 346 547 187 -190 394
2082 394 501 -142 -167 286 239 -585 -302 103 -327 -644 -157 30 -591 -528 -160 -29 -223 -180 303 608 -303
2103 -303 18 381 429 -330 410 489 113 -596 303 574 -161 -312 296 161 -658 -251 360 -207 -690 -378 231
2124 231 -458 -756 128 160 -576 -435 233 209 -348 -114 430 170 -352 220 710 140 18 572 780 -146 -43
2145 -43 594 177 -406 -18 315 -85 -469 -93 -180 -470 -271 -77 -6 -453 -385 154 66 -382 -88 162 153 -204
$$ packed form
1997c38m48Q15L98p23m3Q10Q1r85L66O66K9r81N92Q35r04m70P37J79q29o3P56
2018D80j5j032J72P23l84m12P2P33m73q88Q66O30j108N7Q84j60l93j03P41m9o95
2039c54N57N36m57n16Q12K43r35QO61Jp96r1Q53k71p46K71N53n35p18N79M92o65
2061e18j32O16P6m95m3Q78K6q25L79P01l99l81L12N39o57j73M42K01l60l77N84
2082C94J07o43k5M53m7q24K83M05m30l17M87J87o21O3L68J31j94M3M83L05r11
2103c03L21L63M8p59P40P9l76p09Q99K71p35j51O08j35q19M07O11n67m83L12O09
2124B31o89k98Q84L2p36J41O68k4n57K34N44k60n22N72M90n70j22N54K08r26J03
2145d3O37m17n83L88L33m00l84L76q7k90J99J94P1m47O8N39q8m48K94K50rl57
$$ plain form
2167 -204 281 513 92 -94 531 517 70 36 348 281 52 -226 258 307 10 -363 -201 -51 -466 -221 102
2188 102 -288 -551 18 -109 -485 -452 132 73 -524 -140 532 142 48 308 674 37 -50 315 645 -24 -251
2209 -251 604 281 -88 -140 423 172 -283 -200 513 -356 -751 -36 178 -342 -713 123 108 -541 -70 193 66
2230 66 -229 -47 444 -16 36 508 371 153 142 356 327 -59 263 751 48 -246 151 -35 -288 -448 -38
2251 -38 127 -454 -475 63 -193 -480 -113 96 -161 -141 -18 180 -168 168 260 409 188 130 72 405 147 68
2273 68 452 337 83 -248 -4 -216 -38 -479 -82 -64 -533 -273 -184 -229 -678 -152 -38 -118 -449 60 443 -287
2295 -287 -118 64 292 -92 198 320 -184 -32 493 497 81 35 181 259 -127 -220 284 -7 -491 -122 59 -226
2317 -226 -466 0 -80 -622 -235 47 -114 -423 -93 466 63 -91 287 531 53 28 442 362 16 49 527
$$ packed form
2167b04M85K32m21j86O25j4m47l4L12o7k29k78M84M9k97l73J62J50m15K45L23
2188A02l90k63N69j27l76L3N84n9n97L84O72l90r4K60L66o37q7L65L30o69k27
2209b51Q55l23l69n2N63k51m55Q3P13q69l95P15K14n20l71Q36j5o49M71K63j27
2230F6k95J82M91m60N2M72j37k18j1K14k9l86L22M88p03k94L97j86k53j60M10
2251c8J65n81k1N38k56k87L67K09k57K0J23J98l48L36R2J49k21n8n8L33k58p9
2273F8L84j15k54l31K44k12J78m41L97J8m69K60Q9m5m49N26J14q0l31N09L83p30
2295b87J69J82K28l84K90J22n04J52N25Mm16m6J46P8l86r3N04k91m84L69J81k85
2317b26k40M66q0n42L87K82j61l09L30N59m03j54L78K44m78k5M14q0l46L3M78
$$ plain form
2338 527 97 -190 153 204 101 -91 -246 -17 -291 -212 -180 -408 -510 -211 -66 -298 -148 -131 -21 -92 -77 -12
2360 -12 140 -40 -92 187 510 345 108 198 146 423 364 61 181 77 -325 -187 183 -181 -26 143 5 -390
2382 -390 -348 -273 -326 -309 -24 -98 -433 -364 144 48 -168 144 422 84 17 223 310 275 213 166 288 -268 38 175
2406 175 438 -130 -17 104 -187 -568 -380 124 -617 -295 -283 -266 -314 -443 231 -64 -57 69 351 48 -168 199
2428 199 433 139 263 258 37 -27 181 620 106 61 124 -82 -196 168 -220 -211 -286 -137 -331 -471 -598 -53 -64
2451 -64 -259 -93 -331 50 -30 67 16 16 274 87 273 163 -19 296 144 196 311 66 282 72 318 -179
2473 -179 -204 -33 -237 -255 -75 -237 -217 -347 -25 -137 -337 -151 -38 -75 -142 10 101 -113 -97 -61 80 250 347
2496 347 318 185 139 236 145 96 147 115 339 -121 -33 78 -163 -395 315 -7 -97 -338 -74 38 -114 -45 -228
$$ packed form
2338E27m30k87L43N1j03j92j55K29k74P9L2k28j02K99J45k32J50J7J10p1J5O5
2360a2J52j80n2K79L23j65k37R0n2K77n9l03J20j04m02J38L70l64J55J69j38l95
2382c90M2P5n3J7K85p4l35O9N08r6k16L12K78l38o7K06Q7l5o2m7J22n56L06J37
2406A75K63n68J13J21k91l81J88N04p41L22J2J7m8j29O74k95PJ26K82l03k16L67
2428A99K34k94J24nk21o4K08M39n14m5O3k06j14L64l88Rp5J49j94j40j27N45j1
2451f4j95J66k38L81q0R7n1%K58j87J86j10j82L15j52N2J15k45K16k10K46m97
2473a79k5J71k04j8J80j62K0j30L22j12k00J86J13l7o7J52R1k14J6L6J41J70R7
2496C47k9j33m6R7r1m9N1l2K24m60Q8J11k41k32P10l22r0k41K64J12j52O9j83
$$ plain form
2519 -228 -269 -62 5 36 -196 128 372 117 -35 168 343 327 44 293 68 -90 314 57 343 -26 -12 -83
2541 -83 -258 -196 -206 -66 -118 -155 -83 -20 -187 36 -83 37 -21 139 85 23 216 302 102 174 302 133 13 308
2565 308 -10 61 236 -52 -66 -531 -35 -152 -137 -166 -192 -163 -332 -280 -253 -65 -138 -139 76 -6 69 161 223 120 -46
2590 -46 169 241 224 81 303 137 128 59 46 194 -127 -14 14 -251 -246 -105 -191 -189 -224 -274 -240 -367 -150 -97 -178 33
2616 33 8 -43 -160 -52 98 185 -64 26 159 144 56 266 354 336 249 345 226 -238 -100 -206 -117 -182 -122 -255 -118
2641 -118 -263 -170 -427 27 42 -167 -75 -496 27 95 50 -109 215 252 81 232 113 214 135 4 78 105 168
2664 168 59 -12 104 97 -41 -139 201 -262 -308 -240 -223 -37 -279 -30 -140 -195 -73 -19 -248 162 131 30 -247
2687 -247 -1 153 248 66 361 302 63 26 -69 165 115 122 -66 86 -100 -173 103 112 -322 -187 -265 -253 -113 196
$$ packed form
2519b28m1K07O7L1k32L24K44k55j52K03J75j6k83K49k25j58M04k57K86l69J4p1
2541h3j75O2j0J40n2l7P2O3j67K23j19J20n8J60n4o2J93Q6k00P2J28j69j20K95
2565C08l18P1J75k88j4m65M96j17J5k9k6K9j69N2K7J88p3jK15q2P5R2O2j03j66
2590d6K15P2j7j43K22j66ro9j3J48l21J13K8k65NJ41q6Kl5n0L4j27K17N3q1K11
2616C3k5n1j17J08J50Q7k49R0J33j5q8K10Q8j8q7R6j19m64J38j06Q9o5O0j33J37
2641a18j45R3k57M54J5k09R2m21N23O8m5j59L24L7j71J51j19J01p9j31P4K7O3
2664A68j09p1J16pj38r8L40m63m6O8J7J86k42K49j10n5J22N4k29M10l1j01k77
2687b47K46J54R5j82K95n9k39l7r5K34n0Pj88J52j86p3K76Rm34J35p8J2J40L09
$$ plain form
2711 196 11 36 -179 12 -83 212 -10 257 98 394 0 147 319 174 108 339 112 179 136 -41 113 -81
2733 -81 0 -91 6 -87 -283 72 -163 -321 -76 -169 -262 -281 -149 80 96 -51 194 21 327 200 533 138 238
2756 238 211 139 160 9 151 -4 -20 -39 119 124 -83 -188 -86 -342 -312 -330 -154 -208 -386 -105 -111 184 -287 122
2780 122 7 342 247 -18 260 239 279 100 179 165 334 31 -59 240 16 -68 117 -197 69 87 48 4 -317
2803 -317 -6 -252 89 -7 -6 137 54 -12 -20 138 96 166 1 17 220 87 123 377 20 53 194 77 -405 23
2827 23 78 -174 -73 -166 -278 -165 -231 -103 -411 -153 -93 -197 -108 -276 -86 -169 37 -11 -48 147 -51 -186 344
2850 344 -6 205 202 267 28 261 145 150 327 60 31 -19 129 -210 -208 -352 13 -95 -232 92 -149 -50 -168
2873 -168 -93 26 92 -145 74 -25 -50 18 221 160 159 173 295 24 -196 125 144 143 75 158 -58 -389 54 -116 81
$$ packed form
2711A96j85K5k15J91r5K95k22K67j59K96l94J47J72j45o6K31k27O7m3j77J54j94
2733h1Q1r1R7r3j96L55k35j58K45r3r3j9J32K29J6j47K45j73L06j27L33l95J00
2756B38k7p2K1j51J42j55j6j9J58Nk07j05J02k56L0j8J76n4j78K81oK95m71M09
2780A22j15L35r5k65K78k1M0j79P9j4J69l03r0K99k24q4J85l14K66J8l9m4l21
2803c17L11k46L41r6JJ43q3o6qJ58m2P0j65J6K03j33L6K54l57L3J41j17m82M28
2827B3N5k52J01r3j12J13o6J28l08K58O0j04Q9j68J90q3K06m8l7J95j98j35N30
2850C44l50K11lO5k39K33j16NJ77k67k9n0J48l39Kj44L65j08j37L24k41R9j18
2873a68P5J19O6k37K19r9k5O8K03o1jJ4J22k71k20L21J9jo8Q3k16l31M43j70J97
$$ plain form
2898 81 -152 4 -262 -345 -256 -94 -194 -13 67 -19 13 33 -116 -63 110 -51 92 327 329 91 42 106 5 66
2922 66 330 -177 1 -64 -62 29 -126 75 -79 -411 -433 -345 -91 -145 -234 -175 -147 67 -243 249 178 203 10 146
2946 146 140 72 212 64 105 124 297 12 -41 61 101 77 63 -231 -247 -110 -267 -222 -136 -99 -270 -114 5 -349
2970 -349 -81 51 -195 115 115 38 -25 113 26 75 212 51 33 95 196 127 33 61 -154 116 -190 -294 -119 -32
2994 -32 32 -268 -283 -152 -401 -189 -178 -54 -253 -304 37 110 107 67 457 26 335 228 -35 293 129 154 -117
3017 -117 121 -117 -38 -1 86 -215 -70 -43 -55 -336 -194 -368 -393 -201 -302 3 -311 -241 -281 -52 -29 9 140
3040 140 87 -119 9 438 232 248 283 189 98 252 15 -68 27 -6 -45 -151 -271 52 -304 -237 -26 -115 -208 -275
3064 -275 -104 -141 -197 36 55 -69 36 -181 -8 248 -25 95 255 358 13 120 106 326 183 86 -48 88
$$ packed form
2898H1k33J56k66q3Q9J62j00J81Q0q6L2K0j49N3J73j61J43K35Kk38m9O4j01O1
2922F6K64n07J78o5KR1j55K01j54l32k2Q8K54n4q9N9K8K14l10M92p1K5j93J36
2946A46oo8J40j48M1J9J73k85n3J02M0k4j4k94j6J37j57M5Q6L7j71J56J19l54
2970c49K68J32k46L10%p7o3J38q7M9J37j61j8O2J01o9r4K8k15K70l06j04J75Q7
2994c2O4l00j5J31k49K12J1J24j99n1L41P3lm0L90m31L09j07k63L28j64K5k71
3017a17K38k38P9L7Q7l01J45K7j2k81J42j74k5J92j01L05l14P0m0K29K3L8J31
3040A40n3k06J28M29k06J6L5r4r1J54k37q3R5l3l9j06j20L23l56O7K11q9r3o7
3064b75J71l7n6K33J9j24J05k17J73K56k73J20J60J03l45J07j4K20j43r7j34J36
$$ plain form
3086 88 153 -82 -421 -107 -99 -149 -57 10 -81 -188 -80 -1 -169 45 -5 -189 -116 -63 133 -27 120 162 330 151
3110 151 131 333 -7 19 -96 147 73 -73 -224 -118 -99 -127 -44 -173 153 -137 -315 -312 -213 -167 184 -70 -54 0
3134 0 76 129 120 61 106 220 239 37 36 295 -93 253 -70 205 19 -166 54 58 8 -150 -56 5 -260 9 -218
3159 -218 -258 -146 -88 -76 -122 43 -33 148 -24 154 88 176 85 120 -2 55 222 126 231 321 168 -169 -99 30
3183 30 -53 -23 -58 142 -139 -348 -24 -120 185 -109 49 -4 -225 -29 -83 48 -55 -247 111 162 50 285 195
3206 195 312 252 79 84 113 235 -46 -200 7 -52 -50 -42 -186 26 -66 -236 -59 -59 -79 -226 166 -45 -100 55 13
3231 13 -81 121 275 127 -91 -141 130 41 137 164 -28 207 49 225 -43 167 190 -46 -104 -94 -183 -157 -151 -22
3255 -22 -167 -29 58 -20 169 -73 -124 -273 -91 -135 305 200 46 -51 -156 258 134 228 172 112 -42 -141 18
$$ packed form
3086H8O5k35l39L14Qn0R2O7r1j07J08P9j68K14n0j84P3N3J96j60J47M2J68j79
3110A51k0K02l40K6j15K43p4j46j51J06J9k8Q3j29L26k90j78LR9M6L51k54J6N4
3134@P6N3rn9M5J14J9k02jK59l88L46l23K75j86j85K20Mn0j58R4O1k65K69k27
3159b18m0J12N8J2m6J65p6J81j72J78o6Q8r1L5j22N7J67r6J05R0j53l37P0J29
3183C0q3L0l5K00k81k09L24r6L05k94J58n3k21J96n4J31j03j92L58N1j12K35r0
3206A95J17o0j73NK9J22k81j54K07n9KQj44K12r2j70J77%k0j47L92k11n5J55m2
3231A3r4K02J54j48k18n0K71q9R6K7j92K35j58J76k68K10K3k36n8J0q9K6OJ29
3255b2j45J38Q7p8J89k42n1j49J82m4M40j05j54r7j05M14j24R4n6o0j54r9J59
$$ plain form
3278 18 97 -36 -39 -82 -34 -8 -120 -207 -199 -112 -81 -182 -226 -78 142 21 102 -8 113 -26 148 102 17 112 287 156
3304 156 29 25 111 340 -139 95 106 129 -51 50 -48 -2 0 -347 -171 -97 130 -338 -305 -127 -114 81 -303 -130
3328 -130 23 98 129 66 111 207 -42 -14 274 88 78 146 296 47 105 272 -151 97 -140 40 -56 -18 -276 -117
3352 -117 13 41 -55 -52 -210 -139 -18 -69 -44 -155 -81 83 18 -95 200 331 211 -176 7 148 255 131 -28
3375 -28 -41 96 -78 -231 120 -328 -114 -127 -362 -360 13 -218 -156 -223 -209 54 -175 199 -34 -82 47 46 199 241
3399 241 -51 124 22 191 252 269 132 52 7 16 203 55 32 -198 -78 -137 163 -7 -118 -425 -195 -170 -303
3422 -303 -136 75 -16 82 -180 -15 130 -109 294 84 32 -110 119 -26 67 -164 187 -96 -6 -21 -211 96
3444 96 -438 -236 -174 200 -12 -223 -223 -40 -102 -315 -40 34 33 280 -186 132 246 11 37 -33 123 172 45 -84
$$ packed form
3278A8P9j33lm3M8K6j12q7QQ7L1j01m4J48K20j21Q1j10J21j39J74m6q5R5J75j31
3304A56j27mQ6K29m79K34J1K3j80J01r8M6Kl47J76P4K27m68L3J78J3J95l84J73
3328a30J53P5L1o3M5R6k49K8K88j86j0O8J50k49N8J67m23K48k37J80r6L8k58J59
3352a17J30K8r6Lj58P1J21n1K5j11P4J64o5j13K95J31j20l87J83J41J07j24j59
3375b8j3J37j74j53L51m48K14j3k35KL73k31O2o7J4K63k29L74k33m8J29jJ53M2
3399B41k92J75j02J69O1J7j37q0m5RJ87j48k3k30J20n9L00j70j11l07K30K5j33
3422c03J67K11r1R8k62J65J45k39M03k10n2j42K29j45R3k31L51k83R0j5j90L07
3444I6n34K02O2L74k12k11%J83o2k13K75P4jK47m66L18J14k35K6p0J56M9j27j29
$$ plain form
3468 -84 113 -9 140 40 56 -360 -258 -13 37 -294 81 -191 -244 -30 -65 117 -264 184 -447 -13 -38 -4
3490 -4 7 -22 -193 250 -17 18 19 -41 49 199 76 61 317 62 67 -51 -86 -53 71 24 78 62 60 -134 -109 -101 -44 21
3518 21 -21 -287 38 86 248 268 -35 -98 159 -9 301 -57 26 22 273 -98 104 156 -119 6 -155 -54 -139
3541 -139 -28 -127 62 -101 -73 97 26 -216 123 -451 -185 -139 -124 186 4 -165 94 12 -143 188 233 74
3563 74 71 134 -178 73 11 136 -47 87 -243 -42 -150 52 -139 19 58 144 83 42 -100 55 -36 119 -60
3586 -60 103 -138 63 -48 263 84 94 417 101 136 17 356 257 30 79 -15 147 -64 -212 8 -29 184
3608 184 -208 -111 7 140 -197 -389 -174 -41 -50 8 -39 77 76 81 -9 138 84 70 124 -167 -116 123 117 -72 66
3633 66 56 68 -108 16 27 -284 24 -22 -108 19 -88 35 -284 -88 -38 -77 -197 168 154 29 93 66 237 -86
$$ packed form
3468h4J97j22J49j00J6m16J02K45N0l31L75k72n3K14l5J82l81M48o31M34k5L4
3490dJ1k9j71M43k67L5Jo0R0J50j23j5K56k55Nj18l5L3J24m7N4j6kj94K5QN7O5
3518B1m2k66L25M8J62K0l03o3K57j68L10l58Q3mK51l71K02N2k75J25j61J01q5
3541a39J11r9J89j63K8J70p1k42L39n74K66M6J5L10j82j69K59q2j55L31M5j59
3563G4lO3l12K51o2J25j83J34l30K01j08K02j91J58L9Q6o1m1j42J55r1J55j79
3586f0J63k41K01j11L11j79J0L23l16L5j19L39r9k27M9r4J62k11j48K20l7K13
3608A84l92R7J18J33l37j92K15J33rN8m7J16jNr0J47n4j4N4k91N1K39oj89J38
3633F6j0J2j76J24J1l11L08m6q6J27j07J23l19J96N0l9j20L65j4j25O4k7J71l23
$$ plain form
3657 -86 -175 64 -39 174 -41 -27 253 158 -356 -292 49 -111 -144 -144 -67 -1 -238 29 -68 -72 -27 -124 -28 131 -65
3682 -65 89 -238 39 199 109 -23 204 -33 84 92 -162 85 -141 17 -49 185 -6 17 133 42 -5 -138 94
3705 94 -182 -213 -288 -119 -30 -2 -108 49 43 54 -440 -104 147 -69 44 -119 -60 87 -111 -169 109 35 159 -27
3729 -27 154 166 -143 -102 116 -77 -10 -51 -9 -29 33 186 2 42 -109 1 14 8 -89 -47 -210 -116 -51 -57 166 157 36
3756 36 -23 407 44 213 94 108 293 115 135 -167 -296 14 -43 -42 -160 -145 -37 -44 -44 -214 85 -270 -164 -218
3780 -218 -187 -21 132 279 211 237 10 205 -2 270 -9 -88 79 -199 -19 -118 -56 36 -352 -39 -221 136
3802 136 -52 65 -219 -30 -165 50 97 -72 -39 -30 -66 -140 39 180 118 25 14 -16 59 120 2 -97 -47 36 -120
3827 -120 213 37 249 26 -116 48 -63 3 -122 -74 43 100 -115 21 6 -18 -180 -224 18 209 67 -146
$$ packed form
3657h6q9K39j03K13k15J4K80r5n14O4L41j60l3%P7O6k37K67r7mM5r7R6J59j96
3682f5J54l27K77J60r0j32K27k37J17Qk54K47k26J58o6K34j91K3J16r1m7j33K32
3705I4k76l1p5J69Q9K8j06J57oJ1m94L36K51k16J13j63N9J47j98n8K78p4J24j86
3729b7J81J2l09M1K18j93O7m1M2k0O2J53j84M0j51J10J3or7M2j63R4O5oK23rj21
3756C6n9M30l63J69j19J4J85j78K0l02j29L10n7Jj18J5J08p%j70K99l55J06n4
3780b18L1J66J53J47o8K6k27J95k07K72k79p9J67k78J80r9O2R2l88L13j82L57
3802A36j88J17k84J89j35K15M7j69L3Rl6p4J79J41o2r3j1l0P5O1j18r9N0Q3j56
3827a20L33j76K12k23j42J64j11O6j25M8J17N7k15J36j5k4j62m4K42J91j42k13
$$ plain form
3849 -146 -66 181 190 81 27 -95 85 160 36 51 115 76 47 -38 -16 46 -16 42 138 57 -128 56 57 51 -147 -150 63
3876 63 -106 49 -73 36 206 28 250 100 65 -87 21 232 205 42 46 379 -26 0 -111 134 163 -36
3898 -36 98 121 -162 11 -307 -153 96 -189 -17 -106 107 -59 -89 -167 77 154 177 56 7 33 -72 57 -125
3921 -125 -154 70 -124 -72 -51 37 -139 -147 231 -229 -23 74 -23 42 -55 -42 -60 112 -153 -8 -46 -3 -124 84 182
3946 182 48 96 221 -45 -164 235 136 -39 73 -159 204 126 -50 177 -59 127 104 18 13 -189 -50 -139 -211
3969 -211 -387 -126 149 -6 19 -40 -11 41 -46 -3 25 185 126 97 388 20 53 -15 -231 137 92 -252 122 39
3993 39 -205 -101 157 -143 33 66 -117 -229 -88 -138 -121 -55 -278 140 67 -256 125 69 207 165 -136 -220 -6
4016 -6 -29 -140 153 -117 192 -5 36 -27 131 -148 -270 -87 -111 234 -186 53 -151 137 -54 -98 188 -55
$$ packed form
3849a46Q0K47Rj09n4j22J80P5j24J5O4l9k9q5K2O2o2N8R6q1j85J84Joj98lK13
3876F3j69J55j22J09J70j78K22j50l5j52J08K11k7j63ML33m05K6j11K45K9j99
3898c6J34K3k83J73l18J54K49k85J72q9K13j66l0p8K44P7K3j21m9K6j05J29j82
3921a25k9K24j94N2K1Q8j76qL78m60K06R7r7O5r7J3j8J72k65J45l8M3j21K08R8
3946A82j34M8J25k66j19L99r9j75J12k32L63p8j76K27k36J86k3q6nk02J39q9p2
3969b11j76K61K75j55K5n9K9N2q7M3K8J60n9k9K91l68L3o8k16L68m5l44L74q3
3993C9k44J04K58l00J76L3j83j12J41n0J7O6k23M18p3l23L81n6J38m2l01q4K14
4016fk3j11K93k70L09j97M1o3J58k79j22J83k4L45m20K39k04K88j91m4K86k43
$$ plain form
4038 -55 111 25 -191 130 101 157 138 101 11 83 56 -12 179 75 -84 201 11 115 -196 -326 72 -289 -37
4061 -37 -167 -88 -7 -103 -211 -117 40 22 188 215 -30 -24 -132 116 21 250 214 145 121 102 188 -5 75 -15 -52 -220
4087 -220 -65 -68 -80 17 -107 205 21 -260 237 54 -260 -253 -112 -132 26 -41 -86 -266 -176 146 -9 -240 83
4110 83 123 136 218 151 1 54 13 17 -33 110 280 -13 -11 -67 -113 -238 -222 71 22 120 -356 43 -215 64 -98 95
4136 95 71 32 30 71 54 -210 0 -186 245 -121 231 -30 96 132 29 -76 182 -143 -135 -170 -40 -167 -39 -210
4160 -210 -133 -189 7 19 -167 -257 -142 122 -142 194 -56 191 274 -105 124 132 156 49 -58 226 33 -60 -69 -46
4184 -46 -95 -177 -88 -87 -11 101 -289 -117 62 50 82 -20 78 -80 97 60 -14 68 271 -18 158 -52 0 74 -23
4209 -23 -69 15 98 125 45 -44 -201 -15 158 145 -71 -8 -63 -254 47 -522 -105 -148 129 -15 -172 14 179 -49
$$ packed form
4038e5J66q6k16L21k9N6j9l7r0P2k7o8J91j04j59K85j90J04l11j30L98l61K52
4061c7j30P9Q1r6j08R4J57j8J66K7k45Oj08K48r5K29l6o9k4j9Q6j93Q0r0l7j68
4087b20J55lj2R7j24L12j84k81M97j83l14PJ41k0J58o7m5j80R0L22j55k31L23
4110H3M0J3Q2o7j50N3m1Mn0J43J70k93Kn6m6j25J6K93m9R8m76L99k58K79j62J93
4136I5k4l9kM1j7k64K10j86M31l66L52k61J26L6j03j05K58l25Ql5J30j27J28j71
4160b10P7n6J96J2j86r0J15K64k64L36k50K47Q3l79K29QK4j07j07K84j93r3rK3
4184d6m9q2Q9JP6J12l90J72J79j2L2j02R8j58J77l7p4Q2K03k89J76k10N2P4r7
4209b3m6Q4Q3K7q0q9j57J86J73j3k16O3n5j91L01n69M17m3K77j44j57J86J65k28
$$ plain form
4233 -49 -86 9 -84 131 180 -91 178 289 -272 179 156 148 126 -71 54 41 194 60 -88 -41 -9 -154 -158 -1 22
4258 22 -157 -194 -79 97 -53 -132 -98 189 96 75 -6 89 -76 70 89 237 118 0 157 -23 89 46 139 82
4282 82 -16 -110 24 31 182 88 41 -101 -173 -38 -58 -17 -44 -43 -118 12 -51 21 -145 21 56 136 -80 147 123 220 115
4309 115 89 -56 -82 -135 -164 -105 -10 138 -40 -28 100 -216 -38 6 -74 44 -88 21 164 14 7 21 -46 -112 15
4334 15 283 22 26 -142 -35 1 1 -116 160 136 90 142 -34 -224 -31 60 -118 82 -135 -38 -159 -37 -31 235
4358 235 61 -257 -7 -41 -109 74 65 24 167 -64 79 175 181 -257 192 235 -124 204 16 155 118 -10 -125
4381 -125 -67 -118 -143 -173 0 56 -167 167 160 -137 102 145 -78 124 86 45 81 -3 -20 132 20 -116 114 261
4405 261 141 31 127 59 -107 22 151 143 -20 -182 -114 70 -76 -64 18 -91 -21 -139 -101 -138 240 50 317
$$ packed form
4233d9l7R5r3K15M9k71K69J11n61M51k3qk2j97J25j3J53j34j48M7L2j45mJ57K3
4258B2j79l7J15J76j50p9L4K87r3k1q1R5j65J46J9J48j19j18J57j80J12m3R3n7
4282H2r8r4J34PJ51r4m7j42p2J35k0M1k7Jp5J30o3P2j66J66L5Q0k16K27k4R7j05
4309A15k6j45k6n3k9N9R5J48j78J2J28l16J78M4q0J18j32J09J43j50pJ4o7o6J27
4334A5K68k61Mj68J07L6%j17K76k4m6N2j76j90J93R1j78K00k17R7j21J22OK66
4358B35j74l18K50l4o8J83rm1J43k31J43R6Om38M49M3l59L28j88J39l7j28j15
4381a25N8n1k5l0J73N6k23L34pk97K39M3k23K02l8m1L6q4j7J52j12j36K30J47
4405B61j20j10R6o8j66J29J29qj63j62O8J84j46J2Q2j09P0j18L8l7L78j90K67
$$ plain form
4428 317 -9 60 91 111 117 401 -76 149 -6 -50 32 -14 -133 128 17 -275 -147 -81 169 108 -36 -24 -162 19
4452 19 -107 103 267 -133 -31 91 -113 -43 10 75 119 143 64 219 -78 237 85 85 -62 -125 -20 -144 -112 116
4476 116 -67 58 -25 -94 39 -138 -262 -95 -163 39 5 -82 172 -84 38 -131 -46 -94 71 -98 -173 -113 28
4499 28 -83 -97 81 147 -91 54 92 315 -433 -97 -141 -161 104 218 4 -217 304 -107 53 99 -147 76
4521 76 40 49 319 35 -23 204 -21 -9 -66 10 111 4 127 107 123 -119 125 -73 149 -86 -148 -319 137 -239
4545 -239 122 -95 -122 83 -72 -363 -18 -208 176 -181 101 -122 -66 61 -173 208 225 -40 -56 381 -44
4566 -44 87 -124 98 -93 206 -119 111 -32 121 70 -171 14 -1 -69 -188 132 -43 -148 -10 90 45 143
4588 143 -209 -41 64 -13 -31 -215 -86 2 -62 163 -36 124 -69 190 166 56 113 -128 -1 38 -32 -166 30
$$ packed form
4428C17l26O9L1K0OK84m77K25j55m4Q2m6j19K61j11k92J28O6K50o1j44J2j38J81
4452A9j26K10J64m00J02J22k04P0N3O5M4K4p9J55k97L15j52%j47o3J05j24L2K28
4476A16j83J25q3o9J33j77j24J67o8K02l4q7K54k56J22j69Q5m8J65j69p5O0J41
4499B8j11j4J78O6k38J45L8K23p48L36m4k0K65J14k14k21N21m11J60M6k46K23
4521G6l6RK70k84n8K27k25J2n7P6J01j07J23k0J6k42K44j98K22k35o2j71M56l76
4545b39L61k17k7K05j55k91L45j90L84l57K82k23N6J27k34L81J7k65j6M37m25
4566d4J31k11K22j91K99l25K30j43J53n1k41J85j5o8j19L20j75j05J38J00m5R8
4588A43l52J68J05p7j8j84J29Q8o4K25j99J60j93K59k4j10N7k41J27L9p0j34J96
$$ plain form
4611 30 -241 -99 16 -210 -203 4 250 -10 -49 89 81 316 -130 -123 291 107 87 66 44 65 117 -131 368 -237
4635 -237 128 -137 -23 -8 42 -393 -196 67 -169 -144 25 -88 -216 -22 121 -72 11 -89 -16 -80 -42 132
4657 132 183 317 -50 183 119 43 75 128 -163 104 145 -64 187 -67 15 -121 146 68 61 90 4 54 74 -43 -46
4682 -46 -245 -153 193 319 -55 -43 -73 -90 231 11 196 1 137 68 269 120 -71 -90 -120 -158 29 -63 63
4705 63 -112 96 -117 -17 -116 -169 -201 -135 -152 149 -133 -127 -96 -17 -251 283 -49 80 74 -76 135 14 56 -135
4729 -135 154 68 188 43 -22 169 8 -92 66 -173 -8 -169 -196 36 -120 -225 -177 -96 119 -105 -75 -40
4751 -40 -61 29 12 -6 240 -29 -182 69 109 -108 -227 85 188 336 -47 50 52 147 -173 -149 -136 -206 -4 85 -88
4776 -88 -95 190 110 163 -69 -93 -126 128 71 -230 -41 -72 73 -13 131 -92 130 145 -41 16 78 -142 -352 -93
$$ packed form
4611C0k71J42J15k26PK07K46k60l9J38qK35m46PM14j84k0k1k2K1N2k48M99o05
4635b37L65k65J14J5N0m35J97K63k36K5J69j13j28J94J43j93Q3j00P3o4L8J74
4657A32N1J34l67K33o4p6L2N3k91K67M1k09K51k54Q2j36K67p8pK9q6N0K0j17l
4682d6j99R2L46J26l74J2l0j7L21k20J85j95J36o9K01j49j91j9l0l8J87r2J26
4705F3j75K08k13J00r9n3l2O6j7L01k82OL1P9k34N34l32J29oj50K11j21M2j91
4729a35K89q6J20j45o5J91j61j00J58k39J65j61k7K32j56j05M8Q1K15k24L0L5
4751d0k1R0j7j8K46k69j53K51M0k17j19L12J03J48l83R7KR5l20K4J3p0K02Q9j73
4776h8pK85q0N3k32k4l3K54n7l01J89l1J45q6J44k23K22J5j86N7O2k20k10K59
$$ plain form
4800 -93 -296 60 -94 -90 -171 -7 10 -61 180 232 -174 137 -56 36 -17 253 166 -54 -216 -190 13 238 137 54
4824 54 107 -28 87 208 -1 25 45 -44 5 19 -34 -43 291 -172 -125 -19 -40 -176 173 78 98 12 -136 -25 -82
4849 -82 220 7 -284 -85 -43 115 136 52 -141 56 39 -93 261 -31 38 -123 -50 151 -122 -92 124 -276 -204
4872 -204 271 -198 57 30 144 122 -167 -3 -11 -68 57 -84 11 103 30 198 66 -108 69 189 24 125 -7
4895 -7 51 126 150 92 55 4 -75 79 -3 -316 -128 -64 7 -11 -94 -32 327 -49 19 124 -85 175 73 111 -42 254
4921 254 108 393 -36 -51 -132 171 -85 87 -102 -40 -154 -57 272 -65 15 133 45 -75 -138 -126 18 -145 195
4944 195 -232 131 90 -49 -93 -41 -31 -163 -121 9 253 19 -135 -85 -46 -17 121 0 90 -117 -60 59 -72
4967 -72 -49 24 88 -40 -37 190 225 18 -26 112 74 -22 -6 131 47 249 138 -65 132 50 -34 217 115 208 -168
$$ packed form
4800i3k03L56j54Mq1J64J7p1K41N2m06L11j93R2n3K70q7k20j62K6K03K25j01q3
4824E4N3j35J15J21k09K6K0q9M9J4n3rL34m63M7J06k1j36L49r5K0q6j48J11n7
4849h2L02k13k91J99M2J58K1q4j93J97j7j32L54k92O9j61P3K01k73L0K16m00P2
4872b04M75m69K55k7J14k2k89J64qn7J25j41R5R2p3J68j32j74J77J20j65J01j32
4895gN8P5K4n8l7n1p9J54q2l13J88O4P1j8q3O2L59l76O8J05k09K60j02L8j53K96
4921B54j46K85m29j5q1L03k56J72j89O2j14R7L29l37Q0J18q8j20o3J2J44j63L40
4944A95m27L63m1j39m4N2J0j32M2J30K44k34j54N0L9K9J38j21R0k07N7J19j31
4967g2K3P3O4j28LK27L5k07m4J38l8r6J6J37q4K02j11k03J97q2q4K51j02R3l76
$$ plain form
4992 -168 388 48 167 28 -36 176 62 152 -235 3 13 -49 124 182 129 172 128 35 -42 -39 -218 -269 231 143 116
5017 116 211 116 -94 10 205 -60 -31 -106 46 -72 41 -146 -169 -97 34 -145 41 8 106 112 73 139 -42 265
5041 265 -114 -159 261 156 155 140 112 45 175 139 79 -111 2 45 -143 -104 -382 -223 -167 -105 51 -186 -7 -4 -183
5066 -183 -44 -114 -183 -137 151 12 333 41 -82 92 -70 10 -18 68 329 5 182 123 161 1 94 -23 84
5089 84 -147 158 -42 154 -176 -391 15 -225 183 -39 -70 -148 -53 224 -186 -82 86 -23 -76 -14 -7 -84 193
5112 193 207 -62 -174 -66 -27 159 -23 95 -4 -4 153 48 -6 -108 -70 -198 -43 88 84 -119 3 -137 -111
5135 -111 -10 -20 220 186 -77 -73 -71 100 -182 54 35 74 180 -108 -87 -65 -73 -214 -88 -77 -116 -109 -99 88 -41 -232
5161 -232 157 205 -76 77 -47 19 -128 239 -350 -89 125 10 96 -6 73 134 4 -49 71 323 81 42
$$ packed form
4992a68N56l40J19j39o4K12j14R0l87K38J0o2J73N8n3M3m4r3p7Lj79n1N00q8k7
5017A16R5r5k10J04J95k65K9p5J52j18J13j87k3P2J31j79J86l3R8Ol9O6j81L07
5041B65l79m5M20j05jj5k8o7J30l6o0j90J13M3j88L9k78J59N6O2J56k37J79Lj79
5066a83J39p0o9M6K88j39L21k92j23J74j62Q0k8Q6K61l24J77n9L8j60R3j17J07
5089H4k31L05k00J96l30k15M06k40M08k22l1p8R5K77m10J04J68j09n3O2Pp7K77
5112A93J4k69j12J08L9J86j82J18r9%J57j05n4j02L8j28J55J31mk03J22j40K6
5135a11J01j0K40l4k63MKJ71k82K36j9L9J06k88K1K2qj41J26J1l9PJ0J87j29j91
5161b32L89M8k81J53j24O6j47L67n89K61K14j15Q6j02P9O1j30n3J20K52k42l9
$$ plain form
5183 42 -92 54 47 85 -134 246 32 -197 -202 -93 85 -51 7 -181 -194 40 -139 127 244 -31 -263 44 -192
5206 -192 41 146 64 -121 29 212 -2 85 -68 -102 30 116 -321 -50 50 -197 -87 161 -186 -117 -1 -131
5228 -131 -98 63 117 99 -202 -32 29 15 -55 -180 -33 -112 74 -77 75 -109 -15 113 -29 -42 214 -244 -112
5251 -112 29 -48 -92 -71 -25 213 -173 307 90 7 47 -12 190 -125 -242 119 -9 36 112 -37 -178 89 277
5274 277 -129 -85 15 293 99 84 -209 -22 31 -32 -294 -192 -23 -126 -30 185 92 19 24 173 -208 -1 -34
5297 -34 -183 -151 -222 37 23 145 28 332 34 15 99 197 232 57 -108 -129 48 130 29 -54 -104 91 86 -10 47
5322 47 -151 -27 20 -43 -64 -58 -68 207 -8 38 167 77 -89 282 -2 -91 213 -57 7 331 89 271 19 90
5346 90 -35 -218 9 163 127 -102 -54 -112 -235 108 17 -81 -22 117 -305 -72 -44 152 -98 -98 294 112 42 114
$$ packed form
5183D2j34J46pL8k19L80k14k29nJ09J78j36N8j88j3K34j79K66J17k75k32L07k36
5206a92K33J05q2j85J50J83k14Q7j53l4J32Q6m37K71J00k47J10K48l47O9J16j30
5228a31L3J61N4j8l01J70O1j4p0j25J47p9J86j51J52j84R4J28j42j3K56m58J32
5251a12J41p7m4K1M6K38l86M80k17q3M0n9K02l15j17L61j28M5P6j49j41K67J88
5274B77m06M4J00K78j94j5k93J87N3o3k62J02J69j03R6K15r3p3NJ49l81K07l3
5297c4j49L2p1K59j4J22j17L04k98j9Q4R8L5j75j65k1J77Q2j01q3n0J95nr6N7
5322D7j98J24M7o3k1Oj0K75k15M6J29r0j66L71k84q9L04k70O4L24k42J82k52P1
5346I0j25j83K27J54l6k29M8n8j23L43r1r8N9J39m22K33K8J96k50%L92j82p0P2
$$ plain form
5370 114 108 44 69 99 -9 -120 -98 148 11 20 -309 67 -119 -195 110 -38 -3 -18 19 93 -57 -74 -119 -66 25 108
5396 108 139 -44 384 -206 28 32 194 119 -80 293 117 -13 -173 4 76 125 88 -30 -109 -15 155 70 -29 98
5420 98 80 -2 97 7 -166 160 -117 137 -119 61 -59 -35 87 220 145 -212 -14 54 332 60 -89 -160 23
5443 23 18 3 -68 77 -40 30 -83 11 -97 -44 -52 126 -13 -55 143 -119 200 144 -11 132 -123 44 75 40 -186
5468 -186 -11 84 40 -49 29 -54 43 -89 73 -150 41 47 110 -284 66 -107 -238 -116 -174 -1 -231 -49 15 123
5492 123 91 54 -132 -131 -104 -11 97 -126 56 2 30 46 182 -34 -182 -116 140 200 117 -112 71 57 -22 -102 141
5517 141 33 -75 75 5 -81 -268 -148 -91 -29 3 103 163 49 274 36 232 15 -103 -26 -130 171 -60
5539 -60 -21 -52 -33 -23 213 -54 130 -73 -356 -226 -70 -26 200 229 2 16 -117 41 133 89 -106 -57 -8 227
$$ packed form
5370A14oo4K5L0j08j11K2K46j37Rl29L76j86p6L05j48L5j5L7P4j50j7m5N3R1Q3
5396A08L1j83M28n90K34MJ62p5j99L73j76j30j60J77P2M9l7j18p9R4J70q5r9J27
5420I8j8q2R9r0j73L26k77K54k56J80j20K4J22J33p5l57J98O8K78k72j49p1J83
5443B3nj5p1J45j17P0j13R4j08N3qJ78j39m2J98k62L19n6j55J43k55J67L1l5k26
5468a86J75R5m4q9P8q3R7j32J62k23J91OO3l94L50j73j31J22n8J73k30J82O4J08
5492A23l2l7j86JK7R3J08k23J82n4K8J6J36k16j48O6K56O0q3k29J83j4p9q0K43
5517A41j08j08J50p0q6j87J20N7O2L2J00O0j14K25k38J96k17j18P7j04L01k31
5539f0L9l1J9J0K36k67J84k03k83J30J56M4K26K9k27J4j33J58R2m4j95M9M9K35
$$ plain form
5563 227 -1 -6 -46 -36 -88 -47 115 69 226 -56 213 1 43 66 -260 -155 175 -29 -83 -42 41 137 22 -62 85
5588 85 -143 -68 40 -78 139 120 45 84 57 4 -7 79 99 -117 201 109 -209 -90 -77 -206 -16 78 -95 58
5612 58 99 -151 -247 -100 -9 -73 -80 -48 -53 -97 -82 22 13 183 -87 55 -16 28 82 61 -86 41 -217 60 93 -118
5638 -118 144 22 69 97 61 87 -112 -188 32 128 -6 -105 -15 -100 -93 103 -91 -75 -233 20 129 66 94 -43 183
5663 183 -79 160 6 -146 -152 9 14 -173 -12 106 21 43 -65 -208 -177 -10 -7 -17 0 -142 26 207 -212 -357
5687 -357 -59 -230 55 17 259 99 -92 -91 8 -7 151 -152 -89 71 14 -189 148 -98 -193 116 -113 102 -150
5710 -150 -70 -286 52 191 -188 -106 21 -22 269 197 -29 233 77 106 103 -60 -162 -97 97 -79 128 126 -174
5733 -174 74 59 -24 50 67 -19 7 120 -57 39 -191 -126 -209 -158 33 -98 -55 96 30 84 125 140 -225 99 45
$$ packed form
5563B27k28nm0J0n2M1J62m6J57k82K69k12M2K3l26J05L30k04n4M1Q3R6j15q4J47
5588H5k28P5J08j18K17j9p5L9k7n3j1Q6K0k16L18r2l18J19J3j29J90R4j73J53
5612E8M1k50r6J47R1o4pL2nm4J5J04rJ70k70J42p1M4N4k1j47J27k58K77L3k11
5638a18K62j22M7K8l6K6j99p6K20R6j34r9R0q5PJ96j94J6j58K53J09o3K8j37K26
5663A83k62K39j54j52oJ61Nj87J61J18q5K2j08j43L1J67Lj0J7j42J68J81m19j45
5687c57K98j71K85l8K42j60j91JR9j5J58l03O3J60n7k03L37k46r5L09k29K15k52
5710a50Q0k16L38J39l79Q2J27m3K91p2k26K62j56K9lj63j02O5J94j76K07kl00
5733a74K48j5q3P4J7q6K6J13j77R6k30O5q3N1J91j31M3J51o6N4M1J5l65L24n4
$$ plain form
5758 45 4 -21 -214 121 154 -58 167 191 110 -125 -167 -200 242 -141 71 205 -382 -130 -82 68 44 -56 -80 -172
5782 -172 13 180 10 98 -44 -111 54 -49 12 1 118 23 61 -43 -101 -3 114 128 -24 262 -172 -20 -131
5805 -131 102 -135 11 -157 -151 44 13 -189 19 -12 -82 -20 -37 -78 -109 -175 -198 212 132 -127 59 123 117 179 90 188
5831 188 -217 161 -67 62 -26 -136 309 -144 -112 -227 -46 -108 -180 -11 -139 -167 205 -197 -107 -211 153 -91
5853 -91 297 186 111 -15 13 40 -62 30 71 128 177 -225 -103 -97 -143 -209 -61 96 -56 57 2 54 -119 105 125
5878 125 87 -126 34 111 202 165 47 51 81 83 99 -122 70 -167 -176 216 -18 -53 68 153 -268 -31 -227 -201 71
5903 71 -33 -50 29 -43 -226 21 -2 -26 14 9 162 104 9 78 -88 54 -171 -33 -29 -19 -151 -182 59 -38 -27 98
5929 98 -155 -124 235 19 11 86 179 -266 -225 -129 -159 29 139 -86 -152 94 -143 119 -114 72 119 35 68 3 40
$$ packed form
5758D5m1k5j93L35L3k12K25K4q1k35m2l3M42l83K12J34n87K52M8J50k4j00k4r2
5782a72J85J67j70Q8j42o7J65j03O1j1J17r5L8j04n8R8J17J4j52K86m34J52j11
5805a31K33k37J46j68OJ95l1k02K08l1p0O2j7m1l1o6k3M10q0k59J86O4oO2q9R8
5831A88m05L78k28J29q8j10M45m53L2j15J81o2p2J69j28k8L72m02R0j04L64k44
5853i1L88j11p5j26K8K7j02R2M1N7M9m02J22Om6o6J48J57j52J13n5N2j73K24K0
5878A25l8k13J60P7R1l7j18ML0KJ6k21J92k37rL92k34l5J21Q5m21K37j96K6K72
5903G1j04j7P9p2j83K47k3k4M0nJ53n8r5O9j66J42k25J38MJ0j32l1K41r7J1J25
5929I8k53L1L59k16qP5R3m45M1R6l0J88J10k25o6K46k37K62k33J86M7q4L3o5L7
$$ plain form
5954 40 -87 -118 -93 103 -143 -183 -71 19 -76 158 77 -134 17 -149 198 -57 301 -75 -209 98 -55 51
5976 51 -37 37 265 123 246 67 -223 -113 -26 218 60 87 226 20 -17 68 -43 -94 109 -12 -73 38 51
5999 51 14 -44 -169 100 -197 -23 -77 -247 121 -138 61 15 292 29 45 82 -73 -290 -68 18 -104 202 25
6022 25 273 -34 18 67 -187 47 98 -95 81 -69 -41 -79 160 77 -59 -47 -265 41 -90 -43 114 -416 216
6045 216 338 200 139 37 -21 83 237 52 -109 274 216 -110 -186 114 -89 -111 23 -55 -63 -122 -165 -120 -111 -20 192
6070 192 64 -90 -62 -11 -188 95 74 24 -82 -130 251 -168 119 107 -76 117 6 104 132 155 -48 -97 -145 57
6094 57 40 -36 39 -31 -67 -296 129 60 -107 -116 39 123 -177 289 -103 214 -6 -76 18 8 -144 -94 165 -84 85
6119 85 11 157 249 -154 -72 -141 -63 207 -147 -56 -262 159 -58 -157 -11 156 -75 252 -131 24 147 83 20
$$ packed form
5954D0j27l1K5J96k46m0J12R0r5K34q1k11J51j66L47k55L58l76j34L07j53J06
5976E1q8P4K28j42J23j79k90J10Q7K44j58K7J39k06l7Q5j11n1K03j21o1J11J3
5999E1l7n8j25K69k97J74n4j70L68k59J99m6K77k63J6L7j55k17K22Q6j22L06j77
6022B5K48l07N2M9k54K34N1j93J76j50K8l8K39q3j36J2k18L06j31M7J57n30O32
6045B16J22j38o1j02n8J04J54j85j61L83n8l26p6L00k03k2J34p8qn9m3M5RR1K12
6070A92j28j54K8N1j77K83k1n0j06m8L81m19K87j2j83J93j11R8K8K3k03m9m8K02
6094E7j7p6P5p0l6k29M25o9j67rJ55Q4l00M66l92L17k20p0R4j0j52N0K59k49J69
6119H5p4J46R2m03Q2o9P8K70l54R1k06M21k17r9J46J67k31L27l83J55J23o4o3
$$ plain form
6142 20 -251 -87 -154 -354 71 -66 29 106 7 49 -127 43 133 -49 70 43 -97 -52 115 13 -14 -140 -303
6165 -303 -210 -80 -76 35 192 77 -210 43 61 96 2 302 188 134 -91 95 -37 -14 157 -31 -165 -173 14
6188 14 55 -192 -81 -20 36 99 -246 0 -84 -165 1 203 213 216 231 -24 155 -28 213 -96 115 36 176 35
6212 35 96 -194 188 45 -18 49 -11 127 -167 -80 109 -110 -255 127 38 -1 -199 -142 -45 -101 270 35 -207 115
6236 115 -1 54 224 -75 32 119 63 -77 -271 138 271 115 179 -317 50 13 -252 190 -153 301 -210 -219
6258 -219 -216 -216 -121 -32 97 119 -27 87 23 -11 157 -171 -169 -40 118 -124 46 66 -18 -159 -28 128 -126 -91 -59
6283 -59 -29 -37 -212 -37 -251 -50 -140 120 114 -47 147 -151 -112 148 -59 188 54 -142 167 121 22 -6 -177 182
6307 182 267 4 -72 -25 -62 -207 -66 -42 -46 342 -162 -164 -101 286 404 -102 -284 104 349 -81 -178 -248 -252 195 -95
$$ packed form
6142B0k71J64o7k00M25j37R5P7r9M2j76J70R0j82J19k7j40M5J67j02k7j26j63
6165c03R3J30MJ11J57j15k87K53J8L5r4L00j14n4k25J86j32K3J71j88j34qJ87
6188A4M1k47J11O1N6O3l45K46q4q1J66K02J0LJ5k55J79j83K41l09K11p9J40j41
6212C5O1k90L82j43o3O7o0J38k94Q7J89k19j45L82q9l9j98N7R7n6L71k35k42L22
6236A15j16N5J70k99J07Q7n6j40j94M09J33j56O4m96L67l7k65M42l43M54n11r
6258b19L%R5Q9J29K2j46J14o4l4J68l28KJ29J58k42J70K0q4j41J31J56k54L5L2
6283e9L0qj75J75k14K01r0K60oj61J94k98L9K60k07K47j34j96L09m6r9k8j71L59
6307A82Q5k63p6M7l7j45J41K4mL88n04kO3L87J18n06j82L88K45m30r7p0mM47k90
$$ plain form
6332 -95 -136 86 122 254 -83 -16 -68 63 -3 -182 -78 -7 85 77 -83 125 -148 -52 -133 276 19 26 26 88 164 -181
6358 -181 -53 16 -62 -54 120 64 194 -4 108 20 47 -17 -196 91 -164 -194 259 158 -61 -47 -161 13 -149
6381 -149 76 -232 -173 196 49 140 -158 -159 -161 4 -190 -123 106 53 152 -18 49 -254 -38 9 27 16 -38 -7 2 57
6407 57 -101 -116 1 -56 146 57 89 -6 178 242 168 -73 -154 171 -80 77 -272 77 -37 30 87 -3 101 -106
6431 -106 -40 137 223 -74 -221 48 -104 84 83 -6 -148 -31 -32 -245 -70 -307 -237 -129 -110 30 111 -104 135
6454 135 133 -108 80 -187 -43 199 -163 -87 -218 -106 66 101 8 -24 -124 23 -8 92 155 -13 43 82 102 -215
6478 -215 63 13 102 -100 -61 72 -43 -33 20 33 -138 -165 11 42 -174 -87 -51 -155 -4 -169 322 175 150 71
6502 71 -162 9 115 300 120 7 81 -115 40 30 -27 -169 -156 -324 49 -73 109 51 -9 -21 -162 -67 -118
$$ packed form
6332i5m1K22L6J32l37O7n2J31o6j79J04P1R2qj60K08k73R6q1M09k57P%O2P6l45
6358a81J28O9p8QJ74n6J30j98J12q8K7o4j79K87k55l0M53j01k19J4j14J74j62
6381a49K25l08N9L69j47R1k98jkJ65j94O7K29n3R9j70O7l03K16M7J8j1n4L1RN5
6407E7j58j5J17n7K02q9L2r5J84O4p4k41q1L25k51J57l49L49j14O7N7r0J04k07
6431a06O6J77Q6k97j47K69j52J88jq9j42J17jk13J75k37P0J08J9J40Q1k15K39
6454A35kk41J88k67J44K42l62P6j31J12J72L5r3l2j00J47l1J00O3j68N6L9K0l17
6478b15K78n0Q9k02L9J33j15J0N3J3j71k7J76L1k16Q7L6j04J51j65M91j47k5p9
6502G1k33J71J06J85j80j13P4j96J55j0n7j42J3j68L73j22J82n8o0j2j41R5n1
$$ plain form
6525 -118 127 21 81 34 59 -56 17 195 -96 -112 279 -146 276 -102 -65 -105 -56 228 139 -142 -194 168 -240
6548 -240 -130 -81 59 -5 154 -117 -89 34 9 74 -116 -59 49 204 -102 -63 78 -70 -77 -115 -28 13 28 90 -152
6573 -152 63 -46 145 2 -18 162 -243 186 -73 -78 1 49 45 -142 -115 -163 -138 -30 98 27 57 42 77 -10 -59
6598 -59 -1 -115 -199 -58 123 51 126 -103 52 -42 -234 43 93 -75 38 74 -109 -168 -170 -99 -131 7 78 -83 66
6623 66 64 -299 -135 -40 187 6 144 -106 -6 -146 131 89 -176 6 -27 -174 -207 -6 -38 295 1 82 -46
6646 -46 -69 -2 -93 67 12 -67 -268 -32 240 112 -3 30 45 195 242 457 -40 51 5 47 -47 133 103 211 46
6671 46 130 102 133 0 -66 127 -104 66 -71 24 39 -149 -145 -17 81 23 23 53 260 -82 280 -93 -144 102 -76
6696 -76 -74 80 -140 -164 253 117 164 220 -23 -403 -207 -139 65 222 -49 89 98 -218 -6 -267 82 85 -28 149
$$ packed form
6525a18K45j06O0m7K5j15P3J78k91j6L91m25M22l78L7m0M9K84q9k81n2L62m08
6548b40J10M9J40o4J59k71K8J23k5O5j90N7J08J55l06L9J41j48pl8Q7M1J5O2k42
6573a52K15j09J91j43k0J80m05M29k59nP9M8mj87K7m8K5J08J28p1L0j5L5q7m9
6598e9N8j14q4J41J81p2P5k29J55r4j92K77N0j68J13L6j83n9kP1l2J38P1j61J49
6623F6kl63J64R5K27j81J38k50J00j40K77m2k65J82l3j47l3K01l2L33k94Q1j28
6646d6k3O7r1J60n5p9k01K36K72j28j15L3J5J50M7K15m97R1m6M2r4J80l0J08j65
6671D6Q4k8L1j33o6J93k31J70j37R5J5j88MJ28R8n8%L0K07l42L62l73n1K46j78
6696g6KJ54k20k4M17j36M7N6k43l80J96O8K04J57k71J38Rl16K12k61L49Lj13J77
$$ plain form
6720 149 -131 -55 7 63 78 9 -112 -155 -119 168 -31 86 5 -111 -138 -244 -4 312 -50 -156 -155 152 241 -115
6744 -115 -126 -26 -107 149 184 148 162 291 -9 232 88 -8 106 168 160 322 -182 7 141 88 -332 -94 6
6767 6 -157 74 4 149 -185 -11 -13 65 51 -16 -83 -151 -192 28 32 -33 -29 -146 43 110 -134 115 70 334 98 121
6793 121 -167 0 21 -73 -12 140 234 -122 -88 -71 -39 -135 33 -6 61 -21 -121 -42 -71 256 -187 -3 37 -113 182
6818 182 -192 -54 -183 -33 48 132 -28 261 24 -71 34 -10 7 -159 67 -11 61 41 -46 32 34 -135 67 -10
6842 -10 16 -114 -95 -159 -109 -37 -90 113 -89 6 -146 -95 129 -182 46 -45 -92 68 87 105 116 189 140 -146 -68 12
6868 12 -233 40 81 -186 133 -309 70 41 -107 -110 14 -126 -124 146 -72 50 6 -46 -159 -146 -30 -51 -70 -31
6892 -31 378 -65 92 -55 182 30 125 -204 147 -64 -211 -101 -75 59 38 10 -92 -46 -45 154 -364 229 -95
$$ packed form
6720A49k80P6O2N6J5o9j21m3L6K87j99J17q1j16k7j06K40L16l62j06JL07Q9l56
6744a15j1J00q1K56L5l6J4J29l00K41j44r6J14O2qJ62n04J89J34n3m20K38J00
6767Fj63K31p0J45l34J74kP8j4o7o7o8m1K20Mo5Mj17J89O7k44K49m5K64k36K3
6793A21k88J67K1r4O1J52R4l56L4J7L2r6J68l9O7q2j00P9k9L27m43J84M0j50K95
6818A82l74J38j29J50Q1Q4j60K89k37r5J05m4J7j66K26p8P2k0q7P8Kj69K02p7
6842a0K6j30J9o4N0P2n3K03k02R5j52N1K24l11K28r1m7J60J9J8J1P3m9k86P8Q0
6868A2k45K73M1k67L19m42L79k9j48lJ24j40KK70k18J22m4n2j13J3J16k1j9L9
6892c1M09m43J57j47K37j52R5l29L51k11j47J10K6J34k1k8j02M6JJ99n18N93l24
$$ plain form
6915 -95 42 -20 12 55 50 -13 111 60 2 190 91 110 82 7 -176 -4 -24 74 -14 -110 -136 -95 8 -29 46 -68 -103
6942 -103 12 -17 51 -14 -109 -65 -15 -55 179 168 170 -75 226 152 130 225 -30 -89 -98 90 45 90 -163 18 -155 103
6968 103 -88 -74 196 141 70 8 75 98 -66 -204 154 41 76 -209 142 189 128 -89 19 -39 -35 88 -32 -97
6992 -97 -105 -109 -124 103 -53 -187 -109 52 29 -10 -119 -59 -174 -45 67 -138 139 -106 -264 43 166 95 94 -214
7016 -214 178 -59 47 76 -160 2 -36 15 61 37 17 -35 74 3 -69 7 -231 -51 55 0 66 13 17 45 284
7041 284 4 127 -148 -57 72 -128 -16 -137 -19 -215 2 -96 -50 79 101 -36 121 187 -30 85 142 -160
7063 -160 -177 -15 -65 -262 -60 -66 -74 -32 -13 -163 -236 -241 -54 -196 201 39 -59 -194 -84 153 99 -41 -41 14 -67 141
7089 141 3 94 -112 -151 -273 -83 34 -43 -172 -233 -49 121 53 92 -30 78 -25 34 186 72 32 182 20
$$ packed form
6915i5J37o2L2M3no3J24n1n8J88r9J9k8p5j83J72k0R8q8r6k6M1J03l7P5j14l5
6942a03J15k9O8o5r5M4N0m0K34j1Kk45L01p4k2R5k55n9rJ88m5M5k53J81j73K58
6968A03j91J4K70n5p1o2O7K3j64j38L58j13L5k85L51M7o1k17J08n8MJ23j20o5
6992i7qmj5K27j56j34P8J61k3l9j09O0j15J29J12k05K77k45j58L07J23p1jl08
7016b14L92k37J06K9k36J62l8N1M6k4k0n2J09p1p2P6k38J80J06n5O6n3MK8K39
7041B84k80J23k75R1J29k00J12j21J18j96K17r8M6J29K2j37J57O6k17J15N7l02
7063a60j7J62n0j97K02oqM2J9j50p3nJ87j42L97j62r8j35J10K37n4j40%N5q1K08
7089A41j38R1k06l9j22J90J17p7j29o1J84J70o8L9j22J08j03N9J52j14m0J50j62
$$ plain form
7112 20 -54 -258 179 53 183 -66 -98 46 16 -212 -68 -112 129 159 132 24 -125 -213 -113 -76 -85 -10 -68 -10 -129
7137 -129 -66 -211 45 -5 16 -300 -142 254 191 142 118 -83 4 83 157 133 -45 144 -40 -40 -231 -100 9 118
7161 118 38 157 -156 161 119 -74 142 12 110 143 113 88 347 -204 -75 20 -39 -3 5 -165 -84 262 53 -51
7185 -51 203 124 -200 62 223 54 -8 -257 -150 82 266 87 14 -46 -50 16 84 31 11 313 -34 -39 93 -24
7209 -24 -66 -93 225 38 69 80 220 -118 -141 -132 143 77 59 42 -22 -110 -64 -24 -146 -196 -64 40 -88 34 127 -237
7235 -237 -86 -22 -59 -77 -67 179 -15 68 -17 183 128 110 -27 -72 -198 147 183 -37 -76 -211 -52 32 -7 94
7259 94 -71 -75 -140 60 -129 -192 -105 -97 -262 -56 -132 66 -72 -93 -154 67 146 -173 108 127 243 264 -26 -14 28
7284 28 97 -28 298 -149 -234 -61 8 213 -157 82 -124 -45 207 97 73 73 -137 17 230 85 -6 68 76 53
$$ packed form
7112B0p4k04M37j26J30k49l2J44l0k28J44m4K41L0k7j08j49q8J00L7rP5n8N8j19
7137a29O3j45K56n0K1l16J58L96o3m9k4k01Q7P9P4k4j78J89j84%j91J31J09J09
7161A18q0J19l13L17m2j93K16j30R8L3l0k5K59n51J29R5n9L6Qj70Q1L46k09j04
7185e1K54p9l24K62J61j69o2k49J07K32J84j79p3o0mO6O8n3k0L02l47nJ32j17
7209b4m2k7L18j87L1J1J40l38k3RK75o6j8j7o4q8M6M0j22n0J32J04j28J22R3l64
7235b37J51O4l7j8J0K46j94Q3q5K00n5j8j37m5j26L45L6k20l9j35J59Q4l9J01
7259I4j65mo5K00j89o3Q7Qj65K06p6J98j38k1o1K21P9l19K81J9J16K1k90J2M2
7284B8O9j25L26m47q5J73O9K05l70K39k06P9K52j10k4%k10J54K13j45r1P4Qk3
$$ plain form
7308 53 110 -48 7 29 114 -156 -1 -184 171 -105 -192 147 -103 -153 64 -57 155 139 -190 -204 -60 58 51 90
7332 90 -71 13 26 -168 -33 -45 -37 -133 340 -220 15 -225 144 -25 -105 61 -45 -142 41 60 -45 -23 -92 -228
7356 -228 -21 257 36 -19 122 17 145 -3 -201 -46 -59 -26 -5 -30 74 -202 118 -3 -109 254 -109 151
7378 151 -166 204 131 -115 19 -31 -91 -37 64 97 -148 -123 -62 68 23 -86 2 49 279 292 83 -153 147 -40
7402 -40 271 128 -157 -26 39 -18 6 -124 12 117 9 54 -38 -14 17 -134 -83 -76 100 -4 -93 -66 -230 83
7426 83 160 63 21 48 186 79 -12 -74 -18 -57 -100 164 36 11 -27 79 -95 138 -30 44 123 62 67 -42 -193 -63
7452 -63 -29 -105 179 -199 -26 145 243 -262 83 252 -104 -293 219 97 -55 37 -168 -97 -89 -30 160 -187 17
7475 17 -227 92 121 123 -61 85 -240 -3 -186 55 -113 123 -89 115 -147 188 -15 89 143 160 -93 -73
$$ packed form
7308E3N7j58N5K2Q5k70J55j83L55k76q7L39k50n0K17j21K12j6l29j4J44J18pL9
7332I0j61Q4J3j94J35j2Qr6M73n60K35k40L69j69q0J66j06r7J83J9j05K2o9j36
7356b28K07K78k21n5J41j05J28j48j98J55j3L3K1k5J04k76L20j21j06L63l63K60
7378A51l17L70p3k46J34n0o0N4J01L3k45K5O1J30m5j09Q8M7K30J3k09k36L00j87
7402d0L11j43k85J31O5n7K4j30J36J05j08M5r2K4L1j51N1PJ76j04q9K7j64L13
7426H3P7r7m2K7J38j07r1o2N6l9m3K64j28k5l8J06j74K33j68P4P9o1Nj09j51J30
7452f3L4p6K84l78J73J71R8n05L45J69l56j89N12j22j52R2k05P1QN9J90l47K04
7475A7k44L19K9Kj84J46l25K37j83K41j68K36k12K04k62L35k03J04N4J7k53K0
$$ plain form
7497 -73 204 -292 41 -10 29 128 -174 189 -77 273 146 90 189 -112 -26 -184 23 23 -151 -31 -12 163 -52
7520 -52 -212 -81 213 -220 -71 -7 -14 24 -64 200 108 -130 42 69 -58 -69 42 53 -39 92 -28 95 48 -173
7544 -173 50 40 40 52 -117 24 68 -78 -28 -58 26 39 -78 72 -36 82 73 -76 90 -194 77 8 -66 185
7568 185 -81 -11 -257 -165 -91 28 212 56 -85 -73 -150 -12 344 -219 27 -149 -200 90 -126 -145 -155 -72 35
7591 35 -98 115 -72 -74 -2 193 71 -176 77 -35 -246 16 -122 -77 9 46 17 32 -22 -335 65 -164 -142 -220
7615 -220 78 103 95 132 -3 6 -132 65 -88 29 -46 -72 21 -92 109 -7 -117 -31 306 87 44 79 -61 -82
7639 -82 67 6 98 -143 -19 -298 6 108 -45 58 -111 17 -180 30 46 -82 106 39 252 90 -129 -20
7661 -20 101 54 -105 -11 73 -89 35 124 27 17 -129 61 -260 -37 -46 -27 -111 -94 56 -213 70 36 77 -63 -220
$$ packed form
7497g3K77m96L33n1L9R9l02L63k66L50j27n6R9l01Q6j58K07%j74J20J9J75k15
7520e2j60J31K94m33J49O4pL8q8K64r2k38J72K7j27j1J11J1r2J31j20J23m7k21
7544a73K23j0%J2j69J41M4j46N0l0Q4J3j17J50j08J18rj49J66k84K71o9p4K51
7568A85k66P0k46R2P4J19J84j56j41J2p7J38L56n63K46j76n1K90k16j9j0Q3J07
7591C5j33K13j87kP2J95j22k47K53j12k11K62j38M5Q6L7k9J5n4l13M00k29K2p8
7615b20K98K5qL7j35Rj38J97j53J17p5k6R3j13K01j16j10Q6L37k19m3L5j40k1
7639h2J49o1R2k41J24k79L04J02j53J03j69J28j97K10J6j28J88o7K13j62k19J09
7661b0J21m7j59R4Q4j62J24Q9r7j0j46J90l21K23rJ9q4J7J50k69K83l4M1j40j57
$$ plain form
7686 -220 242 -100 32 173 47 139 89 17 -118 -45 -11 -149 97 96 47 39 71 139 21 73 55 -104 42 -50 14
7711 14 -12 -129 172 -20 -92 20 -95 13 -55 -58 -18 138 -131 -40 9 -229 64 -66 -4 -1 -94 -82 34 -21 -276
7736 -276 212 36 -149 -48 -119 55 -128 -65 -195 -196 115 329 43 -134 -292 -172 114 195 38 176 -22 163
7758 163 111 -46 -251 -154 -18 40 -285 -176 3 -190 22 4 74 213 86 3 -25 127 -88 -69 -210 -143 53
7781 53 -6 7 -1 121 -68 -33 131 216 20 123 -100 177 -37 -189 -6 48 -74 -78 -102 101 -19 -139 -83 86
7805 86 -100 -32 -192 22 -83 117 -43 8 -39 226 68 154 -44 -66 -172 65 -19 15 165 23 -45 230 70
7828 70 290 -91 63 -39 -23 -14 38 8 114 105 -268 -22 234 28 -32 -135 15 124 -350 -112 108 -107 247
7851 247 12 102 -53 -215 97 -116 -15 136 63 40 112 197 11 -118 231 -54 99 -4 -346 101 -68 70
$$ packed form
7686b20M62l42J32J41j26R2n0p2j35P3L4j38K46jm9qL2O8j18N2j8j59J46r2O4
7711A4k6j17L01j92p2J12j15J08o8lM0J56k69R1M9k38K93j30O2Lr3J2J16n5k55
7736b76M88j76j85J01p1J74j83O3j30jL11K14k86j77j58J20K86Q1j57J38j98J85
7758A63n2j57k05R7J36N8l25J09J79j93K12j8P0J39j27q3k8J52k15J9j41O7J96
7781E3n9J3qJ22j89L5J64Q5j96J03k23K77k14j52J83N4j22mk4K03j20j20N6J69
7805H6j86O8j60K14j05K00j60N1m7K65j58Q6j98k2j06K37q4L4J50j42o8K75j60
7828G0K20l81J54j02J6RN2l0J06rl73K46K56k06o0j03J50J09m74K38K20k15L54
7851B47k35R0j55j62L12k13J01J51p3k3P2Q5j86j29L49k85J53j03l42M47j69J38
$$ plain form
7873 70 -24 -8 -25 -43 -57 -3 -155 211 223 58 -71 -19 -14 220 39 -168 144 -95 -146 -182 -30 101 -64 -401
7897 -401 -146 58 -164 -122 -105 -20 -184 211 -66 82 -29 -58 -150 35 -16 77 70 -119 30 89 98 -67 -156 384
7921 384 -208 128 -45 164 100 -124 -44 66 283 -47 -55 128 31 -20 268 -44 95 -78 -112 -40 -150 -27 -179
7944 -179 234 -49 182 45 -102 -32 199 102 -76 -24 185 -70 -149 122 226 53 48 50 -1 59 139 2 92 68
7968 68 156 144 83 97 58 -145 36 138 -88 142 153 102 15 -264 137 139 198 12 -173 26 234 -25 105 -42
7992 -42 88 -196 -220 50 -122 -61 -118 160 52 23 -155 20 -37 -82 -98 138 41 28 -83 75 -43 173 7
8015 7 147 -3 -125 186 -157 4 161 87 -26 -36 -224 181 -15 -89 -120 -6 -213 -38 37 -209 -47 148
8037 148 -159 25 183 -54 47 129 42 229 106 180 26 19 124 7 -41 65 282 383 104 123 -100 105
$$ packed form
7873G0r4J6j7j8j4N4j52L66J2j65j29N2NK34j81k07L12k39n1l6J52J31j65l37
7897d01K55K04k22M2J7Q5j64L95k77J48j11k9r2J85n1R3pj89J49N9Rj65q9N40
7921C84n92L36j73K09o4k24Q0J10K17l30qJ83r7n1K88l12J39j73l4P2j10J23j52
7944a79M13k83K31j37j47P0K31r7j78N2K09k55p9K71J04j73nKn1O0Q0j37R0k4
7968F8Q8j2o1J4l9k03J81J02k26K30J1n1q7k79M01KN9j86j85J99K08k59J30j47
7992d2J30k84k4K70j72O1n7K78j08k9j78J75n7m5j6K36r7j3j11J58j18K16j66
8015GJ40j50j22L11l43J61J57p4j13j0j88M05j96p4l1J14k07J75P5k46J62J95
8037A48l07J84J58k37J01Q2q7J87j23P4j54pJ05j17m8J06K17J01k79J9k23K05
$$ plain form
8059 105 -40 -148 47 -201 -78 -225 -104 16 -53 41 -157 -82 -155 -104 -31 20 24 155 -44 85 -166 -192 157
8082 157 243 63 -119 49 -117 15 44 -182 73 -97 9 -35 5 -125 53 -162 158 43 -67 -161 73 58
8104 58 -53 -130 105 5 -175 -96 154 112 -11 154 -46 -89 112 174 -39 101 -28 -101 73 46 409 131 -37
8127 -37 -120 223 230 -146 -4 -91 -150 194 -365 -225 -103 -51 -64 96 -21 -3 159 119 74 167 -113 -77 -60 175 -126
8152 -126 -134 82 -123 -50 17 11 45 107 29 -44 34 111 48 -176 41 44 231 -19 98 -160 -57 36 122 137 -164 285
8178 285 -7 62 -169 81 102 -46 -36 115 -197 -58 -141 220 42
$$ packed form
8059A05j45j08J95k48J23j47J21J20o9R4j98P5p3N1P3N1MJ31j99J29k51k6L49
8082A57Q6j80j82J68j66J32K9k26K55j70J06m4M0j30J78k15L20j15j10r4K34j5
8104E8j11p7K35j00j80P9K50m2j23J65k00m3K01O2k13J40j29p3J74k7L63k78j68
8127c7q3L43Pl76J42q7n9L44n59J40J22N2j3J60j17J8J62m0m5R3k80L6J7K35l01
8152a26qK16k05P3O7oL4O2p8p3P8P7o3k24K17LJ87k50J17k58J03R3Q6J5l01M49
8178B85k92O9k31K50K1j48J0J51l12J39q3L61j78
8191D2
$$ Imaginary data points
##PAGE= N=2
##DATA TABLE= (X++(I..I)), XYDATA
$$ plain form
0 0 0 0 0 0 0 0 0 0 0 0 8 -8 8 -8 8 -16 16 -16 21 -24 32 -32 40 -48 56 -64 73 -88 99 -113 129 -147 166
33 166 -187 211 -238 265 -296 330 -369 409 -454 503 -554 611 -676 748 -822 905 -996 1097
51 1097 -1210 1335 -1474 1633 -1813 2017 -2254 2534 -2871 3282 -3794 4455 -5348 6615 -8539
66 -8539 11804 -18327 36166 -180702 -470681 308857 382994 -385699 -294610 461276 182795
77 182795 -481846 -66909 493016 -42091 -451069 143917 405461 -221232 -327402 277654
87 277654 248731 -310860 -161035 314186 76776 -304809 -11062 264556 -48891 -226701
97 -226701 81031 169472 -105483 -124663 103413 78769 -90736 -46868 69518 28738 -40950
108 -40950 -18814 22082 31175 2613 -42756 -5143 69743 6429 -85941 13167 104846 -36366
$$ packed form
0@%%%%%%%%%%Qj6J6j6J6k4L2l2L7m5N6o4P2q8J04j20J37j61J87k12K42k76L13
33A66l53L98m49N03n61O26o99P78q63R57j057J165j287J424j570J727j901K093
51A097k307K545k809L107l446L830m271M788n405O153p076Q249r803J1963j5154
66h539K0343l0131N4493k16868k89979P79538P4137p68693R1089P55886k78481
77A82795o64641M14937N59925n35107m08978N94986K61544o26693j06170O05056
87B77654k8923n59591J49825M75221k37410l81585K93747K75618l13447j77810
97b26701L07732Q8441k74955j9180K28076k4644j69505M3868J16386m0780o9688
108d0950K2136M0896R093k8562m5369L7613P4886o3314r2370R9108R1679j41212
$$ plain form
120 -36366 -113587 66788 109343 -103015 -96708 130115 63025 -159811 -31721 168496 -17107
131 -17107 -174524 60161 156815 -108574 -130035 146193 89909 -169968 -37671 185568 -13209
142 -13209 -176620 73719 160876 -117529 -118822 159689 73327 -180190 -14816 189198 -43667
153 -43667 -179114 98828 148340 -150049 -109157 181332 51823 -206430 1608 204961
163 204961 -66418 -194434 119658 161263 -168703 -118465 203412 66456 -220738 -4673
173 -4673 227751 -50475 -209720 109417 185381 -149728 -140264 186266 95487 -203118 -41997
184 -41997 207871 -9105 -198254 52961 173529 -93151 -147312 115266 108119 -135377 -75952
195 -75952 135857 37918 -133710 -11452 120158 -11230 -104514 27239 88626 -33042 -68843
$$ packed form
120c6366p7221J80375M2555k12358O307K26823o7090k22836J28090K00217j85603
131a7107j57417K34685R6654k65389k1461K76228n6284k59877J32297K23239j98777
142a3209j63411K50339Q7157k78405j293K78511q6362k53517J65374K04014k32865
153d3667j35447K77942M9512k98389M0892K90489j29509k58253K08038K03353
163B04961k71379j28016L14092M1605l29966N0238L21877j36956k87194K16065
173d673K32424k78226j59245L19137P5964l35109R464L26530r0779k98605J61121
184d1997K49868k16976j89149K51215J20568k66680n4161K62578p147k43496N9425
195g5952K11809r7939j71628J22258J31610j31388r3284J31753O1387j21668l5801
$$ plain form
206 -68843 38429 59663 -31362 -47319 30272 47984 -21712 -46192 21415 53782 -21867 -61523
218 -61523 27933 68740 -42739 -76242 56916 73093 -81453 -71613 99900 54286 -124965
229 -124965 -35742 139892 5489 -151326 27659 154159 -62508 -145065 101051 130271
239 130271 -131139 -98802 161795 67074 -175739 -23151 186167 -18280 -180822 63136
249 63136 165143 -103308 -140043 133737 103466 -159908 -66807 168641 19910 -173198 19821
260 19821 158843 -61293 -140691 90981 111210 -115146 -77306 130467 42543 -131389 -4059
271 -4059 128157 -24564 -110027 54424 93073 -70382 -65183 84724 40346 -86455 -14245
282 -14245 81967 -8491 -73522 24040 57351 -39111 -44362 41678 24161 -45146 -12710 38042
$$ packed form
206f8843J07272K1234r1025j5957P7591J7712o9696k4480O7607L2367p5649l9656
218f1523Q9456M0807j11479l3503J33158J6177j54546R840J71513m5614j79251
229a24965Q9223J75634j34403j56815J78985J26500k16667q2557K46116K9220
239A30271k61410L2337K60597r4721k42813J52588K09318k04447j62542K43958
249F3136J02007k68451l6735K73780l0271k63374R3101K35448j48731j93108J93019
260A9821J39022k20136p9398K31672K0229k26356L7840K07773q7924j73932J27330
271d059J32216j52721q5463J64451L8649j63455N199J49907m4378j26801P2210
282a4245R6212r0458o5031R7562L3311r6462n251Q6040j7517o9307L2436N0752
$$ plain form
294 38042 -533 -33035 6601 23638 -9525 -14465 9909 9681 -3086 -3183 1105 6756 8170 -6613
308 -6613 -9022 15596 13037 -21695 -9412 30985 3222 -38502 5493 40937 -20150 -44504 30867
321 30867 37714 -48779 -32044 58358 15871 -69944 -323 73679 -19715 -73327 40997 68374
333 68374 -59196 -53438 79058 38319 -88158 -12994 98568 -8073 -96048 35427 91252
344 91252 -58024 -76711 78394 57414 -94079 -36146 100790 8263 -105906 14379 97478
355 97478 -41757 -89360 59172 70246 -76861 -52179 86258 29549 -90064 -6408 89644
366 89644 -12631 -80029 33086 71555 -44408 -54761 57516 41320 -60312 -23181 62384
377 62384 9413 -59120 3174 52870 -14874 -47596 19886 36261 -27347 -31220 26035 20919
$$ packed form
294C8042l8575l2502L9636J7037l3163m940K4374k28j2767r7M288N651J414j4783
308f613k409K4618k559l4732J2283M0397k7763m1724M3995L5444o1087k4354P5371
321C0867O847q6493J6735R0402m2487q5815O9621P4002r3394n3612J14324K7377
333F8374j27570N758J32496m0739j26477P5164J11562j06641q7975J31475N5825
344I1252j49276j8687J55105k0980j51493N7933J36936r2527j14169J20285Q3099
355I7478j39235m7603J48532J1074j47107K4682J38437n6709j19613Q3656R6052
366H9644j02275o7398J13115L8469j15963j0353J12277j6196j01632L7131Q5565
377F2384n2971o8533O2294M9696o7744l2722O7482J6375o3608l873N7255n116
$$ plain form
389 20919 -29116 -17497 26313 11128 -25618 -8721 24092 7578 -22059 -4768 24601 6174
401 6174 -23071 -1494 27264 2150 -26901 3285 31224 -6864 -31633 13460 31268 -21146
413 -21146 -30755 26614 24975 -36539 -21590 39859 10073 -46982 -2820 46275 -9784 -47405
425 -47405 19872 42962 -30647 -36300 40938 28704 -45851 -15337 52506 6060 -51305 8707
437 8707 52438 -18780 -44932 31711 38449 -39684 -28941 45797 16842 -50527 -6864 48587
449 48587 -8324 -48551 16411 40838 -27899 -35886 32936 25391 -39253 -16325 41125 6774
461 6774 -40002 3678 39233 -9054 -32805 19074 30524 -21127 -21541 26760 17146 -26451 -9783
474 -9783 27679 4028 -27336 280 23830 -6059 -23164 6972 17954 -11936 -18266 11557
$$ packed form
389B0919n0035J1619M3810j5185l6746J6897L2813j6514k9637J7291K9369j8427
401F174k9245K1577K8758k5114k9051L0186K7939l8088k4769M5093J7808n2414
413b1146r609N7369j639o1514J4949O1449k9786n7055M4162M9095n6059l7621
425d7405O7277K3090p3609n653P7238j2234p4555L0514O7843m6446n7365O0012
437H707M3731p1218k6152P6643O738p8133J0743P4738k8955o7369M3663N5451
449D8587n6911m0227O4962K4427o8737p987O8822p545o4644K2928N7450l4351
461F774m6776M3680L5555m8287k3751N1879J1450n1651m14M8301r614m3597J6668
474i783L7462k3651l1364K7616K3550k9889j7105L0136J0982k9890o330K9823
$$ plain form
486 11557 13142 -14623 -12335 14122 9415 -15493 -7403 17361 6293 -17100 -1939 19248 1597
499 1597 -17251 4138 20165 -4964 -17767 10501 17907 -12493 -15197 15940 12168 -19714 -10553
512 -10553 20459 4483 -24243 -2044 22238 -5243 -24664 7830 21433 -14169 -19791 18298
524 18298 15458 -21524 -9885 24823 6869 -23756 1078 26276 -4485 -22278 11901 21849
536 21849 -13905 -16858 18138 13085 -20850 -9135 21593 2716 -23495 -344 19876 -6736
548 -6736 -20925 8514 16402 -13964 -15073 14895 9636 -16861 -6209 17955 3049 -16702 1699
561 1699 17527 -2937 -13313 7838 13568 -7466 -9664 10778 9248 -10740 -5853 11617 3216
574 3216 -12696 -2118 10957 -1252 -12597 1310 9337 -6053 -10512 5373 7620 -7851 -7277
$$ packed form
486A1557J585k7765K288K6457m707k4908Q090K4764j1068k3393J5161K1187j7651
499A597j8848K1389J6027k5129j2803K8268P406l0400k704L1137l772l1882R161
512a0553L1012j5976k8726K2199K4282k7481j9421L2494J3603l5602n622L8089
524A8298k840l6982J1639L4708j7954l0625K4834K5198l0761j7793L4179R948
536B1849l5754k953L4996n053l3935J1715L0728j8877k6211K3151K0220k6612
548f736j4189K9439P888l0366j109K9968n259k6497J0652K4164j4906j9751J8401
561A699J5828k0464j0376K1151N730k1034k198K0442j530j9988M887J7470q401
574C216j5912J0578J3075j2209j1345J3907Q027j5390m459J5885K247j5471N74
$$ plain form
587 -7277 7644 5576 -8436 -2939 9985 2888 -8547 139 10616 474 -8106 3823 9781
600 9781 -3687 -7524 5953 7696 -6798 -6063 7660 3286 -10031 -3274 8186 -319 -10146 -485
614 -485 7515 -3514 -9210 3417 6934 -5533 -6213 6505 5566 -6401 -3138 8655 3736 -7014
628 -7014 313 9202 125 -6429 3173 7867 -3250 -6068 5013 4573 -6166 -4314 5414 1475 -7437
643 -7437 -2619 5346 -707 -7273 -125 5205 -2613 -6131 2383 5228 -3579 -4133 5105 3972 -4067
658 -4067 -1301 6495 2777 -4345 417 6537 251 -4319 2104 5162 -1907 -4495 2043 3639 -3829
673 -3829 -4229 2813 1739 -5303 -3285 3150 687 -5282 -1738 4306 -563 -4744 875 4439 -769
688 -769 -3384 2759 4586 -1656 -2193 4354 4044 -2436 -1335 4273 2316 -4062 -956 4482 20 -4772
$$ packed form
587g277J4921k068j4012N497J2924p097j1435Q686J0477j0142q580J1929N958
600I781j3468l837J3477J743j4494P35J3723m374j3317O757J1460q505r827R661
614d85Q000j1029n696J2627L517j2467o80J2718r39j1967L263J1793m919j0750
628g014P327Q889r077o554R602M694j1117k818J1081m40j0739J852R728l939q912
643g437M818P965o053o566P148N330p818l518Q514K845q807n54R238j133q039
658d067K766P796l718p122M762O120o286m570O423L058p069k588O538J596p468
673c829m00P042j074p042K018O435k463n969L544O044m869m181N619L564n208
688g69k615O143J827o242n37O547l10o480J101N608j957o378L106N438m462m792
$$ plain form
704 -4772 -138 3387 -1949 -5291 953 3018 -3737 -4363 2408 1798 -3676 -2733 3897 1840 -4194 -349
720 -349 5187 1154 -3659 1486 5437 20 -3471 2928 5021 -1964 -3151 3808 3397 -3831 -3057 4110
736 4110 1100 -5564 -1929 4048 -1008 -6238 -155 4568 -2434 -6047 1910 4472 -4047 -4278 4679
751 4679 4143 -4663 -2248 6718 2789 -5715 753 7456 -95 -5673 2899 6880 -3140 -5379 4776
766 4776 4729 -6116 -4354 5684 1595 -7767 -2145 6395 -1381 -8568 980 6354 -4056 -6651 4416
781 4416 5313 -5670 -4331 7002 3694 -6493 -711 8471 982 -6732 2322 8287 -2221 -5990
795 -5990 4921 6039 -5214 -4456 5767 2828 -7155 -2646 6270 -700 -7481 -160 5546 -2831 -6900
810 -6900 2291 5063 -4150 -4915 4816 4057 -5028 -2624 6425 3012 -5191 -579 7326 920 -5499 1482
$$ packed form
704d772M634L525n336l342O244K065o755o26O771o10n474R43O630k057o034L845
720c49N536m033m813N145L951n417l491O399K093o985j187O959m11p228P74P167
736D110l010o664L635N977n056n230O083M723p002l613P957K562q519k31Q957
751D679n36q806K415Q966l929q504O468O703p551n578Q572L981j0020k239J0155
766D776m7j0845J762J0038m089r362N622Q540p776p187R548N374j0410k595J1067
781D416Q97j0983J339J1333l308j0187N782R182p489p714R054N965j0508l769
795e990J0911J118j1253P58J0223k939r983M509Q916o970o781P321N706q377m069
810f900R191K772r213p65R731p59r085K404R049l413q203M612P905o406o419O981
$$ plain form
826 1482 7149 -1515 -6123 3329 5912 -4302 -5801 4715 3909 -6906 -4516 6104 1677 -8708
840 -8708 -1964 7815 -1137 -9078 1670 8213 -4020 -7505 6175 7515 -7087 -4889 9783 4628
854 4628 -8862 -643 11398 149 -9920 3500 10448 -5104 -8755 7287 7075 -9483 -6030
867 -6030 9770 2363 -12257 -1632 10737 -2613 -11524 3538 9442 -6701 -8638 8057 6474
880 6474 -9216 -3946 10796 2827 -9615 1116 10957 -1676 -8796 5341 9026 -5316 -6279 7375
894 7375 5335 -7803 -3765 7853 1564 -8943 -1097 6852 -1688 -7995 1249 6194 -3830 -6983
908 -6983 3504 4929 -4727 -4699 5586 4354 -5469 -2665 6995 3073 -5902 -281 7841 989 -6596
923 -6596 1480 8034 -1741 -7205 3815 6907 -5397 -6816 6077 5045 -8857 -5183 8378 1267
$$ packed form
826A482N667q664m608R452K583j0214j499J0516q06j0815K390J0620m427j0385
840h708O744R779q952p941J0748O543j2233l485J3680J340j4602K198J4672n155
854D628j3490Q219J2041j1249j0069J3420O948j5552l651J6042k12j6558L453
867f030J5800p407j4620J0625J2369j3350q911J5062N904j6143j937J6695j583
880F474j5690N270J4742p969j2442J0731R841j2633p120J4137L685j4342r63J3654
894G375k040j3138M038J1618o289j0507P846P949q540o307R244M945j0024l153
908f983J0487J425r656K8J0285j232r823K804R660l922q975N621Q122o852p585
923f596Q076O554r775n464J1020L092j2304j419J2893j032j3902L674J3561p111
$$ plain form
937 1267 -10665 -891 9701 -2727 -10548 3917 9685 -6775 -8036 9372 6899 -9673 -3612
950 -3612 12178 2388 -11204 1889 12818 -3117 -10485 6858 9823 -8081 -7748 10015 5174
963 5174 -12022 -3555 11164 -733 -12358 1754 10183 -5497 -10396 6479 7555 -8929 -5730
976 -5730 9923 3524 -9503 -839 10650 -123 -8339 3615 9114 -3757 -6488 5980 6093 -5917
990 -5917 -4147 6991 2817 -7347 -1731 6834 -345 -7474 152 5962 -2798 -6908 2302 4791 -4298
1005 -4298 -5559 4046 4016 -4958 -3480 6255 3182 -6134 -1202 7347 1666 -6348 1009 8424 -1250
1020 -1250 -7415 3473 7624 -4677 -6688 6189 5198 -8168 -4649 8470 1784 -10486 -1229 9345
1034 9345 -2134 -10311 3220 9402 -6074 -8862 7548 6929 -9105 -4587 11225 3770 -10808
$$ packed form
937A267j1932R774J0592j2428p821J4465N768j6460j261J7408k473j6572O061
950c612J5790r790j3592J3093J0929j5935p368J7343K965j7904L33J7763m841
963E174j7196Q467J4719j1897j1625J4112Q429j5680m899J6875J076j6484L199
976e730J5653o399j3027Q664J1489j0773q216J1954N499j2871k731J2468J13j2010
990e917J770J1138m174j0164N616Q565p179p129P626N810q760m110R210K489r089
1005d298j261R605l0q974J478R735l073r316M932Q549n681q014P357P415r674
1020a250o165J0888M151j2301k011J2877r91j3366L519J3119o686j2270R257J0574
1034I345j1479q177J3531O182j5476k788J6410o19j6034M518J5812p455j4578
$$ plain form
1047 -10808 -13 12404 -1396 -10231 5495 10678 -6568 -8297 8889 6654 -10362 -4275 10781
1060 10781 1008 -11763 158 10015 -3777 -10629 4323 8060 -7669 -7756 7809 5031 -9084
1073 -9084 -3365 9450 1390 -9071 1335 9594 -1870 -7325 4863 7365 -4300 -4868 6652
1086 6652 4629 -6246 -2437 6312 1338 -6403 -721 5646 -660 -6762 425 4810 -2643 -5743 2004
1101 2004 4364 -3675 -4789 3913 3774 -4610 -2706 5608 2811 -4942 -709 6586 1160 -5384 1199
1116 1199 6657 -1480 -5712 3262 5986 -4059 -5130 5159 3773 -7153 -3192 7046 708 -8750
1130 -8750 -97 7337 -3052 -8200 4102 6427 -6359 -5459 7167 3870 -7912 -1237 9313 425
1144 425 -8416 2824 8752 -3286 -6556 6308 6382 -6702 -4299 8206 2354 -8877 -539 8170
$$ packed form
1047a0808J0795J2417j3800q835J5726N183j7246j729J7186k235j7016O087J5056
1060A0781r773j2771J1921R857j3792o852J4952L737j5729q7J5565k778j4115
1073i084N719J2815q060j0461J0406Q259j1464n455J2188K502j1665n68J1520
1086F652k023j0875L809Q749m974p741N682O367o306o102P187M385p453l100P747
1101B004K360q039j114Q702j39q384J904Q314k797p753M233P295n426o544O583
1116A199N458q137m232Q974K724j0045j071J0289j386j0926L961J0238o338r458
1130h750Q653P434j0389n148J2302K325j2786R00J2626l297j1782O675J0550q888
1144D25q841J1240N928j2038l270J2864P4j3084K403J2505n852j1231Q338Q709
$$ plain form
1158 8170 -2168 -8982 2792 6872 -5722 -6854 5826 4013 -7791 -3153 7353 1040 -7665
1171 -7665 522 7579 -1930 -5926 3833 6250 -3486 -4019 5823 4550 -5112 -1925 6153 1623 -5754
1186 -5754 -287 5672 -758 -6016 1020 4708 -2874 -5345 2304 3495 -3902 -4004 3326 2524 -4770
1201 -4770 -2450 4880 1961 -4988 -439 5465 991 -5269 1597 6448 -1384 -4783 3760 5354 -3811
1216 -3811 -4311 5334 3664 -6200 -2702 6194 723 -7433 -451 6501 -2113 -7364 2319 5438 -4843
1231 -4843 -5494 5276 4062 -6628 -2579 7254 1376 -6982 875 7570 -1194 -6201 3827 6712
1245 6712 -3876 -4424 5967 3952 -5738 -2279 6459 570 -6517 102 5834 -2078 -6223 2222 4158
1260 4158 -4513 -4367 3837 2401 -5370 -1940 5126 537 -4861 414 5043 -962 -3872 2533 4582
$$ packed form
1158H170j0338o814J1774M080j2594j132J2680j813j1804M638J0506o313q705
1171g665Q187P057r509l996R759K417r736n33R842j273r662L187Q078m530p377
1186e754N467N959o430n258P036L688p582k471P649J191p397j02P330q02p294
1201d770K320P330k919o949M549N904m474o260O866M851p832l399Q543J594r165
1216c811n00R645j670r864L498Q896n471q156O982O952q614n251R683L119j0281
1231d843o51J0770j214j0690M049R833n878q358P857O695q764n007J0028K885
1245F712j0588n48J0391k015r690L459Q738n889p087O619N732p912m145Q445J936
1260D158q671J46Q204j436p771L430P066m589n398N275M629o005k910O405K049
$$ plain form
1275 4582 -2189 -2509 3883 3192 -2987 -1283 3714 1050 -3923 -422 3697 -752 -4162 867 2922
1290 2922 -2093 -3819 1655 2095 -3244 -2840 3042 1174 -3667 -942 3520 585 -3261 757 4120
1305 4120 -649 -2910 2348 3640 -1314 -2568 2962 2654 -3085 -1281 3760 752 -4122 -559 3840
1320 3840 -1169 -4397 998 3243 -2803 -3759 2562 2410 -3818 -2496 4118 1018 -4121 195 4607
1335 4607 -195 -3838 2102 4634 -1731 -3099 3792 3193 -3524 -1642 4657 1090 -4253 -5 4525
1350 4525 -1261 -4706 1526 3547 -3197 -3881 2579 2066 -4261 -2347 3796 548 -4457 -91 4181
1365 4181 -976 -3669 1882 3815 -1964 -2496 3380 2818 -2770 -1135 3759 1218 -3055 -81 3353
1380 3353 -283 -2992 874 2298 -1834 -2993 1320 1532 -2504 -1978 1666 784 -2445 -1088 1906 214
$$ packed form
1275D582o771l20O392o91o179J704M997k664m973L501M119m449l410N029K055
1290B922n015j726N474M40n339M04N882j868m841K725M462k935l846M018L363
1305D120m769k261N258J292m954j254N530l08n739J804N041l008m874L563M399
1320C840n009l228N395K245o046r56O321j52o228J322O614l100n139M316M412
1335D607m802l643N940K532o365j368O891n99o717J882O299l567n343M248M530
1350D525n786l445O232K021o744o84O460n13o327J914O143l248n005M366M272
1365D181n157k693N551J933n779n32N876n62n588J635M894k541m273K974L434
1380C353l636k709L866J424m132j159M313K12m036N26L644q82l229J357K994j692
$$ plain form
1396 214 -2356 50 2562 -20 -1635 1162 2601 -356 -1504 2079 2577 -1489 -1028 2267 1211 -2177
1412 -2177 -639 2489 243 -2778 -560 2219 -1010 -3183 533 1775 -1972 -2755 1463 1529 -2547 -1467
1428 -1467 2682 603 -2623 81 3278 -306 -2418 1636 3194 -1323 -1828 2680 1973 -2399 -994
1443 -994 2940 738 -2968 236 2702 -1234 -3121 1171 2055 -2532 -2211 2065 838 -3125 -848 2267
1459 2267 -284 -2441 601 2433 -885 -1659 1933 1666 -1211 -248 2417 1038 -1571 450 2478 34
1475 34 -1588 622 1462 -1030 -1484 623 877 -1790 -1167 813 -364 -1807 -602 692 -501 -1303 31
1492 31 890 -309 -786 604 1222 189 -247 995 1289 -322 -90 1377 1180 -431 -309 1042 684 -1304
1510 -1304 -277 1155 -105 -1689 -76 929 -876 -1760 34 851 -1282 -1478 759 706 -1398 -792
$$ packed form
1396B14k570K406K512k582j615K797J439k957j148L583M98m066M61L295j056l388
1412b177J538L128k246l021K218K779l229k173L716J242l747p83M218O6m076J080
1428a467M149k079l226K704L197l584k112M054J558m517n05M508p07m372J405
1443i94L934k202l706L204K466l936j887M292Q84m587L21M276j227l963K277L115
1459B267k551k157L042J832l318p74L592k67k877R63K665j379k609K021K028k444
1475C4j622K210Q40k492m54K107K54k667O23J980j177j443J205J294j193q02J334
1492C1Q59j199m77J390O18j033m36J242K94j611K32J467j97j611J22J351l58j988
1510a304J027J432j260j584J613J005j805q84J794Q17k133j96K237n3k104O06
$$ plain form
1526 -792 1399 492 -1427 312 2008 -63 -1080 1411 2011 -999 -810 1894 1137 -1385 -3 1922
1542 1922 -525 -1851 466 1055 -1152 -1656 648 523 -1991 -1006 1159 217 -1653 -204 1259 -328
1558 -328 -1529 707 1503 -909 -430 1264 1054 -543 90 1763 633 -640 365 1127 -74 -552 326
1575 326 627 -543 -874 196 -231 -477 -506 40 -58 -813 -684 211 25 -525 -187 227 241 -353 -66 472
1595 472 591 185 370 914 780 206 123 994 346 -623 366 561 -730 -458 437 247 -867 -868 437 -435
1615 -435 -1313 140 288 -714 -1174 407 661 -627 -257 1078 373 -782 618 1144 328 -453 962
1632 962 1361 -267 -230 1095 653 -798 -316 636 -146 -1082 167 504 -1192 -1213 -30 85 -1089 -469
1650 -469 347 -486 -799 -103 383 -420 -320 350 666 154 87 526 454 98 422 656 235 107 280 144 196
$$ packed form
1526g92K191r07j919J739J696k071j017K491O00l010J89K704p57k522J382J925
1542A922k447j326K317N89k207n04K304j25k514R85K165r42j870J449J463j587
1558c28j201K236P96k412M79J694k10j597O33J673j130j273J005P62j201m78Q78
1575C26L01j170l31J070m27k46k9N46r8p55J29Q95j86n50L38M14J4n94K87N38
1595D72J19m06J85N44j34n74q3Q71o48r69R89J95j291K72Q95j90j114jJ305q72
1615d35q78J453J48j002m60J581K54j288L70J335p05j155J400N26q16p81J415
1632I62L99j628L7J325m42j451M82R52p82r36J249L37j696k1J183J15j174O20
1650d69Q16q33l13O96M86q03J00O70L16n12o7M39p2l56L24K34m21j28J73j36N2
$$ plain form
1671 196 7 -197 -133 -300 -181 -509 -282 -49 -414 -770 -227 -233 -511 -499 -29 285 -448 -259 425 126 -287
1692 -287 570 843 70 -173 1000 490 -331 265 785 40 -725 118 673 -395 -956 296 328 -1078 -801
1711 -801 292 -147 -993 -518 655 -575 -1022 65 462 -447 -691 658 827 -351 -153 912 483 -320
1729 -320 536 970 435 -99 396 695 -377 -374 295 140 -654 -429 -155 -370 -834 -67 -62 -509 -723 100 -266
1750 -266 -324 -285 69 446 -48 -15 218 595 425 189 569 637 100 109 535 314 215 97 187 191 -563 -491 295 -208
1774 -208 -1076 -174 128 -730 -974 148 81 -793 -519 369 40 -602 223 886 405 -508 483 1122 -67 -185
1794 -185 1054 845 -197 67 855 259 -812 223 717 -496 -894 -13 115 -799 -791 123 -240 -979 -441
1813 -441 203 -289 -711 132 698 -29 -603 366 815 36 -22 1051 847 63 512 801 218 -291 230 579
$$ packed form
1671A96j89k04O4j67J19l28K27K33l65l56N43ok78J2M70L14p33J89O84k99m13
1692b87Q57K73p73k43J173n10q21N96N20p45p65Q43N55j068n61J252L2j406K77
1711h01J093m39q46M75J173j230m47J087L97r09k44J349J69j178J98J065m29q03
1729c20Q56M34n35n34M95K99j072LO69j55p94K25K74k15m64P67Nm47k14Q23l66
1750b66n8L9L54L77m94L3K33L77j70k36L80O8n37RM26k21r9j18R0Mp54P2P86n03
1774b08q68R02L02q58k44J122o7q74K74Q88l29o42Q25O63m81r13R91O39j189j18
1794a85J239k09j042K64P88n96j071J035M94j213l98Q81J28r14QR14l63p39N38
1813d41O44m92m22Q43N66p27n74R69M49p79n8J073k04p84M49K89n83n09N21L49
$$ plain form
1833 579 -363 -421 149 103 -372 -809 -186 173 -714 -577 195 -148 -721 -302 554 -388 -451 372 794 14 -143
1854 -143 628 775 257 -107 747 611 -140 -25 676 267 -438 -94 660 -119 -933 -245 459 -689 -932 -44
1874 -44 26 -777 -865 270 -23 -997 -314 548 -66 -524 240 947 165 -461 792 819 -137 -18 968 704 -459
1895 -459 150 807 -47 -828 92 556 -598 -570 187 363 -775 -735 457 -190 -889 -419 519 -80 -979 62
1915 62 1076 -173 -295 386 713 -310 -379 865 812 -362 195 1123 373 -513 131 414 -165 -559 -160
1934 -160 218 -616 -567 59 300 -673 -639 61 9 -687 -61 258 -102 -590 80 502 156 -395 543 886 -154
1955 -154 -124 613 554 -232 -37 514 -119 -530 -75 412 -373 -445 50 104 -538 -632 269 -261 -711 -375 400 -199
1977 -199 -488 164 649 -125 -583 512 708 -43 113 815 651 -83 -26 1028 342 -407 148 613 -225 -606
$$ packed form
1833E79r42n8N70m6m75m37O23L59q87J37P72l43n73M19Q56r42o3Q23M22p80j57
1854a43P71J47n18l64Q54j36p51J15P01m09p05L44P54p79q14O88P04j148k43Q88
1874d4P0q03q8J135k93r74O83Q62o14m58P64P07p82o26J253K7r56J19R86k64j163
1895d59O09O57q54p81R20M64j154K8P57J76j138M0J192o47o99M70R38n99q99J041
1915F2J014j249j22O81L27j023o9J244n3j174N57R28p50q86O44K83n79l94L99
1934a60L78q34M9O26K41r73L4P00n2o96O26L19l60m88O70M22l46n51R38L43j040
1955a54L0P37n9p86J95N51o33m11M55M87p85p2M95N4o42r4R01n30m50L36P75n99
1977a99k89O52M85p74m58J095J96p51J56P02j64p34N7J054o86p49N55M65q38l81
$$ plain form
1997 -606 26 453 -463 -803 210 119 -788 -416 308 -107 -758 -225 523 -82 -571 563 533 -279 -413 761
2017 761 732 -67 19 962 645 -170 -42 634 365 -574 214 568 -366 -663 -30 232 -650 -952 142 -20
2037 -20 -806 -341 534 -228 -753 -112 434 -392 -167 360 663 77 105 732 535 -156 20 889 472 -298 95
2058 95 527 -221 -478 228 426 -705 -742 72 -119 -791 -311 313 -115 -531 -158 53 8 -660 472 483 167
2079 167 -370 182 700 -87 37 744 358 -238 -24 593 119 -363 192 156 -167 -399 119 122 -593 -647 -83
2100 -83 -82 -715 -455 211 -79 -492 -152 281 -343 -545 332 612 -3 -231 642 515 -24 62 848 94 -355
2121 -355 267 589 -360 -647 423 146 -220 -855 468 170 -837 -616 8 -227 -641 -287 406 -314 -738
2140 -738 87 302 -229 -341 570 564 -49 -27 603 289 -383 396 768 -201 -115 413 345 -337 -402 290 20 -555
$$ packed form
1997f06O32M27r16l40J013r1r07L72P24m15o51N33P48o05m89J134l0q12j34J174
2017G61k9p99Q6R43l17q15J28O76k69r39P88L54r34k97O33K62q82l02J094j62
2037b0p86M65Q75p62n25O41N46q26K25N27L03n86K8O27j97o91J76Q69m17p70L93
2058I5M32p48k57P06J98j131l7Q14j91o72M80O24m28m16L73K11m5o68J132J1l16
2079A67n37N52N18p87J24P07l86n96K14O17m74m82N55l6l23k32N18Lp15n4N64
2100h3Jo33K60O66k90m13L40M33o24k02Q77K80o15k28Q73j27n39Q6P86p54m49
2121c55O22L22r49k87J070k77l66o35J323k98j007K21O24k35m14L54O93p20m24
2140g38Q25K15n31j12R11oo13K2O30l14o72P79L72r69Q6N28o8o82o5O92k70n75
$$ plain form
2162 -555 -305 -148 -227 -641 -32 324 -395 -660 -244 177 -402 -372 453 425 -288 -111 395 396 -14 381 500 301
2184 301 -79 154 434 144 -450 92 167 -395 -652 -95 42 -469 -591 68 -46 -837 -108 252 -94 -515
2204 -515 170 345 153 -394 606 487 -265 -171 768 292 -202 171 676 116 -357 123 433 -187 -738 138
2224 138 49 -670 -391 323 -381 -609 -305 236 -262 -326 -56 337 -128 -20 334 258 -72 25 468 531 -119 537
2246 537 388 -54 -101 339 481 -90 -416 344 200 -226 -275 100 -239 -484 -53 -29 -183 -494 -91 -163 -281
2267 -281 186 -196 143 -87 -143 304 369 -89 4 390 335 96 -27 481 379 -60 -38 308 41 -315 37 66
2289 66 12 -294 -98 -23 -255 -384 -115 -326 -419 -255 275 -130 -387 185 22 26 -344 332 363 -37 125 360
2311 360 429 -31 364 447 29 -5 77 344 -391 -439 179 -18 -298 -126 -56 -349 -617 -70 48 -338 -437 219
$$ packed form
2162e55K50J57p9m14O09L56p19k65M16M21n79L0Q25k8p13J77N06Jm10L95J19j99
2184C01l80K33K80k90n94N42P5n62k57N57J37n11j22O59j14p91P29L60l46m21
2204e15O85J75j92n47J000j19p52R4R39m76m94L73N05n60m73M80L10o20n51Q76
2224A38q9p19K79P14p04k28L04N41m98o4K70L93m65J08L54p6l30R7M43O3o50O56
2246E37j49m42m7M40J42n71l26P60j44m26m9L75l39k45M31K4j54l11M03p2j18
2267b81M67l82L39k30n6M47O5m58R3L86n5k39j23N08j02m39K2L46k67l56L52K9
2289F6n4l06J96P5k32j29K69k11r3J64N30m05k57N72j63Ml70O76L1m00J62K35
2311C60O9m60L95Q3m18l4Q2K67p35m8O18j97k80J72P0k93k68N47J18l86r9O56
$$ plain form
2333 219 58 -228 35 376 194 -101 137 499 260 -135 545 270 287 128 82 282 -97 -1 112 -43 32
2354 32 -37 -27 -188 -342 -254 -95 77 -299 -292 -3 -155 -243 -100 243 -53 96 193 285 154 218 246 370 178 154
2378 154 218 207 228 136 223 -380 -224 -159 193 -144 -370 -169 -213 -513 -527 54 -6 -411 0 52 -16 -61 344 290
2402 290 -50 -273 363 393 153 323 298 171 -110 221 353 -12 -141 175 341 -28 -143 -60 28 -146 -256
2423 -256 -212 -494 -199 71 -54 -190 -170 100 54 -20 131 151 249 162 103 220 347 224 433 165 -182 143 273
2446 273 127 111 47 -59 -3 -137 -441 -496 -196 -199 -158 -220 -158 -52 -4 -97 -295 9 187 279 210 38 244 219 413
2471 413 -51 185 441 265 200 30 183 23 -3 0 10 -46 -185 -264 52 -112 -118 -204 -288 -279 -22 -173 -308 -66
2495 -66 -65 -1 -96 320 110 -16 137 310 347 176 37 243 68 109 143 129 102 -108 91 171 100 -201 -156 -119 -370
$$ packed form
2333B19j61k86K63L41j82k95K38L62k39l95O80k75J7j59m6K00l79R6J13j55P5
2354C2o9J0j61j54Q8J59J72l76PK89j52q8J43L43k96J49R7R2j31O4K8J24j92k4
2378A54O4j1K1r2Q7o03J56O5L52l37k26K01m4l00j4N81o0m05M11N2o8m5M05n4
2402B90l40k23O36L0k40J70k5j27k81L31J32l65j29L16J66l69j15Q3Q8j74j10
2423b56M4k82K95K70j25j36K0K70m6p4J51K0R8q7n9J17J27j23K09k68l47L25J30
2446B73j46j6o4j06N6j34l04n5L00lM1o2O2J06M8r3j98L04J78R2o9j72K06k5J94
2471D13m64K36K56j76o5j70J53j60k6LJ0n6j39p9L16j64oq6q4RK57j51j35K42
2495f6JO4r5M16k10j26J53J73L7j71j39K06j75M1L4j4k7k10J99Q0p1l01M5L7k51
$$ plain form
2520 -370 -380 -128 -196 -172 -220 -171 -178 -188 169 72 46 239 95 265 213 171 83 280 100 158 122 363 170 -145 15
2545 15 -195 -105 -95 -151 -184 -134 -350 -49 -46 -251 -161 -313 -57 -211 -89 -143 -231 85 -68 303 14 149 279 88
2569 88 349 301 56 150 -93 122 -68 -91 -142 8 -104 -294 -207 -120 -459 -416 -216 -195 -185 -265 -218 109 -261 -49
2593 -49 419 56 -110 154 97 42 389 110 148 151 156 312 -49 32 267 79 2 -270 -401 -110 -443 -148 -192 -254
2617 -254 -161 -168 -90 -15 -526 -169 -149 -115 45 105 240 281 9 121 -10 61 179 350 286 322 160 284 330 10
2641 10 45 -16 102 19 -81 -71 -43 -328 -106 -258 -276 -83 -169 -293 -23 -168 98 103 81 230 499 183 247 121
2665 121 359 394 31 316 212 122 339 -201 226 -180 63 295 185 -180 -106 53 -99 -118 -118 132 -106 -130
2687 -130 -164 -67 -184 70 107 -13 -30 21 313 80 134 111 329 96 102 238 75 149 -47 69 -110 -18 -13 -84 -68
$$ packed form
2520c70j0K52o8K4m8M9pj0L57r7k6J93j44J70n2m2q8J97j80N8l6K41j93l15J60
2545A5k10R0J0n6l3N0k16L01Lk05R0j52K56j54J22n4q8L16j53L71k89J35J30j91
2569H8K61m8k45R4k43K15j90k3n1J50j12j90Q7Q7l39M3K00K1J0q0M7L27l70K12
2593d9M68l63j66K64n7n5L47k79L8LNJ56l61Q1K35j88p7k72j31K91l33K95m4o2
2617b54R3pP8P5n11L57K0L4J60O0J35M1k72J12j31P1J18J71o4L6j62J24M6l20
2641A0L5o1J18q3j00J0K8k85K22j52j8J93q6j24K70j45K66Nk2J49K69l16O4j26
2665A21K38L5l63K85j04r0K17n40M27m06K43K32j10l65P4J59j52j9%K50k38k4
2687a30l4R7j17K54L7j20j7N1K92k33N4k3K18k33OJ36j63P4j96J16j79R2Np1J6
$$ plain form
2712 -68 -140 -84 -72 -306 -244 -76 -90 -138 -212 13 5 -50 46 128 -8 152 66 274 226 183 102 250 336 187 276 46
2738 46 245 -224 12 23 -255 -29 -94 -26 -101 -528 -281 38 -148 -80 -182 -31 -14 -7 190 -2 -104 -16 187
2761 187 253 73 469 22 -16 153 256 314 -140 -35 103 -21 -130 -164 -201 47 -201 -162 -122 -191 -125 -376 -384 -93
2785 -93 -62 48 9 -47 326 62 231 96 128 -33 320 142 226 240 192 -72 32 169 19 191 -125 -36 -145
2808 -145 -257 -253 -189 -94 -181 -106 150 -39 -56 -167 -7 370 -138 64 62 -79 372 -8 185 97 199 25 118 79
2832 79 51 252 -115 11 -129 -173 -248 -93 -39 -180 -116 -342 -248 -216 -205 -184 -102 -247 135 -99 46 39 480 20
$$ packed form
2712f8p2N6J2k34O2J68j4m8p4K25qn5R6Q2j36J60q6K08m8m3q1J48Q6j49Q9k30
2738D6J99m69K36J1k78K26o5O8p5m27K47L19j86O8j02J51J7PJ97j92j02Q8K03
2761A87O6j80L96m47l8J69J03N8m54J05J38j24j09l4l7K48k48L9M0o9O6k51qK91
2785i3L1J10l9n6L73k64J69j35L2j61L53j78Q4J4m8k64J04J37j50J72l16Q9j09
2808a45j12MO4R5q7P5K56j89j7j11J60L77n08K02kj41M51l80J93q8J02j74R3l9
2832G9k8K01l67J26j40m4p5J55N4j41O4k26R4L2J1K1Q2j45L82k34J45pM41m60
$$ [...]
8191c7
##END NTUPLES=NMR FID
##END=
