##TITLE=1H_Pr AdAm
 CDCl3,8 sc, 
 5.04.2021
##JCAMPDX= 6.0         $$ Bruker NMR JCAMP-DX V2.0
##DATA TYPE= NMR FID
##DATA CLASS= NTUPLES
##ORIGIN= UXNMR, Bruker Analytische Messtechnik GmbH
##OWNER= root
$$ XWIN-NMR		Version 3.5
$$ Mon Apr  5 16:45:55 2021 Russian Standard Time (UT+4h)  she@DPX200
##.OBSERVE FREQUENCY= 200.131506
##.OBSERVE NUCLEUS= ^1H
##.DELAY= (6, 6)
##.ACQUISITION MODE= SIMULTANEOUS
##.ACQUISITION SCHEME= undefined
##.AVERAGES= 8
##.DIGITISER RES= 18
##SPECTROMETER/DATA SYSTEM= spect
##.PULSE SEQUENCE= zg30
##.SOLVENT NAME= CD3CN
##.SHIFT REFERENCE= (INTERNAL, CD3CN, 0, 15.7039)
##AUDIT TRAIL= $$ (NUMBER, WHEN, WHO, WHERE, WHAT)
$$ ##TITLE= Audit trail, XWIN-NMR		Version 3.5
$$ ##JCAMPDX= 5.01
$$ ##ORIGIN= Bruker BioSpin GmbH
$$ ##OWNER= she
$$ F:/spectra/data/she/nmr/H-F/1/audita.txt
$$ ##AUDIT TRAIL=  $$ (NUMBER, WHEN, WHO, WHERE, WHAT)
(   1,<2021-04-05 16:44:44.39 +0400>,<she>,<DPX200>,
      <created by zg, POWCHK disabled, PULCHK disabled
       configuration hash MD5:
       00 E9 B6 7A A2 85 ED C7 34 08 36 98 17 FE 4E 26
       data hash MD5: 16K
       CD 22 66 4F 51 3F F4 A3 BE ED A5 F4 19 2F 88 5C>)
$$ ##END=
$$ 
$$ hash MD5
$$ D0 62 FF 38 04 96 9C 2B CE 6F 01 68 F5 0F FC 32
##$RELAX= 
##$RELAX= 
##$RELAX= 
##$RELAX= 
##$RELAX= 
##$RELAX= 
$$ Bruker specific parameters
$$ --------------------------
##$DU= <F:/spectra>
##$EXPNO= 1
##$NAME= <H-F>
##$PROCNO= 1
##$TYPE= <nmr>
##$USER= <she>
##$AMP= (0..31)
100 100 100 100 100 100 100 100 100 100 100 100 100 100 100 100 100 100 
100 100 100 100 100 100 100 100 100 100 100 100 100 100 
##$AQSEQ= 0
##$AQ_mod= 1
##$AUNM= <au_zg>
##$AUTOPOS= <>
##$BF1= 200.13
##$BF2= 200.13
##$BF3= 200.13
##$BF4= 200.13
##$BF5= 200.13
##$BF6= 200.13
##$BF7= 200.13
##$BF8= 200.13
##$BYTORDA= 1
##$CFDGTYP= 0
##$CFRGTYP= 5
##$CHEMSTR= <none>
##$CNST= (0..31)
1 1 145 1 1 1 1 1 1 1 1 1 1 1 1 1 1 1 1 1 1 1 1 1 1 1 1 1 1 1 1 1 
##$CPDPRG= <>
##$CPDPRG1= <>
##$CPDPRG2= <>
##$CPDPRG3= <>
##$CPDPRG4= <mlev>
##$CPDPRG5= <mlev>
##$CPDPRG6= <mlev>
##$CPDPRG7= <mlev>
##$CPDPRG8= <mlev>
##$CPDPRGB= <>
##$CPDPRGT= <>
##$D= (0..31)
0 1.2 0 0 0 0 0 0 0 0.06 0 0.03 0 0 0 0 0.0002 0 0 0 0 0 0 0 0 0 0 0 0 
0 0 0 
##$DATE= 1617626683
##$DBL= (0..7)
120 120 120 120 120 120 120 120 
##$DBP= (0..7)
150 150 150 150 150 150 150 150 
##$DBP07= 0
##$DBPNAM0= <>
##$DBPNAM1= <>
##$DBPNAM2= <>
##$DBPNAM3= <>
##$DBPNAM4= <>
##$DBPNAM5= <>
##$DBPNAM6= <>
##$DBPNAM7= <>
##$DBPOAL= (0..7)
0.5 0.5 0.5 0.5 0.5 0.5 0.5 0.5 
##$DBPOFFS= (0..7)
0 0 0 0 0 0 0 0 
##$DE= 6
##$DECBNUC= <off>
##$DECIM= 32
##$DECNUC= <off>
##$DECSTAT= 4
##$DIGMOD= 1
##$DIGTYP= 9
##$DL= (0..7)
0 120 120 120 120 120 120 120 
##$DP= (0..7)
150 150 150 150 150 150 150 150 
##$DP07= 0
##$DPNAME0= <>
##$DPNAME1= <>
##$DPNAME2= <>
##$DPNAME3= <>
##$DPNAME4= <>
##$DPNAME5= <>
##$DPNAME6= <>
##$DPNAME7= <>
##$DPOAL= (0..7)
0.5 0.5 0.5 0.5 0.5 0.5 0.5 0.5 
##$DPOFFS= (0..7)
0 0 0 0 0 0 0 0 
##$DQDMODE= 0
##$DR= 18
##$DS= 0
##$DSLIST= <SSSSSSSSSSSSSSS>
$$ [...]
##$SUBNAM2= <"">
##$SUBNAM3= <"">
##$SUBNAM4= <"">
##$SUBNAM5= <"">
##$SUBNAM6= <"">
##$SUBNAM7= <"">
##$SUBNAM8= <"">
##$SUBNAM9= <"">
##$SW= 16.9725357007746
##$SWIBOX= (0..15)
0 0 2 0 0 0 0 0 0 0 0 0 0 0 0 0 
##$SW_h= 3396.73913043478
##$TD= 16384
##$TD0= 1
##$TE= 0
##$TE2= 300
##$TE3= 300
##$TEG= 300
##$TL= (0..7)
0 120 120 120 120 120 120 120 
##$TP= (0..7)
150 150 150 150 150 150 150 150 
##$TP07= 0
##$TPNAME0= <>
##$TPNAME1= <>
##$TPNAME2= <>
##$TPNAME3= <>
##$TPNAME4= <>
##$TPNAME5= <>
##$TPNAME6= <>
##$TPNAME7= <>
##$TPOAL= (0..7)
0.5 0.5 0.5 0.5 0.5 0.5 0.5 0.5 
##$TPOFFS= (0..7)
0 0 0 0 0 0 0 0 
##$TUNHIN= 0
##$TUNHOUT= 0
##$TUNXOUT= 0
##$USERA1= <user>
##$USERA2= <user>
##$USERA3= <user>
##$USERA4= <user>
##$USERA5= <user>
##$V9= 5
##$VALIST= <valist>
##$VCLIST= <CCCCCCCCCCCCCCC>
##$VD= 0
##$VDLIST= <DDDDDDDDDDDDDDD>
##$VPLIST= <PPPPPPPPPPPPPPP>
##$VTLIST= <TTTTTTTTTTTTTTT>
##$WBST= 1024
##$WBSW= 4
##$XGAIN= (0..3)
0 0 0 0 
##$XL= 0
##$YL= 0
##$YMAX_a= 169010
##$YMIN_a= -195381
##$ZGOPTNS= <>
##$ZL1= 120
##$ZL2= 120
##$ZL3= 120
##$ZL4= 120
##$ABSF1= 10
##$ABSF2= 0
##$ABSG= 5
##$ABSL= 3
##$ALPHA= 0
##$AQORDER= 0
##$ASSFAC= 0
##$ASSFACI= 0
##$ASSFACX= 0
##$ASSWID= 0
##$AUNMP= <proc_1d>
##$AZFE= 0.1
##$AZFW= 0.1
##$BCFW= 1
##$BC_mod= 2
##$BYTORDP= 1
##$COROFFS= 0
##$CY= 11.3945322036743
##$DATMOD= 1
##$DC= 2
##$DFILT= <>
##$DTYPP= 0
##$F1P= 15.9154993809931
##$F2P= -4.1035820241983
##$FCOR= 0.5
##$FTSIZE= 0
##$FT_mod= 4
##$GAMMA= 1
##$GB= 0.15
##$INTBC= 1
##$INTSCL= 1
##$ISEN= 128
##$LB= 0.24
##$LEV0= 0
##$LPBIN= 0
##$MAXI= 10000
##$MC2= 0
##$MEAN= 0
##$ME_mod= 0
##$MI= 1.114404
##$NCOEF= 0
##$NC_proc= 0
##$NLEV= 6
##$NOISF1= 3.799351
##$NOISF2= 2.8
##$NSP= 1
##$NTH_PI= 0
##$NZP= 0
##$OFFSET= 15.70392
##$PC= 1
##$PHC0= -10919.6
##$PHC1= 13.40092
##$PH_mod= 1
##$PKNL= yes
##$PPARMOD= 0
##$PSCAL= 0
##$PSIGN= 0
##$REVERSE= no
##$SF= 200.130013532006
##$SI= 16384
##$SIGF1= 3
##$SIGF2= 2
##$SINO= 400
##$SIOLD= 16384
##$SREGLST= <1H.CDCl3>
##$SSB= 0
##$STSI= 0
##$STSR= 0
##$SW_p= 3612.71676300578
##$SYMM= 0
##$S_DEV= 0
##$TDeff= 0
##$TDoff= 0
##$TI= <>
##$TILT= no
##$TM1= 0
##$TM2= 0
##$TOPLEV= 0
##$USERP1= <user>
##$USERP2= <user>
##$USERP3= <user>
##$USERP4= <user>
##$USERP5= <user>
##$WDW= 1
##$XDIM= 8192
##$YMAX_p= 0
##$YMIN_p= 0
$$ End of Bruker specific parameters
$$ ---------------------------------
##NTUPLES= NMR FID
##VAR_NAME=  TIME,          FID/REAL,        FID/IMAG
##SYMBOL=    X,             R,               I
##VAR_TYPE=  INDEPENDENT,   DEPENDENT,       DEPENDENT
##VAR_FORM=  AFFN,          ASDF,            ASDF
##VAR_DIM=   8192,          8192,            8192
##UNITS=     SECONDS,       ARBITRARY UNITS, ARBITRARY UNITS
##FACTOR=    0.0002944,     1,               1
##FIRST=     0,             0,               0
##LAST=      2.4114304,     0,               0
##MIN=       0,             -195381,         0
##MAX=       2.4114304,     169010,          0
$$ Real data points
##PAGE= N=1
##DATA TABLE= (X++(R..R)), XYDATA
0@%%%%%%%%%%%%%%%qJ6j6J6j6K0k8L2l4M2m8N6o4P2q5R6j09J23j39J57j75J94
37A02k18K44k71L02l34L69m08M50m96N45o00O61p28Q02q82R73j077J192j323J474
57G77j649J857k105K407k788L280l938M863o254Q552j2919K3732r1396r8097L42688
72A69010j65691j49938K59292j04263j22866J84423p6222m8581J24568j21835
82e2103r490J61152j41012l8177J77717j17430p6236J70512o1691q1547J08494
93D0189l8288m1480P3119m2881l040M8346o7682J4741O2329n3399o393K8548j8752
106d643P568n50M024J2747m4978J5870N2207n1259j0986M7837l8164p022M8685
119C1336l5721j4083M1243l5292l372N1682m7261j4931N8775m1388j5378N5551
$$ plain form
0 0 0 0 0 0 0 0 0 0 0 0 0 0 0 0 0 -8 8 -8 8 -8 12 -16 16 -18 24 -24 32 -32 40 -45 51 -58 65 -74 83 -92 102
37 102 -116 128 -143 159 -175 194 -214 236 -260 285 -315 346 -382 420 -462 511 -566 626 -697 777
57 777 -872 985 -1120 1287 -1501 1779 -2159 2704 -3550 5002 -7917 15815 -75581 -173678 169010
72 169010 3319 -146619 112673 8410 -114456 69967 -6255 -54836 69732 -52103
82 -52103 -61593 99559 -41453 -79630 98087 -19343 -95579 74933 13242 -68305 40189
93 40189 1901 -39579 33540 -9341 -12381 35965 -31717 -16976 45353 -8046 -14439 14109 -4643
106 -4643 2925 2375 6399 19146 -25832 -9962 42245 -9014 -20000 27837 -10327 -17349 31336
119 31336 -4385 -18468 22775 -12517 -15889 35793 -11468 -26399 32376 -9012 -24390 31161
131C1161l5399j3845L5210l0341J1463K5487m3200J6833K1584m0297K4528K2634
143B5818m2040P141K1253j4909P105J099j4587J1274J067r225J6324m948k3762
156a8390J9954J2218k3648P620R717j7204N585P540n265K832q542J610J1394j3179
170g758L768J2009j7999J07J5442o367m012M241j30n462R61J5770p933j8434K0580
185D783M969k2652J8311J0726l0554Q712K5209j9947o155J8866j1721o123J6680
198A1104p159l980P811j2622O579J3385k0995M493J6541k3420L470K1620j9254
211b427m305J4857j1796J52J2392j2012k609J0643r833j100J5792j1432j2798
224a4476J8564L50j6046J2880M975j8243O505J3209j1049k425P967n914r82Q600
$$ plain form
131 31161 -4238 -18083 17127 -13214 -1751 23736 -19464 -2631 18953 -21344 3184 25818
143 25818 -16222 -9081 12172 -2737 4368 5467 -9120 2154 3221 -6004 10320 5372 -18390
156 -18390 1564 13782 -9866 -2246 7471 -9733 -4148 3392 -1873 959 -7583 -5973 5421 -7758
170 -7758 -3990 8019 -9980 -9873 5569 -798 -4810 -569 -699 -6161 -5200 10570 2637 -15797 4783
185 4783 9752 -12900 5411 16137 -14417 -5705 19504 -443 -6598 12268 547 -5576 11104
198 11104 3945 -35 7776 -4846 1733 15118 -5877 -1384 15157 -8263 -4793 16827 -2427
211 -2427 -6732 8125 -3671 -3519 8873 -3139 -5748 4895 -4938 -6038 9754 -1678 -14476
224 -14476 4088 4438 -11608 1272 6247 -11996 -5491 7718 -3331 -5756 2211 -3703 -4685 3915
238C915n014k695O753p300j15J3148r986o644J5071p855p158J7284p134j1514
252i244J4317k993p986J2986n044j0005J2390j760q063J1194k996j1389J1546
265B953K663j1225P968K449j1941P348P263j1179K859O301r989L283R076r393
279a564j196Q344p466k52J0206q077m200R996n348l693J1005o520o889J1202l791
294A757n638J0523n545p556J1613l555o731J0964n733q155J2750k859r093J1129
308C871l084j0287J2031O42j1036Q083J526j0113Q120L845j0194M596L598p839
322f241N378M269q876L281M766p333L820N867q956N97Q541o814j154R349p180
337f86m329J1197m266n907J0712n057p516J3281l561r842J3446l387j2432J5623
$$ plain form
238 3915 -1099 -3794 2959 -4341 -4456 8692 -1294 -7938 7133 -722 -7880 9404 2270 -9244
252 -9244 5073 2080 -5906 7080 2036 -7969 4421 2661 -5402 5792 2796 -8593 2953
265 2953 5616 -5609 2359 4808 -7133 215 7478 -3701 -842 5459 -4530 -1247 7829 -1564
279 -1564 -2760 5584 -1882 -2134 8072 -5 -4205 5791 443 -3250 7755 1235 -5654 5548 1757
294 1757 -3881 6642 1097 -6459 5154 1599 -5132 5832 99 -8056 4694 1835 -7258 3871
308 3871 787 -9500 2531 3173 -7863 220 1746 -8367 -247 3598 -6596 -2000 1598 -6241
322 -6241 -863 3406 -5470 -2189 2577 -4756 -936 4931 -4025 -3428 5113 -1701 -2855 6494 -686
337 -686 -5015 6182 1916 -3991 6721 1664 -5852 7429 3868 -5974 7472 4085 -8347 7276
351G276l8j5589J3418J685j5407J3284L229j6282J1984K304j5239J4853J413j8271
365a1380J5360L218j9057J5680M826k0731J2938P325j7974J0762O286j7235J0232
378B50O853j6510J0145O952j7853Q981R789j6586O148R213j4466M782Q261j0992
392e033M445M790j0868O146O443j1301L004P796r530q4R960o416m717P527j664
407D98k866M010k885j36L741n277J922N921p616q72Q399l952n108O507J666o404
423b452J084N320k791k048K588p65K71k22j082M120k800m960P536P52p128L573
439I96K051l789J535J496j689j025N02P47J64m31j976O07L009l196j331L901k524
456i53j005K220k058J082L33k253K405m67k439K378J051j088k796R78N950m635
$$ plain form
351 7276 7238 -8351 5067 6752 -8655 4629 7858 -8424 3560 5864 -9375 5478 6891 -11380
365 -11380 3980 7198 -11859 3821 8647 -12084 854 8179 -9795 967 7253 -9982 250
378 250 7103 -9407 738 7690 -10163 -1182 8607 -7979 -1831 7382 -7084 -2302 5959 -5033
392 -5033 -588 4202 -6666 -520 5923 -5378 -2374 5422 -4108 -4192 5768 -648 -5365 2162 498
407 498 -2368 1642 -1243 -1379 2362 -2915 -993 4928 -2688 -3560 4839 887 -4221 2286 3952 -2452
423 -2452 -1368 3952 1161 -887 1701 936 1207 985 -97 4023 1223 -3737 3799 4551 -2577 996
439 996 3047 -742 793 2289 600 -425 77 824 988 557 -1419 -812 2197 -999 -2330 1571 -953
456 -953 -1958 262 -1796 -714 -381 -2634 -229 -696 -3135 -757 294 -794 -3590 -2612 3338 -1297
472a297m061P460j489n333N465K018n134j361M997K542n981j061N881n19m113
487a986Q09M979k274o763P864M575j2832L227J0690q562l675O707L70l230j064
502a165L042O74m411J821L892l076l498K281N627m281n823P596N49o745N141J267
518B891n589K080K355m81j756j430K835n1j061L19k018K489J016m066K629R65
534A127l413K353N96j481l79o26L653j184n000L844K491l042r76Q77K088k420
550a492j320N851l638n031O864J697n247p40L338J733m043K70M560m103j181M795
566B313j313j690p87J695M043n448k140P794k454n243N059J699m922K57N683k475
582B071n986N875K579n779J603J255j595K058j936K38J853m275K447L511n401
$$ plain form
472 -1297 -5358 2102 613 -4720 745 2763 -2371 -3732 1265 3807 -2174 -3235 2646 2127 -1986
487 -1986 -1177 3802 1528 -5235 2629 7204 -5628 -2401 8289 -273 -3948 2759 3129 -101 -1165
502 -1165 1877 2551 -1860 -39 3853 777 -2721 -440 5187 906 -4917 2679 3228 -3517 1624 2891
518 2891 -2698 -618 1737 1256 -500 -1930 905 854 -207 112 -1906 583 1599 -2467 162 1127
534 1127 -2286 67 663 -818 -1197 -1823 1830 646 -4354 -510 1981 -1061 -2037 -1160 928 -1492
550 -1492 -2812 3039 -599 -5630 1234 2931 -2316 -3056 282 2015 -2028 -1758 2802 -1301 -2482 2313
566 2313 1000 -690 -1477 218 4261 -1187 -3327 4467 2013 -3230 1829 3528 -1394 -1137 4546 2071
582 2071 -3915 1960 4539 -1240 363 1618 23 2081 145 383 2236 -2039 408 3919 -1482
597a482l80L619j039j528O29P12j773L91K650l308m35L175k538K74J613k769J334
614h55J357j788M98m82M45J267j723K15L61p7J201j643L69J130k315K366J406
631A732m369J688K671k315n6J152o34m26R93O60j748L27J384j273R54Qj926K703
649A525l81k400K783p26j410K347j291p69J750j122Q7R33j362j96J644p5j954
666f17Q25J516k122N11J870k722K69K156j839J61O16j259J076L3j053O06m8l08
684c29K08j54K2l73J84K72p27L79K8k77O51q63l52J629j137o79J588p58p78J287
704a79J37j143K65J085n61m84R36m49k88R95n08JO47r05O49O72j166N24P70j005
724gL20P50p15R1M12k29j29L80k75q7M91n55p0Q93p80m20R86n74n08R85m80o08
$$ plain form
597 -1482 -1862 1757 718 -810 -181 531 -1242 -851 1799 -1509 -1944 1231 -1307 -1033 580 -2189 -855
614 -855 502 -1286 -788 -1270 -825 442 -1281 -1066 -705 -782 419 -1224 -855 275 -2040 326 1732
631 1732 -2637 -949 1722 -593 -649 503 -131 -557 436 1096 -652 -325 1059 -214 740 748 -1178 1525
649 1525 1144 -1256 1527 801 -609 1738 447 -322 1428 306 393 1326 -36 -232 1412 1337 -617
666 -617 208 1724 -398 113 1983 -739 -470 1686 -153 8 624 -635 441 474 -579 27 -21 -329
684 -329 -121 -275 -253 -626 -442 -170 -897 -518 -490 -767 -116 -979 -1331 298 -839 -1518 70 -688 -1466 -179
704 -179 -42 -1185 -920 165 -396 -880 56 -393 -681 314 -194 -193 454 -451 198 870 -296 228 998 -7
724 -7 313 1063 348 439 851 622 493 873 598 511 1002 447 377 1270 490 70 1056 482 -26 959 479 -129
746a29O06j36l88L22j90j85K65k77p0K72l08l24M43j7n42L31Q2l35PK46l0k25
768e82o5L02m4m41N16J2n57M83K40n59J93L18m38K29K27l15K06M8j59L26K3m58
790d95O03L6o76Q76J69j159R27M96j433R36P56j502O71Q68j177M03Q11j284P11
809E37N67j251Q06N77j555P00J208j754L04J369j598J39J231j406K83J004j730
826e69O80J170k134O13J547k037j5J836j444o73J457p01n86J032n58n59J172r98
844g67m21J823j409j024K464r42j568K106l47j498J453M3q29O98j39l12P63l45
862b51o27J116J53j410J034R10j768P73J064j475N31P77r30O82j56p40J248j67
880G64r43P47K02m22qM05j18o00N07L47n53M1k32L34N89j382L83J131j449J19
$$ plain form
746 -129 477 341 -47 275 85 -100 165 -112 -182 90 -218 -542 -99 -116 -658 -327 -245 -580 -573 -327 -357 -582
768 -582 -647 -345 -389 -830 -314 -302 -859 -376 -136 -695 -502 -184 -622 -393 -166 -481 -275 -227 -386 -60 -37 -495
790 -495 108 144 -532 344 513 -646 281 777 -656 280 1036 -466 205 1073 -104 299 1110 -174 537
809 537 1104 -147 659 1236 -319 381 1589 -165 139 1508 -90 49 1280 -126 157 1161 -569
826 -569 111 1281 -853 -240 1307 -730 -745 1091 -353 -1026 431 -270 -856 176 -382 -941 231 -767
844 -767 -1188 635 -774 -1798 666 -276 -1844 262 -85 -1583 -130 -87 -916 -218 -357 -669 94 -251
862 -251 -878 238 391 -1019 15 925 -843 -70 994 -481 50 827 -103 579 423 -317 931 764
880 764 -179 568 770 348 340 745 627 27 534 881 328 369 137 471 1060 -322 61 1192 -257 -138
900a38J066r17k65L79K87j20j096P49P66j087j69L81K89k58q08J239m6k076K005
919A81P94k586Q22J219r21j34J73K0k9n2K58j53L2l36J09J551j809q79L189j659
939b10j504K890j493j006K628j416q77J689p90j29J104q55q54J548O13k147R30
956A21J305k232J519J069l121J955J019k699K532k57l016L226M26l037J545Q68
972A223j498N64P75j135l86J296n52l81P35j700J097J863l537O82K877l381Q04
989f54K220l205P62J743j578N65n22n46J846o85j309R96M29p85O3J186j421p29
1007a624K791j195j493J903r27Q2J391j992O09J225j640J308l6j541J492J91m61
1024H3m5n18J032n4n82O88j013N54J137j399K50M83p03Q97j13p69K22J16Q22p55
$$ plain form
900 -138 928 11 -254 125 412 292 -804 -55 711 -376 -545 -164 125 -133 -941 298 252 -1824 181
919 181 975 -1611 -789 430 -491 -625 -452 -432 -461 -513 -255 -408 -376 -712 -603 948 -861 -1740 1449 -210
939 -210 -1714 1176 -317 -1323 1305 -111 -988 701 -89 -218 886 31 -823 725 1338 -809 121
956 121 1426 -806 713 1782 -1339 616 1635 -1064 1468 1211 -1805 1421 1847 -1190 355 1223
972 1223 -275 289 1064 -71 -457 839 287 -94 641 -1059 38 1901 -1636 -954 1923 -1458 -654
989 -654 1566 -1639 -877 866 -712 -147 -669 -1215 631 -54 -1363 -367 62 -723 -660 526 -895 -1624
1007 -1624 1167 -28 -1521 382 -545 -463 928 -1064 -455 770 -870 438 402 -1139 353 544 83
1024 83 38 -480 552 498 -84 604 -409 145 1282 -117 133 616 -87 810 697 -72 150 266 1088 333
1044C33p26J183o60J70P87j745Q31P16j355J335n43j608K230k48j541R75k11j03
1062a80L96l56p2m49O11M98j145L40K3k36J051j040m54J234p80J85M48j034N29
1081d31L44k24K01q55P11N55j070Q78l49p26J677p36q34J367q74Q0J158j260j4
1100d02R91m78o3M09l59k90Q61J23j292R69M92j379J290o4j703J889o1j486J532
1119I79o29r16J824p98j079J419m87m99Q34l91o33O74L51r97K50N79j058O71N38
1138F32j641Q80P00j524Q99L03j299R66L73j249P35J73o39N08J93p33K05O15n35
1157d38k07Q38o97j73J168q96k89J154q94kR33j062K11R73j007J14P50o96L3P46
1177E59n53k58Q00l35m22P74k99n38J052m20o27R80l44n33Q96l83n30Q73l97k65
$$ plain form
1044 333 -393 790 130 300 1087 -658 173 889 -466 869 326 -1282 948 700 -841 134 -77 -180
1062 -180 216 -140 -212 -661 -50 448 -697 -357 -334 -570 481 -559 -1013 221 -559 -374 74 -960 -431
1081 -431 -87 -311 -110 -965 -254 301 -769 109 -240 -966 711 -25 -859 508 -366 -286 872 -388 -402
1100 -402 589 111 48 457 98 -192 669 792 -500 469 961 -418 872 808 -895 994 933 -553 979
1119 979 350 -566 1258 460 -619 800 313 -186 648 257 -376 298 649 -348 -98 481 -577 94 632
1138 632 -1009 -129 571 -953 -54 249 -1050 -84 289 -960 -225 -52 -691 -183 10 -723 -518 97 -438
1157 -438 -645 193 -504 -677 491 -405 -694 460 -434 -436 497 -565 -354 619 -388 -274 476 -220 -187 559
1177 559 6 -252 548 213 -209 565 266 -272 780 360 -267 713 369 -164 732 349 -181 692 295 30
1197C0N36k96j67L14j19l09K85L0l10J60J68m22P5K62m09J06K02k94rJ70j48j16
1219b61J93r9j94J55O8l18J74J87m81L13K13n23K74K31n75L33L37o20K95L79n96
1240e15K99L44n46K16M85o12J82M61n50J82M55n89O6O24n64M7N68n19kN53n23
1261F2o1O52n34p1O06n01j74O60l88k58N59k95k74N23k92k39M28j70k99M41k46
1282A29l22M79j35m28M76p0l73K23N2k75J52K8k14J68K5k96K10J25m70L17J93
1303fm42J25J83k99K06R6k33J94L8j78J61M6k00J31J87k06nL22k90j6K82j82J7
1326f9K66k60J10J83l52L05J22l50K63J07k58J34J5L4l8L0J27j49k9J25n5L2m5
1349B48j02J68j03q5J25j17M4lj5P0l15J17L05m88N4K69m42K85Q8m75K83J06k85
$$ plain form
1197 30 566 270 103 417 298 -11 274 304 -6 154 322 -100 -25 237 -172 -66 136 -158 -167 3 -145 -261
1219 -261 -68 -167 -361 -206 -138 -456 -282 -95 -576 -263 -50 -573 -299 -68 -643 -310 27 -593 -298 81 -515
1240 -515 -216 128 -418 -202 283 -329 -147 314 -236 -54 401 -188 -122 502 -62 -15 553 34 32 585 62
1261 62 1 653 119 48 654 153 -21 639 251 -7 552 257 -17 506 214 -25 403 233 -66 375 129
1282 129 -193 286 151 -277 199 129 -244 -21 31 -244 -92 -64 -278 -110 -85 -381 -171 -46 -516 -199 -6
1303 -6 -448 -323 -140 -439 -233 -137 -370 -176 -138 -316 -155 -109 -309 -178 9 -197 -202 120 -170 -186 96 -86 -69
1326 -69 197 -63 47 230 -122 183 305 -45 218 325 67 201 216 250 212 242 369 220 191 316 261 293 248
1349 248 146 314 211 126 251 134 178 175 160 230 -85 32 337 -151 -97 172 -270 15 103 -372 -89 17 -268
1372b68K35j34j67J55J28j25l23L55N1l80M55j63n16P54j32m89N85l13j56P27
1392B79n07j73L85J6j21l3J96j01r9N49l75l76P68m51O8M90q38L36O74q69K92
1413A10L32n55M08J52l09l4L9L73l08j34K18l10L71J48o95M34O1m37O29m00l33
1434b40O35k55j02Q2m34M55P9l86K10l44J97L76n32J19j2j48N30m25j80K90k54
1455c39M00j93m98N88k11L7L82p57L51L84n14M62l14k48P36l15j38J10k92N14
1475A45M8l83L05l22K71M21p26K04K30k10M80l73k26N19k88K33K7n63N66k9j65
1496A64K52o32M11M00o37L96k41k81P71m64k53L27l16L98Pn52L74j37N9K95o28
1517b87K30J32k46L67l87k56O47l80N2Q7n46N32P3l70K45k26J43L16m83J52m7
$$ plain form
1372 -268 -33 -167 -334 -179 -51 -176 -499 -144 -93 -473 -18 -181 -697 57 -75 -564 21 -292 -448 279
1392 279 -228 -401 -16 0 -121 -154 42 -59 -158 391 16 -360 408 -43 25 515 -323 13 687 -182 110
1413 110 442 -113 295 447 138 104 143 516 208 74 292 -18 353 501 -194 240 301 -136 493 93 -240
1434 -240 395 140 38 120 -314 141 220 -166 44 -300 -103 273 -259 -140 -152 -300 230 -195 -375 -85 -339
1455 -339 61 -132 -630 -42 -253 -216 166 -591 -240 144 -370 92 -222 -470 266 -49 -187 -77 -369 145
1475 145 193 -190 115 -207 64 485 -241 -37 193 -17 463 90 -136 383 95 328 355 -208 358 329 164
1496 164 416 -216 195 595 -42 354 113 -168 603 139 -114 213 -103 295 302 -250 124 -13 46 341 -287
1517 -287 -57 75 -171 196 -191 -447 200 -180 -128 -41 -587 -55 18 -352 -107 -333 -190 126 -357 -205 -252
1538b52j09N44l74j85L54k68L51k5m89M47l9n6K52m73K21L91m46K98q6k80N47
1559C23j51k11J88k00L15J05m23K48j07Q9K09l46J41%q0K92l31j40M42k98J31
1580A96O2m91M71J0k17K54l93O5L04l27R7k1j64L08j55j57J22j67K01k2k01J39
1602h6j28J13R3l38J70J29k23K35j74j98L78k21J6K20l27J32K15k42J07Rj7K14
1624G7j59J7j5L6J00l1m6P7j18J71J6j58J98k4n1J48j85j3K63k38J32Qj60J72
1648B17L6r0L9q9J1R3j02k0ol5P4p8O9n2k7P7j50K4J33j85L5Q0j73N5K9j15J21
1675b9Kj21J14n8q9KP5o8N1k3n5m5J18o9L8R4j40Q6R4j81Q9J0q7R8Q5j17P6O9
1703A9j54J30Q1q2M9P7j40N4J21p7J4R1j23j3J48j44J15N4j25M4R3j48nJ48j60
$$ plain form
1538 -252 -361 183 -191 -376 -22 -290 61 36 -453 -6 -45 -101 151 -322 -101 290 -156 142 56 -224 323
1559 323 172 -39 149 -51 264 369 -54 194 87 176 385 39 180 180 100 392 61 -79 363 65 196
1580 196 258 -233 238 248 31 285 -108 -43 261 -66 31 10 -154 154 -1 -158 -36 -203 -2 -24 -225 -86
1602 -86 -214 -101 -8 -346 -176 -47 -270 -35 -209 -407 -29 -250 -234 -14 -341 -209 6 -236 -129 -120 -137 77
1624 77 -82 -65 -80 -44 56 25 -21 56 -62 109 125 -33 165 141 90 238 53 40 303 65 197 205 45 217
1648 217 253 163 202 113 124 217 115 95 89 54 128 50 119 67 40 117 -33 -9 124 -61 -26 54 -119 -64 -35 -150 -29
1675 -29 -27 -148 -34 -92 -181 -179 -104 -172 -121 -144 -199 -244 -126 -195 -157 -63 -203 -117 -23 -204 -115 -105 -192 -94 -9 -126 -50 19
1703 19 -135 -5 76 -6 43 120 -20 34 155 78 92 183 60 47 195 51 166 220 95 139 232 84 79 227 67
1728F7J25k9q1J4M5p7j0N0m0m1N5l3l0k7K9k9N2k9j04N1MJ3o7n8Q0l6J1nj7J0
1758a07J9p1M3J9r1Q8k1l8RJ02j07O5J4r1L9L7Qj2P8r1N3J29j58J00M5q9J21L
1786I6j11J30N3p9P1j6p4J58j07nO0q4O1M6o6k3n3P5p9J34pj29Q8M9k07J19O0
1813A60k58K12nk28K26p2p5J01j05k3R7n9n0K3mJ8j23J37q3r6J70r3p5J18q9L0
1839a46N1q7O8k7K6J02j83N8J23j31J23m5l4K00j29p2K07j44N3J02j13LL1L0J12
1864A78r3m2Q5n9J79j18j62K80j17K7O9k46J46J06j39R4j32l1J77j40M8l7j80
1887a07K71n0j15J14k04J07J38k63O4Q7o6J31k36PJ11l5Q2j03j56K13m7p5J31
1910ak65J71J23k48J17l9l3K76k53l8J09j02K06n7k24K61j29J22Q4l58K70R3j58
$$ plain form
1728 67 192 163 82 96 141 64 54 104 64 23 78 45 15 -12 17 -12 40 11 -93 -42 -38 -25 -92 -150 -70 -106 -95 -100 -117 -107
1758 -107 -88 -159 -116 -97 -188 -100 -121 -159 -150 -48 -155 -90 -76 -167 -128 -91 -83 -95 -17 -108 -55 74 -84 16 61 -28 93 96
1786 96 -15 115 168 89 160 144 70 228 121 116 176 92 153 199 133 110 57 132 53 187 180 51 139 188 -19 100 160
1813 160 -98 114 109 -119 107 35 -40 61 -44 -67 30 -29 -79 -56 -60 -42 -165 -28 -111 -207 -37 -130 -205 -87 -176 -146
1839 -146 -95 -182 -114 -141 -115 -13 -196 -138 -15 -146 -23 -68 -102 98 -31 -103 104 -40 13 115 2 5 36 66 178
1864 178 85 43 128 69 248 130 -32 248 131 158 227 -19 127 233 94 188 56 25 202 62 110 73 -107
1887 -107 164 114 -1 113 -91 16 154 -109 -45 42 -24 107 -129 -122 -11 -46 36 -67 -223 -10 -57 -132 -1
1910 -1 -266 -95 28 -220 -103 -142 -175 101 -152 -190 -81 -183 23 -34 -258 3 -126 -4 80 -278 -8 85 -73
1933g3J93k15l1K88j52P8l1j25L46j71p3J30k35K19J68l16J48p6n6K66k49q3K47
1956A97q9J54j26k39K43n3K8P6l95L05N3k06J98j71p6L01k11q9R1j89K80p0j96
1979a84J15j73K01J01l02J21L3o1J95k30k5K50j38J25r0k25L29j37qJ05k66K04
2001f0J25j93J60j36m5K94j59n1J16j38K79j25k16K56o5J3J37k74J35R4p3J32
2023B06k06M3J27j23J24l8k36L50q7j46J86k44L9K45l00P1N7j07J56n7j17Q5j0
2046A8K8m7j49J15n7N6L8k37J79J4p4J59k10n0L23k53JJ01j66J52j3q7K6K0OJ58
2072E1k11N4PM9J18k02J6J57q4R3q1p4J60j9q5J73j69J10O7j42L0M0q0J61n3j1
2098G5Q5j50J27pj00O1j3OL3j24Q4M8j02Q0m8l6Q5j06L7pl7J8K3p0N6k8Lnp1M6
$$ plain form
1933 -73 120 -95 -126 162 10 88 57 -68 278 107 34 164 -71 148 316 0 148 72 16 282 33 -50 197
1956 197 108 262 136 -103 140 87 115 191 -204 101 154 -52 146 -25 -101 200 -11 -100 -9 -198 82 12 -184
1979 -184 -69 -242 -41 60 -242 -121 -88 -149 46 -184 -209 41 -97 28 -62 -287 42 -95 -103 2 -264 -60
2001 -60 65 -128 32 -104 -149 145 -14 -65 51 -87 192 67 -149 107 42 55 192 -82 53 147 74 206
2023 206 0 43 170 47 171 133 -103 247 160 14 200 -44 -5 240 -60 11 68 -39 117 60 -57 28 18
2046 18 46 -1 -150 -35 -92 -36 2 -235 -56 -42 -116 43 -167 -217 106 -147 -146 -45 -211 -59 -72 -159 -133 -113 -107 51
2072 51 -160 -106 -99 -50 68 -134 -118 39 -45 48 -33 -107 53 34 -51 122 -47 63 130 -12 18 58 -22 139 86 75
2098 75 160 10 137 130 30 91 78 84 117 -7 77 125 23 103 55 19 104 -2 35 28 -9 9 32 -38 18 -10 -7 -12 -83 -37
2128c7k5j4R6j60L6J4j2M5Ll2P1o8oK6k2j3Q2r5K3Pk7P5n5L8No6RJ08km0J7M9
2160C0o1j4J23n3Qnl8oQ3q4R0M0l1k1O4nnMl6J8j9j7M6J5l4k5j7M5l7N9q0k8O6
2193G5l3p2L6j2M1l4j5rl3j4M3n8PL6n4ok0k5N6K7o9L9L7o0O0m1J7K1mMl5O4N1
2226B0r9N8k5L7l5J8J9J8m1O8q0M7KK8o4P2m5R5k0n5M6L0m1PRK3Ln4O8o5qO6j2
2259I0P7j9r4J6L5j26J09j8k3P4j06%J6mk6L3q3l1L2J9k1jOmk9Q5q0K5J8o8O9
2290b9K6m7J1l4L1K4k3pm8Q5J0k5n5R4p9L3M2o0Q6k5KK4k5K5O7o6RJ7n8P0J1m9
2322C7j1LQ0j7j2L2m5k5P5p5L2j1J0Q8j61M8Pk6OK7o8N8l6j4K1o7L3R4j23O8n3
2353b5j09K06j41o9J00r9R3M7j63J62j74J28K1n6l2P5k4O5n8j18J83r4K9L8j52
$$ plain form
2128 -37 -62 -76 20 -140 -104 -90 -102 -57 -54 -86 -15 -83 -89 -63 -85 -98 -16 -111 -88 -81 -108 -33 -88 -50 -45 -111 -102 6 4 -36 -19 30
2160 30 -31 -45 78 25 33 28 -10 -16 67 -17 73 113 82 61 125 120 115 119 83 101 82 65 111 126 92 67 50 95 58 117 37 9 75
2193 75 42 -30 6 -6 35 1 -14 -23 -56 -70 -27 -85 -78 -42 -96 -102 -122 -147 -91 -64 -133 -94 -57 -117 -57 -98 -81 -60 -64 -60 -95 -31 20
2226 20 -79 -21 -46 -9 -44 -26 -7 11 -30 38 -42 5 7 35 -29 43 -2 93 73 18 64 94 53 60 69 92 95 41 109 44 36 102 90
2259 90 167 148 54 70 105 -21 88 70 47 121 15 15 31 27 1 34 -49 -80 -48 -29 -50 -51 -45 -49 -78 7 -73 -48 -30 -98 -29
2290 -29 -3 -50 -39 -73 -42 -18 -41 -48 -96 -11 -1 -26 -81 13 -66 -33 9 -51 35 10 12 36 11 36 103 37 46 63 5 75 86 37
2322 37 26 29 109 92 80 112 67 42 117 42 74 63 73 161 0 48 55 29 35 62 -6 52 16 2 23 -44 -11 83 -40 28 -25
2353 -25 -134 72 -69 -138 -38 -137 -44 3 -160 2 -172 -44 -23 -79 -111 -36 -60 5 -53 -171 12 -82 -53 -15 -167
2378a67K06M2j11O3j07M6O7l1J0m3m0J80j06k0R8j53J27O0j70R1lK5P0j01l8J53
2404A48j18O9jj60K34j06k2N3j35J59j7j06R7j53J09J13j97j4M2l9J44r8j24J43
2428B1m4L3m5j22Q4N9m6R6k42J00R4r4M6Rj64K74j62K9K7p5J52m4j31R6M1o6J37
2455F3j89R9R5r6J26j28q4J51L0l5K6j45J57J0p6J13j78R3J53k23Q9J6q2J55n9
2480H1p3J06r6R7J5j81J06k4j4J57j82O6N2r8P1o2j06K06j04J0L3j70J65K6j54
2505g3Q5p4K9Q3j28J5j4oQ8n3m6O9m7J2O6j39J11pp1Q0j34P4P3q5R0l4l9J41o3
2534Cq5J37j01J11J8j33R6rj1M9j11O7N4l6L5p0k0O6j5R7n4r8R6j9j7M4r4LR3
2563I6n8l1M1l4J02q2m7N0j9k9K5j5LOON6j36J18l9j6n7k7J3J00q7rO6j48J02
$$ plain form
2378 -167 39 81 -30 33 -74 -28 39 8 18 -25 -65 115 9 -11 87 -66 61 121 -49 42 39 64 134 33 -5 148
2404 148 30 99 98 -62 172 66 44 97 -38 121 104 -2 95 -58 51 164 -33 -47 -5 -44 100 2 -122 21
2428 21 -23 10 -35 -157 -73 -14 -60 36 -206 -106 -12 -106 -60 -51 -215 59 -103 -74 -47 -122 30 -14 -145 -49 -8 -74 63
2455 63 -126 -27 68 -28 98 -30 -114 37 67 32 58 -87 70 80 4 117 -61 32 185 -38 51 67 -15 140 81
2480 81 8 114 18 115 130 -51 55 31 17 174 -8 58 110 12 83 21 -85 121 17 27 60 -110 55 81 -73
2505 -73 12 -62 -33 50 -78 -63 -77 -83 5 -48 -94 -25 -72 -60 6 -133 -22 -29 -100 -20 -154 -80 -7 -92 -2 -36 -75 66 3
2534 3 -82 55 -46 65 83 -50 46 37 26 75 -36 31 85 49 84 14 -6 60 45 142 88 -10 86 67 50 94 0 3 96
2563 96 38 7 48 14 116 34 -13 37 18 -11 14 -1 2 8 14 70 -66 52 13 -3 -60 -87 -74 26 -61 -70 -4 -152 -50
2592e0m0j0P1n4k4J36j22O2J6m1K8n4J0K5j2K9L8n6OM3K5J2p1L6J3J8m8N7k9N5
2622F9Ko4Q4p1N3j7j3J3j4mrJ8p5K7M2k2L6ll7M0k3J1m4%J8l0O0m9l0O1k9M4l9
2655Eln0N7k5o2O2n8j1LJL2k1N0k8l9k0K5L9j9JN6o0j4PJ6M5L3k8J1j3K3ppn1
2689e0J13k4m4L1j0L6k8k0R1l8L8m9j9j4QP3Qr7M6M3o6L1J8m2K0l2l0OM0j9j7
2720CM2k8j1j6M3m5O3p5L2%k4K7k3l3K0l8L8ql6L2J8pL2n9pM2l4kqk5J4N8j2L4
2754Gkm7NNRl0P5m7J8lj3K8j7O0krl0lM9L4j3Ll6j6L8oPj2O1n9l7J6NJ1J7l2K8
2791F2M3n5l0L5l7m2K8l4J0jMP5o6L9j4j09P7O2p0j5K1n3P3r1N9j6N2m6m0J9O5
2822Ep4L6Nn5Q2l7m0N7j4K5K1n3K7J1Jpjj0Q2q0M7n8RO5k0J6N1j02J4Q2j13J03
$$ plain form
2592 -50 -90 -100 -29 -83 -107 29 -93 -31 -15 -56 -28 -82 -72 -47 -59 -30 8 -48 -42 1 26 38 -33 3 16 34 -14 43 14 69
2622 69 71 7 91 20 73 56 43 56 42 38 29 47 -28 -1 41 19 55 52 15 55 32 43 -1 -1 17 -13 47 -2 -32 29 0 44 5
2655 5 2 -48 9 -16 -78 -16 -74 -85 -82 -81 -49 -70 -20 -48 -87 -107 -82 -43 -62 -61 -5 -65 -79 -72 -56 -11 22 -6 5 -8 15 8 1 -50
2689 -50 63 39 -5 26 16 52 24 4 95 57 95 46 27 13 21 94 102 5 51 94 28 59 77 35 55 23 -7 -1 39 20 3
2720 3 45 17 6 -10 33 -12 51 -24 8 8 -16 11 -12 -45 -25 -63 -25 -33 -69 -37 -19 -26 6 -53 -60 -18 -52 -54 -62 -87 -73 -15 -27 7
2754 7 5 -42 -37 -32 -23 -53 22 -25 -7 -10 -23 5 -12 48 46 37 7 4 53 87 74 77 41 25 63 57 64 52 113 54 17 33 38 49 66 34 62
2791 62 105 50 20 55 18 -24 4 -30 -20 -21 -17 58 -8 31 17 -92 -15 47 -23 -38 -17 -70 3 -88 -29 -45 7 -39 -79 -60 5
2822 5 -69 -33 -28 -83 -1 -38 -78 -21 -35 -10 11 -42 -15 -4 -3 -10 -11 -21 61 -19 28 -30 -21 44 24 40 91 -11 3 85 -28 75
2854G5p3J1P4j6m2j7l2J42k8r1K0j3M3q%LRo5Q1p1m9O6l2L2l2m1N8Np9J42j82
2885a10Q2M8o9N5k0l1J24j04j22J47o0J05o6o4P8o6R2j4j02M8M8r5J06r9k5K11
2911I7p2k9K9o1J48p2q0Nk3J23O3j08oOp5J72j28m5P1J8L9Qm7Q9k1o2M6j23J38
2940A00l1n3L4Lk9Q2j00k0L3o0J39o0j13J07r4Q2L3j50P6M9o8R2j16J6O9k1jm6
2968d7k6Q8l1p4J07j53P6O1o0L1Mm8R5o9MP2n8L0Jk9N4m3J0N2q8M8M4l5L2m8K4
2999B4P5n6JJ3p8R8kn6O4k7jL4r0Q5l5j7L5j00O4L6q3N6K0j12N7J1j6mmJK8K0
3031D1Qp9J1M1n5J1L4p9O3%o5P9p6P0o2K3QM2k3Nm3l1R4k6J0o0K9j7N2m1K6j2
3063b2MN7n3O3q7K3L0J7l9M4o6J9M9j9N4K4m3M7o7QO1n9M1no2O1n0j7L7J1m5m2
$$ plain form
2854 75 2 13 87 71 29 12 -20 122 94 3 23 10 53 45 45 48 57 -8 73 2 -47 19 -13 19 -13 -54 4 9 -70 72 -110
2885 -110 -28 20 -49 6 -14 -45 79 -25 -147 0 -60 45 -21 -85 -7 -73 19 5 -97 -49 -1 -96 10 -89 -114 97
2911 97 25 -4 25 -36 112 40 -40 -35 -58 65 128 20 14 20 -55 117 -11 -56 15 33 72 80 33 122 101 39 85 -38 100
2940 100 69 16 50 53 24 106 6 -14 19 -41 98 38 -75 32 -62 20 53 -97 -21 28 -40 52 -64 -48 21 0 -1 -47
2968 -47 -73 15 -16 -90 17 -136 -60 1 -59 -28 -24 -72 23 -46 -42 30 -28 2 3 -26 28 -15 -5 47 -41 7 51 16 48 0 24
2999 24 99 43 44 57 -21 77 75 19 83 56 55 89 -1 84 49 32 67 -33 31 67 -16 40 60 -52 5 16 0 -4 -8 -7 21 41
3031 41 49 -30 -19 22 -33 -22 12 -67 -4 -4 -69 10 -66 4 -58 -35 -27 15 -8 -3 -46 -77 17 -9 1 -59 -30 -47 5 -36 -10 -22
3063 -22 -18 39 -14 49 -38 -15 15 32 -7 37 -29 -10 39 20 74 98 55 102 35 43 104 45 86 81 19 80 30 13 50 61 16 -26
3095b6M8J4k4Kl6L0k3j6M1k2k0N5l4k7m5Q0k2J7m1nJ0K5k5K4o4Q4k5J0L7m3J4
3126gk8l2P5l1QJ5j7oKL2o9M1pjO6k7k5KqO6l0mJ6j1k3J7j1kK7J4M2j03O6NQp7
3162a7J0M1j5M1m2lM8L2n2K2o4N2o2M3l4O0k5n6m4J18r6K2NJK1o6Q2m2n8Q2l0
3193b6n6M8Lm0Q0r0K3M8Mj2jj4k7J4%j4L8Ok3M5m7k3K4N0q4O0Rm3Q7o2K0kj6K5
3227DL7m7J4K6j2j4K8K8n9O0ok0K7n2J4L7k9Rj8J7j9N6m0k6qn4O7o4JjJ0LK7k9
3261c3K5k5J0Mm3Q3m4n2L1M4j1Nq4Q6m3nK8m6O5l8JnL3j6K2k5rL6J4J2l1l6K9
3294a8J6k5J2P%M7o7L4N9l7L8p0j0K1oK3kj4M2m2M0j4l8K3N4r2J05l0PL5n5L0
3326G3m5m2OK1l3K5RJ0j5j7K7m3nN0p0rL4l1L0k0k3M1j9K6J8r7J41k7o3KpM8k2
$$ plain form
3095 -26 22 36 12 14 -22 8 -15 -31 10 -12 -32 23 -11 -38 -83 -3 -25 -8 -49 -54 -44 -19 -44 -20 -84 0 -25 -15 22 -21 -7
3126 -7 -35 -67 8 -23 -15 0 -17 -23 -21 11 -58 -17 -24 -25 41 14 -11 -9 -17 49 19 15 31 20 -3 14 3 1 28 42 84 -19 47 52 60 -17
3162 -17 -7 34 19 60 18 15 63 95 43 65 1 53 -9 34 0 60 35 -21 -65 53 -43 -21 -16 -15 6 -60 22 -20 -78 4 -26
3193 -26 -82 -34 -31 -71 9 -81 -58 -10 -6 -18 -19 -33 -60 -46 -46 -60 -22 -16 -39 6 -41 -64 -40 10 -74 -14 -5 -48 39 -23 -3 -5 -21 4
3227 4 41 -6 8 34 22 8 36 64 5 65 59 39 66 14 28 65 36 45 27 44 25 81 41 15 7 -47 20 -44 -43 -44 -34 -31 -4 -33
3261 -33 -8 -33 -23 -19 -62 21 -23 -75 -44 0 -11 -6 -90 -4 -47 -52 -24 -70 -5 -43 -42 -47 -14 -30 -8 -33 -42 -6 8 20 -11 -47 -18
3294 -18 -2 -27 -15 -8 -8 39 -28 6 65 28 66 -4 -14 7 1 24 22 8 50 8 48 34 -4 19 73 -19 86 56 63 98 43 73
3326 73 28 -14 -8 13 -20 5 14 24 9 -8 19 -24 -29 21 -49 -58 -24 -55 -25 -45 -68 -27 -46 -20 -2 -99 42 15 -48 -46 -53 -5 -27
3359b7k9K6l4L3M7Lk5j3J0NN8o8k4K2PK2j5k4N9m7R1p3mP0q5L1op0Q6P5q4m1O
3392a8N4J2m6k6M6%O7p2QO4q9L1L3j21N2N9r4K1k6rN8m1RJ6m5K8k3m7J21p5N9
3423Fj7k1k0J2l8J33o7j5K6m0N6o8j5Q9p3M0N3j14N5N7m1J7l6N0j6L8l1%K5Pr
3454D3r4M6Q9o0k3RJ6K4k8K8q8O6K9l9l2J2l5O8NRO8j35M6M8p7Ol2O8J3q3j8O4
3486A3j0Kl5l7Q0j2l8Q6o7j7J3k6M3l2l5O0k3K4m9M3K3j3qN7l7o2R4l8K3p3rR8
3518C8n8M8J1n3l4L7L1J7j7k3j9l4Q0n0P0m9N3k0K1m5k0L1nkJ7m1L7KnKj5K8Q
3551D1m8K2M7mq9L8J7j5k2M4k4m9P7p1J0Rk0K7Jj6L8r5K6J6j4L6j3j4M6rJ3mP
3584Hl9j8P7m5J4Rq0P4%J4NQJPJ4m8L0n8ML7K0l3l7J25p5J0j6J2k9N3qq6L6L8
$$ plain form
3359 -27 -56 -30 -64 -31 16 19 -6 -19 -9 -4 54 -14 -38 -16 -9 13 -2 -26 33 -14 77 4 0 70 -15 16 10 -60 26 101 17 -24 -18
3392 -18 36 48 2 -24 22 22 89 17 25 89 0 31 64 -57 -5 54 -40 -19 -45 -54 4 -37 -28 -12 -57 -29 -52 -99 22 -53 6
3423 6 -11 -32 -52 -40 -78 55 -12 -27 -1 -41 15 -53 -68 21 -52 -12 41 -73 -18 39 -2 15 -21 29 13 51 20 20 45 52 43
3454 43 -51 -5 84 24 1 10 26 50 22 50 -38 28 57 18 -14 -2 -37 31 36 45 113 -22 24 72 -5 1 -31 37 50 -33 -51 13
3486 13 3 5 -30 -67 13 1 -37 49 -18 -35 -22 -48 -5 -37 -72 -12 -35 -11 -60 -17 6 -7 -15 42 5 -57 37 -1 22 -51 -60 38
3518 38 -20 28 39 -14 -48 -11 20 37 20 -3 -22 -56 24 -26 44 -5 48 28 49 4 -16 15 10 8 25 -16 21 23 18 20 5 33 41
3551 41 -7 15 62 58 -31 7 24 9 -13 31 7 -42 35 -36 -26 -17 -37 -10 -9 -25 13 -82 -56 -40 -54 -18 -31 -45 1 -8 5 1 8
3584 8 -31 -49 28 -17 -3 6 -74 0 0 14 19 27 28 35 49 1 31 -27 -23 14 34 1 -36 89 14 24 8 20 -9 44 36 -50 -14 24
3618B4L7Lj1l9M5o4L6Kj9L1n0k6L4l4N2oj2k0O3p7O1m3O5n1K6l7m6N2l7J0qMQ
3651b7J6J9jm6K1k4K6k7M2j3qj6p0J34m8L1R7j18NqJ2L1l0K0Mj1kJN3p3L6k4K7
3684B9Ol4M9n7O0l1jj4l1Q6n0M5m5Nl3J0K0M9m9j4oL4n6O4l6L2l7M1on3J5L2M
3717B8j9J7m6l0jM9l1k5K1N0n8KK8m2K7M2o1J2J4n4O0J8j0M2l0n5Q5m2l2O9l8
3748a0K7m2N1K3l6Jl7O5j22Q6P%P5n3K6q7L6M2K8o4k6K2J5l6K4j8QK0K2n9N6m7
3780cl1R6Np0M0K8o0Pj4j7K6l3M6o6j8O5j3Oj7k5O1k2o7J00m7l0Q4o7kl8N8L6
3812A8n0k5M4PROo4Q8n0l2M1M9j7k7n9O5jqK4mk1J2K3m2K7J1Km8L2l3M2L1mo8
3846b2P8nl5l6NrM6J9j2j1LJq2P5L1j0o2O3m1M6n2NK9N0j02M8j5k1Nk0N2l6MJ4
$$ plain form
3618 24 61 64 53 14 59 -5 31 33 14 45 -5 -31 3 -31 21 15 3 -17 46 -31 30 -13 52 1 27 -10 -56 -4 -41 -31 -39 -35 -27
3651 -27 -11 8 7 -39 -18 -42 -16 -43 -1 -14 -22 -38 -108 26 -22 9 106 -12 -7 -15 -3 28 -2 18 22 11 9 10 63 -10 26 2 29
3684 29 35 1 50 -7 53 22 21 7 -24 62 12 57 12 17 -16 -6 14 63 14 0 -6 28 -28 36 0 32 -5 36 30 -23 -8 24 28
3717 28 9 26 -20 -50 -51 -2 -33 -58 -37 13 -45 -43 -15 -57 -30 12 -49 -37 -23 -77 -17 1 -9 33 3 -52 33 -9 -41 28 -10
3748 -10 17 -25 26 49 13 14 -23 42 -80 6 13 13 88 35 61 -26 10 52 80 16 -10 12 27 -9 15 -3 5 25 47 -12 44 -3
3780 -3 -34 62 67 -3 37 65 5 12 -2 -19 7 -26 20 -46 -64 1 -12 -6 -23 -48 13 -9 -76 24 -23 -53 31 -36 -38 -76 -18 18
3812 18 -32 -57 -13 -6 3 9 -55 33 -17 -49 -8 41 24 -3 -62 3 2 -6 18 14 -7 5 28 -14 13 24 26 -22 10 -23 19 50 46 -22
3846 -22 56 51 16 -20 -15 -24 22 41 29 18 21 22 -60 15 46 36 -26 37 -4 42 -10 -5 24 74 -28 20 5 -16 -11 -31 21 -15 -11 3
3880Cn7K5K6m8K9nj4J7k6Rj3j9M1K0l2P7m1l0K4Pj1M6j6M3n5K2l4RM4j0l7N5m6
3913CK0L7n1M6m6K5J5o2J0rJ2K8Po1j4Q2j7L6m0J1Mk3J2n9J3Kj0L8Nq0P2Kk2j1
3947b5Lk4N5j6o6M3m5R6J5n8k1P9J2q5%J4jk2k2M6k0K2k3P0m3l0N3j1JN9o8JM2
3980C1j9K3Rn7M0k2oO2q1L6j9l2P1k3L6k5j7J0j1n5N9N0k4m5n1Q0n0j9Q5Nm2P
4012Fk6j7nj5P0J1m1K5%k2J8j6l0K3LJ1K8l0L0Oo8L8j5OOjpOj2k8J7j3K5K6no
4048bJ4rK1l7oO4p3J0k6M3QKmJ9oL2n8J8%RK3l9j6R2p6O6o1K4K2n6L8n4J5rK5
4083A3j9j2j9M3nLj7kL0q0K9L2k1pL8nN7o9j7N3o4N5o2Q4nj6m1N6n6pn3R9n4K
4117c7M5k7k9P4J4p7K5qK6K2k6oM0l1K3N1l6l7L0p0N7j2k2O0op9K1J4M4k1k4K8
$$ plain form
3880 3 -54 -29 -3 -51 -22 -27 -41 -24 -50 -41 -54 -73 -32 -12 -44 33 -8 -38 -14 -7 -18 28 12 55 0 22 -12 -3 41 31 -6 49 3
3913 3 23 60 9 55 9 34 49 -13 -3 -12 0 28 35 -26 -40 42 25 61 21 32 36 13 25 -34 -21 -19 -29 9 14 -66 6 8 -14 -25
3947 -25 -22 -46 9 -7 -73 -30 -75 21 36 -22 -43 36 48 -37 -37 -23 -24 -46 -68 -22 -42 -20 -43 27 -16 -46 7 -4 -3 56 -12 -11 31
3980 31 12 35 44 -13 27 5 -1 61 -20 16 -3 -35 36 13 49 24 7 17 6 -49 10 60 36 -9 -60 20 -30 -49 36 41 -1 6
4012 6 -20 -37 -42 -57 13 24 -17 8 8 -14 4 -12 -42 -19 -16 -5 23 -7 23 29 -39 -1 -16 -10 -4 -5 -12 -6 -18 -46 -29 -42 -17 9 4 -2
4048 -2 12 3 24 -13 -19 45 -28 -18 -44 -1 7 9 5 24 18 50 -8 10 10 19 42 3 -13 79 3 69 8 32 54 -2 36 -18 -3 -12 13
4083 13 -6 -18 -37 6 1 4 -13 -15 15 -65 -36 -4 -25 -32 6 1 58 -11 -28 25 -39 16 -46 38 33 17 -24 32 -24 -31 -84 15 -39 -37
4117 -37 8 -19 -48 26 40 -37 -12 -20 6 28 2 -4 36 5 28 79 43 6 36 -34 23 11 -11 49 43 -36 -15 -1 43 22 -2 26
4149B6J3Nlq2L1J4J4j6l9J23j60Q9j5k2N5n4k3L7J3j4K9l4J9l4OM7j4J7n3m6N4
4180a7l3JJj8R5l6rK1qJ8m1J9K3k4J4l4p3J24p3K4PO2r4L9RN1n7J3K9l2J9o5M2
4213cL0L6o3M0m1Qjj2Q1o5n1N9k6M6LJl8M0j05Q1o0R4l4m6J1J3k1K8m7N7k6n7
4245f8M6j0O1kn7K8j7LL6l7qK2K1m9M0rj6L7k2l4L2M8n1P2r8nj3M7l0N1o2K5J2
4278gO9j02QR1j11P9k5rOR2o4K3n5M8o1N8K9m0L5Rj03O6j1m6M5m8Q3l2k5M8o0
4309a0J9k0K9pK8r1J07n6m0rN4k4j0L5l2L5n9P9l4o2N4n4J8Q9r2%RL6K3J5q4O0
4341FL4j0o4pO6l1rPn9Q7j2n6P4n5KM6m3K3Pj6L8kj4j1l0M6rl4M5K3k6Jj1JJ6
4376B3N7j03L3m9N5J0o0M5o3N2J7p8L7K7pk8Ml7J6M5O%p8R1J3o3N0m0KM5p0L1
$$ plain form
4149 26 39 44 41 -41 -10 4 18 2 -37 86 -74 15 0 -22 33 -21 -44 -7 6 -8 21 -13 6 -28 -22 25 11 28 -25 -71 -17
4180 -17 -50 -49 -48 -66 29 -7 -16 5 -3 15 -26 -7 16 -8 6 -28 -101 23 -50 -26 -19 43 -51 -12 -3 48 -9 4 33 1 20 -45 -3
4213 -3 27 63 0 40 -1 7 6 -6 75 10 -41 18 -8 38 41 42 4 44 -61 20 -40 54 20 -26 -15 -2 -23 5 -42 15 -11 -68
4245 -68 -22 -32 29 27 -30 -2 -19 -16 20 -17 -25 -3 18 -31 9 0 -16 21 -1 -35 -3 45 -6 66 -32 -37 -50 -3 -33 18 -44 -19 -7
4278 -7 62 -40 -32 59 -52 27 2 -7 -1 91 27 50 -5 43 -18 40 69 29 64 73 -30 36 25 -21 24 -24 59 27 2 50 -10
4309 -10 9 -11 18 11 39 -52 55 -1 -41 -50 4 -20 -30 5 -27 8 -51 28 -6 -68 -14 -68 -50 39 -53 -53 -44 -8 15 30 -54 6
4341 6 40 30 -34 -41 25 -6 -15 -8 -67 20 8 -48 26 -29 -27 19 -24 -1 6 -10 28 26 12 1 -29 17 8 -26 19 42 16 17 6 7 23
4376 23 80 -23 10 -39 16 26 -34 11 -52 0 17 -61 -24 3 -4 -32 -28 -65 -49 -4 2 2 -76 15 28 -35 15 -25 -23 22 -48 -17
4408a7%L0k5K7j5m2J9M2M1l7n2M5j7L6m9j9N6o5J1L3L9Mn2pM9m8K1L8p1Q2n0%
4440GK8o0N9k3j3P2m5m1K8k0J8j6j0p3J52q2M6m1O1k4m0NL4m6K9Kk0l6M8lk2%
4472b6K9J2k5nl5OJ9J3J6n9K4M4Lk0m7M4N4Ml7n2K7P2n5JJ3J1l9K7j0lN6j9p8
4505c5N5n5N3m4K5M9J1k9k3n2N6m1M2j4jK7K4o0l6Q9m9P2Po9J0jRk3k4M2k6LK5
4538A7m0K4P9o4L7q8L3J0j9j2J3K1k6kJkJ4m6K6j8J8K5k6O1j08J9P7p4%N8l9J9
4570a2J5qM7o4O8j0j00R9m5J0L3K8o7J6L6l7Nl6K5M3j0m1M4k6Lj1J0o4P5N4pk1
4602E2l0k6L9l8l0P6M8p2pj3K2lk1n5O4L6n8M1K2o8K7k0l1K3K3lm9J8J8J3Pn5
4634e0P2Nm7O3m5Pl1KK6J4k8J7M4l8m6J9m0R7k0n3L6LL7o0QM4n1J5l0Q5k6o1L2
$$ plain form
4408 -17 -17 13 -12 15 0 -42 -23 19 60 23 -29 16 -1 35 -14 -33 23 -42 -31 2 41 45 -7 -14 35 -13 8 46 -25 57 7 7
4440 7 35 -25 34 11 -2 70 25 -16 12 -8 10 -6 -16 -89 63 -19 27 -14 47 23 -17 -12 22 -24 5 7 -13 -49 -1 -4 -26 -26
4472 -26 3 15 -10 -15 -50 -44 -25 -12 4 -55 -31 13 16 -4 -51 -7 47 51 14 -38 -11 61 6 7 20 31 -8 19 9 6 62 43 -35
4505 -35 20 -35 18 -26 -1 48 59 30 7 -45 11 -30 12 -2 -3 24 48 -12 -48 41 -8 64 71 2 12 11 20 -3 -27 15 -11 -8 17
4538 17 -23 1 80 16 53 -35 -2 8 -11 -23 -10 11 -15 -17 -16 -18 -4 -50 -24 -42 -24 1 -25 36 -72 -53 24 -50 -50 8 -31 -12
4570 -12 3 -5 42 -22 46 36 -64 35 -10 0 33 61 -6 10 46 9 14 -22 3 46 36 -5 39 13 16 5 15 -49 26 80 73 52
4602 52 22 -4 35 -3 -33 43 91 19 12 -1 21 18 -3 -58 6 42 -16 25 47 -21 6 -14 -45 -22 1 -2 -51 -33 -15 -2 5 -50
4634 -50 22 27 -20 43 -2 5 -26 -24 2 16 -12 5 49 11 -35 -16 -56 41 21 -32 4 7 44 -16 -8 36 -15 0 -30 55 29 -32 0
4667@N4k9Pk7k0m8L0kK9M2LK1p6N6o3N5L4p1J9mj7l6P1J7m1K2kl2RnJ6%Kl4N6
4702C6j4q8L9M5o6J2L2k1m9N5JK5j8o8P0j1o4M9N6j7m5M8J5Oj5l3kP6m0M2o1l
4734hL2k6j3Rl4P0Nq9N1kK0J2j5j1L8o0N7m0m4Q1p4J6K9k8k2L3k5M3oj5K1J0J2
4767B7j06O1K6J9j8j5k2NL4PL2q0qJ1Nn2O4J1l4j5N8rk4%K1Qq1M4PL9qj1L9q6
4801e1N4k3j0K5l1J9M0ljK3o6M9j2kkn2P4Qo1Qk4L0K9p5P0k0m2Q0l4J1Kn9J6N3
4835B3k0j9RK9j3RJ6n6O5K1o7km1J16m5o0Nj6M6k7O5Jj4n3RnL4lLm0k8Q5m8K4
4869CM9j35P0kj2O6lj8J1lk3j6j9O9k4k5M8o2R1j4n7N7p6O9j7l6Pj4L2J9K8o3
4901@K6k1lK5n1j4N1qKrm1N0j0k1L2K6QJ0q1rJP8K7j8o3Nk6OL6j1pj2K3l7mM1
$$ plain form
4667 0 54 25 32 5 -15 -63 -33 -35 -6 36 39 60 -16 40 -23 32 66 -5 14 10 -7 -43 28 45 4 26 24 -8 1 -4 12 12 14 -20 36
4702 36 22 -66 -27 18 -48 -36 -4 -25 -74 -19 -18 7 -11 -79 -9 -20 -84 -35 21 4 -41 7 22 28 13 -20 -22 54 14 56 -5 -8
4734 -8 24 -2 -15 -6 -40 30 35 -54 -3 -5 15 27 12 1 39 -21 36 -4 -48 33 -41 -25 4 -24 -46 -13 -38 5 -1 -16 5 15 27
4767 27 -79 -18 8 27 9 -6 -28 -23 11 18 50 -30 -38 -27 -22 -74 -10 1 -33 -48 10 1 -23 -23 -2 6 -75 -31 -24 15 7 -4 35 -51
4801 -51 3 -20 -30 -5 -36 -17 23 20 19 42 -24 25 13 11 9 -43 31 39 -22 -14 -38 -8 21 -54 16 -4 -46 34 0 11 13 -46 -30 23
4835 23 3 -16 -7 22 9 18 34 -22 43 64 -3 -5 -46 70 25 -35 -30 -46 0 -27 38 39 25 -28 -19 -24 10 7 10 -30 -58 27 -21 3
4869 3 52 -83 -13 -15 -27 39 36 18 29 26 3 -13 -32 37 13 -12 36 -26 65 51 -6 51 -25 44 27 -9 -2 -16 16 35 63 0
4901 0 26 5 2 27 -24 -38 13 5 7 -2 -43 7 -3 -24 8 34 42 52 -29 -38 -37 41 68 50 -13 -8 -34 -28 8 -3 -10 -22 1 -36 -40 1
4937Aj6k3jK9m5O2l3pK5k4N3j4j3j0J3PL7l2K3lpj1%k6k1O8J1k2J9j3n3M0N1n7
4971HJ3qK2r8R2J0m3lL6J2m3K0n3J1KP3q3K6J9m0J8nM9k9J5Oj7l4L4j4k6P4j2
5004C2l8j5K2m5K6J3M3J2n1k2LL1kj8K2o4Q2n6l0N5o1K5QJ6J1l1K3J9qJ2o2N2
5036DL3o9M9L9q4M9j2K4n7M2k5j0N8J1l9k8L1N0o9RM1n7K1jo4N5j1ML4Km9K7N
5069A3J2j2l8P0k3J5j8Jk4j0j7NM8m6j2L6Mj5J4jl5L7j6Lm0L0K0Jm8rjM8Jl4O6
5104B5k7k2K6K6o1N0k5K0j1j2M6j7Ql2Nm2K0N9j8j8J2L1M5q8Pm3O4l9P8m0k9K
5136@kLM2J2p7kO3Nl5K8j10L0P3l6nL4j0mjJ2n2P1k0k9l9L5jQ2q1m0R5o0N8n5
5170a6l2K5RJ0K0k4PRlK2l8M1l4lj2rM6o3O6o1J6rN7ol4K4M1j8j0OJl2N0n0Jl3
$$ plain form
4937 1 -15 -38 -39 -10 -55 7 -26 -33 -8 -32 21 7 -6 -16 -3 4 41 9 32 29 22 11 11 -15 -36 32 43 21 40 27 -26 14 65 8
4971 8 21 13 35 -63 29 39 -4 -7 29 41 -2 18 -35 -24 -22 51 -32 -6 13 -27 -9 -14 35 6 21 27 10 -24 10 -4 -30 44 32
5004 32 -6 -21 1 -44 -18 -5 38 50 -1 -23 -20 11 9 -9 13 -51 31 -25 -55 0 -61 -36 -28 -12 -1 -32 -9 10 2 14 -48 4
5036 4 37 -32 17 56 -28 21 9 33 -24 18 -7 -17 41 52 13 -15 16 66 -3 6 47 -10 11 10 -54 1 -10 -6 28 30 -19 8 13
5069 13 25 13 -25 45 22 37 19 20 -4 -14 -31 -26 22 -24 -36 0 4 -11 3 2 -33 4 -12 -9 -49 -19 1 2 -46 -55 -56 -8 -7 -41 25
5104 25 -2 -24 2 28 -33 17 -8 12 1 -11 35 18 26 -6 -1 -43 -23 36 18 0 12 43 88 0 7 -36 28 -11 67 27 -2 0
5136 0 -2 1 43 55 -22 -24 39 44 9 37 -73 -43 30 -6 -11 23 13 9 8 20 -32 39 19 -10 -49 -14 -15 67 -14 -54 41 -19 39 -16
5170 -16 -48 -23 -14 -4 16 -8 -1 8 5 27 -11 30 -4 -7 -19 -28 18 -45 21 -40 -24 -33 24 18 -16 8 49 31 21 27 28 -4 46 -4 -3 -36
5206c6N9N4m4j1Rk8Jj4m4R6n6J1LK5k4L5Ok3jl7m1Q3o5N9J2N7p1J8n7lM6npl3
5240b6K0L0l8KOJ4J6l7K4o8Q2j5o1N4k2L4j12J06Qj04O2rO7Ml8PK8o5M5J6krK
5273B1rK5k9k4P1j0Jn2L7n0L5QK3n9L9rK6k2k4kk0j3L1L5k9l1M5%l8J3K4q1K6
5306d2L3k7P7l2jl3J4o1N3K3M6j13K7J5jrO4l8j9K0mJ0ROk6Ol9M0pN1k0l5K9N
5340B1m2ML4k6L2n8P8m3L5m5Q0p3L3K6jl1J8k5j6L5j8n0K4N2k1K5k2j3PM0n3j2
5372el5M2M9m9%l7KM7j3j6Qjo9P2L7l6J5K2k3n5M7Rk1K8mj6M9p1J5qj6K7O4n5
5406Cl0PJ6m2J5k7L4M4j1n6L5M5l8l6K1K4roJL0J5o2K4K0K3n9L9L7m4PQRk7K6
5440C6k7K0l1J1l2N6kk9j9J3nM9L5l7l5L3n1K9r8Q8k3K8l9NO5m5Oj8K7Ml3j3J0
$$ plain form
5206 -36 23 77 33 22 31 3 4 -10 -54 42 -14 -3 0 25 1 36 42 19 18 -19 -60 23 -42 17 29 86 15 33 -24 -27 19 14 7 -26
5240 -26 -6 24 -14 -12 -6 8 24 -13 11 -57 25 10 -51 3 -19 15 -97 9 17 -87 -25 -34 33 37 -1 6 34 -31 14 30 28 19 21
5273 21 12 37 8 -16 55 45 46 -6 31 -19 16 24 47 -12 27 18 44 22 -2 -4 -24 -37 -6 29 0 -31 14 14 -24 -11 13 -68 -42
5306 -42 -9 -36 41 9 8 -25 -11 -72 -19 4 50 -63 -36 -21 -22 -31 33 -5 -24 -4 -8 2 11 17 -9 -3 -42 -2 -9 42 22 -13 16 21
5340 21 -21 -17 17 -9 23 -35 43 0 35 -10 70 -3 30 56 55 24 42 17 1 36 18 -32 -8 44 23 48 26 13 20 60 7 -5
5372 -5 -40 2 51 2 2 -35 -33 14 1 -15 -7 -8 -77 -5 32 -4 11 33 10 -45 2 11 -10 18 14 -2 47 -24 -9 -17 -33 -6 58 3
5406 3 -27 -20 -4 -46 -31 -58 -24 20 9 -47 -12 33 -5 -41 -20 4 -5 -11 -10 20 35 -27 -3 17 40 -19 20 57 13 20 28 37 10 36
5440 36 9 29 -2 9 -23 33 31 2 -17 -4 -9 40 75 38 3 36 -15 14 -84 4 -19 9 -30 -25 40 -5 1 -17 10 14 -19 -32 -22
5473b2L6m1M5JQQJ3o6mP4j10Q7o2O2qrJ9k3j5k3k5Q9k2J9Lj9k7K8KKl3N7l3J3
5507B4qk8L8n9N0RJ6j6OK3l0mkk7k2j4L2m4J49j11K4k3O9o2j3mM8k4l5K8j4J9
5539erL6mn9N2J2ql6l7Q8lm0M0p0P5o1O7jn6MOl5N6l0j7M1pJj4PnR1m9m3L1l6
5575a8L5m6L1%K4J8p3P8m7J3NK1l3J2J1L4l5k5J4K3m1N5r0k7O0j9Q4p7K5J6m9
5606b1j7j5K4j1L0kJ0j7J3j6J5OJ0l6L0J3m5oM0Pm8PPN0k6P3p6kM6q7P7l2Mpj
5641ck1N1k2L3k5LJ3l6mM9r5P8l6L9j3m0N6l7L1p3Q2m0M4Rn4L7Nm0L2Qn2K8Km
5675En3O2k4M7p1N6q3L6qP3m2j0K6k4l8N3j4lk2J9l2M7k4M3J1j3n9M3L3o0R8q0
5707hJ6q1Q6j9OK8m0l7N0K9k1L5j4j3m7O1m2k5M2J8p6Q6Qo7L4j9pj0K7k6K7L9
$$ plain form
5473 -22 14 -27 18 19 27 35 48 -18 -22 52 -58 29 -33 29 21 12 31 8 -7 -30 -55 34 12 31 34 15 -12 16 18 20 -13 44 11 24
5507 24 16 -12 26 -33 17 26 42 26 32 55 25 21 19 -8 -30 -44 -12 -56 93 -18 6 -17 52 -10 -23 -27 21 -3 -38 -10 -24 -5
5539 -5 -14 22 18 -41 11 23 15 -21 -58 30 27 -13 27 -43 32 -29 38 37 -19 -15 -9 -44 12 -18 -35 6 -1 0 -14 -7 -12 79 30 -13 18 -18
5575 -18 17 -29 2 2 26 44 -29 49 2 15 20 41 8 20 31 65 30 5 19 42 1 56 -34 -61 -1 -20 64 -13 12 28 -21
5606 -21 -38 -53 -29 -40 -10 -12 -2 -19 -6 -22 -7 -1 9 -27 3 16 -29 -35 5 12 -36 -29 -22 28 2 75 -1 -3 43 -44 33 1 5 -2 -3
5641 -3 -24 27 5 38 13 16 29 -7 -11 38 -57 21 -15 24 11 -29 27 -10 21 -52 30 -10 34 43 -11 26 31 -9 23 31 -21 7 9 5
5675 5 -48 14 -10 37 -34 22 -61 -25 -33 40 -2 -12 14 -10 -48 5 -9 -12 -34 -15 -47 0 -24 19 30 17 -42 1 34 -26 72 -8
5707 -8 8 -73 13 -6 0 28 -12 -49 1 30 9 44 30 17 -30 31 -11 -36 6 24 -52 34 42 -25 9 -10 -17 -27 0 -26 1 40
5739D0nm9L5K9o0L8j3oRJ9m3J7K0K8n4J9J5rn6K8k9O7k5k9M6k8K0p3N0j2j5K7
5771AMk3j5Nl0N4J4o0N2Rl6M3J1pj5J0J1n8P4j16J32r0M3L9p1K3J0n3j4j0N3K3
5803A3J8p7J9j4O3q2P0o2Q3j8J8j8p6Q2j5Rqk7M2Lm2Q0m8PL5n5n3Q8kk4O1m9n8
5836c7N2k8O5lj00L4J0m7M3M0p6L3m1J5M1J0J8m9J0j3m3P0RNj8m6K4M8lm9J3L2
5868A9J6m5M0j1%j6QplJ9nj5k2oK1P6o4J5o2L4l5P1j4j2j8M6k0l2j8K9m0L9L5
5901B3p2Q4k7k9L4k8j4L8N0o4O3K3j22L5L6j7nj7n1M1Pjj1N8l1Pn9M8Rl3L1k9
5933b3M5m6K6j7k7J08n2J7k1j9rN4j6J0n9J3jK3K9m3oP0j06K3KM8mj9K3Pk5l3
5965b8m6M9K0L2l4rM6Nl0j6NK6j3k2L7k9j6M3j8J7l8j5N2J5m6J5J9%J6k7k0J1
$$ plain form
5739 40 35 -14 21 50 -10 28 15 9 18 37 -6 11 31 59 5 24 39 30 -26 2 -27 40 15 -14 32 4 24 -49 1 -11 -26 1
5771 1 5 -18 -33 -28 -58 -4 10 -50 2 11 -25 18 29 22 7 17 28 -30 44 -72 60 -30 13 52 -19 4 14 -39 -53 -63 -10 13
5803 13 31 -46 -27 -41 22 -60 10 -52 31 13 31 13 -63 19 4 13 5 -22 20 23 -19 61 13 20 55 0 -53 35 33 9 70 21 -37
5836 -37 15 -13 52 49 -51 -17 -7 -54 -11 29 -47 -14 -55 -40 1 11 29 -20 -10 -23 -66 4 13 18 0 -46 -22 26 23 -26 -13 19
5868 19 35 -10 30 19 19 3 11 4 1 20 15 0 -22 -28 -7 69 5 20 -42 -8 -43 28 14 2 -16 30 10 -22 -40 -11 -51 -12 23
5901 23 -49 35 8 -21 13 -15 -29 9 59 -5 58 81 -41 -6 30 13 8 -9 -60 -19 -12 -13 -24 34 3 10 -49 -1 8 -25 6 -23
5933 -23 22 -24 2 -15 -42 66 14 31 10 -9 -18 36 20 30 -29 -16 -17 6 35 -8 -14 56 -50 -27 -25 23 19 0 23 30 5 -28
5965 -28 -74 -25 -5 27 -7 -16 30 35 5 -11 -6 20 7 -15 22 -7 -23 20 2 19 -19 -34 18 33 -13 2 21 21 37 10 -10 1
5997AM2n0j5j2J8%m6N3n0K1l1N2o8Q9Mj0oJ8K6l5p3N1k0L6NK8ll1pK3K8pm2L4
6031B3Kj9Pom1M4Oo2N5k6l1K3K3K2l8j8M8MK9nJ0n1K8j2m3O5l3L2Qm6J3J4pnj5
6066bj0K7mKl4lJ0L1j3oK1p3O4l1lN3j12O5QNqq0J03m4l0N3L8m4L8k6pM0O3l7
6100E4k0l2k9J0M8o0L1k6K0K4%jm6OK8k6L5m5J1Kl2P0j9J8n8J3J2k3j3N4j9L6
6132B3J7k5j3j3O6q2NM1j8j5M4l1j6Q1j32M8l2L8j5J1K4ml6Q4p1J2M7m3QKJ1k6
6164a0K6k2J4l1O0l2m8O8k1L6m8J2K5k7Ol5M0k1J7m9J32n6m5N0p4rL0K4mj5n5
6195f2M6j8PQKjK8oJ8%q3M9K4m6M2j2K7j7J2k3J7k6J1l6L5L4n7oQ5j04O2jJ5j7
6229GL6n3J3M7n9L2l7l0J4K3K4k7K6Rj5LJ5j7N2n5j8J1j7M8J5p2M4%j4oJ3j2r
$$ plain form
5997 1 43 -7 -22 -34 -16 -16 -62 -9 -59 -38 -69 -17 -85 4 8 -2 -8 10 36 1 -72 -21 -41 -5 0 28 25 -6 -13 10 38 31 -11 23
6031 23 25 6 13 7 -34 10 16 -46 9 -17 -48 -25 -2 20 -18 -36 12 16 45 40 50 -1 27 15 -28 37 4 36 44 -2 11 25 18 13 -2
6066 -2 -12 15 11 13 -21 -24 -14 17 4 -2 19 -54 10 -21 -24 29 -83 -18 -10 -5 -13 -93 10 -34 -64 -11 27 -17 21 -5 -12 28 91 54
6100 54 34 2 -27 -17 31 -29 2 -24 -4 20 20 19 -27 -21 7 -19 16 -29 -18 -16 -48 22 3 21 -37 -24 -12 -35 -48 6 -13 23
6132 23 40 15 2 -11 55 -27 -22 19 1 -14 30 -1 -17 64 -68 -20 -52 -14 -29 -18 6 2 -34 50 -21 -9 38 -5 3 5 16 -10
6164 -10 16 -6 8 -23 37 5 -43 25 4 40 -8 4 29 2 8 -27 13 -8 9 -40 92 36 -9 41 -33 -42 -12 12 8 -7 -62
6195 -62 -16 -34 -27 -19 -17 -18 10 4 22 22 -61 -12 12 -34 8 -4 23 6 18 -5 12 -14 -3 -39 -4 30 -27 -33 52 -52 10 9 24 7
6229 7 43 -10 3 50 -9 23 -14 -44 -30 -7 17 -10 16 25 10 13 28 11 63 8 -10 1 -16 32 47 -25 19 19 5 -1 12 0 -9
6262iK2l6M8K3n0K5L8j5l0k1L4k6j3L1n1K6k7J1j0K5Rl0L3l9K6K6kJ8j7k3k5L5
6294Fkj3J6kJ1n7R2k7J7Lm8J7j8K2m0J6M5j6m7j8L6oJ3j3QM5m3j4O8m0k2K5J2
6327B6l3L2JJjpk0O6o8JO8p1k3K0J1N7m4k2j5N8j8o5L0Pjl3M1pL4k9j6nJM0K3
6362C9m6l4M7n5N0J2J1m4nJ8K9L0p4M0L7q7O7l6KRm7k2P4pLo8M3J9o0P1n0J3L2
6395A1j1j6j6J7K2m5RM6pk0N2n8J0K5Jl4K4K0mkl3O4mK5p4O8p6%Rl7P3l0mJ5J4
6430C4%rj5n4L8k5K1lK3m5K3K4K2qn3N9n8Q4o6L6l0N2m5j4K1m5K7pl0K3L8k3o7
6463g2L1J7N9l1j1J2n7R6q5M5k8L9J1j6j4O4p4J5J1o5K7j3K2K8mj4M0j0J2K1r1
6494c5P8Oo7J4J9K7m5J9j0L9k3qo7Q9k5kPJm1L8kk8j3k6P9j9n5Q2m8j6JP2l9m6
$$ plain form
6262 -9 13 -23 25 48 -2 23 61 46 16 -5 29 3 -10 21 -30 -4 -31 -20 -30 -5 4 -26 7 -32 -6 20 18 36 19 -4 -29 6
6294 6 4 -9 7 5 16 -41 51 24 41 44 -4 13 -5 17 -23 -7 38 22 -25 -43 -7 -13 0 -13 -5 40 -3 -17 51 11 -11 14 26
6327 26 -7 25 26 27 26 19 -1 65 -3 -2 66 -5 -28 -8 3 60 16 -6 -21 37 19 -46 -16 -9 -10 -43 -2 -9 25 -4 -20 -25 -24 16 39
6362 39 -7 -41 6 -49 1 13 24 -20 -25 -7 22 52 -22 18 55 -32 35 -1 1 10 -37 -59 15 8 11 -57 -14 5 -55 16 -34 -21 11
6395 11 0 -16 -32 -15 7 -38 -29 17 10 -10 42 -16 -6 19 20 -14 10 30 26 24 -9 55 51 76 2 70 -6 -6 3 -34 39 9 5 20 34
6430 34 34 25 10 -44 -6 -31 -10 -13 10 -35 -12 12 34 26 -27 32 -26 58 -8 28 -2 50 5 -9 12 -33 -6 -13 -43 -20 18 -5 -72
6463 -72 -41 -24 35 4 -7 5 -52 44 -41 4 -24 15 26 10 -4 60 -14 1 12 -53 -26 -39 -17 11 7 -7 33 23 35 56 -35
6494 -35 43 49 -18 -4 15 42 -3 16 6 45 22 14 -53 36 11 9 16 17 -24 14 12 -16 -29 -55 24 5 -50 32 -16 -32 -31 41 2 -44
6528d4P2k6j3L8l7N3q5K7J5J2j3L7o7MK1J1plK6o5O7j6k9P8p0k2k8N2k2jO4n2
6560b3J3J6k6LO9Ok7k7k7K6K5n5L2q4N0%qM1K4m1lJ6j5nk5J2L5L1Jn5N0n5L4j3
6594ej9nQJ03q6jJ5Rm6J0J6O1q7N8K7m0K8n9P8r3L6K1p8O1pK0j2j7J3j6K5ql1
6627b1N6o0k9N2k1L2m2K3qqK7MJ6m4K2L0K5m8n5O3L6m5l2OQ9l3l5M1m2L2q4R1
6659C8n2J4Jo8j8J52m2o3L4j0LJJNj8K2j2%%k7N7j3j3J5PK6nm3K7M2n0%j1P1j05
6694c4L1j0K3J7j8j7J7o3N6O3o9J8m6M6n2OL0j0L5Nj9k2l4M2Mj7L3m6L5o6M7%
6726a5O9J8m0j6jj8J9Lk7J6l7k3M2lLlj4Rj7N0l6PN7o2J6j6L3q2L2J7P0j8n5P
6760a5N2rj3%mk9j4J2L9l4M0Ol8L5J4l0k8K8j3j9J2QJN7q6M5Qk3Oj5lJ2rk0J3
$$ plain form
6528 -44 28 2 -11 27 -10 43 -42 -15 0 12 -1 36 -31 -27 -6 5 -2 -5 21 -44 23 7 -22 56 -14 -36 -64 -12 -34 -35 29 -23
6560 -23 -10 6 -20 -17 52 58 31 4 -23 3 28 -27 5 -79 -29 -29 -37 4 28 -13 -16 0 -15 -20 -45 -33 2 33 34 -21 29 -26 8 -5
6594 -5 -24 -29 -21 82 -4 -5 10 19 -27 -17 -1 60 -27 31 58 18 46 -13 65 -28 8 29 -49 12 5 25 13 -4 9 -7 18 10 -21
6627 -21 35 -25 -54 -2 -23 9 -33 -10 -18 -26 1 5 21 -23 -1 29 54 6 -49 14 50 5 -27 -21 68 35 0 41 -1 31 -53 38
6659 38 -14 0 1 -67 -85 67 25 -38 -4 -14 -11 -10 -9 -4 -22 0 -12 -12 -12 -39 18 5 -8 7 14 40 35 -8 19 61 11 11 0 71 -34
6694 -34 -3 -13 10 27 9 -8 9 -54 2 65 -4 14 -32 14 -38 -32 -2 -12 23 28 9 -13 -47 -5 -1 -18 15 -31 4 -62 -15 -15
6726 -15 54 72 32 16 15 -3 16 19 -8 8 -29 -52 -10 -13 -10 -13 -27 -18 -35 15 -21 -14 43 -19 -3 -19 14 -68 -36 -19 51 33 -22 -15
6760 -15 37 28 15 15 11 -18 -32 -20 19 -15 25 31 -7 28 42 12 -16 12 -1 -20 -8 0 1 58 -28 17 25 2 8 -7 -10 2 -7 -27 -14
6795a4L4j0K8m9J1K6n1M2j4j6J2m0J5K1j8J2R%NJpJ7k3j9QrJ3j6N3q0R7o4rR7
6829F2n1l9oL4J0m6N8QMK6m2l6L4J2qnj5M6l1k7J5K2oJ5l5K5k7qJ8K6k6oL1n5
6863b3O5l6Rm2N7l0J4j0Rn4L3J5L4q2M5K0J9k5Mk8K7j1k8J4L7J9k4Lp6K7P0l5
6895A7J6J0p3LJ4m3K4J3J3j1j7J9%p0P4j5J2L3n5R9q6J7k3M0K0l6K2k0JK3p6N6
6927AK2K6J1m3j5j8O9n2l4M7K2m6j1jK5j6Nk8K3N3r7O6J6L1l9M0l1k7k8L9pn6
6959e3M7J1Q8km7j0k7j7K9J4l3J8pJ9k8M7p1J0nJ4j5Oj7J9rJ9m6RlK9L3l8L2N
6993B1Qo1P1l7m0O5m9L7K1pJj9j5K8m6j2M3qo1P3n7M6M9n2l3O1l7K3pJj2o5L0
7026d0K4oL2j5j0J1j6P5j9j2L7o7M3j1k3j5M7K8k8p5N8n0M6lk5k8M9L8o0L6k8
$$ plain form
6795 -14 20 10 38 -11 0 26 -25 17 3 -13 -1 -41 -26 -5 -23 -11 -2 -2 3 4 -3 14 -9 -28 -20 -29 -16 -32 21 -59 38 -26 -35 62
6829 62 11 -28 -34 0 10 -36 22 30 34 60 18 -18 16 28 20 15 0 46 15 -12 3 25 19 34 -1 24 -3 -11 7 33 7 1 32 -23
6863 -23 42 6 15 -27 30 0 14 4 13 -41 -8 7 41 -41 4 24 43 18 22 -6 21 10 -18 -4 33 52 28 31 -45 -18 52 17
6895 17 33 43 -30 -27 -13 -56 -32 -19 -6 -17 -34 -15 -15 -85 -11 -26 -14 19 -36 63 -23 -6 -29 11 31 -5 17 -3 -2 21 -55 1
6927 1 23 49 60 17 2 -16 53 1 -33 14 36 -10 -21 -22 3 -13 -8 -36 -13 40 -57 9 25 56 17 57 26 -1 -29 10 3 -53
6959 -53 -6 5 93 91 44 34 7 -10 19 33 0 18 11 30 2 49 -22 -12 -17 -3 -18 -12 -29 -10 -19 0 -46 -37 -40 -11 22 -16 16 21
6993 21 29 -32 39 2 -38 27 -22 15 36 29 30 11 -4 24 -22 -34 9 1 -60 13 -44 2 51 -1 -34 27 -10 13 6 7 -5 -70 -40
7026 -40 -16 -22 10 -5 -15 -4 -20 55 36 24 61 -6 37 26 3 -12 35 63 35 -40 18 -32 14 11 -14 -42 7 45 -15 21 -7
7057gl0L2M5m8K1Ok9k6O5onm0L8O0m3K2l8k6l9P8m1RMJ0M6m0m1J6K9j6M8r7JN
7091c7Q5n2L7n4M7p7K9k2O0l3J7j2NN8p3KjK6L5l1q0O3Jl9R2mk9j2%Kk3O1n3L0
7125A8K3q1K0rM7m2L0L6q7LJ9J8Kl8N0Jk6n4QM6L0J6j5K0Jk2J2k1k4M7Ml5J3j2
7159bj6M0n2R7j5k5l5lK8pJ1q7O3RN3n2J6J4l1m8K7P2p1oj8L1k4L6l4N1oo1N6
7192A1kl7k7R4l3jJ4K0n0NL0l9%K6Mj2qqMn5P2j2m2RN9l8lM1m9K8J9n3j8L5KL4
7228B0k0oM9q4N4j3JmrL3p8N2L7m2M1k7lk1L3J7k0j7J1J0j4n1N8l0J0j9K2k1J3
7261a8J6J6k4K3nLl6J7k0P0NJm1pN8o2J4L0J5l7j5M9l0j5nL4n4J1k9J8K5J8m7
7294b2l0J3J5K4j1N2o0k7L2J5nmK2jk3pL4l9M6n5L6nM7l7J4J4l8jPl0N0j4m1L3
$$ plain form
7057 -7 -37 -5 40 -8 13 19 -10 -36 29 23 18 -22 16 76 33 55 17 -9 -48 30 -11 -2 2 12 58 18 -23 -7 22 6 54 -43 -42 -37
7091 -37 48 -4 33 -21 26 -51 -22 -44 16 -17 0 -12 -7 51 -22 -20 -21 5 40 9 -71 -8 -7 -46 46 42 13 1 1 3 -20 41 -12 18
7125 18 41 -40 -20 -29 18 -24 6 42 -45 -42 -23 -5 -3 -41 9 10 -16 -70 -62 -16 14 30 15 35 36 14 26 5 -19 28 32 -3 10 -2
7159 -2 -18 22 -30 67 52 27 -8 -11 17 10 21 -66 -3 6 59 7 23 37 6 -42 -15 57 -14 -20 -38 -7 -31 5 -29 22 16 -45 11
7192 11 9 -28 -55 39 6 5 19 39 -11 -6 24 -15 -15 11 15 3 -5 -13 -9 -64 8 -4 -46 -37 22 -16 -19 22 -27 1 20 -33 -51 -16 -14 20
7228 20 0 -6 43 -41 13 0 1 -3 -12 21 -57 -5 32 -10 31 4 1 -20 13 30 10 -7 4 14 0 -51 7 -23 -13 -32 -10 -31 -18
7261 -18 -2 14 -10 13 8 11 -25 -8 -28 42 47 48 7 0 58 -4 10 40 55 18 3 52 22 7 2 36 -18 -7 -36 -18 7 25 -22
7294 -22 -52 -39 -24 0 -11 41 -19 -46 -14 1 -4 -8 14 13 -10 -17 17 -22 24 -31 5 0 47 10 24 38 0 -1 6 -24 26 12 -29 4
7328DNj7qJ1L6m7pK0kj7M2o5M1j9rN7m5K3J2J1p4N1K5J9p5rP5k4l3M1j3mnqM0
7363C2m4RK3o4L2l7M0j2K9k0l3mJ2J04j9p5j6K0N4k1j%J5M0rn0M4j0m4N7l3J9
7395C8n3L5jm2J5J5Qn1J4J5QMJom6J4P0J5p8l9J3M7rJ1nJ7K2m0J1j6J5l1L7j7
7429iNk2J7K6pKJK3m1L6Q3j19J3l1N4q9Q5k3o7N0L1k5K5k9J3J3PJ2l9Jo2O2Ro
7463aRRj8L8l9QK1l8L9Pj0N1j1Po8%k8L2k5M5o8oP9l8M6k4n0M4j7l0J2K0J0Lq
7498ALln0J5J6kK0Lnok2J6N2l7l1N7Rj8j2K8Jm1j7NLpN3j8k2RL0K7q7J1k6P4q
7535B1j1%k0pL5l6L2QoNQj6Po5N1O0o9J8J5jK0p8O9o8O8m7N7o7L8qJ3np7L0PM8
7571B9k1qj4J5LJ7k3k8J8K5oRl0Q7n6M1o6NjM5m1L6k4L5j04P2QPn7J6qL2J3o5
$$ plain form
7328 4 9 -8 -16 -5 31 -16 -23 -3 -5 -22 20 -45 -4 -23 -32 25 -20 3 15 26 -48 3 28 47 -28 -37 38 14 -19 22 9 5 0 -8 32
7363 32 -12 -3 20 -44 -12 -49 -9 -21 8 -12 -45 -49 -37 67 48 -27 -43 -23 31 10 9 9 24 64 55 5 49 39 -5 52 19 38
7395 38 -15 20 19 -23 -8 7 15 -36 -22 -7 1 5 6 0 -46 -32 38 53 -25 -64 -51 -4 -13 -2 -7 10 32 -8 3 -13 2 -29 8 -9
7429 -9 -4 -26 -9 17 10 12 13 36 -5 31 114 -5 8 -23 31 -58 27 4 -63 -13 18 -7 18 -11 2 15 22 34 -5 -4 -66 -4 5 -1
7463 -1 8 17 -1 37 -2 6 27 -11 28 35 25 76 65 72 4 4 -24 8 -17 28 -40 -46 33 -5 41 17 -33 11 -6 -36 -24 -4 6 9 1
7498 1 4 1 -49 -34 -18 -20 0 3 -2 -8 -30 -14 38 1 -30 27 36 18 6 34 35 -6 -23 -18 -15 -22 31 13 -9 0 30 57 -30 -19 -45 29 21
7535 21 10 10 -10 -17 18 -18 14 22 16 21 29 13 20 -45 6 66 -3 15 30 29 49 -29 40 -28 40 -7 50 -17 21 13 26 21 -56 -26 -19 29
7571 29 8 0 -14 1 4 21 -2 -30 -12 13 7 16 -14 73 17 58 -8 -3 -4 41 0 36 12 47 -57 15 23 30 -27 -11 -19 13 26 -39
7605c9J0L0l0O7p3L4K3l0j1l4O2j0l1L9k6N3k9L3J3Mo4N9n3nrL2j8qK4n0K7M2
7637C2l4k2O0k5Qk9k3j4J4P4p5o3N7pK0K1pLL0J2kj8J9l1K1k9oKK1l4M8J8pk0
7671A4qJ3nk0j1RPK0l8NkK5n4qQ3m7K3L0m8j4k1L1%j8M8n4N6j6L1M3o8k4NL7N5
7706G9p5RK1l3j7QJ5qRk5J5m4L2M0k4m7K7Pj9J8J0J1m2qJL5J8LLm8N8m5k1M4M
7741A1jK9m2j7L3m0J5M5k9Lm4N6j2OLLj3l5J7oJ6J0m4m7O9N3m7M3n2k7O7n1L3
7774Ej2M9l2m7Q0n7j8L8n1O9jjk6K1l9LO1m3J8rm3Q8m5j3PJk3Rk1L7m1K2J3n8
7808e9O5l2J3m3Q3m2O4n3m5Q2rn9j6R4m1KK%pM9m7kL7m6k7O2Pj0Nq3K2K6P7r8
7842b9N9k0k6K6J4o8J1N3m5qnK7Q%J1K3mk2RlM1j5%l6L6M5n4kj4oJ2k4l2J1L4
$$ plain form
7605 -39 -29 1 -29 38 -35 -1 22 -8 -19 -53 9 -1 -32 7 -19 34 5 38 51 55 -9 50 -3 -8 -17 15 -3 -11 13 -37 -10 32
7637 32 -2 -24 36 11 19 -10 -33 -47 -33 41 -34 -97 -40 -47 -27 -6 -13 -10 20 32 30 12 31 0 21 -8 -14 -12 9 -25 23 41 34 14
7671 14 6 19 14 -6 -17 -8 -1 19 -19 -14 -16 9 -45 -53 30 -17 6 36 -12 -26 -47 -16 -16 -34 14 -40 16 0 31 74 6 -18 -13 24 79
7706 79 4 13 34 1 -16 -8 7 -1 8 -17 -2 -46 -14 26 2 -45 -18 -11 -30 -12 -2 9 -33 -41 -40 -5 13 16 19 -29 29 -16 -37 7 11
7741 11 10 39 -3 -20 13 -27 -12 33 4 7 -37 19 7 13 16 19 6 -29 -12 -18 -2 8 -36 -83 -14 39 -8 35 -17 -44 23 -28 5
7774 5 -7 42 10 -37 43 -14 -32 6 -45 24 23 22 -4 17 -22 -19 42 -1 17 8 -35 53 8 -5 2 3 -20 -11 -32 5 -36 -14 -1 -59
7808 -59 6 -26 -13 -56 27 -15 49 -4 -49 33 24 -35 -51 43 2 4 6 6 -1 48 1 -1 36 -10 -37 25 32 22 27 -56 -34 -8 69 -29
7842 -29 30 10 -16 10 24 -44 -33 20 -25 -33 -38 -11 -3 -3 8 31 27 5 14 11 52 37 37 1 37 82 28 26 12 6 18 -6 -38 -27 7
7877GL9p2k4L1K5l1L0J1l8K9l7kK1lj5M9k2Oj0L2Rr3J08m8J0l6Q0k8k8k3NL7k0
7910al5O0m4k0P4l8j8O2j8j0m5N4n3QK2m9Q0q8R4m3rL1j4j6P1o5L5j5l8O4k2J7
7942C1M4n9k3K7nM0l8k2k6N1ko8K2N8mk6j4PK1Nj7j6j2K5j1J8n3O5lkm0N1l8P
7976gM2%pn2lQ3k6J2p8L5ork7N7m0K1rL1j4k9Ko8N9J6K2Ml5rL7MM5n5Pn0O6nP
8013B1p3Q2m4j5M4J4L7j22Q6K4r7N4k7k0PN6pm4M0O%l5L4kn4N7l8K5m6KL2%J0
8046Gl7koO5k1Qj1K5mk5kj4J7LM5m4L4k5kK7m9L2k3M5m1j0K1j7kRm7N5m2L5oJ7
8082A5o2M2nk6%N4j6Nk6L2m7RN7p2P5n0QPJ0K3J3p2O1o3RM4%o1L3l3KN6m3J0M3
8117C2o1L8k4k0PP0p0M1l0KM0k1J9p0J08j01O1j1K5n0j0j4Q9p2L5Qp2R0m0K1j5
$$ plain form
7877 7 46 -26 -50 -19 6 -25 5 16 -22 7 -30 -32 -11 -14 -29 20 -2 4 -6 26 35 -58 50 2 12 -24 56 28 0 -23 -18 19 -1
7910 -1 -36 24 -20 -40 34 -4 -22 40 22 12 -33 21 -32 -24 -2 -51 29 -59 35 -8 -17 14 0 -16 55 -10 25 10 -28 36 14 31
7942 31 75 16 -7 20 15 55 17 -5 -31 20 18 -50 -28 30 26 0 -14 -7 14 19 2 -14 -26 -1 -12 6 -47 18 15 13 -27 24 -14 -7
7976 -7 35 35 28 -24 -27 56 30 42 -36 -1 -7 -16 -43 14 -26 -5 -14 17 3 -26 -24 -92 -33 -17 5 9 -26 -35 2 6 51 -4 3 -47 19 14 21
8013 21 -52 30 -14 -29 15 29 66 -56 30 54 -43 11 -16 -36 -29 27 20 -24 16 22 22 -13 21 19 -35 22 -16 9 -37 -35 -3 -3 7
8046 7 -30 -32 -38 27 6 14 3 28 24 -1 -3 -17 0 3 48 4 38 13 11 38 -11 21 -2 43 2 -8 13 -4 -6 3 -44 11 -31 4 -2 15
8082 15 -47 -5 -10 -36 -36 18 2 7 -19 13 -34 -25 32 -40 35 -15 -7 0 10 33 46 -26 35 -28 -19 25 25 -36 -3 -36 -34 22 -21 -11 32
8117 32 -29 9 -15 -35 -28 42 -28 13 -17 -15 25 4 23 -47 61 -40 21 10 35 -15 -25 -39 50 -22 13 21 -51 39 -1 20 5
8148EPJ3j7m4M3K6n6L3o0nO5JJ7J4k4Jl2K3J7ll1k8K0L9n0K3MqM3m4j5NM4j8p0
8183f2J11p1M6j7J0m8j5M4
$$ plain form
8148 5 12 25 8 -36 7 33 -23 10 -50 -55 10 11 28 42 18 19 -13 10 27 24 -7 -35 -15 24 -26 -3 1 -7 36 -8 -23 -18 26 8 -62
8183 -62 49 -22 24 7 17 -31 -46 -2
8191b
$$ Imaginary data points
##PAGE= N=2
##DATA TABLE= (X++(I..I)), XYDATA
0@%%%%%%%%%%%%Qj6J6j6K4l2M0m8N6p0P8q8J06j30J52j76K06k36K69l05L46l92
34b08M46n05N67o34P08p93Q85r85J095j214J343j483J638j809J995k196K419k667
52a398K937l237L573l949M375m861N419o073O846p776Q924j0381J2304j4964J8912
67A0651k5455L8835j10763J79016J3853l01518K67395l031j99363J64788K4879
78E9287j42342J32554n0695p5485J59650o7399j17502J82710m8142j36827J60545
89E6354N332j40984J03506J5151q3200O9516m935m7426N8909m0292j9121P4543
101D7353m1565l6154M7572j3849o774J1511q507J0569k4866l167N5422l6576l5921
114c4952N5219j6087l0599M9741j7114l5841M4438j1845k6750N0006k3459l9193
$$ plain form
0 0 0 0 0 0 0 0 0 0 0 0 0 0 8 -8 8 -8 16 -16 24 -24 32 -38 40 -48 58 -72 80 -96 110 -126 143 -162 184 -208
34 -208 238 -267 300 -334 374 -419 466 -519 576 -638 705 -778 860 -949 1046 -1150 1269 -1398
52 -1398 1539 -1698 1875 -2074 2301 -2560 2859 -3214 3632 -4144 4780 -5601 6703 -8261 10651
67 10651 -14804 24031 -86732 92284 106137 -195381 72014 68983 -130380 34408 59287
78 59287 -83055 49499 -1196 -76681 82969 15570 -101932 80778 32636 -104191 56354
89 56354 61686 -79298 24208 39359 -43841 25675 20740 -26686 32223 -8069 -27190 47353
101 47353 5788 -30366 17206 3357 -3417 8094 -413 10156 -14710 -17877 37545 969 -34952
114 -34952 20267 4180 -26419 23322 6208 -29633 14805 2960 -23790 26216 2757 -36436
126c6436O0446j4758m2132N6524j3520l9282M3394j2212j4344L5099l3106n586
138a5913L8712l3785K129L5508l8846o669L4986j4722n784R266j4290O433R344
151F369j2255P997L014k2155J3015K0111k4009k215J8399j4766q70J4131p843
164a077q42j280k409J2793p802m979J4864j2280o017J9115m393r533O081R36l421
179b44M87J0327l140j8943J4638J3861k3623O659J8357k6702j003K9969j5955
192D688j6671K0760l981j3718J6217j540j2324R369n441k176J5508j5451o326
205a1086K1443j5800p607K5247j3476j3977J9270n145p824J4053p392q275J2907
218B338l857o423J3939n116j5522J6274P473j8450O890J1391j6664J423J7069
$$ plain form
126 -36436 24010 9252 -32880 23644 10124 -29158 14236 2024 -12320 22779 -10327 -15913
138 -15913 22799 -10986 -8857 26651 -12195 -18864 16122 1400 -4384 4882 -9408 -2975 6369
151 6369 -5886 2111 5125 -17030 -4015 16096 -7913 -10128 8271 -6495 -7365 6766 -1077
164 -1077 -1919 -3199 -5608 7185 -617 -5596 9268 -3012 -9029 10086 5693 -3840 2241 3177 -244
179 -244 243 10570 7430 -11513 3125 16986 -6637 22 18379 -8323 -9326 20643 4688
192 4688 -11983 8777 4796 -8922 7295 5755 -6569 2800 -2641 -4817 10691 -4760 -11086
205 -11086 10357 -5443 -13050 12197 -1279 -15256 4014 -1131 -8955 5098 -2294 -10569 2338
218 2338 -1519 -7942 5997 881 -14641 1633 9106 -9344 -2454 8937 -7727 -6304 10765
231A0765r717p863J0407k125m655Q413k258o586O946k263m305J1357m970j1463
245h317J3836l44j2690J4171j37j6287J2298M511j2736R275J532j3227J0044M485
259F414j1558P347K809j2580Q056P856j2711L048P456j1067K845J0692j0351k473
273d217R800p239j605J0570p099n765R816l539m926R892m363q269J0009o25p822
288e382Q985j556j0340R972J640r758Q107P9j0517R759K349j0702Q349N91j0969
303i393J0539K985j2314P972L487j2003Q706O092j2741M439P017j0029L949P952
317F658j0269Q86P768o975J356O948p995l80P835n925l93P361o985k875R628l985
333B658n426Q867l244p700J0077J36r858Q214O69j0646J0145K392j3295R208L746
$$ plain form
231 10765 1048 -6815 3592 1467 -3188 5225 2967 -3619 3327 1064 -3241 8116 3146 -8317
245 -8317 5519 5175 -7515 6656 6519 -9768 2530 7041 -5695 3580 5112 -8115 1929 6414
259 6414 -5144 2203 5012 -7568 488 8344 -4367 -1319 6137 -4930 -2085 8607 -1744 -4217
273 -4217 5583 -1656 -3261 7309 210 -5555 4261 722 -4204 5688 1325 -6944 3065 2440 -5382
288 -5382 3603 2047 -8293 1679 3319 -6439 1668 1747 -8770 989 3338 -7364 985 1576 -9393
303 -9393 1146 4131 -8183 -211 3276 -8727 -21 6071 -6670 -2231 4786 -5243 -1294 6658
317 6658 -3611 -2725 5043 -1932 -576 6372 -1623 -2003 5832 -93 -486 6875 -110 -2985 6643 2658
333 2658 -2768 6099 2855 -4845 5232 5368 -4490 3724 4393 -6253 3892 6284 -7011 2197 5943
348E943j4697J0326P002j7665P438R709j6459O522J0571j7128M978J0849j5880
361h491O996R894j9087P836J2500j9623P048J3668k0740M890J5758j7629K407
374d573J3748j6164K432J3968j5306J928J3420j5891J196J5714j4564j802J4640
387H746j2031k069J3003r379j983R277q921P40R907r805j810J0506o924m089J0656
402E824l672p793P828J375n720L626j61k676M307k871j492O532n169l810Q739
417D867j717p062N584L257o648k46N997k172l872L014L08j366P80j303K074n04
433I91n213N397L121q256J728M780m347J04K541k014j061R46Q86l05n51r85J37
450b101K798j810k579M062o91k766L084q92n52J758k102J271J312k803J977J718
$$ plain form
348 5943 -8754 1572 8574 -9091 -1653 8056 -8403 -1881 8690 -8438 -3460 7389 -8491
361 -8491 -1495 8399 -10688 -2852 9648 -9975 -2927 10741 -9999 -5109 10649 -6980 -4573
374 -4573 9175 -6989 -4557 9411 -5895 -3967 9453 -6438 -5242 10472 -4092 -5894 8746
387 8746 -3285 -5354 7649 -1730 -3713 5564 -3357 -2617 7290 -2515 -4325 6181 -743 -4832 5824
402 5824 2152 -5641 2187 3562 -2158 1468 1307 -1369 2938 67 -1425 5107 -62 -3872 4867
417 4867 3150 -3912 1672 4929 -1719 -1965 4032 1860 -2012 1002 1310 -56 724 -579 1495 991
433 991 -4222 1175 4296 -3960 -2232 2548 -1799 -1695 846 -1168 -2229 -1283 -397 -702 -1253 -2238 -2101
450 -2101 697 -1113 -3692 370 -321 -3087 -3 -895 -1447 311 -1791 -520 792 -2011 -34 1684
466A684j907j367O60M771k472n640O607J501o816M042L562n578j178M790K032
481D691n381k091O298N0m927P38M173j127o181M662O420j0946j067J2717o831
496A198p226Q289J204m803n09K625J199l911M48M295k855l459K540M424k752o445
512e738O038L780q002K684M269o132R97M002j806j561p77K349R30k358O10p14
528a429Q46K171l848Q67L071l659J096K084k490K47J19J951K08m861K837M014
544C224l875j276J762J457j041k242M409p78o039N907L325o377p53M033J424l392
560b32j240M743k213l210N167o06l291Q13R83K794l407l736P137j95p060M217
576F64L157n112n77M959j116o306M179M707o618l71L890k372R43k62j603K559
$$ plain form
466 1684 -223 -1590 -930 3841 1369 -4271 2336 3837 -2979 1063 4625 -953 -2131 2659 4691
481 4691 -690 -2781 3517 3567 -1360 -622 3551 2424 -3757 905 7325 -3621 -4688 8029 1198
496 1198 -6028 2261 3465 -1338 -1847 778 1977 -1934 -1486 2809 -46 -3505 -965 3459 707 -5738
512 -5738 300 4080 -3922 -1238 3031 -3101 -2104 1898 92 -1469 -2246 103 1033 -1325 -715 -1429
528 -1429 -583 1588 -2260 -1393 1678 -1981 -885 1199 -1291 -1044 -925 1026 1234 -3627 -790 3224
544 3224 -651 -1927 -165 1292 251 -1991 2418 1640 -4399 1508 4833 -1544 -2297 1736 3160 -232
560 -232 -1472 3271 1058 -2152 3015 2409 -882 -69 914 3708 301 -3435 3702 3507 -3553 664
576 664 3821 -1291 -1868 3091 1975 -4331 -152 4555 -2063 -2434 1456 -916 27 -235 -1838 721
592G21k649O8M435m520j873M865p72k333Q35J004r80l93K487j860j899L884j257
609b37j626K613j878l6K485k002j20Q84l60J304j191n79J386l73P31p49p45J862
627A369j553M72K399l801J78L947k447j213J907o28n73P95N67j345l45J737r69
644D97k72R21j879J521J020l148J856Q79k413J856n4j904J927l97r72J184r27
661c05n50J510k8j800L27J867j664o83K262j786r12K744j381j085J522j057L57
678f62Q33j328L81M59n71L07K6j01j5l3N68n52P3N22m30N11j91o80J524l75j373
699a107J711l8j263J234M67j241J39J235m50p80R29L8o94Q68r6o79P81n47k4R59
719A442j066j70J103r02k69R75o47l87N44k50l29L66j72l80L96k98l76P23m02
$$ plain form
592 721 -1928 -1860 2575 -1945 -3818 1047 275 -2058 -1223 -219 -1199 -1592 895 -965 -2864 1020 -237
609 -237 -1863 750 -1128 -1164 1321 -681 -801 83 -277 1027 -164 -743 643 270 1001 252 -493 1369
627 1369 -184 288 2687 -1114 -936 3011 564 -649 1258 630 57 852 1419 74 -271 1466 497
644 497 225 1146 -733 788 1808 -1340 516 1395 -1018 838 784 -1120 807 410 -562 622 -305
661 -305 -855 655 627 -1173 -846 1021 -643 -1326 936 -850 -1762 982 -399 -1484 38 -1019 -662
678 -662 171 -1157 -776 -317 -888 -581 -555 -656 -671 -704 -136 -688 -615 -93 -523 -12 -203 -883 641 266 -1107
699 -1107 604 566 -697 537 1004 -237 -98 1137 687 -93 836 874 180 1048 952 273 1054 507 483 1442
719 1442 376 206 1309 407 138 1113 466 79 623 373 44 410 238 -142 254 -44 -420 303 -99
738i9p71R55j61r30Q87j06p86O31P0m30J55L8k07K47m7k00K81m6l06M25J72n04
760g32K54L40l72N6L08m0j67M3K63Q9l50K97L12n85K55N53m98l1M84k84k5M36
782F06l09k0K78k83K10J68m40L18K20p52N92M30j173M49R48j353K17J247j452
801i9j0J293j052k90J071r85l8R89j189J65J017j400m7J547j360n51J699j055
819b95p49J515r01n73J377j172k71J655j568l88K032j498q08K188q62j298J628
836A2o9j187J085N5r26J087k03r50J640m74j529K075J76k149J765O63j984J130
854B17P91j225M73M27o17N01J03p83P86M63j326M23J314j514j25J592j321l08
872a29J341r46JN21r78P78L59j331N90M20o47l2L83j24n92L33M25n96j28J29l8
$$ plain form
738 -99 -870 85 -76 -1006 -119 -225 -1011 -380 -310 -740 -585 -547 -754 -507 -554 -754 -473 -519 -825 -400 -228 -732
760 -732 -478 -138 -510 -454 -146 -186 -353 -310 -47 42 -308 -11 301 -284 -29 524 26 -5 479 195 170 606
782 606 297 277 555 272 482 650 210 528 748 -4 588 1018 -155 294 1242 -111 106 1353 -99
801 -99 -109 1184 132 -158 913 -72 -110 879 -310 -145 872 -528 -575 972 -388 -939 760 -295
819 -295 -1044 471 -430 -1003 374 -798 -1069 586 -982 -1370 662 -836 -1644 544 -318 -1616 12
836 12 -57 -1244 -159 -104 -1030 57 -146 -1096 544 70 -1459 616 792 -1357 408 1071 -913 217
854 217 1008 -217 256 683 66 567 670 -113 673 1136 -190 233 1547 33 -92 1500 179 -129
872 -129 1212 266 267 788 -190 588 947 -384 206 626 -21 -53 330 206 -386 -53 372 -224 -352 -223 -261
893b61O38j009l19J575j104n84J399p48n53P38Pm6p75L71J104j004m16P76lk9
913b43o86O66P10j814J034J671k545J49K077j108m27M64L4O2m3J81l6j12Rl1J037
934A049p97j520K730j98k746K696o3k275K485k57k052J835p4r75J158m54j052
951e10J170Q60j940k7J969j781M3J952k680K99K601k950Q55J578l329J970J855
968A935l630P82K115j890k9J095r70n63J303j02j050Q39o82l8K144k532q30L757
986A654k348j123L303k499n92K833j649k55O10p59J415j40j627J033Q86q96j40
1003b94R85o17j179K347j65k395J901K18j125J591j300n18K072j493J14R72j675
1020e61R43R05j188P9j41M95L86j013M68k70k17J326j185n35J116p01M05K11j078
$$ plain form
893 -261 377 -632 -951 624 -480 -1064 335 -413 -966 -228 -221 -267 -1042 -671 433 -571 -987 -211 -214 -243
913 -243 -929 -263 447 -1367 -333 1338 -1207 -1058 1019 -89 -516 -52 -18 44 1 182 146 34 43 12 1049
934 1049 252 -1268 1462 1264 -1482 1214 1151 -1124 1361 1104 -948 887 813 -162 996 542 -510
951 -510 660 1520 -420 -447 1522 -259 -216 1736 -944 -645 1956 -994 -139 1439 -1890 80 1935
968 1935 -1695 -913 1202 -688 -717 378 -592 -1155 148 46 -1004 -165 -847 -885 1259 -1273 -2103 1654
986 1654 -694 -1817 1486 -1013 -1605 1228 -421 -676 -66 -825 590 450 -1177 -144 742 -154 -294
1003 -294 691 74 -1105 1242 1077 -1318 583 801 -324 1267 -33 -551 1521 28 142 1114 -561
1020 -561 382 1287 99 178 37 532 918 -95 373 103 -114 1212 27 -508 608 -93 312 523 -555
1039e55M19K29L32l35j094J097J20p21R09j163q7J604j527L73O97j802J541P49
1057G86k202Q75O59p36M66k02j70l1L19N37q85q7P20m50O33l08r42J448k90n41
1077d01Q28q18J70Q46n62J02l56K15J014j146K81N04j188J347L5j476J310o0q37
1096a92J295q37p01J360l70n63M79j78l20N65L05j276L80R99j292M00Q40j838
1114i44J016J058k154J033N17j596J454Pj631J337J14j069Q36o8p31O00M47q78
1132f52j04Q85o75o4J007j316J27J395j345J55J070j348M84R53j302L17P97q07
1150d23K61M78o18K8P34l13n30Q25j68o79J098l81q10J239l50o90J189o41n11
1169b62J213o92m50R77m24m43Q01l27n33O85l1o89N43J92q59P21Q7j001Q88J3
$$ plain form
1039 -555 -136 93 425 90 -1004 93 213 -508 401 -762 -849 755 -772 -399 298 -1504 37 786
1057 786 -1416 -541 118 -618 -152 -354 -524 -555 -236 301 -584 -671 49 -401 232 -76 -1018 430 140 -401
1077 -401 427 -391 -221 625 63 165 -191 24 1038 -108 173 677 -511 836 871 -605 705 645 -192
1096 -192 1103 266 -435 925 555 -8 471 293 -27 538 843 -433 -53 946 -346 54 894 -944
1114 -944 72 1130 -1024 9 526 -1070 384 391 -1240 97 211 -858 -22 -90 -821 -221 226 -652
1132 -652 -756 129 -546 -610 397 -919 -792 603 -742 -587 483 -865 -381 572 -730 -413 384 -423
1150 -423 -162 316 -302 -274 460 147 -383 442 274 -405 693 312 -498 741 391 -299 890 249 -262
1169 -262 951 259 -191 786 362 -81 720 393 -140 545 514 -175 368 560 -299 422 509 -492 396 409
1189D09q68P05O3q69P48jo31M94m6m50L81M2l45J92J07l62J29J91k92rL91l36
1211c57j14L50j68j59K15%j99K02Q9k31J70J53k22R5K87l63Q3L91m29J04M46m70
1233a27O1N62n47k1N73m72K7N03m00j48N67l89j12N70m71j37N62l65j86O13l89
1254B74l35O77m23l14O24k80l82N75k49m18O22k41m51N56j04n38N47l9n27M11
1274a5M9n05M38j9m22L95L0n08L98R8m47K70K17m96K51K58m21J58K11k94R4J95
1296f5k43O3K71l27N3M05m16K6M42k77K0K78k86Q5J84j80L0K24k28M6K47k11q3
1319E8L33j61j58K88j22j22K83j44j08K51k62K2L20m00M7K61l02J2M5o1L8l6N2
1342A34p5j53K01j25m9Pj12J87l2k62J66n1r9J10p7J2o6j02M34l47k60O25m22
$$ plain form
1189 409 -459 246 309 -560 188 187 -444 50 4 -446 -65 -23 -368 -176 -69 -431 -302 -111 -403 -412 -21 -357
1211 -357 -471 -121 -289 -448 -233 -233 -432 -230 -141 -372 -202 -49 -271 -176 111 -252 -169 222 -207 -103 343 -127
1233 -127 -66 496 -51 -72 501 29 56 559 159 11 578 189 77 647 176 39 601 236 50 663 274
1254 274 -61 616 193 -121 503 223 -159 416 167 -251 371 130 -321 235 131 -407 140 101 -426 -15
1274 -15 34 -471 -33 -52 -474 -79 -49 -557 -159 -61 -508 -238 -21 -517 -266 -8 -429 -271 -60 -354 -260 -65
1296 -65 -308 -245 26 -301 -248 157 -259 -233 209 -68 -48 230 -56 29 213 33 63 287 59 105 352 141 58
1319 58 391 230 72 360 238 116 399 255 147 398 136 158 478 78 125 386 84 96 141 80 118 82 134
1342 134 59 -94 107 -18 -67 -60 -172 15 -17 -279 -113 -164 -263 -153 -230 -218 -284 -386 48 -299 -559 66 -356
1365c56M6L59m91J03L65l89J44J26j61J73P3j16j37J62K52l88K17J81m32M73J38
1386C42p10N84L2m70O47k20m12N05N6j91j0J00O7j74L25j21n45O27j15l64N42
1407D95m89j10Q68p30j85O19n05J15K53l82k0J19J29j18l18L30j42n0L20o53J74
1428b80M87n75K91M7o47P49l8m82L71l38K36K89m91J42l0j10N35m28j54L39j99
1449b86L61j74l56M36o0P4J28n58M31K25l38M18m50j7O84n14P7J48m48O94q9n24
1471a38L67j98K30J95m77K14Kp4N08o07j27N86m07K37j16m05N32q4j93K55n87
1492b87L65K42m57K27k76QO04o54l9K97m29N57o1o31M76j31PL26o26J60L24k27
1514b25L19n42L4M79l15J68n6m41O99q8m00L98l66J83M33n96J80N5j29N23m01
$$ plain form
1365 -356 -310 49 -442 -339 26 -363 -219 -93 -254 -81 -8 -124 -261 -99 153 -235 -18 163 -269 204 342
1386 342 -368 216 248 -222 425 205 -207 298 354 163 153 253 320 146 471 350 -195 432 317 -47 495
1407 495 6 -104 764 34 -151 468 -37 78 331 -51 -71 48 177 59 -259 71 -71 -121 199 -454 -280
1428 -280 207 -368 -77 -30 -677 72 34 -448 -77 -415 -179 110 -381 -239 -269 -379 156 -272 -426 -87 -286
1449 -286 75 -99 -455 -19 -79 -5 123 -435 -4 221 -117 301 -149 -166 518 4 81 229 -219 475 386 -138
1471 -138 229 31 261 456 -21 193 195 121 629 22 -105 481 74 311 195 -210 322 238 45 300 -287
1492 -287 78 320 -137 90 -186 -178 426 -228 -267 30 -399 158 97 -534 -58 -189 -182 144 -482 -322 2 -225
1514 -225 94 -448 -414 65 -250 -82 -138 -579 120 32 -368 30 -336 -153 280 -316 -136 -81 -210 313 -88
1535h8o6K96k23L34q4l82M59j58K3J91m75L52K04l63K88k34j81O12l58l5J80m02
1557a10M62mm26K53j15O7K79m55Q6Q1n0K08l68n5L11k42J74j11l75M85j13j47
1579a65K04l44K25K55m73K03o6k24M82k75j52K51j99K16j6k69J27N6N2P8k61J42
1601a53J03r6J59j45p5L21k65J78jk76M09l2k76K84j99L5L75l19K8J60j60J90
1623B45r7r6J72q3R0n4p4J95j53L6J73l90K45J0j82J32j29l2K04j77o7J66j83
1646d9J35%k22J35%p3L0n3l4J9L4m3n8k4Q8m4K6m6j02K05p8nP9j33M0J70j76K
1674a77J22j36J30J3j02O9L7l9O3M4l4n2J40p9j6J43q6KP0r3k4J82j05M1Q2j18
1700G7K1P4q9J1L7l2K1O2l2j0M3q2LQ3j08l2J83j97j5R1j18l7J35j45L3Q5j50
$$ plain form
1535 -88 -154 142 -81 253 169 -213 246 88 111 302 -173 179 383 20 308 74 -107 505 147 112 292 -110
1557 -110 352 348 -78 175 60 127 406 -49 37 118 68 276 -92 -147 164 -78 96 -15 -390 95 -18 -165
1579 -165 39 -305 -80 175 -298 -95 -161 -385 97 -178 -330 -79 -278 -62 -78 -347 -220 -164 -112 -34 -295 -153
1601 -153 -50 -146 13 -132 -207 114 -151 27 26 -250 159 127 -149 135 -64 -29 346 27 55 215 55 245
1623 245 148 52 224 141 231 177 103 298 145 181 354 -36 209 219 37 169 40 8 212 35 -32 134 -49
1646 -49 86 86 -136 -1 -1 -74 -44 -97 -131 -112 -78 -121 -179 -203 -115 -159 -133 -179 -281 -76 -154 -159 -80 -213 -173 -3 -179 -177
1674 -177 -55 -191 -61 -48 -150 -81 -44 -83 -20 24 -10 -62 78 -1 -17 126 40 42 112 19 -5 177 72 113 195 77
1700 77 98 172 83 94 131 99 120 182 150 140 183 101 104 187 79 47 230 33 18 109 -9 -46 89 -56 -23 62 -88
1727h8k0J37j28mQ2j62Q6j1Oj08R7j1l6J0j3J3O4l2k3M1m9j7L3N2onj7L5kk0Q3
1758a3n7LN2r5J25N7q4N5N0m0l1R8o6m8J36n0J9J7p0N4N9q8L9J28j16KK7o1p4
1787B8J85j30NN2j16J08n6l3M6o1p6J18o6o2J7M2l6j5l3mJ6j4p0N3O8j68N7Q0
1815f5j69J69Pj34J00j3n2Q5Nk8l9%J00j04kJ38j53J65Jj70J79jr3J39r9K0J31
1842A17j43J25k9p4J76j46J9R5j67J38J46k86J50k5l5J14j24NR6k0N3j52l1J26
1866A28p6O6l7j60J96l0r9J22j52k5K18j94k6L5j74K65j66j8O5j10J36L0k63K27
1890d2o0o3K46k88j4K41j74J38j51r8K43j07O0N4k48K86Q5k44J11r2K7K70k42
1913f2rJ38j64K38k6k17J92n3Q1Pk09K51o3k7J53k63J9K89j63nk1j15K43n7j54
$$ plain form
1727 -88 -108 29 -99 -103 -21 -183 -97 -108 -102 -210 -113 -124 -160 -150 -163 -150 -86 -118 -141 -100 -149 -166 -133 -81 -87 -92 -109 -74 -76 -96 -13
1758 -13 -70 -67 -15 -110 15 72 -12 43 93 53 22 120 54 6 142 92 111 128 58 112 171 83 122 250 134 136 163 102 28
1787 28 213 83 88 140 24 132 76 43 89 28 -48 70 4 -58 -41 1 -35 -50 -83 -87 -71 -85 -155 -102 -34 -202 -145 -65
1815 -65 -234 -65 -58 -192 -92 -105 -157 -72 -67 -95 -134 -134 -34 -138 -140 -2 -155 10 11 -159 20 19 -74 65 -34 -14 117
1842 117 -26 99 70 -4 172 26 45 140 -27 111 257 -29 121 96 61 175 51 56 152 132 185 33 2 128
1866 128 52 118 81 -79 117 87 -12 110 -42 -67 151 -43 -69 -34 -208 57 -109 -127 -62 -172 -36 -6 -269 -42
1890 -42 -102 -165 81 -207 -221 20 -154 -16 -167 -265 -22 -129 -69 -15 -263 23 108 -136 -25 -117 -90 180 -62
1913 -62 -71 67 -97 141 115 -102 90 37 118 125 -84 167 104 77 230 -33 -14 275 112 107 86 -29 214 157 3
1938CJ32j52J58L7k28K14k10J09K14l76oK24k11K37j53j77K21j54J32Qk93K31
1960d0P7k30K06k12K3K63l04J06L0j76L39j42k22J74j11J67J20l70K13K7MJ31
1982G3k26K6K33k01J48j15j59M00j04p5J06k55K57J03k48J55j19Q8J97k78O7K3
2004I6j12K55j51j56L13j87J49j7k91K42K1j40J64k25J1K29j86N6l3j23K75k03
2026a3l3Q0k41K56J07l68K04k0q8J82j61r7J93j46R4K0k02J90J5q0Mj05J25j0
2050i4k9P2k15J71J52k10R6J9j57K52k8j79J90l5l3J39j79PJ55r4J08r3oJ07n5
2075F1J46j65j6J76j23k7J22j46O2P2j46J29j04j0J11j65J08L8l5K6o7m2O8q2
2099iN2M0j09J00n7k1M1j33M7j4m0P5l2p4J70j16l9N6r2P2M7j00KL6JK8m4j0Q1
$$ plain form
1938 3 135 -17 141 178 -50 164 -46 63 277 -99 -105 119 -92 145 -8 -185 36 -118 14 22 -271 -40
1960 -40 37 -193 13 -199 -176 87 -217 -111 -81 -257 82 -60 -282 -108 -219 -52 68 -302 -89 -62 -58 73
1982 73 -153 -127 106 -95 53 -62 -221 179 75 0 106 -149 108 211 -37 118 -1 87 284 6 73 96
2004 96 -16 239 88 -68 245 58 207 190 -101 141 162 22 186 -39 -28 201 15 71 38 -85 190 -13
2026 -13 -46 34 -207 49 156 -212 -8 -28 -116 66 -95 -192 1 -145 -51 -31 -233 -43 -28 -108 -104 -209 -84 -94
2050 -94 -123 -51 -266 -95 57 -153 -57 -38 -195 57 29 -150 40 5 -28 111 -68 -61 94 0 108 15 9 116 61
2075 61 207 42 26 202 79 52 174 28 90 162 16 145 41 31 142 -23 85 123 88 114 47 5 73 -9
2099 -9 43 83 -26 74 17 -4 37 -96 -49 -63 -103 -28 -60 -134 36 -80 -119 -63 -155 -83 -36 -136 -134 -98 -97 -69 -113 -123 -42
2128d2p5R5n8m0J28r7N1K3l6P4k3m4N6Nj7Q6p0k7P4k2P5J1j04N5mqP8n0p8M9M9
2159A14l2K4o3J4j1K0j5O4m0Mr1P0o1k7Q2n3rR7r3L0L4j34M8Ln1L2k9M4p6K3k8
2190a10rQ9r7L5K0m1Okj9L8J0j9M2n4K5L4l4NL9mN4k1L0l3j2lL6O7J9r9K3J0j8
2223GP8m7PM1l5k9R9j3kk6mL8l6KN6m6m9M4k6j1l1N4j9pMMo7L0k3M5o0M3m7oN3
2258B1o2J2k8LL5r2K8O0q5O1n4mMQ1m4nML5n1OK1k9M6k4%M3l5l0Q1n0O7L7j23
2291g1P6M4q7J07l6J0L0m3Q5k7j00J12k6k6N3r0N5M8l1Jk6QJ10j02J6Qj03R9n
2320H9j05J21j27J8J01r0K1K8p1O9q8Qkn8J33l8j25Q3k8RK9q6L7O1l8K1o8jJ03
2349Fj20QP7j03J17l7q6R2o4R7M3j20J1J39j00J27j02l9J58q2j9N0r8J45m0n6
$$ plain form
2128 -42 -117 -22 -80 -120 8 -89 -38 -15 -51 23 0 -44 12 17 0 86 16 -11 63 41 116 127 23 78 74 66 144 94 16 65 114
2159 114 82 106 43 57 46 66 51 115 75 79 -12 58 -3 -30 52 -1 -10 87 -6 24 58 -76 -28 -25 -76 -44 -73 -29 -105 -82 -110
2190 -110 -119 -30 -127 -92 -72 -113 -107 -109 -128 -90 -80 -99 -57 -111 -86 -52 -86 -81 -42 -46 8 -13 17 -16 -28 -31 5 72 91 -8 15 25 7
2223 7 85 38 45 86 51 22 121 108 106 80 76 114 78 80 136 90 41 85 59 48 17 71 52 45 49 53 -14 16 -7 38 -22 21 -26 -32 21
2258 21 -41 -29 -57 -54 -19 -111 -83 -23 -108 -47 -101 -105 -101 -20 -64 -69 -65 -30 -81 -75 -54 -83 -37 -61 -61 -18 -53 -83 -2 -52 15 52 -71
2291 -71 5 49 -38 69 33 43 73 30 115 88 -12 100 74 48 101 11 66 114 83 84 58 66 176 74 90 98 -5 94 89
2320 89 -16 105 -22 -4 97 7 28 56 -15 54 -34 -26 -28 -86 47 9 -116 -33 -61 -52 -23 -109 -72 -11 -49 -28 -96 -97 6
2349 6 -114 -106 -29 -132 -15 -52 -138 -46 -110 -13 30 -90 -79 60 -40 87 -15 -54 104 22 3 53 -45 100 60 4
2375DJ34j31QQ3r9R8k6n3J32j00j4J02j62J58l2k07K08p2J5Q8k30J30P8j59J04
2400E7r5m9J81j05K6J2q3Q5K0j98J14n0O5O9k04Q6J8j30K77k32rJ60j61J42n1
2425e5j71J80K4o0J05j56K3K22j69N6p2J0J59j28K5m7n5J91j2j22R9m2J1J49k22
2450e7J19J7n4J54j78RJ53j13K5J2j30J53L4p6M7j67R2J08j33L9l3nJ31j52nM9
2476C9p4J39p0j53J59m9K4M7k20J12J27n0k2j65J9J86j42J8L5j19K18l9j16R2
2500dj08P6L7j51R1Kn3J46j22l2J41p5O1K1j42J82l1l6k2l4L7J45j77J07r3J5
2526a9J03q9L4L2j00J75lj60J27l0J0Q5j68M4P8o3K7mj32J34j4n5J3p8J21n9m2
2553c3J08j11L3K6r5O5n1JN5Kj06Q9p1O0L6j03L7L0n7R5q0RJ6qj1o6j6R8L8n9
$$ plain form
2375 4 138 7 15 98 -1 97 71 18 150 50 36 138 -24 134 102 -105 103 31 46 134 -96 34 112 -47 57
2400 57 -38 -87 94 -11 15 27 -56 29 49 -149 -35 -85 -20 49 -155 -69 -51 -181 96 -136 -145 15 -146 -4 -55
2425 -55 -226 -46 -22 -82 23 -133 -110 112 -57 -1 -73 -63 96 -32 -7 -54 -109 82 70 -52 47 5 16 165 -57
2450 -57 62 79 25 179 1 10 163 50 75 87 -43 110 144 68 115 -52 40 148 15 54 21 16 147 -5 -10 39
2476 39 -35 104 34 -119 40 -9 15 62 -158 -46 81 31 9 -156 -137 49 -93 -75 -40 -159 59 20 -96 -4
2500 -4 -112 -36 1 -150 -59 -57 -110 36 -86 -118 23 -52 9 30 -112 70 39 3 -19 -53 -16 129 -48 59 -34 -19
2526 -19 84 -5 29 61 -39 136 133 -27 100 70 80 165 -3 41 119 56 83 79 -53 81 67 12 25 -53 68 9 -33
2553 -33 75 -36 -3 23 -72 -7 -58 -57 -2 0 -106 -17 -88 -28 8 -95 -58 -28 -85 10 -70 -61 -45 -53 -64 -130 -146 -48 -10 -69
2583f9N1l3M4Rm9N4p8K3O9q6J00Ql1J0k0K4J7j8K4Rn2O7j2j9K6Kn1M8p4M2L5k5
2615D5P7p7jK9p6ON8m0j2L0l2L1j1l2L7k9j7KjJ2j4ml5K1k2L9J1l9o2Q1m5oM2
2648c4l4j7OJ2J7KJ4n7M5K2n1N6m4k1J6L3k8P4j7JOk8J6j3K5k4J5M0k2J8J9K5
2680G2k5K9l6k6Q3j00N3M0p4nM8MJ6l1K2j6oj1j5l1N6K8l6m2LPJ2jk8n0J5M6n7
2713e6l4P3nL5l1Nm8PJm0MM1l8K6k3L9j2m0K6N7k7J8J3k9NNj6J2JJ4K0k5lJ9J6
2748A0jn3K4N4k2L9oj7QL6j9k4L3J9q4O7Rn4O0l2o2O6m7O0k0l8L7m4j0M1m8kR2
2781G2q6M5l2MN7n3q8Q2r0R2j3j8K2o1J6N7m9Rk4K0J2p1K3M1o8J03kp1k4Q6q9
2812i8L6n3K3P9k5Q3j02K2J26j08J1J0o9J06K6j08M7M9n7K2m1K2M9OK1l6n7M1
$$ plain form
2583 -69 -18 -51 -7 2 -47 7 -71 -48 21 -65 35 43 12 22 2 26 43 25 49 58 6 73 61 42 68 70 19 67 -7 35 70 45
2615 45 122 45 44 73 -3 3 61 21 9 39 7 38 27 -5 32 3 -14 -12 -13 -1 -15 -19 -54 -33 -55 -16 -5 -44 -106 -25 -70 -76 -34
2648 -34 -68 -85 -79 -67 -50 -48 -34 -91 -46 -24 -75 -19 -63 -84 -68 -35 -63 11 -6 -5 1 -27 -11 -24 1 -23 -8 32 10 28 47 72
2680 72 47 76 40 14 97 -3 50 90 16 11 59 63 79 48 70 54 48 37 22 -9 47 75 39 -3 0 7 19 18 -10 -60 -45 1 -56
2713 -56 -90 -17 -22 13 -18 -13 -61 -54 -53 -93 -89 -48 -86 -60 -83 -44 -56 -96 -70 -13 -40 -22 -9 -38 -33 -28 -44 -32 -31 -17 3 -22 -25 -6 10
2748 10 9 -44 -20 34 12 51 45 28 36 72 53 29 62 81 -3 64 73 19 79 47 -15 51 4 64 44 6 43 -1 -11 30 -18 -20 72
2781 72 -14 31 -1 3 60 7 -81 1 -89 3 -10 -28 -6 -67 -51 6 -43 -34 -58 -38 -26 -97 -74 -33 -101 2 0 -71 -95 -9 -98
2812 -98 -62 -115 -92 -13 -38 45 -57 -35 91 -17 -6 4 -65 41 67 -41 6 55 -2 20 -21 1 50 56 77 41 -16 25
2840B5L3L4j6j86J50k3j2J07j19OP2l7Mk1j0Q4n5j06Q5m6J5O6j52Q8L4rJ4r2j0
2869g7J28l0p9J1j09J41j7LJ5o8P8N5k20R1L6pM9r3L4K2j9O0ro9J04l1J2M2r5
2898d2M0L0k0P1j12m1J57j07J2M7r2J62l4q7P6q0J13j0j15L6M9j4R0r9l5N8l3
2925B0N0q3n5J05j0pL7j16P1j4m2M9k7l0N4J0m1K1o4O7J1j20J39j19RJ08j53N2
2953g8pN6j6p9M9J27j12L2p0M6Q0k1o4R0j01O2P3j65J42o2RQ7m0o8N4q6J41n0
2981B9j08M9O2L4M1r7N1N2j11P0l3n6J24q9O3q4J4O7Rr9J30j08KM6p2KK8m4O4
3010C6n5RL4l8L7m2m4O4klj9l3LO9p5P2q8N0K1o9K0k9N4j4j2%P8q5N0j0mk5M4
3043fm4O7n8J0K7nM9m5K0M8m2Pj1j5L9Lm0N2m7L2%n1L3L9j1K9l7K2J1o4M5l0k0
$$ plain form
2840 25 58 92 76 -110 40 17 5 112 -7 -1 71 34 38 17 7 91 36 -70 15 -31 -16 50 -102 -14 20 11 25 -67 -77
2869 -77 51 21 -58 -47 -156 -15 -32 -29 -14 -82 -4 51 -169 -78 -42 -49 0 -93 -59 -37 -56 4 -5 -74 30 -1 11 53 -42
2898 -42 -2 28 8 79 -33 -74 83 -24 -12 35 -57 105 71 -16 60 -20 93 83 -32 4 53 39 129 30 -5 53 20
2925 20 70 -13 -68 37 27 20 57 -59 12 -2 -44 5 -22 -52 2 12 -29 -8 -72 -5 6 -114 25 -94 -85 23 -130 -78
2953 -78 -85 -29 -45 -124 -75 52 -60 -28 -98 -52 28 7 -57 33 -68 -6 67 -98 44 -18 -9 78 38 -30 24 -62 79 29
2981 29 -79 -30 32 66 107 10 61 113 2 72 39 -17 107 18 81 -3 11 78 87 -12 118 10 12 58 -14 -12 16 -28 36
3010 36 -19 -10 24 -14 23 -19 -63 1 -1 -4 -23 -56 -53 16 -59 13 -75 -25 -4 -73 -53 -82 -28 -42 -54 -54 24 -61 -11 -21 -25 -50 -6
3043 -6 -50 17 -41 -31 -4 -9 40 -5 15 63 21 28 17 2 41 44 4 56 9 41 41 -10 23 62 51 80 43 65 76 12 57 27 7
3076Gk5P1n8M5LrMm9J3K4m0K7m7K5LK7m2mN9j3m3k7J3j6j1J8j5N7pk7n1N8jn1
3110h2k1N3L6o0J03j3n4N8m7M1q9K8oO1L3J0l1l8Mk9mM5J2K3k2NM5n1j2L7rL6
3142F2j7k7k2qJ8L8l3M5m7jQ3p0%k2qN1J1n4M3m1j8L8k1j4l7O1n0M1l5K3K2M7
3174E8p6k8k1N0o5J7K8j3rM1jK2m7K4J4qj9N%K2J7p4K1L9j8L4p2L9OK6M0l1N5
3207G6n7nK8j02M4mk7N3qn6N7K0M4o3Q4j7o5MK3J1l4k5L6K4j6Lnj2K9j8k1L9k7
3240A3n7P7m9k2K2n2Q2qQq7K8k7M2l0nL6%L5m8j8O2r9M8M9n0lQ6j05M8JQN8q4
3273d1J9R2j21R1n2JN0q0P3lj1L2n3J6R0o9j4j6mN9no8k0N5L2J1q6Q1k4m0L2l6
3305iM4Nq2L2K2j2P7j15N9L0p2L5k5L0k1k2j8K4r6O0L8j08R9L9n4K2K6nj6l5J9
$$ plain form
3076 7 -18 53 -5 40 43 34 38 -11 2 26 -14 13 -34 -9 -6 21 -21 -25 34 21 -22 -49 -36 -52 -63 -45 -60 -3 -10 -37 -88 -30 -31 -82
3110 -82 -103 -50 -14 -74 29 16 -38 20 -27 14 -75 -47 -53 8 41 51 20 -18 -14 -43 -47 -2 10 33 11 16 61 10 -2 35 26 62
3142 62 45 18 -4 -12 6 44 11 56 9 8 91 21 21 -1 -9 42 53 -1 42 1 -17 21 0 -14 -51 10 -40 1 -34 -11 11 58
3174 58 -18 -46 -67 -17 -82 -65 -37 -50 -59 -18 -19 3 -44 -20 -6 -14 -33 -28 -28 -6 11 -63 -42 -3 -21 13 -59 -20 -14 12 52 21 76
3207 76 19 14 42 -60 -16 -20 -47 6 -2 -58 -1 19 63 0 84 67 2 6 29 40 6 -19 17 41 25 28 23 11 40 22 1 40 13
3240 13 -44 33 -16 -38 -16 -68 14 6 14 -73 -45 -72 -30 -60 -65 -29 -29 6 -42 -60 2 -97 -49 0 -50 -53 33 -72 -24 -23 -15 43 -41
3273 -41 -22 70 -51 40 -12 -11 39 -41 32 29 18 50 -3 13 103 34 20 4 0 59 54 -14 -34 21 53 64 -22 59 35 -5 27 -9
3305 -9 35 40 -42 -10 12 0 77 -38 21 51 -21 14 -11 19 -2 -24 -42 -18 -114 -54 -16 -124 -25 14 -40 -18 8 3 -13 -48 -29
3336b9J1QRj9m4Q6k9K1l9o7Q9M2q7R8j23L1J06q3J3L5n0P3o8%m%Q1l4n4O6l6J4
3368A7K9j9kN2n2jl7LK7jk6J11j26M6N9p8k6K4K3o%l3kk0O9k8l1K6J0J9J6r4L3
3401a8K6Qk2k5l4L2k1M3J6o4O8n9J5K2qL9J6n6oM2o3K8o7L9P0q0P0j1n7O0J9K0
3433D2Pq7Q3L3p1Rj2M2M6n8j5K5p0P0n5RK6J9Noj0k2R1j18N3m2pK0k6R3n4jK2
3466D1p2nP3r9P0Kn7N1o8M8L8o3J5J1j5M7k7o8J09m3l1N9k3K2oj7L7q4L0On5Q5
3498A1p0Q1n9L9J1oj9N4m2J5J2m4K8j5l4O5k6NJ8m5L4L1J2olj3j5m1M7j6l3L6
3530A2l9J6K0l6LlJ07q4K9j8J0m0m1J22l0n9R7j14J1L5j6nQj4M1o4j1N0j7J3k8
3561d5L0o7N5j3k2K1mN6m8O9p0NK1j5L0j5j8L7k8nP0o8L0m3N5k0j3M3J0j2j8L6
$$ plain form
3336 -29 -18 -10 -1 -20 -64 22 -7 14 -25 -92 -3 39 -48 50 -73 -42 64 -19 -6 29 -21 52 -16 -16 -20 -20 61 27 -27 39 3 17
3368 17 46 27 25 77 25 24 -13 -10 17 16 -10 101 -25 21 80 2 -24 0 23 17 17 -16 -18 -38 31 3 -28 -2 8 27 43 -51 -18
3401 -18 8 16 -6 -31 -65 -33 -54 -11 5 -59 9 -50 -35 -13 -21 18 34 -22 -28 14 -49 -21 -88 -49 21 -59 11 0 -57 3 22 42
3433 42 49 -38 45 78 7 16 4 46 92 34 19 44 -26 44 -11 -2 24 43 48 42 32 10 101 -17 36 -6 -13 7 -19 74 20 19 41
3466 41 -31 -36 37 -62 8 10 -47 4 -64 -16 22 -41 -26 -15 -30 17 -10 -78 31 -12 -43 16 -7 15 9 -8 29 -55 -25 -19 -74 11
3498 11 -59 22 -37 2 13 7 -12 42 0 15 27 -17 11 -4 -38 27 1 6 24 -21 13 44 56 50 47 34 19 -22 25 9 -24 12
3530 12 -27 -11 9 -27 -24 -27 80 -4 25 7 17 -23 -64 58 28 -31 66 -48 -37 -2 -18 -23 -15 -29 12 -52 -63 -13 -30 -17 -45
3561 -45 -15 -82 -27 -40 -62 -41 -45 11 -37 32 -38 -33 -12 -27 3 -12 -30 7 -21 -26 44 -24 6 -37 18 -2 -15 28 38 26 8 44
3593D4o7L6LNoL5n5j7N9j6pl1M5km6J5L6%o8O9p3P7l9K2k5m0Q1r0N7pK1l4Rj3
3627b2oN7m7n2M6pk7R6j4o3j9K7K1J7lkl0jj6O0m7J4mkJ5QJ3qjK9Pk5nNL5j3j9
3664A7m0P1r4R5j4l0J2j7L7n6j6Q3n6rK4RN2m2nk2mN8o0N0r9J08p3MK1rk3P2m1
3697Co8O2l8Q9j04R5k7K0m7rk6O9q4N8j7L3m6J6MO3qo6K2j3M2n0J5J1J1kNk3o5
3730g5R6J3Ql2K7k8m9J05p6J1lK6lpl4L3K1r7J14M1n1k9K9k1lqLj8k2K3J9Pk0
3763@k8K6K0m5L5Qj6M3m2m3l0P0nKl1P3K2o8l5KK5j1L6M7or8Q2n8L3J2l3O4o3
3796a2MM6o5L2Kj0J5J0Kj9lJ8K6o4K8%LlrL9o2JJJ30j19PK0kK5m6oQ2m5j0RJ0
3832C5JKm0%qM6Lp0L6p0R1j1m9J5OlL3k3nqj9N4J9o0oK4lL5q2M8L1o4M3jp6L6
$$ plain form
3593 44 -23 13 16 21 15 50 -5 -22 37 21 14 -17 28 26 -20 -5 31 31 -37 32 -41 36 -3 19 -6 -46 35 -55 2 -5 16 -18 -9 -22
3627 -22 -28 29 -18 -70 -24 -31 -58 38 24 -39 -58 -31 -10 7 4 2 -28 -29 -45 15 -32 -18 -22 -24 -9 -1 12 4 3 32 39 14 9 14 49 36 17
3664 17 -23 48 -46 49 35 5 17 0 37 -19 -35 48 -8 -17 7 16 68 26 21 -1 -5 53 -7 43 -56 52 -21 -17 4 -5 -28 44 3
3697 3 -65 -3 -41 48 -56 39 12 32 -15 -24 -50 19 -65 -7 -24 9 -37 -21 -17 46 38 -28 -6 -19 23 -27 -12 -1 10 8 13 -10 -75
3730 -75 21 34 42 10 37 9 -40 65 -11 0 -3 23 20 13 -21 12 33 -64 50 91 40 11 40 19 16 8 11 -7 -29 -6 13 20 0
3763 0 -28 -2 18 -27 8 16 0 43 1 -42 -72 -2 -7 -5 -36 37 59 -9 -44 -42 -17 -28 8 55 49 -49 33 -25 8 20 -13 51 -12
3796 -12 -8 38 -27 5 7 -3 12 22 24 5 2 20 46 -18 10 10 13 10 1 40 -22 -21 -20 110 -9 -2 18 16 41 -5 -11 71 26 16 25 35
3832 35 36 38 -2 -2 -10 36 39 -31 5 -65 26 15 -34 -19 -13 -16 17 -6 -11 -19 -38 16 35 -25 -31 -7 -10 25 -57 -9 22 -42 1 0 -76 -40
3868d0QN6k0o5M5NPM0n6Ok8J4K7j8RO1l2l7kM3J4%l2%qL3K9q1J1L0k2J5k7nN3
3903C3k6prk3J09Nq1k5M6p0J15l9l6K0l6L4j9j0PKj0M3o3MQ0n0jj5JK9m0ON3p1
3937d4N8k1k4M5m0k6O7L2r9mlM0j7nM7J2Jn0j4O4k1j4N8j15Q1Pl7O4m7K7k7lN2
3970D4j7l3P9o0j9QoqN0k4lRm9J00j08M6L4p7O5Rn9P8k0k4l3KJ9j4QLqk9K4J6
4004Cj7mPJ3n8K4J2M1j6k0K8k9L3l9M9m0J4J7l2j4L7p7J41q9k2K0jJ7Q8p3J1k3
4036Ak5J8KJ2J3k0l6L6mK3m8O5n6K6J0p2L9O0q3L8L1K0r0Pj2Q0m7J5Ql1k3lnK4
4070b7K6j1L1j3l6Lk4L2kJ2L5k0j02J01l4L8j1m0K8k0M4J3l7mm2RL2k2KO9o0L0
4102@pk9M8l0%j0J10r6Kl6P5ko5JK7k7O7pql3O4j5pk4K4m7N7Nm9j0L9J9j1kJ0
$$ plain form
3868 -40 -32 24 4 -61 -16 -11 -4 36 -20 -14 -42 -28 -1 -19 -10 51 19 -18 -20 23 37 37 5 5 -3 30 59 -22 -11 19 -3 12 -15 -20 33
3903 33 7 0 -9 -32 77 82 1 -24 22 -48 67 28 -8 12 -24 10 -9 -19 -12 -10 -20 23 -40 -36 44 -6 -7 -22 -21 8 -32 -26 27 -44
3937 -44 14 -7 -31 14 -26 -52 15 47 -52 -56 -59 -19 -36 -41 6 18 19 -31 -45 19 -2 -16 42 -73 8 15 -22 42 -5 22 -5 -8 44
3970 44 27 -6 73 13 -6 2 -4 -12 38 14 11 20 -29 71 -37 9 43 -34 31 40 -19 59 39 15 -18 -16 3 -11 -3 0 -8 -37 -13 3
4004 3 -14 -18 -11 2 -56 -32 -20 21 5 -15 13 -16 17 -22 27 -13 1 18 -14 -28 9 -68 73 -16 -38 -18 -19 -2 86 13 24 1
4036 1 -24 -6 -4 8 21 1 -35 1 -3 20 -28 37 -19 7 17 -55 -16 44 -39 -1 30 50 -40 -33 -45 35 -12 3 11 -20 -43 -46 -51 -27
4070 -27 -1 -12 19 6 -30 -27 -51 -19 -21 -9 26 6 -96 5 -29 9 -2 -42 -14 -34 10 23 -14 -18 -60 -51 -19 -41 -39 30 -30 0
4102 0 -7 -36 12 -18 -18 -28 82 -14 -12 -48 27 25 -40 -39 -12 -39 28 21 13 -20 44 29 22 -2 22 -25 32 37 -12 -22 17 36 25 23 33
4137C3L2n7n8PM4N4j2k0n8J2M6l8oj7J3J8K1n4NN7o3j1J7N0qk7Qk1J9qK1k4J0
4170a5PJ5kJ9m6n0P6k2mk2M7K2l8MK5j6jJ0k7J4%J5mJ7l0j8P3k1k0j1l1R5n2j0
4204aK7j5L2m1K1%J0o2Q2l5L0k9r4P2L5m1L1n6k3O2l7oO7o3J9ll7Q1l8m9J1M4
4236fq3J15j8l9L3l4K1j4L0m8K2J6JlMrL0L3k0n6J1mL3Nr4J06n4K2ONlRK4j01
4270f0M9L6l0L3qj6J5L4n1M1mj6lm0OL2P2r9j6K0MJ7l3Kn2Q7m4MJ2k7J4L7k2m5
4304e1PQO1q7L2K3nO0m7l8L2P3m3r3R3k9J0L4m9J4r5P3L8q4O3O3m9J2l9k2R8n3
4336A0M2p5P9p2M8qj1qJ2K9m6KK5l1L9Mq2N6%K3l4j7K4m9P3l2o8M5K7J9K1k4l2
4369a1jj1K9N7p1l7j2N0J1k6j5nKL3pk1KK0L2l7Nk7J4K8m9K6l7N4j2k3K5l1L0
$$ plain form
4137 33 65 8 -50 -43 1 55 43 23 -35 -23 23 -15 -21 -38 -25 -7 14 -40 -35 22 -41 -52 -35 15 7 -20 -12 -33 -14 -22 -1 -25 -15
4170 -15 -8 7 5 24 -22 -72 4 -18 -22 -44 3 25 -13 -9 16 0 -1 9 -18 -4 -4 11 7 24 -6 -24 49 28 8 -3 -34 61 9 -1
4204 -1 26 11 43 2 23 23 33 -29 53 18 48 19 -75 -3 32 -9 22 -34 -57 5 -32 -38 29 -34 -15 -18 -55 26 -12 -61 -50 -6
4236 -6 -89 26 8 -31 2 -32 -11 -25 5 -43 -21 -5 -4 -7 -3 -12 18 51 31 -25 -14 -18 15 20 -74 32 -22 0 6 11 8 17 41 -60
4270 -60 -11 25 -5 28 20 4 19 53 2 43 39 23 20 -20 -14 18 90 -9 -25 -5 -1 16 -17 -15 -67 20 -24 -20 -8 -35 -21 16 -6 -51
4304 -51 -44 -36 25 -62 -30 -7 -12 48 1 -37 -5 68 25 -68 25 -4 6 40 -9 5 -90 -17 21 -63 0 63 14 26 -13 -35 63 10
4336 10 52 -23 56 -16 32 24 13 5 17 46 0 2 27 -4 35 39 -43 13 13 36 2 -15 9 -40 33 1 -67 -22 5 24 45 21 -11
4369 -11 -12 -23 6 63 -8 -45 -57 -7 4 -22 -37 -42 -40 -7 -14 -35 -33 -13 19 -18 -13 -40 -26 2 -47 -21 -58 -4 -16 -39 -14 -45 -15
4402a5k2J2P2l1L4n0kLN5q2K2J5l1O4o5Oj7M8%m0j4N3qlL5l6K0k0jK6j2j5pj5
4436b1PJ6qpJ8M3l0j1NL0q4J1Q5p3RLk5J9Lj0J5Lj7j8l8P5mL6o5n9J02Kk0j8m6
4471g2P5n7L3oM2Ll4k2P9j0l3%PK6k0k4pJ5J4K3k0m8O5q6J14n9qL0jL4p6OJ1Q
4505BK5j2M4n7PK6r1N1J5j3mPk2L9j4j7K0m2L9L7o3O6o8OKK2l6J5k2P6q7K3L4
4538Hm3K9Pk5j0L1n1J8j6N5l6J7Orm1O0Pk6K3L4Ko5LJ32j18K6j1l6L2l0L2K2o8
4571d1P9l0LJ3k8Rj4J5j5J0j5M9k3j7J2K0j5MJ8J2j8j19P6k3N1Nn9M7M3o1j2K0
4603dL2m8K3j5n6O0J6l3NPpqM0l7Q3k2k0n6K5nl6M2k1P6r6O9qk5LK8%j1m0P0k
4638B9l4nJ8mMmJ1j9M9j4K8r6Q2j0k4N3n0K7o4J6j9N9l4j6L2J3Jk1olN2q6N4k1
$$ plain form
4402 -15 -37 -25 47 16 50 0 -2 1 56 -26 -4 11 -20 44 -21 -15 -32 16 16 -24 -38 15 7 4 39 3 23 3 2 28 16 1 -6 -21
4436 -21 -14 2 -6 -13 5 48 18 7 12 42 -42 -31 54 -19 -10 -7 -32 -13 -10 -20 -5 -2 -19 -37 -75 0 -4 32 -33 -92 10 12 -8 -26 -72
4471 -72 3 -54 -21 -27 15 18 -16 -38 41 31 -2 -2 5 31 11 -13 -20 -5 9 32 12 -36 29 -57 57 -2 -10 20 19 53 -23 -17 -6 2
4505 2 27 15 59 2 9 35 -56 -5 10 -3 -7 0 -22 17 3 -14 6 -36 3 40 -23 43 -25 -19 -17 5 -31 -16 -38 38 -49 -26 8
4538 8 -35 -6 1 -24 -34 -3 -54 -36 -52 3 -33 -16 -10 -19 -60 0 7 -19 4 38 40 -25 -22 110 -8 18 7 -29 3 -27 5 27 -41
4571 -41 38 8 11 24 -4 5 -9 6 -9 1 -14 35 12 -5 7 27 12 16 34 46 28 -91 -15 -38 13 18 -41 6 49 -12 -24 -4
4603 -4 28 -20 3 -12 -68 -8 8 -25 -20 -13 -20 -28 12 -25 58 36 16 -40 -15 -20 -56 -14 -35 41 -55 14 6 -19 -16 12 12 1 -39 31 29
4638 29 -5 -10 8 4 8 4 15 -4 45 31 59 -37 45 35 11 64 14 41 -23 -7 -26 33 -1 -17 15 28 29 8 2 -1 51 -35 19 -2
4672bJ6m5M3k5OJ7J7o1L8L2l7on8M7m2M4J5L8o3NLl3j8L1nK3J6n4j8P9Qn8K3j5
4706c9L3O4n5mj7k7N5oo8J03n5K5k7l2O3n2L3K7l4qO3n7M1m8O2Pm8KLK1n1j4L6
4739dQjo2J13l6o3P0j4j6RK4k0m3%M1m8N8m2pK7POJm1K2j3M5p2J8K4%j0K5j4K1
4774A3l7n4P1m1L8K7nj1m2L9k2Jlnj6M2J8l9J5OM6m0%K4M4l5l6P1p5rO9m6%k9
4808b1RK2lj2j2K1J4l0K5Mp4J32r2l6R6Ln0j0J6nK1o7K8M0J2J8l2m4M7j0Ln6J6
4841b7JPk5J0K1PK8q4K8JK8Pm0L2oPK7l0k4M1p8L2M0l2K7oO5o1K0j5j2J1m1N0
4875IkJlm4M1N8q0L4k6M1n4K2O7m6n3Q4n9N4kj6p4P8o4O0l0NM4q1O1m3P2m7k8
4908b1OK0n5Q6q4K8K2K4l5L3%o1L3o4N2nl8J3P1j5m2KM1l7JL8RRk7jJm4L6k5N5
$$ plain form
4672 -2 14 -31 12 -13 -7 10 27 -34 4 36 -1 -7 -65 -18 -60 -16 -1 37 -26 -21 -18 -51 -69 -38 -43 -20 -4 -58 -76 3 11 -47 -24 -39
4706 -39 -6 58 3 -1 -18 -45 10 4 -64 39 -16 9 -18 -50 13 -39 -6 21 -13 -21 42 -15 26 -22 40 47 -1 1 4 25 -26 -40 -4
4739 -4 4 3 -59 54 18 -45 25 11 -5 4 28 8 -35 -35 6 -42 16 -26 -33 -6 1 7 8 -33 -11 -24 21 -51 -33 -9 -9 -19 6 -8 13
4774 13 -24 -78 -7 -48 -10 17 12 1 -41 -2 -24 -23 -26 -31 -47 -5 13 -26 -11 -5 41 1 1 25 69 34 -2 69 -6 -15 54 8 8 -21
4808 -21 -12 10 7 -5 -17 4 18 -12 13 17 -57 75 -17 -53 43 46 -4 -14 2 -3 18 -49 -21 19 31 49 17 -27 20 10 13 -43 -27
4841 -27 -26 -19 -44 -34 -13 -6 22 -62 -34 -33 -5 2 -38 -6 -12 -5 22 -8 -32 9 -69 -37 3 -29 -2 -8 57 -4 16 1 -11 0 -41 9
4875 9 7 8 5 -39 2 60 -20 14 -12 29 -25 -3 64 18 -35 49 -10 44 42 26 -48 30 -34 26 -4 1 45 -36 25 -18 54 7 -21
4908 -21 -15 5 -50 36 -48 -20 2 26 -9 24 24 -37 -4 -68 -16 -21 -59 -46 25 10 -32 -30 11 -26 -25 13 22 31 4 3 4 -40 -4 -29 26
4943B6k1J3l3N4pm5O7n4jK2j3k2O6k2K4n3J4M0p2L8Qj3K4k5K0m1j3K3K8j9o6M4
4975iL7j4qm9O0l7PKm1L4L1l3K9lK1l4k3rM1n8O4l7N3k5j6J1k0k8QK3J1J7m9K4
5009b0J5K4m9K2j6N6o6JL9m7N4j4K9m6M5m6M8l0K7l5J9o9M3K1L9m2n2N5k0J5J4
5040A4k3N1Qp4kQJ2j0j5N8qq3N0qj3J7J2nO6n1k1MJ2KK0n3J8K1l4J5k6KK8kJ6
5075Fk2Jjk2j3K7KRJ8j4j9J5k4KK4j2RPJ5ok6L8o0N9K9q2PJ5K2k8N8n8K4lPrL9
5112C4k6j5l9j6P2J6m9J8J8J3m1K3J0jl0N8p2pK2l0O5m3M8q3L3j3L8j4Lk7N9p4
5144e0K0M8n8mJ2RL5J4l4J6nj2J4nK5o6M3Kl1K2l0L3jlm6qM1K4o6Q2j7j9L0j4
5178Apj8PnM1m4M9OoJ8j0o7J3%oLL4l1K7K6k2j9J7k3JL8kll2K0mk0l9Q7l6M3n8
$$ plain form
4943 26 5 18 -15 39 32 -13 54 0 -1 21 8 -14 52 30 54 1 15 55 -17 21 29 16 40 15 35 -6 -19 4 32 13 -53 -9
4975 -9 28 14 6 -43 17 -20 -13 -11 -52 -18 13 -20 9 6 27 -7 -30 -39 2 -56 8 -29 24 -1 -17 -6 -26 -54 -46 -23 -12 5 -44 -20
5009 -20 -5 19 -30 -8 -24 32 -34 -33 6 -41 13 -1 28 -18 27 -19 29 -1 26 -9 10 -59 -16 5 44 2 -50 5 -15 0 14
5040 14 -9 42 50 -24 -26 -18 -6 -16 -31 27 19 -64 -14 -22 -35 -18 -6 -11 55 4 -17 -13 -1 1 21 -32 -14 7 -27 -12 -38 -36 -8 -10 6
5075 6 -16 -15 -16 -38 -51 -24 -22 -13 5 -9 -28 -13 -37 -35 -11 -23 -14 -7 8 2 -24 14 -46 13 42 -40 -33 -18 4 -24 34 -24 0 -3 4 -5 34
5112 34 8 -7 -46 -62 10 26 -23 -5 13 26 -15 8 18 17 -13 45 -27 -34 -12 -42 23 -20 28 -55 -22 -35 3 -11 -8 -35 24 -50
5144 -50 -30 18 -40 -44 -32 -23 12 26 -8 8 3 -9 5 0 25 -41 2 4 -27 -5 -35 -2 -3 -6 -52 -60 -19 5 -61 21 4 -15 15 1
5178 1 -6 -24 -17 -22 19 -25 24 30 24 42 32 -35 -22 -22 -28 -25 9 -22 5 31 9 -10 7 -16 -15 23 21 18 -14 6 2 -18 -57 30 -6 37 -21
5215b1j6jMK5N2l2J9k6o2RM2Pk6K8k5L1k4J9JK1l5Mk0oMk0J7M9j3j0L7n5P1n2
5249dRk6L2n9N9j4k1P2j2k7l5J6L9l8M2j7n0J01m8J8m6K0M5o4J6Mql7N0N8o6j6
5281gJ7kk4M0j05O2L5j1l8k5N2j7k8L8jJ3K4r3Q7Kq7K1P0m0M9Lj12O1j6j0L1l4
5313d5L1O1k7j7J4p5J6M0K6Rk1o0M4j7Pj0L5JK4mk5%KK2j4jk0MOKmkK3n2QM2m6
5350b3RjPn0Q7m7Q7n4l5NM6j01J17o1L8Kl4n7O3N3l8l1K3%J7n3j0j3Q1j9l3N9
5382C4p4J4J9N0Pm6qN3q1QMJ7k4O4m6J6MjKo2Q5n0L1oM2q6L8qK0j4K0J0l5k0K6
5417CPl9K8J8k9J3M7n1Ro8J14m5K0pQp6P4j01Q1kk2j2N7nk6k6j7Q5o3L7j2l9p
5450d6K6J9l6QM9N0l4m9K6l1K7j4QJ8qJ3k9kkl8P8j03M5nL0ol9N1%Km2L2K0p7
$$ plain form
5215 -21 -37 -38 -34 -9 43 11 30 4 -58 -49 -7 0 -26 2 -23 8 -16 3 4 25 -10 -6 -26 -32 -28 -48 -31 18 5 -5 32 -23 48 -4
5249 -4 5 -21 11 -48 11 -3 -24 48 36 9 -26 -10 29 -9 33 16 -34 67 19 37 -9 11 56 -8 8 12 4 -33 17 75 9 -7
5281 -7 10 8 -16 24 -81 -19 16 5 -33 -58 -6 -23 -51 -13 -14 -1 23 -70 17 19 -68 -47 23 -17 32 35 -77 -16 -32 -42 -11 -45
5313 -45 -14 47 20 3 17 -58 -42 -2 24 33 12 -48 -4 -21 -14 -24 11 12 36 32 7 7 9 31 17 16 -4 0 6 8 4 2 25 -27 -19 23 -23
5350 -23 -14 -15 -8 -58 29 -18 69 15 -20 -15 31 -70 47 -14 24 26 -8 -65 -2 51 13 -18 5 5 22 -31 -41 -54 27 8 -25 34
5382 34 -40 -26 -7 43 50 4 -4 49 -32 -24 -20 -3 -27 37 -9 7 11 10 12 -50 35 -15 16 10 52 -34 4 -4 16 2 22 32 -3 -23 3
5417 3 10 -29 -1 17 -12 1 48 -3 6 -62 52 7 27 20 28 -48 26 -75 6 4 -18 -30 27 22 -4 -30 -47 38 -25 12 0 -39 -46
5450 -46 -20 -1 -37 -29 20 70 36 -13 13 -18 9 -5 3 21 13 26 -3 -5 -7 -45 33 -70 -25 -30 0 -6 -45 6 6 8 -34 -2 18 -59
5484e9P9l1l6J10o8j0N2J2Lr0O1n4RM4o9j0J05k3nm6%nN1J0o0O2l3RK1l8m9K7
5516c1P2m9P4m6k7o2P3j3RM0p9N1J3J7k6m2rP1km1j3K7Nj5L9Pn5oK7Lj8O1o0k6
5550c1Q6J0o7N7k4l5L0n2K9m8N3l5jL8m6L9k3k3K9J4J4Ql0L8o1M3k6J1L1k2l4
5581b8j0J3O3j13J27o7J1J7k8P2n5K8o5k2P3j3k3OK2plNpmn0O9Km5m9O8P2j15
5613e6O1j9Nl7P7o8P3MqPj07R9n0K0KK7j9noJ6o5J11q7K5%K5o7K0J4oJ6k8N2p2
5647d6O8n4O5n9L1j2L0l9N0m4J6JJ4k8L0n4j6N2n5O4nJ0p5N3j3J0o3O6L0ml8K7
5679A2j3rK1n7O4o4N1J3lMn5M2qM1l6J%k9N9o4O2n4N1QK8j02M4N3j30Q3K0j0p1
5712d8P4k5K4l4K9plkm8K2N9qm1pJ1m5N9M3m1p1M2Pk1J0jM2j1Rm0R1p1Ol4N7r
$$ plain form
5484 -59 20 -11 -47 63 -5 -15 37 49 52 -38 23 -31 -22 22 -47 -57 48 25 20 -26 -26 -31 20 30 -30 32 -1 8 29 -9 -58 -31
5516 -31 41 -8 66 20 -7 -69 4 -9 0 40 -39 12 25 42 16 -26 -35 36 34 -7 -20 7 12 -3 36 43 -12 -18 9 12 -6 55 -5 -31
5550 -31 55 65 -2 55 31 -4 26 -26 3 -45 8 -27 -28 10 -36 3 -20 -43 -14 0 14 22 -8 30 -31 12 -14 -3 28 6 -28
5581 -28 -38 -25 38 -75 52 -15 -4 13 -15 57 2 30 -35 -57 16 3 -20 -14 8 1 -2 3 -4 -8 -58 11 13 -32 -81 -13 59 -56
5613 -56 5 -14 -9 -46 31 -37 36 40 32 39 -68 31 -19 1 3 30 11 6 0 16 -49 62 -25 0 0 25 -42 -22 -8 -14 2 -26 26 -46
5647 -46 22 -32 33 -26 5 -7 23 -16 34 -10 6 7 21 -7 23 -31 -47 5 -50 14 9 19 -56 -3 -16 -6 -69 -3 27 23 -15 12
5679 12 -1 -10 11 -46 18 -46 5 18 15 19 -36 6 -2 39 3 4 4 -25 34 -30 32 -22 29 37 65 -37 7 60 -70 13 33 23 -48
5712 -48 26 1 25 -9 20 13 10 8 -40 -18 41 33 -8 -15 -4 -49 10 53 12 -59 -17 -10 -31 -21 -22 20 9 18 -22 69 -2 4 -30 27 18
5747A8l8L7o1N6kn6M0J3m6K5L8m1Rk3KK0lJ6j6K8k1K8o0K5oO6m2rN0l2K7n5j9
5780c2l0M3O3k7k8kOj4L8nL5l4j2L1L0j09PL3NK3n3M6Ql1K1m8P2l3J0Jm7JP4m4
5814bmk6M1K2j9m4j7M7n1M7ll9RK5p2Q3j4LJ6k7K6pj4M6n9K3lN4m6M5j4%j2m5
5848c1RJ3J7k2K3l3L8k6L8j3n0N4j3k6LJ6K2rk0M1p1M0K0o2K5mN5n2M3l3P2l5
5880B9k0M3m4rL6m3L0m3K9l1L6l4J2POL6o6M7o4O4%j7J5l1m2K1J1L2k8K7n7P8
5912C0n9rN2m6j4M0Qpo2O1K8l8J8l2rM7m3RM9KL3k3k9nk7J0K9j2o6K2N8n8L8N8
5946E3m2MK9m4k7O3p2P3l2K0Nl0oL8j6L2n9J6Mm6J5K8J5n3J6l4K5L8O3o1qQJ5
5979C0qJ1j9j2J5j8K0j4olOkk1L2l2L5o9M9nL3m8M6m6RLk8J00p5jL5lJ8n9K4K2
$$ plain form
5747 18 -20 17 -44 12 10 -46 -6 7 -39 -14 24 -17 -8 -31 -29 -9 -12 4 -12 16 -5 23 -37 -12 -18 48 6 -3 47 15 42 -13 -32
5780 -32 -62 -19 44 17 -11 -13 -7 -21 17 12 47 13 1 32 62 -47 -40 -7 -2 21 -32 14 22 -9 12 -36 36 3 13 14 -33 -32 42 -2
5814 -2 -6 -32 9 31 12 -32 -49 -2 -53 -6 -9 -48 -39 -14 -86 -3 -17 -14 2 -25 1 -6 -20 26 -33 -10 -13 41 -5 40 26 26 14 -31
5848 -31 -22 -9 8 -14 9 -24 14 -12 26 13 -37 17 4 -22 -19 -3 19 10 -10 31 -40 0 20 -42 -17 -21 34 -18 25 -8 64 29
5880 29 9 52 8 -1 35 -8 22 -21 8 -23 13 -21 -9 -2 4 40 -26 21 -43 21 21 4 19 -12 -54 -33 -22 10 -18 9 -48 30
5912 30 -29 -38 14 -32 -46 -6 2 -5 -67 -6 22 -16 2 -30 -39 8 -35 -26 23 25 58 35 6 1 -26 -16 13 1 -65 -43 15 -43 -5 53
5946 53 11 15 44 0 -27 36 -36 37 5 25 30 0 -6 32 16 48 -11 5 9 -37 -22 6 21 -32 -16 -50 -25 13 76 15 7 15 30
5979 30 22 33 14 2 17 -1 19 5 -1 -4 2 0 -21 11 -21 14 -55 -6 -11 22 -26 20 -26 -17 -14 -42 58 -17 -18 17 14 32 -27 -3 19
6014A9j7k7J7j3J8Onk9M4j7qO4l3rlk6L0n2K0RP4q3RL7l4M0k4j3l3M5m9M4M3k5
6048A9l0J5Rn5M0pQJ2jkl2K1J3Nl7K3lk0qJ8j5N8m2J5k0QJMJ4L1n9j6NO0n1L9
6084B0j2J3k9J1j3mQ2p1J9k5j3M7N8r8NJ5l3K8%J3KNJ6p3L7j1J8l9pM0J6k0m1
6117d4L7m5L6L1n5J5K4%J8j27P9J4L9qokrRl2rM0K9q5O2j0K3l5NkK8o1M9Ml5K2
6152aPl3J1J7j0n0N2K7m8J8OM1l6pM5n1kN8m1l5J3K9J2l0n4R8l2j7k2J5K8m6P2
6185C4j0m8QK8j6K3j9J9lm8pM7k5L2k9K2k7OO3l9j9POl6RM8n6oO1k7L3n6L3n0
6219d2J15j09R4p0K3J1q2N0l2J1l7L3L5n3J4N5Mj3K1m1J9k4k1N4rJ0Lk9k1R1k1
$$ plain form
6014 19 2 -25 -8 -21 -3 3 -2 -31 13 -4 -12 52 19 10 7 -19 11 -41 -21 -12 62 -21 -12 25 -9 31 7 -6 -39 6 -43 1 44 19
6048 19 -11 4 13 -42 -2 -9 -1 11 10 8 -24 -3 10 15 -22 1 -2 -22 -30 -12 -27 31 -11 4 -16 -8 -7 -3 11 42 -17 -33 -28 32 -19 20
6084 20 8 21 -8 3 -10 -14 68 -3 16 -9 -22 25 83 -15 -10 5 -28 0 0 13 15 20 36 -37 0 -11 7 -32 -39 1 17 -3 -44
6117 -44 -7 -52 -16 15 -40 -25 -1 -1 17 -110 -31 -17 22 14 8 6 -3 6 -26 -35 5 34 -51 11 1 24 -11 -6 -8 20 -41 8 12 -23 -1
6152 -1 6 -27 -16 1 -9 -59 -7 20 -28 -10 -4 37 1 -6 39 -12 -14 44 3 -32 -19 10 22 -8 -62 36 4 -13 -35 -20 8 -38 34
6185 34 24 -24 -16 12 -4 19 0 19 16 -32 -39 8 -17 15 -14 8 -19 -13 50 11 -8 -1 5 -31 -22 26 -30 -36 25 -2 31 -25 8 -42
6219 -42 73 -36 58 -12 11 22 -60 -10 -42 -31 -68 -35 0 -53 -39 16 20 7 28 -13 6 -18 -39 15 6 16 19 -10 -31 60 39
$$ [...]
8191B4
##END NTUPLES=NMR FID
##END=
