##TITLE=1H_Pr AD-urea
 D2O, 64 sc, 
 1.07.2021
##JCAMPDX= 6.0         $$ Bruker NMR JCAMP-DX V2.0
##DATA TYPE= NMR FID
##DATA CLASS= NTUPLES
##ORIGIN= UXNMR, Bruker Analytische Messtechnik GmbH
##OWNER= root
$$ XWIN-NMR		Version 3.5
$$ Thu Jul  1 09:02:58 2021 Russian Standard Time (UT+4h)  she@DPX200
##.OBSERVE FREQUENCY= 200.131506
##.OBSERVE NUCLEUS= ^1H
##.DELAY= (6, 6)
##.ACQUISITION MODE= SIMULTANEOUS
##.ACQUISITION SCHEME= undefined
##.AVERAGES= 8
##.DIGITISER RES= 18
##SPECTROMETER/DATA SYSTEM= spect
##.PULSE SEQUENCE= zg30
##.SOLVENT NAME= D2O
##.SHIFT REFERENCE= (INTERNAL, D2O, 0, 15.7039)
##AUDIT TRAIL= $$ (NUMBER, WHEN, WHO, WHERE, WHAT)
$$ ##TITLE= Audit trail, XWIN-NMR		Version 3.5
$$ ##JCAMPDX= 5.01
$$ ##ORIGIN= Bruker BioSpin GmbH
$$ ##OWNER= she
$$ F:/spectra/data/she/nmr/H-F/1/audita.txt
$$ ##AUDIT TRAIL=  $$ (NUMBER, WHEN, WHO, WHERE, WHAT)
(   1,<2021-07-01 09:00:45.28 +0400>,<she>,<DPX200>,
      <created by zg, POWCHK disabled, PULCHK disabled
       configuration hash MD5:
       00 E9 B6 7A A2 85 ED C7 34 08 36 98 17 FE 4E 26
       data hash MD5: 16K
       01 96 AF 80 69 3E E6 55 0C 86 DC 02 3B DD D2 60>)
$$ ##END=
$$ 
$$ hash MD5
$$ 08 ED A6 DD 51 A2 56 60 02 15 06 C2 11 90 58 25
##$RELAX= 
##$RELAX= 
##$RELAX= 
##$RELAX= 
##$RELAX= 
##$RELAX= 
$$ Bruker specific parameters
$$ --------------------------
##$DU= <F:/spectra>
##$EXPNO= 1
##$NAME= <H-F>
##$PROCNO= 1
##$TYPE= <nmr>
##$USER= <she>
##$AMP= (0..31)
100 100 100 100 100 100 100 100 100 100 100 100 100 100 100 100 100 100 
100 100 100 100 100 100 100 100 100 100 100 100 100 100 
##$AQSEQ= 0
##$AQ_mod= 1
##$AUNM= <au_zg>
##$AUTOPOS= <>
##$BF1= 200.13
##$BF2= 200.13
##$BF3= 200.13
##$BF4= 200.13
##$BF5= 200.13
##$BF6= 200.13
##$BF7= 200.13
##$BF8= 200.13
##$BYTORDA= 1
##$CFDGTYP= 0
##$CFRGTYP= 5
##$CHEMSTR= <none>
##$CNST= (0..31)
1 1 145 1 1 1 1 1 1 1 1 1 1 1 1 1 1 1 1 1 1 1 1 1 1 1 1 1 1 1 1 1 
##$CPDPRG= <>
##$CPDPRG1= <>
##$CPDPRG2= <>
##$CPDPRG3= <>
##$CPDPRG4= <mlev>
##$CPDPRG5= <mlev>
##$CPDPRG6= <mlev>
##$CPDPRG7= <mlev>
##$CPDPRG8= <mlev>
##$CPDPRGB= <>
##$CPDPRGT= <>
##$D= (0..31)
0 1.2 0 0 0 0 0 0 0 0.06 0 0.03 0 0 0 0 0.0002 0 0 0 0 0 0 0 0 0 0 0 0 
0 0 0 
##$DATE= 1625115644
##$DBL= (0..7)
120 120 120 120 120 120 120 120 
##$DBP= (0..7)
150 150 150 150 150 150 150 150 
##$DBP07= 0
##$DBPNAM0= <>
##$DBPNAM1= <>
##$DBPNAM2= <>
##$DBPNAM3= <>
##$DBPNAM4= <>
##$DBPNAM5= <>
##$DBPNAM6= <>
##$DBPNAM7= <>
##$DBPOAL= (0..7)
0.5 0.5 0.5 0.5 0.5 0.5 0.5 0.5 
##$DBPOFFS= (0..7)
0 0 0 0 0 0 0 0 
##$DE= 6
##$DECBNUC= <off>
##$DECIM= 32
##$DECNUC= <off>
##$DECSTAT= 4
##$DIGMOD= 1
##$DIGTYP= 9
##$DL= (0..7)
0 120 120 120 120 120 120 120 
##$DP= (0..7)
150 150 150 150 150 150 150 150 
##$DP07= 0
##$DPNAME0= <>
##$DPNAME1= <>
##$DPNAME2= <>
##$DPNAME3= <>
##$DPNAME4= <>
##$DPNAME5= <>
##$DPNAME6= <>
##$DPNAME7= <>
##$DPOAL= (0..7)
0.5 0.5 0.5 0.5 0.5 0.5 0.5 0.5 
##$DPOFFS= (0..7)
0 0 0 0 0 0 0 0 
##$DQDMODE= 0
##$DR= 18
##$DS= 0
##$DSLIST= <SSSSSSSSSSSSSSS>
$$ [...]
##$SUBNAM2= <"">
##$SUBNAM3= <"">
##$SUBNAM4= <"">
##$SUBNAM5= <"">
##$SUBNAM6= <"">
##$SUBNAM7= <"">
##$SUBNAM8= <"">
##$SUBNAM9= <"">
##$SW= 20.0188882624521
##$SWIBOX= (0..15)
0 0 2 0 0 0 0 0 0 0 0 0 0 0 0 0 
##$SW_h= 4006.41025641026
##$TD= 16384
##$TD0= 1
##$TE= 0
##$TE2= 300
##$TE3= 300
##$TEG= 300
##$TL= (0..7)
0 120 120 120 120 120 120 120 
##$TP= (0..7)
150 150 150 150 150 150 150 150 
##$TP07= 0
##$TPNAME0= <>
##$TPNAME1= <>
##$TPNAME2= <>
##$TPNAME3= <>
##$TPNAME4= <>
##$TPNAME5= <>
##$TPNAME6= <>
##$TPNAME7= <>
##$TPOAL= (0..7)
0.5 0.5 0.5 0.5 0.5 0.5 0.5 0.5 
##$TPOFFS= (0..7)
0 0 0 0 0 0 0 0 
##$TUNHIN= 0
##$TUNHOUT= 0
##$TUNXOUT= 0
##$USERA1= <user>
##$USERA2= <user>
##$USERA3= <user>
##$USERA4= <user>
##$USERA5= <user>
##$V9= 5
##$VALIST= <valist>
##$VCLIST= <CCCCCCCCCCCCCCC>
##$VD= 0
##$VDLIST= <DDDDDDDDDDDDDDD>
##$VPLIST= <PPPPPPPPPPPPPPP>
##$VTLIST= <TTTTTTTTTTTTTTT>
##$WBST= 1024
##$WBSW= 4
##$XGAIN= (0..3)
0 0 0 0 
##$XL= 0
##$YL= 0
##$YMAX_a= 1032383
##$YMIN_a= -1072681
##$ZGOPTNS= <>
##$ZL1= 120
##$ZL2= 120
##$ZL3= 120
##$ZL4= 120
##$ABSF1= 10
##$ABSF2= 0
##$ABSG= 5
##$ABSL= 3
##$ALPHA= 0
##$AQORDER= 0
##$ASSFAC= 0
##$ASSFACI= 0
##$ASSFACX= 0
##$ASSWID= 0
##$AUNMP= <proc_1d>
##$AZFE= 0.1
##$AZFW= 0.1
##$BCFW= 1
##$BC_mod= 2
##$BYTORDP= 1
##$COROFFS= 0
##$CY= 11.3945322036743
##$DATMOD= 1
##$DC= 2
##$DFILT= <>
##$DTYPP= 0
##$F1P= 15.9154993809931
##$F2P= -4.1035820241983
##$FCOR= 0.5
##$FTSIZE= 0
##$FT_mod= 4
##$GAMMA= 1
##$GB= 0.15
##$INTBC= 1
##$INTSCL= 1
##$ISEN= 128
##$LB= 0.24
##$LEV0= 0
##$LPBIN= 0
##$MAXI= 10000
##$MC2= 0
##$MEAN= 0
##$ME_mod= 0
##$MI= 1.114404
##$NCOEF= 0
##$NC_proc= 0
##$NLEV= 6
##$NOISF1= 3.799351
##$NOISF2= 2.8
##$NSP= 1
##$NTH_PI= 0
##$NZP= 0
##$OFFSET= 15.70392
##$PC= 1
##$PHC0= -12038.77
##$PHC1= -48.79901
##$PH_mod= 1
##$PKNL= yes
##$PPARMOD= 0
##$PSCAL= 0
##$PSIGN= 0
##$REVERSE= no
##$SF= 200.130013532006
##$SI= 16384
##$SIGF1= 3
##$SIGF2= 2
##$SINO= 400
##$SIOLD= 16384
##$SREGLST= <1H.CDCl3>
##$SSB= 0
##$STSI= 0
##$STSR= 0
##$SW_p= 3612.71676300578
##$SYMM= 0
##$S_DEV= 0
##$TDeff= 0
##$TDoff= 0
##$TI= <>
##$TILT= no
##$TM1= 0
##$TM2= 0
##$TOPLEV= 0
##$USERP1= <user>
##$USERP2= <user>
##$USERP3= <user>
##$USERP4= <user>
##$USERP5= <user>
##$WDW= 1
##$XDIM= 8192
##$YMAX_p= 0
##$YMIN_p= 0
$$ End of Bruker specific parameters
$$ ---------------------------------
##NTUPLES= NMR FID
##VAR_NAME=  TIME,          FID/REAL,        FID/IMAG
##SYMBOL=    X,             R,               I
##VAR_TYPE=  INDEPENDENT,   DEPENDENT,       DEPENDENT
##VAR_FORM=  AFFN,          ASDF,            ASDF
##VAR_DIM=   8192,          8192,            8192
##UNITS=     SECONDS,       ARBITRARY UNITS, ARBITRARY UNITS
##FACTOR=    0.0002496,     1,               1
##FIRST=     0,             0,               0
##LAST=      2.0444736,     0,               0
##MIN=       0,             -1072681,        0
##MAX=       2.0444736,     1032383,         0
$$ Real data points
##PAGE= N=1
##DATA TABLE= (X++(R..R)), XYDATA
0 0 0 0 0 0 0 0 8 -3 0 -8 8 -14 24 -24 32 -40 40 -56 68 -80 96 -112 136 -166 188 -222 260 -296 344 -394 446
31 446 -513 582 -655 746 -836 937 -1055 1174 -1311 1463 -1619 1799 -1993 2200 -2435 2685
47 2685 -2960 3266 -3595 3959 -4365 4809 -5309 5867 -6496 7217 -8040 8999 -10136 11497
61 11497 -13174 15299 -18073 21890 -27487 36514 -53538 97002 -452392 -690886 384245
72 384245 954318 967006 183706 -663819 -1072681 -659738 194567 933203 958797 319022
82 319022 -575926 -1018626 -743696 88620 830087 979748 404219 -444727 -974863 -784387
92 -784387 -37058 736738 961881 495564 -329693 -901819 -821747 -142339 627213 938677
102 938677 564524 -210223 -826877 -837314 -243095 521462 898830 623574 -100730 -742591
112 -742591 -842517 -330433 413913 851196 667906 3729 -655793 -834372 -407378 309644
122 309644 794832 700641 99971 -565772 -815979 -473547 207727 731833 721660 188872
132 188872 -474222 -787721 -528989 110074 663162 731191 269007 -382403 -750887 -573193
142 -573193 17911 590023 729967 340146 -291538 -706300 -606623 -68813 513183 719012
152 719012 402718 -201904 -654497 -629754 -149772 433763 698616 455710 -115088 -596699
162 -596699 -642518 -223353 353503 669725 498565 -32081 -534209 -645587 -289040 273369
172 273369 633136 531762 46281 -468070 -639505 -346642 194324 589905 555697 119357
182 119357 -399318 -624770 -396133 117022 541064 570547 186673 -328905 -602173 -437667
192 -437667 42119 487291 576590 247734 -257794 -572614 -470482 -28603 430182 574329
202 574329 301551 -187415 -536788 -494976 -95161 370259 564347 348309 -118197 -495559
212 -495559 -511582 -157043 308357 547141 388127 -50790 -449669 -520281 -213369 245837
222 245837 523490 420252 13318 -400398 -521404 -263765 182992 493985 445269 74400
232 74400 -347822 -515418 -308420 120642 459213 463069 131432 -293129 -502665 -346672
242 -346672 59462 419760 473783 184189 -236802 -483614 -378627 126 376181 477401
252 477401 232183 -179614 -458763 -403929 -56705 329236 474388 274892 -122479 -428609
262 -428609 -422537 -110133 279993 464886 311843 -66141 -393858 -434406 -159819 228721
272 228721 449204 343090 -10937 -354835 -439773 -205547 176120 427868 368445 42389
282 42389 -312318 -438727 -246625 122956 401198 387289 92933 -267001 -431436 -282422
292 -282422 70277 369904 400024 140248 -219520 -418171 -312904 18453 334340 406408
302 406408 183738 -170613 -399364 -337742 -31908 295114 406622 223042 -120910 -375377
312 -375377 -356596 -79637 253195 400951 257400 -71627 -346907 -369338 -124189 209508
322 209508 389518 286300 -23690 -314759 -376150 -164569 164911 373040 309716 22396
332 22396 -279440 -377170 -201087 119598 351703 327934 66711 -241292 -372896 -233650
342 -233650 73920 326078 340884 108805 -200746 -363147 -261640 28655 296572 348307
352 348307 147429 -158986 -348570 -284702 -15050 263857 350264 182441 -116530 -329374
362 -329374 -302588 -56821 228721 347053 213326 -74142 -306206 -315242 -95870 191758
372 191758 338819 239643 -32578 -279657 -322859 -131896 153492 326143 261550 7899
382 7899 -250040 -325467 -164716 114469 309112 278939 46804 -217852 -323301 -194122 74974
393 74974 288239 291655 83746 -183656 -316653 -219542 36130 264164 299629 117748 -148331
404 -148331 -305582 -240589 -1716 237215 302867 148738 -112410 -290587 -257381 -37765
414 -37765 208051 301741 176294 -76244 -272172 -269919 -71974 177080 296457 200275 -40547
425 -40547 -250670 -278059 -103657 144989 287289 220504 -5826 -226592 -282018 -132725 112193
436 112193 274442 236785 27713 -200440 -281995 -158771 79000 258323 249372 59660 -172319
447 -172319 -278169 -181817 45987 239265 258031 89542 -142999 -270700 -201503 13546
457 13546 217671 262873 117133 -112789 -259786 -217562 -17771 193956 263885 142096 -82338
468 -82338 -245761 -230192 -47607 168549 261436 164172 -51775 -228985 -239289 -75841 141739
479 141739 255545 183306 -21450 -209673 -244838 -102115 113861 246237 199370 7989
489 7989 -188193 -246952 -126142 85390 234095 212183 36402 -164943 -245554 -147725 56774
500 56774 219100 221748 63485 -139986 -241043 -166573 28330 201674 227931 88750 -114100
511 -114100 -233272 -182604 265 181902 230843 112173 -87295 -222613 -195650 -26917
521 -26917 160353 230453 133144 -60245 -209132 -205484 -52873 137295 226900 151659 -33309
532 -33309 -193212 -212213 -77154 113135 220364 167397 -6692 -175139 -215806 -99689 88029
543 88029 210957 180357 19271 -155088 -216250 -120200 62404 198860 190505 44177 -133463
554 -133463 -213539 -138304 36850 184285 197497 67481 -110843 -208029 -153753 11736 167825
565 167825 201456 88786 -87699 -199708 -166287 -12427 149741 202407 107931 -64260 -189011
576 -189011 -176091 -35556 130179 200631 124988 -40752 -176077 -183192 -57306 109617 196150
587 196150 139832 -17495 -161266 -187571 -77451 88271 189079 152255 5236 -144873
597 -144873 -189194 -96015 66255 179745 162318 27201 -126931 -188170 -112764 43949 168185
608 168185 169733 48173 -107639 -184655 -127424 21906 154707 174620 67654 -87732 -178698
619 -178698 -139642 535 139705 176836 85466 -67414 -170539 -149608 -20205 123288 176601
630 176601 101518 -46836 -160466 -157061 -39772 105824 173933 115594 -26445 -148525 -162261
641 -162261 -58190 87479 169053 127593 -6283 -135061 -165079 -75252 68606 162069 137545
652 137545 13223 -120019 -165569 -90718 49481 153158 145276 31958 -104035 -163839 -104451
663 -104451 30415 142508 150720 49581 -87130 -159928 -116313 11479 130241 154088 65995
674 65995 -69619 -154108 -126314 -7090 116677 155194 81061 -51661 -146307 -134248 -24880
685 -24880 101953 154319 94520 -33576 -136736 -140267 -41966 86213 151248 106335 -15502
696 -15502 -125606 -144072 -57964 69734 146352 116374 2252 -112999 -145873 -72684 52930
707 52930 139511 124463 19239 -99554 -145543 -85832 36059 131071 130509 35308 -85156 -143341
719 -143341 -97289 19237 121207 134788 50521 -70042 -139255 -107159 2607 109936 137075
730 137075 64632 -54352 -133368 -115366 -13645 97490 137447 77497 -38460 -125939 -121756
741 -121756 -29271 84057 135948 88865 -22368 -116930 -126285 -43895 69947 132646 98765
752 98765 -6580 -106718 -129016 -57666 55210 127618 107017 8918 -95214 -129943 -70129
763 -70129 40272 120999 113646 23975 -82833 -129004 -81458 24961 112863 118596 38271 -69358
775 -69358 -126332 -91448 9610 103294 121743 51782 -55338 -121959 -99816 -5405 92616 123027
787 123027 63999 -41145 -116080 -106494 -19700 81037 122607 75009 -26804 -108786 -111470 -33356
799 -33356 68650 120502 84555 -12490 -100177 -114756 -46014 55808 116787 92693 1403 -90519
811 -90519 -116375 -57673 42620 111695 99357 14986 -79898 -116432 -68273 29181 105152 104475
823 104475 28008 -68401 -114836 -77745 15615 97329 108073 40304 -56376 -111815 -85910 2287
835 2287 88385 110065 51686 -43931 -107305 -92535 -10674 78567 110601 62058 -31140 -101433
847 -101433 -97832 -23228 67915 109445 71325 -18370 -94434 -101656 -35027 56719 106892 79325
859 79325 -5771 -86359 -103902 -45923 45136 103078 85895 6486 -77362 -104762 -55936 33236
871 33236 98046 91253 18353 -67612 -104138 -64933 21255 91660 95294 29670 -57185 -102224
883 -102224 -72823 9303 84359 97859 40276 -46302 -98939 -79498 -2452 76119 99064 49981
895 49981 -35201 -94469 -84898 -13788 67057 98984 58793 -23839 -88907 -89060 -24611 57493 97495
908 97495 66472 -12711 -82347 -91917 -34615 47570 94858 73053 -1730 -74966 -93502 -44021
920 -44021 37139 91089 78685 9070 -66749 -93828 -52690 26594 86288 83019 19545 -57830
932 -57830 -92905 -60420 15856 80364 86203 29474 -48532 -90969 -67152 5348 73668 88171
944 88171 38567 -38849 -87793 -72765 -4951 66206 88962 47000 -28887 -83519 -77331 -14915
956 -14915 58077 88659 54623 -18869 -78368 -80830 -24512 49336 87138 61397 -8736 -72316
968 -72316 -83211 -33499 40294 84562 67202 1117 -65568 -84371 -41816 30958 80968 72010
980 72010 10769 -58083 -84536 -49345 21459 76520 75723 19972 -50047 -83469 -56133 11884
992 11884 71056 78466 28789 -41490 -81515 -62128 2282 64763 80066 37080 -32659 -78438
1004 -78438 -67133 -7051 57868 80556 44662 -23634 -74439 -71084 -16041 50386 80036 51421
1016 51421 -14417 -69575 -74045 -24698 42335 78468 57422 -5276 -63903 -76014 -32799 34036
1028 34036 75910 62521 3810 -57518 -76836 -40253 25422 72411 66721 12590 -50493 -76744
1040 -76744 -47069 16513 67969 69853 21035 -42845 -75468 -53182 7706 62750 72039 28994
1052 28994 -34913 -73344 -58340 -1022 56867 73257 36298 -26771 -70243 -62597 -9459 50288
1064 50288 73433 43048 -18410 -66253 -65819 -17648 43292 72578 48961 -10011 -61558 -68199
1076 -68199 -25390 35782 70757 54151 -1657 -56103 -69645 -32505 28035 68071 58552 6526
1088 6526 -50047 -70153 -39069 20102 64578 61983 14362 -43531 -69547 -45073 12114 60263
1100 60263 64562 21902 -36472 -68147 -50270 4112 55256 66231 28979 -29112 -65914 -54647
1112 -54647 -3800 49678 66857 35480 -21654 -62860 -58243 -11362 43530 66693 41258 -14039
1124 -14039 -58931 -60953 -18563 37095 65655 46424 -6510 -54511 -62814 -25386 30258 63785
1136 63785 50872 1066 -49389 -63770 -31783 23164 61136 54534 8363 -43768 -63930 -37577
1148 -37577 15990 57725 57475 15392 -37657 -63231 -42749 8738 53713 59467 22056 -31303
1160 -31303 -61762 -47241 1534 49087 60795 28325 -24575 -59586 -51122 -5556 43777 61273
1172 61273 34148 -17740 -56547 -54207 -12480 38189 60956 39348 -10698 -52878 -56522 -19088
1184 -19088 32110 59788 43975 -3741 -48598 -58049 -25320 25760 57964 47920 3117 -43701
1196 -43701 -58867 -31068 19186 55386 51161 9896 -38448 -58798 -36319 12404 52090 53735
1208 53735 16334 -32772 -57969 -40972 5766 48197 55450 22386 -26817 -56509 -44941 -847
1220 -847 43829 56529 28086 -20631 -54207 -48329 -7286 38913 56733 33265 -14346 -51379
1232 -51379 -50952 -13520 33654 56270 37880 -7947 -47900 -52861 -19511 27981 55055 42007
1244 42007 -1487 -43786 -54214 -25154 22000 53064 45557 4876 -39192 -54752 -30442 15849
1256 15849 50485 48423 11056 -34102 -54545 -35166 9578 47308 50535 17017 -28734 -53570
1268 -53570 -39385 3326 43516 51973 22695 -23070 -51900 -42914 -2863 39206 52737 27904
1280 27904 -17126 -49611 -45929 -8920 34447 52729 32638 -11148 -46645 -48217 -14749 29320
1292 29320 52049 36787 -5093 -43113 -49760 -20143 23938 50551 40385 822 -39197 -50714
1304 -50714 -25258 18403 48578 43349 6588 -34778 -50871 -29863 12798 46037 45662 12193
1316 12193 -30083 -50400 -33929 7088 42764 47344 17384 -25105 -49240 -37482 1471 39253
1328 39253 48437 22365 -19894 -47547 -40556 -4169 35136 48803 26980 -14403 -45217 -43030
1340 -43030 -9565 30742 48651 31084 -8910 -42400 -44933 -14835 25946 47692 34721 -3434
1352 -3434 -39008 -46178 -19758 20890 46247 37875 2053 -35212 -46743 -24330 15718 44218
1364 44218 40459 7345 -31030 -46765 -28446 10447 41637 42493 12433 -26552 -46177 -32128
1376 -32128 5152 38626 43892 17221 -21862 -44999 -35299 -5 35100 44690 21764 -16930
1388 -16930 -43214 -37946 -5159 31342 44984 25806 -11967 -40975 -40072 -10091 27149 44561
1400 44561 29513 -6867 -38249 -41706 -14809 22627 43625 32766 -1765 -35010 -42705 -19398
1412 -19398 17908 42113 35630 3273 -31328 -43127 -23531 13084 40047 37923 8195 -27324
1424 -27324 -42954 -27224 8180 37537 39573 12903 -23114 -42257 -30594 3175 34573 40753
1436 40753 17343 -18579 -40993 -33521 -1700 31114 41387 21490 -13943 -39118 -35855 -6542
1448 -6542 27455 41318 25202 -9161 -36821 -37698 -11175 23390 40869 28535 -4441 -34111
1460 -34111 -38913 -15461 19150 39740 31436 363 -30899 -39651 -19541 14642 38158 33860 5011
1473 5011 -27473 -39777 -23220 10185 36146 35705 9416 -23685 -39418 -26513 5635 33595
1485 33595 37065 13598 -19655 -38587 -29369 1178 30710 37885 17472 -15456 -37190 -31773 -3247
1498 -3247 27466 38212 21176 -11234 -35334 -33766 -7647 23921 38054 24485 -6812 -33080
1510 -33080 -35258 -11794 20036 37356 27392 -2405 -30312 -36164 -15682 16109 36134 29849 1945
1523 1945 -27320 -36662 -19353 11929 34413 31902 6207 -23872 -36616 -22658 7667 32270
1535 32270 33398 10255 -20213 -36008 -25582 3412 29763 34459 14074 -16403 -34937 -28041
1547 -28041 -843 26877 35003 17630 -12510 -33386 -30069 -4769 23761 35073 20784 -8489
1559 -8489 -31472 -31667 -8738 20323 34625 23713 -4414 -29193 -32698 -12424 16675 33663 26152
1572 26152 -337 -26479 -33286 -15919 12912 32410 28190 3592 -23545 -33490 -19036 9119
1584 9119 30623 29876 7283 -20318 -33164 -21824 5250 28429 30984 10955 -16987 -32448 -24339
1597 -24339 1397 26014 31619 14308 -13342 -31192 -26455 -2376 23227 31941 17462 -9641
1609 -9641 -29687 -28094 -6103 20187 31770 20202 -5938 -27747 -29304 -9585 16977 31202
1621 31202 22655 -2249 -25478 -30117 -12982 13567 30248 24787 1416 -22883 -30541 -15946 10090
1634 10090 28813 26439 4981 -20036 -30465 -18761 6556 27024 27835 8316 -17057 -30018
1646 -30018 -21158 3061 24980 28700 11514 -13888 -29261 -23207 -424 22611 29170 14461 -10670
1659 -10670 -28009 -24923 -3763 20081 29320 17141 -7314 -26471 -26289 -6977 17279 28949 19586
1672 19586 -4054 -24613 -27291 -10102 14432 28366 21612 -790 -22511 -27925 -12936 11328
1684 11328 27337 23375 2511 -20152 -28133 -15624 8193 26004 24785 5652 -17567 -27991
1696 -27991 -18013 5039 24280 25878 8578 -14802 -27433 -20046 1822 22443 26675 11463 -11932
1709 -11932 -26585 -21972 -1357 20226 26973 14102 -8956 -25511 -23435 -4423 17749 27007 16540
1722 16540 -5838 -23961 -24532 -7350 15130 26602 18655 -2759 -22135 -25361 -10106 12342 25827
1735 25827 20498 281 -20059 -25799 -12774 9432 24789 22068 3289 -17748 -25873 -15193 6485
1748 6485 23394 23213 6217 -15211 -25535 -17295 3471 21647 24103 9012 -12595 -24979 -19170
1761 -19170 546 19724 24574 11436 -9824 -24007 -20670 -2382 17649 24803 13806 -7060
1773 -7060 -22733 -21899 -5125 15261 24491 15915 -4224 -21257 -22753 -7756 12884 24019 17685
1786 17685 -1410 -19506 -23306 -10128 10245 23197 19229 1303 -17455 -23533 -12430 7595
1798 7595 22083 20456 4002 -15305 -23432 -14518 4947 20747 21417 6531 -12977 -23024 -16344
1811 -16344 2174 19121 22072 8929 -10561 -22368 -17848 -449 17269 22373 11147 -8006
1823 -8006 -21400 -19127 -3035 15171 22345 13240 -5462 -20157 -20181 -5547 12957 22020 15112 -2832
1837 -2832 -18595 -20884 -7898 10734 21506 16536 -330 -16939 -21212 -10028 8300 20582 17901
1850 17901 2151 -15072 -21262 -12037 5891 19497 18908 4546 -13026 -21162 -13836 3477 18195
1863 18195 19591 6772 -10879 -20607 -15363 1037 16650 20060 8965 -8649 -19838 -16617 -1308
1876 -1308 14946 20306 10849 -6382 -18949 -17676 -3659 13018 20187 12599 -4085 -17743 -18470
1889 -18470 -5787 11019 19845 14159 -1797 -16341 -19039 -7823 8893 19258 15454 498 -14814
1902 -14814 -19302 -9718 6832 18363 16519 2672 -13095 -19267 -11471 4633 17323 17416 4739
1915 4739 -11184 -18997 -12973 2490 16066 17998 6769 -9295 -18550 -14289 323 14610 18259
1928 18259 8629 -7228 -17817 -15370 -1713 13041 18454 10322 -5217 -16910 -16252 -3819 11334
1941 11334 18220 11872 -3058 -15743 -16884 -5785 9474 17840 13226 -973 -14430 -17374 -7611
1954 -7611 7509 17277 14332 1075 -12934 -17545 -9340 5588 16402 15277 3046 -11239 -17407
1967 -17407 -10873 3498 15345 16019 5069 -9579 -17125 -12302 1504 14121 16459 6827 -7692
1980 -7692 -16598 -13403 -568 12650 16719 8561 -5801 -15878 -14371 -2474 11221 16656 9986
1993 9986 -3858 -14886 -15079 -4291 9605 16432 11299 -1964 -13832 -15589 -5989 7854 16016
2006 16016 12451 -38 -12484 -15832 -7601 6066 15375 13379 1841 -11117 -15905 -9100 4235
2019 4235 14472 14193 3585 -9580 -15809 -10414 2338 13469 14715 5274 -7898 -15331 -11619 556
2033 556 12262 15080 6962 -6275 -14830 -12610 -1271 10946 15182 8337 -4496 -14011 -13403 -2961
2047 -2961 9498 15066 9701 -2669 -13131 -13945 -4662 8028 14782 10844 -1008 -11991 -14318 -6187
2061 -6187 6402 14283 11816 761 -10782 -14485 -7617 4726 13655 12599 2406 -9448 -14402
2074 -14402 -8874 3050 12789 13171 3983 -8060 -14228 -10103 1401 11870 13632 5438 -6586 -13858
2088 -13858 -11010 -230 10723 13794 6800 -5003 -13255 -11800 -1726 9508 13816 8091 -3484
2101 -3484 -12470 -12433 -3285 8161 13679 9204 -1845 -11610 -12875 -4754 6738 13373 10198 -339
2115 -339 -10589 -13183 -6099 5312 12824 10966 1164 -9468 -13173 -7317 3877 12267 11713 2609
2129 2609 -8232 -13093 -8427 2330 11446 12170 4025 -6968 -12864 -9349 912 10526 12418 5304
2143 5304 -5622 -12484 -10183 -548 9504 12550 6503 -4226 -11904 -10857 -1944 8344 12595 7602
2157 7602 -2852 -11191 -11332 -3282 7139 12413 8495 -1449 -10368 -11668 -4521 5900 11998 9347
2171 9347 -63 -9365 -11896 -5746 4602 11510 10086 1329 -8354 -11930 -6836 3260 10905 10607 2633
2186 2633 -7271 -11789 -7752 1924 10118 10964 3854 -6091 -11512 -8616 557 9260 11196 4999 -4816
2201 -4816 -11097 -9311 -714 8309 11303 6036 -3591 -10539 -9915 -2030 7247 11293 7039 -2292 -9875
2216 -9875 -10288 -3188 6113 10996 7862 -947 -9067 -10522 -4321 4992 10616 8627 267 -8204 -10649
2231 -10649 -5405 3803 10164 9103 1455 -7216 -10618 -6304 2546 9575 9570 2634 -6206 -10437 -7129
2246 -7129 1348 8853 9872 3773 -5108 -10179 -7835 187 8061 10031 4722 -3960 -9767 -8422 -1036
2261 -1036 7149 10087 5679 -2838 -9206 -8937 -2124 6194 9985 6467 -1654 -8590 -9188 -3079 5163
2276 5163 9727 7172 -558 -7839 -9420 -4142 4066 9288 7730 546 -7040 -9479 -5003 3032 8885
2291 8885 8254 1662 -6098 -9411 -5822 1942 8273 8605 2689 -5154 -9233 -6537 871 7614 8725
2306 8725 3593 -4192 -8936 -7151 -126 6916 8930 4427 -3158 -8486 -7592 -1141 6091 8850 5132
2321 5132 -2257 -8025 -7959 -2123 5281 8766 5927 -1238 -7395 -8217 -2956 4337 8505 6491 -287 -6754
2337 -6754 -8386 -3838 3460 8164 7018 656 -6062 -8435 -4585 2497 7780 7374 1586 -5306 -8317
2352 -8317 -5290 1583 7266 7635 2505 -4503 -8167 -5889 604 6646 7825 3304 -3570 -7852 -6340
2367 -6340 -260 6012 7901 4020 -2732 -7431 -6754 -1148 5268 7868 4748 -1841 -7058 -7132 -2022 4509
2383 4509 7779 5309 -941 -6515 -7297 -2819 3739 7580 5845 -6 -5876 -7428 -3584 2821 7268
2398 7268 6267 880 -5254 -7461 -4233 1982 6792 6636 1647 -4472 -7388 -4861 1194 6330 6904
2413 6904 2441 -3794 -7173 -5373 292 5774 7059 3192 -2973 -6946 -5832 -534 5139 7083 3877
2428 3877 -2224 -6555 -6271 -1288 4435 7027 4517 -1415 -6140 -6475 -2103 3837 6980 4989 -538
2443 -538 -5625 -6690 -2837 3075 6706 5478 255 -5178 -6756 -3495 2354 6395 5854 1079 -4475
2458 -4475 -6757 -4117 1623 6034 6164 1801 -3878 -6673 -4617 777 5575 6310 2428 -3177 -6509
2473 -6509 -5053 -17 5121 6417 3168 -2428 -6244 -5475 -739 4524 6488 3752 -1785 -5890 -5801 -1463
2489 -1463 3873 6387 4291 -943 -5484 -5954 -2186 3292 6248 4707 -286 -5052 -6108 -2800 2606
2504 2606 5972 5111 514 -4508 -6155 -3430 1901 5755 5399 1107 -3946 -6160 -3904 1233 5377
2519 5377 5665 1801 -3303 -6063 -4352 455 5005 5785 2454 -2765 -5813 -4770 -115 4573 5846
2534 5846 3011 -2038 -5568 -5072 -798 3987 5865 3541 -1386 -5326 -5283 -1489 3429 5763 3910 -771
2550 -771 -4899 -5468 -2057 2870 5700 4316 -164 -4504 -5584 -2605 2297 5489 4644 588 -4066 -5588
2566 -5588 -3110 1655 5142 4970 1049 -3489 -5533 -3581 1098 4839 5119 1701 -3082 -5437 -3944
2581 -3944 470 4490 5171 2234 -2457 -5271 -4233 -110 4065 5246 2732 -1918 -5070 -4504 -705
2596 -705 3645 5256 3158 -1305 -4768 -4759 -1265 3076 5229 3539 -749 -4446 -4885 -1847 2583 5135
2612 5135 3852 -141 -4064 -4958 -2286 2070 4903 4189 439 -3651 -4996 -2828 1488 4643 4405 948
2628 948 -3180 -4990 -3183 972 4336 4651 1537 -2789 -4842 -3550 427 4031 4720 1994 -2206 -4728
2644 -4728 -3830 -125 3652 4754 2429 -1659 -4604 -4073 -682 3258 4765 2871 -1194 -4303 -4303 -1211
2660 -1211 2848 4656 3247 -639 -4060 -4397 -1683 2389 4607 3453 -119 -3650 -4490 -2137 1891
2675 1891 4430 3826 400 -3306 -4618 -2553 1278 4214 3960 877 -2907 -4549 -2877 836 4003
2690 4003 4115 1389 -2478 -4396 -3194 344 3709 4241 1815 -2020 -4281 -3490 -211 3322 4365 2252
2706 2252 -1484 -4117 -3702 -659 2947 4319 2572 -1108 -3888 -3890 -1119 2555 4239 2945 -535 -3616
2722 -3616 -4016 -1572 2088 4137 3178 -48 -3278 -4099 -1912 1583 3984 3468 352 -2921 -4089 -2232
2738 -2232 1145 3731 3666 833 -2483 -4035 -2649 672 3509 3785 1255 -2125 -3940 -2942 293 3261
2754 3261 3795 1654 -1745 -3843 -3210 -162 2883 3822 2005 -1327 -3647 -3339 -614 2561 3843 2338
2770 2338 -882 -3425 -3453 -1017 2226 3798 2674 -454 -3180 -3587 -1391 1801 3691 2906 14 -2841
2786 -2841 -3666 -1783 1359 3457 3029 462 -2573 -3721 -2136 974 3232 3190 811 -2232 -3609 -2405
2802 -2405 591 3079 3273 1230 -1810 -3525 -2616 155 2752 3350 1593 -1457 -3331 -2817 -226 2450
2818 2450 3429 1829 -1066 -3134 -2942 -640 2147 3352 2163 -611 -2963 -3101 -989 1820 3277 2355
2834 2355 -296 -2672 -3136 -1320 1456 3133 2553 117 -2425 -3254 -1635 1131 3051 2752 442 -2109
2850 -2109 -3154 -1917 736 2844 2850 779 -1839 -3140 -2169 367 2620 2991 1147 -1483 -3046 -2334
2866 -2334 -16 2373 2994 1460 -1157 -2872 -2596 -343 2077 3000 1708 -763 -2742 -2631 -714 1805
2882 1805 2977 1953 -437 -2530 -2771 -1027 1476 2869 2192 -118 -2344 -2795 -1279 1222 2780 2358
2898 2358 184 -2074 -2834 -1585 895 2572 2486 472 -1803 -2794 -1734 560 2407 2600 913 -1503
2914 -1503 -2765 -1935 217 2251 2563 1089 -1242 -2637 -2132 -78 2026 2676 1326 -894 -2545 -2239
2930 -2239 -394 1808 2625 1560 -654 -2321 -2361 -633 1540 2583 1751 -397 -2205 -2429 -846 1300
2946 1300 2512 1914 -56 -1996 -2427 -1139 1009 2417 2022 214 -1825 -2478 -1331 740 2324 2154
2962 2154 427 -1561 -2424 -1521 452 2132 2198 639 -1392 -2384 -1655 231 1955 2256 877 -1128 -2303
2979 -2303 -1870 -23 1726 2211 1041 -834 -2186 -1956 -202 1588 2240 1224 -647 -2049 -1964 -402
2995 -402 1343 2180 1440 -415 -1940 -2013 -585 1173 2172 1588 -222 -1751 -2055 -886 1029 2056 1655
3012 1655 76 -1568 -2083 -1029 759 2003 1673 247 -1419 -2020 -1208 555 1840 1792 477 -1282
3028 -1282 -2058 -1304 289 1763 1853 625 -1067 -1950 -1393 92 1574 1930 758 -882 -1837 -1573 -39
3045 -39 1415 1890 949 -635 -1789 -1615 -272 1242 1848 1083 -438 -1630 -1707 -494 1097 1838 1244 -211
3063 -211 -1562 -1657 -637 907 1762 1367 -123 -1389 -1688 -803 723 1695 1420 158 -1250 -1752 -918 501
3081 501 1620 1512 293 -1103 -1670 -1063 324 1528 1581 453 -965 -1678 -1173 223 1370 1595 619
3098 619 -809 -1608 -1266 -10 1264 1574 778 -576 -1522 -1321 -123 1153 1608 898 -437 -1443 -1436 -273
3116 -273 997 1590 1021 -291 -1336 -1409 -488 813 1542 1105 -111 -1240 -1448 -616 696 1483 1174 37
3134 37 -1161 -1455 -744 484 1382 1261 167 -979 -1440 -826 356 1297 1253 318 -901 -1477 -961 226
3152 226 1222 1350 492 -774 -1407 -1037 41 1133 1344 574 -566 -1311 -1054 -95 992 1395 682 -444
3170 -444 -1265 -1149 -134 887 1337 799 -345 -1187 -1229 -297 819 1279 890 -192 -1118 -1144 -440 666 1247
3189 1247 906 -71 -1004 -1167 -496 488 1219 970 4 -902 -1166 -562 393 1160 1015 111 -811 -1153 -676 321
3209 321 1073 1067 202 -695 -1155 -757 175 1021 1057 369 -575 -1054 -818 101 957 1075 420 -483 -1100 -897 50
3230 50 818 1056 473 -422 -997 -872 -114 780 1031 587 -324 -913 -892 -143 642 1025 584 -171 -933 -962 -261
3251 -261 603 993 684 -39 -847 -914 -426 484 1014 712 -4 -741 -911 -443 425 935 791 94 -724 -948
3271 -948 -478 270 865 800 174 -611 -930 -536 186 852 829 253 -571 -885 -642 91 751 844 345 -431 -925
3292 -925 -714 27 690 864 387 -349 -800 -710 -109 644 861 464 -216 -767 -722 -230 571 857 604 -149 -724
3313 -724 -784 -232 482 868 597 -98 -732 -837 -354 351 868 683 49 -600 -799 -456 286 742 710 122 -579
3334 -579 -840 -472 208 728 789 231 -517 -768 -549 121 697 785 345 -416 -834 -584 -11 693 821 409 -353
3355 -353 -795 -632 -116 598 807 485 -223 -742 -732 -163 536 819 524 -159 -703 -730 -234 469 798 559 -40
3376 -40 -714 -790 -336 392 786 598 46 -682 -762 -397 295 774 669 126 -568 -861 -423 203 743 683 162
3397 162 -547 -816 -520 150 683 760 275 -499 -805 -562 91 667 772 267 -359 -770 -633 -44 601 766
3417 766 384 -312 -773 -706 -90 548 737 461 -250 -705 -669 -144 509 795 443 -136 -665 -702 -213 481 752
3438 752 551 -97 -664 -742 -259 407 761 556 24 -576 -752 -322 325 744 621 43 -579 -734 -403 263
3458 263 705 643 118 -552 -750 -443 196 665 705 191 -574 -782 -447 106 701 700 257 -405 -722 -587 -24
3479 -24 655 750 320 -369 -726 -656 11 611 708 436 -256 -715 -607 -125 503 786 361 -237 -680 -654 -205 508
3501 508 749 427 -205 -692 -691 -209 437 778 529 -93 -675 -692 -311 359 780 556 -43 -611 -791 -334 388
3522 388 749 594 30 -570 -819 -393 221 733 692 131 -544 -784 -426 182 709 813 132 -505 -799 -501
3542 -501 110 708 787 262 -410 -818 -590 55 639 746 342 -343 -795 -664 7 567 771 379 -304 -752
3562 -752 -719 -110 590 845 469 -200 -709 -734 -189 514 812 543 -116 -713 -793 -237 448 855 596 -86 -680
3583 -680 -849 -315 370 814 626 32 -648 -875 -409 344 848 737 135 -623 -795 -486 246 771 762 182 -559
3604 -559 -865 -572 161 782 752 201 -425 -879 -604 95 706 832 324 -410 -854 -691 2 746 848 373
3624 373 -321 -806 -707 -33 570 866 495 -265 -819 -716 -221 569 853 537 -168 -792 -826 -218 511 837 589
3645 589 -129 -719 -840 -342 456 869 601 1 -668 -809 -409 377 842 713 44 -681 -846 -482 284 832
3665 832 745 148 -589 -865 -482 226 771 728 167 -578 -904 -591 189 766 796 282 -497 -871 -598 74 704
3686 704 864 334 -336 -782 -688 -1 649 809 370 -329 -791 -787 -87 623 866 498 -261 -778 -744 -211 531
3707 531 807 573 -163 -754 -840 -311 393 836 613 -27 -663 -778 -307 395 843 655 37 -636 -807 -382
3727 -382 271 776 707 114 -518 -848 -502 185 730 752 184 -464 -843 -604 103 720 765 310 -376 -880 -582
3748 -582 15 590 788 372 -383 -814 -703 -99 587 816 457 -233 -747 -705 -165 539 850 549 -202 -689
3768 -689 -738 -299 377 760 623 -65 -639 -774 -371 351 807 688 94 -647 -815 -435 238 790 728 152 -534
3789 -534 -853 -515 183 720 750 266 -446 -800 -607 44 691 844 359 -394 -727 -687 -41 641 770 458 -294
3810 -294 -789 -692 -164 555 818 545 -116 -747 -772 -271 425 797 546 -127 -699 -793 -334 366 830 659 4
3831 4 -631 -751 -412 268 744 702 121 -584 -846 -516 188 749 750 181 -527 -833 -563 66 693 779 253 -389
3853 -389 -827 -645 20 681 796 386 -336 -824 -667 -70 612 814 467 -266 -837 -756 -140 556 830 549
3873 549 -152 -765 -820 -154 449 826 579 -48 -707 -819 -323 344 817 690 30 -660 -853 -464 294 772
3893 772 721 140 -611 -811 -556 207 719 794 215 -474 -820 -640 65 759 856 319 -435 -803 -633 3 646
3914 646 805 410 -299 -881 -723 -130 617 866 424 -188 -769 -769 -171 449 823 503 -198 -778 -809 -208 446
3935 446 819 616 -48 -646 -840 -391 364 773 660 30 -626 -827 -410 276 778 730 113 -514 -931 -529
3955 -529 203 718 792 201 -491 -788 -638 59 679 759 286 -406 -826 -692 -49 644 831 441 -307 -787 -720
3976 -720 -131 580 786 486 -173 -741 -770 -199 478 828 596 -105 -736 -790 -330 379 822 616 25 -635 -856
3997 -856 -374 347 770 636 51 -546 -866 -506 249 759 735 197 -524 -846 -589 166 717 762 265 -456 -789
4018 -789 -643 71 656 791 396 -407 -866 -692 -60 654 863 439 -267 -746 -732 -103 556 771 501 -195
4038 -195 -770 -772 -209 447 822 577 -119 -664 -753 -277 414 787 644 7 -607 -765 -347 375 854 709 66
4059 66 -573 -819 -472 230 771 715 161 -492 -758 -499 161 717 676 186 -465 -847 -563 48 627 809 361
4080 361 -407 -775 -637 -9 629 788 424 -290 -779 -676 -136 542 779 474 -203 -703 -695 -183 566 745 508
4101 508 -67 -684 -705 -309 410 712 536 -71 -579 -719 -330 337 748 605 86 -570 -795 -398 191 656
4121 656 651 81 -521 -715 -491 165 637 687 182 -450 -709 -493 127 617 661 257 -320 -700 -552 -18 555
4142 555 685 341 -225 -678 -611 -108 520 691 403 -240 -572 -610 -217 443 753 473 -123 -614 -661 -277 314
4163 314 667 556 -47 -582 -756 -331 305 680 574 19 -566 -714 -392 191 608 619 134 -444 -733 -428
4183 -428 175 654 704 175 -423 -696 -449 54 594 674 270 -291 -622 -518 -41 462 692 342 -268 -650 -556
4204 -556 -105 464 684 411 -206 -568 -599 -205 373 659 488 -74 -564 -655 -267 330 680 517 -42 -498 -670
4225 -670 -332 246 644 523 66 -473 -669 -422 209 681 575 148 -396 -691 -400 98 576 647 219 -386
4245 -386 -672 -487 50 564 661 262 -259 -626 -513 -42 410 695 373 -248 -632 -535 -152 412 632 395 -167
4266 -167 -565 -609 -201 407 633 447 -114 -535 -630 -281 272 664 480 25 -476 -677 -294 259 642 596 108
4287 108 -478 -664 -345 191 599 533 165 -420 -635 -434 93 588 592 223 -347 -593 -471 70 540 648 276
4308 276 -268 -581 -486 -60 498 669 355 -252 -637 -541 -108 425 627 389 -111 -566 -604 -159 421 604 437
4329 437 -85 -606 -640 -204 358 677 504 -23 -479 -626 -260 231 581 529 135 -424 -637 -386 140 579 506
4350 506 130 -375 -675 -425 120 491 607 169 -361 -632 -469 34 501 631 302 -312 -607 -483 -46 518
4370 518 651 309 -208 -621 -538 -116 357 674 406 -167 -525 -586 -143 380 638 474 -58 -538 -648 -246 308
4391 308 656 495 20 -515 -603 -303 234 671 561 49 -465 -637 -379 140 609 575 179 -395 -659 -456 93
4412 93 545 604 206 -365 -619 -537 -16 521 653 283 -306 -626 -571 -32 506 679 412 -192 -612 -606 -120 493
4434 493 695 423 -194 -658 -659 -169 349 704 507 -88 -615 -642 -245 365 693 539 -3 -527 -631 -362 249
4455 249 693 574 73 -507 -669 -395 199 648 661 157 -400 -699 -478 132 596 665 256 -437 -683 -480 14
4476 14 602 708 361 -306 -697 -604 -83 557 739 376 -238 -666 -624 -144 479 747 495 -174 -697 -657 -204
4497 -204 426 707 519 -94 -611 -677 -259 399 757 483 44 -558 -696 -381 255 726 635 83 -511 -738 -453
4518 -453 261 703 667 165 -442 -799 -443 126 685 667 218 -428 -768 -572 79 594 686 296 -330 -736 -632
4539 -632 -30 576 679 396 -248 -712 -611 -102 496 682 429 -211 -669 -682 -116 408 672 443 -73 -596
4559 -596 -691 -243 392 706 596 -20 -540 -704 -287 272 685 602 -5 -552 -733 -432 226 710 661 180 -434
4580 -434 -736 -432 114 651 694 226 -373 -747 -527 28 553 683 262 -354 -739 -581 -23 533 681 386
4600 386 -205 -686 -647 -127 471 703 430 -173 -654 -664 -260 395 706 543 -74 -589 -644 -311 296 677 582
4621 582 11 -520 -697 -348 304 626 611 142 -507 -685 -460 155 696 657 182 -484 -703 -474 112 598 706
4642 706 280 -371 -649 -494 -61 505 701 337 -243 -671 -620 -92 481 694 403 -203 -728 -688 -170 414 702
4663 702 503 -116 -541 -671 -261 357 652 454 -86 -523 -660 -329 334 728 575 103 -499 -702 -384 152
4683 152 622 640 149 -399 -731 -520 171 637 631 204 -355 -693 -556 44 548 722 318 -339 -656 -516 -93
4704 -93 504 733 383 -241 -613 -587 -130 513 705 461 -139 -616 -670 -197 390 689 516 -76 -587 -681 -310
4725 -310 310 678 571 -31 -525 -694 -349 227 663 568 63 -487 -692 -375 186 667 601 154 -407 -718 -440
4746 -440 55 544 669 207 -323 -648 -436 -9 578 708 350 -294 -690 -525 -30 524 711 387 -241 -592
4766 -592 -561 -119 471 655 393 -97 -566 -580 -195 390 638 465 -77 -534 -731 -253 276 667 504 29 -477
4787 -477 -677 -338 190 551 579 103 -470 -646 -437 149 553 560 175 -375 -691 -471 105 506 620 219 -265
4808 -265 -674 -517 2 508 659 328 -267 -616 -567 -80 474 640 391 -166 -597 -582 -109 444 587 404 -136
4829 -136 -556 -604 -221 340 643 531 -97 -512 -582 -316 274 617 552 75 -434 -594 -353 223 609 543 102
4850 102 -449 -650 -363 160 581 584 175 -324 -644 -465 49 536 642 221 -245 -659 -475 -21 491 636 321
4871 321 -256 -578 -547 -118 452 610 383 -165 -577 -545 -108 428 678 458 -132 -573 -555 -179 306 657 526
4892 526 -8 -532 -601 -249 291 587 483 56 -497 -607 -346 220 561 560 110 -462 -614 -360 158 499 494 170
4914 170 -357 -647 -388 71 506 572 220 -343 -544 -453 -26 518 630 265 -238 -647 -482 -72 489 574 313
4935 313 -136 -577 -507 -84 413 590 337 -138 -578 -490 -151 359 621 412 -88 -440 -521 -203 279 531 398
4956 398 6 -489 -580 -243 148 504 443 113 -345 -529 -350 164 443 527 117 -315 -524 -358 57 453 522
4977 522 167 -289 -475 -373 59 424 495 203 -199 -504 -430 -79 411 569 279 -165 -490 -501 -89 368 506
4998 506 287 -93 -413 -495 -137 287 475 352 -110 -412 -537 -192 234 458 310 -23 -433 -460 -215 167 461
5019 461 394 83 -309 -524 -235 128 410 423 159 -329 -439 -310 -35 387 457 179 -195 -406 -353 50 371
5040 371 453 200 -209 -446 -388 -14 354 473 251 -185 -392 -334 -92 311 399 240 -154 -456 -403 -178 218 440
5062 440 316 -69 -373 -440 -215 168 432 374 9 -294 -395 -169 119 429 423 77 -273 -424 -281 63 387
5083 387 391 105 -195 -476 -273 99 367 419 182 -193 -450 -306 53 284 430 217 -118 -385 -424 -37 246
5104 246 430 269 -82 -371 -342 -98 215 449 303 -78 -372 -355 -143 194 398 320 -13 -275 -427 -181 150
5125 150 399 287 41 -284 -393 -218 114 454 392 43 -291 -392 -227 36 357 411 97 -218 -403 -268 63
5146 63 342 335 122 -199 -392 -338 -43 358 415 226 -154 -416 -334 -71 249 363 247 -66 -346 -339 -75 269 398
5169 398 261 -23 -302 -319 -141 219 364 298 3 -272 -359 -127 105 371 317 25 -254 -357 -209 135 259
5190 259 342 120 -261 -364 -259 81 363 309 110 -240 -338 -268 54 279 350 179 -141 -316 -334 -19 255 348
5212 348 167 -82 -321 -288 -23 224 320 201 -69 -259 -299 -85 136 324 230 -39 -264 -322 -57 129 307 251
5234 251 6 -259 -309 -172 127 277 202 -70 -198 -337 -226 87 253 277 48 -210 -376 -243 25 279 285 82
5256 82 -205 -331 -282 -17 259 270 110 -80 -308 -219 -1 273 334 152 -62 -293 -197 -57 202 279 207 -75 -306
5279 -306 -236 -54 186 318 208 -4 -271 -265 -115 164 288 230 -26 -260 -268 -128 123 278 281 -10 -192 -285 -119
5302 -119 85 235 246 119 -151 -270 -166 48 249 326 125 -152 -303 -234 -40 235 231 118 -124 -262 -303 -82
5324 -82 190 251 194 -107 -300 -295 -92 232 292 216 -22 -264 -255 -122 138 297 225 -28 -234 -277 -90 157 240 233 -30
5349 -30 -204 -273 -160 73 283 327 38 -186 -269 -173 117 250 235 97 -117 -268 -159 30 262 289 116 -40
5371 -40 -254 -189 -22 141 248 116 -120 -231 -254 -79 121 273 144 -89 -214 -185 -101 132 288 145 -35 -190
5393 -190 -218 -166 114 243 180 21 -129 -250 -72 143 262 148 40 -224 -253 -121 46 153 127 89 -121 -164
5415 -164 -164 58 128 201 92 -102 -238 -202 -29 201 186 118 -24 -216 -157 -21 142 198 150 -16 -124 -193 -62 51
5439 51 247 130 -32 -162 -201 -74 65 206 180 6 -138 -153 -123 -3 202 153 71 -65 -176 -136 12 121 185
5462 185 89 -69 -109 -86 2 95 187 168 -96 -126 -171 -39 131 174 193 64 -122 -199 -64 80 173 82 16 -108 -226
5487 -226 -84 59 166 143 70 -102 -135 -99 26 103 119 43 -86 -190 -93 32 153 174 87 -91 -190 -153 -52 121
5511 121 186 79 -64 -172 -159 7 151 173 112 -76 -120 -157 -50 100 125 64 51 -154 -188 -102 32 179 144 28
5535 28 -125 -221 -131 77 133 224 48 -101 -142 -84 19 138 173 35 -98 -178 -158 6 89 232 112 -72 -149 -160
5559 -160 10 109 151 127 -27 -159 -157 -65 43 224 121 -14 -167 -199 -89 75 215 141 29 -150 -146 -112 49 136
5583 136 138 -5 -70 -197 -95 70 138 149 44 -40 -123 -100 -1 131 194 114 -5 -212 -117 -38 83 189 88 -39
5607 -39 -135 -44 -38 130 200 70 -74 -118 -156 -34 93 160 136 51 -144 -146 -4 55 159 98 -47 -163 -215 -92 43
5632 43 150 182 44 -135 -235 -139 27 139 150 36 -70 -172 -153 24 103 159 9 -103 -195 -119 21 100 149 67
5656 67 -82 -132 -171 -24 161 147 24 -86 -221 -153 -47 102 71 131 -73 -181 -77 -104 95 194 92 -18 -160
5679 -160 -201 -54 99 142 99 -51 -72 -126 -95 60 205 94 14 -131 -159 -50 50 169 175 47 -135 -127 -104 55
5703 55 111 159 17 -118 -180 -74 -18 141 184 45 -90 -104 -101 -4 134 140 63 -73 -151 -164 17 70 119 88 -104 -159
5729 -159 -152 -46 117 204 113 -80 -147 -112 -35 124 139 56 -3 -103 -139 -23 65 138 84 18 -114 -147 -21 69 157 137
5755 137 -33 -102 -177 -61 68 126 124 1 -105 -121 -72 43 103 116 32 -90 -87 -69 42 106 103 65 -75 -151 -52 74
5781 74 104 112 46 -41 -107 -59 -68 144 61 37 -110 -130 -74 -5 99 125 30 13 -126 -78 29 66 181 38 -44 -126 -82 -25
5809 -25 82 125 109 2 -66 -71 -21 94 102 80 -20 -133 -160 -35 34 64 76 -6 -86 -45 -25 97 25 47 65 -97 -36
5836 -36 9 36 44 68 0 -45 -27 -33 11 81 88 10 -79 -116 -64 59 64 21 37 -84 -97 -46 67 57 86 12 -122 -120 -11 42
5866 42 103 88 -13 8 -123 23 27 102 143 57 -19 -96 -105 0 78 41 36 -67 -114 -69 -16 89 101 28 -88 -75 -18 -17 20
5895 20 39 32 -57 -111 -38 -7 30 108 29 -20 -128 -78 7 44 35 92 -37 -88 -70 -91 56 77 93 -17 -98 -96 -15 57 41 94
5925 94 18 -79 -133 -67 28 114 82 23 -70 -108 -80 72 83 118 37 -71 -70 -98 -26 49 95 57 -15 -68 -64 -22 102 100 -5 -11
5955 -11 -124 -102 4 112 121 98 -41 -152 -76 -28 32 163 93 -42 -114 -109 -30 41 124 89 -31 -79 -83 33 122 119 113 -72
5983 -72 -112 -144 -52 17 131 122 21 -77 -141 -67 89 91 93 17 -85 -118 -68 45 89 79 39 -63 -142 -132 20 98 121 79
6011 79 -37 -100 -49 -36 66 141 68 -82 -103 -142 4 29 120 50 -26 -144 -116 -39 63 124 120 -32 -58 -102 -81 74 154
6038 154 98 -40 -118 -186 -43 -6 167 26 8 -102 -111 -13 51 130 140 28 -109 -135 -87 84 167 135 53 -95 -184 -104
6064 -104 21 141 105 48 -35 -193 -100 82 93 154 47 -80 -129 -127 55 72 132 89 -74 -164 -129 -1 94 117 115 25
6090 25 -129 -173 -87 69 155 107 -20 -119 -132 -91 16 152 115 36 -87 -209 -97 37 140 117 41 -111 -136 -97 19
6115 19 99 177 68 -66 -212 -133 16 113 133 87 -75 -174 -109 10 175 144 49 -46 -193 -128 -38 164 140 12 -122
6140 -122 -162 -101 52 115 154 112 -57 -124 -126 -23 90 234 60 -33 -79 -147 -29 95 167 165 52 -141 -139 -36 121
6165 121 185 91 -3 -145 -154 -112 -22 152 97 51 -73 -175 -100 28 122 168 -24 -82 -172 -120 21 94 199 38 -100
6190 -100 -196 -167 27 184 176 66 -85 -154 -155 22 145 195 28 -64 -198 -135 19 70 138 83 -46 -163 -107 3 105
6215 105 188 60 -110 -180 -131 -12 78 189 28 -131 -199 -208 -21 65 139 72 -78 -177 -136 -67 100 187 127 -39 -208
6240 -208 -197 -82 103 100 163 -2 -129 -166 -95 57 184 164 24 -137 -146 -81 -2 173 156 66 -117 -189 -107 100 145
6265 145 156 33 -85 -183 -141 13 155 102 28 -106 -177 -118 52 155 146 18 -51 -123 -175 39 56 97 75 -71 -166
6290 -166 -117 -51 141 228 100 -32 -153 -171 -74 147 211 112 -36 -97 -123 -69 54 163 93 2 -110 -149 -34 56 120
6315 120 70 3 -154 -163 -46 44 185 149 37 -91 -176 -93 60 153 100 27 -74 -185 -92 32 169 136 34 -82
6339 -82 -144 -87 37 155 137 82 -83 -124 -126 59 146 133 58 -80 -134 -96 6 139 177 26 -28 -128 -169 -33 92
6364 92 113 111 -47 -183 -123 -36 101 96 31 -55 -148 -137 4 113 90 115 18 -122 -154 -60 97 137 86 -5 -90 -130 -3
6391 -3 49 150 92 45 -62 -127 -75 117 116 107 56 -131 -121 -95 40 85 104 -29 -100 -136 -101 5 67 124 91 -128 -145 -118
6419 -118 41 111 106 21 -124 -92 -129 -9 135 157 22 -5 -171 -101 7 103 193 66 -72 -89 -87 -24 119 87 80 -43
6445 -43 -132 -135 -17 100 173 83 -42 -143 -119 -39 88 144 81 -14 -105 -205 -25 92 111 112 -89 -141 -132 -95 85 188
6471 188 115 42 -108 -160 -53 75 135 99 -2 -121 -78 -117 16 165 154 24 -104 -177 -48 26 208 132 93 -65
6495 -65 -145 -55 0 131 182 93 -141 -150 -140 46 120 156 69 -16 -209 -167 -40 176 167 75 -45 -131 -227 -23 125 130 106
6522 106 12 -149 -146 -75 101 181 41 -26 -155 -124 -37 109 170 85 -61 -195 -154 -129 118 158 150 49 -180 -194 -90
6547 -90 71 182 179 5 -144 -196 -119 78 151 175 73 -93 -147 -150 -5 149 211 38 -46 -191 -68 -41 174 179 135
6572 135 -29 -225 -133 -78 189 158 96 3 -157 -154 -59 197 212 116 -46 -185 -179 -61 96 200 130 -55 -169 -231 -105
6597 -105 54 245 160 -21 -125 -184 -149 82 178 135 45 -90 -136 -74 17 148 201 7 -99 -193 -176 44 168 187
6621 187 134 -108 -308 -235 -31 191 196 49 -125 -179 -204 -20 176 223 171 -95 -296 -226 -17 204 181 149 -76 -247
6645 -247 -257 8 143 227 137 9 -177 -237 -98 75 213 189 12 -159 -241 -54 -5 226 210 11 -158 -294 -122
6668 -122 72 195 192 57 -208 -257 -156 61 181 256 75 -116 -271 -170 19 208 252 79 -96 -246 -224 -25
6690 -25 273 259 86 -64 -263 -218 -43 237 232 136 -108 -228 -225 -49 117 319 165 -96 -187 -275 -73 112 252
6713 252 179 -7 -233 -232 -81 208 253 181 -13 -180 -257 -120 67 234 278 28 -233 -248 -171 87 208 211 22 -192
6737 -192 -261 -144 84 205 241 54 -147 -274 -256 -20 240 249 122 -118 -307 -247 -36 230 313 97 -101 -269
6759 -269 -208 -56 178 232 210 -70 -207 -193 -44 144 287 242 14 -221 -250 -55 116 233 207 57 -230 -295 -94
6782 -94 81 260 255 22 -196 -313 -180 98 287 248 101 -148 -269 -173 33 227 304 64 -124 -263 -233 -23
6804 -23 194 304 171 -137 -281 -245 -27 187 297 163 -93 -228 -217 -25 174 329 189 2 -253 -295 -67
6825 -67 173 246 182 -58 -206 -238 -145 178 284 243 -14 -264 -274 -119 79 223 223 20 -177 -285 -193 36 258
6848 258 223 49 -193 -261 -172 54 251 235 157 -185 -255 -156 -28 208 277 171 -148 -299 -233 -47 266 314 144
6871 144 -56 -241 -219 -50 178 286 194 -50 -272 -268 -85 138 286 136 1 -202 -275 -82 94 298 238 5
6893 5 -273 -278 -146 80 274 261 8 -223 -262 -191 39 308 252 92 -149 -258 -174 26 256 272 135 -78 -268
6916 -268 -219 46 207 265 191 -107 -286 -191 -55 219 248 123 -88 -240 -283 -56 152 278 233 -61 -263 -215 -152
6939 -152 107 295 274 -12 -225 -274 -94 87 320 258 -29 -176 -253 -94 60 237 241 41 -168 -261 -124 31
6961 31 242 276 109 -163 -316 -186 28 216 245 125 -114 -288 -212 1 189 272 151 -34 -256 -248 -56 135
6983 135 307 172 -51 -246 -258 -92 177 231 239 27 -210 -267 -150 86 226 208 13 -197 -282 -198 102 244 267
7006 267 56 -188 -260 -147 60 292 302 87 -158 -317 -198 29 198 303 192 -173 -274 -220 -50 174 318
7027 318 157 -110 -280 -317 -70 155 299 217 -116 -215 -312 -142 120 256 257 -22 -236 -283 -130 131 223 235 4
7050 4 -232 -243 -201 87 233 307 105 -180 -359 -230 11 228 286 100 -168 -294 -296 11 216 275 109 -104 -290
7073 -290 -283 -40 193 298 146 -125 -227 -293 -112 176 306 198 -70 -254 -269 -109 146 301 210 4 -269 -272
7095 -272 -129 114 298 214 66 -197 -315 -152 88 305 317 75 -193 -350 -236 4 245 282 61 -139 -332
7116 -332 -194 0 263 301 151 -113 -323 -279 -32 153 292 209 -102 -306 -262 -117 186 348 221 -46 -246
7137 -246 -297 -184 137 319 275 -33 -241 -287 -128 165 278 289 44 -193 -312 -216 89 250 311 110 -147 -348
7159 -348 -208 29 225 248 109 -117 -315 -226 21 191 256 143 -126 -250 -326 -23 224 293 171 -93 -244 -321
7181 -321 -94 168 297 222 -80 -260 -322 -121 184 330 216 3 -267 -347 -137 130 289 279 58 -236 -287 -267
7203 -267 82 304 261 61 -192 -318 -252 32 195 325 117 -138 -338 -250 -20 220 366 207 -192 -270 -248 -38
7225 -38 215 341 207 -36 -260 -217 -21 183 334 199 -88 -225 -300 -93 171 319 254 14 -181 -280 -162 96
7247 96 283 257 30 -221 -254 -198 115 278 219 75 -183 -276 -202 68 267 274 37 -95 -277 -215 72 264 276 137
7271 137 -112 -315 -247 -18 256 303 198 -112 -290 -264 -95 201 312 171 -49 -200 -291 -113 205 317 249 26
7293 26 -223 -288 -156 112 303 285 37 -202 -329 -168 112 328 247 73 -162 -345 -226 60 243 366 41
7314 41 -125 -287 -275 41 264 316 135 -144 -306 -276 -11 242 248 196 -141 -229 -275 -35 207 356 203 -50 -293
7337 -293 -256 -115 160 294 207 8 -246 -284 -176 130 316 248 74 -207 -267 -145 63 243 244 73 -185 -297
7359 -297 -148 -16 282 248 122 -150 -366 -247 46 278 261 160 -86 -255 -264 -26 217 318 144 -41 -284
7380 -284 -250 -13 182 322 181 -60 -273 -290 -73 152 275 222 10 -266 -301 -60 134 316 272 21 -245 -246
7402 -246 -131 82 276 271 78 -202 -325 -187 13 279 340 166 -113 -324 -224 40 248 312 140 -136 -315
7423 -315 -229 -22 223 317 177 -66 -290 -270 -15 195 366 201 -16 -258 -267 -117 152 301 235 25 -282 -277 -118
7446 -118 100 320 235 19 -222 -317 -112 135 273 260 68 -203 -320 -213 124 292 254 83 -130 -304 -192
7467 -192 8 276 365 113 -89 -311 -197 33 246 291 167 -103 -320 -338 -66 266 328 204 -120 -304 -328 -95
7489 -95 189 318 207 -30 -303 -277 -57 166 362 273 -29 -277 -406 -168 122 295 262 2 -274 -343 -130 114
7511 114 353 308 54 -205 -299 -160 80 322 327 166 -163 -372 -203 66 260 328 123 -168 -289 -245 -5 251
7533 251 363 210 -123 -312 -298 -89 229 327 224 -63 -290 -316 -56 204 377 245 -15 -287 -306 -118 210
7554 210 414 215 -23 -308 -360 -114 131 300 284 27 -248 -310 -230 112 347 343 96 -192 -345 -189 114 316
7576 316 337 87 -219 -325 -243 11 237 348 146 -172 -312 -315 42 287 393 225 -143 -337 -299 -12 231 332
7598 332 239 -114 -291 -263 -61 195 357 219 -98 -247 -310 -99 237 370 226 -26 -227 -306 -128 143 332
7619 332 325 68 -213 -315 -197 127 345 355 34 -220 -383 -288 102 290 331 32 -211 -364 -249 66 317 307
7641 307 195 -87 -340 -257 -15 249 339 157 -99 -299 -294 -77 195 334 214 -74 -327 -253 -63 219 323 249
7663 249 -62 -269 -315 -109 195 407 227 -30 -244 -291 -145 112 242 286 69 -218 -373 -144 88 255 261 92
7685 92 -228 -343 -240 49 225 263 84 -184 -300 -235 30 252 297 116 -156 -304 -281 3 233 314 181 -14
7707 -14 -283 -251 -20 230 320 161 -86 -291 -276 -87 199 272 237 -89 -240 -312 -102 114 302 224 -33 -233 -336
7730 -336 -219 140 289 274 29 -220 -340 -177 117 285 280 111 -194 -308 -185 54 230 328 91 -196 -238 -198
7752 -198 34 272 295 162 -96 -304 -265 3 201 280 203 -78 -249 -261 -31 178 273 177 -128 -257 -260 -106 110
7775 110 332 164 7 -204 -286 -155 76 293 241 33 -232 -338 -155 89 341 306 99 -246 -285 -209 58 281
7797 281 301 125 -164 -297 -225 15 221 268 106 -196 -287 -268 -5 290 321 158 -101 -280 -299 -61 160 319
7819 319 214 -27 -249 -273 -110 180 325 211 -39 -254 -327 -126 149 275 256 17 -188 -280 -218 51 293 266
7841 266 88 -226 -329 -200 99 316 304 118 -176 -309 -243 36 209 330 133 -103 -336 -224 0 214 300
7862 300 135 -115 -318 -258 8 206 293 214 -30 -287 -304 -165 160 323 212 -51 -231 -298 -94 186 335 301
7884 301 38 -234 -323 -128 139 275 205 73 -188 -278 -196 59 311 253 95 -179 -279 -235 70 307 314 117 -153
7907 -153 -291 -292 -26 256 360 125 -131 -292 -237 -23 256 370 177 -92 -291 -312 -111 177 323 141 -66
7928 -66 -260 -336 -106 198 317 236 31 -289 -270 -120 118 356 267 0 -287 -329 -164 82 335 295 67 -222
7950 -222 -332 -287 69 276 305 37 -191 -328 -193 46 252 312 138 -83 -324 -302 -46 203 303 138 -102
7971 -102 -280 -259 -34 209 302 210 -70 -253 -265 -60 139 297 233 -40 -172 -280 -110 128 338 268 71 -231
7993 -231 -288 -128 128 310 301 31 -273 -387 -201 92 254 351 94 -177 -313 -177 50 319 263 97 -172 -304
8015 -304 -213 -2 245 308 133 -149 -334 -329 2 224 250 157 -68 -297 -257 -78 221 262 195 -32 -224 -285 -109
8038 -109 166 278 270 -15 -243 -314 -120 73 364 279 44 -233 -317 -146 98 295 277 83 -178 -285 -206 25
8060 25 293 330 118 -188 -312 -174 -9 239 288 131 -97 -332 -284 -22 184 241 149 -96 -292 -250 -110 139
8082 139 315 223 -43 -266 -279 -132 131 278 250 -43 -291 -302 -136 137 296 269 9 -202 -264 -116 73 264
8104 264 314 92 -216 -303 -234 9 191 294 69 -113 -317 -208 14 211 282 176 -105 -247 -236 -43 243 256
8126 256 215 -66 -319 -237 -112 217 360 251 15 -277 -253 -52 193 283 208 -44 -244 -288 -147 105 325 232
8148 232 9 -159 -259 -181 110 230 205 113 -140 -271 -215 64 197 224 102 -179 -233 -240 -20 252 373 143 -74
8171 -74 -292 -241 -12 221 299 137 -27 -214 -284 -62 217 300 213 -52 -218 -247 -114 144 294 252
8191B52
$$ Imaginary data points
##PAGE= N=2
##DATA TABLE= (X++(I..I)), XYDATA
0 0 0 0 0 0 0 0 0 0 0 0 0 8 0 0 -8 8 -8 13 -9 16 -19 19 -27 28 -31 43 -45 52 -63 66 -79 91 -100 117 -129 142
36 142 -164 181 -199 226 -246 273 -306 334 -373 411 -449 498 -548 602 -667 731 -807 894 -987
55 -987 1098 -1224 1366 -1540 1747 -1998 2321 -2733 3296 -4109 5367 -7565 12194 -26080 158668
70 158668 906880 1017117 409685 -518650 -1040728 -824647 4649 817604 1032383 498704
80 498704 -395310 -993762 -867476 -114310 716965 1018354 582880 -273702 -920301 -897196
90 -897196 -223054 603432 986558 650397 -151716 -835109 -907524 -323077 488877 938151
100 938151 704333 -36909 -741515 -903659 -409842 374445 879605 742817 70143 -644821
110 -644821 -886204 -484331 263621 812568 768281 168147 -546099 -858186 -546280 157686
120 157686 739603 780995 256612 -447285 -820586 -596566 56619 661433 782560 336088
130 336088 -348923 -774393 -635446 -38594 579688 773423 405334 -252552 -720598 -663051
140 -663051 -126478 496031 754267 464045 -159245 -660692 -679916 -206821 410901 725777
150 725777 512973 -69007 -595286 -686445 -279893 324807 688925 551902 16662 -525658
160 -525658 -682875 -344235 239780 644947 580592 96302 -453095 -669767 -399820 156723
170 156723 594703 599085 169636 -378541 -648107 -446310 76643 539255 608087 236246
180 236246 -303154 -618725 -484103 -40 479488 608256 295863 -227950 -582543 -512793
190 -512793 -72433 416296 599978 348180 -153485 -540072 -532833 -139660 351130 583910
200 583910 392432 -81665 -492809 -544251 -201067 284711 560714 428850 -12576 -441371
210 -441371 -547635 -256611 217992 531166 457681 53315 -386478 -543425 -305663 151744
220 151744 495954 478502 114504 -329528 -532081 -347908 87129 455878 491903 171373
230 171373 -270777 -514016 -383417 24299 411483 498041 223207 -211249 -489886 -411952
240 -411952 -35984 363434 497039 269715 -151479 -460231 -433722 -93162 312646 489478
250 489478 310531 -92120 -425390 -448578 -146613 259573 475280 345246 -34115 -386203
260 -386203 -456484 -195566 205417 455204 373548 21749 -343455 -457749 -239691 150645
270 150645 429473 395504 75154 -297530 -452636 -278993 95768 398809 411187 125681
280 125681 -249085 -441269 -312776 41509 363564 420400 172339 -198995 -424032 -340723
290 -340723 -10944 324661 423202 214695 -147993 -401400 -362753 -61472 282415 419819
300 419819 252460 -96697 -373725 -378627 -109262 237528 410413 285258 -45852 -341677
310 -341677 -388451 -153675 190911 395300 312347 3623 -305771 -392113 -193925 143531
320 143531 375052 333516 50681 -267259 -389809 -229256 96469 350348 349008 94760
330 94760 -226565 -381993 -259802 49947 321589 358867 135949 -184036 -369002 -285594
340 -285594 4192 289169 363208 173939 -140153 -351031 -306559 -40328 253491 362117
350 362117 208006 -95948 -328568 -322033 -82295 215536 355766 237499 -52092 -302298
360 -302298 -332263 -121448 176040 344392 262405 -9195 -272608 -337097 -157059 135692
370 135692 328527 282295 31739 -240323 -336876 -188840 95150 308550 297385 70740
380 70740 -205776 -331785 -216797 54552 284973 307609 107296 -169462 -322071 -240619
390 -240619 14719 257964 313015 141149 -132044 -308030 -260025 -23947 228204 313674
400 313674 171432 -94278 -290144 -274852 -60488 196523 309798 197959 -56714 -268900
410 -268900 -285172 -94615 163380 301653 220607 -19978 -244736 -290923 -126137 129176
420 129176 289664 239196 15664 -218045 -292480 -154502 94723 274025 253730 49557
430 49557 -189478 -289847 -179595 60311 255235 264135 81367 -159421 -283373 -201201 26421
441 26421 233673 270615 111027 -128242 -273256 -219381 -6651 209770 273044 137942 -96535
452 -96535 -259784 -233817 -38465 183759 271705 162069 -64607 -243289 -244604 -68481 156347
463 156347 266729 182993 -33047 -224105 -251574 -96324 127944 258318 200694 -2373
473 -2373 -202676 -254916 -121946 98774 246793 215051 27538 -179078 -254828 -145175 69192
484 69192 232316 226090 55906 -154026 -251226 -165601 39747 215165 233688 82603 -127682
495 -127682 -244275 -183064 10697 195660 237887 107308 -100432 -234375 -197655 -17755
505 -17755 174220 238701 129736 -72706 -221521 -209005 -44797 150990 236336 149868 -44726
516 -44726 -205947 -217159 -70673 126378 230697 167199 -17112 -188224 -222028 -94541 100884
527 100884 222083 181732 9767 -168387 -223643 -116360 74775 210711 193205 35674
537 35674 -146860 -222083 -135916 48483 196757 201600 60351 -123940 -217466 -153009 22111
548 22111 180371 207042 83418 -99957 -210031 -167354 -3524 162087 209282 104517 -75417
559 -75417 -199825 -178869 -28253 142104 208478 123266 -50772 -187209 -187199 -51280 121103
570 121103 204769 139564 -26647 -172633 -192624 -72888 99151 198505 153352 -2950 -156209
581 -156209 -195248 -92657 76615 189681 164511 19991 -138133 -195306 -110572 53954 178594
592 178594 172990 41900 -118839 -192649 -126323 31274 165371 178909 62592 -98566 -187413
603 -187413 -139906 8769 150338 182231 81860 -77432 -179779 -151174 -13179 133649
613 133649 182934 99314 -56086 -169977 -159867 -33984 115888 181039 114640 -34700 -158164
624 -158164 -166129 -53613 97188 176825 127765 -13762 -144647 -169844 -71693 77895 170346
635 170346 138749 6624 -129677 -171268 -88393 58240 161767 147443 26368 -113401 -170255
646 -170255 -103200 38393 151266 153977 44980 -96153 -166936 -116161 18631 139176 158182
657 158182 62288 -78320 -161494 -127042 -569 125754 160195 78295 -59900 -154061 -135962
668 -135962 -19275 110877 159925 92698 -41391 -144877 -142764 -37040 95048 157492 105434
679 105434 -22805 -133934 -147440 -53765 78465 153069 116327 -4548 -121630 -149978 -69413
690 -69413 61147 146676 125445 13339 -107918 -150411 -83616 43525 138561 132634 30452
701 30452 -93144 -148790 -96286 25879 128723 137690 46627 -77658 -145162 -106971 8704
712 8704 117584 140581 61551 -61825 -139781 -115995 -8086 105182 141657 75148 -45629
723 -45629 -132619 -123157 -24364 91746 140726 87444 -29124 -123991 -128495 -39741 77373 137902
735 137902 98121 -12749 -113865 -131922 -54225 62474 133360 107212 3383 -102468 -133521
746 -133521 -67550 47138 127195 114537 18823 -90018 -133193 -79512 31630 119370 120193 33797
758 33797 -76766 -131122 -90122 16084 110213 124014 47843 -62720 -127270 -99210 634
769 634 99655 126052 60877 -48136 -121822 -106836 -14492 87989 126272 72899 -33166 -114773
781 -114773 -112767 -29070 75436 124794 83405 -18315 -106318 -116850 -42550 62273 121518
792 121518 92404 -3679 -96698 -119232 -55061 48702 116768 99793 10502 -86067 -119801 -66435
804 -66435 34832 110492 105622 24076 -74589 -118768 -76550 21088 103053 109840 36940 -62488
816 -62488 -116086 -85275 7351 94305 112470 49005 -49853 -112063 -92782 -6204 84518 113515
828 113515 60014 -36747 -106575 -98724 -19267 73779 112965 69992 -23547 -99770 -103223 -31686
840 -31686 62477 110879 78678 -10444 -91746 -106046 -43369 50536 107404 86124 2378 -82714
852 -82714 -107539 -54085 38283 102628 92095 14823 -72941 -107438 -63693 26083 96514 96759
864 96759 26633 -62433 -105819 -72200 13684 89326 99811 37768 -51457 -102941 -79483 1548
876 1548 81204 101505 48112 -40021 -98768 -85595 -10341 72133 101892 57565 -28367 -93395
888 -93395 -90296 -21674 62387 100805 65934 -16709 -86941 -93717 -32445 52191 98571 73225
900 73225 -5161 -79472 -95784 -42366 41509 95027 79200 5933 -71288 -96517 -51375 30785
912 30785 90337 84032 16732 -62497 -95926 -59535 19922 84662 87620 27027 -53043 -94223
924 -94223 -66833 8964 77965 90126 36759 -43002 -91313 -73067 -1805 70432 91283 45723
936 45723 -32840 -87208 -78091 -12220 62244 91236 53813 -22541 -82254 -81913 -22073 53511 90114
949 90114 60918 -12274 -76292 -84623 -31421 44332 87703 67200 -2057 -69556 -86280 -40190
961 -40190 34814 84261 72357 7898 -61977 -86679 -48324 25090 79914 76504 17530 -53939
973 -53939 -86047 -55476 15193 74624 79650 26717 -45416 -84257 -61769 5523 68530 81549
985 81549 35192 -36538 -81504 -67064 -4054 61801 82424 43237 -27227 -77691 -71528 -13449
997 -13449 54256 82269 50496 -17864 -73005 -74895 -22472 46123 80953 56859 -8430 -67390
1009 -67390 -77187 -30852 37698 78687 62322 722 -61113 -78469 -38767 28965 75450 66889
1021 66889 9853 -54135 -78612 -45882 20035 71221 70466 18562 -46641 -77789 -52252 11047
1033 11047 66216 73047 26842 -38667 -75916 -57890 2033 60353 74646 34607 -30341 -73142
1045 -73142 -62705 -6690 53792 75149 41832 -21806 -69356 -66352 -15228 46787 74664 48165
1057 48165 -13169 -64718 -69147 -23334 39284 73180 53780 -4544 -59445 -70902 -30846 31418
1069 31418 70705 58432 3830 -53478 -71673 -37831 23334 67349 62344 11985 -46864 -71463
1081 -71463 -44108 15201 63271 65281 19820 -39842 -70405 -49633 7044 58442 67280 27234
1093 27234 -32431 -68358 -54481 -1129 52873 68302 34036 -24738 -65392 -58456 -8949 46733
1105 46733 68447 40352 -16979 -61769 -61563 -16629 40167 67637 45887 -9129 -57245 -63637
1117 -63637 -23824 33224 65966 50601 -1423 -52302 -65106 -30481 26048 63478 54596 6162
1129 6162 -46638 -65445 -36521 18773 60270 57861 13511 -40609 -64989 -42024 11330 56298
1141 56298 60289 20404 -34073 -63650 -46933 3918 51727 61806 26921 -27405 -61624 -51009
1153 -51009 -3326 46589 62568 32954 -20415 -58815 -54423 -10449 40950 62429 38397 -13279
1165 -13279 -55333 -56995 -17272 34840 61520 43348 -6284 -51125 -58824 -23688 28482 59831
1177 59831 47608 863 -46401 -59806 -29702 21884 57440 51174 7755 -41116 -60001 -35219
1189 -35219 15034 54333 54063 14388 -35428 -59463 -40206 8138 50488 56033 20867 -29364
1201 -29364 -58135 -44517 1277 46130 57353 26794 -23110 -56044 -48221 -5375 41242 57762
1213 57762 32206 -16662 -53309 -51108 -11818 35954 57539 37133 -10156 -49981 -53324 -17925
1225 -17925 30373 56503 41536 -3606 -46036 -54841 -23796 24447 54814 45264 2823 -41480
1237 -41480 -55619 -29207 18338 52431 48377 9156 -36591 -55672 -34183 11988 49343 50749
1249 50749 15326 -31207 -54939 -38690 5600 45647 52481 21080 -25517 -53508 -42555 -724
1261 -724 41496 53510 26607 -19553 -51424 -45796 -6985 36765 53726 31526 -13439 -48619
1273 -48619 -48347 -12963 31746 53298 36090 -7243 -45182 -50223 -18714 26287 52079 40006
1285 40006 -1144 -41295 -51368 -24033 20577 50287 43315 4878 -36932 -51760 -29044 14798
1297 14798 47736 45881 10636 -32082 -51603 -33381 8971 44754 47880 16176 -27116 -50671
1309 -50671 -37291 3096 41139 49139 21337 -21844 -49057 -40556 -2515 37139 49742 26083
1321 26083 -16422 -46923 -43197 -8069 32825 49767 30451 -10882 -44192 -45250 -13433 28057
1333 28057 49019 34396 -5257 -40945 -46756 -18561 23004 47776 37694 294 -37216 -47605
1345 -47605 -23327 17785 45896 40593 5804 -33131 -47863 -27748 12438 43453 42791 11047
1357 11047 -28632 -47425 -31632 6974 40465 44499 16071 -23807 -46338 -35151 1639 37023
1369 37023 45509 20791 -18835 -44760 -37965 -3681 33275 45905 25182 -13778 -42593 -40335
1381 -40335 -8769 29029 45680 29015 -8613 -39946 -42131 -13694 24625 44949 32428 -3559
1393 -3559 -36832 -43320 -18311 19942 43553 35484 1630 -33301 -43958 -22588 15067 41618
1405 41618 37902 6666 -29324 -43968 -26534 10005 39257 39863 11500 -25057 -43416 -30115
1417 -30115 5016 36355 41313 16122 -20644 -42268 -33142 87 33099 42021 20374 -15953
1429 -15953 -40602 -35710 -4846 29403 42293 24412 -11110 -38434 -37820 -9680 25296 41876
1441 41876 27944 -6258 -35816 -39270 -14264 20976 40986 31053 -1382 -32720 -40249 -18476
1453 -18476 16557 39567 33672 3405 -29285 -40588 -22402 11994 37661 35803 8052 -25482
1465 -25482 -40341 -25893 7325 35200 37366 12461 -21479 -39689 -29003 2732 32401 38450
1477 38450 16600 -17261 -38492 -31625 -1874 29196 39004 20354 -12909 -36709 -33853 -6312
1489 -6312 25604 38943 23849 -8554 -34606 -35507 -10558 21902 38422 26916 -4004 -32022
1501 -32022 -36687 -14652 17895 37341 29607 355 -28992 -37286 -18411 13721 35830 31917 4785
1514 4785 -25722 -37455 -21877 9425 33903 33694 8994 -22107 -37070 -25053 5086 31472
1526 31472 34850 13021 -18234 -36184 -27756 772 28556 35680 16727 -14235 -34818 -29992 -3452
1539 -3452 25489 35922 20137 -10112 -33000 -31842 -7573 22054 35639 23239 -5977 -30673
1551 -30673 -33145 -11371 18530 34894 25835 -1857 -28139 -33961 -14986 14683 33616 28130 2182
1564 2182 -25211 -34272 -18385 10756 32008 30000 6164 -21967 -34165 -21395 6810 29933
1576 29933 31329 9965 -18584 -33558 -24059 2827 27561 32228 13361 -14989 -32498 -26267 -1033
1589 -1033 24890 32605 16647 -11266 -31078 -28172 -4820 21880 32644 19661 -7543 -29132
1601 -29132 -29574 -8491 18660 32176 22301 -3663 -26932 -30588 -11991 15260 31243 24609 92
1614 92 -24422 -31101 -15155 11696 30031 26428 3751 -21592 -31240 -18134 8081 28292 27981
1627 27981 7260 -18594 -30918 -20751 4463 26342 29087 10701 -15385 -30153 -23025 820
1639 820 23961 29652 13747 -12074 -29083 -24895 -2653 21447 29952 16599 -8627 -27574 -26376
1652 -26376 -6026 18655 29774 19172 -5176 -25783 -27557 -9303 15638 29162 21443 -1764
1664 -1764 -23639 -28371 -12303 12542 28239 23369 1488 -21339 -28717 -15090 9378 26957 24939
1677 24939 4666 -18777 -28670 -17606 6141 25381 26139 7748 -16012 -28250 -19797 2961 23548
1690 23548 26987 10709 -13169 -27547 -21744 -283 21339 27491 13580 -10055 -26442 -23404 -3412
1703 -3412 18991 27525 16047 -7009 -24940 -24702 -6471 16372 27340 18347 -3956 -23269 -25635
1716 -25635 -9389 13572 26646 20308 -752 -21248 -26210 -12113 10680 25666 22008 2352
1728 2352 -18978 -26465 -14638 7753 24442 23354 5318 -16557 -26334 -16952 4694 22848 24356
1741 24356 8195 -13833 -25794 -18873 1597 21009 25048 10844 -11045 -24939 -20603 -1397
1753 -1397 18761 25316 13377 -8133 -23737 -22002 -4256 16492 25240 15636 -5324 -22245 -23055
1766 -23055 -6991 13989 24831 17506 -2413 -20546 -23744 -9588 11376 24086 19192 373
1778 373 -18578 -24120 -12063 8679 23132 20537 3141 -16477 -24081 -14186 6008 21775 21646
1791 21646 5816 -14063 -23775 -16093 3273 20188 22472 8327 -11705 -23171 -17825 504 18393
1804 18393 22870 10671 -9140 -22292 -19264 -2153 16321 23011 12871 -6466 -21136 -20334 -4801
1817 -4801 14164 22762 14747 -3877 -19679 -21195 -7241 11759 22253 16542 -1272 -17922 -21613
1830 -21613 -9585 9436 21480 17951 1373 -16085 -21841 -11630 6941 20399 19047 3845
1842 3845 -14055 -21727 -13562 4423 19148 19909 6215 -11973 -21361 -15202 1910 17635 20483
1855 20483 8384 -9636 -20663 -16652 -511 15864 20718 10488 -7298 -19774 -17812 -2902
1867 -2902 13962 20699 12352 -4982 -18639 -18683 -5234 12035 20525 13970 -2627 -17283 -19338 -7371
1881 -7371 9949 19888 15463 -248 -15683 -19716 -9377 7718 19122 16611 2021 -13936 -19723
1894 -19723 -11184 5516 18184 17585 4211 -12051 -19594 -12816 3248 16894 18234 6366 -10195
1907 -10195 -19179 -14235 996 15447 18581 8201 -8179 -18540 -15416 -1107 13942 18879 10060
1920 10060 -6068 -17641 -16429 -3196 12211 18810 11675 -3913 -16598 -17114 -5236 10384 18436
1933 18436 13089 -1700 -15229 -17638 -7235 8429 17927 14345 382 -13760 -17974 -9020 6405
1946 6405 17158 15392 2467 -12176 -17939 -10619 4323 16111 16152 4427 -10410 -17720 -12092 2232
1960 2232 14905 16720 6269 -8535 -17232 -13341 182 13582 17047 8136 -6669 -16567 -14345
1973 -14345 -1785 12058 17125 9680 -4659 -15683 -15245 -3709 10447 16925 11134 -2717 -14531
1986 -14531 -15810 -5571 8690 16629 12421 -806 -13319 -16187 -7277 6917 16028 13456 1168
1999 1168 -11932 -16351 -8805 4985 15188 14306 2999 -10383 -16268 -10244 3166 14172 14879 4769
2013 4769 -8782 -15934 -11483 1246 13013 15260 6450 -7047 -15410 -12546 -532 11770 15524
2026 15524 8001 -5275 -14681 -13393 -2343 10290 15501 9448 -3447 -13773 -14121 -4120 8767
2039 8767 15247 10666 -1673 -12740 -14553 -5753 7144 14821 11746 62 -11516 -14804 -7276 5489
2053 5489 14238 12550 1850 -10180 -14867 -8692 3740 13351 13277 3490 -8738 -14644 -9905 2041
2067 2041 12423 13802 5122 -7169 -14297 -10937 384 11369 14053 6579 -5667 -13759 -11770 -1283
2081 -1283 10087 14209 7893 -4043 -13050 -12506 -2865 8792 14038 9102 -2462 -12188 -13072 -4419
2095 -4419 7395 13790 10114 -897 -11215 -13377 -5799 5969 13300 10998 690 -10055 -13486
2108 -13486 -7069 4391 12694 11764 2192 -8828 -13496 -8297 2846 11940 12246 3705 -7562 -13230
2122 -13230 -9295 1384 11078 12699 5072 -6171 -12872 -10268 -113 10029 12868 6337 -4725
2135 -4725 -12340 -10979 -1589 8871 12870 7432 -3316 -11722 -11512 -2977 7688 12694 8519 -1897
2149 -1897 -10854 -11953 -4250 6393 12503 9389 -478 -9962 -12180 -5543 5123 12020 10142 933
2163 933 -8930 -12274 -6658 3740 11425 10830 2277 -7795 -12268 -7677 2372 10730 11217 3591 -6558
2178 -6558 -11985 -8567 1000 9806 11451 4727 -5320 -11604 -9316 -327 8860 11568 5908 -4085 -11048
2193 -11048 -10054 -1698 7786 11573 6875 -2751 -10387 -10429 -2896 6738 11425 7852 -1461 -9603 -10772
2208 -10772 -4093 5530 11100 8574 -129 -8723 -10933 -5220 4296 10626 9297 1137 -7734 -10962 -6210
2223 -6210 3032 10047 9750 2339 -6720 -10811 -7139 1807 9356 10074 3499 -5576 -10651 -7865 552
2238 552 8563 10267 4598 -4480 -10237 -8524 -623 7665 10349 5494 -3284 -9683 -9070 -1838 6722
2253 6722 10327 6417 -2108 -9015 -9382 -2931 5633 10083 7158 -864 -8341 -9692 -3954 4626 9778
2268 9778 7800 241 -7489 -9753 -4923 3514 9306 8419 1302 -6629 -9725 -5831 2412 8768 8770 2378
2284 2378 -5670 -9582 -6546 1233 8106 8963 3349 -4683 -9298 -7198 116 7342 9148 4368 -3631
2299 -3631 -8963 -7683 -912 6551 9217 5064 -2655 -8472 -8051 -1911 5708 9059 5879 -1530 -7873
2314 -7873 -8394 -2793 4801 8862 6541 -548 -7169 -8549 -3704 3846 8599 7031 458 -6521 -8684
2329 -8684 -4491 2818 8164 7499 1325 -5673 -8646 -5238 1917 7637 7783 2227 -4874 -8469 -5945
2344 -5945 949 7007 7991 3159 -3961 -8097 -6373 -23 6329 8113 3942 -3100 -7777 -6868 -908
2359 -908 5674 8126 4675 -2145 -7303 -7236 -1839 4910 7979 5254 -1311 -6849 -7449 -2715 4024 7834
2375 7834 5891 -379 -6286 -7660 -3468 3262 7553 6340 523 -5644 -7630 -4217 2443 7170 6646
2390 6646 1419 -4940 -7615 -4802 1469 6701 7039 2169 -4114 -7414 -5367 607 6153 7197 2984
2405 2984 -3335 -7230 -5842 -219 5522 7194 3758 -2507 -6885 -6273 -1048 4826 7207 4377 -1754
2420 -1754 -6497 -6636 -1913 4175 7084 5008 -841 -6054 -6756 -2674 3389 6947 5408 -11 -5509
2435 -5509 -6945 -3340 2621 6645 5792 799 -4852 -6888 -4022 1901 6370 6186 1599 -4210 -6851
2450 -6851 -4591 1077 5864 6419 2336 -3498 -6675 -5050 261 5384 6567 2963 -2787 -6444 -5467
2465 -5467 -493 4807 6621 3603 -2026 -6171 -5809 -1309 4267 6567 4188 -1243 -5783 -6045 -1996
2480 -1996 3559 6437 4692 -517 -5297 -6229 -2654 2876 6274 5065 233 -4778 -6358 -3229 2165
2495 2165 6002 5508 987 -4214 -6287 -3823 1486 5627 5705 1615 -3553 -6209 -4318 768 5252 5901
2511 5901 2285 -3025 -6093 -4771 50 4769 6003 2907 -2315 -5809 -5124 -675 4212 6012 3474
2526 3474 -1681 -5467 -5366 -1341 3649 5990 3972 -990 -5154 -5536 -1932 3170 5876 4361 -322
2541 -322 -4757 -5672 -2509 2497 5652 4688 363 -4277 -5705 -3092 1923 5375 5000 977 -3714 -5671
2557 -5671 -3586 1251 5083 5219 1575 -3203 -5616 -4025 609 4689 5404 2149 -2663 -5481 -4370
2572 -4370 -85 4284 5453 2619 -2110 -5269 -4574 -588 3848 5384 3144 -1428 -4980 -4842 -1184
2587 -1184 3344 5371 3540 -828 -4568 -4965 -1698 2858 5246 3921 -284 -4280 -5060 -2313 2282
2602 2282 5078 4184 310 -3840 -5094 -2726 1695 4856 4449 875 -3409 -5172 -3110 1104 4572
2617 4572 4670 1477 -2942 -5021 -3586 516 4191 4759 1919 -2418 -4896 -3861 -58 3911 4873 2443
2633 2443 -1840 -4705 -4152 -561 3497 4867 2872 -1314 -4438 -4353 -1086 2967 4870 3206 -785 -4188
2649 -4188 -4495 -1555 2530 4711 3518 -290 -3854 -4613 -2062 2020 4641 3757 262 -3507 -4713 -2510
2665 -2510 1520 4362 4007 786 -3096 -4641 -2898 1028 4153 4196 1267 -2586 -4553 -3173 524 3841
2681 3841 4378 1714 -2177 -4382 -3510 6 3482 4499 2156 -1733 -4277 -3713 -486 3158 4431 2548
2697 2548 -1212 -4023 -3979 -1031 2693 4350 2900 -715 -3778 -4141 -1500 2218 4233 3160 -226 -3442
2713 -3442 -4188 -1912 1846 4163 3392 252 -3152 -4229 -2232 1310 3939 3645 742 -2789 -4169 -2597
2729 -2597 912 3695 3855 1226 -2331 -4108 -2914 394 3431 3937 1597 -1886 -3942 -3157 -70 3102
2745 3102 3932 1951 -1434 -3831 -3402 -528 2700 3920 2319 -1058 -3639 -3558 -895 2345 3827 2592
2761 2592 -538 -3301 -3680 -1313 1926 3830 2889 -121 -3009 -3659 -1708 1542 3683 3121 348 -2700
2777 -2700 -3739 -2065 1164 3505 3317 674 -2369 -3712 -2403 680 3199 3387 1107 -2027 -3668
2792 -3668 -2641 321 2925 3467 1476 -1644 -3503 -2877 -168 2725 3482 1785 -1222 -3424 -3041 -505
2808 -505 2377 3515 2147 -820 -3148 -3168 -866 1987 3436 2386 -481 -2899 -3239 -1298 1625 3362
2824 3362 2661 -30 -2621 -3322 -1605 1333 3237 2786 366 -2297 -3271 -1877 874 3000 2923 731
2840 731 -1985 -3234 -2157 490 2743 3030 1041 -1705 -3172 -2342 115 2543 3054 1387 -1290 -3108
2856 -3108 -2620 -250 2278 3087 1668 -985 -2926 -2725 -613 2027 3071 1986 -602 -2656 -2833 -896
2872 -896 1699 2983 2194 -181 -2375 -2822 -1219 1377 2901 2360 100 -2198 -2910 -1521 1011 2762
2888 2762 2526 413 -1954 -2915 -1796 678 2607 2644 755 -1705 -2923 -2024 347 2366 2714 1062
2904 1062 -1364 -2764 -2148 -30 2201 2706 1344 -1010 -2633 -2288 -269 1895 2683 1568 -792 -2440
2920 -2440 -2433 -515 1663 2697 1787 -411 -2260 -2483 -901 1356 2614 1942 -130 -2173 -2600 -1123 1130
2937 1130 2524 2092 121 -1870 -2547 -1341 811 2413 2188 365 -1686 -2547 -1536 543 2276 2268 670
2954 670 -1462 -2483 -1676 279 2032 2368 855 -1193 -2381 -1882 100 1922 2406 1181 -947 -2295
2970 -2295 -1952 -237 1717 2383 1273 -687 -2205 -2097 -466 1548 2350 1440 -460 -2000 -2133 -682
2986 -682 1305 2264 1655 -198 -1928 -2222 -938 1063 2168 1702 -15 -1725 -2198 -1099 784 2046
3002 2046 1870 254 -1492 -2149 -1207 598 1986 1884 498 -1304 -2105 -1366 415 1785 1953 674 -1102
3019 -1102 -2029 -1501 121 1666 1993 801 -915 -1990 -1563 -179 1509 1946 1004 -676 -1811 -1650 -271
3036 -271 1359 1902 1176 -566 -1732 -1723 -459 1122 1849 1283 -286 -1665 -1776 -628 970 1879 1399 -78
3054 -78 -1507 -1803 -817 803 1814 1498 101 -1312 -1736 -925 592 1700 1538 284 -1184 -1764 -1071
3071 -1071 433 1621 1602 409 -1030 -1789 -1210 203 1436 1651 588 -873 -1669 -1300 59 1292 1631
3088 1631 756 -699 -1650 -1344 -125 1223 1708 885 -515 -1501 -1449 -316 1100 1600 1072 -324 -1425
3105 -1425 -1462 -403 944 1576 1135 -174 -1298 -1484 -615 762 1602 1308 4 -1240 -1496 -731 633
3122 633 1492 1314 219 -1099 -1500 -929 392 1417 1336 335 -947 -1441 -966 268 1307 1406 495 -783
3140 -783 -1492 -1054 90 1202 1403 568 -662 -1378 -1181 -39 1084 1419 749 -488 -1311 -1167 -201 988
3158 988 1401 841 -330 -1280 -1246 -357 854 1380 871 -233 -1101 -1252 -468 693 1338 1010 -109 -1089 -1308
3177 -1308 -530 539 1243 1040 46 -956 -1274 -654 460 1207 1079 191 -850 -1236 -785 339 1119 1125 279
3196 279 -750 -1230 -771 240 1106 1142 403 -579 -1184 -837 75 974 1168 469 -517 -1107 -932 -74 917 1128
3216 1128 534 -414 -1061 -948 -159 748 1109 634 -265 -1021 -945 -221 656 1054 682 -173 -897 -979 -265 560
3236 560 1044 790 -133 -862 -956 -391 471 954 780 -4 -790 -1028 -485 398 946 847 118 -637 -1001 -522 312
3257 312 879 837 152 -566 -962 -620 209 819 946 210 -503 -938 -718 49 769 883 394 -424 -861 -741
3277 -741 -15 694 912 400 -325 -919 -792 -21 587 862 542 -310 -863 -786 -79 605 937 582 -201 -744
3297 -744 -771 -245 457 866 610 -85 -711 -797 -357 392 829 690 -10 -678 -822 -431 314 813 726 43 -612
3318 -612 -840 -543 171 764 758 229 -593 -859 -540 104 739 778 289 -412 -802 -631 69 670 769 413 -275
3339 -275 -816 -677 -59 619 846 394 -286 -760 -738 -144 543 850 501 -178 -726 -805 -240 450 828 561 -125
3360 -125 -696 -829 -259 428 774 588 -36 -668 -782 -411 325 754 621 61 -567 -823 -433 184 757 692
3380 692 172 -535 -839 -516 211 693 752 347 -375 -748 -478 72 678 794 342 -356 -796 -600 -2 631
3400 631 795 359 -269 -775 -729 -103 570 770 438 -207 -764 -693 -98 512 781 495 -184 -691 -807 -214 433
3421 433 747 514 -62 -649 -721 -256 361 822 581 -61 -586 -770 -332 287 737 648 95 -576 -731 -404 245
3442 245 735 665 141 -550 -839 -522 168 636 664 136 -467 -758 -553 96 658 687 313 -381 -835 -543 37
3463 37 670 750 324 -373 -744 -599 -35 574 724 404 -273 -779 -645 -54 521 798 405 -223 -761 -684 -127
3484 -127 473 774 502 -129 -681 -678 -215 433 776 507 -33 -657 -729 -325 372 714 582 -24 -595 -738 -327
3505 -327 272 816 638 6 -579 -772 -449 208 701 688 170 -548 -760 -400 170 694 694 224 -462 -765 -566
3526 -566 65 671 741 301 -347 -716 -545 21 669 795 295 -306 -765 -690 -16 584 767 368 -296 -775 -620
3547 -620 -158 531 780 476 -177 -735 -757 -208 465 819 545 -114 -739 -754 -300 420 826 580 -108 -612 -797
3568 -797 -351 320 838 676 62 -622 -841 -405 317 790 695 144 -529 -811 -480 183 775 784 214 -491 -835
3589 -835 -561 78 736 788 229 -454 -814 -590 34 690 772 375 -346 -837 -645 -36 647 847 410 -313 -823
3610 -823 -742 -115 577 868 462 -259 -817 -724 -186 556 838 588 -135 -736 -756 -192 490 867 652 -105 -662
3631 -662 -792 -312 411 846 675 -33 -666 -883 -400 370 778 726 24 -619 -841 -435 311 787 661 140
3651 140 -561 -849 -529 200 783 766 238 -500 -794 -547 156 749 819 271 -451 -911 -622 50 749 837 314
3672 314 -388 -832 -710 64 641 837 453 -383 -810 -702 -71 555 860 463 -278 -763 -841 -208 546 862
3692 862 541 -123 -702 -786 -248 463 836 570 -93 -739 -839 -368 384 798 658 20 -654 -825 -339 310
3712 310 870 665 108 -560 -887 -479 190 747 700 207 -499 -840 -558 171 754 780 275 -452 -851 -634 74
3733 74 666 857 342 -373 -815 -747 -62 590 852 383 -298 -745 -724 -192 509 827 495 -125 -729 -725 -303 422
3755 422 821 587 -63 -654 -789 -344 418 811 672 55 -616 -802 -413 271 735 707 117 -571 -817 -540
3775 -540 181 694 751 238 -476 -830 -543 78 697 745 228 -431 -749 -656 -21 632 791 396 -344 -822 -732
3796 -732 -124 552 814 481 -172 -736 -715 -175 531 863 571 -78 -696 -820 -282 413 818 678 7 -635
3816 -635 -761 -435 334 788 652 62 -606 -865 -475 155 741 787 120 -558 -863 -562 55 716 741 287 -456
3837 -456 -883 -613 24 641 819 376 -385 -810 -642 -83 625 827 440 -265 -782 -682 -102 623 826 493
3857 493 -136 -677 -770 -272 518 828 662 -40 -673 -873 -326 389 826 652 4 -674 -850 -435 302 799
3877 799 700 95 -577 -848 -513 204 698 785 184 -502 -822 -524 77 755 788 263 -471 -812 -650 63 643
3898 643 819 343 -363 -768 -658 -115 666 892 424 -256 -805 -751 -198 557 843 549 -196 -705 -736 -241 509
3919 509 840 598 -89 -732 -855 -367 392 804 652 3 -637 -841 -405 257 812 718 124 -576 -827 -489
3939 -489 200 728 744 234 -505 -885 -563 126 655 835 304 -434 -787 -639 38 713 872 396 -302 -782
3959 -782 -726 -67 583 846 423 -245 -777 -797 -148 489 782 552 -126 -738 -805 -293 412 806 597 -77 -722
3980 -722 -804 -310 328 779 665 55 -647 -821 -397 247 842 709 148 -482 -791 -515 176 740 722 279 -490
4001 -490 -822 -543 104 668 791 277 -416 -762 -676 33 617 774 416 -263 -816 -711 -135 586 829 476
4021 476 -236 -744 -767 -193 447 859 502 -141 -736 -822 -301 402 788 601 -1 -600 -790 -305 351 786 695
4042 695 29 -628 -775 -448 268 784 693 139 -571 -783 -503 203 675 723 167 -475 -808 -621 32 644 760
4063 760 297 -389 -783 -624 -9 610 784 386 -336 -776 -708 -48 566 789 460 -264 -733 -733 -132 506 830
4084 830 467 -245 -688 -712 -246 470 812 571 -97 -657 -710 -308 362 770 654 -13 -586 -795 -337 283 749
4105 749 622 159 -576 -797 -476 213 704 717 195 -494 -742 -560 70 685 606 224 -370 -775 -544 28 618
4126 618 727 360 -277 -738 -598 -40 561 759 376 -206 -648 -624 -114 470 788 499 -197 -627 -692 -238 404
4147 404 725 464 -55 -589 -688 -282 395 755 594 31 -504 -740 -412 232 632 553 94 -526 -710 -409 174
4168 174 551 631 146 -445 -722 -417 78 554 685 228 -301 -646 -535 6 503 679 343 -242 -646 -588 -12
4189 -12 566 722 395 -145 -594 -641 -142 439 708 421 -103 -562 -632 -285 291 576 464 -15 -503 -711 -311
4210 -311 270 659 495 28 -495 -644 -318 248 604 566 91 -381 -657 -477 129 591 618 192 -350 -647 -479
4231 -479 54 593 614 341 -243 -638 -525 -9 497 639 344 -253 -669 -597 -110 440 626 406 -173 -606 -607
4252 -607 -150 407 683 401 -56 -538 -635 -253 277 627 497 -63 -550 -616 -315 268 655 513 99 -467 -644
4273 -644 -404 220 603 580 133 -425 -645 -438 177 550 593 204 -324 -622 -500 100 557 649 259 -217 -648
4294 -648 -538 -6 483 613 309 -265 -631 -558 -97 459 614 319 -188 -616 -626 -177 390 669 397 -80 -537
4315 -537 -608 -189 348 630 547 -33 -548 -634 -269 249 617 532 67 -440 -652 -356 211 631 589 183 -383 -612
4337 -612 -388 122 511 556 158 -345 -634 -483 112 547 592 237 -291 -674 -508 -9 429 582 315 -302 -652
4358 -652 -525 -109 457 641 380 -155 -555 -566 -114 390 672 442 -73 -524 -628 -180 396 598 499 -32 -491
4379 -491 -641 -284 280 592 569 26 -426 -657 -351 173 557 540 85 -375 -681 -486 94 560 530 212 -333
4400 -333 -676 -464 68 536 611 284 -287 -629 -516 -54 491 658 337 -211 -616 -591 -112 469 687 394 -136
4421 -136 -581 -550 -193 430 707 416 -105 -538 -625 -224 343 670 523 -51 -533 -758 -342 253 654 594 41
4442 41 -506 -757 -411 189 605 603 157 -416 -682 -446 118 594 608 214 -365 -682 -487 25 548 718 299
4463 299 -286 -658 -574 -20 496 673 398 -226 -676 -582 -110 494 722 381 -164 -654 -622 -210 416 715 478
4484 478 -95 -638 -709 -329 401 632 554 17 -559 -728 -357 322 707 642 37 -500 -732 -406 189 658 588
4505 588 161 -435 -660 -444 162 715 662 194 -388 -683 -503 70 574 679 310 -349 -698 -543 -16 599
4525 599 695 286 -258 -744 -603 -59 487 771 472 -208 -711 -669 -185 441 701 385 -136 -615 -650 -267 346
4546 346 701 519 -26 -619 -730 -279 284 671 569 30 -506 -668 -336 224 686 570 183 -504 -691 -465
4566 -465 134 629 680 245 -423 -724 -514 54 592 676 255 -349 -733 -606 15 498 731 351 -290 -658 -628
4587 -628 -65 492 701 402 -176 -639 -700 -162 405 764 522 -120 -606 -677 -310 377 686 516 32 -521 -680
4608 -680 -338 323 719 590 45 -459 -655 -430 211 607 656 144 -453 -721 -460 135 583 632 187 -363 -695
4629 -695 -564 90 586 607 349 -296 -726 -605 -111 511 757 395 -275 -665 -616 -158 447 715 467 -138 -632
4650 -632 -606 -251 405 733 510 17 -530 -741 -318 293 716 551 16 -543 -712 -410 163 673 627 88 -479
4671 -479 -702 -397 142 628 586 180 -400 -730 -502 63 565 674 313 -373 -728 -547 -25 530 688 303
4691 303 -279 -698 -603 -83 535 710 413 -206 -643 -677 -169 471 741 530 -105 -644 -647 -217 359 693 585
4712 585 -30 -577 -675 -306 255 681 597 120 -496 -693 -371 194 667 604 115 -431 -703 -466 89 600 612
4733 612 215 -375 -714 -502 113 571 713 284 -287 -651 -527 28 542 743 321 -236 -657 -582 -131 462
4753 462 712 443 -117 -631 -592 -210 347 709 486 -92 -628 -652 -228 323 655 488 -40 -553 -582 -330 270
4774 270 641 536 78 -500 -660 -399 201 619 527 153 -432 -634 -459 116 590 653 282 -331 -677 -449 87
4795 87 585 632 256 -250 -619 -492 -41 513 638 375 -128 -615 -609 -92 365 654 377 -80 -553 -612 -231 334
4817 334 677 460 -61 -517 -589 -323 230 625 566 35 -454 -651 -396 257 626 542 79 -457 -646 -406 188
4838 188 549 584 224 -405 -673 -392 67 533 608 205 -284 -615 -478 2 494 628 269 -192 -592 -535 -26
4859 -26 460 674 322 -185 -583 -569 -133 416 666 402 -140 -522 -627 -199 307 601 464 -74 -476 -592 -246
4880 -246 270 627 497 23 -515 -571 -292 177 582 477 12 -354 -658 -303 129 546 553 130 -388 -700 -458
4901 -458 135 562 576 194 -340 -623 -481 71 510 564 281 -255 -619 -543 -8 411 565 313 -246 -538 -488
4922 -488 -113 365 591 346 -125 -511 -532 -189 377 592 412 -56 -497 -591 -230 248 584 448 5 -436 -593
4943 -593 -257 165 543 492 78 -468 -582 -315 153 536 572 168 -363 -578 -394 64 491 469 131 -250 -562
4964 -562 -388 80 482 497 287 -225 -495 -434 17 385 572 252 -187 -531 -496 -80 361 497 318 -108 -517
4985 -517 -441 -111 318 524 360 -81 -447 -533 -181 280 478 316 25 -382 -521 -200 175 502 433 -8 -343
5006 -343 -511 -242 102 416 449 8 -291 -460 -323 58 446 456 133 -227 -444 -338 36 413 407 231 -141
5027 -141 -450 -409 -31 309 446 250 -127 -474 -332 -36 317 477 245 -41 -422 -353 -155 326 423 329 -34
5048 -34 -412 -460 -156 232 470 358 24 -337 -500 -281 188 422 384 -11 -325 -430 -262 137 408 441 30
5069 30 -223 -448 -294 80 354 463 181 -187 -459 -387 43 338 471 182 -145 -424 -360 -14 265 401 224
5090 224 -107 -396 -397 -132 249 488 224 -121 -383 -421 -98 239 405 285 -33 -330 -415 -162 199 388 304 9
5112 9 -329 -365 -185 179 432 362 65 -252 -407 -266 148 364 348 102 -253 -384 -321 -51 377 392 140 -190
5134 -190 -418 -334 -22 298 365 218 -192 -392 -385 -16 261 353 189 -104 -373 -336 -76 258 423 298 -41 -365
5156 -365 -346 -142 144 377 266 -9 -304 -334 -134 165 380 367 9 -317 -354 -246 146 351 320 84 -294 -390
5178 -390 -267 96 311 331 70 -219 -398 -219 17 283 338 152 -205 -334 -257 -21 254 390 151 -147 -373
5199 -373 -342 -54 214 316 181 -111 -320 -326 -130 175 365 259 -63 -325 -268 -49 196 354 267 -3 -229 -309
5221 -309 -105 160 327 289 54 -240 -315 -173 115 299 320 100 -214 -360 -246 114 279 277 77 -157 -318 -263
5243 -263 28 284 287 178 -133 -342 -275 30 212 300 187 -157 -346 -292 -103 166 295 234 -84 -297 -241 -69
5265 -69 143 304 250 -91 -308 -321 -101 147 309 261 -13 -282 -307 -116 128 335 253 20 -226 -292 -198 60 267
5288 267 260 67 -173 -311 -219 71 219 268 94 -143 -267 -245 -12 288 298 158 -89 -299 -229 30 205 316
5310 316 164 -37 -253 -287 -24 195 296 227 -137 -253 -302 -65 189 256 212 -13 -239 -306 -154 144 277 231
5332 231 -80 -209 -331 -192 112 306 203 -24 -155 -294 -117 92 311 259 119 -173 -313 -211 -15 196
5352 196 225 176 -66 -241 -196 -15 195 291 97 -115 -254 -190 -32 157 295 106 -82 -231 -259 -88 142 280
5374 280 152 -50 -242 -300 -122 85 209 200 8 -158 -223 -91 100 186 188 1 -218 -259 -143 67 252 239 39
5397 39 -137 -211 -185 19 201 220 53 -111 -195 -198 -2 185 253 195 -55 -191 -181 1 149 230 84 -93 -220 -211
5421 -211 -63 134 143 154 -87 -182 -195 -127 39 145 126 -38 -178 -250 -116 79 186 191 52 -71 -169 -79 56 139
5445 139 192 120 -32 -198 -161 -22 136 156 88 -58 -153 -163 14 150 231 97 -68 -130 -168 -62 98 183 54 -32
5469 -32 -151 -165 -47 64 108 74 -35 -142 -233 -106 107 155 150 34 -86 -181 -119 64 118 174 99 -58 -152 -128 47
5494 47 128 250 107 -57 -153 -163 -7 50 130 153 -89 -119 -179 -71 63 171 107 -12 -155 -151 -121 38 184 206 35
5519 35 -80 -164 -111 93 177 161 -5 -136 -197 -148 58 101 135 43 -95 -137 -110 -3 124 119 83 -63 -151 -118 13 131
5545 131 203 75 -56 -153 -174 3 45 163 41 -15 -119 -135 -81 29 178 99 -54 -143 -188 -29 13 168 170 21
5569 21 -177 -177 -66 108 187 126 -20 -183 -113 -91 -10 141 190 62 -107 -176 -108 -4 145 191 88 -68 -114 -153 21
5594 21 82 227 57 -19 -196 -108 -16 118 166 80 -57 -126 -156 -8 72 149 129 -54 -133 -168 -44 65 153 105 13 -113
5620 -113 -125 -95 11 148 122 40 -132 -166 -119 49 174 134 90 -76 -193 -102 22 168 240 97 -51 -177 -101 -32
5644 -32 162 140 99 -44 -128 -147 15 77 193 82 -37 -214 -143 -19 101 194 61 26 -117 -164 -81 43 157 139
5668 139 -17 -148 -192 -6 78 176 167 22 -144 -162 -62 32 198 134 75 -110 -135 -139 21 151 200 71 -75 -169 -117
5693 -117 12 146 141 52 -69 -130 -109 19 140 110 113 -51 -149 -155 -11 145 136 96 -60 -158 -139 -23 112 122 74 -13
5719 -13 -118 -144 -102 128 177 151 26 -194 -157 -7 114 169 141 -25 -107 -147 -64 52 181 77 28 -137 -163 -12
5743 -12 66 194 168 -49 -154 -145 -99 35 55 102 -44 -107 -175 -107 48 117 166 42 -106 -172 -94 21 154 175 13
5768 13 -61 -153 -78 14 82 105 88 8 -131 -30 45 132 100 85 -100 -86 -100 -9 90 123 66 -26 -92 -109 -26 114 175 81
5796 81 2 -106 -128 -63 26 112 42 -58 -136 -86 -3 20 135 98 -28 -62 -131 29 15 37 101 -18 -76 -120 -44 47 116
5823 116 59 23 -98 -74 -32 83 151 52 38 8 -125 3 57 81 90 -33 -36 -96 -19 33 64 95 39 -24 -128 -73 -1 -22
5851 -22 28 6 -37 -139 -75 40 61 52 43 -120 -101 -61 -21 120 99 38 -38 -83 -44 8 57 121 75 1 -51 -49 6 95 75 -3
5881 -3 -52 -96 -92 16 33 84 13 -41 -75 -108 -11 81 140 59 -22 -69 -110 -21 77 80 -10 -26 -109 -78 -56 30 72 80 14 -60 -83 -106
5913 -106 76 154 60 -10 -47 -70 -48 53 49 107 22 -34 -98 -79 21 116 124 -4 -21 -157 -91 63 100 109 84 -62 -142 -71
5941 -71 1 71 62 9 -31 -127 -136 -34 52 129 -4 -29 -90 -114 -24 10 143 93 -53 -110 -70 -4 49 127 118 -33 -66 -61 -30 25
5971 25 144 136 17 -125 -114 -57 55 110 116 -34 -119 -106 -22 18 54 158 -6 -48 -126 -87 35 96 91 -8 -78 -113 -92 -72
5999 -72 180 170 53 -91 -112 -124 -31 122 175 69 -20 -153 -130 -55 87 176 67 -39 -102 -100 17 66 112 133 6
6024 6 -131 -177 -101 18 131 53 -43 -129 -161 -103 9 169 73 17 -93 -84 -101 66 137 134 17 -77 -131 -94 41 81 105
6051 105 35 -74 -131 -97 -1 80 115 70 -24 -160 -74 25 121 158 67 -100 -117 -142 -38 136 207 52 -11 -129 -151 -41
6077 -41 63 159 57 15 -139 -151 -97 58 154 82 40 -138 -49 -17 17 132 133 27 -92 -163 -82 32 169 136 43 -71
6103 -71 -157 -87 72 188 106 37 -101 -173 -42 24 110 172 136 -5 -142 -173 0 67 148 81 -62 -134 -130 5 97 132
6129 132 18 -76 -207 -186 -36 110 174 57 -33 -53 -132 -87 110 152 96 -16 -130 -144 -34 75 161 120 10 -80
6153 -80 -170 -5 74 155 222 12 -122 -160 -64 87 151 216 48 -166 -178 -61 92 106 90 -6 -139 -164 -146 50 94
6178 94 180 26 -141 -176 -132 15 134 110 98 -91 -160 -74 -22 126 150 32 -38 -204 -50 -3 140 161 85 -50 -128
6203 -128 -105 -18 111 125 110 -22 -110 -150 -42 90 176 127 -12 -149 -133 -116 111 178 100 47 -129 -175 -69 86 202
6228 202 121 0 -105 -194 -162 30 207 185 45 -98 -151 -130 -3 156 183 8 -63 -145 -89 99 151 168 64 -71
6252 -71 -185 -73 62 162 173 105 -45 -182 -89 -2 126 125 101 -85 -119 -98 28 159 197 143 -30 -130 -110 -40 85
6277 85 173 59 -14 -167 -185 -64 77 180 68 -55 -92 -97 -40 89 109 80 -25 -107 -132 -16 94 205 124 -22
6301 -22 -127 -181 -87 10 151 137 -36 -161 -156 -86 39 183 118 -4 -120 -159 -86 63 143 157 37 -134 -110 -124 35
6326 35 103 126 92 -71 -120 -88 -31 112 109 87 -99 -132 -58 22 104 151 65 -61 -136 -141 1 65 120 100 -35 -192 -159 -80
6354 -80 78 141 90 -77 -90 -155 -50 114 129 65 -32 -111 -213 -69 31 128 126 -54 -51 -148 -87 82 133 115 -18 -107
6380 -107 -154 -37 59 162 78 5 -91 -132 -73 44 139 177 62 -117 -186 -115 7 113 90 30 -70 -121 -81 69 124
6405 124 99 52 -84 -183 -108 -11 130 153 44 -18 -164 -165 -8 196 98 81 -65 -145 -138 3 70 147 94 -44 -72 -111
6431 -111 -33 92 164 104 0 -160 -140 16 85 114 110 7 -121 -89 -63 33 110 90 4 -77 -77 -48 52 151 103 36 -118
6458 -118 -160 -97 59 136 112 18 -140 -158 -87 23 134 131 30 -24 -160 -57 5 117 130 42 -31 -149 -98 15 154
6483 154 171 68 -66 -191 -86 -24 119 152 82 -44 -166 -116 -5 57 157 48 -83 -204 -162 -52 107 173 125
6506 125 0 -185 -164 -39 118 127 124 -36 -137 -127 0 102 165 105 -16 -165 -199 -21 30 157 178 24 -91 -154
6530 -154 -79 44 189 164 -3 -125 -162 -79 11 137 169 30 -119 -151 -119 34 102 139 70 -85 -109 -180 22 125
6554 125 161 53 -79 -211 -132 -43 114 205 124 -46 -196 -129 -46 106 215 93 -30 -169 -188 -54 80 259 158
6577 158 -57 -165 -199 -130 89 217 166 7 -212 -172 -110 84 177 167 -7 -169 -173 -127 52 203 198 50 -140 -217
6601 -217 -124 30 254 191 70 -152 -255 -153 16 110 177 82 -45 -143 -145 -32 105 268 150 -94 -182 -180 -54 193
6625 193 221 169 -45 -277 -180 -58 129 223 196 -66 -180 -183 -63 104 207 175 -26 -159 -261 -73 92 189 228
6648 228 17 -201 -186 -58 60 154 218 41 -119 -211 -112 25 161 237 85 -166 -207 -191 39 185 254 98 -56
6671 -56 -201 -198 39 205 241 155 -108 -245 -168 -43 118 237 153 -35 -232 -252 -71 169 187 180 -86 -212 -231 -77
6695 -77 203 247 188 -32 -197 -280 -124 48 260 182 27 -193 -268 -116 92 275 223 14 -131 -251 -167 134 241
6718 241 192 76 -150 -262 -183 24 199 275 107 -146 -295 -140 51 160 258 73 -73 -229 -201 -27 160 259
6740 259 97 -61 -264 -246 -65 184 264 151 -130 -248 -228 -24 128 244 178 -64 -216 -224 -70 180 321 195
6762 195 -23 -209 -305 -134 93 252 173 108 -147 -234 -144 36 231 210 109 -169 -295 -179 104 203 227 106 -190
6785 -190 -268 -199 54 199 236 128 -137 -292 -283 -15 181 272 123 -116 -262 -243 -66 199 229 130 -56 -238 -241 -1
6809 -1 167 277 215 -93 -226 -234 -60 124 246 225 20 -204 -200 -109 28 272 229 24 -213 -301 -194 80 233 225
6833 225 50 -223 -294 -147 24 203 191 3 -136 -298 -190 3 251 284 95 -100 -240 -178 25 272 311 185
6855 185 -92 -268 -194 -42 230 258 179 -46 -236 -218 -30 217 267 231 -41 -250 -281 -175 180 304 179 -20
6877 -20 -241 -299 -140 35 304 235 -10 -205 -295 -193 92 241 211 20 -159 -268 -166 22 282 252 43 -126
6899 -126 -266 -181 46 239 256 110 -102 -255 -291 -19 261 274 160 -97 -263 -218 -33 209 351 129 -70 -220
6921 -220 -294 -57 90 327 244 -54 -241 -247 -136 120 240 237 -10 -197 -241 -133 86 296 264 70 -116 -254 -114
6944 -114 24 240 261 74 -122 -294 -216 2 321 303 82 -149 -216 -273 48 193 330 175 -145 -301 -243 -54
6966 -54 201 279 162 -18 -223 -243 -104 122 276 205 8 -186 -243 -81 116 283 157 58 -215 -249 -128 55
6988 55 300 237 48 -118 -269 -185 75 262 252 100 -112 -265 -166 20 238 295 137 -128 -245 -180 -18 265
7010 265 276 118 -67 -255 -267 -38 173 247 191 -14 -258 -301 -72 111 292 236 -23 -198 -289 -149 115 242
7032 242 233 6 -208 -247 -161 132 227 315 155 -155 -265 -154 91 294 292 137 -138 -265 -225 57 180 313 142
7055 142 -145 -296 -258 -31 212 282 167 -32 -268 -230 -67 168 310 144 -68 -216 -344 -74 229 329 248
7076 248 16 -235 -250 -141 162 309 232 34 -211 -342 -151 115 304 236 31 -163 -291 -169 125 290 297 60
7098 60 -122 -282 -178 60 217 315 138 -156 -249 -255 5 224 319 149 -77 -290 -253 -106 166 296 194 -31
7120 -31 -263 -252 -78 226 310 187 -49 -239 -234 -88 107 348 235 59 -245 -272 -222 137 315 260 88 -220 -267
7143 -267 -148 97 262 308 74 -191 -375 -200 7 299 276 172 -176 -271 -273 -41 188 308 180 -127 -239 -313
7165 -313 -19 198 268 213 -94 -303 -349 -66 163 316 182 -59 -268 -286 -104 158 314 258 34 -241 -301 -114
7187 -114 124 315 272 85 -208 -264 -158 64 247 293 113 -178 -297 -264 11 278 372 182 -149 -309 -237 -19
7209 -19 258 317 135 -119 -281 -269 -51 190 300 176 -98 -280 -226 -110 178 332 213 -7 -292 -290 -134 172
7231 172 362 256 1 -195 -275 -96 120 317 247 68 -205 -328 -190 36 309 271 109 -157 -283 -252 47
7252 47 242 323 160 -132 -316 -280 13 200 295 182 -108 -244 -300 -40 235 278 237 -63 -294 -236 -132 181 332
7275 332 265 39 -251 -290 -132 119 344 269 -30 -237 -281 -130 77 305 311 9 -152 -340 -151 84 303 313
7297 313 49 -169 -310 -209 25 274 217 103 -163 -318 -301 -56 182 315 178 -111 -259 -195 0 182 351
7318 351 183 -88 -338 -291 -56 156 296 225 -19 -283 -285 -112 94 326 269 44 -189 -329 -142 73 262 226
7340 226 64 -172 -360 -261 58 214 249 127 -194 -313 -276 32 238 205 154 -159 -362 -304 3 295 266 149
7362 149 -47 -258 -239 -16 224 328 207 -141 -248 -256 -99 182 323 232 35 -248 -246 -138 86 270 279 19 -221
7385 -221 -293 -171 115 270 228 7 -195 -304 -140 50 224 276 79 -177 -306 -258 22 235 290 100 -108 -281
7407 -281 -301 -43 245 294 204 -107 -241 -236 -43 200 296 203 -69 -262 -282 -51 143 342 270 -21 -272 -331 -124
7430 -124 97 345 229 -19 -237 -337 -137 145 285 290 83 -226 -318 -205 85 254 234 60 -213 -289 -232 54
7452 54 319 282 68 -145 -342 -220 -14 227 264 168 -104 -298 -316 -60 209 366 202 -108 -246 -279 -98 196
7474 196 302 186 -67 -314 -276 -83 159 335 235 -4 -306 -258 -150 69 323 246 13 -280 -355 -112 134
7495 134 236 297 54 -223 -345 -213 128 283 266 90 -152 -303 -250 12 276 366 166 -246 -293 -238 -33 320
7517 320 333 168 -135 -322 -285 37 214 367 204 -74 -274 -309 -52 199 353 238 -99 -298 -330 -99 183
7538 183 335 245 -40 -236 -306 -115 151 328 298 18 -269 -322 -192 123 288 320 70 -237 -361 -175 170 298
7560 298 373 24 -130 -349 -209 52 344 357 170 -174 -331 -279 -20 316 366 172 -147 -278 -268 -14 250 270
7582 270 162 -106 -330 -292 -90 184 331 213 -19 -317 -296 -89 182 369 214 -68 -248 -280 -58 206 310
7603 310 343 -22 -273 -251 -172 139 374 296 88 -245 -348 -221 48 292 345 101 -180 -333 -249 56 308 348
7625 348 142 -190 -361 -258 -32 241 363 182 -101 -340 -245 -52 235 302 228 -115 -286 -286 -54 144 389 170
7647 170 -59 -298 -304 -60 174 356 219 -25 -256 -341 -177 148 327 334 2 -244 -350 -163 73 341 326 21
7669 21 -217 -375 -203 118 296 301 58 -169 -343 -225 30 223 310 106 -162 -283 -271 42 262 349 164 -104
7691 -104 -261 -268 -3 253 429 178 -108 -269 -311 -7 215 303 242 -43 -272 -312 -120 147 354 302 -10 -288
7713 -288 -337 -153 147 390 246 35 -252 -332 -162 68 318 247 44 -213 -308 -190 46 266 265 106 -164 -294
7735 -294 -216 25 273 283 133 -194 -268 -293 26 267 332 205 -73 -252 -253 -37 178 261 202 -101 -275 -286 -124
7758 -124 184 277 218 -35 -289 -313 -87 109 341 184 -17 -271 -284 -136 99 334 226 52 -194 -351 -199
7779 -199 87 313 253 118 -165 -316 -251 71 244 325 130 -191 -270 -247 -49 191 303 177 -152 -296 -198 -42
7801 -42 208 313 193 -86 -267 -283 -70 173 311 202 -70 -258 -295 -119 170 302 239 37 -182 -268 -111 160
7823 160 315 270 55 -209 -315 -171 83 278 287 47 -151 -242 -211 38 229 308 84 -143 -318 -242 44 211
7845 211 296 162 -142 -281 -214 16 264 282 160 -110 -283 -238 -51 170 336 227 -44 -257 -283 -126 159 300
7867 300 242 -56 -221 -299 -133 116 350 305 44 -203 -305 -157 87 219 246 123 -162 -355 -229 115 205 258
7889 258 139 -156 -277 -227 82 305 300 179 -117 -250 -295 -60 183 345 171 -87 -298 -306 -93 173 307 176
7911 176 -13 -284 -285 -76 131 277 221 -33 -250 -309 -184 170 284 259 51 -212 -289 -101 123 256 253 90 -236
7934 -236 -266 -216 70 327 297 82 -186 -253 -221 6 230 299 142 -178 -314 -272 9 236 335 137 -107 -269 -309
7957 -309 -28 186 328 161 -111 -279 -317 -85 192 250 188 -59 -267 -291 -54 177 284 213 -15 -269 -315 -88
7979 -88 117 300 295 8 -207 -311 -140 89 292 244 42 -207 -318 -188 48 257 256 91 -191 -334 -271 22
8001 22 255 284 187 -113 -334 -254 -32 249 305 160 -87 -273 -277 -55 184 319 177 -88 -209 -268 -82 203 312
8024 312 263 72 -253 -347 -148 148 307 274 32 -200 -299 -138 150 295 242 34 -124 -284 -217 20 333 318
8046 318 84 -222 -320 -299 30 237 243 91 -167 -279 -281 30 238 286 166 -93 -283 -225 -44 192 275 245 -61
8069 -61 -306 -284 -79 191 282 226 12 -207 -246 -102 141 292 237 13 -240 -293 -170 111 249 258 -21 -187 -313
8092 -313 -186 53 280 289 79 -143 -353 -271 39 267 331 69 -170 -296 -204 -63 211 261 116 -121 -331 -197
8114 -197 -40 206 348 208 -75 -218 -278 -47 185 295 249 -66 -225 -280 -137 156 273 198 17 -240 -340
8135 -340 -133 95 280 263 62 -234 -266 -213 96 306 331 87 -136 -276 -267 -23 276 318 136 -104 -301 -230 -19
8158 -19 191 324 191 -61 -275 -257 2 233 299 181 -40 -236 -265 -43 154 341 196 7 -295 -288 -64 145
8180 145 326 261 11 -186 -269 -181 96 272 218 86 -206
8191b06
##END NTUPLES=NMR FID
##END=
