##TITLE=1H_Pr Ad-C1
 CDCl3, 8 sc, 
 9.06.2021
##JCAMPDX= 6.0         $$ Bruker NMR JCAMP-DX V2.0
##DATA TYPE= NMR FID
##DATA CLASS= NTUPLES
##ORIGIN= UXNMR, Bruker Analytische Messtechnik GmbH
##OWNER= root
$$ XWIN-NMR		Version 3.5
$$ Wed Jun  9 13:09:56 2021 Russian Standard Time (UT+4h)  she@DPX200
##.OBSERVE FREQUENCY= 200.131506
##.OBSERVE NUCLEUS= ^1H
##.DELAY= (6, 6)
##.ACQUISITION MODE= SIMULTANEOUS
##.ACQUISITION SCHEME= undefined
##.AVERAGES= 8
##.DIGITISER RES= 18
##SPECTROMETER/DATA SYSTEM= spect
##.PULSE SEQUENCE= zg30
##.SOLVENT NAME= CDCl3
##.SHIFT REFERENCE= (INTERNAL, CDCl3, 0, 15.7039)
##AUDIT TRAIL= $$ (NUMBER, WHEN, WHO, WHERE, WHAT)
$$ ##TITLE= Audit trail, XWIN-NMR		Version 3.5
$$ ##JCAMPDX= 5.01
$$ ##ORIGIN= Bruker BioSpin GmbH
$$ ##OWNER= she
$$ F:/spectra/data/she/nmr/H-F/1/audita.txt
$$ ##AUDIT TRAIL=  $$ (NUMBER, WHEN, WHO, WHERE, WHAT)
(   1,<2021-06-09 13:08:49.64 +0400>,<she>,<DPX200>,
      <created by zg, POWCHK disabled, PULCHK disabled
       configuration hash MD5:
       00 E9 B6 7A A2 85 ED C7 34 08 36 98 17 FE 4E 26
       data hash MD5: 16K
       47 62 A2 C2 1C BA AA 43 5E 1D BC BA 30 75 70 6A>)
$$ ##END=
$$ 
$$ hash MD5
$$ EF 72 A1 84 82 9D 9C 32 9D FD C4 9D DC A5 BF 40
##$RELAX= 
##$RELAX= 
##$RELAX= 
##$RELAX= 
##$RELAX= 
##$RELAX= 
$$ Bruker specific parameters
$$ --------------------------
##$DU= <F:/spectra>
##$EXPNO= 1
##$NAME= <H-F>
##$PROCNO= 1
##$TYPE= <nmr>
##$USER= <she>
##$AMP= (0..31)
100 100 100 100 100 100 100 100 100 100 100 100 100 100 100 100 100 100 
100 100 100 100 100 100 100 100 100 100 100 100 100 100 
##$AQSEQ= 0
##$AQ_mod= 1
##$AUNM= <au_zg>
##$AUTOPOS= <>
##$BF1= 200.13
##$BF2= 200.13
##$BF3= 200.13
##$BF4= 200.13
##$BF5= 200.13
##$BF6= 200.13
##$BF7= 200.13
##$BF8= 200.13
##$BYTORDA= 1
##$CFDGTYP= 0
##$CFRGTYP= 5
##$CHEMSTR= <none>
##$CNST= (0..31)
1 1 145 1 1 1 1 1 1 1 1 1 1 1 1 1 1 1 1 1 1 1 1 1 1 1 1 1 1 1 1 1 
##$CPDPRG= <>
##$CPDPRG1= <>
##$CPDPRG2= <>
##$CPDPRG3= <>
##$CPDPRG4= <mlev>
##$CPDPRG5= <mlev>
##$CPDPRG6= <mlev>
##$CPDPRG7= <mlev>
##$CPDPRG8= <mlev>
##$CPDPRGB= <>
##$CPDPRGT= <>
##$D= (0..31)
0 1.2 0 0 0 0 0 0 0 0.06 0 0.03 0 0 0 0 0.0002 0 0 0 0 0 0 0 0 0 0 0 0 
0 0 0 
##$DATE= 1623229729
##$DBL= (0..7)
120 120 120 120 120 120 120 120 
##$DBP= (0..7)
150 150 150 150 150 150 150 150 
##$DBP07= 0
##$DBPNAM0= <>
##$DBPNAM1= <>
##$DBPNAM2= <>
##$DBPNAM3= <>
##$DBPNAM4= <>
##$DBPNAM5= <>
##$DBPNAM6= <>
##$DBPNAM7= <>
##$DBPOAL= (0..7)
0.5 0.5 0.5 0.5 0.5 0.5 0.5 0.5 
##$DBPOFFS= (0..7)
0 0 0 0 0 0 0 0 
##$DE= 6
##$DECBNUC= <off>
##$DECIM= 32
##$DECNUC= <off>
##$DECSTAT= 4
##$DIGMOD= 1
##$DIGTYP= 9
##$DL= (0..7)
0 120 120 120 120 120 120 120 
##$DP= (0..7)
150 150 150 150 150 150 150 150 
##$DP07= 0
##$DPNAME0= <>
##$DPNAME1= <>
##$DPNAME2= <>
##$DPNAME3= <>
##$DPNAME4= <>
##$DPNAME5= <>
##$DPNAME6= <>
##$DPNAME7= <>
##$DPOAL= (0..7)
0.5 0.5 0.5 0.5 0.5 0.5 0.5 0.5 
##$DPOFFS= (0..7)
0 0 0 0 0 0 0 0 
##$DQDMODE= 0
##$DR= 18
##$DS= 0
##$DSLIST= <SSSSSSSSSSSSSSS>
$$ [...]
##$SUBNAM2= <"">
##$SUBNAM3= <"">
##$SUBNAM4= <"">
##$SUBNAM5= <"">
##$SUBNAM6= <"">
##$SUBNAM7= <"">
##$SUBNAM8= <"">
##$SUBNAM9= <"">
##$SW= 20.0188882624521
##$SWIBOX= (0..15)
0 0 2 0 0 0 0 0 0 0 0 0 0 0 0 0 
##$SW_h= 4006.41025641026
##$TD= 16384
##$TD0= 1
##$TE= 0
##$TE2= 300
##$TE3= 300
##$TEG= 300
##$TL= (0..7)
0 120 120 120 120 120 120 120 
##$TP= (0..7)
150 150 150 150 150 150 150 150 
##$TP07= 0
##$TPNAME0= <>
##$TPNAME1= <>
##$TPNAME2= <>
##$TPNAME3= <>
##$TPNAME4= <>
##$TPNAME5= <>
##$TPNAME6= <>
##$TPNAME7= <>
##$TPOAL= (0..7)
0.5 0.5 0.5 0.5 0.5 0.5 0.5 0.5 
##$TPOFFS= (0..7)
0 0 0 0 0 0 0 0 
##$TUNHIN= 0
##$TUNHOUT= 0
##$TUNXOUT= 0
##$USERA1= <user>
##$USERA2= <user>
##$USERA3= <user>
##$USERA4= <user>
##$USERA5= <user>
##$V9= 5
##$VALIST= <valist>
##$VCLIST= <CCCCCCCCCCCCCCC>
##$VD= 0
##$VDLIST= <DDDDDDDDDDDDDDD>
##$VPLIST= <PPPPPPPPPPPPPPP>
##$VTLIST= <TTTTTTTTTTTTTTT>
##$WBST= 1024
##$WBSW= 4
##$XGAIN= (0..3)
0 0 0 0 
##$XL= 0
##$YL= 0
##$YMAX_a= 953677
##$YMIN_a= -918406
##$ZGOPTNS= <>
##$ZL1= 120
##$ZL2= 120
##$ZL3= 120
##$ZL4= 120
##$ABSF1= 10
##$ABSF2= 0
##$ABSG= 5
##$ABSL= 3
##$ALPHA= 0
##$AQORDER= 0
##$ASSFAC= 0
##$ASSFACI= 0
##$ASSFACX= 0
##$ASSWID= 0
##$AUNMP= <proc_1d>
##$AZFE= 0.1
##$AZFW= 0.1
##$BCFW= 1
##$BC_mod= 2
##$BYTORDP= 1
##$COROFFS= 0
##$CY= 11.3945322036743
##$DATMOD= 1
##$DC= 2
##$DFILT= <>
##$DTYPP= 0
##$F1P= 15.9154993809931
##$F2P= -4.1035820241983
##$FCOR= 0.5
##$FTSIZE= 0
##$FT_mod= 4
##$GAMMA= 1
##$GB= 0.15
##$INTBC= 1
##$INTSCL= 1
##$ISEN= 128
##$LB= 0.24
##$LEV0= 0
##$LPBIN= 0
##$MAXI= 10000
##$MC2= 0
##$MEAN= 0
##$ME_mod= 0
##$MI= 1.114404
##$NCOEF= 0
##$NC_proc= 0
##$NLEV= 6
##$NOISF1= 3.799351
##$NOISF2= 2.8
##$NSP= 1
##$NTH_PI= 0
##$NZP= 0
##$OFFSET= 15.70392
##$PC= 1
##$PHC0= -11497.19
##$PHC1= 28.00101
##$PH_mod= 1
##$PKNL= yes
##$PPARMOD= 0
##$PSCAL= 0
##$PSIGN= 0
##$REVERSE= no
##$SF= 200.130013532006
##$SI= 16384
##$SIGF1= 3
##$SIGF2= 2
##$SINO= 400
##$SIOLD= 16384
##$SREGLST= <1H.CDCl3>
##$SSB= 0
##$STSI= 0
##$STSR= 0
##$SW_p= 3612.71676300578
##$SYMM= 0
##$S_DEV= 0
##$TDeff= 0
##$TDoff= 0
##$TI= <>
##$TILT= no
##$TM1= 0
##$TM2= 0
##$TOPLEV= 0
##$USERP1= <user>
##$USERP2= <user>
##$USERP3= <user>
##$USERP4= <user>
##$USERP5= <user>
##$WDW= 1
##$XDIM= 8192
##$YMAX_p= 0
##$YMIN_p= 0
$$ End of Bruker specific parameters
$$ ---------------------------------
##NTUPLES= NMR FID
##VAR_NAME=  TIME,          FID/REAL,        FID/IMAG
##SYMBOL=    X,             R,               I
##VAR_TYPE=  INDEPENDENT,   DEPENDENT,       DEPENDENT
##VAR_FORM=  AFFN,          ASDF,            ASDF
##VAR_DIM=   8192,          8192,            8192
##UNITS=     SECONDS,       ARBITRARY UNITS, ARBITRARY UNITS
##FACTOR=    0.0002496,     1,               1
##FIRST=     0,             0,               0
##LAST=      2.0444736,     0,               0
##MIN=       0,             -918406,         0
##MAX=       2.0444736,     953677,          0
$$ Real data points
##PAGE= N=1
##DATA TABLE= (X++(R..R)), XYDATA
0@%%%%%%qJ6j0J0j6K4l2L5m3O0q0R5j11J33j62J94k28K68l16L69m27M94n71O57
$$ 0 0 0 0 0 0 0 -8 8 -2 8 -8 16 -16 19 -24 36 -44 51 -60 73 -89 105 -123 145 -171 198 -229 265 -306 351
30C51p51Q54r68J095j236J392j562J749j955K179k425K693k987L307l654M037
$$ 351 -400 454 -514 581 -655 737 -825 924 -1031 1148 -1277 1416 -1571 1736 -1918 2119
46B119m455M911n409N958o564P230p967Q790r718J0761j1946J3309j4896J6774
$$ 2119 -2336 2575 -2834 3124 -3440 3790 -4177 4613 -5105 5656 -6290 7019 -7877 8897
60H897j9028K1791k5279K9839l6064M5086n9364Q5311j46525N33808K24438j544275
$$ 8897 -10131 11660 -13619 16220 -19844 25242 -34122 51189 -95336 438472 662910 -881365
72h81365O36566J174716r75946q57025J296448L16467j336556J46561J249176
$$ -881365 -244799 929917 -46029 -903054 393394 709861 -626695 -480134 769042
81G69042o10598r16698Q72647N61267j000067j55132R45649j71065q05998M32041
$$ 769042 158444 -758254 114393 675660 -324407 -479539 466110 295045 -510953 -78912
91g8912N46716n48294k91691N44398O9811m43685N5650L34728j15717k15419J07470
$$ -78912 467804 -80490 -372181 172217 242028 -201657 -146007 188721 73004 -142415 -34945
102c4945J36048n3694j13929j4400J63946K6608k47767J6100L17844j17582l50639
$$ -34945 101103 47409 -66520 -80920 83026 109634 -138133 -122033 195811 78229 -272410
113b72410K60893L23524m18265k19845N65472K4103o22666K15853N72679m43609
$$ -272410 -11517 312007 -106258 -326103 239369 263472 -359194 -143341 429338 -14271
123a4271m36711O28529K14041p39513O5915P37548l62096n94985N94682L58687
$$ -14271 -450982 177547 391588 -347925 -282010 455538 93442 -501543 93139 451826
133D51826p23570p7405P52001k17606o54367M76154M46213o50237j63767O84819
$$ 451826 -271744 -349149 402852 185246 -469121 7033 453246 -196991 -360758 324061
143C24061j17615o04333L54812M35674n15091k02432N79675n2681n23653K72261
$$ 324061 206446 -397887 -43075 392599 -122492 -324924 254751 202070 -321583 -49322
153d9322L78825m17813j80163M62668k1495m28728K06784L15205l33950j48710
$$ -49322 329503 -88310 -268473 194195 172700 -256028 -49244 265961 -67989 -216699
163b16699L77816k5694l35471J66381K38539k50797j18437K82573j1300k56345
$$ -216699 161117 135423 -200048 -33667 204872 -45925 -164362 118211 106911 -149434
173a49434J21889J75145j83147p1250J82361j3045j46691P1953Q8534r8523j8705
$$ -149434 -27545 147600 -35547 -106797 75564 62519 -84172 -12219 76315 -22208 -40913
184d0913Q3443m1860k8650N9723l9103l0691Q5072k5588j01169R4009Q3301j65978
$$ -40913 42530 670 -27980 31743 -7360 -38051 47021 21433 -79736 14273 97574 -68404
196f8404k0729K16391q0553k22010J99210J61741k92803n5882L42904p6486l44344
$$ -68404 -89133 127258 46705 -175305 23905 185646 -107157 -163039 179865 103379 -240965
207b40965K19181K88560l56738j64623M43897m688m56567J80650M02254l34975
$$ -240965 -21784 266776 -89962 -254585 189312 184624 -271943 -91293 310961 -24014
217b4014k92477M55800J24609n08260O7988M83498k49423l87957L85260K47622
$$ -24014 -316491 139309 263918 -244342 -176354 307144 57721 -330236 55024 302646
227C02646m67504p9651M90143r9097m37400K52922L27175l53358j86699L92966
$$ 302646 -164858 -244509 245634 146537 -290863 -37941 289234 -64124 -250823 142143
237A42143M8369l85082P9578L32565j82025k41967K38737J41953k49795n4701
$$ 142143 190512 -194570 -114992 217573 35548 -206419 32318 174271 -75524 -130225
247a30225K31575q161k00578N1770J60580p4036j23281P6935J02751p0327j04662
$$ -130225 101350 93189 -107389 -55619 104961 30925 -92356 -15421 87330 17003 -87659
258h7659Q1671J09140j07164j06800J42913R0885j86239n6214K28530m321k58848
$$ -87659 -5988 103152 -4012 -110812 32101 122986 -63253 -119467 109063 104742 -154106
269a54106R2179K54597j90196k04331K70995J25350l31383j9413L60830j13845
$$ -154106 -61927 192670 2474 -201857 69138 194488 -136895 -156308 204522 90677
279I0677l35795K44513K52993l42550j33460L95852p012m01548J51528L51835
$$ 90677 -245118 -605 252388 -90162 -223622 172230 165218 -236330 -84802 267033
289B67033k84492k42866L73481J01011m06860N1622L75372j84136l00906K88735
$$ 267033 -17459 -260325 113156 214167 -192693 -141071 234301 50165 -250741 37994
299C7994J86511l48303n0093L52057q3844k98667J84312K14649k47294j15058
$$ 37994 224505 -123798 -173891 178166 94322 -204345 -20033 194616 -52678 -167736
309a67736K75135Q440k60291Q7440K02883j47598j26681J70522N7868j69725L464
$$ -167736 107399 115839 -144452 -57012 145871 -1727 -128408 42114 99982 -69743 -66279
320f6279J46654m8930j10495P4972O6727p1996l7833O0066K5346n0866k0915M7805
$$ -66279 80375 31445 -79050 -4078 62649 -9347 -47180 12886 38232 -12634 -33549 14256
332A4256K0636m9645k3897N9961K4591p9838j0382J03576k6218j09326O7042R8285
$$ 14256 34892 -14753 -38650 21311 45902 -33936 -44318 59258 33040 -76286 -9244 89041
344H9041j09366o8824J46709K2783j70854M1501J69518j11910j32463J66205P4242
$$ 89041 -20325 -89149 57560 80343 -90511 -49010 120508 8598 -123865 42340 116582
355A16582j99501l789K11168p8733j92273J57199J34610k10234n2981K29711l3453
$$ 116582 -82919 -86708 124460 45727 -146546 10653 145263 -64971 -117952 111759 78306
366G8306k17073J13072J76644j81648j08705K24735J9759k26345O4072J93181
$$ 78306 -138767 -25695 150949 -30699 -139404 85331 105090 -121255 -57183 135998
376A35998j30415j42115J78487P4053k01506N083J88422p2161j51292J20244R9135
$$ 135998 5583 -136532 41955 116008 -85498 -80415 108007 35846 -115446 4798 103933
387A03933j43750m6319J48551p262j36286N2379J07840q1441o8773R0458L6076
$$ 103933 -39817 -86136 62415 55153 -81133 -28754 79086 -2355 -71128 19330 55406
398E5406q8509j3377Q5572j0429p2789K5293N9773l3394m6473L1454M6840m1694
$$ 55406 -33103 -46480 39092 28663 -44126 -18833 40940 7546 -38927 -7473 39367 -2327
410b327m1708N4719L0597o4435j6877P3942M91q0938K0505Q5716m9632p5940P9514
$$ -2327 -44035 10684 41281 -23154 -40031 33911 34402 -46536 -26031 59685 10053 -65887 13627
423A3627N2699j01218k1938J13075j3291j16360N5433J02632r4720p0647J21642
$$ 13627 66326 -34892 -56830 56245 42954 -73406 -17973 84659 -10061 -80708 40934
434D0934K9496j31489J3615J28105n7544j10894R8917P6773j27286k8334J31648
$$ 40934 70430 -61059 -47444 80661 23117 -87777 11140 87913 -39373 -67707 63941
445F3941j5590j24376N7190J01742q8412p2738J12049L2510j20395J1235J09607
$$ 63941 48351 -76025 -18835 82907 -5505 -78243 33806 66316 -54079 -42844 66763
456F6763m3058r2119O7572O7253q7381l7386R6499L133q9894K2655P7829m2019
$$ 66763 23705 -68414 -842 66411 -20970 -58356 38143 41276 -48618 -25963 51866 9847
468I847o3645N7495M7730p0441k5272P3937J360o6285J2009O3036k7063n9745
$$ 9847 -53798 3697 51427 -19014 -44286 29651 31011 -35274 -23265 39771 12708 -47037
480d7037M5544M7348n9983k7581O4108J0568o6016L969O8322k4397o5394M9974
$$ -47037 -1493 45855 -14128 -41709 22399 32967 -33049 -29080 39242 14845 -50549 -575
492e75M7616o3644k9779P3302J0325p5813R853P6986l6811o6603O3160M1773p3368
$$ -575 47041 -16603 -46382 26920 37245 -38568 -28715 48271 11460 -55143 8017 49790 -23578
505b3578j9403P8521k106q1735L1751P0599n5147n0728P0983K4526p5603j524
$$ -23578 -42981 35540 33434 -48301 -16550 54049 -1098 -51826 19157 43683 -31920 -33444
517c3444P4981k0834o9380M5979N4787o4189l1387P2074N673o8562J3970O3867
$$ -33444 41537 20703 -48677 -2698 52089 -12100 -43487 28587 34260 -34302 -20332 43535
529D3535l4190n3051N1934L3084o2138r657N9981o331n5645K1608N0357l9736
$$ 43535 9345 -43706 8228 41312 -20826 -30483 29498 23167 -32478 -10870 39487 -249
541b49l7830M9556K0608n3263j929N0844j1190m6844K3282M0654l8165k6717M4424
$$ -249 -38079 11477 32085 -21178 -23107 27737 16547 -30297 -7015 33639 -4526 -31243 13181
554A3181J2725m4715j210M5238j1705m2932K5068L5039l7630k1539M2584Q436
$$ 13181 25906 -18809 -20019 25219 13514 -29418 -4350 30689 -6941 -28480 14104 22540
566B2540m3314J980M3666j4668m0846K9344L0008l9548j7288M4260M210m3908
$$ 22540 -20774 -18794 24872 10204 -30642 -1298 28710 -10838 -28126 16134 20344 -23564
578b3564O927M3984k1528l7379L4037K4462m0557j0598M2842j683m2140J3993
$$ -23564 -16637 27347 5819 -31560 2477 26939 -13618 -24216 18626 16943 -25197 -11204
590a1204L9510k9421k7970L8548J4102l8808l368L9448r286l6077K1210L0063
$$ -11204 28306 -1115 -29085 9463 23565 -15243 -18611 20837 11551 -24526 -3316 26747
602B6747l1058j9362L5604O134l3158J715L3724j2223l0192K3398K1341k9239
$$ 26747 -4311 -23673 11931 18065 -15093 -13378 20346 8123 -22069 1329 22670 -6569
614f569j1309L1195M88k6994L489K8438j1862k5349K2831J5586k6859o833K5658
$$ -6569 -17878 13317 13805 -13189 -9700 18738 6876 -18473 4358 19944 -6915 -13748 11910
627A1910Q60k4743L900K5924j3987k1621K2002J1382k2789m901K1105K379k4105
$$ 11910 12770 -11973 -8073 17851 3864 -17757 4245 15627 -7162 -12063 9042 11421 -12684
640a2684N754K1635j3786j6587J9268P948j8256m057J8495K077k2879Q026J6954
$$ -12684 -6930 14705 919 -15668 3600 11548 -6708 -10765 7730 9807 -13072 -5046 11908
653A1908j2472j1402J4195Q896j6598m819J7280K65j9358Q228J5337j2366q467
$$ 11908 -564 -11966 2229 11125 -5473 -10292 6988 7253 -12105 -3877 11460 -906 -9373
666i373J0282Q531j4230m404J7160k529j6106P118J2142r268q245R913P823j4263
$$ -9373 909 9440 -4790 -9194 7966 5437 -10669 -3551 8591 -677 -8922 991 8814 -5449
680e449l635J8215l941j4148O894R368p933p640R611O418j3408r83J4360n497
$$ -5449 -9084 9131 5190 -8958 -2064 7304 -629 -8269 1342 7760 -5648 -6631 7729 2232
694B232r900P234P544p194o319R617M859j3104J219R961m441p486N636P118p933
$$ 2232 -7668 -434 7110 -84 -6403 3214 8073 -5031 -3812 6149 1708 -5778 -142 6976 -957
709i57o470J1723J838j0368K054P242k233p170L531P640o296o192R487J875r285
$$ -957 -7427 4296 6134 -4234 -2180 5062 2829 -4341 -810 6830 534 -5658 3829 5704 -3581
724c581L84P923o83q852L299Q052p083n122R771Q6p271k225R699j459p946K526
$$ -3581 -3197 4726 4043 -4809 -1510 6542 -541 -5663 4108 4194 -3077 -5302 4397 2938 -5008 -2482
740b482Q882o913o318Q902K284q481j644Q609Q49j0739N661P228p845m552P408
$$ -2482 6400 -513 -6831 2071 4355 -4126 -5770 2839 3688 -7051 -1390 5838 -2007 -6559 849
755H49L713q032k469R330m29r299M574Q175p802m353O318N087r168j736J1594
$$ 849 4562 -3470 -5939 3391 2962 -6337 -1763 6412 -1390 -5743 575 5662 -3506 -5242 6352
770F352k733j0678O199P441o853n931P717N986j1560q03J1572m224r907P076O356
$$ 6352 3619 -7059 -860 6581 -272 -6203 1514 7500 -4060 -4863 6709 2485 -7422 -346 6010
785F010n441p793J0253M460j0732k841J2546l635q981O273P668q351q387J3420
$$ 6010 569 -7224 3029 7489 -3243 -6084 6462 2827 -6154 119 7787 -564 -8951 4469
799D469K561j1200Q2J1938m546r459M453J0531q837p611J0996M202j2729L50J0993
$$ 4469 7030 -4170 -4088 7850 3304 -6155 -1702 8829 -8 -7619 3377 7579 -5150 -4800 6193
814F193j958j1681N548J1801j1165o853J1642M241j4282J633J2060k506j4523
$$ 6193 4235 -7446 -1898 9903 -1262 -8115 3527 7768 -6514 -4881 7179 4673 -9850
827i850Q299J0226j1620o124J4022m87j2099J795J4171m723j4643J1018P709j2277
$$ -9850 -1551 8675 -2945 -9069 4953 4466 -7633 -5838 8333 3610 -11033 -15 7694 -4583
841d583l286J3980j883j1471L659J1900p141j1570J3105N385j4926Q94J1792j291
$$ -4583 -7869 6111 4228 -7243 -3584 8316 1175 -10395 2710 8095 -6831 -5937 5855 4564
855D564j3710P068J1154r059j0264J3566M385j2908o62J2198l320r983O471J0227
$$ 4564 -9146 -2078 9076 17 -10247 3319 7704 -5204 -5866 6332 3012 -6971 -500 9727
869I727j1257o626J2173J930r582j333J1388l173j1446Q739Q764j0542n844J1851
$$ 9727 -1530 -8156 4017 5947 -3635 -4968 6420 3247 -8199 540 9304 -1238 -7082 4769
883D769J593j1434Q28J1126k701j2455J0573P148j0508p211J2515K278j2528J554
$$ 4769 6362 -5072 -4244 6882 4181 -8274 2299 9447 -1061 -8272 4243 6521 -6007 -4453
897d453J3976o022j4057J1070R099j3694l053J4135N77j5808L738J6335j1444
$$ -4453 9523 3501 -10556 514 9613 -4081 -7134 7001 7578 -8230 -4492 11843 399
910C99j1216J4086N098j3228j467J3887j913j5247O742J4664j4306p137J5789
$$ 399 -10817 3269 8367 -4861 -6328 7559 5646 -9601 -2859 11805 -2501 -9638 6151
923F151M07j3405N2J4840m380j4082R731J0155j3706m778J4043J724j3482J461
$$ 6151 6558 -6847 -6795 8045 3665 -10417 -686 9469 -4237 -9015 5028 6752 -6730 -5269
937e269J1881m310j1432R528P632j0531n361J2304L261j5168J241J3571m188j2151
$$ -5269 6612 2302 -9130 398 8030 -2501 -7862 4442 7703 -7465 -6224 7347 3159 -8992
951h992R281Q373j1456m377J1790L427j4908M01J6516o557j3297R688J0409j2540
$$ -8992 289 8662 -2794 -7171 4619 8046 -6862 -6461 10055 3498 -9799 -111 10298 -2242
965b242o943J5692L427k0540N734J8068j1133j4431J4995R708j7506m451J9922
$$ -2242 -9185 6507 9934 -10606 -4872 13196 2063 -12368 2627 12335 -5171 -9622 10300
978A0300r76k2518J1123J6271j4932j1642J8961M444j9996J117J9348p327j6403
$$ 10300 9324 -13194 -2071 14200 -732 -12374 6587 11031 -8965 -7848 11500 4173 -12230
991a2230J4504J0666j7150o791J7751J347j7929N598J5272j0708j0698J4199M274
$$ -12230 2274 12940 -4210 -11001 6750 8097 -9832 -4234 11038 330 -10368 3831 8105
1004H105j4817j53J3589j372j4591N816J2163j0029p043Q889M962j0146k920J3218
$$ 8105 -6712 -6865 6724 5352 -9239 -3423 8740 -1289 -8332 557 5519 -4627 -7547 5671
1018E671q38j2472L115J1950p874r209J0539Q019j3377n387J6598r80j5977N113
$$ 5671 4833 -7639 -4524 7426 -448 -9657 882 8901 -4476 -9863 6735 5755 -10222 -5109
1032e109J5850j1315j1452J3176R986j7360l215K1030n855j9466J1921J5622j6315
$$ -5109 10741 -574 -12026 1150 11136 -6224 -9439 11591 5736 -13730 -1809 13813 -2502
1045b502j0340K1216L015k3174M632K2746j3595j7358J9112R561k1623l170K2901
$$ -2502 -12842 8374 11389 -11785 -7153 15593 1998 -15360 3752 13313 -8310 -11480 11421
1058A1421m136k2018J3799J6070j8297r805K1288J372k0870N224J9655j1160j4881
$$ 11421 7285 -14733 -934 15136 -3161 -12966 8322 9694 -11176 -5952 13703 2543 -12338
1071a2338J5486P801j6229k501J5656K00j7303N642J3980r629r239J1455N827
$$ -12338 3148 10949 -5280 -7781 7875 8075 -9228 -3586 10394 765 -8474 2981 8808
1084H808j2761k991J2487N09j3480L539J2457o789j0073Q525O868r320o323J2330
$$ 8808 -3953 -6944 5543 6052 -7428 -3889 8568 1779 -8294 231 7099 -2221 -8544 3786
1098C786K754j4646K170J5386q230j1299R769J1496j3820p988J6407K875k0412
$$ 3786 6540 -8106 -5936 9450 1220 -10079 -310 11186 -2634 -10622 5785 8660 -11752
1111a1752O996J6319j0716j4126J5335R184j7516m353K0666l999j9462J1600J4839
$$ -11752 -4756 11563 847 -13279 2056 11240 -6276 -10629 10037 6038 -13424 -1824 13015
1124A3015j5354j0262J9074L886k0357L132J8728r792j4071J4599P781j6363k920
$$ 13015 -2339 -12601 6473 10359 -9998 -6866 11862 2070 -12001 2598 10379 -5984 -8904
1137h904J7335j241j7213O826J3045j1173o861J1671L823j2780j33J2740l046
$$ -8904 8431 7190 -10023 -3197 9848 -1325 -8186 3485 7308 -5472 -5605 7135 4089
1150D089j1757Q096P822r290n264Q837L437r978N99R351l901q670O249P039o632
$$ 4089 -7668 428 8250 -1040 -6304 2533 5970 -4008 -3409 5942 2041 -6629 -380 6659 27
1165B7n660P062N237j0795o23J0446k511r957N696Q466o885q703J1476M178j3296
$$ 27 -5633 1429 6666 -4129 -4752 5694 3183 -6774 -1078 7388 503 -8200 3276 7454 -5842
1180e842J01J2450l798j1629P876R821j0474p505J3121L089j4994K985J3831p293
$$ -5842 -5741 6709 2911 -8718 -842 8979 -1495 -9000 4121 7210 -7784 -4799 9032 1739
1194A739j1175J0849P441j3475m091J6050k658j4265Q194J0573j0532q756J4726
$$ 1739 -9436 1413 8854 -4621 -8712 7338 4680 -9585 -1391 9182 -1350 -10106 4620
1207D620L512j5886J501J5935q471j1122J0845P400j3022l688J4313k01j4282
$$ 4620 8132 -7754 -6253 9682 1211 -9911 934 8334 -4688 -8376 5937 5736 -8546
1220h546O098J1466r432p357J0600M962j1427j779J1251p08j1845O452P591p727
$$ -8546 -2448 9018 -414 -7771 2829 7791 -3636 -5415 5836 5128 -6717 -265 7326 -401
1234d01o636R603M190r952k263J1191j505j1185O286Q458o563q266Q990N457j0942
$$ -401 -7037 2566 6756 -3196 -5459 5732 4227 -6958 -672 7786 1223 -7043 1947 7404 -3538
1249c538k925J2731m57j3020L915J2119p895r613J1168P787j5182j451J4629l023
$$ -3538 -6463 6268 5811 -7209 -3294 8825 930 -8683 2485 10272 -4910 -6361 8268 5245
1263E245j5071Q454J1593j1996q267J4715L841j7356K484J6536p308j3521J0708
$$ 5245 -9826 -1372 10221 -1775 -10042 4673 8514 -8842 -6358 10178 2870 -10651 57
1276E7J0021j3330n524J6680k249j6438P407J3896j1631r501J4178M724j4739
$$ 57 10078 -3252 -8776 7904 5655 -10783 -3376 10520 -1111 -10612 3566 8290 -6449
1289f449m57J5002n367j2466R861Q678j1939l826J0558J711j2432K608J1330o387
$$ -6449 -6906 8096 2729 -9737 124 8802 -3137 -6963 3595 5306 -7126 -4518 6812 425
1303D25p213P279N763q298m103R495J784j1281K920Q615l915p297O254N587o748
$$ 425 -6788 491 6254 -2044 -6147 3348 5132 -6149 -3229 5386 1471 -5826 428 6015 -733
1318g33n243R719J726q472n19Q195l094o667M527P272p884m734R263J726r465
$$ -733 -5976 3743 5469 -3003 -3522 4673 1579 -5088 -561 6711 -1173 -5907 3356 5082 -4383
1333d383J961Q748m712p470O447P441j0234l843J1387j417j0486N118R106p648
$$ -4383 -2422 6326 1614 -5856 591 8032 -2202 -6045 5342 3925 -6561 -1443 7663 15
1347A5o728R363L138j0515J302J0112m933p909N763O467q648k344R345p92r140
$$ 15 -6713 2650 5788 -4727 -3425 6687 1754 -6155 -392 6075 -2573 -4917 4428 3636 -5504
1362e504L108Q303p226m025O731L662q834J97P927l278o297M430M841n805k397
$$ -5504 -2396 5907 -1319 -5344 1387 5049 -3785 -3588 4339 1061 -5236 -806 4035 -1770 -4167
1377d167N806J819o603m80P297l048m812M133L128m128k419M623J316n104M71
$$ -4167 1639 3458 -3145 -3625 3672 624 -4188 -55 3073 -1055 -3474 1149 2465 -2639 -2168
1392b168O458m292l533L093N164m964l511N267J728o155R55O061k525n220K666
$$ -2168 4290 -2 -3535 -442 4722 -242 -3753 1514 3242 -2913 -1958 4103 1578 -3642 -976
1407i76M506m670l053P208m98o614L278N798l929n632O032K590n392k597P849
$$ -976 3530 -1140 -4193 3015 2517 -4097 -819 4979 1050 -4582 1450 4040 -1352 -3949 3900
1422C900j271o512K685N579m704k577M000L419o912O48N418j876n939L649M625
$$ 3900 2629 -3883 -1198 4381 -323 -2900 1100 4519 -2393 -1745 3673 1797 -4142 -493 4132
1437D132m398l706O844J35o925J885N859k500n646L804M449l734n157P910K62
$$ 4132 -266 -3972 2872 3007 -3918 -2033 3826 1326 -4320 -516 3933 199 -4958 2952 3214
1452C214p688K648O134l337n087L689M581o260j464N923O21o390J573N514l678
$$ 3214 -4474 -1826 4308 971 -4116 -427 4154 -2106 -3570 2353 2974 -3416 -1843 3671 -7
1467gm561N104L309n448j473N605j681m349K335N541l723l769L493L166o466j423
$$ -7 -4568 536 3845 -1603 -3076 2529 848 -3501 -1166 4375 652 -3117 376 3542 -2924 -4347
1483d347P433l98n431J749N455m704m903P177L00n652J241N689k261m826K477
$$ -4347 3086 2688 -2743 -994 4461 -243 -5146 2031 2331 -3321 -2080 3609 1348 -3478 -1001
1498a001M689m517l446O427N57n422l70N665j945m476L360L725l729k102N103
$$ -1001 3688 -829 -4275 2152 2709 -2713 -3083 2582 637 -3839 -479 3246 -483 -2585 2518
1513B518M59m436J38M880j579o092M534K796m756j412M552J999n953J271M457
$$ 2518 2977 -1459 -1321 3559 1980 -4112 422 3218 -1538 -2950 1602 3601 -2352 -1081 3376
1528C376k759n062N351J589n029J93M924j620m271L174K802j918m749N454O66
$$ 3376 617 -4445 906 2495 -2534 -2341 2583 963 -3308 -134 2668 750 -3999 1455 2121
1543B121m414J342J063K8j961J716L188m497n62L310N21m386K861J220j121l707
$$ 2121 -2293 -951 112 140 -1821 -105 3083 -1414 -1976 1334 1855 -2531 330 1550 429 -3278
1559c278M020J272l186k09L015m97k656O38K272j781q72J545K386n250J685K814
$$ -3278 742 2014 -1172 -1381 1634 1137 -1519 -881 1391 -390 -1262 283 2669 -2581 -896 1918
1575A918j125k713L58L168j443l483L270J537l619Q48K615j106k170K007K963
$$ 1918 793 -1920 -1562 1606 163 -3320 -50 1487 -2132 -1284 1331 225 -1945 62 3025
1590C025l410r82J597J043k851K116J850k333k221K095K042k960k55L032p02k756
$$ 3025 -385 -1367 230 1273 -1578 538 2388 55 -2166 -71 1971 -989 -1244 1788 1086 -1670
1606a670J266K717k193j241J251K136l261L41K720j506j590R71J906r48j774K096
$$ -1670 -404 2313 120 -1121 130 2266 -995 -654 2066 560 -1030 -59 1847 899 -875 1221
1622A221L98l133J045K201j398p55n44K244j683m30J318K26j327Q1J541j314j061
$$ 1221 1619 -1514 -469 1732 334 -421 -965 1279 -404 -834 484 710 -617 -536 1005 -309 -1370
1639a370K87K529j707r80J684J41j876L77K177j76l276J062K233k188l5J764M97
$$ -1370 -1083 1446 -261 -1241 443 584 -1292 -915 1262 1086 -2190 -1128 1105 -1083 -1118 646 1143
1656A143j861k48K071o44j846Q58K226j913p66J685O8k099N91K491j563j792K803
$$ 1143 -718 -966 1105 461 -1385 -527 1699 -214 -980 705 773 -1326 -735 1756 193 -1599 1204
1673A204K7k031J71J254k67j339J30K282j419j398J974N7j263L28J007K76j723
$$ 1204 1231 -800 -629 625 358 -981 -851 1431 12 -1386 588 645 -618 -290 717 993 -730
1690g30K22J541r33p80J312rn79j58Q64o3j526N84J528j447n7N47O13m72r33R79
$$ -730 -508 1033 100 -680 632 623 44 -114 750 687 -839 -255 1273 -174 -231 316 929 457 -476 503
1710E03N97j848N30P59l32l66L0O14j633L05J978q77j544J667M17p78n68L29J016
$$ 503 1100 -748 -218 541 209 -157 -127 487 -1146 -841 1137 260 -1284 383 800 22 -546 -217 799
1729G99j440k41J974j270o15Q56l55J27m86J038k43o54N66R15q85n80O64N02p85
$$ 799 -641 -882 1092 -178 -793 63 -292 -165 -651 387 144 -510 56 971 86 -494 170 672 -113
1748a13k92R57k52r25L72R77q23M79R9J17p74j025J497J79n98M41q30M99n03N99
$$ -113 -405 552 300 -625 -253 724 -99 380 479 596 -178 -1203 294 473 -125 316 -514 -15 -518 81
1768H1n6j82k1J243q23j59K95k04K58j63O3Q26j924Q8J572m46j219J346j83J39
$$ 81 25 -157 -178 1065 242 83 378 174 432 269 332 1158 -766 -678 894 448 -771 575 392 531
1788E31r29R29P75j339O4O34l04n00M37M2J35q55K32R8J9j52L34j95n45M44P17
$$ 531 -398 531 1306 -33 31 665 361 -139 298 340 475 -380 -148 -50 -31 -183 151 -44 -589 -145 572
1809E72q30N2O17l64p9O4Q85o02n24J46L99k95m28N24q11P92q42L31J48J50O24
$$ 572 -258 -206 411 47 -32 32 917 315 -209 -63 336 41 -387 137 -674 118 -724 -393 -245 -95 529
1830E29l7r12L36l14M40l90k34J146n55n90O21J19J78p10Q77N92j788N90J346
$$ 529 492 -420 -84 -398 42 -348 -582 564 9 -581 40 159 337 -373 504 1096 -692 -102 1244
1849A244o63l58n7K65l15k24l3O69q89p79J483L45p14P22K18j825R16J103o11
$$ 1244 581 223 166 431 116 -108 -141 528 -361 -1140 343 688 -26 696 914 -911 5 1108 497
1868D97p09K43O54n82O0L1ol48Rj63P89o00N20P78j239o9N03j09J51m83M05K34
$$ 497 -212 31 685 103 163 194 188 -160 -151 -314 475 -125 395 1173 -66 -135 368 259 410 -73 332 566
1890E66j047J096Mn71q28L07O49n04k99J103k81j16M28k86j55n58J80P09j61m37
$$ 566 -481 615 619 48 -780 -473 176 -328 -627 476 195 79 507 221 66 -492 -312 397 236 -201
1910b01P68K10j057m95K03J340j151L3O20j00q20J211n30m22pN10J49m56l70J159
$$ -201 567 777 -280 -775 -572 768 -383 -350 270 170 -650 561 31 -391 -398 112 261 -195 -565 594
1930E94j360O21o95N66j64J96L5K06j05l75J62k63R32j45j01J51k25M52n22l03
$$ 594 -766 -145 -840 -274 -438 -242 -207 -1 -106 -481 -319 -582 350 205 104 255 30 482 -40 -343
1950c43O58o23J88N59q43N05k55P08M67r73m38J64M41o50K02J102j3j660J341
$$ -343 315 -308 -120 439 -404 101 -154 554 1021 48 -390 -226 215 -435 -233 869 856 -804 537
1969E37J132j783p11R68k64N96j637J174K1p58O20M72k94k46Q40n30k2o01J088
$$ 537 1669 -114 -825 143 -121 475 -1162 12 33 -725 -105 367 73 -173 667 137 115 -486 602
1988F02k08l62r8L27k25j46M77J22k98j24J38l66p93K001l10m80o07O3N56j197
$$ 602 394 32 -66 261 36 -110 367 489 191 67 205 -161 -954 1047 737 257 -350 -287 269 -928
2008i28Q96J078q68j34P08j413M25l90J481q96r20J337j1j709J432j78M8k89J32
$$ -928 -32 1046 178 44 752 -661 -236 -626 855 -41 -961 376 365 -1344 88 -90 -42 -331 -199
2027a99P25j14n54K66j90K73K52m98j40m29P4M54M72j065J828L48k056N7N13Q15
$$ -199 526 412 -142 124 -66 207 459 -39 -179 -608 -534 -80 392 -673 1155 1503 -553 -496 17 832
2047H32j092J67R64q99k89R13n00J28PL49L65p87N95j04j148J99J252j143K7J12
$$ 832 -260 -93 871 -28 -317 596 96 224 231 580 945 158 753 649 -499 -300 952 -191 -164 -52
2067e2P17j756M58J668n1j049L95J36O53m74j046J178o03o00J253j62j056m21
$$ -52 665 -1091 -633 1035 984 -65 330 466 1119 645 -401 777 174 -426 827 665 -391 -812
2085h12J015L84p84M7Q28j218O69R06j114p09O54P83j057k36P36N73j043M0PK37
$$ -812 203 587 -197 -150 678 -540 129 1035 -79 -788 -134 649 -408 -644 92 665 -378 -338 -331 -94
2105i4j005J421n24k37m29J145j36o04l39R07Q3K23q15Q49J53q06N78l71m6k84
$$ -94 -1099 322 -202 -439 -868 277 141 -463 -802 105 188 411 -404 445 598 -208 370 -1 -47 -331
2125c31Q6J60n89O19L48m88M48J266o62j237m3J292o12l76j129K003k26m84K7
$$ -331 -245 -85 -674 -55 293 -195 253 1519 857 -380 -423 869 257 -119 -1248 755 529 45 72
2144G2k83J965k650N41J141j091K66P86r50M43L57Q25j635m62J447l72r63N68
$$ 72 -211 1754 -896 -355 786 -305 -39 747 -203 240 597 1422 -213 -675 772 400 -563 5
2162EM27r36j22N28pj33O19k91r84L87J008p52o90P17P5J03K11m2l5J24l58O6
$$ 5 432 -504 -626 -98 -105 -238 381 90 -894 -507 501 -251 -941 -224 -149 -46 165 123 88 212 -146 -80
2184h0j83M44r1j29j26l68M65k87P44l23j01M43L9Q51j595O51p41L97P57j91m03
$$ -80 -263 181 90 -39 -165 -533 -68 -355 389 66 -35 408 447 1298 -297 354 -387 10 767 576 173
2205A73j34m65M82j616J868o68n77J013l39K92P6j31P12m25k24Q90p09K08L51
$$ 173 39 -426 56 -1560 308 -360 -937 76 -263 29 105 -26 686 261 37 927 218 426 777
2224G77q37J47j84K06J156r70j92K06M16l24r1R23j109n69J155j89m15n40R55
$$ 777 -60 87 -97 109 1265 295 103 309 725 401 310 1233 124 -445 710 521 106 -434 521
2243E21l11Q96j554R27j391P38L48o7k85R06l79k73j2m45R91q71l5L91k81j21
$$ 521 210 1106 -448 479 -912 -174 174 107 -178 728 349 76 64 -381 610 -261 -296 95 -186 -307
2263c07N01P89j236m02l58J273q88M09R29j349J635k73o49j64J75J70K57q30P41
$$ -307 194 983 -253 -655 -1013 260 -628 -219 710 -639 996 723 74 -90 85 255 512 -318 423
2282D23J23o49o79J80J225p71M61j06k59k87J4L31K08J59p06Q79j058j12J277
$$ 423 546 -103 -782 -602 623 -148 313 207 -52 -339 -325 6 214 373 -333 546 -512 -624 653
2301F53j140P3L61q3K07r6j97L41M84j072J141p45l9p4Q43q65L4J6O28Q5m64m57
$$ 653 -487 -414 -53 -136 71 -25 -222 119 603 -469 672 -73 -112 -186 657 -208 -174 -158 470 555 91 -366
2323c66N27l65O32K02j67M5J03o68o23Q05l24J66k39N44K5k44j17J080j174l50
$$ -366 161 -204 428 630 463 508 611 -57 -680 125 -199 -33 -272 272 297 53 -64 1016 -158 -508
2343e08M10N50p69Jn9K01m31J394q02P09o12R4l55L19n31K84j87l93J062L30j335
$$ -508 -98 452 -317 -316 -375 -174 -605 789 -13 696 84 178 -177 142 -389 -105 -292 -685 377 707 -628
2364f28P93k96J7m55o7Q55r98J032o09L07qm44L76l37k77J257n18O68p16L37p61
$$ -628 165 -131 -114 -569 -636 219 -779 253 -356 -49 -57 -501 -125 -462 -739 518 0 668 -48 289 -472
2385d72M69n34L33L00l55O0j19m1l26P81m7l14P49q89J086j096M68O19j43M20
$$ -472 -3 -537 -204 96 -259 -199 -318 -359 -685 96 49 -265 484 -405 681 -415 53 672 529 949
2405I49j280J75J61o60L87J238l0j626J777j369O1P8R61m00j634J887r0r24NJ35
$$ 949 -331 -156 5 -655 -268 970 940 -686 1091 -278 -217 -139 822 422 -1212 675 585 -339 -334 -199
2425a99M79J97L59q66o13Q54m80K52K10J31J47J626j937m99L76l29O6j75K83o37
$$ -199 280 477 836 -30 -643 211 -269 -17 193 324 471 2097 160 -339 37 -292 -226 -401 -118 -755
2445g55J7J037m50J049o69J44o99N52j37J01O42o19o84P58k96r8J64J44n37N43
$$ -755 -738 299 -151 898 229 373 -326 226 89 190 832 213 -471 287 -9 -107 57 201 -336 207
2465B07l85M38N18p87l81K80j04jP59n16q52P57o17Q14q80O39K46M88M40j138
$$ 207 -178 260 778 -9 -390 -110 -214 -215 544 28 -824 -67 -684 130 -750 -111 135 623 1063 -75
2485g5O0k61M51m81n06N24j25l00R12m25J21O05k04m52r0P97o26o6j12K56N26
$$ -75 -15 -276 175 -306 -812 -288 -413 -713 199 -226 -105 500 296 -156 -246 551 -75 -141 -253 3 529
2506E29o75O04N67r46o89Q16J347j572o91m16Q17O96m88L70J64K24m65K9j057
$$ 529 -146 458 1025 79 -610 206 1553 -19 -710 -1126 -309 387 -101 269 433 657 192 221 -836
2525h36M22N69p61J387j300L1P67l68K10J0l62k13M2j31L34J93P00j129N41J30
$$ -836 -414 155 -606 781 -519 -488 279 -89 121 131 -231 -444 -402 -533 -199 -6 694 -435 106 236
2545B36k26j65l01j14J656n91j023J350j080k05J138k21M00n33M61n50m33k36
$$ 236 10 -155 -456 -570 1086 495 -528 822 -258 -463 675 454 854 321 782 232 -201 -437
2563d37M3N77o25K74O7J76J69L0q95J064l70N93j205l4O27j72Q32j457J235o80
$$ -437 -394 183 -442 -168 -101 75 244 274 -621 443 73 666 -539 -573 54 -118 714 -743 492 -188
2583a88J32J45J076j037j854J660o38J801p20r07N23N78j12l74m61O01n82L54
$$ -188 -56 89 1165 128 -1726 -66 -704 1097 377 -530 -7 571 459 85 -376 225 -357 -3
2601cJ99O4j48M07j59o27L74R31j117m19L56K16J43k08l63L59J184L73k520L68
$$ -3 196 260 112 519 360 -267 107 1038 -79 -498 -142 74 217 9 -354 5 1189 1562 -958 -590
2621e90J727r92K06k55l47j03J187lj37j17n03o07k63k67N81Q45Lj130J202K15
$$ -590 1137 145 351 96 -251 -354 833 830 693 576 73 -534 -797 -1064 -483 362 365 -765 437 652
2641F52j762O86q6J25o33M81J45P22J37o44j260J264o39M67P42L33j280J310o39
$$ 652 -1110 -424 -510 -385 -1018 -537 -392 330 467 -177 -1437 -173 -812 -345 397 730 -550 760 121
2660A21P0p30m50K332j858O56k04L4M11K42r68m00Q33L68n80N1J80r28J696j320
$$ 121 191 -539 -989 1343 -515 141 -63 -29 382 624 -344 -744 89 457 -123 -72 108 -820 876 -444
2680d44J19l1j83L00L00r40J551j120R11p03P2n44N98l2J465j701p8N38P12j452
$$ -444 -325 -356 -539 -239 61 -879 672 -448 463 -240 -168 -712 -114 -146 1319 -382 -460 78 790 -662
2700f62m1L91Q4O15q87J59O04m67M46k99N18j249K03K47J237j380L80K65K12P12
$$ -662 -703 -312 -228 387 -500 -341 263 -204 242 -57 461 -788 -585 -338 899 -481 -101 164 376 1088
2720A088j263p7j12R39j217J083n42n62Q78j038o09L09J155l0K16j121P71j31
$$ 1088 -175 -252 -364 575 -642 441 -101 -663 215 -823 -1432 -1123 32 2 218 -903 -132 -263
2738b63J78J14m58O82l35l6m7n5M85k59J1M13j026O96m66l54R27j091K102n10
$$ -263 -85 29 -429 253 -82 -118 -165 -220 265 6 17 430 -596 100 -366 -720 207 -884 1218 708
2758G08r26P78m03J654j809j99P0N93J76r60K39j21q3J181j400L25J270l12n75
$$ 708 -218 560 157 1811 2 -197 -127 466 642 -318 -79 -200 -283 898 -502 -177 1093 781 206
2777B06m64M39j76p19M92m80O50r71J623k04n3N83j213J98Q16K6o70N97K44j322
$$ 206 -258 181 5 -714 -222 -702 -52 -1023 600 396 343 926 -287 -89 727 753 83 680 924 -398
2797c98M50j26P2JJ20L29m41j93N99j80j79l97Q14p23l50j21Q17m20L74j168L93
$$ -398 52 -74 -2 -1 119 448 7 -186 413 233 54 -343 471 -252 -602 -723 94 -326 48 -1120 -727
2818g27J04O84L90p27M8N64L15j357L78J57k97J125m41p6K16j314j27M55J646
$$ -727 -623 61 451 -276 -228 336 651 -706 -328 -171 -468 657 216 140 356 -958 -1085 -630 1016
2837A016j433Q90J8J92l007J714J096n99n69r01K242j142J52J034j099n65P07
$$ 1016 -417 473 491 683 -2324 -610 486 -113 -682 -1583 659 -483 -331 703 -396 -961 -254
2854b54p87O14J480k438J396p82J564j192K08J118j40p95m19P36j49m83Q01m72
$$ -254 -1041 -427 1053 -1385 11 -771 793 -399 -191 927 787 -8 -427 309 160 -323 478 6
2872FK86L7m39L66p67N68N02l88o02P67P15j106j70l98K76L18p42r8N28lp21J530
$$ 6 292 329 -110 256 -511 57 559 171 -431 336 1051 -55 -225 -623 -347 -29 -771 -869 -341 -344 -1065 465
2894D65j738K113K65j653L13p6j03O39p88P00O40j017k2O71n41n82J781j075J045
$$ 465 -1273 840 1105 -548 -235 -311 -414 225 -563 137 777 -240 -262 409 -132 -714 1067 -8 1037
2913A037n55Q6n83m93J854p23n98k81L88m49J068j199r8J475p66j927J465R64
$$ 1037 482 568 -15 -508 1346 623 25 -256 132 -317 751 -448 -546 929 163 -1764 -299 665
2931F65m52J45k91N78j317R84j18L34r8q14K1l48K83k52O21Jm14j11P22R4l28
$$ 665 213 358 67 645 -672 312 194 528 430 -384 -363 -711 -428 -680 -59 -58 -472 -583 139 233 -95
2952i5K89k30L43n4q63J020O34j297K6o0m1L44P18j607O72L47l30l46J085q79
$$ -95 194 -36 307 253 -610 410 1044 -253 -227 -287 -328 16 734 -873 -201 146 -184 -530 555 -324
2972c24R8K63j96j001j46Q80j56J033p8J35m19m95R30k11j061J602p78p73J195
$$ -324 -226 37 -159 -1160 -1306 -426 -582 451 373 508 89 -406 524 313 -748 854 76 -697 498
2991D98q42P28o70M08M90p19k14k65j40P56N91q80q33J053L48m71l59O13l25J89
$$ 498 -344 384 -286 122 612 -107 -321 -586 -726 30 621 -259 -1092 -39 309 -162 -521 92 -233 -44
3011d4Q03o66n02J96O69n22p4O59j025J86l70O7J53M09j58Rn18J448m48N0o34
$$ -44 759 93 -409 -213 456 -66 -140 519 -506 -320 -690 -623 -470 -61 -219 -210 -728 720 272 322 -312
3032c12K94K07o64O63n38R30j312O68J2J54l6l58O52J9r54p58R08N36m76P5J024
$$ -312 -18 189 -475 188 -350 580 -732 -64 -52 102 66 -292 360 379 -575 -1333 -425 111 -365 -290 734
3053G34j625Q17J046j661N05r08J093L93k25j0p04L29l08N48q85k82J101j20L82
$$ 734 -891 -74 972 -689 -184 -1092 1 394 169 159 -545 -216 -524 24 -861 -1143 -42 -162 220
3072B20K17l62j399J152k17q11k99L81J182L9L46j129M64Q62r03l60j514P26J708
$$ 220 437 75 -1324 -172 -389 -1200 -1499 -1118 64 103 449 -680 -216 646 -257 -617 -2131 -1405 303
3091C03O2k25K57o62L54mN84R6n39K48K68q51Q76n3o08R2J66p21J86L46j054R65
$$ 303 365 140 397 -265 89 85 669 765 226 474 742 -109 767 714 106 198 364 -357 -171 175 -879 86
3113H6k91j42Q08p6l25k98L17o89J794q02n48k89l22Q88K97j20k2R0l21J95m92
$$ 86 -205 -347 461 385 60 -238 79 -610 1184 382 -166 -455 -777 111 408 288 266 356 35 230 -262
3134b62N40j280J572j140J107o31L88J72p36k19O51q8n07Q7K18m73J43K96P89
$$ -262 278 -1002 570 -570 537 -94 294 466 -270 -489 162 74 -433 -346 -128 -601 -458 -162 627
3153F27n77K71n80J66p94J099j173R42K6N26k23J99j151J097J91o88Q42j029P39
$$ 627 50 321 -259 -93 -887 212 -961 -19 7 533 310 509 -642 455 646 -42 800 -229 510
3172E10q46m08M43R38o36N97j193P49j115K90J303j246N02K55m70k94J002q17
$$ 510 -336 -744 -301 637 1 598 -595 154 -961 -671 632 -614 -112 143 -327 -621 381 -436
3190d36j041J294J50M8l42L6l96O53q57J183O37l13k257J032M98k45L4p31L30
$$ -436 -1477 -183 -33 15 -327 -291 -687 -34 -891 292 929 616 -1641 -609 -111 -356 -322 -1053 -723
3209g23J066R0L63p25k38L03J051j709J202m03o54P20o52K05O5q05Q33O8O2r20
$$ -723 343 433 796 71 -167 136 1187 -522 680 277 -377 343 -309 -104 -39 -844 -11 57 119 -801
3229h01J291o22o62J389k21j357J082k48Q90p56m84P62o82O94o69p6J251p58P36
$$ -801 490 -132 -794 595 374 -983 99 -149 741 -15 -499 263 -419 275 -394 -470 781 23 759
3248G59l42k76l63N63L09p10L7K85o91R30K34p57k23L6j81n78L78j6J174l07J5
$$ 759 417 141 -222 341 650 -60 -23 262 -429 501 735 -22 -245 -209 -390 -968 -590 -606 568 261 276
3269B76J21O9r29N17k77Q05k15j200J300K5j5j56R04j608P81j78N06j347J506
$$ 276 397 466 -463 54 -223 582 367 -833 467 492 477 321 1225 -383 398 220 726 -621 885
3288H85q92n67L20J08M3O29j638R13r92R48j37L06m63J473j835P19j24p4R58K51
$$ 885 -7 -574 -254 -146 -103 526 -1112 -199 -1191 -243 -380 -74 -537 936 -899 -180 -304 -378 580 831
3308H31r96Q00p78j000J245L04N45j783J578n46k8P08p17m64O43J69p26N25o35
$$ 831 -165 635 -143 -1143 102 406 951 -832 746 200 172 880 163 -301 342 511 -215 310 -325
3327c25M97O78j590O95M82n90l98J188r18j02P59o76j88o5L83N89j450Q91j03
$$ -325 172 850 -740 -45 437 -153 -551 637 -281 -383 376 -300 -488 -553 -170 419 -1031 -140 -243
3346b43Q79O67k050L59N57n6j187k9J448k56n71k8L55k31N64k22j58o62J804j261
$$ -243 636 1303 -747 -388 169 113 -1074 -1103 345 89 -482 -510 -155 -386 178 -44 -202 -864 940 -321
3366c21Q42j077J555n19L47p56j842K201l63J19k59J176j054o81J085o94Q8N00
$$ -321 521 -556 999 480 827 71 -1771 430 67 186 -73 1103 49 -632 453 -241 -153 347
3384C47j207P48j747J421R25j251Q35J325j541Q23j87m70O80j20n81M19m5O37
$$ 347 -860 -112 -1859 -438 487 -764 71 1396 -145 678 491 21 701 581 0 419 374 1011
3402A011j66qj565N08n02Q34l80j203Q70L73J133j284P70j196q90J050P62p65
$$ 1011 845 837 -728 -220 -722 112 -268 -1471 -601 -228 905 -379 391 -805 -1695 -645 117 -648
3420f48N70M65J15j92p10J00l18N78O27k175K353r28O0Q26o00R0p6m09K32p16
$$ -648 -78 387 502 310 -400 -300 -618 -40 587 -1588 765 -163 -103 723 123 213 137 -272 -40 -756
3440g56M70K44m66O24Q03j060M80j127P35N13r91p96K483j666k05P15M4R8r48
$$ -756 -286 -42 -508 116 919 -141 339 -788 -53 460 -531 -1327 1156 -510 -715 0 44 142 -806
3459h06M85p0L61N64k71k63l84M28K75j23k62J093k203Q91K33P58k38r31M48j506
$$ -806 -321 -391 -30 534 263 0 -384 44 319 196 -66 1027 -1176 -285 -52 706 468 -463 -15 -1521
3479a521J204j97j31Q73j67m0n83O02J1K51j086J686n67p71Q45q51N72J73j51
$$ -1521 -317 -514 -645 228 61 21 -562 40 51 302 -784 902 335 -436 409 -442 130 303 152
3498A52j582J363L48M94j057J450j526L18P01q23l6R62o45P75j604R6O33j381
$$ 152 -1430 -67 281 775 -282 1168 -358 -40 661 -162 -198 764 119 894 -710 -614 19 -1362
3516a362L7j101K157l03Q31N38k04j265J101l69k50k61J628k26j525k7p29L75
$$ -1362 -1325 -2426 -269 -572 259 797 593 -672 429 60 -190 -451 1177 951 -574 -601 -1330 -955
3534i55N83n20L15L34M43j58J165j725j39J247o43M12n60R54R57o94j84j258j126
$$ -955 -372 -892 -577 -243 200 42 1207 -518 -657 590 -53 359 -201 753 1710 1016 832 -426 -1552
3553a552J272K177k464n9j12J347O70r53J32j061K29n44k95k70N85M97J130p72
$$ -1552 -280 1897 -567 -626 -738 609 1279 326 458 -603 -374 -918 -1213 -1483 -898 -401 729 -43
3571d3j054o72J961r77J498q07R46j96j602N53L82j048M68m95n8O80j4p66J205
$$ -43 -1097 -1769 192 -785 713 -94 852 656 -946 -393 -11 -1059 -591 -1086 -1144 -464 -478 -1244 -39
3590c9r32J374j122J93J148l33k05j246J511L60mj309j2J016O88j672O90j115
$$ -39 -971 403 -719 -526 622 289 84 -1162 349 709 705 -604 -616 400 1088 -584 106 -1009
3608a009K426j309q97J044j33L36j13o78Jk82Q90Q2L4L29j545J629q18J527j457
$$ -1009 1417 108 -789 255 122 458 345 -333 -332 -614 276 358 392 721 -824 805 -13 1514 57
3627E7J43r44Q38q15R34M46o13N33j661J491k5m26k27j31L85L6m08J211m84%j407
$$ 57 200 -744 94 -721 213 659 46 579 -1082 409 384 -42 -269 -400 -15 21 -387 824 340 340 -1067
3648a067J976j545R85J299k125K86j5k54J210q52K99m93K75j09j082J270J3q03
$$ -1067 909 -636 349 1648 -477 -191 -206 -460 750 -102 197 -296 -21 -130 -1212 58 71 -732
3666g32J277P95r66j074n99J664n41J25O95r18N49j560J317J16K3n50k30J238
$$ -732 545 1340 374 -700 -1299 365 -176 -51 644 -274 275 -1285 32 148 171 -379 -609 629
3684F29j086P74o41L18L25O42l66n34J87L83l78L84m00Q18k98j625N05K87l67
$$ 629 -457 317 -324 -6 319 961 595 61 248 631 253 637 237 1055 757 -868 -363 -76 -443
3703d43M76N37k8N9r78J256p85p73J185J297j809R86k65j096N29n61k5M93l26
$$ -443 33 570 542 601 -377 879 94 -679 506 1803 -6 980 715 -381 148 -413 -438 55 -271
3722b71j419K151j027Q82o23j60N84O84o66l34l52r60K906j570p6q6J517r78j500
$$ -271 -1690 461 -566 316 -307 -467 117 801 135 -199 -551 -1511 1395 -175 -251 -337 1180 202 -1298
3741a298Q47J225q96P9q09L37M19R14j734N99M7pP4n49j62J394m59p82J094Mp06
$$ -1298 -451 774 -122 -43 -852 -515 -96 818 -916 -317 -270 -277 -203 -752 -914 480 21 -761 333 337 -369
3762c69j032K639r20j55l89K63J214j803O27j57j092J445J72o00n6k12Q39p30
$$ -369 -1401 1238 318 163 -226 37 1251 -552 75 -82 -1174 271 443 -157 -213 -425 414 -316
3780c16J57m79K70J03J611k124Q95J06o94L93O10n4O17k409O11L15J607j725J149
$$ -316 -159 -638 -368 -265 1346 -778 117 223 -471 -78 532 478 1095 -1314 -703 -388 1219 -506 643
3799F43M9j62M08m68n19m3M64p83m90L75M06M59K6n96o40J015N73o21l95P47o26
$$ 643 692 530 938 470 -49 -92 372 -411 -901 -526 -120 339 365 -231 -871 144 717 96 -299 448 -178
3820a78m69J941j229j101J068Q5M79J13J62k52j341P30k6j6l85J83J102j73j79
$$ -178 -647 1294 65 -1036 32 117 596 709 871 619 -722 8 -18 -34 -419 -236 866 693 514
3839E14m12r08J062j070K00l0J046n43m5r7O53j122M1J677j220m35J083q11Q2
$$ 514 102 -806 256 -814 -614 -644 402 -141 -186 -283 370 -752 -711 966 -254 -689 394 -417 -335
3858c35J343j747J705k123J665m28N67p78K3N74N3K05j512J258p32p69O53m7P45
$$ -335 1008 -739 966 -1157 508 80 647 -131 -108 466 519 724 -788 470 -262 -1031 -378 -425 320
3877C20L66k197J718o36J29q37J985j991J522o3j210J019o80N11N60n42k74O19
$$ 320 686 -1511 207 -429 -300 -1137 848 -1143 379 316 -894 125 -555 -44 516 -26 -300 319
3895C19n23M47J84l49j099J660j22j477J131J16J21P2j49L05j604Q65O69m61K87
$$ 319 -204 243 427 78 -1021 639 517 -960 171 287 408 480 331 636 -968 -103 566 105 392
3914C92p06Q88l76l14J34q42N27l82R52m62Q62o86r99J138O62j564J128L8r99
$$ 392 -314 574 198 -116 18 -824 -297 -679 273 -189 673 -13 -1012 126 788 -776 352 390 -609
3933f09J463k93j36j992K235m59j49l32j26J058n67j86l03J644j787ML64O49l51
$$ -609 854 561 425 -1567 668 209 60 -272 -398 660 93 -93 -396 1248 -539 -535 -171 478 127
3952A27J66L66j64l00j66n03J136m39M49l00k92P06m50m21M16k77K71m72M0K59
$$ 127 293 659 495 195 29 -474 662 223 672 372 80 786 336 -85 331 54 325 -147 -107 152
3972A52l12Q8K64l04N64L26j6l37j039J087m35J37O13m88k24O70p23M61J43k91
$$ 152 -160 -72 192 -112 452 778 762 425 -614 473 38 175 788 300 76 746 23 484 627 336
3992C36n43K83R98j982O74j94J056l10M98j144q0j27k49J005n13Q7p5J322j401
$$ 336 -207 76 1074 -908 -234 -428 628 318 816 -328 -408 -535 -784 221 -292 -205 -280 1042 -359
4011c59M36ol49k58NJ194j053L04n82M78O24j477J152l3M59k49L4P91j269K05
$$ -359 77 71 -278 -536 -531 663 -390 -86 -668 -190 434 -1043 109 76 535 286 320 1111 -158 47
4031D7j548M14Q01J98n99L64j93J216j2n75k16j3o01l81J609r0j392J357k8o51
$$ 47 -1501 -1087 -286 -88 -687 -323 -516 700 688 113 -103 -116 -717 -1098 511 421 -971 386 358 -293
4051b93p8J579q05p12P88l66O98m60l11N14J20p11P33r43QL5N05J070j186M19
$$ -293 -371 1208 403 -309 479 113 811 351 40 554 674 -37 696 -247 -239 -204 301 1371 185 604
4071F04n57P9M69o35r17R22J94m8o15K01J50q75R20M21R27r58l4n56P37J34l0
$$ 604 47 126 595 -40 -957 -35 159 111 -504 -303 -153 -1028 -108 313 1240 282 248 -308 429 563 533
4092E33m29n38o02J157Q67j277l41O12M39j78J11r46K03L90j16p90P39J1j39j067
$$ 533 104 -434 -1036 121 988 -289 -630 -18 421 243 354 -592 -389 1 -115 -905 -166 -155 -294 -1361
4112a361R12m77J608m88M61M76j208O94k062J825L45r4j893J788K22j031j75j13
$$ -1361 -449 -926 682 194 655 1131 -77 617 -1445 380 725 631 -1262 526 748 -283 -458 -571
4130e71O32m02n97O16N22N6l6m31j72Q07k71r35N13l7K22J666j984J127j215M27
$$ -571 61 -341 -938 -322 200 256 220 -211 -383 424 153 -782 -269 -306 -84 1582 -402 725 -490 -63
4150f3l8J08L85m46M84O4M11j182k7L27k2j58M23j377J393M27q85J24j316J497
$$ -63 -101 7 392 -54 430 494 905 -277 -304 23 1 -157 266 -1111 282 709 -176 -52 -1368 129
4170A29K36m82M28j308J311m52J033O72r51p02L8m11J348n58J648j677j798J161
$$ 129 365 -117 311 -997 314 -138 895 1567 616 -86 -48 -459 889 331 1979 302 -1496 -335
4188c35J464o38M16j150K16K48q60J99M65J014J75k014J675k38k0Q39k405K323
$$ -335 1129 491 907 -243 -27 221 -639 -440 25 1039 1214 -800 875 637 617 1456 -949 1374
4206A374j189j282J356J01n00J70j53N67P10k119j74J791r70N78j163J037Q66
$$ 1374 185 -1097 259 360 -140 30 -123 444 1154 -965 -1139 652 -318 260 -903 134 1000
4223A000o96p05q51Q14J42J851k516P4k52J427l4N46N04j163K16j23m44J242j045
$$ 1000 304 -401 -1252 -438 -296 1555 -961 -887 -1139 288 254 800 1304 141 357 234 -210 1032 -13
4242a3J065k338Q04R35l42J81j221R40k08O81N8j401J67N26K35l71J57J266j419
$$ -13 1052 -1286 -482 453 111 292 -929 11 -197 484 542 -859 -692 -166 69 -302 -145 1121 -298
4261b98M93P54o02p13n08j62Q40j48R43j315k37J157K04q52N69r40J054J802j662
$$ -298 195 949 347 -366 -874 -1036 -196 -344 599 -716 -953 204 408 -444 125 -815 239 2041 379
4280C79q43j064O21J192m55M2K42j142j80J375P36j263J09M47n63K15J930k030
$$ 379 -464 -1528 -907 285 -170 -128 114 -1028 -1208 167 903 -360 -251 196 -367 -152 1778 -252
4298b52n00Q80M98Q35j074r02k1K130j842O34O57J36j490O02k56L88m35j610K180
$$ -252 -752 128 626 1461 387 -515 -536 1594 -248 386 1043 1179 -311 291 35 423 -12 -1622 558
4317E58O5j57j131J637P1j440L90R1P95%j450P58K25j91k63l69J397m16j557J316
$$ 558 623 466 -665 972 1043 -397 -7 84 879 879 -571 187 412 221 -42 -411 986 570 -987 329
4337C29r3L52l6n3n00o17J604m88o05l96J98P32j429J70P66N59j293J479M39q47
$$ 329 236 588 552 499 -1 -618 986 498 -107 -503 -305 427 -1002 -832 -66 493 -800 679 1118 271
4357B71l20j89J522p79j955K007J261j814n21Q07j70j820J593Q71j16L52Mk117
$$ 271 -49 -238 1284 505 -1450 557 1818 4 -517 290 120 -1700 -107 764 648 1000 1004 -1113
4375a113O31Q21K45k25l90k82N66k41k41o47J046q72n69J544j29K4k174K491M50
$$ -1113 -482 339 584 359 -31 -313 253 12 -229 -876 170 -702 -1271 273 144 168 -2006 485 935
4394I35j160j7M37K04j527J873p58R34L33j543R07k74J78j671J188l10M58r16
$$ 935 -225 -242 195 399 -1128 745 -13 921 1254 -289 618 344 522 -1149 39 -271 187 -729
4412g29n29N91o08P51Q08q85J379p57k35j74O06q89M14m10R62K18j16l71P72j387
$$ -729 -1258 -667 -1275 -524 284 -601 778 21 -214 -388 218 -671 -257 -667 295 513 397 26 798 -589
4432e89O93P41j379m56J587o02r88J761j291l34J720q78j7j169R22m40Q98n77
$$ -589 104 845 -534 -990 597 -5 -993 768 -523 -857 863 -15 -32 -1201 -279 -719 179 -398
4450c98K41j050J409N11M90j559L39J26j22j05M43P51j958J541n15n99n08J711
$$ -398 -157 -1207 202 713 1203 -356 -17 109 -13 -118 325 1076 -882 659 144 -455 -963 748
4468G48j478R7K25O70j205R49n36R26p50P63Q39o56q44j80J101O9j609J66N21
$$ 748 -730 -633 -408 262 -943 6 -530 396 -354 409 1248 592 -252 -432 669 738 -871 -705 -184
4487a84K030j298j444O04J084m1p06N29M03J30j009o31K82J112l60n6q36q53Q89
$$ -184 1846 548 -896 -292 792 751 45 574 977 1107 98 -533 -251 861 501 445 -391 -1244 -355
4506c55O25j402R52j488J783J228j673k25L40n52J073k87q27L00O42m55J92J626
$$ -355 270 -1132 -180 -1668 115 1343 -330 -555 -215 -767 306 19 -808 -508 134 -321 -129 1497
4524A497j727q8J678j723M93j318L20P32k73J88k14P93r15Q66N74p60N48l53k63
$$ 1497 -230 -318 1360 -363 130 -1188 -868 -136 -409 -221 -435 358 -557 309 883 123 671 318 55
4543E5J201k652J782J5j128J013Q01j761K3J295J75j071O18J058J49j865J141
$$ 55 1256 -1396 386 401 -727 286 1087 -674 -651 644 819 -252 366 1424 1573 -292 849
4560H49r27q09M29R40q55O39M4n59R77k92j23p5j518R70R99p17M87q07K69l32
$$ 849 -78 -887 -458 482 -373 266 310 -249 728 436 313 238 -1280 -310 689 -28 459 -348 -79 -411
4580d11J13j104J900o36J428j920J971j977J838j530J19Q19n6J20j560J83p33
$$ -411 -298 -1402 498 -138 1290 -630 1341 -636 1202 -328 -209 610 554 674 -886 -703 -1436
4597a436K265L8r09K80m32q9Q93o23K67j353P96P33p75O0J426j863Q45K49l91
$$ -1436 829 867 -42 238 -194 -283 610 -13 254 -1099 -303 430 -345 -285 1141 -722 123 372 -19
4616a9J95q30m00J690m01K85n70K70m61P98r73j69O6p69j84J100N87l4j427J963
$$ -19 176 -654 -1054 636 235 520 -50 220 -241 557 -416 -585 -519 -1288 -1472 -372 215 181 -1246 717
4636G17j543L68j58L10L12l49P53l1j900N93J659J44m11n19m31K28Q81j414Q20
$$ 717 -826 -458 -616 -306 6 -343 410 379 -1521 -928 731 875 464 -55 -486 -258 623 -791 29
4655B9m95K16O94pJ42J21q9k197J465j43J2p9K3N74r54J783O0r23j123J360n83
$$ 29 -466 -250 444 437 579 700 611 -1586 -121 -264 -252 -331 -308 266 -688 1095 1155 232 -891 469 -114
4676a14p00pJ942j750J031l60m11o57P5J246M98j155M37J281j611J635k063L73
$$ -114 -814 -821 1121 -629 402 42 -369 -1026 -951 295 793 -362 75 1356 -255 1380 -683 -310
4694c10M02p3j4l41N33k22k21p19J273l86l73P03j044J143p76K8M11N7J25j145
$$ -310 92 19 5 -336 197 -25 -246 -965 308 -78 -451 252 -792 351 -425 -397 14 71 196 -949
4714i49P84j7M51n15M38N83p85L14n47N16Q1n44L54j13n5P89o83j042L17P91K70
$$ -949 -165 -182 269 -246 192 775 -10 304 -243 273 354 -190 164 51 -4 785 102 -940 -623 168 438
4735D38j09m82L52p33K41J943j734J610j013l65k77J16m43l57P20n30R51j91o45
$$ 438 329 -153 199 -534 -293 1650 -84 1526 513 148 -129 -13 -456 -813 -93 -623 328 137 -508
4754e08O79P0o74K92J066k19m36j430J233j36M64k25M88o66Q07o21p96O76j42
$$ -508 171 241 -433 -141 925 706 270 -1160 73 -63 401 176 664 -2 805 184 -612 64 -78
4773g8J57nn75P97p19r38P35L66R4K03k23O3L40o32R19o77q1L59o08O28m96P23
$$ -78 79 74 -501 296 -423 -1361 -626 -260 -166 37 -186 -123 217 -415 504 -173 -254 105 -503 125 -371 352
4795C52N75q04N45j8o58K34j00k32J39N6O96j138n5O28Q75j584Q64j52j226K85
$$ 352 927 123 668 650 -8 226 126 -106 33 89 785 -353 -408 220 1095 -489 375 223 -1003 -718
4815g18O4J001j136N32k25k85K93r28O79j4K60M28p16P39k8l73N81q16N75M68
$$ -718 -654 347 -789 -257 -482 -767 -474 -1402 -723 -737 -477 -49 -765 -26 -54 -427 154 -662 -87 381
4835C81r33P42j446J563m5O59L26k44p54j142K091k959K039J55l07J83Q62j919
$$ 381 -552 190 -1256 307 262 921 1247 1003 249 -893 1198 -1761 278 433 126 309 1171 -748
4853g48k07J603j470L09J045m57o76R09j97L67K68j378J338p43K03Q56q64j024
$$ -748 -955 648 -822 -513 532 75 -601 308 111 478 746 -632 706 -37 166 1022 158 -866
4871h66J926r80k09j84l94p2M00J75m08J291q66q44R23K64K29l73m12Q74j676
$$ -866 1060 80 -129 -313 -707 -779 -379 -204 -612 679 -187 -1031 -108 156 385 12 -400 474 -1202
4890a202R34J2J055o75p69J169p4o94J61l90N78n01R41j107P32j197J335K5p95
$$ -1202 -268 -256 799 124 -645 524 450 -244 -83 -473 105 -396 545 -562 170 -1027 308 333 -462
4909d62N82N26q85q19J009L98K67j439J666p07Q06j804J861j491N12k09j048R31
$$ -462 120 646 -239 -1058 -49 349 616 -823 843 136 942 -862 999 -492 20 -189 -1237 -306
4927c06J462p34r6j80q40N06J047k24j76j325M87M49o55R75j59M79j402J646p63
$$ -306 1156 422 326 146 -694 -188 859 635 459 -866 -379 70 -585 390 231 710 -692 954 191
4946A91r22O00L78L45k87J107j479J456k000Q4J027j28j15R08k64j233n88O31
$$ 191 -731 -131 247 592 305 1412 -67 1389 -611 -527 500 372 257 1165 901 -332 -920 -289
4964b89o17K011j34j550M76q93J594L38q05J03l95j289J948m77K32m29j4J509
$$ -289 -906 1105 971 -579 -103 -996 598 936 131 234 -161 -1450 498 21 253 -176 -190 1319
4982A319n60j274K35n42J339j773k68J785j095N71J271j141k81K82k77J402n08
$$ 1319 759 -515 -280 -822 517 -1256 -1524 261 -834 -263 1008 -133 -414 -132 -409 993 485
4999D85j49j822K56J052O64o90p52J817q12M16l59n24J716j485Q41O1j812J347
$$ 485 336 -1486 -1230 -178 486 -204 -956 861 49 465 106 -418 1298 -187 654 715 -1097 250
5017B50k87m90l29P52O47j445J112R06q09R96j181L94p41m10M52n68R62R4J80
$$ 250 -37 -527 -856 -104 543 -902 210 1116 307 1303 122 516 -225 -635 -183 -751 211 305 485
5036D85j848J462j98N0j224M9J152n09J510m45J09j138N71O35j61m32J02J311
$$ 485 -1363 99 -99 -49 -1273 -1224 -72 -581 929 484 593 -545 26 661 500 68 170 1481
5054A481k408J424l70j251J305Q4n21J228o36q05J354l32R80j680o2j68J251k64
$$ 1481 -927 497 127 -1124 181 265 -256 972 336 -469 885 553 1533 -147 -209 -377 874 610
5072F10n04j58J47L92k320P53J094R58j264r49J040Q18m66n14L14j94J69Pj68
$$ 610 106 -52 95 487 -1833 -1080 14 972 -292 -1241 -201 617 151 -363 -49 -243 -74 -67 -235
5091b35O65m51q74K62M94Q4M0Q08p54l77L59j70K47m66J89P52j669J531q62L41
$$ -235 430 -21 -895 -633 -139 -55 -15 793 39 -338 21 -149 98 -368 -179 573 -1096 435 -427 -86
5111h6J45j17o24M99L70j122J428J26l22j131M27J103j171j46N39o52K37O53q90
$$ -86 59 -58 -682 -183 187 -935 493 619 297 -834 -407 696 -475 -621 -82 -734 -497 156 -734
5130g34J395j159M21k30l34J109p94K03n72O57o13J97M55l41l00J188l48o12J248
$$ -734 661 -498 -77 -307 -641 468 -326 -123 -695 -38 -651 -454 1 -340 -640 548 200 -412 836
5149H36j025j23q13J467k27j023N21l21N35J191j471k40J688r23L30r10Q06J229
$$ 836 -189 -312 -1125 342 115 -908 -387 -708 -173 1018 -453 -693 995 72 402 -508 298 1527
5167A527j812j054J455n93K20P97r31K99L39p39m6M09j292Q87M08k50k0l88J93
$$ 1527 -285 -1339 116 -477 -257 540 -391 -92 247 -492 -538 -129 -1421 -534 -126 -376 -396 -784 -591
5186e91J172L1r3k251K840j314n93J514o89L80r56l7J238m71L57l16J16p91J172
$$ -591 581 612 519 -1732 1108 -206 -799 715 26 406 -550 -587 651 180 537 221 337 -454 718
5205G18q69l23N79j82l07N96P53j385J026j027O67P87q16p9j261P72N69J81R08
$$ 718 -151 -474 105 -77 -384 212 965 -420 606 -421 246 1033 217 138 -1123 -351 218 399 1307
5224A307j993J450j576o5K159m87j711M23K218j820J46m99J624q78k521K683n65
$$ 1307 -686 764 -812 -877 1282 795 -916 -493 1725 -95 51 -448 1176 298 -2223 460 -105
5241a05J621k051N05m21K125k176J120k87J84R28j708m51K261r04j374L87J11
$$ -105 1516 -535 -30 -451 1674 -502 618 331 515 1443 -265 -716 1545 641 -733 -346 -235
5258b35k46M36J329k832J601N52M13r7n4p84M55o48l18l48N54L16l40p31N49j34
$$ -235 -481 -45 1284 -1548 53 605 1018 921 867 83 538 -110 -428 -776 -222 94 -246 -977 -428 -562
5278e62J403j103M34j080O19N90n40m79J419j159P63o28P73l87O25o70J541k690
$$ -562 841 -262 172 -908 -289 301 -239 -718 701 -458 305 -323 450 63 688 18 1559 -1131
5296a131K52J494q95J167r22rlO22j4J52j065L97N1l60j025R1R94R55j811Q90
$$ -1131 -879 615 -280 887 -35 -44 -47 575 561 713 -352 45 96 -264 -1289 -1198 -204 751 -1060 -170
5316a70p17L05J806k153J518j202P85K3j096J125p2n23K85K8o91J534j110J20
$$ -170 -887 -582 1224 -929 589 -613 172 195 -901 224 152 -371 -86 -58 -749 785 -325 -205
5334b05R76l54q20L16M22n79M35j521K722j710p1J295m75l53K98n57N08o20N25
$$ -205 771 417 -403 -87 335 -244 191 -1330 1392 -318 -389 906 431 78 376 -181 327 -293 232
5353B32r23R31q60L48Q69j297M20P64j35K03j075J562j412k18O72N33o57N44J42
$$ 232 -691 240 -620 -272 597 -700 -280 484 349 552 -523 1039 -373 -591 81 614 -43 501 643
5372F43r06N60j82N33p30P2Q10p80n72J159o64K04j56j007J026L04K45M75p21
$$ 643 -263 297 115 648 -82 -10 800 20 -552 607 -57 147 -9 -1016 10 314 559 1034 313
5391C13r6O4k44l11N71n97K77J76p20O3K30J501j984M52J97K03R33r59j246J310
$$ 313 217 281 37 -274 297 -300 -23 153 -567 -504 -274 1227 -757 -305 -108 95 1028 69 -1177 133
5411A33N66j66K54o29k40M37P6K53r77O7O20J39l5K98j938J009PN03M60o24q59
$$ 133 699 533 787 158 -82 355 431 684 -293 -226 394 533 498 796 -1142 -133 -126 377 837 213 -646
5432f46nJ434n37J46j625K463j358n61L80J350j906N0n59J307L41j43j34j151
$$ -646 -651 783 246 392 -1233 1230 -128 -689 -309 1041 -865 -815 -1374 -67 274 131 -3 -1154
5450a154J598J032k057O68J62k36j032J489n52j23J179L30j562L48R6m74j012
$$ -1154 444 1476 -581 87 249 13 -1019 470 -82 -205 974 1304 -258 90 186 -288 -1300
5467a300P70j6Q8K96J274M32k166J520o34N17p90J6n86N98l15K61m73J456j932
$$ -1300 -530 -546 -458 -162 1112 1544 -622 898 264 781 -9 7 -579 19 -296 -35 -508 948 -984
5486i84n8O88M56K65j011R32n49P85r89O17Q31m18l97k44q92L71J001j09j217
$$ -984 -1042 -354 102 367 -644 288 -261 524 -465 152 983 565 168 -76 -968 -597 404 295 -922
5505i22l05P98N08j442J982o01m34N72J162o88r3l52j410K121n38j011P90j071
$$ -922 -1227 -429 79 -1363 619 18 -416 156 1318 630 537 185 -1225 896 358 -653 137 -934
5523i34J122r12J08J954q01o57k77p69K123p80j236J31M86k27M67n26L92Q01q61
$$ -934 188 -724 -616 1338 537 -120 -397 -1166 957 177 -1059 -928 -442 -669 -202 -728 -336 465 -396
5542c96q09K926j352j007J042p06M83Lm19o17J470j261N83p1q7l9r5M68r74J073
$$ -396 -1205 1721 369 -638 404 -302 181 184 -235 -852 618 -643 -60 -131 -218 -257 -352 116 -858 215
5562B15m48n74l61P80Q03j99J18J300o99o92O19j171J407j326Q53k804K854j239
$$ 215 -233 -807 -1168 -388 415 216 334 1634 935 243 862 -309 1098 -228 625 -2179 675 -564
5580e64k1l64J526m24o06M9J526j050n72J417o92j19p58R23n18P20j92o30j01
$$ -564 -585 -949 577 153 -453 -404 1122 72 -500 917 225 106 -652 271 -247 473 281 -349 -450
5599d50j22J042J26r02k5L69j334P00P98r48K01N24r8j92q9N81l39J25N29Q17
$$ -450 -572 470 596 -306 -331 38 -1296 -596 202 -746 -545 -21 -119 -311 -400 181 -158 -33 496 1313
5619A313j575J28o42J266N58l49j389J385n27m86o59K67J502o44O0n00Q5Q57j015
$$ 1313 -262 -134 -776 490 1048 699 -690 695 168 -318 -977 -710 792 148 208 -292 -207 650 -365
5638c65R93j345R87j088O20J94M81Q48j522N68n59J63n93j20P64l04m65P10m30
$$ -365 628 -717 270 -818 -198 -4 477 1325 -197 371 -188 -25 -618 -738 26 -278 -743 -33 -463
5657d63K7M54K88m97M75k2J83l8p53j40MM57q42J850k159J399r53o07J289R12
$$ -463 -436 18 306 -191 284 262 445 407 -346 -486 -482 -25 -867 983 -1176 223 -730 -1337 -48 864
5677H64k18n29M06Ko91L62O83j674J424j461J187M79p32k82O12r15j91J551j67
$$ 864 646 117 523 525 -166 196 879 -795 629 -832 355 834 102 -180 432 -483 -674 877 710
5696G10q8o10j286J193j54n16J051n31P74q04j160J592J152j073j532J528l6q75
$$ 710 622 12 -1274 -81 -235 -751 300 -231 543 -261 -1421 171 1323 250 -1282 246 210 -665
5714f65J045r35L90J359k923K007m37j077K360j603P43l27m3J181n17O53j656
$$ -665 380 -555 -165 1194 -1729 278 -159 -1236 1124 -479 264 -63 -106 1075 558 1211 -445
5731d45R94L95l06J19o85q73O20L02Q82j890k29J432r9p20r78K346r45J062j231
$$ -445 549 944 638 757 72 -801 -181 121 1003 -887 -1116 316 217 -503 -1481 865 -80 982 -249
5750b49J314q0q98o45J542j193k28O81o08j89o5k90K348k459O97J080r11K62P12
$$ -249 1065 985 87 -558 984 -209 -437 244 -364 -553 -618 -908 1440 -1019 -322 758 -153 109 821
5769H21q91P95j458Q19j051p74K240j395R45j200K201O50j882K47J577o14j895
$$ 821 -70 725 -733 86 -965 -1739 501 -894 51 -1149 1052 1702 -180 67 1644 1030 -865
5786h65K289k463K115j031K36O34p24j121N92J743j831J468j35j771l2K84J884
$$ -865 1424 -1039 1076 45 281 915 191 -930 -338 1405 -426 1042 907 -864 -896 -612 1272
5803A272k504Q49k03J210j436J346o17j0O07N95j225M61o78N65K016k329K25K79
$$ 1272 -1232 -383 -586 624 -812 534 -83 -93 514 1109 -116 345 -333 232 2248 -81 144 423
5821D23m91j709L128K12j464p48R19O40p57j85l03j192L041k748K47R72J375k881
$$ 423 -68 -1777 1351 1563 99 -649 270 910 153 -32 -335 -1527 1514 -1234 -987 -15 1360 -1521
5839a521J238J63j934J559J018J59j434J541j287K00N65q24o5K625j353o43j299
$$ -1521 -283 -120 -2054 -495 523 682 -752 789 -498 -298 267 -557 -622 2003 650 7 -1292
5856a292L5J168r1q65J870k165K423n00j213J749j005j14j64N60m82O81j293r55
$$ -1292 -1257 -89 -180 -1045 825 -1340 1083 583 -630 1119 114 0 -164 396 -86 595 -698 -1653
5874a653L49J970j037m68J611K1q41R53j326m13j7K063Q19j915l3R0L41K93k239
$$ -1653 -1304 666 -371 -839 772 793 -48 905 -421 -834 -851 1212 2031 116 83 173 514 807 -1432
5893a432r9K310j017m6J501j657M85j171J271N62j109Q74n6J283k246P34r2Q47
$$ -1432 -1531 779 -238 -284 1217 -440 45 -1126 145 707 -402 472 416 1699 -547 187 95 942
5911I42p2k076j78M90P96j01P79j263J877k920J168J7j139K408j216Q26R20l3
$$ 942 870 -1206 -1384 -894 -98 -199 580 -683 1194 -1726 -558 -541 -1680 728 -488 338 1258 1225
5929A225j041o39j31J376j565q17K384q07M7m24J407M20j654J634j553j94J45
$$ 1225 184 -455 -586 790 -775 -1592 792 -15 32 -392 1015 1435 -219 1415 -138 -332 -187
5946a87Q0p21N96Q66o19r15N48N0n45M76J090k25p59K47O51q2j740K596j583j70
$$ -187 -107 -828 -232 634 15 -900 -352 -302 -847 -371 719 494 -265 -18 633 551 -1189 1407 -176 -346
5966c46l27K275j786k92l24l55J187l29m89J124j057J277q88M94m23L18j072J014
$$ -346 -673 1602 -184 -476 -800 -1155 32 -297 -786 338 -719 558 -330 164 -259 59 -1013 1
5984Al55J08q6Q83n76l25R45J207k654J268m43J461j715l51N27n09o46J070J356
$$ 1 -354 -246 -332 551 -25 -350 595 1802 -852 416 -27 1434 -281 -632 -105 -614 -1260 -190 1166
6003A166l33r23o71J75J434l37J71j849j030J984N49j13J96q45q1J197k49j431
$$ 1166 833 -90 -761 -586 848 511 682 -1167 -2197 -213 336 223 419 -426 -507 690 441 -990
6021i90L74O22N93k29p16q01N76O79p50J317r0k7J63j0j61P33n24L5j620o3M17
$$ -990 -616 6 599 370 -346 -1147 -571 108 -642 675 585 558 721 711 550 1283 759 794 -826 -889 -472
6042d72J026n82L67J204j321j529J045K04m04J246k099P98L16r6N64j037M42K03
$$ -472 554 -28 339 1543 222 -1307 -262 -58 -462 784 -1315 -517 -201 -297 267 -770 -328 -125
6060a25j342K278P29q62j051j58J622j948N79N51q45J47p7l84M62J330j774J545
$$ -125 -1467 811 1540 678 -373 -531 1091 -857 -278 273 -572 -425 -502 -886 -424 906 -868 677
6078F77k8j305J473r53p79L95k32N91j16J175Q16k499L24P44j360N60M43Q72j007
$$ 677 649 -656 817 -136 -915 -520 -752 -161 -277 898 1714 -785 -461 283 -1077 -517 -74 798 -209
6097b09J372j101K67M52k88m23K02n03J419n29q97K082j323j19P04j772L13M93
$$ -209 1163 62 329 781 493 70 272 -231 1188 659 -238 1844 521 402 1106 -666 -353 140
6115A40m6J07J29r08M49R06p27J114j706Q28j294Q71o09Q11Q9J218k072J90n56
$$ 140 94 201 330 -578 -129 777 50 1164 -542 286 -1008 -137 -746 65 154 1372 -700 -510 -1066
6134a066P57j194J834k01q98K678k19l254K443j608M52P92j325J372p39R13r87
$$ -1066 -309 -1503 331 130 -768 1910 1691 -1563 880 -728 -276 516 -809 563 -176 737 -250
6151b50O20q17n46Q97N85p64q1r80K432q56p4l75M32k87l18p08J722j176L17L03
$$ -250 370 -447 -993 -96 489 -275 -356 -1336 1096 240 166 -209 223 -64 -382 -1090 632 -544 -227 76
6171G6K22o11j2q71K171o80k40M65J8o48j19M61p40J953j712j621J702O74o46
$$ 76 298 -313 -325 -1196 975 295 55 520 538 -110 -229 232 -508 1445 -267 -1888 -186 488 -158
6190a58m90o17J857j630l11K347j166j168K672o43p78l5K241k074M91k11j400
$$ -158 -648 -1265 592 -1038 -1349 998 -168 -1336 1336 693 -85 -120 2121 47 538 327 -1073
6207a073J746j670N72n0J499k212R63K82J178m14j438J025l78j282J670j55o62
$$ -1073 673 -997 -425 -475 1024 -1188 -225 57 1235 821 -617 408 30 -1252 418 263 -399
6224c99l53J375p97R13k46o39J163Q1j354o0R76j203P16J404j697o93Q80j95O87
$$ -399 -752 623 -174 739 493 -146 1017 1098 -256 -316 660 -543 173 1577 -120 -813 67 -128 559
6243E59O9j114k78K374j635p12P33k7L07O23q30j91p85N50R59j993P21P29K46
$$ 559 628 -486 -764 1610 -25 -737 -4 -31 276 899 69 -122 -907 -357 602 -1391 -670 59 305
6262C05q41J195q03Q88n42J02k96Q0K33N36r64j046L78J360K47m84m34O38K33
$$ 305 -536 659 -144 744 202 304 8 88 321 857 -107 -1153 -775 585 832 348 -86 552 785
6281G85n80j280k37J012k46k73J180m44n26J70m24J565k53J22l42r19O16L19q00
$$ 785 205 -1075 -1312 -300 -546 -819 361 -83 -609 -439 -863 702 449 571 229 -690 -74 245 -555
6300e55J69K064j334j023R69k288J593Q56m09P61r35O4n22q51J705j157J372j20
$$ -555 -386 1678 344 -679 290 -1998 -405 451 42 803 -132 -68 -590 -1441 264 -893 479 359
6318C59M27N1j923J067L49j34m08J131J20j48l13k094K806j777r6N01J17K43j282
$$ 359 786 837 -1086 -19 330 196 -212 919 1039 891 578 -1516 1290 -487 -583 -82 35 278 -1004
6337a004J82N1N26J000n46n02R57J10j420L13o44j20J561m55J446k348J377m92
$$ -1004 -822 -771 -245 755 209 -293 664 774 -646 -333 -977 -1097 464 9 1455 -893 484 -8
6355hl06K26n29P01l33N65P9j047M48R60l78N06j445Q98J081k73j616n9n60J640
$$ -8 -314 -88 -617 84 -249 316 395 -652 -204 756 378 884 -561 337 1418 1145 -471 -530 -1090 550
6375E50k86q44P11R58o75n84N25r64O11N20P39k431L10O41j06R46m36q73l79J208
$$ 550 264 -580 131 1089 414 -170 355 -609 2 522 1261 -1170 -860 -219 -325 621 185 -688 -1067 141
6395A41J81p98R01J280q96j522P43j084k0L93O52j86L01m34R34o36j49m9J265
$$ 141 322 -476 425 1705 809 -713 30 -1054 -1074 -681 -29 -215 86 -348 586 -50 -199 -248 1017
6414A017q42L19j031L55P74j753J264o53J921j302j068O89K09o23J292j274L15
$$ 1017 175 494 -537 -182 592 -1161 103 -550 1371 69 -999 -310 -101 -724 568 -706 -391
6431c91L9l49J011m0J551j152P0J093k453J187l82j228M21M8k56Q92m4JR3j302
$$ -391 -352 -701 310 270 1821 669 739 1832 -621 566 184 -1044 -623 -575 -831 61 17 18 111 -1191
6451a191J222O86j425Q69J03l38j322K413j854L74N66O7o75n38K284j788J39m76
$$ -1191 31 717 -708 161 264 -74 -1396 1017 -837 -463 103 170 -505 -1043 1241 -547 -408 -884
6469h84J929j032N54N5k98J76j088K59J888o59j853K286j47j372j249K217k113
$$ -884 1045 13 567 622 324 500 -588 -329 1559 900 -953 1333 1186 -186 -1435 782 -1331
6486a331K632j44m81m62j562N80m18k05J979j535R42O65j10L59k202K219j273
$$ -1331 1301 1157 676 214 -1348 -768 -1186 -1391 588 -947 -5 660 550 909 -1293 926 -347
6503c47L04J45j73j155J047J659j617J348j000P22o02j521R87J20j121R86j10
$$ -347 -43 102 -71 -1226 -179 1480 -137 1211 211 933 331 -1190 -203 -83 -1204 -218 -328
6520c28O71m36o96Q86J153j253k73R86m70m55N2p97J267j096J381j931q8O14j27
$$ -328 343 -93 -789 97 1250 -3 -276 710 240 -215 -163 -960 307 -789 592 -1339 -1427 -813 -940
6539i40J132k85L32m71J635m71p48m78O10j338J984m62l61j045P40j25J4K97k31
$$ -940 192 -93 239 -232 1403 932 184 -294 316 -1022 962 500 139 -906 -166 -291 -277 20 -211
6558b11Q04j79M78q68k7l33J274l69r50P14r49K093m52j740R38n79M21j17L63
$$ -211 593 414 892 24 -3 -336 938 569 -381 333 -616 1477 1025 -715 223 -356 65 -52 311
6577C11M92j304J194j43j046Q01o46O59J94j305R26O63j354l15J927l19o0j31
$$ 311 803 -501 693 550 -496 305 -341 318 512 -793 133 796 -558 -873 1054 735 675 544
6595E44J99j915J237j62K6J502j640P69o14l01L81Oj75o28Q52j7M78j151K58n3
$$ 544 743 -1172 65 -97 -71 1431 -209 560 -54 -355 26 32 -143 -771 81 64 542 -609 -351 -404
6615d04O33n93J554k327Q50L47o82K96o03J829J78j314N3K67m67J80j05j6n09
$$ -404 229 -364 1190 -1137 -287 60 -622 -326 -929 900 1078 -236 -183 84 -383 -203 -308 -324 -833
6634h33J250p40P90M80Q60j389P59m81k92N94j416n20J139r41J19P05j314O76
$$ -833 417 -323 467 947 1807 418 1177 696 404 998 -418 -938 201 -740 -621 84 -1230 -554
6652e54R86l21M5O61m15q84Q54l41N99j96l22L10J02j690R41N96J52k9O03j555
$$ -554 432 111 156 817 402 -482 372 31 630 434 112 422 524 -1166 -225 371 523 494 1097 -458
6672d58J025j121J557r18l08O09p72k84N89q75J091J68P97j497Q46o57j08J265
$$ -458 567 -554 1003 85 -223 386 -386 -670 -81 -956 135 303 1100 -397 449 -208 -316 949
6690I49m8j750J105K3K06o90n52M08J239J81j903j43J647j654J193J05n11m86
$$ 949 901 -849 256 279 485 -205 -757 -349 890 1071 -832 -975 672 -982 211 316 -195 -681
6708f81J31K95J863j669m24L74P39j135L51J868j084j175K34J308k224J479r56
$$ -681 -550 -255 1608 -61 -485 -111 628 -507 -156 1712 628 -547 -313 995 -1229 250 -706
6725g06J159n93l77K98l34k62N39O65N11j040Q81l06l50p29J334j765J871R08
$$ -706 453 -140 -517 -219 -553 -815 -276 389 900 -140 741 435 85 -644 690 -1075 796 1704
6743A704j496j96o28L51l95J346l82J85q28Q51K25n85Lj101R07j13M51J64N86
$$ 1704 208 12 -616 -265 -660 686 304 489 -339 512 737 152 155 -946 -39 -152 299 463 1049
6762A049j000q98Q4M53M35p36k48R5R15j79j125O83J304l65n71q31q84J834P94
$$ 1049 49 -849 -765 -312 123 -613 -861 -766 149 -30 -1155 -472 832 467 -104 -935 -1819 15 809
6781H09k308J295p1p30O72P67q97J68p44o82R45J117l51k48O68j005o91J881J78
$$ 809 -1499 -204 -275 -1005 -333 434 -463 -295 -1039 -1721 -776 341 -10 -258 410 -595 -1286 595 773
6800G73j92M64j712M66M62n78K99Q67j156N33K31r4Q33k913Q91l13J044J022j93
$$ 773 581 1045 -667 -201 261 -317 -18 849 -307 226 457 363 1196 -1717 -826 -1139 -95 927 734
6819G34j115j38J067j36q61M84L08l97k72K5K15K63P43r26N68o14j29J7N57o63
$$ 734 -381 -519 548 412 -449 35 343 -54 -326 -301 -86 177 920 -6 562 -52 -181 -164 393 -270
6839b70K39J685k269r14K104R2m51l77M06M66q8j99q75M87p99N41N86O45r15p24
$$ -270 -31 1654 -615 -1529 575 667 216 -161 245 711 623 424 -451 36 -763 -222 364 1009 94 -630
6859f30L51M66r62J092q45k72J710r6j055q52J451n01m04j82J11J542r38O99j221
$$ -630 -279 187 -775 317 -528 -800 910 814 -241 -1093 358 -143 -547 -729 -618 924 -14 685 -536
6878e36j74M50r8K061j702m88K09l03K238p09j050m98M67p81J418K10P16k033
$$ -536 -710 -260 -358 1703 1 -487 -278 -581 1657 948 -102 -600 -133 -914 504 714 1430 -603
6896f03Q60l98J53p25k40J152r82J709p60j93N58n09j183K53L77P61P9m58j002
$$ -603 257 -141 12 -713 -953 199 -783 926 166 -27 531 22 -1161 -908 -531 230 309 -149 -1151
6915a151J633L87L16m17j145O08L15l52j688L78K433j138m3q2q59R02o22O46M82
$$ -1151 482 869 1185 768 -377 231 546 194 -1494 -1116 1317 179 136 54 -805 97 -525 121 603
6934F03j930J897J32r76L10n68P18j38M28L08o97M15K78p36K17j183J563r05J989
$$ 603 -1327 570 702 -274 36 -532 186 48 476 784 87 502 780 44 261 -922 641 -264 1725
6953A725j535J081j702j69P32J90o20J659j564j172K452r45J39n14J454p53K75
$$ 1725 190 1271 -431 -600 132 322 -298 1361 -203 -1375 1077 132 271 -243 1211 458 733
6970G33j260J548q08o52N39J904j143j128Q81L55q67K89J89L27k267J040Q31o72
$$ 733 -527 1021 213 -439 100 2004 861 -267 614 969 102 391 580 907 -1360 -320 511 -161
6988a61L73n57N10J149J29r85r7p1j822J354R93j102l7N17O75j11m68r13l22K292
$$ -161 212 -345 165 1314 1443 458 361 290 -1532 -178 815 -287 -324 193 868 757 289 -624 -946 1346
7008A346j382p08L77Q51o34J090J41o97j22M16j425o45J722K50j007M75o67n30
$$ 1346 -36 -744 -367 484 -150 940 1081 384 262 678 -747 -1392 330 580 -427 48 -619 -1149
7026a149k83J479M89P1J94k482K233o34K68n74R05j187J447n54p96M05p66J919
$$ -1149 -1432 47 536 607 801 -1681 552 -82 186 -388 517 -670 777 223 -573 -168 -934 985
7044I85l96k05N01r00K85l62m1Rl46J388j050J018k041K617j097j70J34p85M67
$$ 985 589 384 885 -15 270 -92 -133 -124 -470 918 -132 886 -1155 1462 365 195 329 -456 11
7063A1L80q35o73N5N70O77J29N20j112r20N11J159o65L26P87r15q6K77j014L08
$$ 11 391 -444 -1117 -1062 -492 185 314 834 -278 -1198 -687 472 -193 133 920 5 -81 196 -818 -510
7083e10k29J577j336J245R8n58j149J132l51m32J189k105M07J352p0J19N59J77
$$ -510 -739 838 -498 747 845 287 -862 270 -81 -513 676 -1429 -1022 330 260 379 938 1115
7101A115k908K416l41j077l74J09O47Q03k73o16J010J90j103Q21j621J993P27
$$ 1115 -1793 623 282 -795 -1169 -1060 -413 390 117 -499 511 701 -402 419 -1202 791 1518
7118A518q78J223k516P31L52j894K670j929Q26O9j571J351R79Q48n96r75n25J212
$$ 1518 640 1863 -653 78 430 -1464 1206 -723 103 172 -1399 -48 931 1779 1183 208 -317 895
7136H95j825K229j841J748P22j875J99r74k18J971j594M06K53m37J42Q27n12J303
$$ 895 -930 1299 -542 1206 1928 53 252 -722 -940 1031 -563 -157 96 -341 -199 628 116 1419
7154A419q01j400J083p5p22M7J468j566K553j183j10r11o13M43L25o0k7P80l46
$$ 1419 618 -782 301 226 -496 -449 1019 -547 2006 823 713 -198 -811 -368 -43 -103 -130 650 304
7173C04N64l45r84l83R38K61M74l68L22M5o18n13J871j572m00Q80j021Q8r36J554
$$ 304 868 523 -461 -844 94 355 829 461 783 828 210 -303 1568 -4 -404 476 -545 -457 -1393 161
7193A61m16Q78N80j773J136L24J362k853O77o92n8J218l77j21m48J895j117n88
$$ 161 -255 623 1203 -570 566 890 2252 -601 76 -616 -674 544 167 46 -402 1493 376 -212
7211b12J069J55j001o83K30R07j199j28J768r68L44j77j621O93J41J872k05p81
$$ -212 857 1012 11 -672 -442 465 -734 -862 906 -62 282 105 -1516 -823 -682 1190 985 204
7229B04j20J281j298O48r04l48J665j135q09J498q40j38L95j005J288j642R98
$$ 204 84 1365 67 715 -189 -537 1128 -7 -816 682 -158 -296 99 -906 382 -1260 -262
7246b62m36M47o91O6K12M64j150Q41J105j78k21j111M71M85Q08l64r20o65R18
$$ -262 -698 -251 -942 -876 -664 -200 -1350 -509 596 418 197 -914 -443 42 850 486 -434 -1099 -181
7265a81R53j106M44P18r63j82j370K641k910K120m93O03M38j375L54M31K67L79
$$ -181 772 -334 110 828 -135 -317 -1687 954 -1956 164 -329 274 712 -663 -309 122 389 768
7283G68j25q97q86O34Q2J068j551J941k29o03o21M08J142j227J819k660J258j003
$$ 768 643 -254 -1140 -506 -424 644 -907 1034 805 202 -419 -11 1131 -96 1723 -937 321 -682
7301f82o9L20o52J92M35j03o86p40J840n69J738j957M22m44J504L44j430R48n82
$$ -682 -751 -431 -1083 -891 -456 -559 -1245 -1985 -145 -714 1024 -933 -511 -955 549 893 -537 411 -171
7320a71o79O32l99K83k68j34J30Q17j5j788J584J539l184P66L3K677m68j471j361
$$ -171 -850 -218 -617 -334 -602 -736 -606 211 196 -1592 -8 1531 -1653 -887 -854 1823 1355 -116 -1477
7339a477J27K438n84o30j733J639l39q67m49J015R83M85p00m48J101k948K391
$$ -1477 -1350 1088 504 -126 -1859 -220 -559 -1426 -1875 -860 123 608 -92 -540 561 -2387 4
7356Dk56N13p3O26p15K87j185P62j033j42J088M20l91p86P37K5o37L8J390j30
$$ 4 -252 261 188 814 99 386 -799 -37 -1070 -1212 -124 296 -95 -881 -144 -119 -756 -718 672 542
7376E42j82q83q76L257r49j108j308J341P0m13J59n7N72O21p68n84J798k143K306
$$ 542 360 -523 -1399 1858 909 -199 -1507 -166 -96 -509 -350 -407 165 786 18 -566 1232 -911 1395
7395A395j091p32L38O13L40k066k52J654n92J90N65K22j898J716l37j200j74O18
$$ 1395 304 -428 -90 523 863 -1203 -1455 199 -393 -203 362 584 -1314 402 65 -1135 -1309 -691
7413f91n50R38J509k054L77J143j949K850k361k89J443q72N19J135j131j52J61
$$ -691 -1241 -303 1206 -848 -471 672 -1277 1573 -788 -1077 366 -506 13 1148 17 -135 26
7430B6n29N41j688K039j241l34J553K44j13p17N15o95J130j738J259J025k60j732
$$ 26 -503 38 -1650 389 -852 -1186 367 611 498 -219 296 -399 731 -1007 252 1277 1017 -715
7448g15k55m38J269l0M67J379k207M89j659K271J034p07j947N69r3O70R84PK99
$$ -715 -970 -1408 -139 -169 298 1677 -530 -41 -1700 571 1605 898 -1049 -480 -573 97 1081 1088 1387
7467A387j601l88k18J508l12K32n98m25J057m44k10L23q11Q27l12N00j448J094
$$ 1387 -214 -602 -820 688 376 608 10 -415 642 198 -12 311 -500 327 15 515 -933 161
7485A61O44M99o05j190r5J269j113L04l37K15J578j000Q92n87l1n5j157j00N22
$$ 161 805 1304 699 -491 -586 683 -430 -126 -463 -248 1330 330 1222 635 604 549 -608 -708 -186
7504a86R67k210P13J085j037J32m90P77m04K567k991K127k099K149j735O76l11
$$ -186 781 -1429 -716 369 -668 -536 -1026 -249 -653 1914 -1077 1050 -1049 1100 -635 41 -270
7521b70n74R70o52R32j068K99P95J264j147j369Q45m4L2J135k104K55N87o78O65
$$ -270 -844 126 -526 406 -662 -363 432 1696 549 -820 25 -19 13 1148 -956 -701 -114 -792 -127
7540a27O45o67L41k21m70K80N19l14n55N4l61O33p14J819J29j919p71P76K70N40
$$ -127 518 -149 192 -29 -499 -219 300 -14 -569 -515 -876 -243 -957 862 991 -928 -1699 -923 -653 -113
7560a13O21L39r32J7O09k126K060o0r4l04K03k27r28J111l47P2j148J595O71j622
$$ -113 508 847 -85 -68 541 -1585 475 415 321 17 220 -7 -935 176 -171 -99 -1247 348 1019 -603
7580f03O59o19p89Q98L07N59J199r32j147J118j87P24j778J139o88N77p92j2J321
$$ -603 56 -563 -1352 -454 -147 412 1611 679 -468 650 463 1187 -591 548 -140 437 -355 -367 954
7599I54K5k6o78j892K644K30j394J309p60K7l4N26p98j145J455m69k66P95o72
$$ 954 979 953 275 -1617 1027 1257 -137 1172 412 439 405 931 133 -1012 443 -26 -292 503 -169
7618a69N61j656J38O11R14r97M11L07j383R85l32j01J792j820K311k269L39N19
$$ -169 392 -1264 -1126 -515 399 -598 -187 120 -1263 -278 -610 -711 1081 -739 1572 -697 -358 161
7636A61p80O40P52l04p25J171q69k93k76N37q68O7Q72O26j009j055P83J166j782
$$ 161 -619 21 773 469 -256 915 46 -247 -523 14 -854 -787 85 711 -298 -1353 -570 596 -1186
7655a186R98J212j001N35m19n97R20o62N57n16M45J83n1M38j216M27q0n19p93
$$ -1186 -188 1024 23 558 139 -458 462 -200 357 -159 286 469 418 856 -360 67 -13 -532 -1325
7674a325J862j10j607K742n45k803J832l95K132j503M96j166O7J550j017n16j429
$$ -1325 537 427 -1180 1562 1017 -1786 46 -349 1783 280 776 -390 -323 1227 210 -306 -1735
7691a735L64J801j061o16J447o4K394l043J940j078k07L68l08j621RJ300o26K21
$$ -1735 -1371 430 -631 -1247 200 136 2530 -513 1427 349 142 510 202 -1419 -1410 -110 -736 -515
7709e15N83J424j765o1J250r40Q89j643J999k613K043K5j93m45j180L00J583k89
$$ -515 68 1492 -273 -334 916 -24 865 -778 1221 -1392 651 676 483 38 -1142 -842 741 452
7727D52K29o85j285J168K23k0p37O69O43k587N00J145N55L89K02k384J892r69
$$ 452 681 -4 -1289 -121 102 82 -655 14 657 -1930 -1430 -285 270 659 861 -1523 369 -600
7745f00J313q24J174K90p74Q5r00M21J8o63J016o92K26L96k002L215k11l69p77
$$ -600 713 -111 1063 1353 579 664 -236 185 203 -460 556 -136 90 486 -1516 1699 1488 1119 342
7764C42j035K123j977L34k01J694r72N24n82m25o93J647k42j473Q81N29p6p36
$$ 342 -693 1430 -547 -213 -414 1280 308 832 250 -175 -868 779 537 -936 -55 474 398 -338
7782c38K165l360L384j495n76J614j553M62o01L41k34Kk041N273l220K46q61K58
$$ -338 1827 -1533 1851 356 -220 1394 -159 303 -298 43 -191 -189 -2230 3043 -177 69 -792 -534
7800e34K57O64j071J018L65r86Q2j46j113K451j940J102m06j423K125j412J386
$$ -534 -277 387 -684 334 699 -287 -205 -351 -1464 987 -953 149 -257 -1680 445 -967 419
7817D19r21p52J248R05j355j159J145M55L75m29O56j296J403R7q82o1j320K262
$$ 419 -502 -1254 -6 899 -456 -1615 -470 -15 360 -69 587 -709 694 791 -91 -152 -1472 790
7835G90j185J274l013J867N85j106J613r58n58L90K77p90L3J782j459j34J149
$$ 790 -395 879 -2134 -267 318 -788 825 -133 -691 -301 -24 -814 -781 1001 -458 -592 557
7852E57j215R60R0L58m52r69j88J037j473J284Kj87J47m24j98M02j81L45N61J78
$$ 557 -658 302 392 750 298 -671 -859 178 -1295 -11 -9 -196 -49 -473 -671 -269 -450 -105 456 634
7872F34J91K03o04r11J202M5k85O0j213J137p43l68R13N80k389J712J200j806
$$ 634 825 1028 424 -487 715 760 475 535 -678 459 -284 -652 261 841 -1548 164 1364 -442
7890d42J094j598J757q73m45n71J592J602j558l09J050j321K42R71q30n0m03m98
$$ -442 652 -946 811 -62 -507 -1078 514 2116 558 249 1299 -22 220 1191 361 311 -92 -590
7908e90o58K627j453n49r80K118Q1m45k9p42J186p40L17m01m66M73J034P5m21
$$ -590 -1248 1379 -74 -623 -1603 515 596 151 122 -620 566 -174 143 -258 -724 -251 783 858 437
7927D37j89N6o98l52O56m71Q22K39K84Kp74L80L6P75j846J101J270j412R19q85
$$ 437 248 304 -394 -746 -90 -561 261 500 784 786 12 392 428 1203 -643 458 1728 316 1235 350
7947C50m88L57p73J042l41j100M81J817l71j003j45J54j730N35J433n32Q40k49
$$ 350 -138 219 -554 488 147 -953 -472 1345 974 -29 -174 -20 -1750 -1215 218 -314 526 277
7965B77O72p59j010M44M73O37j765J020j41K11P28j157O92M29r76M03J82r57K00
$$ 277 949 190 -820 -376 97 734 -1031 -11 -152 59 787 -370 322 751 -225 178 360 -597 -397
7984c97J97L41N48L21j269J059j153R07n71m16j355J033J493p20j313J406p9m06
$$ -397 -200 141 689 1010 -259 800 -353 554 -17 -433 -1788 -755 738 18 -1295 111 32 -374
8002c74L28j233L26K149j307M77J48M50j257K79L53m17k28Q94M2R35k086J475
$$ -374 -46 -1279 -953 1196 -111 366 514 964 -293 -14 339 -78 -306 588 630 1565 -521 954
8020I54L23j224n71J073mj410O60J23N75k83p40R65m81L2L10m19k2j109J179M08
$$ 954 1277 53 -518 555 551 -859 -199 -76 499 216 -524 441 -40 -8 302 -117 -139 -1248 -69 339
8040C39j022J491r57Q38j105O35j262O37L63J225p34oo56J55m72P07K84j727O54
$$ 339 -683 808 -149 689 -416 219 -1043 -406 -43 1182 448 442 -214 -59 -531 176 460 -1267 -613
8059f13O69r7M95j214J063k47k44K39N44q43Q53L93n83l98O48j244k10R27r62
$$ -613 56 -41 454 -760 303 56 -188 51 595 -248 605 998 415 17 665 -579 -789 138 -824
8078h24M51n32J762j189K36M00j2K99j426K1P66p0K51N47j089N22K26j175J801
$$ -824 -373 -905 857 -332 -96 304 292 591 -835 -814 -48 -118 133 680 -409 113 339 -836 965
8097I65j098O84m76K02J11m24J97j421J009R50m38n12n48P08k61q9J234k013J647
$$ 965 -133 551 75 277 388 -36 161 -1260 -251 699 261 -251 -799 -91 -352 -441 793 -1220 427
8116D27K34r58j721J247J248N02q46o91k05l70R60Q72m44K21k0n35R12j259J178
$$ 427 661 -297 -2018 -771 477 979 133 -558 -763 -1133 -173 699 255 476 456 -79 833 -426 752
8135G52j84j0j051p0J342p39k68P27m61o47j37P02M92o54M25Q32j094l7J25M91
$$ 752 568 558 -493 -563 779 40 -228 499 38 -609 -746 -44 448 -206 219 1051 -43 -80 45 536
8155E36j182R03J555j680k43J51J11L0q72J574p06J835j684n39J26o89J464o25
$$ 536 -646 257 1812 132 -111 40 151 181 -691 883 177 2012 328 -211 -85 -774 690 65
8173F5k15o33Q55p00J147n00Q6pJ34M90p87K54q56K74L01L05r58O0
$$ 65 -150 -783 72 -628 519 19 105 98 232 722 -65 189 -667 -393 -92 213 -745 -685
8191f85
$$ Imaginary data points
##PAGE= N=2
##DATA TABLE= (X++(I..I)), XYDATA
0@%%%%%%%Pj5J5j5J9k7L6m3N2o8R0j10J27j53J89k25K63l08L63m28M97n71O58
$$ 0 0 0 0 0 0 0 0 7 -8 7 -8 11 -16 20 -23 29 -39 51 -59 68 -85 104 -121 142 -166 197 -231 266 -305 353
30C53p59Q68r87J119j268J434j615J814k031K269k532K819l132L474l848M257
$$ 353 -406 462 -525 594 -674 760 -855 959 -1072 1197 -1335 1484 -1648 1826 -2022 2235
46B235m703N191n723O306o948P656q435R295j0256J1335j2551J3931j5516J7362
$$ 2235 -2468 2723 -3000 3306 -3642 4014 -4421 4874 -5382 5953 -6598 7333 -8183 9179
60I179j9540K2151k5351K9386l4655M1855n2349O9229j01820K65247q62484J56178
$$ 9179 -10361 11790 -13561 15825 -18830 23025 -29324 39905 -61915 203332 -659152 -502974
72e02974J456651q78535r93548J124647O32285j371707n7385J295214l77583j112241
$$ -502974 953677 75142 -918406 206241 838526 -533181 -590566 704648 327065 -785176
82g85176P79727P30668r49610l61932R98126l0697q80310L05473O92263n14944
$$ -785176 -5449 725219 -224391 -586323 411803 381106 -499204 -193731 498532 -16412
92a6412m11192N55246J79874n04758N419L87776q6560k76946J18958J65873q2706
$$ -16412 -427604 127642 307516 -197242 -191823 195953 109393 -167553 -48595 117278 34572
103C4572j18228J7357J30831K8381k04323j3636K88186o1365l38599J85654L45753
$$ 34572 -83656 -66299 64532 92913 -111410 -125046 163140 101775 -236824 -51170 294583
114B94583l35591k86287N00910J28396o06069R3148O11349l34118n15749N41644
$$ 294583 -41008 -327295 173615 302011 -304058 -210910 400439 66321 -449428 92216
124I2216L39237o97623p9567P53062k12769o78783M85192M85048o69787k20609
$$ 92216 431453 -266170 -345737 407325 194556 -484227 965 486013 -183774 -404383
134d04383P48109p0363p19051L57836N59663n74598l09171O81260K0173o56382
$$ -404383 343726 273363 -445688 -87852 471811 -102787 -411958 269302 289475 -366907
144c66907K45457N28429m46603l23384N60272P3744n65935J70205M60810l56210
$$ -366907 -121450 406979 -39624 -363008 197264 271008 -294927 -124722 336088 -20122
154b0122k84552M53486P7607m58138J20028L83180k79649k38556L69648N8752
$$ -20122 -304674 148812 226419 -231719 -111691 271489 -8160 -246716 122932 181684
164A81684l67021J01600K92631k14636j82906K72250N2133k74503P0098K20000
$$ 181684 -185337 -83737 208894 -5742 -188648 83602 135735 -138768 -68670 151330
174A51330j59837j21012J87950K4505j66161M4450J19844r0290n2698R4887j1999
$$ 151330 -8507 -129519 58431 82936 -83225 -38775 81069 -9221 -61919 32968 20969
185B0969o2319N8282n663n2294O5059O813r6813N7738R8090j31483n7770J96050
$$ 20969 -41350 16932 11269 -41025 24034 30847 -65966 -8228 89862 -41621 -99391 96659
197I6659k6040k26193J41230J96383k49877j12206L22176o394l49282J45989L26251
$$ 96659 70619 -155574 -14344 182039 -67838 -180044 142132 135738 -213544 -67555 258696
208B58696k91841k35479M11811P8776m58062R3269M38270k60178l53449L99642
$$ 258696 -33145 -268624 143187 221963 -236099 -142830 295440 35262 -318187 81455
218H1455K13616m90346k9128N05272j59036m42433L20029L24531m33103j66276
$$ 81455 295071 -195275 -224403 280869 121833 -320600 -571 323960 -109143 -275419
228b75419M85548j0728m71012J80267L87988l09998k58554L78909J18816l95583
$$ -275419 210129 199401 -271611 -91344 296644 -13354 -271908 107001 225817 -169766
238a69766J7022L65556j36488k91523K19201J89518k50952r2878K41596K1181
$$ -169766 -152744 212812 76324 -215199 4002 193520 -57432 -150310 91286 112467
248A12467k17615L2820J80895o5880j41113P7295J09153p2371r9835P0958J08418
$$ 112467 -105148 -72328 108567 42687 -98426 -21131 88022 15651 -84184 -13226 95192
259I5192r2299j10474J24084R9881j62192p7390K06219L1301k46479M4705K61300
$$ 95192 2893 -107581 16503 116384 -45808 -123198 83021 114322 -132157 -87452 173848
270A73848j41566k31232K31656J67216l05688p5074L53168m7086l54915J78851
$$ 173848 32282 -198950 32706 199922 -105766 -180840 172328 125242 -229673 -50822
280e0822L02418k98471j96632L74093O5721m04578Q0279L83631k21635l03754
$$ -50822 251596 -46875 -243507 130586 196307 -208271 -127992 255639 34004 -269750
290b69750L34473J75823l98255k3139L95484j19140l43950K42443K47751l28636
$$ -269750 64723 240546 -157709 -180848 214636 95496 -248454 -6011 241740 -86896
300h6896j16370L58202k0452l30499J38429K61537k22807j67203K68705O2277
$$ -86896 -203266 154936 134484 -196015 -57586 203951 -18856 -186059 82646 144923
310A44923k73350M2579K35655j23447j66385J65561R1224j73504k4795J59757
$$ 144923 -128427 -85848 149807 26360 -140025 25536 116760 -56744 -81539 78218
320G8218k7745j31113O4560Q7552p4755m9329O5185L0385n3847k2969M8287K0603
$$ 78218 50473 -80640 -16080 71472 -3283 -52612 12573 42958 -10889 -33858 14429 35032
332C5032m7147k1422N1036K5613o9356j9346R3600o712j08331M6817J05508q9545
$$ 35032 -12115 -33537 17499 43112 -26244 -45590 48010 41298 -67033 -20216 85292 -4253
344d253q5355J27736M8270j61375Q200J75766p8765j56204J43535J05000j87094
$$ -4253 -89608 38128 86398 -74977 -66777 108989 30224 -125980 17555 122555 -64539
355f4539m0073K08736l4755k07884J19014J66406j87407r3855K24227R943k28118
$$ -64539 -104612 104124 69369 -138515 -19501 146905 -40502 -134357 89870 99813 -128305
366a28305P4165K01889j49801j48415K07775O5131k29414K4188K12797j00509
$$ -128305 -54140 147749 -2052 -150467 57308 122439 -106975 -82787 130010 29501
376B9501j69569J57361J08397j92162l2900J95715l8868j72946R9667J24995j32829
$$ 29501 -140068 17293 125690 -66472 -99372 96343 57475 -115471 -15804 109191 -23638
387b3638p1610J47385J8643j44578L0874J23481o7221q9942Q8877N1534q9929
$$ -23638 -95248 52137 70780 -73798 -42924 80557 13336 -76606 12271 63805 -26124
398b6124k4791Q6391J926p9923K0963O5756l1681n1951L4024M6162l8184m3560
$$ -26124 -50915 35476 37402 -42521 -21558 44198 12517 -39434 -5410 40752 2568 -40992
410d0992M9019L6215o1397k1952O6970J1946p9706P872Q6218l3665q3769O7264
$$ -40992 8027 44242 -17155 -39107 27863 39809 -39897 -32025 54193 20528 -63241 4023
422D023O4819r1767l8439J07608N858j16462L3700J10999p4721r0239J08736N3383
$$ 4023 68842 -22925 -61364 46244 52102 -64360 -30660 80339 5618 -84621 24115 77498
434G7498j29015p811J30661l4636j23364P9982R6776j14263n4856J32259O708
$$ 77498 -51517 -59328 71333 36697 -86667 -6685 90091 -24172 -79028 53231 59939
445E9939j31004L5570J14323p0375r0898J01671N3236j18866r801J16232k9271
$$ 59939 -71065 -35495 78828 8453 -82445 19226 72462 -46404 -56205 60027 30756
456C0756j01237N7997P9449p9169n1450R2328K0351r4998J1509Q3802l4403o6921
$$ 30756 -70481 -12484 66965 -12204 -63654 28674 49025 -45973 -34464 49338 14935 -51986
468e1986M7773N6513o5205l5759P3778J0151o8901O252O5935k0137o2753L7403
$$ -51986 -4213 52300 -12905 -48664 25114 35265 -33636 -27384 38551 18414 -44339 -6936
480f936N2403n3414l6362O4040J7881o6088k055O7849j4013o8218L7491N8526
$$ -6936 45467 -7947 -44309 19731 37612 -28476 -30531 37318 23305 -44913 -7422 51104
492E1104n8298m0740P0331J8758p2900n25P7544k5153p1562N1950N4119o9264
$$ 51104 -7194 -47934 22397 41155 -31745 -32270 45274 20121 -51441 509 54628 -14636
504a4636l1352P8307O485q0799J8033P7103m4602o3314O5764L9426p7001j1340
$$ -14636 -45988 32319 38804 -41995 -23962 53141 8539 -54775 10989 50415 -26586 -37926
516c7926P6356r623p5734L4399O3645n6326m1721O8271J7979p0907L796O7244
$$ -37926 38430 28807 -46927 -12528 51117 -5209 -46930 21341 39320 -31587 -27791 39453
528C9453k4026n8661M2534M4847n8680k2577O2541P6n5965J1906N4533l0771m4118
$$ 39453 15427 -43234 -700 44147 -14533 -37110 25431 25507 -30458 -18552 35981 5210 -38908
541c8908M4591K7827n2182q538N0232l646m7962J5678M4162l0437l4070M1849
$$ -38908 5683 33510 -18672 -27210 23022 19376 -28586 -12908 31254 817 -33253 8596
553H596J8981m5566n106M3647m266m3447J8619L7685l1507k9495M1350J5939m3624
$$ 8596 27577 -17989 -23095 20552 16286 -27161 -8542 29143 -2364 -31859 9491 25430 -18194
566a8194m136M4057p012m2792K1823L6329l4689k4823M2535J0740m2281m98M4699
$$ -18194 -22330 21727 14715 -28077 -6254 30075 -4614 -29437 13098 23838 -18443 -18941 25758
579B5758j4809m1542K9563L0749l8691j6494M2774L208m2193Q496M0735k1337
$$ 25758 10949 -30593 -1030 29719 -8972 -25466 17308 20516 -21677 -13181 27554 6217
591F217l3739L3710K0244l7808q158L8684j669l9823J5654L3126k5158k6129L3638
$$ 6217 -27522 6188 26432 -11376 -19534 19150 17481 -22342 -6688 26438 1280 -24849 8789
604H789J2610l3901l356L4386n805l4107J7619K8095k8266j6837L0502Q342l1182
$$ 8789 21399 -12502 -15858 18528 12723 -21384 -3765 24330 -3936 -20773 9729 18071 -13111
617a3111J382K9699j0563k6938J8686K0598k5943j0743K6260L841k6167K529K6905
$$ -13111 -11729 17970 7407 -19531 -845 19753 -6190 -16933 9327 13168 -12999 -10470 16435
630A6435j1808k3850K0306J4277k1427q295K2533K721k2388J320K3208j0160j8883
$$ 16435 4627 -19223 1083 15360 -6067 -14362 8171 10892 -11496 -10176 13032 2872 -16011
643a6011J6907J2109j8983n679J7226N128k2275M119K0262j0474j5119J3648R545
$$ -16011 896 13005 -5978 -11657 5569 10697 -11578 -7459 12803 2329 -12790 858 10403
656A0403j3687p293J6957J750j8212N160J5904j0448j2027J2203J0112j3288o936
$$ 10403 -3284 -10577 6380 8130 -10082 -4922 10982 534 -11493 710 10822 -2466 -9402
669i402J6822J430j7568M745J4742q945j1185J0817P658j0829n653J4877j305
$$ -9402 7420 8850 -8718 -3973 10769 1824 -9361 1456 9114 -1715 -7368 7509 6204
682F204j3198N081J0918p621q946R863P349j2706m635J4275k257j1323O416P727
$$ 6204 -6994 -1913 9005 1384 -7562 2301 9650 -3056 -7691 6584 4327 -6996 -580 7147
696G147n941q414P889P933j2729j664J2296k114r252L419P272o296n280Q730L746
$$ 7147 1206 -7208 681 8614 -4115 -5779 6517 4403 -4849 -1430 5842 -454 -5734 2996 6742
711F742j0793o69J1015m448p648M723O241n202p210Q132M525j0389P17O832L16
$$ 6742 -4051 -4720 6295 1847 -5801 -1078 5163 -39 -7249 883 5408 -4981 -4264 2568 2884
726B884p650J519R267o649o376Q180K564p082j983P818j64q036L263Q761n329
$$ 2884 -4766 -3247 6020 -629 -7005 1175 3739 -3343 -5326 2492 2328 -5708 -2445 6316 987
741I87q814R430J173n866q83O434K56r476K829J0911o691n379O333L842o881l487
$$ 987 -7827 1603 2776 -3090 -3973 2461 2717 -6759 -3930 6981 290 -5089 1244 5086 -1795 -5282
757e282R568J214j1543M744Q404p764n694Q630J929o344l536J1629q23j1170M741
$$ -5282 4286 5500 -6043 -1299 7105 -659 -6353 2277 4206 -2138 -5674 5955 5132 -6038 -1297
772a297Q264o000o474Q619L370q826l581J3308l515j0696O200P660n819p543Q877
$$ -1297 6967 967 -5507 3112 6482 -2344 -5925 7383 3868 -6828 -628 7032 1213 -6330 2547
787B547M642j0569j619J0187p04j0233M518P456n660q100J0147N347j2021j698
$$ 2547 7189 -3380 -4999 5188 4484 -5749 -1231 6225 565 -7535 2612 7959 -4062 -5760
801e760J2102l092r420K658J0054o765p536Q856N949j2268j871J2141j366j1362
$$ -5760 6342 3250 -6170 -3512 6542 -223 -7759 1097 7046 -5222 -7093 5048 3682 -7680
815g680M950R731p254r560J2464M101j2749p24J2165j217j2265M855J2380j0631
$$ -7680 -2730 7001 -253 -9813 2651 6752 -5997 -6721 5444 4227 -8038 -3183 9197 -1434
829a434q625J3263K225j2861K211J3293n361j1200O603J2006j3800m933J3342
$$ -1434 -10059 3204 5429 -7432 -5221 8072 2711 -8489 -1886 10120 -3680 -8613 4729
842D729J638j1696J186J2836n393j2435J0535Q639j4078k377J3072k376j1276
$$ 4729 6367 -5329 -4143 8693 3300 -9135 1400 10039 -4039 -6416 6656 4280 -6996
855f996L461J2220o624j1120J0766Q310j5296M79J1186p79j2800M530J1862p818
$$ -6996 -3535 8685 2061 -9059 1707 10017 -5279 -4800 6386 5607 -7193 -2663 9199 1381
869A381q922J1720L388j1321j262R343M03j1267M384J2384r063q047J1283K253
$$ 1381 -7541 4179 7567 -3754 -5016 4327 4730 -6537 -2153 10231 1168 -6879 4404 6657
883F657j1401n72J0543k4j3820O449J0920j0147o971J0692N067j2986l31J2528
$$ 6657 -4744 -5316 5227 5203 -8617 -2168 8752 -1395 -8366 2326 7393 -5593 -5924 6604
897F604k529j4383Q670J0407j1677o133J3307K641j4101Q59J5943p294j3355J3277
$$ 6604 4075 -10308 -1638 8769 -2908 -9041 4266 6907 -7194 -6335 9608 2314 -11041 2236
911B236P891j5587l607J5536q7j7003N651J6584j1792j1092J4746N059j5711j61
$$ 2236 10127 -5460 -9067 6469 6382 -10621 -4970 11614 -178 -11270 3476 8535 -7176 -7337
925g337J3790j164j6475R983J1166j2947n723J2873K649j2307j175J4702l623
$$ -7337 6453 5289 -11186 -1203 9963 -2984 -8707 4166 6815 -5492 -6667 8035 4412
938D412j3664Q947R476j0168o456J2456K880j3143j449J4848l574j2488P585J0765
$$ 4412 -9252 -305 9171 -997 -7453 5003 7883 -5260 -6709 8139 4565 -7923 -338 10427
952A0427j1464o261J0280N332j3468j911J5859l354j4616P935J1484j0968r996
$$ 10427 -1037 -7298 2982 8314 -5154 -7065 8794 5440 -9176 -1241 10243 -725 -10721
965a0721J4863N185j8235J527J9442q194j6723J3241J1017j5466n968J7618K601
$$ -10721 4142 9327 -8908 -7381 12061 3867 -12856 385 11402 -4064 -10032 7586 10187
978A0187k1664O677J8371j3549j3479J7733P964j9709k450K0969n800j9049J2227
$$ 10187 -11477 -4800 13571 22 -13457 4276 12240 -7469 -9919 11050 5250 -13799 -1572
991a572J4056j6788p922J8244L192j8718M291J5673r274j3264J2828Q446j4132
$$ -1572 12484 -4304 -12226 6018 9210 -9508 -5217 10456 1182 -12082 746 9192 -4940
1004d940m025J5038N20j5755L465J6553r932r466R670O100j0137m816J1730K944
$$ -4940 -8965 6073 6593 -9162 -5697 10856 924 -8542 1128 7228 -2909 -7725 4005 6949
1018F949j4368K539J3901o832j0318P760R974j2490n453J4683J636j6869L803
$$ 6949 -7419 -4880 9021 2189 -8129 -369 9605 -2885 -8338 6345 7981 -8888 -5085
1031e085J6849q710j2978J1695J1199j7488o840K1490j894j9356R226J6763j5762
$$ -5085 11764 3054 -9924 1771 12970 -4518 -11358 10132 8238 -11118 -1892 14871 -891
1044h91j1978J9508N721k1019j023K4343r244k0365J6998J3376k0523p457K3486
$$ -891 -12869 6639 12360 -8659 -9682 14661 5417 -14948 2050 15426 -5097 -12554 10932
1057A0932q69k3248R515J9622j7581j2195K0275M809k0911J924J9042n459j9192
$$ 10932 10063 -13185 -3670 15952 -1629 -13824 6451 11260 -9651 -7727 11315 5856 -13336
1070a3336J3104J1591j6166n297J7790q45j5931M298J5584q458j3051J2682O226
$$ -13336 -232 11359 -4807 -10104 7686 6841 -9090 -4792 10792 2334 -10717 1965 8191
1083H191j1721m025J1174Q22j1457K123J2174n768j0398Q045Q546r180o130J0576
$$ 8191 -3530 -7555 3619 4441 -7016 -4893 7281 1513 -8885 -840 7706 -1474 -7604 2972
1097B972M056j4385J599J4894n287j4075R011J2140j2384r955J5819M830j8323
$$ 2972 7028 -7357 -5758 9136 3849 -10226 -1215 10925 -1459 -11414 4405 9235 -9088
1110i088K512J7488r435j3003J1888J1972j6484p325K0133j70k0550R411J5054
$$ -9088 -6576 10912 1477 -11526 362 12334 -4150 -11475 8658 8488 -12062 -2651 12403
1123A2403j2751j2015J7169O365j8514m64J9606p016j6277J2433J0959j5058o470
$$ 12403 -348 -12363 4806 11171 -7343 -7807 11799 4783 -11494 939 11898 -3160 -9630
1136i630J6829K50j7258N772J5021j0850r808J2396O089j2677k402J3089k504
$$ -9630 7199 7449 -9809 -4037 10984 134 -9674 2722 8811 -3866 -6268 6821 4317
1149D317j3064P522R364q016p616R514M061r221l141J1831j255j0880N062O584
$$ 4317 -8747 -1225 8139 123 -7493 2021 6082 -3139 -6280 5551 4296 -6584 -1522 5062
1163E062n754o117O842O024q908l929J0943N68j0866K768R687n919q704R400N922
$$ 5062 -692 -6809 33 6057 -2851 -6780 4163 4731 -6135 -3367 6320 401 -8303 1097 7019
1178G019j0965l029J2609k557j1711O235J0214o558j1060J2376N161j4273n34
$$ 7019 -3946 -6975 5634 3077 -8634 -2399 7815 1257 -9803 2573 7734 -6539 -7073
1191g073J5216o222j1887R608J0642j3625o358J5853L29j7470P922J3281j0470
$$ -7073 8143 1921 -9966 -358 10284 -3341 -9699 6154 6483 -10987 -3065 10216 -254
1204b54r509J2224N919j4346j731J6150m218j3273Q893R943j1989n029J2171K401
$$ -254 -9763 2461 8380 -5966 -7697 8453 4235 -9038 -145 9798 -2191 -7220 4951 7352
1218G352j3178J107J3913p549r860R503O716j1519k544R984J321j1291L137J1152
$$ 7352 -5826 -4719 9194 1645 -8215 1288 8004 -3515 -6059 3925 5246 -6045 -2908 8244
1232H244p560p179Q097N487r310m878J1300K047j2254L439R651n900p962Q166
$$ 8244 684 -6495 1602 7089 -2221 -7099 4201 6248 -6006 -2567 7084 1184 -6778 1388
1246A388N627q838m898J1155J550j3539M261J0253m936j1091R644P833j2012m777
$$ 1388 7015 -1823 -6721 4434 5984 -7555 -3294 6959 2023 -9068 576 8409 -3603 -8380
1260h380J4754r06j4467N306J2193q770j0176J4303N290j5680j889J8114o081
$$ -8380 6374 5468 -8999 -3693 8500 -270 -10446 3857 9147 -6533 -8422 9692 3611
1273C611j4133R880J0760j3144p090J6217K799j8693M888J4771r756r914J2490
$$ 3611 -10522 -642 10118 -3026 -10116 6101 8900 -9793 -4905 9866 110 -9804 2686
1286B686N835j4269k837J6095k582j3648O679J0296j0316m570J0434K731j1765
$$ 2686 8521 -5748 -8585 7510 4928 -8720 -2041 8255 -2061 -6631 3803 6534 -5231
1299e231J263J1413m430j0316P589O334p804m833Q992K949j0144N76R254l046
$$ -5231 -3968 7445 3015 -7301 288 6622 -1182 -6015 2977 5926 -4218 -3642 5612 2566
1313B566p752N245N974n991o155Q462L127r417L86Q994l429p687M008P682n476
$$ 2566 -5186 59 6033 42 -6113 2349 5476 -3941 -3555 5439 2010 -5677 -1669 6013 537
1328E37p480R933K079j0006P24R283k639q282N075Q101r066n401J1100J478j2284
$$ 537 -6943 2990 5069 -4937 -4213 5070 2431 -5851 -776 7325 -1741 -7142 3958 5436 -6848
1343f848L240R860o309p474P886O406j1822o04J1605l243q812M268P925q260n029
$$ -6848 -3608 6252 -57 -7531 355 6761 -5061 -5665 5940 2697 -6115 -1847 6078 -2182 -7211
1358g211J0012K144j0890K562Q722n239o473O474M752p664k025Q626j037p946
$$ -7211 2801 4945 -5945 -3383 5339 100 -6373 101 4853 -2811 -4836 3790 2753 -5193
1372e193L546O576n455l612N679L449q390J08P183j722o912M013L990l963k930
$$ -5193 -1647 4929 -526 -4138 1541 4990 -3400 -3292 3891 2169 -4743 -730 3260 -703 -3633
1387c633L841L875p165q7O537j145n908L095M055k560l817L913M059p514q08P637
$$ -3633 208 4083 -3082 -3169 3368 2223 -3685 -590 3465 905 -2912 1001 5060 -2454 -3262 4375
1403D375j793n850J947N551m478l579N229K594o769O52O674l278m600K633N185
$$ 4375 2582 -3268 -1321 4230 -248 -3827 1402 3996 -2773 -2121 4553 1275 -3325 -692 4493
1418D493o050k321P442L83q289L398N433k881n737M343M219o733k754Q784j523
$$ 4493 -1557 -3878 3564 3947 -4342 -944 4489 1608 -4129 214 4433 -2300 -5054 3730 2207
1433B207n864L026M634l488m387L881M180p721J62N970j564m733K798M591m361
$$ 2207 -3657 -631 4003 515 -3872 9 4189 -3532 -3370 2600 1036 -3697 -899 3692 -669
1448f69m076O256K709p614Q73N801j841o422K856O621m657m833O940J857p214
$$ -669 -4745 1511 4220 -3394 -2521 3280 1439 -4983 -2127 4494 -163 -4996 1944 3801 -3413
1463c413O65O891k818n499L186N539m710k446N870l88n755J706M709k437n579
$$ -3413 -2748 4143 1325 -4174 -988 4551 -159 -2605 3265 2877 -2878 -1172 3537 1100 -4479
1478d479N809K255m885k429O539n37n129J259N111l559l877M833K771n744N22
$$ -4479 1330 3585 -1300 -3729 2810 2273 -2856 -1597 3514 -45 -3922 911 3682 -2062 -1540
1493a540L176L76n093L057M346l618m600N497K672o470J46L707J407p643L197
$$ -1540 1636 2012 -3081 -24 4322 704 -3896 1601 4273 -2197 -2051 1656 3063 -4580 -1383
$$ [...]
8191I3
##END NTUPLES=NMR FID
##END=
