##TITLE=1H_Pr AD MeOH
 CD3OD, 8 sc, 
 1.07.2021
##JCAMPDX= 6.0         $$ Bruker NMR JCAMP-DX V2.0
##DATA TYPE= NMR FID
##DATA CLASS= NTUPLES
##ORIGIN= UXNMR, Bruker Analytische Messtechnik GmbH
##OWNER= root
$$ XWIN-NMR		Version 3.5
$$ Thu Jul  1 09:12:52 2021 Russian Standard Time (UT+4h)  she@DPX200
##.OBSERVE FREQUENCY= 200.131506
##.OBSERVE NUCLEUS= ^1H
##.DELAY= (6, 6)
##.ACQUISITION MODE= SIMULTANEOUS
##.ACQUISITION SCHEME= undefined
##.AVERAGES= 8
##.DIGITISER RES= 18
##SPECTROMETER/DATA SYSTEM= spect
##.PULSE SEQUENCE= zg30
##.SOLVENT NAME= MeOD
##.SHIFT REFERENCE= (INTERNAL, MeOD, 0, 15.7039)
##AUDIT TRAIL= $$ (NUMBER, WHEN, WHO, WHERE, WHAT)
$$ ##TITLE= Audit trail, XWIN-NMR		Version 3.5
$$ ##JCAMPDX= 5.01
$$ ##ORIGIN= Bruker BioSpin GmbH
$$ ##OWNER= she
$$ F:/spectra/data/she/nmr/H-F/1/audita.txt
$$ ##AUDIT TRAIL=  $$ (NUMBER, WHEN, WHO, WHERE, WHAT)
(   1,<2021-07-01 09:11:01.28 +0400>,<she>,<DPX200>,
      <created by zg, POWCHK disabled, PULCHK disabled
       configuration hash MD5:
       00 E9 B6 7A A2 85 ED C7 34 08 36 98 17 FE 4E 26
       data hash MD5: 16K
       92 81 25 A5 B2 35 9C 83 27 C9 18 25 A8 76 5C 07>)
$$ ##END=
$$ 
$$ hash MD5
$$ 09 97 18 B2 05 F8 FD A2 A4 AE 5F 22 A9 B2 55 05
##$RELAX= 
##$RELAX= 
##$RELAX= 
##$RELAX= 
##$RELAX= 
##$RELAX= 
$$ Bruker specific parameters
$$ --------------------------
##$DU= <F:/spectra>
##$EXPNO= 1
##$NAME= <H-F>
##$PROCNO= 1
##$TYPE= <nmr>
##$USER= <she>
##$AMP= (0..31)
100 100 100 100 100 100 100 100 100 100 100 100 100 100 100 100 100 100 
100 100 100 100 100 100 100 100 100 100 100 100 100 100 
##$AQSEQ= 0
##$AQ_mod= 1
##$AUNM= <au_zg>
##$AUTOPOS= <>
##$BF1= 200.13
##$BF2= 200.13
##$BF3= 200.13
##$BF4= 200.13
##$BF5= 200.13
##$BF6= 200.13
##$BF7= 200.13
##$BF8= 200.13
##$BYTORDA= 1
##$CFDGTYP= 0
##$CFRGTYP= 5
##$CHEMSTR= <none>
##$CNST= (0..31)
1 1 145 1 1 1 1 1 1 1 1 1 1 1 1 1 1 1 1 1 1 1 1 1 1 1 1 1 1 1 1 1 
##$CPDPRG= <>
##$CPDPRG1= <>
##$CPDPRG2= <>
##$CPDPRG3= <>
##$CPDPRG4= <mlev>
##$CPDPRG5= <mlev>
##$CPDPRG6= <mlev>
##$CPDPRG7= <mlev>
##$CPDPRG8= <mlev>
##$CPDPRGB= <>
##$CPDPRGT= <>
##$D= (0..31)
0 1.2 0 0 0 0 0 0 0 0.06 0 0.03 0 0 0 0 0.0002 0 0 0 0 0 0 0 0 0 0 0 0 
0 0 0 
##$DATE= 1625116260
##$DBL= (0..7)
120 120 120 120 120 120 120 120 
##$DBP= (0..7)
150 150 150 150 150 150 150 150 
##$DBP07= 0
##$DBPNAM0= <>
##$DBPNAM1= <>
##$DBPNAM2= <>
##$DBPNAM3= <>
##$DBPNAM4= <>
##$DBPNAM5= <>
##$DBPNAM6= <>
##$DBPNAM7= <>
##$DBPOAL= (0..7)
0.5 0.5 0.5 0.5 0.5 0.5 0.5 0.5 
##$DBPOFFS= (0..7)
0 0 0 0 0 0 0 0 
##$DE= 6
##$DECBNUC= <off>
##$DECIM= 32
##$DECNUC= <off>
##$DECSTAT= 4
##$DIGMOD= 1
##$DIGTYP= 9
##$DL= (0..7)
0 120 120 120 120 120 120 120 
##$DP= (0..7)
150 150 150 150 150 150 150 150 
##$DP07= 0
##$DPNAME0= <>
##$DPNAME1= <>
##$DPNAME2= <>
##$DPNAME3= <>
##$DPNAME4= <>
##$DPNAME5= <>
##$DPNAME6= <>
##$DPNAME7= <>
##$DPOAL= (0..7)
0.5 0.5 0.5 0.5 0.5 0.5 0.5 0.5 
##$DPOFFS= (0..7)
0 0 0 0 0 0 0 0 
##$DQDMODE= 0
##$DR= 18
##$DS= 0
##$DSLIST= <SSSSSSSSSSSSSSS>
$$ [...]
##$SUBNAM2= <"">
##$SUBNAM3= <"">
##$SUBNAM4= <"">
##$SUBNAM5= <"">
##$SUBNAM6= <"">
##$SUBNAM7= <"">
##$SUBNAM8= <"">
##$SUBNAM9= <"">
##$SW= 20.0188882624521
##$SWIBOX= (0..15)
0 0 2 0 0 0 0 0 0 0 0 0 0 0 0 0 
##$SW_h= 4006.41025641026
##$TD= 16384
##$TD0= 1
##$TE= 0
##$TE2= 300
##$TE3= 300
##$TEG= 300
##$TL= (0..7)
0 120 120 120 120 120 120 120 
##$TP= (0..7)
150 150 150 150 150 150 150 150 
##$TP07= 0
##$TPNAME0= <>
##$TPNAME1= <>
##$TPNAME2= <>
##$TPNAME3= <>
##$TPNAME4= <>
##$TPNAME5= <>
##$TPNAME6= <>
##$TPNAME7= <>
##$TPOAL= (0..7)
0.5 0.5 0.5 0.5 0.5 0.5 0.5 0.5 
##$TPOFFS= (0..7)
0 0 0 0 0 0 0 0 
##$TUNHIN= 0
##$TUNHOUT= 0
##$TUNXOUT= 0
##$USERA1= <user>
##$USERA2= <user>
##$USERA3= <user>
##$USERA4= <user>
##$USERA5= <user>
##$V9= 5
##$VALIST= <valist>
##$VCLIST= <CCCCCCCCCCCCCCC>
##$VD= 0
##$VDLIST= <DDDDDDDDDDDDDDD>
##$VPLIST= <PPPPPPPPPPPPPPP>
##$VTLIST= <TTTTTTTTTTTTTTT>
##$WBST= 1024
##$WBSW= 4
##$XGAIN= (0..3)
0 0 0 0 
##$XL= 0
##$YL= 0
##$YMAX_a= 138174
##$YMIN_a= -166079
##$ZGOPTNS= <>
##$ZL1= 120
##$ZL2= 120
##$ZL3= 120
##$ZL4= 120
##$ABSF1= 10
##$ABSF2= 0
##$ABSG= 5
##$ABSL= 3
##$ALPHA= 0
##$AQORDER= 0
##$ASSFAC= 0
##$ASSFACI= 0
##$ASSFACX= 0
##$ASSWID= 0
##$AUNMP= <proc_1d>
##$AZFE= 0.1
##$AZFW= 0.1
##$BCFW= 1
##$BC_mod= 2
##$BYTORDP= 1
##$COROFFS= 0
##$CY= 11.3945322036743
##$DATMOD= 1
##$DC= 2
##$DFILT= <>
##$DTYPP= 0
##$F1P= 15.9154993809931
##$F2P= -4.1035820241983
##$FCOR= 0.5
##$FTSIZE= 0
##$FT_mod= 4
##$GAMMA= 1
##$GB= 0.15
##$INTBC= 1
##$INTSCL= 1
##$ISEN= 128
##$LB= 0.24
##$LEV0= 0
##$LPBIN= 0
##$MAXI= 10000
##$MC2= 0
##$MEAN= 0
##$ME_mod= 0
##$MI= 1.114404
##$NCOEF= 0
##$NC_proc= 0
##$NLEV= 6
##$NOISF1= 3.799351
##$NOISF2= 2.8
##$NSP= 1
##$NTH_PI= 0
##$NZP= 0
##$OFFSET= 15.70392
##$PC= 1
##$PHC0= -11914.03
##$PHC1= 8.800991
##$PH_mod= 1
##$PKNL= yes
##$PPARMOD= 0
##$PSCAL= 0
##$PSIGN= 0
##$REVERSE= no
##$SF= 200.130013532006
##$SI= 16384
##$SIGF1= 3
##$SIGF2= 2
##$SINO= 400
##$SIOLD= 16384
##$SREGLST= <1H.CDCl3>
##$SSB= 0
##$STSI= 0
##$STSR= 0
##$SW_p= 3612.71676300578
##$SYMM= 0
##$S_DEV= 0
##$TDeff= 0
##$TDoff= 0
##$TI= <>
##$TILT= no
##$TM1= 0
##$TM2= 0
##$TOPLEV= 0
##$USERP1= <user>
##$USERP2= <user>
##$USERP3= <user>
##$USERP4= <user>
##$USERP5= <user>
##$WDW= 1
##$XDIM= 8192
##$YMAX_p= 0
##$YMIN_p= 0
$$ End of Bruker specific parameters
$$ ---------------------------------
##NTUPLES= NMR FID
##VAR_NAME=  TIME,          FID/REAL,        FID/IMAG
##SYMBOL=    X,             R,               I
##VAR_TYPE=  INDEPENDENT,   DEPENDENT,       DEPENDENT
##VAR_FORM=  AFFN,          ASDF,            ASDF
##VAR_DIM=   8192,          8192,            8192
##UNITS=     SECONDS,       ARBITRARY UNITS, ARBITRARY UNITS
##FACTOR=    0.0002496,     1,               1
##FIRST=     0,             0,               0
##LAST=      2.0444736,     0,               0
##MIN=       0,             -166079,         0
##MAX=       2.0444736,     138174,          0
$$ Real data points
##PAGE= N=1
##DATA TABLE= (X++(R..R)), XYDATA
$$ plain form
0 0 0 0 0 0 0 0 0 0 0 0 0 0 0 1 -8 8 -8 8 -9 16 -16 18 -24 28 -33 40 -46 51 -60 69 -81 91 -103 116 -131 147
36 147 -166 186 -209 233 -259 288 -319 352 -392 434 -476 527 -581 638 -704 776 -855 943
54 943 -1042 1154 -1281 1425 -1595 1793 -2030 2321 -2686 3161 -3806 4739 -6216 8919 -15529
69 -15529 70981 28059 -112121 -86885 -56193 9211 42263 57686 61595 54663 -27992 -124286
81 -124286 -117448 8452 105185 115871 36906 -51102 -63038 -44171 -50478 -19360 51468 110274
93 110274 84258 -25732 -118092 -111867 -15908 79343 75550 35318 19993 -10303 -59927 -89784
105 -89784 -59126 43331 124533 96717 -15196 -94873 -77177 -28372 9159 41024 51424 63199
117 63199 41420 -60859 -125531 -67352 36258 99607 82682 11402 -44463 -51116 -38593 -43574
$$ packed form
0@%%%%%%%%%%%%%JrJ6j6J6j7K5l2L4m2N2o1P3q6R7j11J29j50J72j94K19k47K78
36A47l13L52l95M42m92N47o07O71p44Q26r10J003j108J219j342J480j631J798
54I43j985K196k435K706l020L388l823M351n007N847o967Q545j0955J5135k4448
69a5529Q6510m2922j40180K5236L0692O5404L3052J5423L909o932q2655r6294
81a24286O838J25900R6733J0686p8965q8008j1936J8867o307L1118P0828N8806
93A10274k6016j09990r2360O225R5959R5251l793m0232j5325l0296m9624k9857
105h9784L0658J02457Q1202k7816j11913p9677J7696M8805L7531L1865J0400J1775
117F3199k1779j02279o4672N8179J03610O3349j6925p1280n5865o653J2523m981
$$ plain form
129 -43574 -13331 71899 104756 47552 -47682 -112956 -75251 18172 62727 54633 32844 16131
141 16131 -15208 -67963 -82065 -28495 60641 114710 60075 -41236 -77567 -55687 -18478 10684
153 10684 33396 58825 58843 9156 -70707 -108216 -39534 56983 84723 55781 -1429 -39909 -38450
166 -38450 -43784 -41862 11156 77480 88220 20847 -64667 -93607 -48742 27944 56124 37523
178 37523 32817 17429 -30173 -68788 -68965 -7579 76444 93257 31372 -45476 -67704 -38674 -13220
191 -13220 9102 37495 57258 51845 -9367 -83857 -82298 -14140 57020 75734 36734 -8424
203 -8424 -32443 -39223 -42083 -33320 24749 84633 66316 -2243 -65728 -79559 -26911 30071 45981
216 45981 37861 28338 9357 -36750 -72753 -50621 12627 76768 78070 7654 -46907 -51941 -36124
$$ packed form
129d3574L0243Q5230L2857n7204r5234o5274L7705R3423M4555q094k1789j6713
141A6131l1339n2755j4102N3570Q9136N4069n4635j01311l6331K1880L7209K9162
153A0684K2712K5429J8m9687p9863l7509O8682R6517K7740k8942n7210l8480J459
166c8450n334J922N3018O6324J0740o7373q5514k8940M4865P6686K8180j8601
178C7523m706j5388m7602l8615j77O1386Q4023J6813o1885p6848k2228K9030K5454
191a3220K2322K8393J9763n413o1212p4490J559O8158P1160J8714l9000m5158
203h424k4019o780k860Q763N8069N9884j8317o8559o3485j3831N2648N6982J5910
216D5981q120r523j8981m6107l6003K2132O3248O4141J302p0416n4561n034J5817
$$ plain form
229 -36124 -9910 13922 39498 58925 35908 -27150 -80785 -66897 6701 59324 59341 27122 -12380
242 -12380 -29291 -37921 -46249 -17135 39481 75965 53387 -18515 -70078 -62280 -12863 32934 38734
255 38734 33633 30987 -2887 -46811 -64510 -38270 28924 76972 58014 -3507 -47935 -44884 -27118
268 -27118 -10689 19889 45772 51890 24168 -41404 -78146 -45612 16427 58528 51308 15147
280 15147 -12482 -30176 -39733 -39147 -8215 50510 72201 32400 -28597 -67760 -50117 690 30053
293 30053 36738 33973 21708 -8288 -51839 -62120 -20317 39891 73687 42406 -16933 -42553
305 -42553 -40772 -24239 -1333 21075 47243 49595 7921 -49795 -72698 -30446 29983 52976
317 52976 42355 10398 -18454 -28410 -40003 -35653 6613 54267 64266 19753 -41133 -61953 -37084
$$ packed form
229c6124K6214K3832K5576J9427k3017o3058n3635J3888P3598N2623J7l2219l9502
242a2380j6911q630q328K9114N6616L6484k2578p1902n1563P798M9417M5797N800
255C8734n101k646l3874m3924j7699K6240O7194M8048j8958o1521m4428L051J7766
268b7118J6429L0578K5883O118k7722o5572l6742L2534O2039M2101p220l6161
280A5147k7629j7694r557N86L0932N8725K1691l9801o0997l9163J7643N0807K9363
293C0053O685k765j2265k9996m3551j0281M1803O0208L3796l1281n9339k5620
305d2553J781J6533K2906K2408K6168K352m1674n7716k2903M2252O0429K2993
317E2976j0621l1957k8852r956j1593M350M2266M7654R999m4513o0886k0820K4869
$$ plain form
330 -37084 6984 32248 31695 32300 18067 -20724 -52315 -53506 -9813 51547 66446 27412 -22821
343 -22821 -43231 -32599 -19548 -260 28760 46729 41948 -2475 -58850 -62080 -16333 34842
355 34842 52977 30639 2683 -15463 -31147 -39092 -28465 15407 61065 54122 5412 -45158
367 -45158 -59145 -24102 14216 27973 31881 28961 12239 -24656 -57157 -44231 5533 54252
379 54252 59444 12850 -28017 -36832 -30888 -14450 4161 28311 49951 34367 -17468 -60879 -53625
392 -53625 -1620 39288 44513 25723 -2359 -17415 -28406 -41419 -21869 27325 60924 46432
404 46432 -9177 -50596 -47647 -15517 17399 26840 27469 29607 6867 -32991 -55378 -37536 18639
417 18639 59541 45905 3009 -30828 -33429 -23137 -14966 6817 34651 47743 27086 -28745
$$ packed form
330c7084M4068K5264n53O05j4233l8791l1591j191M3693O1360J4899l9034n0233
343b2821k0410J0632J3051J9288K9020J7969m781m4423n6375l230M5747N1175
355C4842J8135k2338k7956j8146j5684p945J0627M3872M5658o943m8710n0570
367d5158j3987L5043L8318J3757L908k920j6722l6895l2501J2926M9764M8719
379E4252N192m6594m0867q815N944J6438J8611K4150K1640j5584n1835m3411P254
392e3625N2005M0908N225j8790k8082j5056j0991j3013J9550M9194L3599j4492
404D6432n5609m1419K949L2130L2916R441O29K138k2740l9858k2387J7842N6175
417A8639M0902j3636m2896l3837k601J0292Q171K1783K7834J3092k0657n5831
$$ plain form
429 -28745 -62837 -39866 7996 41477 39177 15202 -1892 -16353 -33176 -38494 -13998 36881
441 36881 60644 31848 -17833 -51640 -40068 -3020 16007 22663 29858 26261 894 -39874 -55186
454 -55186 -23053 28448 58343 36656 -9137 -28761 -27776 -23015 -11463 9225 39280 48478 12881
467 12881 -37939 -59274 -28908 19927 38565 30676 12627 -4282 -15800 -35657 -39425 -1572
479 -1572 44234 56177 20327 -29964 -46727 -28558 -265 16958 21130 30398 25860 -9455 -44980
492 -44980 -50279 -12587 39685 52059 22469 -11825 -26994 -24250 -21577 -11331 16713 42496 42638
505 42638 2309 -47869 -51791 -14505 22689 36036 23499 9374 -1348 -21570 -38566 -32400
517 -32400 7711 51675 48053 6018 -33627 -42928 -18581 3733 12013 23581 32007 19954 -16847
$$ packed form
429b8745l4092K2971M7862L3481k300k3975j7094j4461j6823n318K4496N0879
441C6881K3763k8796m9681l3807J1572L7048J9027O656P195l597k5367m0768j5312
454e5186L2133N1501K9895k1687m5793j9624R85M761J1552K0688L0055R198l5597
467A2881n0820k1335L0366M8835J8638p889j8049j6909j1518j9857l768L7853
479a572M5806J1943l5850n0291j6763J8169K8293J7223M172R268m538l5315l5525
492d4980n299L7692N2272J2374k9590l4294j5169K744K673J0246K8044K5783J42
505D2638m0329n0178l922L7286L7194J3347j2537j4125j0722k0222j6996O166
517c2400M0111M3964l622m2035l9645r301K4347K2314Q280J1568Q426j2053l6801
$$ plain form
530 -16847 -50629 -41965 2274 42955 46019 11101 -16434 -20723 -23327 -21826 -7193 21541 47741
543 47741 34400 -12398 -48617 -43209 -3444 26760 29001 20512 8546 -4083 -23512 -42146 -24354
556 -24354 21467 51042 38532 -5732 -36559 -33241 -14077 3974 13563 23907 33192 13133 -27529
569 -27529 -49730 -32938 14527 45495 33300 4628 -15289 -20256 -22060 -22084 -2018 30403 45531
582 45531 24655 -23514 -50144 -29636 4590 25318 26003 16574 8773 -6827 -30595 -39076 -14496
595 -14496 30958 50670 24799 -13380 -34655 -27790 -7661 2626 13590 29432 29120 3862 -34450
608 -34450 -47820 -18125 22401 41671 26297 -1976 -13605 -18854 -24511 -18324 4814 35740 43127
621 43127 10442 -30823 -44184 -21571 11473 23088 21368 17034 6407 -10722 -34431 -36944 -1391
$$ packed form
530a6847l3782Q664M4239M0681L064l4918k7535m289k604J501J4633K8734K6200
543D7741j3341m6798l6219N408L9765L0204K241q489j1966j2629j9429j8634J7792
556b4354M5821K9575j2510m4264l0827L318J9164J8051R589J0344R285k0059m0662
569b7529k2201J6792M7465L0968j2195k8672j9917m967j804k4K0066L2421J5128
582D5531k0876m8169k6630K0508L4226K0728O85r429p801j5600k3768q481K4580
595a4496M5454J9712k5871l8179k1275O865K0129J0287J0964J5842l12k5258l8312
608c4450j3370K9695M0526J9270j5374k8273j1629n249n657O187K3138L0926P387
621D3127l2685m1265j3361K2613L3044J1615j720m334j0627j7129k3709k513L5553
$$ plain form
634 -1391 37112 44131 15566 -20456 -31344 -20346 -6969 3707 15659 31095 26813 -7208 -39320
647 -39320 -41109 -9403 29889 36729 16629 -2822 -13280 -18467 -24267 -16424 13571 39217 36043
660 36043 724 -36623 -38005 -11169 12362 22028 19261 15055 5847 -17784 -36913 -29095 6702
673 6702 41589 36825 4737 -21527 -28470 -16763 -4952 3687 20353 32172 19804 -13911 -42418
686 -42418 -33837 2386 30391 31548 10711 -4765 -11069 -21605 -24997 -9563 18481 41403 28843
699 28843 -10514 -36968 -31487 -4738 14616 18089 18722 15105 1084 -21641 -38241 -21193 17555
712 17555 39508 29696 -1942 -24204 -22560 -14014 -4872 6420 22569 32540 12574 -23502 -39838
725 -39838 -25182 9263 31738 24501 7395 -4631 -12966 -21284 -24219 -4421 26697 38655 19855
$$ packed form
634a391L8503P019k8565l6022j0888J0998J3377J0676J1952J5436m282l4021l2112
647c9320j789L1706L9292O840k0100j9451j0458n187n800P843K9995K5646l174
660C6043l5319l7347j382K6836K3531R666k767m206r208k3631j9129P818L5797
673F702L4887m764l2088k6264o943J1707J1811Q639J6666J1819j2368l3715k8507
686d2418Q581L6223K8005J157k0837j5476o304j0536l392J5434K8044K2922j2560
699B8843l9357k6454N481K6749J9354L473O33l617j4021k2725j6600J7048L8748
712A7555K1953r812l1638k2262J644Q546R142J1292J6149R971j9966l6076j6336
725c9838J4656L4445K2475p237j7106j2026q335q318k935J9798L1118J1958j8800
$$ plain form
738 19855 -17286 -36738 -22635 -615 13475 18394 17454 14221 -2387 -27859 -35239 -12314 24357
751 24357 38901 19569 -7750 -22101 -20404 -11051 -5163 8267 27412 28482 4565 -28088 -39264
764 -39264 -15190 15681 28700 19878 3428 -4258 -13083 -24569 -20234 2430 29761 36889 9820
777 9820 -23017 -32769 -17373 4199 12765 16173 19004 10896 -7858 -29969 -32593 -2652 28657
790 28657 33718 13340 -12052 -20403 -15941 -11450 -3400 12172 28842 25758 -4397 -31839 -32726 -8589
804 -8589 20185 25717 14097 3711 -5107 -15316 -24428 -18335 9869 33549 30190 2123 -26710
817 -26710 -28268 -10383 4317 12518 16197 17705 9915 -13749 -32808 -25669 4503 31362 28430
830 28430 5207 -12361 -18660 -14989 -9570 -2089 16949 30400 18862 -10753 -33727 -27262 -139
$$ packed form
738A9855l7141j9452J4103K2020J4090M919r40l233j6608k5472p380K2925L6671
751B4357J4544j9332k7319j4351J697R353N888J3430J9145J070k3917l2653j1176
764c9264K4074L0871J3019q822j6450p686q825j1486M335K2664K7331P128k7069
777I820l2837r752J5396K1572Q566L408K831q108j8754k2111k624K9941L1309
790B8657N061k0378k5392q351M462M491Q050J5572J6670l084l0155k7442q87K4137
804h589K8774N532j1620j0386q818j0209r112O093K8204K3680l359k8067k8833
817b6710j558J7885J4700Q201L679J508p790k3664j9059P139L0172K6859k932
830B8430k3223j7568o299L671N419P481J9038J3451j1538k9615k2974O465K7123
$$ plain form
843 -139 20157 22307 11323 1942 -4512 -18594 -25166 -11470 14572 34750 24413 -7079 -26398
856 -26398 -23378 -6887 5769 10793 17308 18197 4484 -17818 -33524 -19518 13249 30773 22805
869 22805 822 -14142 -14789 -14170 -10784 1888 19964 29921 12940 -18319 -32417 -20656 4888
882 4888 21377 17442 9002 2735 -7611 -19903 -24233 -6427 22026 32282 16929 -11515 -26614
895 -26614 -17348 -4186 4836 12312 17201 16748 603 -24136 -30965 -11331 17766 29625 15961
908 15961 -2550 -12614 -15099 -12804 -9332 4717 24796 26674 5248 -22307 -31059 -12602 9824
921 9824 18749 15574 7390 1847 -8772 -23292 -20925 304 25230 30629 8490 -16493 -23274 -13980
935 -13980 -1212 5357 12056 19724 14147 -5624 -26416 -28234 -3426 21912 25279 11571 -5889
$$ packed form
843a39K0296K150j0984r381o454j4082o572J3696K6042K0178j0337l1492j9319
856b6398L020J6491J2656N024O515Q89j3713k2302j5706J4006L2767J7524p968
869B2805k1983j4964o47O19L386J2672J8076R957j6981l1259j4098J1761K5544
882D888J6489l935q440o267j0346j2292m330J7806K8453J0256j5353k8444j5099
895b6614R266J3162R022P476M889m53j6145k4739o829J9634K9097J1859j3664
908A5961j8511j0064k485K295L472J4049K0079J878k1426k7555q752J8457K2426
921I824Q925l175q184n543j0619j4520K367K1229K4926N399k2139k4983o781R294
935a3980J2768O569O699P668n577j9771k0792j818K4808K5338L367j3708j7460
$$ plain form
948 -5889 -12084 -13084 -14243 -7050 10054 26292 23689 -2555 -25344 -25755 -8104 12577 17517 11725
962 11725 8207 572 -12719 -23151 -17881 7380 28058 24858 2529 -18703 -20341 -9110 -1508
975 -1508 5571 13969 18839 11510 -11148 -28937 -21586 3015 23740 21851 5415 -5542 -11479 -13512
989 -13512 -13227 -5582 14398 27885 17002 -8309 -26666 -21532 -1145 12379 15313 11098 6565
1002 6565 -356 -16067 -24293 -11458 12357 28476 19802 -4575 -18456 -16503 -7728 19 6146
1015 6146 15900 19479 6002 -15674 -28654 -16314 10095 22688 16993 3356 -7094 -9671 -13514
1028 -13514 -13685 -657 17951 26733 11521 -14819 -25600 -16079 2177 13596 12371 10357 7209
1041 7209 -4172 -18238 -22695 -6762 18188 26715 13122 -7801 -18457 -12737 -5948 -616 8472
$$ packed form
948e889o195j000j159P193J7104J6238k603k6244k2789m11J7651K0681M940n792
962A1725l518p635j3291j0432N270K5261K0678l200k2329k1232j638J1231P602
975a508P079Q398M870p329k2658j7789P351K4601K0725j889j6436j0957n937k033
989a3512K85P645J9980J3487j0883k5311j8357N134K0387J3524K934m215m533
1002F565o921j5711q226J2835K3815J6119q674k4377j3881J953Q775P747O127
1015F146R754L579j3477k1676j2980J2340K6409J2593n695j3637j0450k577l843
1028a3514j71J3028J8608Q782j5212k6340j0781R521J8256J1419j225k014l148
1041G209j1381j4066m457J5933K4950Q527j3593k0923j0656N720O789N332R088
$$ plain form
1054 8472 17077 17235 2046 -20818 -26158 -9335 12822 22006 12471 693 -5748 -11156 -14019 -11801
1068 -11801 2370 22122 23531 4477 -16830 -24139 -10458 5096 11326 11771 9861 5325 -6211
1081 -6211 -21446 -19595 -360 20181 24358 7254 -11230 -15524 -11458 -5051 572 9444 19085 14660
1095 14660 -3971 -22686 -23526 -3198 16319 18000 9604 -738 -6312 -10397 -15506 -9767 8218
1108 8218 23150 20574 -1652 -20087 -19573 -6700 6773 11073 9811 10778 3637 -11053 -21570 -16372
1122 -16372 5696 22853 19409 2762 -12479 -14064 -8200 -5059 1610 12760 18550 11402 -9547
1135 -9547 -24392 -17344 2038 16863 15838 5647 -696 -6156 -12610 -14714 -6673 12560 24446
1148 24446 14440 -6337 -20360 -16350 -1758 6913 9531 10758 9731 1699 -14546 -22529 -10224
$$ packed form
1054H472Q605J58j5189k2864n340J6823K2157R184r535j1778o441n408k863K218
1068a1801J4171J9752J409j9054k1307p309J3681J5554O230M45j910m536j1536
1081f211j5235J851J9235K0541M177j7104j8484m294M066O407N623Q872R641m425
1095A4660j8631j8715q40K0328J9517J681q396j0342n574m085n109N739J7985
1108H218J4932k576k2226j8435N14J2873J3473M300j262R67p141j4690j0517N198
1122a6372K2068J7157l444j6647j5241j585N864L141O669J1150N790p148k0949
1135i547j4845P048J9382J4825j025j0191o343n460o454k104Q041J9233J1886
1148B4446j0006k0777j4023M010J4592Q671K618J227j027q032j6245p983J2305
$$ plain form
1161 -10224 10302 22824 15443 -2628 -11822 -11282 -8392 -4054 3034 14768 18818 6095 -13479
1174 -13479 -23437 -13069 7015 16116 12581 4668 -1940 -6315 -13379 -14547 -1679 15922 22841 9841
1188 9841 -11535 -19231 -11981 -706 7152 8646 11138 9872 -2385 -16903 -20388 -5789 14768
1201 14768 20855 10164 -4506 -11834 -9741 -7722 -4453 6007 16512 16514 2035 -17923 -21236 -7031
1215 -7031 9221 15083 9654 3399 -1019 -8518 -14558 -12389 1989 19236 19855 3731 -12761 -17800
1229 -17800 -8341 1622 5669 9594 11494 7624 -5254 -19552 -17565 50 16208 18985 6287
1242 6287 -6402 -9778 -9359 -7610 -2626 7529 17986 13844 -3586 -18751 -18804 -2759 11234 12248
1256 12248 8315 3003 -2573 -8996 -15976 -10372 7084 19960 16735 -850 -15003 -14096 -6312 1658
$$ packed form
1161a0224K0526J2522p381j8071r194N40K890M338P088J1734M050j2723j9574
1174a3479r958J0368K0084R101l535p913o608m375p064j168J2868J7601O919j3000
1188I841k1376p696P250J1275P858J494K492j266j2257j4518l485J4599K0557
1201A4768O087j0691j4670p328K093K019L269J0460J0505Kj4479j9958l313J4205
1215g031J6252N862n429o255m418p499o040K169J4378J7247O19j6124j6492n039
1229a7800R459R963M047L925J900l870j2878j4298J987J7615J6158K777j2698
1242F287j2689l376M19J749M984J0155J0457m142j7430j5165n3J6045J3993J014
1256A2248l933n312n576o423o980N604J7456J2876l225j7585j4153R07P784P970
$$ plain form
1270 1658 6102 9098 12374 5676 -9616 -19524 -14205 4497 18120 14707 2811 -6591 -9505 -8325
1284 -8325 -7794 -1075 11243 17418 10710 -7502 -19945 -14104 581 11124 11502 6215 3269 -2986
1298 -2986 -11761 -14885 -6762 10387 20927 11847 -4368 -14477 -12335 -3135 1967 5904 10779 11104
1312 11104 2762 -12337 -19728 -9139 7788 17382 12101 -251 -6494 -7973 -9108 -6686 1248 13147
1326 13147 17801 5522 -11237 -18592 -10838 4122 10832 9391 6305 1747 -4062 -12567 -14656 -2375
1340 -2375 13638 19177 8573 -8145 -13974 -9356 -2787 2513 6447 11125 11060 -1290 -15100 -17422
1354 -17422 -5702 11354 16102 8496 -1121 -6824 -7644 -8965 -6931 4168 15140 15339 2483 -14251
1368 -14251 -17265 -6072 5222 10365 8013 5119 2224 -6642 -14094 -12058 943 16286 16976 3252
$$ packed form
1270A658M444K996L276o698j5292r908N319J8702J3623l413j1896r402k914J180
1284h325N31O719J2318O175o708j8212j2443N841J4685J0543L78n287k946o255
1298b986q775l124Q123J7149J0540r080j6215j0109K142R200N102L937M875L25
1312A1104q342j5099p391J0589J6927R594n281j2352o243j479j135K422P934J1899
1326A3147M654j2279j6759p355P754J4960O710j441l086m558n809q505k089J2281
1340b375J6013N539j0604j6718n829M618O569N300L934M678o5j2350j3810k322
1354a7422J1720J7056M748p606r617n703q20j321K034J1099J0972J99j2856j6734
1368a4251l014J1193J1294N143k352k894k895q866p452K036J3001J5343O90j3724
$$ plain form
1382 3252 -8999 -13011 -7277 -1452 1759 8053 11961 8491 -3904 -17178 -15235 -545 12631 14381
1396 14381 5388 -2901 -5831 -8255 -9133 -4367 6277 16285 12842 -2367 -14740 -14859 -3138 7168
1410 7168 8460 7494 5505 263 -7973 -14874 -9862 5746 16709 13679 -74 -10547 -10311 -6025
1424 -6025 -1360 3326 8393 12490 6360 -8398 -16802 -11733 3146 13593 11243 3687 -3103 -6249
1438 -6249 -8096 -9800 -2415 10066 16259 9607 -6294 -16378 -10959 -419 6706 8199 6725 5291
1452 5291 -603 -10741 -14561 -6542 8576 17228 9898 -2851 -10119 -9518 -4232 -1131 3568 10591
1466 10591 11473 3137 -10594 -16888 -7698 6076 12886 9543 1153 -3074 -5529 -9222 -8161 22
1480 22 11774 15872 5353 -8937 -14678 -8539 2091 6512 6824 7447 4639 -2946 -12110 -14075 -2510
$$ packed form
1382C252j2251m012N734N825L211O294L908l470j2395j3274J943J4690J3176J750
1396A4381q993q289k930k424q78M766J0644J0008l443j5209j2373j19J1721J0306
1410G168J292r66j989n242q236o901N012J5608J0963l030j3753j0473K36M286
1424f025M665M686N067M097o130j4758q404N069J4879J0447k350p556o790l146
1438f249j847j704P385J2481O193o652j5901j0084N419J0540P125J493j474j434
1452E291n894j0138l820Q019J5118Q652p330j2749p268O01N286L101M699P023
1466A0591Q82q336j3731o294R190J3774O810l343q390m227k455l693J061Q183
1480B2J1752M098j0519j4290n741O139J0630M421L12O23k808p585r164j965J1565
$$ plain form
1495 -2510 11903 15678 6738 -5331 -9610 -7246 -4339 -574 4715 11036 10927 -325 -13432 -14775
1509 -14775 -4516 8645 12130 6447 1134 -3098 -6082 -9338 -7706 3188 13850 13296 2118 -11570
1523 -11570 -13201 -5000 2722 6174 6706 6656 3923 -5068 -13433 -11204 915 13437 13765 2932 -6141
1538 -6141 -8914 -6441 -3688 -563 6676 12242 8521 -3664 -14780 -12620 -9 9024 10514 5181
1552 5181 -291 -2700 -7236 -10216 -5288 5698 14691 10992 -2073 -11671 -11223 -3339 3669 5408 6981
1567 6981 7502 1748 -7308 -13938 -8876 5148 13601 10820 610 -6856 -7309 -6081 -3726 1042 8032
1582 8032 12490 6272 -7101 -14370 -9554 1937 10026 8250 3636 321 -3635 -7994 -9767 -3335
1596 -3335 8968 14333 7993 -4902 -12354 -8484 -1310 3215 5770 6748 6846 454 -10053 -13378 -5711
$$ packed form
1495b510J4413L775q940j2069m279K364K907L765N289O321j09j1252j3107j343
1509a4775J0259J3161L485n683n313m232k984l256J632J0894J0662n54j1178j3688
1523a1570j631Q201P722L452N32n0k733q991q365K229J2119J2522L28j0833r073
1538f141k773K473K753L125P239N566l721j2185j1116K160J2611R033J490n333
1552E181n472k409m536k980M928J0986Q993l699j3065r598M48P884P008J739J573
1567F981N21n754r056o630N062J4024Q453k781j0210p466m53J228K355M768O990
1582H032M458o218j3373p269M816J1491Q089j776m614l315l956m359j773O432
1596c335J2303N365o340j2895p452L870P174M525K555R78R8o392j0507l325P667
$$ plain form
1611 -5711 7592 13864 7515 -1654 -6072 -6966 -5160 -3629 1781 10011 11483 2870 -9268 -14297 -6110
1626 -6110 4444 9126 7094 2837 -190 -3945 -9417 -8781 -492 10655 13980 4344 -7259 -11083
1640 -11083 -6970 300 3415 4990 8139 5724 -2236 -11233 -12434 -2034 9549 11822 5337 -3204
1654 -3204 -6128 -5557 -5567 -2898 4293 11089 10537 -351 -11552 -11867 -3668 6030 8536 5388 2814 -635
1670 -635 -5322 -9734 -8014 2636 12558 11528 1349 -8698 -10154 -4203 188 3081 6018 7635
1684 7635 5129 -4805 -12434 -10043 1011 10866 10683 2536 -3413 -5998 -5894 -4770 -1917 6287 11598
1699 11598 7560 -3368 -12306 -10218 -667 6170 7414 5051 2090 -741 -6740 -10403 -5446 4977
1713 4977 12749 9455 -1874 -8709 -8250 -3271 892 3060 6752 8040 2575 -6891 -12579 -7790 4521
$$ packed form
1611e711J3303O272o349r169m418q94J806J531N410Q230J472q613j2138n029Q187
1626f110J0554M682k032m257l027l755n472O36Q289J1147L325r636j1603l824
1640a1083M113P270L115J575L149k415p960q997j201J0400J1583K273o485q541
1654c204k924N71j0K669P191O796n52j0888j1201l15Q199R698K506l148k574l449
1670f35m687m412J720J0650R922j030j0179j0047j456N951M391K893K937J617
1684G635k506r934p629K391J1054R855j83q147n949k585J04J124K853Q204N311
1699A1598m038j0928q938K088R551O837J244k363k961k831n999l663M957J0423
1713D977P772l294j1329o835M59M979M163K168L692J288n465r466n688M789J2311
$$ plain form
1728 4521 10895 8335 1200 -3994 -4885 -5904 -5347 -91 7601 11561 5601 -6215 -12127 -7732 1432
1743 1432 6905 6064 4155 2210 -2050 -7675 -9713 -3315 8152 12390 6624 -3777 -9326 -6412 -2034
1758 -2034 640 3934 7036 7433 1048 -9144 -12009 -4696 6086 10776 5997 -346 -3570 -5243 -6009
1773 -6009 -4602 1395 9395 10537 2305 -7944 -11560 -4899 2749 6279 5630 3967 1504 -3197 -9363
1788 -9363 -8599 -176 9470 11534 3629 -5640 -8284 -5714 -1358 982 4168 8096 6286 -2020 -10223
1803 -10223 -10775 -1739 7912 9058 4659 -1111 -3800 -4925 -6222 -3941 3438 10371 9596 -698 -9826
1818 -9826 -9471 -2943 3567 5647 4727 4238 1236 -5051 -9545 -7616 2554 11032 9489 1398 -6146
1833 -6146 -7437 -3962 -1656 1160 5567 7939 5068 -4269 -11259 -8447 957 8294 7915 2289 -1136
$$ packed form
1728D521O374k560p135n194q91j019N57N256P692L960n960j1816n912M395R164
1743A432N473q41j909j945m260n625k038O398J1467M238n766j0401n549K914M378
1758b034K674L294L102L97o385j0192k865P313J0782M690m779o343l224j673p66
1773f009J407N997Q000J142q232j0249l616O661P648L530o49j663k463m701o166
1788i363P64Q423R646K064p905r269k644K570M356K340L186L928j810q306q203
1803a0223n52R036R651J146m399n770k689j125j297K281P379O933p75j0294r128
1818i826L55O528O510K080r20m89l002o287m494J929J0170Q478j543q091p544
1833f146j291L475K306K816M407K372k871r337o990K812R404P337l79n626l425
$$ plain form
1848 -1136 -3345 -5655 -6110 -2857 5800 10952 6829 -2658 -10156 -8265 -903 3761 5181 4717 3528
1863 3528 336 -6384 -10226 -5262 4749 10785 7408 -1261 -6300 -5992 -3939 -984 1814 6295 8131
1878 8131 2556 -6599 -11322 -6614 3732 8500 6354 2002 -1797 -3510 -5832 -6098 -486 7264 10606
1893 10606 4862 -5578 -9451 -5920 95 4381 4613 4570 3675 -1250 -7427 -9357 -2944 7412 10471
1908 10471 5251 -2322 -6580 -5188 -2808 -1284 2780 7156 7503 893 -8223 -10372 -3959 4593 8061
1923 8061 4680 1076 -1053 -4350 -6345 -5355 821 8616 9658 2368 -6355 -9111 -4381 1227 3675
1938 3675 4617 4816 3176 -2131 -9129 -8300 -249 7903 9276 3306 -3556 -5443 -4721 -2759 -448 3479
1954 3479 8289 6469 -1730 -8878 -9302 -1822 5972 7043 3713 493 -1623 -4183 -6927 -4384 2909
$$ packed form
1848a136k209k310m55L253Q657N152m123r487p498J891P362M664J420m64j189
1863C528l192o720l842M964J0011O036l377q669n039L08K053K955K798M481J836
1878H131n575r155m723M708J0346M768k146m352l799j713k322k66N612P750L342
1893A0606n744j0440l873L531O015M286K32m3q95m925o177j930O413J0356L059
1908A0471n220p573m258J392K380J524M064M376L47o610r116k149O413Q552L468
1923H061l381l604k129l297j995R90O176P795J042p290q723k756M730N608K448
1938C675R42J99j640n307o998Q29Q051Q152J373n970o862j887P22J962K311L927
1954C479M810j820q199p148m24P480P794J071l330l220k116k560k744K543P293
$$ plain form
1969 2909 9170 8447 -251 -7898 -7774 -2819 1502 3726 4305 4904 2169 -4078 -8952 -7144 1685 8990
1985 8990 7455 1382 -4223 -5201 -3907 -2853 -192 5017 8008 5436 -3560 -9874 -7277 369 6340
2000 6340 6354 2874 423 -1608 -5168 -6769 -3422 4726 9986 6054 -2126 -7661 -6648 -1421 1916
2015 1916 3385 4672 4582 1408 -5576 -9439 -4855 3681 9162 6432 -364 -4263 -4644 -4117 -2416 437
2031 437 6134 8460 3033 -5283 -9611 -5908 2365 6255 4827 2831 405 -2071 -5913 -6874 -1256
2046 -1256 6445 9359 4694 -4191 -7815 -4895 -934 2275 3186 5044 4855 -245 -6906 -9009 -3143
2061 -3143 6003 8597 4159 -1215 -4023 -4073 -3787 -2642 1668 7057 7584 1620 -7197 -8980 -3267 3253
2077 3253 5639 3990 1919 162 -3185 -6416 -5621 -30 7913 8963 2012 -5113 -7069 -3639 262
$$ packed form
1969B909O261p23q698p647J24M955M321K224N79N99k735o247m874J808Q829P305
1985H990j535o073n605r78J294J054K661N209K991k572q996o314K597P646N971
2000F340J4l480k451k031l560j601L347Q148N260l932q180n535J013N227L337
2015A916J469J287r0l174o984l863M584Q536N481k730o796l899l81N27J701K853
2031D37N697K326n427q316m328L703Q273L890j428j996k426k476l842r61N618
2046a256P701K914m665q885l624K920L961L209R11J858j89n100o661k103N866
2061c143R146K594m438n374k808n0K86J145M310N389N27n964q817j783N713O520
2077C253K386j649k071j757l347l231P95N591P943J050o951p125j956L430L901
$$ plain form
2092 262 1889 3650 5309 4025 -1522 -8190 -7852 -614 6518 7854 2672 -2090 -3250 -3576 -3898 -1944
2108 -1944 2639 7890 6925 -992 -7999 -7798 -1888 4070 4760 3286 2361 -1 -3276 -7192 -5034 2076
2124 2076 8279 7271 12 -5758 -5454 -2489 -192 1718 3831 5922 3375 -3631 -8650 -6338 1515
2139 1515 7604 6138 1671 -2330 -3178 -3578 -4274 -1770 4616 8025 5026 -2826 -8594 -6046 27 4147
2155 4147 4420 3079 2691 -261 -4890 -7244 -3628 4270 8772 5359 -1606 -5909 -4868 -1483 -302
2170 -302 1719 4958 5715 2098 -4991 -9030 -4435 3024 7038 4747 517 -1920 -2943 -4236 -3958 -609
2186 -609 5833 8438 3346 -4739 -7911 -4687 1022 3880 3561 3296 2287 -1039 -5948 -7296 -1589 5780
2202 5780 8247 3937 -2854 -5216 -3717 -2005 -202 2171 5301 5828 192 -6580 -7870 -2936 4659
$$ packed form
2092B62J627J761J659j284n547o668L38P238P132J336n182m762j160l26l22J954
2108a944M583N251r65p917p007K01N910N958O90j474r25k362l275l916K158P110
2124B076O203j008p259n770L04K965K297J910K113K091k547p006n019K312P853
2139A515O089j466m467m001q48m00o96K504O386L409k999p852n768K548O073M120
2155D147K73j341l88k952m629k354L616P898M502l413o965m303J041L385J181
2170c02K021L239P57l617p089m039M595P459M014k291m230k437j023j293K78L349
2186f09O442K605n092q085l172L224N709K858l19k65j009l326m909j348N707P369
2202E780K467m310o791k362J499J712J803K373L130N27n636o772j290M934P595
$$ plain form
2217 4659 6644 3126 208 -1588 -3012 -4733 -3919 1395 7465 7260 1374 -5832 -7007 -2908 1529
2232 1529 3604 3249 3360 2286 -2079 -7016 -6353 -76 7037 7427 1695 -3124 -4849 -3329 -1653 -571
2248 -571 3152 5870 4614 -1259 -7377 -7053 -741 4956 5722 2900 -61 -1470 -3417 -5065 -2988 2803
2264 2803 7573 5993 -1067 -6041 -5949 -1780 1997 2802 3543 3537 1385 -3124 -7321 -4860 2082 7141 6288
2281 6288 703 -3912 -3878 -3028 -1944 494 4346 6479 3569 -3546 -7304 -5364 929 5056 4604 2003
2297 2003 -150 -1826 -3915 -5003 -1838 4379 7584 4473 -2212 -6292 -4781 -798 1705 2998 3544
2312 3544 3423 359 -4685 -6686 -3474 3213 7404 4639 -578 -3539 -3719 -2834 -1513 616 4886 5818
2328 5818 2052 -4239 -7591 -4042 1942 4575 4248 1668 -317 -2189 -4758 -4451 -717 5233 7315
$$ packed form
2217D659J985l518k918j796j424j721Q14N314O070k05n886p206j175M099M437
2232A529K075l55J11j074m365m937O63O277P113L90n732m819j725J520J676J082
2248e71L723K718j256n873o118L24O312N697P66k822k961j409j947j648K077N791
2264B803M770j580p060m974R2M169L777Q05P41ok152m509m197K461O942N059q53
2281F288n585m615L4Q50J084K438L852K133k910p115l758J940O293M127m52k601
2297B003k153j676k089j088L165O217L205l111o685m080J511L983K503J293N46
2312C544j21l064n044k001L212O687M191k765n217k961j80Q85J321K129M270R32
2328E818l766o291l352L549N984K633l27k580j985j872k569L07L734N950K082
$$ plain form
2343 7315 3025 -3304 -5786 -4352 -134 1934 2871 3915 3131 -680 -5210 -6891 -1753 4547 6439
2358 6439 3800 -1175 -3506 -3352 -3077 -1399 1944 5218 6038 661 -5450 -6767 -3008 2611 4827 3543
2374 3543 1532 -674 -2874 -4868 -4206 726 5625 6373 1742 -4040 -5621 -2921 12 2005 3377
2389 3377 3762 2744 -1540 -6411 -5766 -658 5338 6033 2332 -1346 -3497 -3445 -2610 -967 2812 5597
2405 5597 4667 -635 -5874 -6050 -1208 3091 4158 3223 900 -487 -3349 -4912 -3222 1646 6181 5796
2421 5796 150 -4587 -5138 -2738 495 2167 3410 4078 1741 -2790 -6481 -5048 777 5220 5626 1604
2437 1604 -2203 -3240 -3077 -2468 -274 3084 5841 3965 -2034 -6169 -5023 -421 3595 3801 2276 1203
2453 1203 -1195 -3500 -4837 -2756 3185 6540 4651 -872 -4949 -4519 -1552 591 2170 3457 3692
$$ packed form
2343G315m290o329k482J434M218K068R37J044p84l811m530j681N138O300J892
2358F439k639m975k331J54K75J678L343L274Q20n377o111j317L759N619K216j284
2374C543k011k206k200j994O62M932M899P48m631n782j581K700K933J993J372
2389C377L85j018m284m871O45N108N996O95l701l678k151N2Q35J643L779K785
2405E597r30n302n239j76M842M299J067r35k323j387k862j563J690M868M535l85
2421E796n646m737n51K400L233J672J243O68k337m531l691J433N825M443M06m022
2437A604l807j037J63O09K194L358K757j876n999m135J146M602M016K06j525j073
2453A203k398k305j337K081N941L355j889n523m077M30K967K143J579J287K35
$$ plain form
2468 3692 1294 -3653 -6376 -3458 2055 5969 4701 470 -1936 -3436 -2631 -2402 -10 4184 5713
2483 5713 2475 -3023 -6573 -3993 925 3765 3681 1759 905 -856 -3999 -4919 -1495 4035 6773 3674
2499 3674 -2175 -5043 -3886 -705 769 2097 3916 3666 248 -4169 -6162 -2447 3305 5659 3357
2514 3357 -139 -2375 -2335 -2714 -2222 759 4734 5839 1503 -4342 -5583 -2922 1693 3599 2642 2087
2530 2087 835 -1790 -4698 -4981 -259 5300 6170 2473 -3012 -4547 -2544 -681 730 2169 3848
2545 3848 3323 -442 -5439 -5942 -1274 4279 5488 2365 -602 -1900 -2526 -2854 -2191 1288 5532 5006
2561 5006 156 -5245 -5556 -1482 2290 3333 2470 1883 923 -2148 -5248 -4057 771 5610 5752 611
2577 611 -3282 -3873 -2319 -332 391 2457 4571 3192 -1682 -6161 -5179 568 5068 4414 1330 -1029
$$ packed form
2468C692k398m947k723K918N513L914j268m231k406j500Q05K29K392M194J529
2483E713l238n498l550K580M918K840q4j922q54j761l143r20L424N530K738l099
2499C674n849k868J157L181J474J328J819k50l418m417j993L715N752K354k302
2514C357l496k236M0l79M92K981L975J105m336n845j241K661M615J906r57n55
2530B087j252k625k908k83M722N559Q70l697n485j535K003J863J411J439J679
2545C848n25l765m997n03M668N553J209l123k967j298o26l28O63L479M244n26
2561E006m850n401l11M074L772J043q63n87r60l071l100J191M828M839J42n141
2577F11l893n91J554J987P23K066K114j379m874m479R82N747M500o54l084k359
$$ plain form
2593 -1029 -1683 -2567 -3434 -1823 2572 6139 4324 -1286 -5431 -4574 -622 2359 2695 2185 2401 428 -2793
2610 -2793 -5293 -3504 2404 6188 4387 -696 -3744 -3375 -1601 -812 908 3221 4666 2652 -3351
2625 -3351 -6314 -3834 1536 4684 3381 554 -438 -1452 -2674 -3754 -1426 3684 6192 3203 -2491
2640 -2491 -5574 -3440 306 2059 2238 2485 1966 229 -4217 -5410 -2228 3307 5891 3025 -1536 -3446
2656 -3446 -2753 -1790 -1206 834 3961 4911 1007 -4174 -5991 -2404 2886 4212 2728 595 -548 -1660
2672 -1660 -3395 -3619 505 4671 5781 1487 -3946 -4857 -2323 550 1812 2021 2905 2498 -1018 -4476
2688 -4476 -5249 -633 4649 5100 2028 -1852 -2741 -2012 -1778 -1060 1657 4329 4507 -146 -5288 -5501 -998
2705 -998 3015 4086 1796 737 -399 -2401 -4050 -3357 1139 5255 4851 207 -3719 -4485 -1461 608
$$ packed form
2593a029o54q84q67J611M395L567j815n610m145Q57L952K981L36n10K16j973l221
2610b793k500J789N908L784j801n083l048L69J774P89J720K313J445k014o003
2625c351k963K480N370L148j303k827r92j014j222j080K328N110K508k989n694
2640b491l083K134L746J753J79K47n19j737m446j193L182N535K584k866m561j910
2656c446O93R63N84K040L127R50l904n181j817L587N290J326j484k133j143j112
2672a660j735k24M124M166J110m294n433r11K534K873J262K09Q84m07l516l458
2688d476p73M616N282M51l072l880q89P29K34P18K717K672J78m653n142k13M503
2705i98M013J071k290j059j136k002j649O93M496M116m04m644l926p66L024K069
$$ plain form
2721 608 1459 2407 3276 1878 -2078 -5298 -4499 491 4645 4603 724 -1905 -2427 -2495 -2012 -707 2402 5163
2739 5163 3251 -1538 -5106 -4585 -71 3319 3127 1976 789 -560 -2472 -4218 -2343 2357 5421
2754 5421 4114 -935 -3826 -3149 -1242 631 1478 2685 3657 1162 -2750 -5348 -3146 1899 4909 3468
2770 3468 306 -2129 -2334 -2105 -2181 138 3374 4824 2562 -2581 -5064 -2921 444 2901 2744 1511
2786 1511 909 -901 -3356 -4088 -1385 3233 5350 2640 -1418 -3971 -3046 -780 275 1698 3208 3159
2802 3159 695 -3814 -5275 -2135 2345 4433 2821 -311 -1682 -2103 -2664 -1916 386 4014 4652 848
2818 848 -3280 -5082 -2425 1326 2492 2477 1861 759 -1177 -3744 -3982 -246 3641 4879 1969 -2296
2834 -2296 -3641 -2211 -746 690 2096 3146 2969 -547 -4312 -4519 -898 3267 4181 2057 -381 -1995
$$ packed form
2721F08Q51R48Q69j398l956l220P99M990M154m2l879k629n22o8M83J305L109K761
2739E163j912m789l568N21M514L390j92j151j187j349j912j746J875M700L064
2754E421j307n049k891O77J907J873Q47J207R72k495l912k598K202N045L010j441
2770C468l162k435k05K29p6K319L236J450k262n143k483K143L365K457j57j233
2786A511o02j810k455p32K703M618K117k710m058k553R25K266J055J423J510m9
2802C159k464m509j461L140M480K088j612l132j371m21n61P48K302L628O38l804
2818H48m128j802K657L751J166j5o16j102j936k567k38L736L887J238k910m265
2834b296j345J430J465J436J406J050j77l516l765k07L621M165R14k124k438j614
$$ plain form
2850 -1995 -2111 -2637 -1728 1230 4022 4070 443 -3916 -4779 -1392 1496 2869 2103 1710 597 -2112 -4055
2867 -4055 -3248 722 4308 4266 829 -2450 -3513 -1803 -360 745 2273 3479 2317 -1476 -4652 -3821
2883 -3821 260 3407 3935 1369 -602 -1681 -2344 -2411 -1147 1792 4708 3320 -921 -4263 -3947 -755
2899 -755 2186 2464 1953 1737 114 -2330 -4148 -2421 1662 4215 3949 158 -2854 -3006 -1485 -395
2915 -395 1065 2476 3511 1767 -2367 -4616 -3224 1025 3739 2956 1040 -561 -1725 -2298 -2590 -632
2931 -632 2855 4158 2818 -1677 -4213 -2966 -131 1854 2215 1840 1641 -58 -2840 -4010 -2113 2354
2947 2354 4558 2926 -612 -2897 -2183 -1154 -488 840 2966 3236 1178 -3031 -5042 -2161 1557 3505
2963 3505 2766 711 -553 -1707 -2635 -2530 -151 3394 4411 1580 -2396 -4176 -2370 384 1802 1677
$$ packed form
2850a995j16n26R09K958K792M8l627m359q63L387K888J373p66l93j113k709j943
2867d055Q07L970L586m2l437l279j063J710J443J105J528J206j162l793l176Q31
2883c821M081L147N28k566j971j079o63o7J264K939K916j388m241l342L16L192
2899g55K941K78n11k16j623k444j818J727M083K553k66l791l012j52J521J090
2915c95J460J411J035j744m134k249J392M249K714p83j916j601j164n73k92J958
2931f32L487J303j340m495k536J247K835J985L61l75j99j699k782j170J897M467
2947B354K204j632l538k285P14J029O66J328K126K70k058m209k011K881L718J948
2963C505p39k055j264j154r28J05K379L545J017k831l976j780J806K754J418j25
$$ plain form
2979 1677 2000 1329 -682 -3286 -4125 -844 3145 4424 2072 -1319 -2566 -2284 -1178 -161 1244 2935
2995 2935 3456 -167 -3704 -4712 -1387 2332 3165 1917 276 -838 -1635 -2698 -2350 953 3841 4264
3011 4264 746 -3263 -3764 -1623 593 1602 1823 2143 1359 -1343 -3984 -3565 74 3627 3804 884
3027 884 -1737 -2613 -1782 -1270 -275 2109 3773 2795 -823 -4348 -3874 -388 2487 3006 1372 175 -709
3044 -709 -2307 -2820 -1996 1416 3976 3477 -327 -3303 -3304 -1008 1191 1276 1888 2102 842 -2015 -4173 -3076
3062 -3076 1050 3947 3333 279 -2079 -1968 -1485 -1499 -42 1991 3766 2222 -2097 -4099 -3018 219
3078 219 2736 2333 1279 248 -1031 -1978 -3126 -1302 2288 4695 2686 -1196 -3641 -2298 -390 707
3094 707 1412 1882 2188 288 -2581 -4030 -1706 2106 3977 2281 -92 -1693 -2065 -1642 -1238 260 3217
$$ packed form
2979A677L23o71k011k604q39L281L989J279k352l391j247K82J106J017J405J691
2995B935N21l623l537j008L325L719Q33j248j641j114p97j063L48L303K888M23
3011D264l518m009n01K141K216J009K21L20p84k702k641M19L639L553J77k920
3027H84k621q76Q31N12R95K384J664r78l618l525M74L486K875N19j634j197q84
3044g09j598n13Q24L412K560m99l804k976jK296K199Q5O12K14j260k857k158J097
3062c076M126K897o14l054k358J11M83j4J457K033J775j544m319k002J081L237
3078B19K517m03j054j031j279r47j148J824L590K407k009l882k445J343J908J097
3094G07P05M70L06j900k869j449K324L812J871j696k373j601l72M23M04J498K957
$$ plain form
3111 3217 3694 1369 -2906 -4099 -2088 1015 2789 2256 776 167 -958 -2615 -3132 -441 2822 4238
3127 4238 1531 -1964 -3399 -2058 -214 566 1415 2265 1866 -346 -3230 -4126 -1103 2365 3680 1858
3143 1858 -544 -1598 -1429 -1515 -1073 612 3379 3523 255 -3116 -3978 -1516 1702 2504 1701 1190 67
3160 67 -1273 -2812 -2700 177 3860 3721 933 -2311 -3025 -1465 -27 818 1468 2469 1850 -1132 -3757
3177 -3757 -3440 -75 2951 3249 1267 -868 -1641 -1957 -1563 -901 1842 3665 3108 -424 -3794 -3642 -632
3194 -632 1413 2008 1483 794 -34 -1724 -3293 -2121 990 3974 3186 -171 -2400 -2560 -1160 -146 497
3211 497 1864 2626 1406 -1770 -3751 -2946 843 3140 2929 676 -1234 -1524 -1779 -2216 -434 1959 3927
3228 3927 2342 -1425 -3574 -2799 -320 1855 1893 1421 1006 -89 -2216 -3520 -1385 1977 3828 2314
$$ packed form
3111C217M77k325m275j193K011L103J774n33j480o09j125j657n17K691L263J416
3127D238k707l495j435J341J844P80Q49Q50l99k212k884q96L023L468J315j822
3143A858k402j054J69q6M42J685K767J44l268l371q62K462L218Q02q03n11j123
3160F7j340j539J12K877L683j39k788l244p14J560J438Q45O50J001o19k982k625
3177c757L17L365L026K98j982k135p73l16L94O62K743J823n57l532l370J52L010
3194f32K045N95n25o89q28j690j569J172L111K984p88l357k229j60J400J014O43
3211D97J367P62j220l176j981Q05L789K297k11k253j910k90k55m37J782K393J968
3228C927j585l767k149P75K479K175L8m72m15j095k127j304K135L362J851j514
$$ plain form
3244 2314 -699 -2517 -1777 -921 -249 927 2140 2991 901 -2336 -4057 -2135 1400 3510 2032 227
3260 227 -726 -1569 -1638 -1862 -317 2791 3750 1474 -2149 -3479 -1979 304 1743 1597 1665 998 -436 -2571
3278 -2571 -3032 -710 2509 3805 1543 -1038 -2346 -2079 -724 -162 834 2501 2398 329 -2923 -3816
3294 -3816 -1179 2304 3304 1855 -203 -649 -1427 -2225 -1824 404 2993 3847 339 -2481 -3230 -1340
3310 -1340 871 1589 1275 1632 653 -1156 -3082 -2735 60 3225 3140 631 -1603 -2225 -1175 -1084 -135 1300
3328 1300 2607 2303 -549 -3200 -3162 -474 2521 3001 960 -126 -933 -1660 -2288 -1612 894 3531 2750
3345 2750 -365 -3095 -2897 -669 900 1552 1554 1804 561 -1572 -3356 -2322 882 3470 2862 158 -1600
3362 -1600 -1867 -1436 -673 -37 1777 3053 1643 -1436 -3606 -2617 634 2435 2221 843 -542 -399 -1833
$$ packed form
3244B314l013j818P40Q56O72J176J213Q51k090l237j721J922L535K110j478j805
3260B27r53q43o9k24J545L108R59k276l623j330J500K283J439j46O8o67j434k135
3278b571m61K322L219J296k262k581j308K67J355N62R96J667j03k069l252q93
3294c816K637L483J000j449k058m46p78p98M01K228K589Q54l508k820p49J890
3310a340K211P18l14L57r79j809j926L47K795L165q5k509k234o22J050R1R49J435
3328A300J307l04k852k651L8K688K995M80k041j086q07p27o28O76K506K637p81
3345B750l115k730J98K228J569O52KK50j243k133j784J034L204K588o08k704j758
3362a600k67M31P63O36J814J276j410l079k170R89L251J801k14j378j385J43j434
$$ plain form
3379 -1833 -2352 -725 1670 3484 2462 -1214 -2944 -2355 -271 1198 1315 1569 1589 263 -2255 -3239 -1553
3396 -1553 1402 3414 2241 -218 -1754 -1691 -1110 -613 448 2207 2971 1203 -2133 -3784 -1590 1123
3412 1123 2691 2011 672 57 -1039 -1974 -2342 -438 2513 3472 1562 -1747 -3021 -1881 14 810
3428 810 1389 1770 1582 -12 -2690 -3066 -800 2106 3445 1438 -609 -1734 -1627 -1225 -844 412 2826
3445 2826 2856 257 -2674 -3338 -1170 1357 2078 1580 672 180 -882 -2569 -2136 107 2840 3174 803
3462 803 -1988 -2582 -1365 102 952 1273 1891 1247 -907 -3031 -2848 -273 2730 2737 1054 -960 -1664 -951
3480 -951 -1179 -735 1120 2849 2057 -458 -3076 -2571 -557 1649 2146 971 479 -358 -1478 -2358 -1881
3497 -1881 1035 3437 2563 142 -2302 -2499 -800 247 676 1553 1938 1195 -1526 -3207 -2400 716 3088
$$ packed form
3379a833n19J627K395J814j022l676j730N89K084J469J17K54K0j326k518r84J686
3396a553K955K012j173k459j536O3N81M97J061J759P64j768l336j651K194K713
3412A123J568o80j339o15j096r35l68J904K951R59j910l309j274J140J895P96
3428H10N79L81j88j594k678l76K266K906J339k007k047j125J07M02L81J256K414
3445B826L0k599k931o64K168K527P21m98r08m92j062j687M33K243K733L34k371
3462H03k791n94J217J467Q50L21O18o44k154k124J83K575L003Pj683k014p04P13
3480i51k28M44J855J729p92k515k618N05K014K206M97j175m92q37j120q80M77
3497a881K916K402q74k421k444j97J699J047M29Q77L85p43k721j681Q07L116K372
$$ plain form
3514 3088 2532 210 -1206 -1540 -1394 -1274 -401 1496 3198 1763 -1147 -2990 -2495 184 1824 2069 1280
3531 1280 354 34 -1638 -2718 -1267 1692 3453 2323 -731 -2741 -2028 -320 501 1013 1555 2142 658
3548 658 -1918 -2995 -1618 1421 2992 2116 233 -1106 -1275 -1286 -1556 214 2171 3136 1224 -2012 -3036
3565 -3036 -1547 310 1911 1358 1113 511 -357 -2108 -2397 -589 2443 2985 1502 -1325 -2571 -1633 -477
3582 -477 247 1095 2100 1794 37 -2517 -3172 -905 1859 2788 1466 -210 -1049 -1040 -1538 -1418 474 2775
3600 2775 2848 210 -2366 -2830 -1208 1219 1472 1374 999 393 -865 -2493 -2367 78 2686 2957 775
3617 775 -1801 -1892 -1341 -87 383 1055 2271 1712 -507 -2843 -2955 -11 2229 2235 911 -323 -953 -1018
3635 -1018 -1825 -1007 1031 2749 2470 -380 -2734 -2369 -674 1173 1298 999 1216 294 -1101 -2699 -1983
$$ packed form
3514C088n56k322j416l34J46J20Q73J897J702j435k910j843M95K679J640K45p89
3531A280r26l20j672j080J451K959J761j130l054k010P13J708Q21N12N42N87j484
3548F58k576j077J377L039J571q76j883j339j69j1k70J770J957R65j912l236j024
3565c036J489J857J601n53k45o02q68j751k89J808L032N42j483k827j246R38J156
3582d77P24Q48J005l06j757k554o55K267K764R29j322j676q39Rm98J20J892K301
3600B775P3k638k576m64J622K427K53r8l75o06j258j628J26K445K608K71k182
3617G75k576r1N51J254M70O72J216n59k219k336j12K944K240Oj324j234o30o5
3635a018q07Q18K038J718k79k850k354L65J695J847J25k99K17r22j395j598P16
$$ plain form
3652 -1983 691 3090 2540 78 -1953 -1755 -693 -431 165 1459 2113 1386 -1074 -3235 -2205 410
3668 410 2449 2317 577 -461 -956 -1657 -1552 -938 1621 2928 1792 -896 -2686 -2418 -88 1423 1403
3685 1403 1499 1103 -108 -1833 -2761 -1307 1790 3094 2079 -571 -1599 -1556 -1048 -260 288 1650 2667
3702 2667 823 -1657 -3050 -1590 1151 2520 1635 415 -744 -729 -1529 -2017 -56 2082 3058 1202
3718 1202 -1628 -2636 -1561 166 1023 1005 1071 1047 -172 -2329 -2496 -1058 2246 3217 1082 -708 -1920
3735 -1920 -1072 -879 -536 826 1957 2357 324 -2473 -2931 -818 1402 2173 1252 -19 -297 -1012 -1488
3752 -1488 -1353 329 2617 2652 302 -1892 -2538 -1040 716 915 1361 1518 580 -951 -2525 -2325 50
3769 50 2349 2603 806 -1314 -1309 -1336 -983 -189 692 2490 1849 -520 -2775 -2631 -245 1907 1690 892 300
$$ packed form
3652a983K674K399n50k462k031J98J062K62N96J294O54p27k460k161J030K615
3668D10K039j32j740j038m95p01J05O14K559J307j136k688j790K68K330J511k0
3685A403R6l96j211j725r28J454L097J304j015k650j028M3N08P88N48J362J017
3702B667j844k480j393J460K741J369q85j220j159J5q00m88J961K138R76j856
3718A202k830j008J075J727Q57j8O6k4j219k157j67J438L304R71k135j790j212
3735a920Q48J93L43J362J131M00k033k797m58K113K220P71r21j271k78p15m76
3752a488J35J682K288L5k350k194o46J498J756J99M46J57r38j531j574K00K375
3769E0K299K54j797k120Nk7L53P94Q81J798o41k369k255J44K386K152k17p98n92
$$ plain form
3788 300 -529 -1369 -1985 -1246 903 2792 2168 -375 -2530 -1896 -474 510 1184 1457 1604 622 -1308 -2971
3806 -2971 -1797 566 2704 2194 348 -1257 -1516 -996 -966 -364 1397 2356 1146 -1168 -3067 -1708 278
3823 278 1881 1688 893 419 -403 -1567 -2025 -977 1544 3018 1429 -911 -2488 -1711 -274 913 930
3840 930 1295 1396 510 -1782 -2897 -1295 1063 2581 1707 -117 -1028 -1119 -1118 -766 128 1992 2561 721
3858 721 -1901 -2650 -1727 1045 1967 1360 819 146 -698 -2047 -2135 -515 1942 2739 1334 -1260 -2492 -1238
3876 -1238 -313 562 880 1405 1645 -82 -2064 -2705 -720 1641 2660 1095 -467 -1405 -1015 -1056 -1006 733
3894 733 2475 2402 306 -2166 -2468 -836 925 1366 1513 630 392 -850 -2244 -1756 140 2305 2816
3911 2816 473 -1662 -1792 -1191 111 380 999 1819 1209 -695 -2512 -2423 120 1988 2423 1149 -762
$$ packed form
3788C00q29q40o16P39K149J889o24k543k155O34J422R84O74K73J47r82j930j663
3806b971J174K363K138n10j846j605k59N20L0O02J761R59j210k314j899J359J986
3823B78J603j93p95m74q22j164m58J048K521J474j589k340j577P77J437J187J7
3840I30L65J01q86k292j115J602K358J518q74j824r11r1JL52Q94J864N69j840
3858G21k622p49R23K772R22o07n41o73q44j349q8J620K457P97j405k594j232J254
3876a238R25Q75L18N25K40j727j982o41J985K361J019j565j562r38L90m1N0J739
3894G33J742p3k096k472l02J632J761M41J47q83k38j242j394M88J896K165N11
3911B816k343k135j30O01J302K69O19Q20o10j904j817Q9K543J868M35j274j911
$$ plain form
3928 -762 -1156 -1290 -1357 -407 694 2505 2333 -158 -2383 -2483 -521 986 1561 968 654 25 -1276 -2389
3946 -2389 -1480 1009 2461 2082 44 -1896 -1445 -686 -250 690 1460 2232 1117 -1329 -2616 -1871 706
3963 706 2213 1728 351 -473 -1084 -1071 -1617 -639 1795 2781 1341 -1228 -2571 -1671 582 996 1287 895
3981 895 451 -272 -1729 -2151 -1436 1396 2866 1820 -615 -1744 -1376 -517 -143 564 1638 1905 636
3998 636 -1625 -3134 -1411 1213 2332 1719 343 -573 -1176 -1223 -1244 78 2009 2549 622 -1500 -2451
4015 -2451 -1186 622 1189 1197 1068 645 -240 -1974 -2273 -196 1858 2601 1159 -959 -1725 -1150 -464 -233
4033 -233 774 1800 1800 -290 -2258 -2453 -919 1568 1953 1085 58 -467 -967 -1342 -1439 352 2500 2519
4051 2519 331 -1837 -2318 -748 571 1209 1348 1069 696 -554 -2064 -1899 173 2467 2532 450 -1117
$$ packed form
3928g62l94j34o7R50J101J811j72k491k225j00J962J507N75n93l14o29j301j113
3946b389R09K489J452l79k038j940M51P59M36R40P70P72j115k446j287P45K577
3963G06J507m85j377q24o11J3n46R78K434R86j440k569j343R00K253M14K91l92
3981H95m44p23j457m22P15K832J470j046k435j129L68Q59L74P07J074K67j269
3998F36k261j509J723K624J119o13j376r16o03m7k1J322J931N40j927k122r51
4015b451J265J808N67Qj29m23q85j734k99K077K054P43j442k118p66N75O86K31
4033b33J007J026%k090j968j95J534K487L85q68j027n25n00l75r7J791K148J9
4051B519k188k168m81J570J319O38J39k79l73j250j510J65K072K294O5k082j567
$$ plain form
4068 -1117 -1440 -1020 -519 -258 1142 2191 1425 -474 -2170 -2490 -161 1779 1915 971 -119 -496 -1261
4085 -1261 -1605 -1205 844 2356 2051 -762 -2108 -1869 -260 712 1198 1449 1161 393 -1411 -2377 -1588 1107
4103 1107 2350 1934 208 -1582 -1396 -811 -595 227 1364 2067 1098 -1248 -2591 -1860 367 1758 1693
4120 1693 742 -109 -718 -1075 -1691 -772 1418 2942 1448 -890 -2321 -1643 -140 582 775 1192 1225 159
4138 159 -1721 -2257 -1121 1286 2676 1684 -283 -1285 -1288 -608 -401 480 1726 2308 622 -1562 -2950
4155 -2950 -1136 911 1771 1402 467 -82 -741 -1496 -1411 -119 1934 2571 939 -1297 -2141 -1431 -6 805
4173 805 943 1468 916 -322 -2119 -2678 -206 1712 2374 1099 -851 -1551 -1022 -825 -558 559 2163
4190 2163 2337 -73 -2144 -2396 -697 1117 1834 889 229 -186 -984 -1725 -1463 260 2325 2281 500 -1391
$$ packed form
4068a117l23M20N01K61J400J049p66j899j696l20K329J940J36r44j090l77p65
4085a261l44M00K049J512l05k813j346K39J609R72M86K51k88p68j804r66P89K695
4103A107J243m16j726j790J86N85K16Q22J137P03r69k346j343P31K227J391o5
4120A693r51q51o09l57o16R19K190J524j494k338j431O78J503P22J93M17L3j066
4138A59j880n36J136K407J390r92j967j002lO80K07Q81J246N82j686k184j388
4155b950J814K047Q60l69r35n49o59p55Q5J292K053O37j632k236q44P10J425Q11
4173H05J38N25n52j238j797n59K472J918O62j275j950p00N29J97K67J117J604
4190B163J74k410k071k52J699J814P17r45o60m15p98p41K62J723K065m4j781j891
$$ plain form
4208 -1391 -1965 -679 -18 416 1148 1675 828 -606 -2500 -1747 147 1818 2098 435 -838 -1041 -1128 -949
4226 -949 -549 1078 2457 1598 -520 -2380 -2044 -18 1124 1648 836 238 -161 -914 -1860 -827 1045
4243 1045 2333 1945 -219 -1680 -1934 -659 420 781 1232 1695 544 -1193 -2444 -1500 606 2092
4259 2092 1686 122 -764 -722 -1147 -1070 -157 1449 2338 1291 -1050 -2539 -1605 365 1501 1277 639 458
4277 458 -590 -1472 -1836 -674 1481 2181 1198 -391 -1630 -1219 -419 -147 1055 1459 1204 492 -1658 -2291
4295 -2291 -903 1151 1952 1382 -70 -795 -824 -1106 -1118 163 1748 2199 363 -1476 -2312 -1252 775
4312 775 1593 1172 852 414 -579 -1751 -2146 -209 2007 2444 876 -1313 -1784 -1189 -117 382 748 1798
4330 1798 1680 201 -1981 -2498 -675 1461 1892 962 -107 -849 -1189 -910 -975 504 2177 1976 198
$$ packed form
4208a391n74J286O61M34P32N27q47j434j894P53J894J671K80j663j273k03q7J79
4226i49M00J627J379q59k118j860L36K026J142N24q12n98l99p53r46J033J872
4243A045J288l88k164j461k54J275J079L61M51M63j151j737j251R44K106J486
4259B092m06j564q86M2m25P7R13J606Q89j047k341j489R34J970J136k24o38j81
4277D58j048q82l64J162K155P00r83j589j239M11Q00K72J202M04k55p12k150o33
4295b291J388K054Q01n70j452p25k9k82j2J281J585M51j836j839q36J060K027
4312G75Q18m21l20m38r93j172l95J937K216M37j568k189m71N95J072M99L66J050
4330A798j18j479k182n17J823K136M31r30j069p42l40K79o5J479J673k01j778
$$ plain form
4347 198 -2075 -1954 -723 938 1253 1039 827 451 -987 -1706 -1594 29 2153 1914 469 -1442 -1626
4364 -1626 -997 -119 284 1059 1684 1061 -807 -2592 -1736 73 1778 1815 653 -329 -800 -1163 -1114 -566 1116
4383 1116 2272 1475 -578 -2222 -2148 -329 942 787 919 775 284 -1037 -2222 -1249 868 2302 1732
4400 1732 -135 -1495 -1472 -743 -63 276 1170 1789 689 -1238 -2486 -1574 456 2098 1372 233 -189
4417 -189 -767 -934 -1285 -479 1370 2225 1403 -1116 -2200 -1341 46 815 983 962 722 -127 -1553 -1922 -1091
4436 -1091 1476 2300 1222 -319 -1497 -1411 -930 -330 522 1668 1486 206 -1899 -2588 -1092 981 1853
4453 1853 1048 157 -435 -898 -1498 -1253 129 1699 2204 573 -1373 -2200 -999 69 966 871 995 785
4471 785 -315 -1837 -1960 -456 1863 2024 867 -730 -1238 -986 -468 -266 627 1744 1463 -227 -1883
$$ packed form
4347A98k273J21J231J661L15k14k12l76j438p19J12J623K124k39j445j911j84
4364a626O29Q78M03P75O25o23j868j785Q56J809J705L7j162r82m71l63M9N48J682
4383A116J156p97k053j644P4J819J271j55J32j44m91j321j185R73K117J434n70
4400A732j867j360K3P29O80L39Q94O19j100j927j248R12K030J642p26j139m22
4417a89n78j67l51Q06J849Q55q22k519j084Q59J387P69J68k1k40q49j426l69Q31
4436a091K567Q24j078j541j178Q6M81O00Q52J146j82j280k105o89J496K073Q72
4453A853q05q91n92m63o00K45J382J570N05j631j946q27J201J068Q97r5J24k10
4471G85j100j522j23J504K319J61j157j597n08K52N18K02Q93J117k81j690j656
$$ plain form
4488 -1883 -2165 -238 1299 1563 898 48 -480 -839 -1417 -1107 588 2090 2099 67 -1725 -2104 -998 319
4506 319 833 882 950 595 -711 -1649 -1428 251 1918 1886 364 -785 -1415 -1012 -570 -167 1071 2078 1440
4525 1440 -574 -2569 -1795 32 1446 1568 750 34 -422 -801 -1577 -805 890 2434 1484 -375 -1950
4542 -1950 -1604 -395 657 810 848 1004 507 -1350 -2116 -1361 1033 2028 1472 -131 -1066 -1202 -763 -781 270
4561 270 1443 1690 1044 -1050 -2215 -1516 433 1517 1275 769 242 -358 -961 -1504 -350 1603 2366 1392
4579 1392 -1067 -1844 -1144 -164 716 798 1038 1147 143 -1510 -2226 -779 1042 2398 1167 -310 -1100
4596 -1100 -941 -737 -652 356 1508 1704 492 -1579 -2379 -632 1067 1440 1016 249 17 -533 -1467 -1442
4614 -1442 -62 1972 2457 591 -1228 -1700 -1200 274 456 652 1461 1012 -154 -2183 -1885 -327 1801
$$ packed form
4488a883k82J927J537K64o65q50n28l59n78L10J695J502Rk032j792l79J106J317
4506C19N14M9O8l55j306r38K21J679J667l2j522j149o30M03M42M03J238J007o38
4525A440k014j995P74J827J414J22q18p16m56l79p76P72J695J544r50j859j575
4542a950L46J209J052J53L8J56m97j857p66P55K394R95n56j603r35j36M39j8J051
4561B70J173K47o46k094j165O99J949J084k42n06n27o00o03n43J154J953P63r74
4579A392k459p77P00R80Q80Q2K40J09j004j653p16J447J821J356j231j477p90
4596a100J59K04Q5J008J152J96j212k071q00J747J699L73m24p67k32n50r34K5
4614a442J380K034M85j866j819m72N00J474J82J96Q09m49j166k029K98J558K128
$$ plain form
4631 1801 1883 883 -468 -861 -814 -1105 -318 708 1627 1726 -33 -2019 -2266 -769 1257 1363 737 206
4649 206 55 -665 -1772 -1501 620 1927 2133 -29 -1550 -1383 -587 -172 757 807 1268 892 -678 -1858
4667 -1858 -1869 64 2104 1894 206 -732 -821 -610 -972 -476 845 2125 1514 -337 -2363 -1863 116 1103
4685 1103 1211 741 346 101 -853 -1896 -1048 851 2271 1221 -462 -1471 -1564 -511 212 312 982 1344
4703 1344 634 -956 -2585 -1131 801 1975 1372 9 -761 -610 -889 -949 -59 1485 2187 1052 -1360
4720 -1360 -1987 -1209 442 1136 905 536 360 219 -1171 -1746 -347 1299 2219 1251 -1003 -1614 -1094 -248
4738 -248 104 723 1040 1536 32 -1435 -2182 -854 1053 1854 919 32 -454 -809 -1159 -1090 148 1812
4756 1812 1605 618 -1375 -2098 -668 832 1184 935 552 750 -515 -1694 -1384 -152 1831 2185 359
$$ packed form
4631A801Q2j000j351l93M7k91P87J026R19R9j759j986k47J497K026J06o26n31
4649B06j51p20j107K71K121J307K06k162j521J67P96M15R29N0M61l76j570j180
4667a858j1J933K040k10j688r38q9K11l62M96J321J280o11j851k026N00J979R87
4685A103J08m70l95k45r54j043Q48J899J420j050j683j009r3J053P23J00O70L62
4703A344p10j590j629J454J932J174o03j363p70J51k79o0Q90J544P02j135k412
4720a360o27P78J651O94k31l69j76j41j390n75J399J646R20r68k254o11N20Q46
4738b48L52O19L17M96j504j467p47J328J907Q01r35q87m86l55l50O9J238J664
4756A812k07r87j993p23J430J500L52k49l83J98j265j179L10J232J983L54j826
$$ plain form
4773 359 -1038 -1428 -807 -359 -268 491 1428 1301 -211 -2114 -2132 -119 1366 1554 651 -100 -391 -939 -1181
4792 -1181 -866 451 2066 1633 -274 -1866 -1514 -545 618 595 607 801 396 -1037 -2109 -1478 465 2135
4810 2135 1910 264 -924 -914 -821 -341 -16 876 1633 1066 -840 -2013 -1471 -6 1570 998 306 -225
4828 -225 -533 -923 -1274 -640 1052 2067 1026 -520 -2268 -1516 -101 612 704 790 753 283 -1197 -1925 -864
4847 -864 898 1896 1086 -115 -984 -918 -514 -419 310 1328 1675 517 -1095 -2073 -1302 520 1272 1186 209
4866 209 -45 -527 -1047 -1323 -17 1365 2033 797 -957 -1521 -1101 -72 539 498 873 740 49 -1405
4884 -1405 -1780 -376 1408 1824 781 -169 -1215 -542 -560 -492 424 1457 1553 525 -1349 -1598 -688 707
4902 707 1578 653 347 -321 -609 -1235 -1139 7 1998 1957 351 -1331 -1370 -554 24 606 1068 755 571 -613
$$ packed form
4773C59j397l90O21M48R1P59R37j27j512j903j8K013J485J88r03p51k91n48k42
4792a181L15J317J615m33j907j592L52R69J163k3J2J94m05j433j072O31J943J670
4810B135k25j646j188J0R3M80L25Q92P57n67j906j173N42J465J576n72o92n31
4828b25l08l90l51O34J692J015j041j546j748P52J415P13R2Q6l7m70j480p28J061
4847h64J762R98q10j201q69O6M04R5P29J018L47j158j612r78P71J822P52q6r77
4866B09k54m82n20k76J306J382O68j236j754n64M20J029O11m1L75j33o91j454
4884a405l75J404J784M16j043r50j046O73j8O8R16J033R6j028j874k49R10J395
4902G07Q71r25l06o68k88o26R6J146J991m1j606j682l9Q16N78N82M62l13j84j184
$$ plain form
4922 -613 -1606 -1107 148 1313 1614 541 -533 -726 -1261 -662 -280 587 1687 1362 -184 -1662 -1664 -562
4940 -562 728 1103 832 155 -202 -750 -1332 -1024 577 1964 1675 -231 -1190 -1423 -405 474 411 732 1229
4959 1229 466 -896 -1734 -1414 514 1729 1628 477 -725 -979 -995 -641 32 730 1598 914 -703 -2057
4977 -2057 -1251 39 1195 1235 551 393 -468 -971 -1459 -883 998 1977 1196 -496 -1344 -1123 -245 455 707
4996 707 879 885 459 -1181 -1941 -892 800 1773 1242 114 -489 -628 -952 -871 173 1158 1630 739 -904
5015 -904 -1739 -1231 489 979 952 635 -145 -354 -1134 -1330 -212 1417 1607 491 -610 -1077 -1073 -333 315
5034 315 707 842 741 -143 -1439 -1345 -667 1109 1543 864 -355 -709 -649 -1083 -432 556 1002 1688 284
5053 284 -1339 -1777 -694 866 988 806 268 89 -549 -1184 -1238 -183 1529 1735 439 -898 -1594 -568
$$ packed form
4922f13r93M99J255J165L01j073j074j93n35N99L82Q67J100l25j546j478kJ102
4940e62J290L75k71o77l57n48n82L08J601J387k89j906r59k33J018Q79o3L21M97
4959A229p63j362q38L20J928J215j01j151j202k54j6L54O73O98Q68o84j617j354
4977b057Q06J290J156M0o84j58q61n03m88N76J881R79p81j692q48K21Q78P00K52
4996G07J72Om26j640p60J049J692R73n31j128o03j39l24Q1J044R85M72q91j643
5015i04q35N08J720M90k7l17p80k09p80j96J118J629J90j116j101m67MP40O48
5034C15L92J35j01q84j296R4O78J776M34o79j219l54O0m34O51R88M46O86j404
5053B84j623m38J083J560J22j82n38j79o38o35n4J055J712K06j296j337o96J026
$$ plain form
5071 -568 -63 322 917 1023 1022 -438 -1703 -1544 64 1317 1850 686 -348 -651 -608 -630 -236 209 1480
5090 1480 1422 -189 -1270 -1651 -336 857 1090 487 33 -142 -505 -1535 -1133 312 1525 1449 305 -981
5108 -981 -1117 -452 161 467 797 1203 746 -772 -1951 -936 114 1352 1038 161 -492 -683 -502 -1201
5126 -1201 -119 696 1907 1132 -738 -1752 -1167 183 792 968 429 338 -223 -932 -1441 -498 958 1929
5144 1929 979 -427 -1263 -1006 -227 28 383 1126 1039 404 -873 -1817 -785 637 1483 862 79 -419 -663
5163 -663 -676 -836 -10 1292 1706 475 -1070 -1557 -1008 431 854 749 264 457 -71 -1164 -1407 -132
5181 -132 1303 1674 869 -917 -1193 -736 -461 44 248 1019 1066 6 -1325 -1660 -521 1157 1386 783
5199 783 -191 -773 -638 -942 -636 221 1478 1474 266 -1438 -1488 -345 393 872 745 587 346 -509 -1840
$$ packed form
5071e68N05L85N95J06jj460j265J59J608J253N33j164j034l03M3k2L94M45J271
5090A480n8j611j081l81J315J193K33o03m54j75l63j030M02J445J213p6j144j286
5108i81j36O65O13L06L30M06m57j518j179J015J050J238l14q77o53j91J81o99
5126a201J082Q15J211p75j870j014N85J350O09J76n39r1n61p09n09R43J456R71
5144A929r50j406q36K57P79K55L55P43q7o35j277r44J032J422Q46o21p83m98k44
5163f63j3j60Q26J302M14j231j545m87N49J439M23j05m85J93n28j093k43J275
5181a32J435L71q05j786k76M57K75N05K04P71M7j060j331l35J139J678K29o03
5199G83r74n82J35l04L06Q57J257mj208j704n0J143P38M79j27j58k41q55j331
$$ plain form
5218 -1840 -1081 19 1489 1503 139 -709 -900 -292 -224 -295 691 990 1087 -83 -1693 -1394 -176 990 1420
5237 1420 282 -110 -310 -906 -964 -689 886 1688 812 -517 -1321 -1305 -184 514 776 428 807 221 -873
5256 -873 -1740 -1126 442 1750 1418 12 -788 -1100 -561 -452 128 690 1386 661 -719 -1706 -1203 396
5274 396 1282 972 535 -90 -417 -819 -1035 -481 895 1769 858 -791 -1500 -786 -226 397 700 655 773 -73
5294 -73 -1359 -1571 -524 858 1650 686 -51 -1045 -751 -484 -354 297 931 1384 485 -1124 -1680 -645 533
5313 533 1116 704 312 -123 -370 -1120 -761 -104 1017 1795 409 -956 -1228 -593 81 304 554 916 833
5332 833 -236 -1340 -1379 -219 1299 1457 441 -743 -584 -584 -791 -415 522 1145 1192 -4 -1015 -1444 -253
5351 -253 637 580 349 161 167 -604 -1146 -1027 249 1242 1268 361 -1147 -1112 -564 380 473 592 915 523 -633
$$ packed form
5218a840P59J100J470J4j364q48j91O08O8p1R86K99R7j170j610K99J218J166M30
5237A420j138l92k00n96n8K75J575Q02q76j329q04J6J121O98K62l48L79n86j094
5256h73q67O14J568J308l32j406q00l12N39J09N80N62O96p25j380r87N03J599
5274C96Q86l10m37o25l27m02k16N54J376Q74r11j649p09P14N60O23L03m5J18q46
5294g3j286k12J047J382P92r64p37r94K94K67J30O51O34M53q99j609n56J035J178
5313E33N83m12l92m35k47p50L59O57J121P78j386j365k72O35O74K23K50L62q3
5332H33j069j104l9J160J518J58j016j184J59%k07L76R37O23M7j196j011m29J191
5351b53Q90n7k31j88Op71n42J19J276R93K6r07j508L5N48R44R3J19L23l92j156
$$ plain form
5372 -633 -1104 -1202 202 1347 1055 345 -505 -653 -508 -394 -346 717 1265 984 -432 -1407 -1078 -67 722
5391 722 979 821 -41 -201 -1022 -1262 -856 429 1299 964 -398 -1187 -750 -65 372 471 596 641 131 -796
5411 -796 -1444 -1030 429 1084 937 87 -586 -587 -948 -620 68 853 1259 758 -682 -1431 -1052 22 769 540
5431 540 298 112 -304 -867 -1195 -607 1045 1409 799 -386 -1087 -913 -251 125 558 546 850 245 -973
5450 -973 -1487 -359 1176 1271 868 -38 -386 -389 -639 -785 108 1194 1073 442 -1146 -1325 -571 187 712 544
5470 544 462 179 -318 -1236 -898 99 1095 1089 463 -790 -933 -686 -38 260 450 847 625 -316 -1410 -1070
5490 -1070 -80 703 1011 466 -236 -206 -665 -666 -393 497 1247 1171 -347 -909 -1075 -355 527 534 461 555 108 -446
5512 -446 -999 -763 57 1190 1338 379 -722 -906 -242 -64 372 601 579 294 -570 -1423 -995 192 1136
$$ packed form
5372f33m71r8J404J145k92p10q50j48J45J14M8J063N48k81j416r75L29J011P89
5391G22K57j58q62j60q21k40M06J285Q70l35j362p89M37O85M37R9J25M5n10r27
5411g96o48M14J459O55j47q50o73jl61L28O88P85M06n01j440p49L79J074P47k29
5431E40k42j86m16n63l28N88J652L64o10j185p01J74O62L76M33j2L04o05j218
5450i73n14J128J535R5m03r06l48lk50j46Q93J086j21o31j588j79P54P58N25j68
5470E44q2k83m97r18L38R97R96oo26j253j43K47O48K98J90L97k22r41j094L40
5490a070R90P83L08n45p02L0m59jK73Q90P50p6j518n62j66P20Q82Pp3R4m47n54
5512d46n53K36Q20J133J48r59j101j84O64J78M36K29k2k85q64q53M28J187R44
$$ plain form
5531 1136 914 -43 -228 -514 -640 -746 -340 601 1459 750 -464 -1178 -1005 15 476 472 370 525 -229 -556
5551 -556 -959 -678 548 1265 944 1 -866 -768 -336 -297 572 782 1180 205 -623 -1106 -949 444 1170 790
5571 790 308 -326 -480 -735 -718 54 957 1261 514 -640 -1188 -776 256 474 363 652 140 -132 -818 -1217
5591 -1217 -429 655 1184 441 -557 -917 -478 -449 -3 217 695 785 237 -1002 -1120 -461 863 1026 518
5610 518 146 -497 -460 -557 -634 108 956 1217 101 -824 -1261 -642 230 649 282 357 462 -264 -1152 -986 -144
5631 -144 749 1384 488 -572 -642 -480 -304 -171 305 860 634 -134 -1213 -1052 -142 764 821 455 -36 -114
5651 -114 -322 -1011 -421 611 1226 852 -2 -1123 -845 -383 202 472 521 544 415 -613 -1007 -924 375 1261
5671 1261 885 104 -572 -792 -511 -269 -14 499 938 932 -162 -1402 -1084 57 1104 1039 343 -125 -418
$$ packed form
5531A136k22r57j85k86j26j06M06R41Q58p09j214p14J73J020M61mj02J55p54l27
5551e56m03K81J226P17l21r43q67R8M32L9Q69K10L98r75q28m83J57J393P26l80
5571G90m82o34j54k55J7P72R03L04p47j154n48M12J032K18j11K89n12k72o86l99
5591a217P88J084N29p43r98l60M39K9M46K20M78R0n48j239j18O59J324J63n08
5610E18l72o43L7r7p7P42Q48K61j116r25m37O19Q72M19l67P5J05p26q88J66Q42
5631a44Q93O35q96j060p0J62J76J33M76N55k26p68j079J61R10R06N7l66m91p8
5651a14k08o89N90J032O15l74q54j121K78M62N85K70M9K3j29j028l94Q3J299Q86
5671A261l76p81o76k20K81K42K55N13M39oj094j240L18J141J047o5o96m68k93
$$ plain form
5690 -418 -655 -880 -460 740 1295 696 -386 -821 -738 -3 133 708 522 480 84 -684 -768 -585 533 1060
5710 1060 668 27 -261 -417 -258 -91 13 665 846 249 -740 -1121 -508 181 741 748 10 -163 -299 -633
5730 -633 -666 36 917 1124 331 -638 -870 -527 -112 342 448 728 663 -105 -791 -1160 -344 725 1110 682
5750 682 183 -563 -790 -338 -60 295 697 854 -77 -630 -938 -644 366 749 259 525 -115 -504 -747 -707
5770 -707 42 943 1002 60 -545 -965 -215 224 273 328 758 539 -352 -1085 -978 -260 899 992 425 -277 -329
5791 -329 -563 -135 -75 350 913 637 -156 -1123 -949 -208 501 342 222 -210 10 -261 -783 -668 322 954
5811 954 642 -179 -766 -604 -173 22 170 470 817 335 -547 -1232 -791 208 1147 724 -23 -258 -335 -474
5831 -474 -333 -67 485 960 347 -557 -1011 -852 261 619 470 195 188 -177 -519 -748 -438 649 1006 759
$$ packed form
5690d18k37k25M20J200N55n99j082m35Q3P35J36N75j86m2l96p68q4J83J118N27
5710A060l92o41k88j56J59J67J04O52J81n97r89l81O13O89N60Pp38j73j36l34
5730f33l3P02Q81K07p93r69k32L43M15M54J06K80o5p68o86l69Q16J069L85m28
5750F82m99p46k27M52K78L55M02J57r31n53l08K94J010L83m90K66o40l89k43M0
5770g07P49R01N9r42o05m20P50M39M9N5M30k19q91p33J07P18J159R3n67p02n2
5791c29k34M28O0M25N63k76p93r67J74P41P09j59j20m32K20k71n22J15R90O32
5811I54l12q21n87J62M31J95J48L00L47m82q82o85M41R99R39m23p47k35p7j39
5831d74J41K66N52M75o13r04m54J59J113L58j49k75pl65l42k29L10J087L57k47
$$ plain form
5851 759 -251 -753 -367 -89 -264 314 545 478 255 -865 -1096 -350 382 892 609 4 -239 -272 -476 -475 -52
5872 -52 727 954 213 -763 -1250 -495 172 484 405 264 189 -395 -564 -896 -41 698 914 442 -603 -547 -292
5893 -292 -130 -8 274 690 539 -32 -846 -1172 103 658 1009 309 -178 -173 -434 -595 -270 386 850 711
5913 711 -75 -697 -867 -427 221 416 319 306 479 -256 -569 -484 185 894 756 317 -669 -781 -307 -131 94
5934 94 322 688 709 -242 -1151 -505 120 663 854 102 -131 -328 -359 -442 -583 423 935 913 -318 -793 -739
5955 -739 153 314 225 414 295 -38 -460 -656 -452 445 973 650 31 -459 -468 -123 -303 -18 405 793 388
5976 388 -541 -875 -308 -88 943 798 -37 -235 -575 -399 -419 -106 598 881 426 -327 -1054 -578 169 482
5996 482 423 372 204 -286 -561 -708 -298 511 759 293 -81 -484 -796 -424 -447 118 20 376 350 -652 -889
$$ packed form
5851G59j010n02L86K78j75N78K31o7k23j120k31P46P32N10k83o05k43l3k04JM23
5872e2P79K27p41r76m87P55O67L12p9j41p5n84j69l32Q55P39K16m72j045N6K55
5893b92J62J22K82M16j51n71q14l26J275N55L51p00m87Nk61j61L25O56M64j39
5913G11p86o22j70M40O48J95r7j3J73p35l13Q5O69P09j38m39r86j12M74J76K25
5934I4K28L66K1r51r09O46O25N43J91p52k33j97l1q3j41J006N12k2j231m75N4
5955g39Q92J61q9J89j19l33m22j96K04Q97N28l23o19m90rL45j80K85M23L88m05
5976C88r29l34N67K20J031j45q35j98l40J76k0L13P04K83m55p53p27M76P47L13
5996D82n9n1j68m90k75j47M10Q09K48m66l74m03l12L72k3N65r8L56k6j002k37
$$ plain form
6017 -889 -510 391 594 355 -60 24 -373 -365 -306 169 670 893 188 -506 -729 -419 196 497 479 266 315 -133
6039 -133 -640 -701 -29 889 1159 309 -433 -692 -190 -336 -93 66 570 405 230 -1040 -834 88 493 492 255
6060 255 -143 -298 -576 -406 -525 225 741 646 -36 -679 -623 -157 184 142 401 197 427 -74 -758 -718 -68
6081 -68 870 683 -13 -270 -466 -403 -581 -57 485 775 310 -340 -970 -904 28 537 567 129 -175 -184 -493 -725
6103 -725 -312 328 640 392 -78 -490 -646 -46 237 322 470 527 320 -492 -650 -357 385 826 520 143 -226
6124 -226 -63 -231 -288 108 157 694 378 -191 -779 -322 152 441 684 40 -216 -305 -317 -674 -60 543 787
6145 787 420 -562 -531 -314 -18 91 109 329 574 60 -647 -552 -488 428 634 381 -75 -197 -159 -217 -213 185 826
6168 826 577 55 -311 -661 -221 179 814 549 369 140 -187 -472 -304 168 792 606 -250 -479 -600 -206
$$ packed form
6017h89L79R01K03k39m15Q4l97QN9M75N01K23p05o94k23L10O15L01j8k13M9m48
6039a33n07o1O72R18K70q50p42k59N02j46K43J59N04j65j75j270K06R22M05jk37
6060B55l98j55k78J70j19P50N16r5o82o43N6M66L41m2K59k04K30n01o84M0O50
6081f8R38j87o96k57j96O3j78N24N42K90m65o50o30O6R32N09L0m38l04rl09k32
6103g25M13O40L12k48m70m12j56O00K83Q5J48N7k07q12j58K93P42M41l06l77l69
6124b26J63j68n7L96M9N37l16n69n88M57M74K89K43o44k56q9j2l57O14O03K44
6145G87l67r82L1K17K96J09J8K20K45n14p07R5O4R16K06k53m56j22L8n8ML98O41
6168H26k49n22l66l50M40M00O35k65j80k29l27k85J68M72O24j86q56k29j21L94
$$ plain form
6188 -206 47 133 202 422 398 -301 -595 -862 -78 712 629 169 -314 -370 -240 -333 -250 82 654 582 -8 -605 -336
6211 -336 -367 292 398 33 229 -329 -114 -737 -515 390 743 668 188 -205 -608 27 -91 87 424 436 280
6232 280 -312 -524 -695 279 566 573 260 -383 -155 17 148 -211 401 613 237 -354 -699 -380 36 309 509
6253 509 311 -95 -112 -290 -483 -107 193 729 460 -375 -482 -272 95 96 45 241 504 25 -552 -766 -426
6274 -426 -53 481 327 262 -391 -486 -230 -225 -24 380 538 216 -598 -441 -405 -15 293 661 213 185 -213 -356
6296 -356 -600 60 531 898 261 -41 -614 -245 8 53 579 655 419 -71 -531 -541 -296 475 605 450 -17
6317 -17 45 -155 -267 -244 226 682 490 240 -491 -620 -361 193 499 298 282 -129 13 -645 -460 109 516
6338 516 582 428 -467 -801 -256 -156 -35 202 463 245 -30 -545 -579 -86 596 507 121 -193 -312 -160 -247
$$ packed form
6188b06K53Q6O9K20k4o99k94k67P84P90q3m60m83n6J30r3Q3L32N72p2n90n97K69
6211c36l1O59J06l65J96n58K15o23K22R05L53p5m80l93m03O35j18J78L37J2j56
6232B80n92k12j71R74K87Pl13o43K28J72J31l59O12K12l76n91l45L19M16K73K00
6253E09j98m06j7j78j93L76L00N36k69q35j07K10L67Jn1J96K63m79n77k14L40
6274d26L73N34j54o5o53r5K56NK01M04J58l22q14J57L6L90L08L68m48k8l98j43
6296c56k44O60M71L67o37l02n73L69K53M5N26P6k36m90m60j0K45P71J30j55m67
6317a7O2k00j12K3M70M56j92k50p31j29K59N54L06k01j6m11J42o58J85N69M07
6338E16O6j54q95l34N45J00J21K37K61k18k75n15l4M93O82q9l86l14j19J52q7
$$ plain form
6359 -247 -436 209 625 350 -166 -263 -755 48 80 243 593 258 122 -384 -598 -354 197 590 83 -156 -188
6380 -188 -231 -285 -277 233 409 601 363 -269 -599 -441 137 615 398 258 88 -205 -135 -278 -247 368 464 314
6402 314 16 -582 -428 -193 -13 112 155 235 61 -407 -518 -107 -21 763 299 -235 -282 -367 -258 -152 192 405
6424 405 269 110 -616 -756 -535 377 481 162 199 -11 27 -35 -229 39 502 711 440 -210 -400 -466 -77
6445 -77 239 394 145 173 35 -529 -549 -37 546 545 299 -83 -537 -274 19 50 37 418 608 -68 -232 -398
6467 -398 86 244 392 227 -105 76 -301 -265 -235 264 555 252 323 -277 -554 -148 178 79 245 304 172 -222
6489 -222 -608 -437 -133 300 408 106 -229 -508 -244 -101 85 487 343 347 74 -521 -407 -350 188 127 262
6510 262 79 150 -96 -151 -420 241 669 330 -126 -528 -197 -7 341 33 201 274 -112 -535 -439 -236 155
$$ packed form
6359b47j89O45M16k75n16r7m92Q03L2J63L50l35j36n06k14K44N51L93n07k39l2
6380a88m3n4QN10J76J92k38o32l30J58N78M78k17j40j70k93P0j43L1O15R6j50
6402C14k98n98J54K35J80J25M3Q0j74m68j11M11Q6P84m64n34m7q5J09J06L44K13
6424D05j36j59p26j40K21R12J04l19L7k10L8o2j94K68M63K09k71o50j90o6L89
6445g7L16J55k49K8j38n64k0N12N83jk46l82m54K63K93L1j3L81J90o76j64j66
6467c98M84J58J48j65l32J81l77L6L0M99K91l03P1o00k77M06L26r9J66N9j32l94
6489b22l86J71L04M33J08l02l35k79K64J43J86M02j44Mk73n95J14N7N38o1J35
6510B62j83P1k46n5k69O61M28l39m56m02L31J90L48l08J68P3l86m23R6K03L91
$$ plain form
6531 155 665 424 110 -207 -207 -224 -234 183 127 457 423 -29 -694 -327 149 277 333 352 -337 -5 -126 -339 74
6554 74 281 288 38 -77 -435 -401 76 153 183 267 224 114 -470 -388 -318 195 673 119 -30 -467 -165 65 112 282
6578 282 229 248 29 -399 -354 -465 223 321 533 339 436 -131 -212 -346 -145 203 587 344 -379 -287 -218 209 275
6601 275 115 270 367 1 -313 -279 -114 236 490 272 -350 -336 -85 1 -17 217 304 387 -115 -218 -468 -283
6623 -283 -9 205 298 -58 -79 139 -165 -281 77 375 522 190 -124 -241 90 -33 10 135 333 157 -141
6644 -141 -622 -559 15 580 717 145 -5 -91 -185 -313 -257 233 369 282 -20 -420 -542 -202 249 63 61 219
6666 219 36 -256 -468 -29 310 351 236 -277 -214 -272 -390 215 -58 298 269 267 -61 -607 -156 137 341 362
6688 362 -13 -24 -85 -271 -35 -219 328 82 16 -85 -455 -248 122 38 156 -52 -133 -150 -211 -514 -250 255
$$ packed form
6531A55N10k41l14l17%j7j0M17n6L30l4m52o65L67M76J28N6J9o89L32j21k13M13
6554G4K07Pk50j15l58L4M77P7L0Q4m3j10n84Q2P0N13M78n54j49m37L02K30M7J70
6578B82n3J9k19m28M5j11O88R8K12j94R7n67q1j34K01L48L84k43p23R2O9M27O6
6601B75j60J55R7l66l14L4J65L50K54k18o22J4K51Q6j8K34Q7Q3n02j03k50J85
6623b83K74K14R3l56k1K18l04j16L58K98J47l32l14j17L31j23M3J25J98j76k98
6644a41m81O3N74N65J37n72j50q6r4j28N6M90J36q7l02m00j22L40M51j86kJ58
6666B19j83k92k12M39L39M1j15n13O3n8j18O05k73L56k9kl28n46M51K93K04K1
6688C62l75j1o1j86K36j84N47k46o6j01l70K07L70q4J18k08q1j7o1l03K64N05
$$ plain form
6710 255 392 187 -116 -519 -133 -142 213 177 62 261 30 -307 -415 -322 -44 262 230 21 -135 -111 -209 -22
6732 -22 183 209 250 -53 -87 -544 -316 -121 324 149 -86 256 -120 -284 -415 -196 152 363 161 -166 -144 -80
6754 -80 90 -284 -118 223 175 -156 -418 -252 38 237 557 -106 -44 -90 -376 60 -208 -4 170 455 116
6775 116 -225 -29 -126 200 42 131 37 264 -209 -340 -571 171 133 331 18 127 -286 -167 -165 197 299 404
6797 404 69 -67 -114 -99 35 128 330 -81 -461 -327 -148 -141 -105 41 165 269 84 -354 -404 134 37 98 -95
6820 -95 25 292 53 27 59 92 282 417 148 35 -116 30 -115 135 264 283 12 92 -251 -111 73 203
6842 203 379 135 149 1 -234 -182 -11 218 450 -73 18 -279 -235 194 205 211 223 146 98 -252 -125 -169 201 255
6866 255 464 -21 -87 -202 -108 -80 53 255 284 262 -400 -28 54 85 190 94 -91 152 -96 -76 -44 92 265
$$ packed form
6710B55J37k05l03m03L86rL55l6j15J99k31l37j08R3K78L06l2k09j56K4r8J87
6732b2K05K6M1l03l4m57K28J95M45j75k35L42l76j64j31K19L48K11k02l27K2O4
6754h0J70l74J66L41m8l31k62J66K90J99L20o63O2m6k86M36k68K04J74K85l39
6775A16l41J96r7L26j58Q9r4K27m73j31k31P42l8J98l13J09m13J19KL62J02J05
6797D04l35j36m7J5J34R3K02m11l80J34J79PL6J46J24J04j85m38n0N38r7O1j93
6820i5J20K67k39k6L2L3J90J35k69j13j51J46j45K50J29J9k71Q0l43J40J84J30
6842B03J76k44J4j48k35N2J71K29K32n23R1k97M4M29J1OJ2p7m8l50J27m4L70N4
6866B55K09m85o6j15R4K8J33K02K9k2o62L72Q2L1J05r6j85K43k48K0L2J36J73
$$ plain form
6889 265 265 211 -283 -113 -321 -117 19 31 291 11 -169 -460 -213 -194 570 365 -18 232 34 -176 -128 -94
6911 -94 -78 83 512 -378 -329 -342 -194 -166 93 121 -3 -47 -137 -99 -290 -102 92 276 -167 -364 -50 56 -365
6934 -365 34 63 113 -50 -65 -124 -335 66 468 594 -43 -229 -12 33 -242 -192 249 398 151 -200 -77 27
6956 27 130 312 22 -97 18 -161 -14 -63 -58 132 116 87 -117 -136 35 -137 -200 264 180 61 97 -163 -361
6979 -361 32 103 22 102 104 -67 -214 -198 -64 131 236 -23 24 -158 -264 -20 14 -146 46 245 117 56 -314
7002 -314 -159 -76 250 149 466 65 -144 -349 -221 101 141 155 101 -186 -264 -60 201 245 -1 193 -16 -110
7024 -110 -282 -86 -27 -196 301 180 -46 -163 -202 -121 167 280 -24 37 -106 -203 -84 57 -241 86 157 136
7046 136 -144 -46 -216 -177 -27 67 340 71 144 -130 -242 -75 261 91 270 22 36 218 -150 -232 100 515
$$ packed form
6889B65%n4m94J70k08K04J36J2K60k80j80k91K47J9P64k05l83K50j98k10M8L4
6911i4J6J61M29q90M9j3J48K8K59K8j24m4r0L8j91J88J94J84m43j97L14J06m21
6934c65L99K9N0j63j5n9k11M01M02J26o37j86K17M5k75N0M41J49k47l51J23J04
6956B7J03J82k90j19J15j79J47m9NJ90j6k9k04j9J71j72o3M64q4j19L6k60j98
6979c61L93P1q1Q0Kj71j47J6J34J95J05k59M7j82j06K44L4j60J92J99j28o1l70
7002c14J55Q3L26j01L17m01k09k05J28L22M0J4n4k87p8K04K61M4k46J94k09r4
7024a10j72J96N9j69M97j21k26j17l9Q1K88J13l04O1j43r7J19J41k98L27P1k1
7046A36k80R8j70L9J50R4K73k69P3k74j12J67L36j70J79k48J4J82l68q2L32M15
$$ plain form
7068 515 336 -351 -123 -109 166 -113 71 -297 45 189 300 -338 -30 83 161 360 -40 125 -77 66 156
7089 156 -47 26 -59 58 -11 -42 -446 -204 66 188 69 69 -106 -148 -7 -64 76 315 65 -206 -274 -246 187
7112 187 290 -22 -78 66 122 196 -54 -26 70 347 260 45 77 -93 -21 19 -91 -101 -50 252 -225 -234 -169 -2 76
7137 76 174 47 8 -253 -310 -153 -19 -89 313 255 -275 -437 -389 100 89 204 80 129 203 -134 -237 -47 -115 176
7161 176 365 -315 55 -167 -220 79 -30 124 -64 -16 -145 65 -17 -132 37 337 72 135 -289 53 -40 81
7183 81 -129 147 -14 144 -139 6 -132 -73 187 -225 155 -10 -31 190 -49 151 187 116 -12 -258 28 189
7205 189 -7 144 70 163 22 -50 -54 164 248 -17 -314 159 -128 -114 -2 77 -91 302 124 151 -17 -250 -112
7228 -112 -146 -181 208 -107 -107 3 -196 -31 21 -44 264 51 -364 -228 -149 -129 -69 -61 299 118 -112 -144 -159 -125 179
$$ packed form
7068E15j79o87K28J4K75k79J84l68L42J44J11o38L08J13P8J99m00J65k02J43R0
7089A56k03P3q5J17o9l1m04K42K70J22j19%j75m2J41n7J40K39k50k71o8K8M33
7112A87J03l12n6J44N6P4k50K8R6K77q7k15L2j70P2M0j10j0N1L02m77rO5J67P8
7137G6R8j27l9k61n7J57J34p0M02n8n30j62M8M89j1J15j24M9P4l37j03J90o8K91
7161A76J89o80L70k22n3K99j09J54j88M8j29K10q2j15J69L00k65O3m24L42r3J21
7183H1k10K76j61J58k83J45j38N9K60m12L80j65k1K21k39K00L6p1j28k46K86J61
7205A89j96J51p4R3j41p2mK18Q4k65k97M73k87J4J12P9j68L93j78K7j68k33J38
7228a12l4l5L89l15%J10j99J65N2o5L08k13m15J36P9K0O0QL60j81k30l2j5L4L04
$$ plain form
7253 179 94 77 183 191 -36 -76 166 -96 179 -34 -174 20 -68 -212 -149 104 4 -182 -41 -242 56 13 -16
7276 -16 -53 318 72 123 49 -40 264 -76 27 -50 -78 -135 -122 -61 -131 316 242 -230 -8 -20 42 81 -81 -129 -138 -169
7302 -169 240 10 157 -38 -134 -33 -80 115 147 -69 11 -113 34 77 116 -276 -56 -120 -62 -92 -17 349 140
7325 140 346 52 -250 11 238 49 -36 -188 77 8 -206 -202 30 55 14 79 65 273 -131 -119 107 -228 164
7348 164 159 51 -169 -49 4 -63 232 -40 145 -81 -148 -137 17 -273 -133 27 -18 -89 131 -2 7 204 50
7371 50 -68 -36 -7 226 -89 -18 77 52 165 -101 100 -25 -77 258 222 -29 -18 30 -132 -251 182 -4 145
7394 145 -225 275 -110 -30 -132 6 -10 -142 -37 93 166 -310 -167 75 43 -180 -147 32 64 -147 -75 -45 158
7417 158 200 73 -126 -192 -104 -123 -60 61 -18 237 166 118 -229 211 60 236 -27 -68 14 -26 32 190 181 29 123
$$ packed form
7253A79q5j7J06Qk27m0K42k62K75k13j40J94q8j44O3K53j00j86J41k01K98m3k9
7276a6l7L71k46N1p4q9L04l40J03p7k8n7J3O1p0M47p4m72K22j2O2L9j62m8rl1
7302a69M09k30J47j95r6J01m7J95L2k16Q0j24J47M3L9l92K20o4N8l0P5L66k09
7325A40K06k94l02K61K27j89q5j52K65o9k14MK32K5m1O5j4K08m04J2K26l35L92
7348A64nj08k20J20N3o7K95k72J85k26o7J1J54k90J40J60m5p1K20j33RJ97j54
7371E0j18L2K9K33l15P1R5k5J13k66K01j25n2L35l6k51J1M8j62j19M33j86J49
7394A45l70N00l85Q0j02J38j6j32J05J30P3m76J43K42l2k23L3J79L2k11P2L0K03
7417A58M2j27j99o6Q8j9O3J21p9K55p1m8l47M40j51J76k63m1Q2m0N8J58rj52R4
$$ plain form
7442 123 -104 -86 175 -153 -78 -70 45 258 220 76 315 -15 -221 99 -132 -265 -265 -213 34 -11 -260 -101 -230
7465 -230 55 38 -101 83 -62 19 -268 40 17 -14 120 27 63 -98 -174 205 24 108 -122 215 -75 73 -74
7488 -74 221 90 -7 -249 -170 -27 -145 43 35 -1 -38 207 -216 -210 -298 64 180 -56 305 55 -277 158 207 107
7512 107 -244 85 343 -243 39 -20 -4 -95 158 91 -107 -91 146 -48 -220 -238 116 23 -206 21 130 127 180
7535 180 -99 -78 199 160 200 -5 207 312 81 10 114 -48 -94 19 28 258 -39 -50 -16 -304 -181 -423 -18
7558 -18 47 -32 23 -233 -143 236 84 46 159 169 256 -31 -79 -27 -16 44 -9 -29 269 -3 28 -179 -238 -2 210
7583 210 59 23 -174 176 272 12 -359 -260 181 -84 47 51 -188 125 166 19 -274 -163 46 87 18 -189 268
7606 268 141 240 8 -75 -269 4 -83 -3 191 219 -3 -135 -259 67 -259 153 -91 52 -21 -16 -163 -245 -55
$$ packed form
7442A23k27J8K61l28P5QJ15K13l8j44K39l30k06L20k31j33%N2K47m5k49J59j29
7465b30K85j7j39J84j45Q1k87L08k3l1J34r3L6j61p6L79j81Q4k30L37k90J48j47
7488g4K95j31r7k42P9J43j18J88ql6l7K45m23Oq8L62J16k36L61k50l32M35M9j00
7512A07l51L29K58n86K82n9J6r1K53o7j98J6K37j94j72j8L54r3k29K27J09lN3
7535A80k79K1K77l9M0k05K12J05k31p1J04j62m6J13RK30k97j1L4k88J23k42M05
7558a8O5p9N5k56R0L79j52l8J13J0Q7k87m8N2J1O0n3k0K98k72L1k07n9K36K12
7583B10j51l6j97L50R6k60l71R9M41k65J31Mk39L13M1j47k93J11K09M1o9k07M57
7606B68j27R9k32q3j94K73q7Q0J94K8k22j32j24L26l26M12k44J43p3Nj47q2J90
$$ plain form
7629 -55 -126 -262 -56 109 33 42 13 90 149 -423 14 -97 163 -159 441 51 -41 49 -400 71 -33 49 -260 96
7653 96 -216 67 167 33 -402 106 51 -161 123 -244 -85 -46 -22 249 30 192 -50 90 30 150 273 -14
7675 -14 76 -34 84 147 -1 48 -7 115 62 39 -81 -142 -18 -64 328 63 67 290 -66 -57 -28 -353 -20 7 140
7700 140 -123 -192 -183 70 -81 -100 -38 -105 -178 -14 -325 -208 112 219 -110 6 139 -208 -31 -13 117 188 118
7723 118 256 -46 -221 -15 -146 28 -92 30 -30 57 -119 28 -65 364 81 334 -43 -46 -28 87 -9 130
7745 130 -110 34 -210 297 -172 -61 300 -92 104 -39 87 -13 -150 113 -42 -76 212 -53 -304 110
7765 110 198 113 -197 -299 316 -62 -107 14 -210 -165 224 125 -83 26 -317 153 -74 111 20 410 -60 -18
7787 -18 -21 -251 124 -291 -18 -189 19 -142 -281 -412 48 82 190 277 14 -415 -19 -126 -42 -19 192 -26
$$ packed form
7629e5p1j36K06J65p6Rk9P7N9n72M37j11K60l22O00l90r2R0m49M71j04Q2l09L56
7653I6l12K83J00j34m35N08n5k12K84l67J59L9K4K71k19J62k42J40o0J20J23k87
7675a4R0j10J18O3j48M9n5J22n3k3j20o1J24m6L92k65MK23l56RK9l25L33K7J33
7700A40k63o9RK53j51j9O2o7p3J64l11J17L20J07l29J16J33l47J77J8J30P1p0
7723A18J38l02j75K06j31J74j20J22o0Q7j76J47r3M29k83K53l77lJ8J15r6J39
7745A30k40J44k44N07m69J11L61l92J96j43J26j00j37K63j55l4K88k65k51M14
7765A10Q8q5l10j02O15l78m5J21k24M5L89r9k08J09l43M70k27J85r1L90m70M2
7787a8lk30L75m15K73j71K08j61j39j31M60L4J08Q7k63m29L96j07Q4K3K11k18
$$ plain form
7809 -26 99 30 -114 -198 -22 2 208 -34 -69 -109 312 12 -193 -137 -32 289 92 -36 -168 166 -202 104
7831 104 -54 -286 39 32 -52 -119 -37 441 -38 -280 -240 -8 -62 -154 -125 -180 74 134 116 -186 -353 -48 -184 142
7855 142 -34 217 46 74 -208 258 73 100 -145 137 -310 91 15 200 -61 -32 147 24 -302 -115 145
7876 145 -61 240 -126 -116 -138 -180 -107 64 74 43 198 -277 52 -21 100 -141 -4 -138 -198 -174 -39 -65 -243
7899 -243 90 134 253 93 -66 13 119 -37 121 -70 243 120 -99 -350 8 17 -86 174 15 26 -30 -41
7921 -41 -241 -85 -103 -9 50 -68 -292 -1 212 189 -8 150 100 107 -68 -67 47 19 -11 122 48 -405 -129 57
7945 57 40 265 32 48 344 227 52 -161 48 394 189 -181 -169 108 23 110 -33 21 156 430 -94 203
7967 203 -107 -195 101 129 -162 -174 -252 -69 255 230 -283 -88 -40 -273 -105 -196 108 287 -99 -85 116 76 102
$$ packed form
7809b6J25o9j44q4J76K4K06k42l5m0M21l00k05N6J05L21j97j28j32L34l68L06
7831A04j58k32L25pq4o7Q2M78m79k42M0K32n4r2K9n5K54O0j8l02j67L05j36L26
7855A42j76K51j71K8k82M66j85K7k45K82m47M01p6J85k61K9J79j23l26J87K60
7876A45k06L01l66J0k2m2P3J71J0l1J55m75L29p3J21k41J37j34o0K4J35k6j78
7899b43L33M4J19j60j59P9J06j56J58j91L13j23k19k51L58Rj03K60j59J1n6j1
7921d1k00J56j8R4N9j18k24K91K13k3j97J58n0Pj75JJ14k8l0J33p4m53K76J86
7945E7j7K25k33J6K96j17j75k13K09L46k05l70J2K77q5Q7j43N4J35K74n24K97
7967B03l10q8K96K8k91j2p8J83L24k5n13J95M8k33J68r1L04J79l86J4K01m0K6
$$ plain form
7990 102 -160 -224 -160 -29 332 -21 -209 -29 -172 -208 192 -253 -143 64 42 -185 -205 26 260 -43 152 -47
8012 -47 -186 -117 88 432 -31 63 -111 -55 -389 -95 125 97 120 -27 -118 -163 76 -220 -4 22 254 57 -176
8035 -176 -212 -371 72 117 -46 92 61 -196 -410 87 120 73 93 210 31 -93 140 -70 -119 29 -3 -34 -94
8058 -94 -81 -119 13 87 247 97 -10 52 224 -83 -250 296 88 191 57 -220 -227 -96 67 -151 -70 304 -74
8081 -74 -51 70 -63 140 278 37 26 162 198 103 -340 -237 -417 158 129 -138 -60 -41 166 -19 -114 5 -214
8104 -214 99 -145 37 -172 0 75 -114 -147 -228 69 -18 88 219 -117 -79 123 -194 -175 -105 -142 105 88 -148
8127 -148 152 228 31 -149 15 14 -28 242 -300 -159 -207 19 -8 -203 -7 -46 -99 -5 -222 3 143 121 130 14
8151 14 90 75 -116 -150 -186 212 140 -1 -308 -392 56 -3 170 2 49 105 -174 140 -190 112 -84 -68 229 -264
$$ packed form
7990A02k62o4O4J31L61l53j88J80j43l6M00m45J10K07k2k27k0K31K34l03J95j99
8012d7j39O9K05L44m63R4j74N6l34K94K20k8K3j47r1m5K39k96K16K6K32j97k33
8035a76l6j59M43M5j63J38l1k57k14M97L3m7K0J17j79j24K33k10m9J48l2l1o0
8058i4J3l8J32P4J60j50j07O2J72l07j67N46k08J03j34k77pJ31J63k18Q1L74l78
8081g4K3J21j33K03J38k41j1J36L6r5m43J03j80N75k9k67P8J9K07j85r5J19k19
8104b14L13k44J82k09J72P5j89l3q1K97q7J06J31l36L8K02l17J9P0l7K47j7k36
8127a48L00P6j97j80J64jm2K70n42J41m8K26k7j95J96l9n3R4k17K25J40k2Rj16
8151A4P6j5j91l4l6L98p2j41l07q4M48n9J73j68M7N6k79L14l30L02j96J6K97m93
$$ plain form
8175 -264 -367 -323 104 471 -17 -199 109 -168 -45 -142 -74 209 14 258 43 158
$$ packed form
8175b64j03M4M27L67m88j82L08k77J23r7O8K83j95K44k15J15
8191A58
$$ Imaginary data points
##PAGE= N=2
##DATA TABLE= (X++(I..I)), XYDATA
$$ plain form
0 0 0 0 0 0 0 0 0 0 0 0 0 0 0 0 0 0 8 -8 8 -8 8 -8 16 -16 16 -23 24 -27 32 -35 42 -49 55 -61 67 -77 87 -99
38 -99 108 -123 134 -149 166 -183 203 -223 247 -271 299 -329 363 -399 440 -487 538 -597 663 -743
58 -743 832 -939 1071 -1231 1438 -1715 2104 -2685 3656 -5567 10758 -55832 -166079 -70142
72 -70142 15608 65549 72860 46605 12552 -14480 -71859 -110722 -50069 86051 138174 72157
84 72157 -35971 -104451 -76729 -10287 8120 32232 75848 79057 12112 -89916 -127628 -54311
96 -54311 59520 120038 68702 -15125 -37595 -44537 -62069 -46549 11231 90630 113845 31490
108 31490 -84729 -121213 -49186 33571 58570 57915 38059 10128 -20187 -85085 -100635 36
120 36 100618 107246 36249 -50949 -83859 -52230 -6558 10833 30955 79311 69521 -21488 -97489
$$ packed form
0@%%%%%%%%%%%%%%%%Qj6J6j6J6j6K4l2L2l9M7n1N9o7P7r1J04j16J28j44J64j86
38i9K07k31K57k83L15l49L86m26M70n18N70o28O92p62Q39r27J025j135J260j406
58g43J575j771K010k302K669l153L819m789O341r223J6325o6590j10247R5937
72g0142Q5750M9941P311k6255l4053k7032n7379l8863O0653J36120N2123o6017
84G2157j08128o8480K7722O6442J8407K4112M3616L209o6945j02028l7712P3317
96e4311J13831O0518n1336q3827k2470o942j7532J5520N7780P9399K3215q2355
108C1490j16219l6484P2027Q2757K4999o55j9856k7931l0315o4898j5550J00671
120C6J00582O628p0997q7198l2910L1629M5672J7391K0122M8356r790r1009p6001
$$ plain form
133 -97489 -101055 -20297 78626 90499 35417 -11258 -32238 -43864 -58627 -37012 33609 92573
145 92573 87858 56 -95471 -90035 -19889 31876 50320 45375 35401 9665 -41883 -84605 -70480
158 -70480 21101 103029 81187 6746 -51135 -67348 -35614 -7572 6564 46589 77223 43928
170 43928 -38900 -97438 -73216 6296 74037 73016 17720 -11766 -21861 -50654 -56141 -18286
182 -18286 44633 92983 62738 -26566 -85825 -68512 -5059 33132 39684 42739 31927 1227
194 1227 -50015 -85980 -43638 43534 87712 61331 -6823 -52702 -51579 -30013 -7320 13165
206 13165 50254 73895 22170 -56522 -84171 -51579 20930 69339 53027 13781 -11172 -27821
218 -27821 -48910 -51141 -3361 58195 80579 41404 -40975 -79176 -45019 -99 28390 41061
$$ packed form
133i7489l566Q0758R8923J1873n5082m6675k0980j1626j4763K1615P0621N8964
145I2573m715q7802r5527N436P0146N1765J8444m945r974k5736n1548m2722J4125
158g0480R1581Q1928k1842p4441n7881j6213L1734K8042J4136M0025L0634l3295
170D3928q2828n8538K4222P9512O7741j021n5296k9486j0095k8793n487L7855
182a8286O2919M8350l0245q9304n9259J7313O3453L8191O552L055j0812l0700
194A227n1242l5965M2342Q7172M4178k6381o8154m5879J123K1566K2693K0485
206A3165L7089K3641n1725p8692k7649L2592P2509M8409j6312l9246k4953j6649
218b7821k1089k231M7780O1556K2384l9175q2379l8201L4157M4920K8489J2671
$$ plain form
230 41061 38919 27968 -9913 -59962 -72669 -23824 54683 80984 38261 -15358 -47237 -44610
242 -44610 -23252 -8763 21765 59602 57523 5860 -60950 -79030 -30423 32473 61846 41357
254 41357 6784 -8054 -32251 -54329 -37303 9889 61518 73231 19361 -48443 -68996 -34150
266 -34150 8666 25713 38551 40732 17470 -20132 -62631 -64000 -1817 59196 67695 27732 -23946
279 -23946 -43973 -37143 -22712 -1580 27952 60242 49121 -13783 -64335 -64853 -17480 41071 54201
292 54201 30700 6705 -14384 -34697 -49570 -31328 23999 65937 59449 3550 -55798 -57690
304 -57690 -21897 8925 30508 36692 33878 14315 -30858 -64644 -49771 11806 64693 56056 12822
317 12822 -25201 -43193 -32501 -16735 532 36579 58898 34042 -23188 -67687 -53606 -1223
$$ packed form
230D1061k142j0951l7881n0049j2707M8845P8507K6301m2723n3619l1879K627
242d4610K1358J4489L0528L7837k079n1663o6810j8080M8607O2896K9373k0489
254D1357l4573j4838k4197k2078J7026M7192N1629J1713n3870o7804k0553L4846
266c4150M2816J7047J2838K181k3262l7602m2499j369O2183O1013Q499l9963n1678
279b3946k0027O830J4431K1132K9532L2290j1121o2904n0552n18M7373N8551J3130
292E4201k3501k3995k1089k0313j4873J8242N5327M1938o488n5899n9348j892
304e7690L5793L0822K1583O184k814j9563m5173l3786J4873O1577N2887q637m3234
317A2822l8023j7992J0692J5766J7267L6047K2319k4856n7230m4499J4081N2383
$$ plain form
329 -1223 42240 49369 23216 1551 -14254 -40218 -46104 -17460 30395 67585 48328 -13279 -55440
342 -55440 -49476 -12943 14141 26689 37962 31322 3973 -35820 -64845 -36770 26581 61418
354 61418 47516 2526 -31641 -35487 -28729 -15456 7378 39819 57366 22325 -36182 -63030
366 -63030 -42868 9710 46505 38842 18228 292 -19320 -39419 -44021 -9015 42230 63076
378 63076 34911 -23857 -55915 -37602 -7470 14962 29238 33298 29201 -1022 -46528 -59715
390 -59715 -22981 36161 59898 33640 -4414 -31106 -34327 -22441 -14129 10522 47442 51322 10180
403 10180 -44190 -62136 -27159 19016 42929 33580 11652 -374 -20077 -44081 -37774 419
415 419 48196 61868 18953 -33418 -50066 -29548 102 14495 26259 35709 23867 -9694 -50345
$$ packed form
329a223M3463P129k6153k1665j5805k5964n886K8644M7855L7190j9257o1607m2161
342e5440N964L6533K7084J2548J1273o640k7349l9793k9025K8075O3351L4837
354F1418j3902m4990l4167l846O758J3273K2834L2441J7547l5041n8507k6848
366f3030K0162N2578L6795p663k0614j7936j9612k0099m602L5006N1245K0846
378F3076k8165n8768l2058J8313L0132K2432J4276M060m097l0223m5506j3187
390e9715L6734N9142K3737k6258l8054k6692l221J1886Q312K4651L6920L880m1142
403A0180n4370j7946L4977M6175K3913r349k1928j2026j9703k4004O307L8193
415D19M7777J3672m2915n2371j6648K0518K9650J4393J1764R450j1842l3561m0651
$$ plain form
428 -50345 -56729 -7299 43519 53118 25081 -13506 -28384 -27334 -24180 -10840 17863 49865 46191
441 46191 -4214 -49561 -53913 -17980 28002 38591 23635 12540 -1900 -25146 -44524 -33591
453 -33591 13417 53188 52029 7848 -40582 -44069 -18280 372 15209 27020 34583 21876 -20921
466 -20921 -55483 -45232 4355 49017 45785 12337 -14082 -26848 -24809 -21991 -10397 26357 53463
479 53463 34879 -14888 -54063 -44742 -3612 27693 33436 20450 10233 -1923 -30613 -45799
491 -45799 -23414 22010 56926 41925 -7692 -39165 -35843 -14098 2663 13173 30266 35319
503 35319 12309 -28281 -57134 -34340 19431 46636 36004 5502 -16434 -21135 -25560 -23758 -2034
516 -2034 32745 52805 24396 -28282 -51421 -34088 4861 29578 25016 18518 12221 -8019 -34884
$$ packed form
428e0345o384M9430N0818R599k8037l8587j4878J050L154J3340K8703L2002l674
441D6191n0405m5347m352L5933M5982J0589j4956j1095j4440k3246j9378J0933
453c3591M7008L9771j159m4181m8430l487K5789J8652J4837J1811P563j2707m2797
466b0921l4562J0251M9587M4662l232l3448k6419j2766K039K818J1594L6754K7106
479E3463j8584m9767l9175R321M1130L1305N743j2986j0217j2156k8690j5186
491d5799K2385M5424L4916j5001m9617l1473L322K1745J6761J0510J7093N053
503C5319k3010m0590k8853K2794N3771K7205j0632l0502k1936m701m425J802K1724
516b034L4779K0060k8409n2678k3139J7333L8949K4717m562o498o297k0240k6865
$$ plain form
529 -34884 -44254 -13660 34291 53427 29718 -16581 -39823 -25914 -9881 604 16460 31558
541 31558 33626 4240 -39579 -51924 -20421 26240 45130 25362 485 -14048 -22016 -24840 -22482
554 -22482 4098 42172 46955 10509 -34364 -48532 -21065 11050 24899 23876 17016 10186 -12140
567 -12140 -40716 -38437 -1546 40193 49651 14672 -23007 -32621 -21775 -7833 1696 18145 36116
580 36116 27645 -6240 -43897 -47291 -5743 32923 36728 19123 -3007 -13950 -20645 -27713 -17376
593 -17376 13746 44675 40425 -2878 -39404 -39431 -13667 15111 22888 19465 19334 6485 -20419 -41431
607 -41431 -31837 10830 44146 39073 6027 -25941 -28670 -16126 -8932 3872 23465 35506 22363
620 22363 -17941 -46803 -35059 3465 34363 31580 11558 -2335 -13893 -23043 -26702 -13529 23413
$$ packed form
529c4884r370L0594M7951J9136k3709m6299k3242J3909J6033J0485J5856J5098
541C1558K068k9386m3819j2345L1503M6661J8890j9768k4877j4533p968k824K358
554b2482K6580L8074M783l6446m4873j4168K7467L2115J3849j023o860o830k2326
567a2140k8576K279L6891M1739R458l4979l7679r614J0846J3942R529J6449J7971
580C6116q471l3885l7657l394M1548L8666L805j7605k2130j0943o695p068J0337
593a7376L1122L0929m250m3303l6526k7K5764K8778P777l423j31j2849k6904k1012
607d1431R594M2667L3316n073l3046l1968k729J2544P194J2804J9593J2041j3143
620B2363m0304k8862J1744L8524L0898k783k0022j3893j1558r150l659J3173L6942
$$ plain form
633 23413 47097 28471 -12325 -40632 -32373 -4030 14432 19768 19602 17296 3499 -27382 -42297
646 -42297 -20286 18792 44670 31202 -5349 -24674 -23466 -15102 -6848 5763 27604 35157 12473
659 12473 -24973 -45889 -25882 13734 31883 25443 8778 -4658 -13098 -24925 -26594 -3875 29167
672 29167 44457 19565 -22004 -37300 -24480 -767 15378 17715 20325 17359 -4553 -31198 -39032
685 -39032 -12043 28112 40790 21254 -9483 -24287 -18870 -14300 -7541 11920 29869 31504 4781
698 4781 -33320 -41867 -15183 17915 30753 19100 5948 -3423 -16030 -26294 -23459 3217 36088
711 36088 38296 8703 -24787 -35395 -17082 3472 13127 18554 20379 14417 -9786 -36670 -32793
724 -32793 -1226 30465 37143 13018 -12979 -20462 -18148 -12956 -4627 14565 33479 25766 -5351
$$ packed form
633B3413K3684j8626m0796k8307Q259K8343J8462N336j66k306j3797l0881j4915
646d2297K2011L9078K5878j3468l6551j9325J208Q364Q254J2611K1841P553k2684
659A2473l7446k0916K0007L9616J8149o440j6665j3436q440j1827j669K2719L3042
672B9167J5290k4892m1569j5296J2820K3713J6145K337K610k966k1912k6645p834
685c9032K6989M0155J2678j9536l0737j4804N417M570O759J9461J7949J635k6723
698D781l8101q547K6684L3098J2838j1653j3152r371j2607j0264K835K6676L2871
711C6088K208k9593l3490j0608J8313K0554R655N427J825n962k4203k6884L877
724c2793L1567L1691O678k4125k5997p483K314N192Q329J9192J8914p713l1117
$$ plain form
737 -5351 -35607 -36456 -5596 21385 25121 16648 4633 -5378 -16709 -28441 -18650 12111 37780
750 37780 32676 -1259 -28845 -28678 -12278 5379 12743 16970 22272 10164 -17148 -36191 -27442
763 -27442 7428 34206 29684 6342 -14685 -18748 -14990 -13886 -1312 20228 32179 20747 -13291
776 -13291 -37253 -27581 828 22410 22488 11700 4649 -6897 -20813 -26643 -13785 18786 38826
789 38826 23754 -7796 -28708 -24679 -6419 5398 12183 19019 19867 5928 -22888 -36314 -17737
802 -17737 13579 33286 24141 -668 -13447 -16109 -15937 -11967 1112 24076 32595 12176 -19612
815 -19612 -36102 -20959 7935 20692 18247 11062 2712 -7627 -22816 -26477 -5417 24260 36261
828 36261 16405 -14505 -26401 -19116 -4954 6681 12093 19819 19948 -1320 -26697 -33085 -11125
$$ packed form
737e351l0256q49L0860K6981L736q473j2015j0011j1331j1732R791L0761K5669
750C7780n104l3935k7586J67J6400J7657P364M227N302j2108k7312j9043Q749
763b7442L4870K6778m522k3342k1027m063L758J104J2574K1540J1951j1432l4038
776a3291k3962R672K8409K1582P8j0788p051j1546j3916n830J2858L2571K0040
789C8826j5072l1550k0912M029J8260J1817O785O836Q48j3939k8816j3426J8577
802a7737L1316J9707r145k4809j2779k662J72L970J3079K2964Q519k0419l1788
815a9612j6490J5143K8894J2757k445p185q350j0339j5189l661K1060K9677J2001
828C6261j9856l0910j1896P285J4162J1635N412P726J29k1268k5377o388K1960
$$ plain form
841 -11125 20408 30649 17224 -2595 -14001 -14211 -15837 -11699 7622 26673 28279 5353 -25899
854 -25899 -32397 -12643 10274 19562 15004 9570 2938 -11780 -24824 -22769 319 29389 31760
867 31760 7765 -17015 -24515 -13548 -2308 4081 14172 21339 16445 -6682 -31054 -28341 -2265
880 -2265 22523 27808 11092 -5790 -11060 -14737 -16057 -8502 11010 29913 23805 -3432 -27400
893 -27400 -28518 -6174 13214 16347 14031 9368 358 -13721 -26619 -18631 8912 30320 26764
906 26764 728 -19637 -20278 -11594 -1277 6169 14261 22529 12121 -14330 -31114 -23217 4595
919 4595 25222 21994 6818 -6572 -11272 -13719 -16720 -5154 17343 29192 18814 -10302 -29767
932 -29767 -21482 -1065 13381 15233 11724 9247 -1310 -18581 -25428 -12977 14799 31446 19457
$$ packed form
841a1125L1533J0241j3425j9819j1406k10j626M138J9321J9051J606k2926l1252
854b5899o498J9754K2917R288m558n434o632j4718j3044K055K3088K9070K371
867C1760k3995k4780p500J0967J1240O389J0091P167m894k3127k4372K713K6076
880b265K4788N285j6716j6882n270l677j320P555J9512J8903o108k7237k3968
893b7400j118K2344J9388L133k316m663r010j4079j2898P988K7543K1408l556
906B6764k6036k0365o41Q684J0317P446Q092Q268j0408k6451j6784P897K7812
919D595K0627l228j5176j3390m700k447l001J1566K2497J1849j0378k9116j9465
932b9767Q285K0417J4446J852l509k477j0557j7271o847J2451K7776J6647j1989
$$ plain form
945 19457 -4429 -19207 -18166 -7713 -1242 6800 18020 20601 6958 -18998 -30868 -15357 9828
958 9828 24233 18676 2505 -5901 -10762 -16282 -14766 -832 20771 29193 10842 -15348 -27806
971 -27806 -16820 3645 12332 12955 12892 7562 -4855 -21013 -25183 -5491 20091 28696 13437 -9451
985 -9451 -18014 -14034 -7528 56 8088 19311 20342 168 -23192 -27600 -9546 14774 22259 13186
999 13186 1411 -6638 -10912 -16522 -13719 5335 23777 25094 4825 -20092 -24867 -10398 4751
1012 4751 12250 12038 11502 6707 -8940 -22945 -20973 9 23951 25071 6542 -10772 -17194 -11831
1026 -11831 -5871 -736 11589 21122 16219 -4835 -26230 -23738 -1982 16115 20099 9794 -872
1039 -872 -5353 -12411 -17241 -10047 8896 26294 20998 -2784 -21139 -21621 -5828 6837 9719 12371
$$ packed form
945A9457k3886j4778J041J0453O471Q042J1220K581j3643k5956j1870J5511K5185
958I828J4405n557j6171q406m861n520J516J3934K1603Q422j8351k6190j2458
971b7806J0986K0465Q687O23o3n330j2417j6158m170J9692K5582Q605j5259k2888
985i451q563L980O506P584Q032J1223J031k0174k3360m408J8054K4320P485r073
999A3186j1775q049m274n610K803J9054J8442J317k0269k4917m775J4469J5149
1012D751P499k12n36m795j5647j4005J972K0982K3942J120j8529j7314o422N363
1026a1831N960N135J2325R533m903k1054k1395K492K1756J8097L984j0305j0666
1039h72m481p058m830P194J8943J7398n296k3782j8355m82J5793J2665K882K652
$$ plain form
1053 12371 12210 3691 -11669 -24770 -16873 7134 24244 21158 1811 -12740 -13803 -10771 -5812
1066 -5812 1745 12984 22082 11827 -11701 -25430 -19007 2440 18308 15855 7249 -479 -6712
1079 -6712 -13203 -17674 -6572 14668 25379 16109 -7445 -22089 -16305 -2608 6323 10060 11789
1092 11789 12015 1529 -16561 -23321 -11921 11992 24869 14542 -2357 -11810 -12851 -8914 -5670
1105 -5670 3180 17108 20348 7144 -15636 -25839 -12252 6898 16666 13715 4351 -456 -6803
1118 -6803 -15913 -15430 -2006 17811 24995 8974 -11783 -20271 -12974 311 6318 9428 13288 9965
1132 9965 -2676 -18582 -22603 -4863 15982 22430 10827 -5561 -11186 -10297 -9386 -4283 6130 18181
1146 18181 19284 510 -19362 -22020 -7752 10571 15508 10159 4546 -1589 -8332 -16631 -14368 4074
$$ packed form
1053A2371j61q519j5360j3101P897K4007J7110l086j9347j4551j063L032M959
1066e812P557J1239R098j0255k3528j3729O423K1447J5868k453q606p728o233
1079f712o491m471J1102K1240J0711r270k3554j4644N784J3697Q931L737J729
1092A1789K26j0486j8090o760J1400K3913J2877j0327j6899r453j041L937L244
1105e670Q850J3928L240j3204k2780j0203J3587J9150R768k951r364m807o347
1118f803r110M83J3424J9817P184j6021k0757q488P297J3285O007L110L860l323
1132I965j2641j5906m021J7740K0845O448j1603j6388n625Q89R11N103J0413J2051
1146A8181J103j8774j9872k658J4268J8323M937n349n613o135o743q299K263J8442
$$ plain form
1160 4074 20943 20953 4096 -15275 -18401 -8325 552 6279 10059 13061 9017 -7101 -20989 -18156
1174 -18156 -86 18847 19673 5213 -5799 -10663 -10205 -8146 -3623 9614 19743 14412 -3881
1187 -3881 -21225 -18973 -2119 10449 13847 8651 3166 -1398 -10885 -17329 -10310 7729 22290 17012
1201 17012 -1959 -15332 -15802 -5741 1971 5226 11283 13725 5300 -10372 -21839 -14623 6120
1214 6120 18871 15685 2520 -7416 -8589 -9722 -9127 -616 12026 20285 10858 -9722 -20513 -14634
1228 -14634 1111 11942 11269 7902 4120 -3354 -12300 -17313 -6565 12844 21188 12756 -5155 -16067
1242 -16067 -12178 -4098 1358 6563 11523 13207 2409 -14841 -20405 -9503 9371 19192 11352 254
1256 254 -6179 -9054 -9566 -8292 1152 15468 18543 5898 -12482 -20491 -9872 4125 10624 10284
$$ packed form
1160D074J6869J0j6857j9371l126J0076Q877N727L780L002m044j6118j3888K833
1174a8156J8070J8933Q26j4460j1012m864M58K059M523J3237J0129n331j8293
1187c881j7344K252J6854J2568L398n196n485m564r487o444P019J8039J4561n278
1201A7012j8971j3373m70J0061P712L255O057K442q425j5672j1467P216K0743
1214F120J2751l186j3165r936j173j133N95Q511J2642Q259r427k0580j0791N879
1228a4634J5745J0831o73l367l782p474q946n013J0748J9409Q344q432j7911j0912
1242a6067L889Q080N456N205M960J684j0798j7250n564J0902J8874R821p840j1098
1256B54o433k875n12J274R444J4316L075j2645j8380q009J0619J3997O499l40
$$ plain form
1270 10284 6406 3231 -4403 -15292 -15346 -2068 15124 20626 7430 -8149 -14166 -10236 -2602 1943
1284 1943 6856 13582 11303 -1660 -16069 -19116 -4780 12002 16262 9045 -2089 -6282 -7862 -10694
1298 -10694 -6655 4681 16516 17054 1130 -15525 -17078 -6616 5940 10531 8306 6890 2182
$$ packed form
1270A0284l878l175p634j0889n4J3278J7192N502j3196j5579o017L930P634M545
1284A943M913O726k279j2963j4409l047J4336J6782M260p217j1134m193j580k832
1298a0694M039J1336J1835N38j5924j6655j553J0462J2556M591k225j416m708
$$ [...]
8191c4
##END NTUPLES=NMR FID
##END=
