##TITLE=1H_Pr AcCN
 DMSO
 8 sc, 
 22.3.2023
##JCAMPDX= 6.0         $$ Bruker NMR JCAMP-DX V2.0
##DATA TYPE= NMR FID
##DATA CLASS= NTUPLES
##ORIGIN= UXNMR, Bruker Analytische Messtechnik GmbH
##OWNER= root
$$ XWIN-NMR		Version 3.5
$$ Wed Mar 22 15:21:06 2023 Russian Standard Time (UT+4h)  she@DPX200
##.OBSERVE FREQUENCY= 200.13135
##.OBSERVE NUCLEUS= ^1H
##.DELAY= (6, 6)
##.ACQUISITION MODE= SIMULTANEOUS
##.ACQUISITION SCHEME= undefined
##.AVERAGES= 8
##.DIGITISER RES= 18
##SPECTROMETER/DATA SYSTEM= spect
##.PULSE SEQUENCE= zg30
##.SOLVENT NAME= DMSO
##.SHIFT REFERENCE= (INTERNAL, DMSO, 0, 15.7039)
##AUDIT TRAIL= $$ (NUMBER, WHEN, WHO, WHERE, WHAT)
$$ ##TITLE= Audit trail, XWIN-NMR		Version 3.5
$$ ##JCAMPDX= 5.01
$$ ##ORIGIN= Bruker BioSpin GmbH
$$ ##OWNER= she
$$ F:/spectra/data/she/nmr/H-F/1/audita.txt
$$ ##AUDIT TRAIL=  $$ (NUMBER, WHEN, WHO, WHERE, WHAT)
(   1,<2023-03-22 15:20:03.03 +0400>,<she>,<DPX200>,
      <created by zg, POWCHK disabled, PULCHK disabled
       configuration hash MD5:
       00 E9 B6 7A A2 85 ED C7 34 08 36 98 17 FE 4E 26
       data hash MD5: 16K
       57 FB 5E 7E 1F 6D 2E 4B EF 0F 80 7B 1E 29 55 3F>)
$$ ##END=
$$ 
$$ hash MD5
$$ 1A 5D CF 1A 59 9C 08 71 89 F6 87 33 A3 4C AF 16
##$RELAX= 
##$RELAX= 
##$RELAX= 
##$RELAX= 
##$RELAX= 
##$RELAX= 
$$ Bruker specific parameters
$$ --------------------------
##$DU= <F:/spectra>
##$EXPNO= 1
##$NAME= <H-F>
##$PROCNO= 1
##$TYPE= <nmr>
##$USER= <she>
##$AMP= (0..31)
100 100 100 100 100 100 100 100 100 100 100 100 100 100 100 100 100 100 
100 100 100 100 100 100 100 100 100 100 100 100 100 100 
##$AQSEQ= 0
##$AQ_mod= 1
##$AUNM= <au_zg>
##$AUTOPOS= <>
##$BF1= 200.13
##$BF2= 200.13
##$BF3= 200.13
##$BF4= 200.13
##$BF5= 200.13
##$BF6= 200.13
##$BF7= 200.13
##$BF8= 200.13
##$BYTORDA= 1
##$CFDGTYP= 0
##$CFRGTYP= 5
##$CHEMSTR= <none>
##$CNST= (0..31)
1 1 145 1 1 1 1 1 1 1 1 1 1 1 1 1 1 1 1 1 1 1 1 1 1 1 1 1 1 1 1 1 
##$CPDPRG= <>
##$CPDPRG1= <>
##$CPDPRG2= <>
##$CPDPRG3= <>
##$CPDPRG4= <mlev>
##$CPDPRG5= <mlev>
##$CPDPRG6= <mlev>
##$CPDPRG7= <mlev>
##$CPDPRG8= <mlev>
##$CPDPRGB= <>
##$CPDPRGT= <>
##$D= (0..31)
0 1.2 0 0 0 0 0 0 0 0.06 0 0.03 0 0 0 0 0.0002 0 0 0 0 0 0 0 0 0 0 0 0 
0 0 0 
##$DATE= 1679484002
##$DBL= (0..7)
120 120 120 120 120 120 120 120 
##$DBP= (0..7)
150 150 150 150 150 150 150 150 
##$DBP07= 0
##$DBPNAM0= <>
##$DBPNAM1= <>
##$DBPNAM2= <>
##$DBPNAM3= <>
##$DBPNAM4= <>
##$DBPNAM5= <>
##$DBPNAM6= <>
##$DBPNAM7= <>
##$DBPOAL= (0..7)
0.5 0.5 0.5 0.5 0.5 0.5 0.5 0.5 
##$DBPOFFS= (0..7)
0 0 0 0 0 0 0 0 
##$DE= 6
##$DECBNUC= <off>
##$DECIM= 32
##$DECNUC= <off>
##$DECSTAT= 4
##$DIGMOD= 1
##$DIGTYP= 9
##$DL= (0..7)
0 120 120 120 120 120 120 120 
##$DP= (0..7)
150 150 150 150 150 150 150 150 
##$DP07= 0
##$DPNAME0= <>
##$DPNAME1= <>
##$DPNAME2= <>
##$DPNAME3= <>
##$DPNAME4= <>
##$DPNAME5= <>
##$DPNAME6= <>
##$DPNAME7= <>
##$DPOAL= (0..7)
0.5 0.5 0.5 0.5 0.5 0.5 0.5 0.5 
##$DPOFFS= (0..7)
0 0 0 0 0 0 0 0 
##$DQDMODE= 0
##$DR= 18
##$DS= 0
##$DSLIST= <SSSSSSSSSSSSSSS>
$$ [...]
##$SUBNAM2= <"">
##$SUBNAM3= <"">
##$SUBNAM4= <"">
##$SUBNAM5= <"">
##$SUBNAM6= <"">
##$SUBNAM7= <"">
##$SUBNAM8= <"">
##$SUBNAM9= <"">
##$SW= 18.05172834244
##$SWIBOX= (0..15)
0 0 2 0 0 0 0 0 0 0 0 0 0 0 0 0 
##$SW_h= 3612.71676300578
##$TD= 16384
##$TD0= 1
##$TE= 0
##$TE2= 300
##$TE3= 300
##$TEG= 300
##$TL= (0..7)
0 120 120 120 120 120 120 120 
##$TP= (0..7)
150 150 150 150 150 150 150 150 
##$TP07= 0
##$TPNAME0= <>
##$TPNAME1= <>
##$TPNAME2= <>
##$TPNAME3= <>
##$TPNAME4= <>
##$TPNAME5= <>
##$TPNAME6= <>
##$TPNAME7= <>
##$TPOAL= (0..7)
0.5 0.5 0.5 0.5 0.5 0.5 0.5 0.5 
##$TPOFFS= (0..7)
0 0 0 0 0 0 0 0 
##$TUNHIN= 0
##$TUNHOUT= 0
##$TUNXOUT= 0
##$USERA1= <user>
##$USERA2= <user>
##$USERA3= <user>
##$USERA4= <user>
##$USERA5= <user>
##$V9= 5
##$VALIST= <valist>
##$VCLIST= <CCCCCCCCCCCCCCC>
##$VD= 0
##$VDLIST= <DDDDDDDDDDDDDDD>
##$VPLIST= <PPPPPPPPPPPPPPP>
##$VTLIST= <TTTTTTTTTTTTTTT>
##$WBST= 1024
##$WBSW= 4
##$XGAIN= (0..3)
0 0 0 0 
##$XL= 0
##$YL= 0
##$YMAX_a= 244743
##$YMIN_a= -309702
##$ZGOPTNS= <>
##$ZL1= 120
##$ZL2= 120
##$ZL3= 120
##$ZL4= 120
##$ABSF1= 10
##$ABSF2= 0
##$ABSG= 5
##$ABSL= 3
##$ALPHA= 0
##$AQORDER= 0
##$ASSFAC= 0
##$ASSFACI= 0
##$ASSFACX= 0
##$ASSWID= 0
##$AUNMP= <proc_1d>
##$AZFE= 0.1
##$AZFW= 0.1
##$BCFW= 1
##$BC_mod= 2
##$BYTORDP= 1
##$COROFFS= 0
##$CY= 11.3945322036743
##$DATMOD= 1
##$DC= 2
##$DFILT= <>
##$DTYPP= 0
##$F1P= 2.36226072786647
##$F2P= -0.459571619588291
##$FCOR= 0.5
##$FTSIZE= 0
##$FT_mod= 4
##$GAMMA= 1
##$GB= 0.15
##$INTBC= 1
##$INTSCL= 1
##$ISEN= 128
##$LB= 0.24
##$LEV0= 0
##$LPBIN= 0
##$MAXI= 10000
##$MC2= 0
##$MEAN= 0
##$ME_mod= 0
##$MI= 1.114404
##$NCOEF= 0
##$NC_proc= 0
##$NLEV= 6
##$NOISF1= 3.799351
##$NOISF2= 2.8
##$NSP= 1
##$NTH_PI= 0
##$NZP= 0
##$OFFSET= 15.70392
##$PC= 1
##$PHC0= -19105.46
##$PHC1= 11.00075
##$PH_mod= 1
##$PKNL= yes
##$PPARMOD= 0
##$PSCAL= 0
##$PSIGN= 0
##$REVERSE= no
##$SF= 200.130013532006
##$SI= 16384
##$SIGF1= 3
##$SIGF2= 2
##$SINO= 400
##$SIOLD= 16384
##$SREGLST= <1H.CDCl3>
##$SSB= 0
##$STSI= 0
##$STSR= 0
##$SW_p= 3612.71676300578
##$SYMM= 0
##$S_DEV= 0
##$TDeff= 0
##$TDoff= 0
##$TI= <>
##$TILT= no
##$TM1= 0
##$TM2= 0
##$TOPLEV= 0
##$USERP1= <user>
##$USERP2= <user>
##$USERP3= <user>
##$USERP4= <user>
##$USERP5= <user>
##$WDW= 1
##$XDIM= 8192
##$YMAX_p= 0
##$YMIN_p= 0
$$ End of Bruker specific parameters
$$ ---------------------------------
##NTUPLES= NMR FID
##VAR_NAME=  TIME,          FID/REAL,        FID/IMAG
##SYMBOL=    X,             R,               I
##VAR_TYPE=  INDEPENDENT,   DEPENDENT,       DEPENDENT
##VAR_FORM=  AFFN,          ASDF,            ASDF
##VAR_DIM=   8192,          8192,            8192
##UNITS=     SECONDS,       ARBITRARY UNITS, ARBITRARY UNITS
##FACTOR=    0.0002768,     1,               1
##FIRST=     0,             0,               0
##LAST=      2.2672688,     0,               0
##MIN=       0,             -309702,         0
##MAX=       2.2672688,     244743,          0
$$ Real data points
##PAGE= N=1
##DATA TABLE= (X++(R..R)), XYDATA
$$ [...]
1756d49J361r25j58k8J43J65K67l55m22N74k7l09k19M29j75p5K17k71N57k6m52
1777a78RL72K58m14r1J39j41P4k67K61L1O1m07J07K86L03o65J42K31m84M94J03
1799B24k05j76m8K95j91J22Q6k63M06j08J06j91P6n25L53O8rj76K41k30j61L10
1821DM78n24j43M00k81n1o1K58K41l62O4Q5m9J5L3l78Q1M59n77N37k37k31L9Q7
1845a13m2J97J60K1l08P9L27l45K0OJ72k52M8q0o0N8q2K3K84n6l40K6L50m16O1
1870b62M13q9k51O4k4J30P0j01l04K44j20L79j75O9l10L91j3k71k7L52p0m04j2
1893c21N84k8k60q2O1M04n11K23j37K43l07J22L4K45k32r0L8J06J92k2k2l00r3
1916a53L62l90j1O19m29m33K60J4M89j42l43L30J2k16m89M83M29n44k14M60j8
$$ y = [-449, 912, -13, -171, -199, -56, 109, 376, 21, -401, 173, 146, -163, -382, 47, -128, -203, 14, -257, 300, 274, -178, -169, 203, 461, 47, -44, 95, -46, 28, -239, 22, 53, 114, -293, -186, 100, 403, -262, -120, 111, -373, 121, 224, 19, -157, -205, 90, -101, 21, 107, -156, 250, 142, 248, 57, 133, -392, -39, 29, 20, -156, 85, -145, -306, 4, 482, -42, -185, 215, -66, -117, -178, 80, 321, -41, 23, 108, 59, 74, 107, -271, -190, 269, -308, 229, -8, -239, -200, -113, -155, 42, 202, 223, -85, -6, 321, -24, -4, 2, 174, -78, -30, -110, -170, -112, -194, -171, 113, 57, -283, -257, 93, -323, -262, 151, 62, -189, -125, -149, -19, 51, -50, -354, -110, -230, 149, -26, 43, -267, 124, 111, -160, -187, 165, 95, -309, -321, 263, 235, -25, -107, -46, 358, -153, 70, -67, 176, -131, -9, 25, 270, 38, -52, -14, 92, 284, 262, 240, -60, -153, 209, -181, -192, 427, -2, -435, -175, -161, 328, 186, -157, 173, 185, -31, -520, -37, 392, -152, -366, 94, 76]
1937G6l42M16j98J80K7J6k53k01N57k92l04L58m1QQ6P1n76L44L42m67J49K24l61
1960a81Q1K88K0o24M74mn7K46k74j56M01K39o95r1M18p3m61M54r4P0J08m2l89
1983c42L30L53l70p7L04j38l53M94j31l8K76k98j64K12j17j17n9P03rp82K21K67
2005A65k21R8j0k21j37M00n00K70L61k06l21K47J6j64N17q8m87J74K84n58N0N89
2027B58J6m54m7Q4Mj46M76k95j31J67j20l1K74K47p11M79rl87J81N10Rm25K47
2050A96k14m69N94l4k68K93ql53j53P16l94J19L45m12l94N43K17m23K47N6m55
2071b51j6M80J23j53O7Pl44J21l6j53K93L37o67J75K66k39j21J30J96m59L24Q9
2093A69l41J51K95l97j20K10J5k42J18M10k94J92j08k58M89k25l26J54J80k83
$$ y = [76, -266, 150, -48, 132, 159, 175, -78, -279, 278, -14, -318, 40, -1, 7, 93, 164, -412, -68, 274, -193, -44, 180, -181, -100, 188, 208, -416, 58, 54, -3, 243, -31, -187, 214, 453, -242, -333, 85, 12, -449, 5, -89, -19, 89, 47, -342, -12, 341, -29, -106, 198, 60, -293, 201, 70, 32, 308, 10, -154, 58, -59, -176, -235, 468, 459, -323, -102, 165, -56, 42, 32, -189, -326, 74, -426, -156, 205, -1, -322, -75, -59, -223, 294, 206, -281, -107, 177, -381, -331, 258, 274, -180, -227, -143, -139, -285, 191, -104, -235, -68, -188, -219, 55, 302, -409, 70, 61, -326, -145, 365, 374, -51, 196, -18, -487, 107, 73, -195, 98, 90, -263, -416, 300, -94, 25, 370, -42, -436, 107, 324, -99, 148, 204, -251, -267, 213, 336, 183, 250, 257, -87, 34, -2, -155, 138, 475, -192, -17, 249, 10, -111, 19, 215, -244, 80, 169, -172, -21, 274, -123, -243, -33, -18, -260, -142, 268, -26, 166, 58, -200, 289, 64, -262, -108, 72, -211]
2113b11k72Q80j22l77K62j36p2k03N37k73l30N23j00k77j5K34O1O5j15j44m8M33
2135C00l70k18L86J38k37j04K42k37O8K16j95k34M80k20l02O87k74j88O9j02p4
2156a69M78p4l03k32M76o33M78L82j32k04j40J75k05J44J34l61m9K82l6Mo9R7
2178D3j52J55L1o0m9J75k15P5K93K9l22J14N2l94j8O86l97o2L26l50qL21k83j12
2202a22j08J43k48L79L07n35P7J89m7K9l6j58j26L32j28j2L19j02j33l27O75k50
2224A18j29j34J46p3L5q3j04k5L29q5j11J8Lk54L5J93l6J81p0l24L32j1j2q8J77
2249B8q3j64J97J35K0k0l68J0L39Pj03k3j53K85j50j21p2Q7K06q1r4L63N7n99
2273b97o5K63K67k51m0J96nj12K82k30O9J2n7Q3q2Rj80r2K22q0Q4J81l68J73J04
$$ y = [-211, -483, 397, 275, -102, 160, 24, -48, -251, 286, 13, -317, 206, 106, -171, -186, 48, 109, 174, 59, -85, -133, 300, -70, -288, 98, 236, -1, -105, 137, -100, -32, 184, -11, -245, 235, 15, -287, 400, 126, -62, 7, -95, -169, 309, 235, -68, -300, 176, -457, 21, 403, 271, 67, -73, 102, -103, 41, 175, -186, -235, 47, 11, 15, -54, 43, -109, 46, 77, 17, -32, 143, -72, 3, 296, 325, 3, 117, 169, -225, -243, 443, 46, -16, 310, -40, -48, 273, -10, -122, -230, -87, -335, 44, 351, -184, -107, 82, 35, 64, 28, -130, -256, 76, -52, -64, 255, 153, 20, -307, 368, 118, -11, -145, 1, -72, -37, -120, -224, -249, 80, -5, -116, -98, -95, -349, -314, -121, -157, 24, -46, -370, -38, -49, -61, -149, 28, -55, -219, -22, 113, 133, 113, -255, -245, 94, 101, -2, -25, -178, 107, -43, -164, -236, -149, 57, -24, -118, 245, 302, -297, -362, -99, 168, -83, -123, 73, 68, -44, 238, 8, 77, 89, 32, 115, 33, 42, -138, -230, -8, -88, -4, 177, -191, -18, 86]
2298H6Q8Ok5J14l50J62j25j59J83j4k86m9K79K18j85or9J64l6M5QJM9k21K85L1
2324A64l6l29K32J09k26K35o0j78r7j1J93O1p8k55J85q3L20l18L72j87k62K05
2346d4k6M70n25R4j72L69k25K76j06k05l8J13m5L48m19L03k17J5j25L97m9m28
2368b39N5K89j24j19J57O6n3m25M65m9P5j66r4mJ16J56L6o04N37j21J75j74J17
2391G2k70L6M4P2Kk13Q4J91J06J00r1j89L4j14K34k74M19l80K26J66m07K78k70
2414a44M1L9j59J88J46K74m70K85k2k7j36k79J73J30j79L0J59J86p5j43l2lj28
2437a46K47o4k06J7L23k75Q3r1J95L9j61mm7l4J45r6K52p3q4Q8j75K38j09J86
2461B48l02L66l11j46K47k0p1J28J12l89j51K31Q9Q7k85N71j0l78J38j86l44k2
$$ y = [86, 174, 180, 155, 269, -81, 81, -44, -203, -20, -34, -320, -369, -90, 128, -57, -63, -162, 2, -34, 11, 19, 20, 69, -152, 133, 164, 128, -201, 31, 140, -86, 149, 89, -89, -186, -197, -4, 57, -21, -276, -91, -174, 146, -172, 200, 13, -249, -44, -70, 400, -125, -31, -203, 166, -59, 217, 111, -94, -132, -19, -64, 284, -135, 168, -49, -34, -159, 238, 189, -239, -184, 105, -19, -138, 19, 85, 32, -393, 72, 23, 98, -68, -162, -166, -50, 106, 142, -462, 75, -46, 129, -45, 72, -198, -162, -118, -46, -44, -257, -173, 18, 124, 224, 133, -56, -22, -136, 98, -176, 243, -137, 89, 255, -152, 126, -144, -103, -64, -223, -35, 111, 385, -85, 200, 178, 151, 15, -264, -91, 39, -140, -110, 49, 235, 160, 17, -15, -18, -146, 101, 37, -169, -152, 171, -104, -21, -112, 83, 122, -39, -43, -90, -124, 21, -75, 177, 104, 20, 108, -67, 171, 62, 248, -54, 312, 1, -145, 102, 82, 11, 139, 251, -138, -289, -58, 31, 118, -167, 404, 394, 16, 154, -32, -376, -398]
2483c98L92l1Q6k30J05J06j69K54k4n3K8j39NK43k27l19L32O8o5P4J58k14M2L6
2507F0Ll14L91j65R7J01q7j8K9r3j03j38L33j23Q3j89P1j17M5M27k11j95J38k47
2531b22j07K42J62l21N13k71j19J26O8j3M8L16m75N9K5j18l38K30N67n77J50L28
2553B73l32J98o2m0l82M34N6j30m6pJ2K25j57j57jM28r1k43p8j7l3J06J53m49
2577c40K42mm5K30%k72M06r7k68K64j0j76o5J35R5j70J57K52k68j54K72j58j18
2600i2J45o7j78K86k8k20Q3M1O1K5n8P5KR0p8l09L05j11q2j26J73qoN8K17j64
2626C4L6R5j49j17K12q8l22J58k35L12L06m14o4J29K25k57J61N3n1p3K62k07Q
2649A4j20K58k99O7l2J55k21K21r6mQ5n5j29J43P4O5k18K36r1k94L83p1L09k34
$$ y = [-398, -6, -37, 49, -181, -76, 30, -139, 115, 91, 38, 66, -73, -68, 175, -52, -371, -39, 29, -36, 38, 196, -18, 24, 60, 63, -251, 140, -25, 72, 173, 86, 68, 97, 4, -99, -237, 96, -27, 56, -133, -62, -179, -134, 293, 82, -113, 25, -222, -329, -87, 75, -246, 267, -4, -123, 3, 71, 58, 106, 422, -53, 6, 31, -87, -425, -195, 372, -205, -55, 273, -59, 139, 77, 37, -345, 89, 145, 15, -31, -38, -26, 199, 42, -115, -116, 312, 221, -22, -100, -117, -150, -44, 109, -340, -98, -102, -147, 83, 83, -189, 217, 120, -148, 116, 106, -70, -135, 0, 95, -75, 82, 334, 66, -88, 184, 26, -92, 53, -14, -192, 94, 66, -154, -71, -30, 31, 56, -2, 73, 75, 165, 87, -222, 83, -28, -110, -236, -63, -71, -77, -19, 198, 34, 70, 165, 16, -101, 111, 23, -299, -141, -376, -64, 242, -172, -236, -107, 118, -139, 22, 75, 24, -49, 213, 6, 14, -106, 152, -147, -80, -112, 43, -178, 43, -53, -57, 28, -27, -156, -13, 61, 126, -92, 144, 53, -241, 142, 71, 380, 146]
2673A46J47k64P1k71P2j08K20K11l99K78l8j3J34j89J18l19M34p24N76q7k27q2
2695c14K97L1m7O4j30Q8o1J04l9J31j37l1J99l11k0k50N50k4r9o5J64j66K53r5
2719I2J7j05N3k4L7j42j9K10o8jj51q5K46q2j22K67l46J23O6L74m10o2N3L5J1
2744c3m1L74m41M00j46OPJ5j18P0j62j17J93J95k38J77j97J06ok92K42k9l00M71
2768A36k38O0j17R2J25PL9lK84o7k59l1m6K2K09j3N0l04J1R1L0R7l0J12l18J48
2794H7k9m2O8j57J63n2o9k3Q9j70Q3j83K57J71K5m08K65l3q4j73P4Q7n1n5mL1
2820a33K10o9J00j80K17r0j21R3k30K36M2m01M21J31j21K2rj49j75m3L67k42J10
2843a4P4j98M09r6k73K58P5O1m07J68j35K67j49j84LP4Q1l4k3J0K94k47%k9l6
$$ y = [146, 293, 29, 100, -171, -99, -207, 13, 224, -175, 103, 65, 52, 186, -3, 115, -204, 230, -494, 82, -5, -232, -314, -17, 14, -33, 31, -99, -11, -72, 32, -7, 124, -13, -44, 155, -156, -176, -426, 124, 100, 1, -64, 100, -66, 187, 92, 109, 4, 57, 33, 70, -72, -91, 119, 51, 50, -101, -186, 60, -22, -144, 123, -223, -100, -34, 340, -70, -132, -79, -44, -33, -74, 300, -141, 259, 113, 119, 126, 141, 23, 93, -69, -186, 7, 202, -36, 141, -56, 50, 44, -248, -6, -35, -335, 136, -102, -42, -159, -67, 58, 65, 104, 101, 385, 318, 59, 28, -18, 4, 213, 200, 250, -54, -43, 48, 78, 175, 145, 257, -61, 87, 58, 16, 84, -73, 90, 38, -31, -54, 35, -135, -52, -235, 22, 193, 218, -190, 75, 42, -42, -215, -141, -54, -105, -160, -164, -133, 77, 8, 108, -72, 145, 55, -66, 27, -203, 33, 75, -326, 95, 226, 105, 127, 118, -31, -206, -249, 118, -124, -14, 60, -138, 271, 175, -98, 160, 235, 296, -111, 57, -78, 189, 40, -144, -141, -67, 14, -20, -43, -33, 261, 14, 14, -15, -51]
2868e1J04j88K14l34J92j59Q6L9O5KN0O6j9l52J65M3po4O9K49l59K38p4R4lj5
2894E1k00K42J8j22j08K44o22N44LK49l87O9N2J45J25l85N24m12O2k03M0jK23
2917A51k39L63J3j60j26K29k80J37Nm3j02k01R3K66l39L99j43R9l08J64J63j09
2939C2j9M7m9J31l62L23k67k4J38J36r3L20J3l65J63L15l77O9l41N9K11j04J26
2962H2J04k28L6l9n8Q9j3j1k13O2L54p1q0L8j06r4j63M62k57no2J48MJ59O9k89
2988h2J26Q5K6l67L57j67N6p7j04L00P8Q0k14K8n2j64j94N80n62K50k8n0m6J2
3012a29J54R0j17j33M37k59J37j11o4K26j06k17j45K49K96k22M8k98L38Q1k91
3033c6P7k7N4J28k31lm9nN3j36L50J81l79K91k64k4o5r5P7J65J0L6j93K87k05
$$ y = [-51, 53, -135, 79, -255, -63, -222, -136, -97, -32, -30, 20, 86, 67, -285, -120, -77, -84, -148, -79, 170, -189, 49, -25, 69, 66, 51, -149, 93, 111, -11, -119, 125, -497, 47, 50, 299, -88, -19, 33, 178, 303, -82, 442, 30, 92, -111, -71, -72, 151, -88, 275, 288, 128, 2, 231, -49, 88, 93, 50, -52, -253, -160, 106, -233, 166, 23, 122, -186, -22, 141, 32, 13, 60, 11, 142, -220, 103, -164, -188, -50, 86, -7, 313, 326, -39, 124, 439, 62, 131, -210, -151, 60, -44, 82, 186, -42, -6, -45, -103, -14, -27, -38, -251, -189, 165, 94, 14, 52, -54, -148, -311, 151, -106, -111, -173, -25, -21, 138, 207, -82, 44, 129, 155, -212, 145, -22, 34, -43, -147, 153, 231, 311, 97, 125, 73, -91, -285, 295, -267, -17, -45, -95, -141, -129, 25, 115, -2, -135, 302, 43, 180, 69, 5, 231, 125, -92, -237, 12, 308, 86, 134, -164, 174, 255, -36, 41, 14, 68, 196, -35, -38, -87, -92, -39, -175, 175, 356, -23, 268, 4, -20, -85, -180, -103, 62, 72, 108, -85, 202, -3]
3058ck24K18jJ52j7k19N5r0K01L42m28j4j09K01j43J45o2j3j38M91l83J08LJ88
3082B60k43LM2k14J58J62j41K06k52R2j28K29k36p7K93j75k74N06l09K0Q8q0p1
3105a41J78K29k19R2p0m01Q0K74k9Q6l11L10o7o6J84j29%k9J26j64nj94K45j28
3129a49L76k43L2m1j0LJ09J30l92L36j08j43K80j47p8M1K4K06l10J06l6J51l89
3152b52M49k46K64k58n6j17J83NlJ53k28j31M19k83j93K86L69k48k07l8K37k40
3174a35L39k59q6L00j35K8k77L84o8o7k29J8J9K32K59k92k6K7j41L7j08L91l81
3197a70K96k06K9p0L75l15J50j41J2j1O1q5k1J3J20k38L21k0J37l72j50N56k36
3220C5O3j20J02J22j67l25K53j02j9j48M46j52q3J54P9k60J56r1L15j27j10p3
$$ y = [-3, -227, -9, -10, 142, 125, -94, -39, -129, 72, 414, -14, -28, -137, 64, -79, 66, 4, -9, -147, 344, -39, 69, 72, 260, 17, 20, 62, -152, 6, 168, 27, 233, -19, 73, -55, 174, -62, -139, 154, -21, -295, 211, -98, -78, 10, -70, -141, 37, 266, 47, 139, 69, -332, -252, 22, -7, 79, -232, 78, 11, -55, 129, 0, 0, -29, 97, -67, -72, -266, -21, -149, 227, -16, 16, -25, -35, -32, 77, 207, -185, 151, 43, -100, 180, 33, -45, -4, 20, 226, -84, 22, -14, 137, -252, 197, -49, 215, -43, -99, -216, -33, -28, -31, 122, -106, -237, 182, -101, -294, -8, 361, 113, -94, -132, 105, -135, 204, -55, -141, 159, 24, 52, -225, 159, 91, 24, -205, -187, -168, 64, 323, 31, 5, 32, -109, -72, -180, 211, -170, 126, -80, -51, -121, 254, -61, 89, -52, -40, -51, 10, -75, -96, -83, 37, -201, 120, 100, 237, -135, -285, 271, 35, 98, -22, 80, 202, 35, -290, -37, -139, -158, -306, 140, -12, -95, 59, 138, -122, 34, -57, 258, 131, 21, -52]
3242e2N1j10Q4J09Q3j71N4m7p6j90M00p9q1O8k8j20J71Jr3J08j4Q7l54J39K41
3267A81k66l6NK25j43j71J71j91M49k8j84K3J32l31M00j65l7M1j02j3J64q9kj7
3291A6j14J08r9K65k40K4j04Q4J81j54K37m4o3j62R6j12J82p8p6P6k80M1K64K
3315E0r0nj13J00o9L10k06%J71M3rk18J23r8r4Q6n6J43k48K30k63K37o6K83k36
3340Er8O7j73L06L8j41J5j20k0K80l71j1K32l8j44K45k52K01j32K72L7j40M8o2
3364D4J83j60m2R8k3p4k32K55Q7j05p8KJ33k30K27j6l20K23q7J07m0K65j80j05
3388f8N3O0k60P4J04r1K03k09J87k4J93l63J89K37m65J36M4k3Q7k73r1M06j57
3411e1NJ02j63J03kj04K12R6j46l0K01%l47K66j68J07k9P6j02m5K67l44R4q4l8
$$ y = [-52, -1, -111, -27, 82, 165, -6, 48, 1, -75, -265, 135, 56, -25, 43, 15, -105, 66, 67, -26, 82, 68, 155, -199, -60, 181, -85, -121, -116, 109, -34, -205, -34, -225, 224, 196, 12, 35, 167, -164, 236, 71, 34, 75, -27, -40, 124, 35, 33, 16, -98, 10, -89, 176, -64, -40, -144, -60, 121, -33, 204, 160, 97, -65, 31, -81, 101, 23, -53, 23, -257, -216, 48, 50, -40, -45, -158, -58, -127, 183, -23, -23, 148, 191, 182, -36, 87, -11, -105, -19, -75, 68, -180, 50, -213, 24, -42, 241, 5, -93, -26, -199, 107, 145, 4, 19, -101, -121, 159, -212, -223, 9, -29, -173, 72, -180, 21, -111, 161, 198, 58, 106, 44, 227, 67, 25, 123, 100, 26, -206, 49, 136, 31, -47, -45, 88, -142, 85, 69, -251, -28, -115, -8, -48, 217, 37, -68, -15, 45, -215, -141, -37, -128, 75, -134, 53, 29, 222, -141, 48, 285, -180, -44, 0, -23, 64, -209, -300, 106, -51, -46, 56, -107, -4, -6, -110, 102, 198, 52, 22, 223, 223, -124, 142, -26, 81, 52, 128, 26, -19, 248, -96, -2, -86, -124]
3436a24K0O1J03mJ04k77P5l8J47M0n6o0k11L58j13K5l6m9j95L29k14NK47q3p9
3461b5O1O3j00J56k53L93l17Q0L9J91q4j11M7k86Q2J27j99J89j07k63M55j31L2
3484C9rLJ95k25o7JJ83q1k31J80Kk07J95K07j78m3r7J62n9n6K58k48r7QJ20P2
3510B7k83K48n5J13j08O9K5J45j78p7k28N03j51o1N7j58k44K77r9L24j55q2J23
3533C2l66Q0L11j76o9J05J93K92m90N2K2j20J92o8k9J92j85J0nn0M6j71L75j71
3557Bm6J18k06N6n8J98J36j86R4J65j47j31o0K19k24J11R7m1oj28L12l58n5m7
3581a85K31j41k16L03o4j1L7j0m2Q2k26L15K27n72M50j39k10L03p4j67l5J07J19
3604H2j88P4J97j48m5k00K35K4j31j83K13L89m08J36j2M3k61J13k52K38L60m84
$$ y = [-124, -104, -43, 60, 56, 160, -117, -42, -80, 67, 107, 51, -9, -220, 138, 25, 50, 14, -35, -230, 99, -115, -110, 137, 54, -25, 36, 99, -1, 155, -98, 295, -22, 58, 97, 288, 204, 93, 140, -146, -64, 63, -136, 53, -54, -317, 138, 7, 39, 30, 33, 228, 3, -64, -63, 120, 39, -192, -12, -10, -217, -22, 185, 7, -36, -133, 29, -30, -86, 172, -76, -173, -165, -45, 27, -256, -8, -63, 50, -58, 11, 36, 181, 3, -74, -302, 201, 50, -11, 46, -112, -356, -79, -178, 146, -9, -91, 32, -334, -254, 57, -119, -188, -83, 110, 402, -88, -36, -14, -134, 58, -10, -39, 153, -32, -22, -27, -77, -31, -202, 173, 2, -44, 74, -132, -76, -134, 64, 200, 14, 108, 273, 126, -5, -65, 154, -70, 41, 138, 97, 91, -37, 275, -83, -138, -185, 46, -95, -311, -8, -72, -83, -46, -56, -98, -16, -242, 73, 300, -272, 178, 39, -171, 132, 58, -109, -144, -37, 82, -106, -32, 165, 17, -28, -228, 7, 31, -100, -283, -70, 319, -89, 47, 35, 78, -183, -70, -322, -84, 276, -208]
3626b08J84k10N52k24k81M23j21mJ59q8j97K57k16j33J58j36n4Q6J3J23N0O0l25
3649a32L7J50J19P5k88O0J05j89j73M85m14J42M0P1k3J57k07j63O0K59j44mP2
3672I5k50K54p6P9M6k27P1O0J55q6j89p9K47j19m7L28j41o4k11K56j5k60M16n93
3696c50M48m50L13J39k23m8j5K31j28L48k78J38o9Q1k33k4p8M75m49L10m00K52
3718a0J02n3j53J36j08Q8M6k11J39J22j40r1j05O8j20K87p4J52j46Q1j32j01L19
3741I6j14j26Q7k25J31jL62o9j83j18K10kP0j95J02q5Q1J00j75J5K25j50k14L55
3765A77j12J21k06K1j9N9j21J90l06L46k25l8J73m2j5r2m3Q3O4P5l1j3l3p2L5
3790b4K20j0l37J79k20L25J00j57r7j94K07K0j8r7P1R2Q8k19K81k00j21L64k83
$$ y = [-208, -24, -234, 318, 94, -187, 236, 115, 111, 270, 182, -15, 242, 26, -107, 51, -85, -139, -53, -40, 83, 133, 193, -132, -95, 55, 174, 249, -39, 21, 126, -63, -236, 249, -165, -23, 17, 88, 65, 222, 15, -148, -88, 171, 27, 23, 95, -155, 99, 23, 102, 148, -79, -8, 52, 207, 121, -68, -147, 100, -19, -66, 262, 121, 57, -154, 102, 87, -173, 243, -350, 98, -352, -39, 100, -123, -171, -186, 45, -83, 265, -13, 125, 56, 137, -96, -120, -198, 277, -172, 138, -262, -10, 92, 39, -114, 22, -86, 2, 48, -163, -24, 98, -42, -133, -238, -170, -290, -3, -77, 75, -71, 10, -122, -223, 96, -18, -144, -57, -282, -151, -152, 210, 141, -42, -160, 50, 48, 118, -77, 25, -60, 21, 121, -54, -39, 186, 36, -178, 177, 65, 186, -20, 1, -18, 41, -80, 110, -196, 150, -75, -113, 60, 18, 3, -89, -132, -49, 15, 90, 59, 46, 13, -59, -24, 196, 186, -151, 28, -192, 133, 233, 76, -21, -215, -8, 12, -6, -103, -32, 60, 148, -71, 210, 10, -111, 253, -30]
3813c0N6k04J89M2J83k67J79l62K56j41K14o0j21M00p55M66j78J88j61P1J11Q1
3835A57j99R9P8l54R8P5l5J10l12L27j61L0K70l90J71o3J94j4k60nJ93j20L94
3858B83k33J96o2j98P1O9k01J65q9j3l47Q33n50rk4K70k58J80k25P2L20k22j19
3881i1j45J49J46j75J02Q4N6k21K09j00k31J47j3P7J22j52P8J86j20j13m1K9J17
3904A00M4j28O2j72P0J24k56j22L67L3m6r9N1j06J33n7l5M0P6K5k69K53J24k91
3928g9K7J1K18k69J28j84K5J85R9k37R0j19K26k1j57L4N1j1J59l08M1j08K14k23
3952b08K0L89k38J67n1k91L34K08l79k13M37j00j86J37L1l4j59L10l93J22j41
3973b38m4L69j75m8K10j47o6K12Q1Q3k88J82j74j1Q3j39L47j06k29J29j14J47
$$ y = [-30, 26, -178, 11, 53, 236, -31, 148, -214, 42, -99, 115, 55, -66, 334, -421, 45, -133, 55, -106, -35, 76, 157, -42, 57, 135, -219, -121, -46, -81, 29, -283, 44, -117, -87, 183, -207, -36, -99, 95, 81, -179, -184, 9, -111, 283, 50, 246, 184, -14, 57, 126, -75, 90, 1, -12, -359, 474, -76, -85, -109, 161, -97, 83, -142, -70, 250, 28, -91, -236, -87, 59, -116, -14, 70, 126, -95, 114, 14, -217, -70, -83, -6, 116, -36, 42, 228, 108, -5, -46, -17, 100, 144, 16, 78, -94, -24, 100, -156, -278, 89, 122, 76, -23, 28, -78, 55, -2, -37, 3, 79, 104, -165, 88, 212, -79, -52, -41, 177, -92, 36, -148, -123, 62, 161, -76, 14, -105, 121, 100, -57, -23, 28, 17, 176, -132, -91, -199, 15, -208, -188, 201, -37, 130, 79, -212, 122, 330, -49, -262, 175, 75, -111, 26, 57, 23, -136, 174, -219, -97, -238, -282, 87, -88, -136, 74, -73, -139, 73, 154, 237, -51, 131, -43, -54, 29, -110, 237, 131, -98, 31, -83, 64]
3995F4q7M7k46K49j40o3MK91J24k39oJ70l1j82q3l2n1K29o5j1K16j49K7j79J09
4020c4L92l88p4J74k09K82Ll75n7O00k78l5Kj39n9K10rp4m6J07K8L6l9J15q1J05
4046A57l16J58K6j30P5lJ47k0j02mj8o0k2L9J54l5j89J8J62q0Q8R2l77K07M04
4071C71l60j26L48k67K03m14L8K15j87J73%O7k7j28L3J38k03J72j66M9j4j93K51
4094b7j79J57J47j66o7L0oR9K85n47K64o9o5J90J17oo7L6o6J24n49K61R1l6o4
4119a13j59J99J41l5j92L90l86K24J65j52j66J28j17J20J39J45k36j3k6Ok4O5
4141A03j42J01j33K94k97k50M15k61L7K47n9k36K11k13J59p9J32j15M69k15m30
4162b62L10J41j84O2oj36P6k79L45j60P7J78J3l52O0q8J98j07J21N8L0j51J7K27
$$ y = [64, -23, 24, -222, 27, -113, -176, -172, 119, 243, 4, -2, 168, 137, -45, -128, -160, -211, 18, -47, -58, 158, 9, 36, -143, -34, 358, -30, -104, 70, -139, 143, 146, -229, -286, 314, 36, 1, 3, -136, -195, 15, 6, -68, -114, -7, 21, 57, 18, 133, 52, 157, -159, -1, 25, -105, -30, -33, 114, 94, -8, -12, -30, -90, -112, -73, 81, 46, -143, -125, 37, -43, 45, 137, -240, -33, 371, 11, -115, 233, -34, 169, -245, -207, 8, -179, -6, -6, 61, 34, -94, -61, 77, -126, 46, -120, -71, -85, -278, -27, -206, -49, 98, -68, -135, -105, -111, -12, 273, -274, -10, -79, -144, 46, 163, 157, 90, 126, 60, 184, -365, -104, -13, -49, -113, -272, -73, 68, 33, -159, 231, -155, 69, 234, 82, -84, 44, -73, 47, 186, 331, 95, 82, 56, 62, 38, 103, -39, 62, -71, 223, -74, -324, 91, -170, -133, 114, 55, -181, 30, -183, -24, -103, 29, -86, 383, 168, -262, 48, 189, 5, 67, 61, -75, 1, -278, 67, -93, -16, 162, 175, -177, -117, -205, -7, -114, 7, 65, 95, -56, -39, 188]
4186A88j48j78K50j54j08J86mJ95k70J07n5j66K74j39l33K25L08k48j94M78l68
4207a54M1M9k59K29K41J3j90Q9Q9N1l15O3k8m3M3J23O3k08O6j58K96l19K5J88
4231ej7m7P3K39p5j77P6j72J12J71K4l35J21j57K47qk06N9j03K6L65k39j91K36
4255A7j83K11J19o2pq2K0o9L30k45q0j62Q2J61P4q0L4o5Oj61K99j88m2l1K42O2
4281B00%j65k46J01J07m6K2M6j69K92j49k8K08l21L39m7M2k21Q3K86m58n0m3M19
4305B02n48M79R5k22m4j2L35l25KR0J82j17j51J89m4k11k83K71J65k11K40j37
4327e5k07K93m8k20K33m9Q5k03J58J37j04m2J81j0%j23l33K97j3qJ58m72M54l6
4351G3l23N08j84k65K15%m57L67N4K04r5j02J05k55L33k52J03J89k96J82r8l86
$$ y = [188, 40, -138, 112, -42, -150, 36, 32, 227, -43, 64, 9, -157, 117, -22, -355, -130, 178, -70, -264, 214, -154, -113, -64, -323, -94, 147, 160, -30, 59, 148, 199, -116, -53, -81, -124, -81, 42, 105, -103, -37, -195, 101, -218, -193, -5, -22, -69, 4, 243, 168, -9, 67, -105, 7, 178, 202, -133, -12, -169, 78, 70, -136, -77, -180, -154, 211, -28, -219, 17, -166, 45, 164, 102, 95, 13, 33, -36, 294, 49, -31, -193, -111, 50, 124, 44, 78, 13, 19, -142, 157, -31, -73, -104, 138, 200, 200, 35, -211, -110, -3, -49, -27, 19, -150, 142, -7, -35, 173, -148, 191, 144, 186, -35, 48, 334, -124, -174, -217, 202, -346, 133, 228, 6, -38, -50, 285, -40, -38, 52, 234, 117, -34, 155, 111, -100, -383, -112, 53, -158, 82, -55, -262, 31, -17, -237, -4, -53, 32, -171, -13, 124, 20, -22, 159, 149, 149, 26, -307, -10, -23, -31, 127, -345, 109, 73, -250, 258, 74, -191, 24, 24, -433, -66, -12, 192, 97, -5, 100, -155, 178, -74, 29, 218, -78, 104, 6, -380]
4373c80L34NK19j41L3j57k4j67K28k9j58K72J49j91J02j2Kk5r6J76l39K20j49
4396a28K00J85q7k88N1j55L74p0l73L52k3O0m23M74k13K12l41K32q2j22M54j73
4418A16j73q0M06r0j89p9J13j1k25J18J75j68Q1k83K45r7J48j02K41j61k81K26
4440g0n9K95rk96R1P9n4J34P1k24O2M3L9l1j19J36j52O1q8L52j91j7k46L00j79
4465g2k60M16N2j61j11K24q2j93%j05N28l27J01j50K51j15j32K61j12l07K77O1
4487D4k1J47l26K66Q0k98J0M1K37j02pj53J56l3K25oj31p39N54O9k42J84Q3O1
4511I9R8k26J51j2n9O4k38K23m8J01M3k86L27p3k47K61l7O0j97J31m0k34q9J82
4535d6J28j35k2K8K4m7J45k7j78K34k59j2K35OK2j75j03N36r6l00l5K02l68J11
$$ y = [-380, -46, -41, 178, 37, 70, -87, -111, -278, -50, -79, -237, 35, 184, -7, 95, 83, 85, 60, -36, 140, -199, 21, -128, 72, 257, 170, -118, -67, -222, 152, 82, -291, 61, 38, 98, -325, 149, -64, 148, -193, 39, -43, -165, 289, 116, -57, -137, 269, 179, -10, -89, 24, 13, -212, -94, 81, -87, -6, -289, -44, -141, 7, -95, 146, -15, -296, -70, -129, 166, 157, -139, -48, 31, -23, 111, 182, -42, 20, 63, 102, 71, -48, 88, -64, -3, -91, 261, 70, 53, -193, 107, -72, -332, 84, 136, -25, -136, 88, 6, -187, -187, -292, 236, -91, 10, -140, 111, -4, -136, 125, 13, -294, -17, 44, 23, 170, -156, 110, 190, -108, -98, -57, 180, 78, 71, -82, 74, 41, 266, 260, 129, -610, -56, 13, -229, -45, 38, 99, 197, -29, 122, 110, 51, 115, -123, 100, 52, 153, 196, -90, 237, 164, -83, 178, 141, 201, 4, 135, 95, -139, -228, -46, 82, -53, -75, -47, -23, -70, 75, 48, -130, 104, -155, -167, 68, 74, 96, -79, -182, 354, 258, -42, -77, 125, -243, -132]
4559a32J06N4l90L13O0j11K22n2J67l76Q4j19M15k02r1P6r6J38Q1k7l74J8k3J81
4583g8J32k0J0O0j66j0K6P6K1j38k11M05j65J34P1l69O6O7J36Kj00J07k02R6R1
4608D1n3J5m5p0p0R2J88Kj45J53k98K82q4L7K35j47k14J2K45j68N3p6J96k90n6
4633a65L11l01L99L9k72L4Q2J75l20J51l26J67m8K06J7q2Jk11K31P0q9k17L4L37
4657B23j05k0j86j27J66J72o7p3L2ll4K08q8k1O7j06r1j44K15qOJ99j12j70J81
4682A14j37jK61k21o0J44O5m44L92N0j52J21j28o6J12k65L07k84K1K40j37K66
4704A98m71M49k30O9r2j79K21j48Q9J0J23K3O3j89Kj28J8K81N7o1j56L6n7O2K54
4729B44k16j21L47l9l20K67k01J91K5k07k20J45P5K18j61m2O6J01j32o7j0P6j0
$$ y = [-132, -26, 28, -362, -49, 11, -100, 122, 70, 237, -139, -55, -174, 241, 39, -52, 24, -72, 66, 147, 120, -254, -236, -259, -78, 54, 34, 44, 104, -62, -72, -46, 30, 51, -87, -298, 107, -58, 76, 147, -222, -156, -89, 47, 49, -51, 56, -146, -50, 41, -12, 3, -42, -112, -182, -90, 98, 100, -45, 108, -190, 92, 8, 45, 280, 133, -81, -69, 176, 8, 61, -15, 181, -109, -165, 146, -155, 244, 283, 11, 45, 127, 302, -18, 133, -193, -26, -74, 132, 149, 67, 68, -143, 88, 158, 69, -148, -114, 223, 118, 98, -88, -215, -49, 123, 56, -17, 15, 12, -22, 186, 98, 77, 144, 38, -53, -197, 18, 10, 16, 215, 103, -67, 114, -23, -24, 237, 16, -44, 100, 165, -279, 113, 163, 11, 132, 4, -62, 50, -215, 92, -192, -171, 69, -68, 198, -273, 176, -54, 15, -77, -256, -35, -183, -94, -84, 39, 62, 125, -64, -62, -190, -172, 109, 166, 105, -51, -15, -72, -10, 244, 28, -93, 254, 215, -105, 162, -39, 152, 177, -30, -250, -105, -30, 188, 27, -15, 51, 152, 20, -47, -57, 19, 9]
4752Ij25m3K32j03J66j33K56l03N9J95k55J55l83L13k50L73j78N9j17K7N8K26
4774B38j93j00K85k61j7j56K87o3L3J32j26j37kj88L13k6k29K95j29j51J9l5K62
4797E1j59L12k86L35j86j27J26K52m63MQL6N1M3L0P2k91L37O5n04M79k89K2J69
4821H7rk2k14L27j40k28J71J1r6K6J10o5Q0N0jQ5j78Q2p8K71j94J63l59j78L69
4846G0k54L06J45k92j47K80j97P6K84m53J6J55K30j34l09M99n55o0K33j62Q3k5
4868b11K25k79L47J46k25q2J18L2O0M5l01J57o0J00j50J09k2rj02K04j17J80k31
4891f6K07Jl47K57k5P0q0K5mj04K15l60J55Q5J50K5n2pk42K95J5j32k46L06j75
4916c4p9p6J42l5K03j11j68J17j41J39J8j22r6K73m02L24P7k2l07N20m67J86p1
$$ y = [9, -116, -159, 73, -30, 136, 3, 259, -44, 15, 210, -45, 110, -273, 40, -210, 163, -15, 44, -73, -46, 12, 238, 45, -55, 230, -31, -48, -204, 83, 20, 53, 185, 59, -78, -80, -268, 45, 19, -210, 85, -44, -195, -176, -211, 51, -108, 204, -82, 253, 67, -60, 66, 318, -145, -141, -133, -97, -46, -3, 27, 99, -192, 145, 210, -294, 185, -104, -82, 87, 78, 56, -158, 169, 29, -199, -28, -17, -113, -87, 23, -42, 38, 88, 87, 172, -6, 76, -2, 269, 75, 238, -121, -299, 70, -184, 122, 267, -25, -172, 108, -89, -13, 271, -182, -166, -11, 219, 85, -224, 275, -280, -340, -107, -269, -186, -211, 14, -265, 82, 228, 3, -79, 39, 71, 131, 176, -125, 32, -28, 72, -78, 31, 9, 0, -102, 102, -15, 165, -66, 141, 142, -205, 52, 27, 97, 17, 42, 38, -66, 149, -211, -56, 29, 179, 204, 152, 145, -97, 198, 213, 81, -165, 141, -34, -113, -189, -47, -82, 121, 10, -158, -41, -182, -43, -25, -147, -243, 30, -372, -48, 29, 7, -300, 220, -247, -61, -132]
4939a32J85j49J27J13pl01Q9K40j71JJ93j98O5o6k18K83J00p1o1j00L2j03M1o
4963a14k69O32Rk91K02n05M49J0k53K61j18j67Q1R8j41%K38qj57j8R9j91P1L1
4987e1o8L45pm00K77k23J64L4j37R1j18J01k37K66J35rk94K85j85k6J96j52j34
5010a47k33O17j02l2k54MJ59j66L41j95K01k31J95j06L1k26o0K7JL01j36O9J51
5033B09l75J70j54K11j46K41k18j8Q0J06q2j56L54M5l06jL1J14J4O0k99j0P9O5
5057A4j63RJ71K69k90m4L1O6j42K8r3r2N30m18K81k14L37r7l41K27j58nK9J41
5081G6Q1j67KJ30n9j61j4j10L90l59K82N8k08l7J54q8N9pJ02Nj44J63n6P4j92
5106b6k27L37j82J24L02k00k46J09m8m9J42k79L01K6j59L1J5j92K25mJ6k38N0
$$ y = [-132, 53, -96, 31, 144, 137, -164, -75, 165, -6, -5, 188, -10, 55, -11, -229, 54, 154, 83, 22, -78, -46, -149, -108, -114, -383, 249, 258, -33, 169, -336, 113, 123, -130, 131, 13, -154, -73, 25, -116, -116, 122, 114, -43, -61, 38, -153, -82, -51, -119, 226, 219, -181, 96, -127, 37, 71, -66, 25, -93, 8, -229, 37, 172, 163, -131, 154, -31, -57, 139, -13, -147, -380, 237, 135, 103, -151, -147, 12, -154, 187, -8, 193, -38, 157, 51, 82, -144, -204, -177, -176, 125, -11, 58, 209, -166, 4, -150, 61, -85, 156, -62, -80, 0, 106, 24, -132, 222, 267, -39, -40, -9, 105, 119, 179, -120, -130, -51, 14, -149, -140, 31, 300, 10, -34, -3, 63, -79, -51, -144, -236, 294, -124, 157, -57, 280, 183, -158, 69, -89, -94, -65, 76, 157, -10, -8, 122, 63, -98, -112, -222, 168, -191, 91, 149, -59, -96, 58, -30, 29, 22, 124, 129, -15, 148, 92, 166, -26, -253, 84, -98, 26, 328, 128, -118, -9, -57, -106, 36, -243, 58, 84, -75, -44, -29, -221, 4, 0, 16, -222, -172]
5129a72L28l24K24r5L45k43L6J14l33P9J11Q6k36K20j20r5K76R2l77j05J16J68
5151I5k87J16j6J27J14j04J34l68j72J44L55j00j36J38k12J4K49RJ40j31k5k16
5173a32J76J43m25K19J84k32L7j45J77j09J54J83j48J11j95k0j75M44k04K2n5
5194A0l0R7m1m6j16K04j14K4J37l18L00Ql1j35J60P3K3k59Jn1O6Q4j25N07m18
5219A0K90m72J82O5k27j76L58p4q8K55j4j06M4O4j35P1j38l4M3M6n8J51j73K34
5243A18J5j14j72N1J50J55j75J51j23j09O7k53R1J56r5k6R9J51k03J83p8k42K36
5266C3l6O5J1j41n9J59l2L39m24P8J54k35k1j98K56k8N2j31K81j93pL52l82J1
5290i6P6J36j11l43L96k20O3jJ07m0J68L4m9k37k28N86p8k30j24L72l90M30k77
$$ y = [-172, 156, -168, 56, -39, 306, 63, 99, 213, -120, -41, 70, 156, -80, 140, 20, -75, 201, 293, -84, -189, -73, 95, -192, -76, -92, 35, 149, 45, 179, -189, -361, -217, 138, 38, -98, 40, -172, -158, 91, 100, 240, 109, 84, -132, 44, 187, -238, -19, 165, -67, -30, -175, 2, -107, 47, 230, 82, 193, -2, -22, -197, 247, 43, 65, 10, -20, 77, 36, -10, -126, 78, -36, -12, 125, -193, 107, 115, 84, -51, 109, 182, 205, -54, -53, -104, -38, 46, -79, 428, 10, 300, -172, 10, 75, -152, -328, 30, -44, -132, 123, 109, 3, 47, 111, -24, 47, -91, -125, -82, -36, -94, 57, -116, 118, 133, 19, -153, -102, 48, 203, 28, 179, 56, -53, 14, -239, -148, 8, -87, -113, -14, 137, -66, 117, 39, -203, 33, -3, 62, 73, -68, -127, 32, 0, 339, -85, -7, 147, -88, -109, -307, -51, -79, -27, -158, 123, -70, -77, 275, -107, -96, -20, 116, 5, -338, 58, -162, -99, -100, 7, -33, 135, 169, 120, -117, -345, 241, 163, -67, -191, 181, -209, 221, -56]
5313e6J58L6k63K22n4q7J33L8j33L04k23j82j31K85Mj01P4R5L1j51L3k18K26J74
5337B14k99K21k24N6R6k39J38J57j99j12N55o13K89J40k04Pj50K42k78K14L7Q
5359E6k27oR8L4J36q6m5kO4m7j9K84R6n09J94kj61j57M4J53L11j58J05j74j60
5384a78J87j8P2l63K55Q3r4J15L4l4J90k07r2pk4J42k94J75K20k8J63k99q9J07
5408A6n4K59k03J47r7l33M17M3R3l59K36N5l29J92j95J35j36K08J1j70L3r1L00
5431A78k12J50j48j7O6j22j60K83N3k17K54l38K81k41J95k85J53j40K89l2R7j52
5453f5KR7k83J5K85n2k12L99k60J13K71m77J65Nj26Q2k5K89j78P2j73J35j93J15
5477Aj81K87j85q9L61k71J38n2L2k2K68l58R1k20J47R6r4L9m6J75j2j78N1K32
$$ y = [-56, 102, 138, -125, 97, 43, -44, 89, 127, -6, 298, 75, -107, -238, 47, 51, -50, 24, 119, 150, -1, 32, -186, 40, 214, -85, 136, -88, -32, 64, -175, -37, 120, -79, -191, 364, -249, 40, 180, -24, -17, -167, 75, -203, 11, 48, 56, -171, -177, -79, -45, 91, 5, -40, -42, 22, -25, -44, 240, 336, -173, 21, 19, -142, -299, -255, -102, 209, 51, 156, -18, -178, 9, -9, 63, -300, -45, 38, -56, 59, 93, 59, 249, 42, -50, -57, -81, 61, -233, -58, 162, 134, 297, -2, -91, 16, -38, 221, 18, 165, 68, -265, 152, 195, 288, -71, 165, 220, -109, 83, -112, 23, -113, 95, 106, -64, -31, -122, 178, -34, 116, -32, -49, 17, -105, -265, 18, 71, -146, 108, -230, 51, -190, 5, -280, -127, -267, 22, -10, 87, -65, -63, 34, -249, -234, 51, -1, -213, 186, -74, 39, 310, -167, -2, 3, -123, -41, -66, 223, 45, 117, -56, 79, -114, 1, -180, 107, -78, -167, 194, -77, 61, 9, 41, 19, 287, -71, 20, -200, -53, 43, -51, -12, -58, 117, 105, -73, -22, 210]
5501B10m23Q1r1M20m6m76K56q1q7M25k02k1J29j62K80m00K91k8N4j0j69J00o0
5524a0j67L73l89L23l30J13M1K29m1l03R1N2J75r6O3l43L24k28K56k30n0J59l32
5547c20M82m7k36K78J6k27K08j60N5j45K94j21O9k18N1J97k66J18n2Q0J8q9p1
5570h6L2j28L69j80jk08L08K6m8j24O3j5j75M43l99J06m6lJ77j66J59l3M6r0K6
5595E3J91k08q2K19j84K4J9K7k72J93p4K00k88K47N5K1k38M6J75n8j96J14m5K11
5619A50lj03K9j46K28k97J5j16K27M5q7n1O5n1K10j57K42q4J40r9k84J80k67J1
5643b03K71Qj96J31L8J57m56M11J16n38J19Q8R4K4j32M4J42J15k80m0O8j30K78
5666A29k5l21L00L9q6P9l79K58k02L09j00k24K24J3O0j68J96k66J86m4j82M34
$$ y = [210, -213, -132, -223, 197, 151, -325, -69, -150, -237, 188, -14, -35, 94, -68, 212, -188, 103, 75, 129, 119, -50, 50, -10, -177, 196, -193, 130, -200, -87, -46, 183, 142, -161, -70, -18, 157, 61, 124, -219, 105, -123, 133, -97, -147, 12, -320, 162, 115, -121, 157, 173, -54, 154, -6, 49, -96, 198, 77, 146, -72, -21, 176, -90, 28, -24, 56, 74, -15, -86, -54, -182, 187, 7, 6, -202, 106, 132, 84, -40, 23, 8, -167, 276, -123, -17, -63, -66, 111, -55, 104, 71, 117, 27, 53, 244, 36, -46, 173, -11, 13, 32, 59, -213, -20, -94, 106, -182, 65, 120, 141, -97, -51, 124, 66, -130, -16, -61, 150, 147, 44, 73, -73, 155, -142, -127, -243, -16, 29, -58, -109, -44, -95, 115, -42, 200, 116, 256, 157, -127, 53, -214, -203, 68, 76, -120, 11, 49, 206, -250, 161, 277, -261, -142, -54, 40, 64, -68, -24, 118, 233, -47, -87, -19, -149, 129, 104, -217, 83, 122, 36, 115, -264, -6, -208, 101, 1, -223, 1, 14, 74, -94, 102, -164, 22, -22, -204, 230]
5688B30m38K13K19j32L0r0l2j58jK59o2J67k67K11j92O6k09J24M18m52j7P0q2
5711a25J69n4J8p8K75k83J09J11o0q2j23k7K64j95nK51j42OJ28j72J0k77M95j71
5735D2K0K87k16k19K20j23j94L37P2l60j21O19m46o7M00k66O3m8j82Q9l2J90L2
5758I7m7k22K72J01j61q7Q8K37r3j81L5j37j7J85n6J46k90o2L19l15M91j49q4
5781G0j28J38m8R6j62k3r7K92j43l8J39k51P8J72j61L5j2j74J34K52L4k45J58
5804A16o6j9M9J3O6j21j53k6Ql9K78j32J78l09M7K3J65k26k03J75K74k23J1K67
5828A53l43M14q4PQk19J67k17K2J92k16O2Q7n8J43j83K2j71R6M6n7j27K71K1j43
5853a07J74J06j10j17j42K78j0q6J3j59L0Oo9L19r0k45K22o8J11j3K41l52J61
$$ y = [230, -208, 5, 224, 92, 122, 32, 0, -158, -159, 100, 38, 205, -62, 149, -43, 23, -186, -62, 356, -96, -113, -43, -125, 44, -10, 8, -70, 205, -78, 31, 142, 82, 0, -123, -150, 114, -81, -86, 165, 23, 29, 157, -15, -5, -282, 213, 42, 62, 349, 133, -86, 134, 11, -183, 154, 226, -134, -255, 364, -82, -149, 251, -15, 48, 0, -182, -93, -125, 65, 97, 50, -172, 100, 201, 40, -47, 41, 278, 185, 4, 39, -98, -115, 70, 14, 160, -130, -192, 127, -188, 303, 154, 70, -58, 80, 32, 128, -34, -57, -154, 138, -5, -43, 96, -155, -77, 95, -66, -31, -43, -217, -83, 169, 203, -42, 116, 50, 31, 80, 93, 159, 38, -115, -141, -133, -172, 106, -26, 152, -157, -110, -87, 78, -148, -351, -176, 98, -125, -114, 153, -190, 224, 140, 147, 155, -64, 103, -114, -92, 100, -116, -54, 33, -25, 118, -65, -43, -214, -118, -72, -129, -256, 15, 36, -107, 67, 173, 63, -54, -196, 82, 72, -14, -1, -160, -130, -124, -193, 126, 36, -209, 13, -55, 56, 43, 284, -68, 93]
5876I3j55l79O86l51R3k31L64r8j58K78o3R4j92j76L39q3j42p4L47j05J14j89
5898A2r1K99j71j81J23J53j30M5J59J74k48J9j99J18k13NJ91k61L09J08k3m80
5920b82L47j78L1K31k34J41J04k23J22l21O4K67l11O0K37k24L7K15K01l23K3j45
5942a61k17M30j77K72j49j1j87M10k35M3m7R2j33P0J61Q6k48j92K2J89Q1o1L6
5965G4r1q6k0P5L2r0L16NOk26P3q4K45l71K10m5j02n3NJ4R1%q0J3J06P6k93J59
5993d1J62J43m1k44o0J45o6L3k42L59j28j24L15j43j28k5R4K01q7j28L64k14k19
6016g4L2P1p1L61k66J71j79l8K29j60K13l90J68j65M7J39o2j80J19M5R6r1Mj27
6040a08L38m28J30L04k08J79q3N7k30o3O1p6J01L5J9j81L28l35N0p1J7nO1n2K43
$$ y = [93, -62, -441, 245, -106, -13, -244, 120, 22, -136, 142, 79, 173, -19, -195, 144, 61, -81, -155, 192, 87, 201, 12, -79, 220, 49, -132, -9, 144, 14, 59, 218, 392, 144, 163, -36, 82, -131, -126, 65, -196, 113, 221, 198, -282, 65, -113, -82, 149, -85, 56, 160, -63, 59, -262, -198, 69, -242, -182, 55, -169, -132, 83, 284, -39, -16, -161, -378, 52, -125, 147, -2, -13, -200, 210, -25, 18, -29, 63, -70, 0, 161, 247, -1, -193, -171, 18, 99, 38, 74, -17, -103, -123, -48, -16, -106, 210, 215, 221, -5, 68, -16, 229, -142, 68, 23, -79, -132, -127, -113, -22, -22, -102, -89, 17, 93, -200, -41, 121, 264, 223, -21, -81, 64, -2, 31, -211, 148, 20, -104, 211, 68, -60, -85, 9, 210, 123, -5, 359, 145, -74, -42, 29, -42, 319, 53, 224, 45, 7, 236, 76, 289, -101, 67, -98, -51, 88, 26, -154, -35, 10, 106, 15, 19, -108, 230, -198, -68, 236, 28, 207, 124, 181, -49, -112, -51, -127, -26, 9, 28, -153, 175, -160, -110, -181, -164, -169, -108, -160, 83]
6065H3j33P4M5j47J80l0n1j01K15k56J41J40m94K97j15K50j56J56j20l5o4N1K06
6088A36j43M2Mj5P6n8j92J05K0J34Q5m51M20k65l9J54n7N6R9j95J36R6k61J49
6112C6l8l48K16J11j46R2N5O7j63R8j34J29m7J74j48j13R6K9r3J18J0K21j62j31
6136g1K3P8J73m09K63j24J32l47K66j6j06J18j20l6J55k15J66L7K56Op1o7k40
6159a49L43J09l09M3j5J60k50Ol4R8J9j32O1J71k1j8k56j75N66m74L79Kk18K71
6183A77o6M7j81K29j88J1K16j96J87j50k42K22j74K24j96J03J69j65k15J22J06
6204D0Q4j91J89J5k90N6j55J31l2K11o1j12K87m46K74m03L11N5Kj68K56j52j68
6227b67K25L4m7J3Q7j71K48J70k49j69M49l71j23K30m5L6k4k58J19M0K8o7l3j9
$$ y = [83, -50, 24, 69, -78, 102, 72, 21, -80, 135, -121, 20, 160, -334, -37, -152, 98, -58, 98, -22, -57, -121, -70, 136, -7, 35, 39, 24, 100, 42, -150, -45, -25, 109, 194, -257, 163, -102, -141, 13, -44, 12, 111, -84, 52, 148, -113, 36, -2, -350, -134, -23, -169, -77, -22, 45, -118, -20, -154, -25, -72, 102, -46, -159, -63, -34, -127, -9, 1, 222, 60, -71, -48, 30, 203, -206, 57, -67, 65, -282, -16, -32, -138, -20, -140, -176, -21, -236, -70, -33, 223, 229, 158, 91, -149, 194, 303, -6, 37, 22, 182, -68, -62, -96, 2, 21, -111, -50, 121, 100, 82, -174, -349, 217, -257, 122, 124, -94, 177, 111, 158, -23, 206, 18, 29, 245, 49, 236, 86, -156, 66, -108, 116, -80, 23, 192, 27, -188, -66, 40, 124, -67, 122, 137, -153, -97, -252, -121, -153, 58, -3, -115, 172, -274, 0, -403, -92, -37, -35, -203, 53, -99, -267, -42, -8, -55, -42, 45, -126, 122, 292, 43, -126, 323, -48, -171, 59, 14, 50, 26, -232, -113, -73, -45, -112, -145, -164]
6251a64K31p0l3j8L1ro3l4j1O4k71K05M50l70M3J92l88J52K83l95K91k1M6k09
6275f8j1J15j46K70l4j69q1j91K79J56j2m7qQ0l47K50n4O3Q6L04o03L51k01k5
6299d3P8k25L84j25k8k66L06p2m8k2l1K21l65j6K47j87N97l44k9N7R8j29J14O9
6323B41k74M2K2j51J31O2j30K07k08L9n8M7j2k21M3J10o0J62L6n3j69K51k02J86
6347D1J00k42K32j86M53l63p7j22K89l72K88j38M30k98m8o1J56k61J42L49o35
6368c23L24M1j64P9O5j74J55K07j73j32j75J27K10r6p3K93m5l9l34J81L39j99
6390I4m48O00j22j57J14l4p3J00R6j38j55M23q2k07j5o0j35j0L21k82M20l51K10
6413A09j33q4R1J10n4j44J55M9j63k57L14l03M32j43Q3m03K49K60q3L1k60K70
$$ y = [-164, 67, -3, -36, -54, -23, -32, -95, -129, -140, -76, -347, -142, 308, -62, -19, 173, -215, -63, 220, -175, 116, 95, 141, -68, -79, 36, -110, 160, 126, -43, -124, -315, -36, 120, 108, 61, 53, 133, -214, 36, -18, 45, 131, 435, -168, 183, -18, -43, 35, -190, 194, 69, 41, -225, 81, 9, -39, -61, -92, 129, -236, -252, -5, -192, 405, 61, 32, 89, 187, 58, 172, 241, -33, 9, 31, -120, 11, 73, -57, 150, -58, -19, -77, -30, -42, -263, -220, -110, -170, -8, 28, -25, -194, 57, -145, 41, 141, -101, 131, -55, 398, 35, -42, -164, 125, -247, 41, -97, 333, 35, -13, -74, 82, -179, -37, 312, -323, 1, 42, -122, -43, 22, -152, 3, 210, 37, -95, -270, -143, 67, -29, -102, 191, 146, 107, -227, -46, 293, 94, -354, 246, 124, -33, 81, 47, -26, 74, 170, 32, -123, 300, 218, 11, -4, -64, -199, -209, 112, -170, 250, -101, 109, -24, -108, -17, 93, 39, -105, 50, 99, -64, -321, -7, -310, 122, -21, 62, -341, -92, 168, 85, 116, -144, 126]
6435A26j88J7J99k85J56k21L95j57J74l28K13k17K5R7p8j37K35j73j4L41j70J5
6457B5R7k1r1m1J32k65L30j20L7p2M2L2K7M2k03lK73q1n6%j68J35J6J19l20j3
6483a47K69j82P6J11n6P1j14K55j57m5l1j29j09J31j3J00K1p5k77M11j16K69r2
6506A71n4J05l56L09j65j00J37N2k97O5M1p2K03j62K55j56L5N0k1O9j57R0J53
6529A95R3l53K57n6j31j02N3J75M0k85l0J88M0L3m19O10j09l48j02K86p7j74R2
6552a24K09L6k44J29j12K31R0k27J9L7k13J93j74j03J87N8J14M3j6l95J15J97
6574E0J7j87O8j8K20j67O2j10Q6M3j96K44n9k22N8n1L70n1p6j84L3J79j9j09m
6599b3nL17k83M8rj79J45N7j2k38K38Q3J77l91J30l2J84k34Q7k22K05J11l55Q0
$$ y = [126, -62, -45, 154, -131, 25, -196, 199, 42, 216, -112, 101, -116, -91, 6, -72, -209, 26, -147, -161, 180, 10, 25, 122, 101, 10, -31, 101, -164, 166, 46, 83, 11, 53, 85, 112, 154, -49, -52, 221, 140, 84, 84, -84, 51, 67, 186, -134, -147, 122, -60, 16, 127, 71, 142, 28, 283, 126, 81, 50, -79, -188, -57, -70, 30, 51, -24, -301, 110, -6, 263, 171, 117, 222, -134, 175, 10, -90, 47, 99, -198, -133, -92, -164, 39, -123, 132, -24, 11, 61, 40, 109, -48, 42, 195, 288, -65, 192, 136, 5, -97, -44, 131, 171, -114, -144, 44, 84, 117, -302, 308, 199, -149, -251, 35, -42, -216, -124, 85, 121, -123, 6, -106, 125, 215, -12, 7, 44, -169, 24, -150, -253, -66, -8, 106, 149, 133, -262, -147, 50, 67, -120, -52, -70, 150, -17, 45, -65, 21, 64, -132, 112, 53, -169, -111, -162, 208, 157, 81, -103, -70, 109, 90, -19, -23, -28, 289, 6, 54, 45, -134, 11, 68, 56, -182, 56, 139, 316, -75, 55, 23, 207, -27, 60, -162, 43, 154, -201, -121]
6623a21J24M0J69j27j61K38k28J47j10J23l23N8J98n7J05J20l54j0K29q0K34k60
6645d6J3J96k28K44j52j10k2PM50l15j00o5J56k5L6j79K34k05K03k64R2j13L57
6668A64j94J23j17n9m5J27%K98k79j9j94J66j76K37Q9r5K41j11j16j27R5k81N54
6691B81j36j19K15j69Rk17k8o1L12q9L9j11Q7n9J71l08K46Kl3k68L00m42J60J17
6715a01L28p4j05j39J25Q8m16J69J55j12J1J51L7q4J8r7K8K38j39J20k00k25k
6738b26J06L75l0l18Q4KM49n49P0N1l0m6O6J17l27J02K39k44o0K64j03L7M9j65
6762h7N9j2L8j37K22J25l8R5k20j61o1K05K39l62L77l32J57j99m7L12l15Q3J84
6785A25k58rK64j27p9k40J68K46J7k16J01L23M1m52J09m6J8n9J09Q8j42j3j92
$$ y = [-121, 3, 43, 212, 85, -76, 162, -66, 81, -29, 94, -229, -171, 27, -30, 75, 195, -159, -169, 60, -20, 214, -46, -33, 163, -65, 179, 27, -83, -105, -98, 352, 37, -63, -128, 28, 3, 39, -140, 94, -111, 92, -172, -80, -193, 164, -30, 93, -24, -83, -128, -1, -1, 297, 18, -1, -195, -29, -205, 32, 121, 26, 267, 156, 40, -87, 8, -273, 281, 145, 26, 241, 72, 81, -136, -164, -225, 87, -2, 37, -74, 13, -46, 125, -183, 63, 65, 32, -236, 64, -378, -218, -101, 227, 153, 48, -91, 34, 122, -294, -125, 30, -82, -71, 80, 117, 33, 51, -46, -18, 220, 81, 201, 1, -224, -226, -120, 255, 225, -93, -9, -7, 442, -107, -37, 14, -16, -62, 4, 121, -206, -104, 135, -109, -169, 95, -8, 29, 78, -87, -28, -40, -2, -139, 83, 208, 170, 265, 45, -116, -177, 28, 267, -95, 282, -50, 107, -92, -139, 173, -142, -59, 125, -133, -142, 122, -5, -84, -324, -156, 90, 107, -109, -8, 315, 356, -96, 13, -33, -15, -74, 35, 123, -19, -32, -224]
6808b24K85j64o0J58j00J39j18L59l16K05k26J54k04J80K08l25pr1M87k20q1K9
6830F8n7PJ25R3k15r9K93j28L2k19J23n2k98K33J32j71R6K6J16k31K80k54k29
6853c29J84L39j67m4J59k76J41J3l7Q1r2j72PJ12K70j0k60k22K77l3J42j51J76
6876A08j99K03l41J8J88N6J53r3LoQ6n6j14%K3j09J27P3Q9j27m7J58m4k58r8l9
6902b46K49NK7k03M5P1Q8J93l00J75j35n8P8J13j60L28l09Mo0M1k0J20L6j98L08
6927A92q4k9o6J29M2k72m4J69j1P5j48j51J48J56J44j7j70L1J28j48J37j96Nr9
6951g9K82m84K87j05K5K56k49P7K84j69l21P2K70j36J06m5r0p7l9J54K84k88r2
6974g7J11J3P0K42k21j07K30j25m0r0J63k37l8J58K33j62j53J55k5r6j59L27l74
$$ y = [-224, 61, -103, -163, -5, -105, 34, -84, 275, -41, 164, -62, 92, -112, 68, 276, -49, -56, -147, 340, 120, 39, 68, 11, 18, 143, 236, 21, -78, 215, 87, 119, -100, 23, -29, -327, -94, 38, -133, -37, -11, 105, -126, 154, -100, -329, -145, 194, 27, -17, 142, -134, 7, 20, -17, 64, -28, -200, -193, -81, 189, 179, -81, -303, -26, -59, 83, -68, 108, -91, 112, -229, -211, -23, 33, 186, 93, 96, 90, 176, 120, 6, 6, 29, -80, 47, 120, 209, 82, 35, 193, 149, -109, -207, -246, 3, 8, 35, -168, -123, -52, 36, 229, -71, 104, -31, -89, -11, 102, -58, 270, -39, -35, -95, -54, -74, 46, 82, -116, 192, 108, 79, 13, 142, 184, -88, -132, 37, 26, 101, -47, -198, -50, 106, 250, 233, 63, 94, 222, 74, 211, 15, 20, -79, 203, -281, 6, -99, -74, 182, -67, 10, 294, 125, -196, -124, 146, 10, 116, 71, -19, -96, -135, 19, 303, 15, -77, 34, 47, 117, 359, 138, 31, 261, 136, 96, 6, 169, -68, -106, 52, 285, 123, -30, 125, 100, 4, -155, 172, -202]
6997b02L08P8k18P7q4r4K70n7k15J58j26K08q6n5q4J52k28K59j48M33l76M9J44
7020A63j13o9J27j10K24k51K35j22m6J38l34M55k01q3J59k4J9k88o5L16j7k18
7042a05J64j37j03K95j75K46m24J91l6N9N7r8J76l18L89k57j30J67j2J47J05l82
7064a81L70j30k82M29j73J03r8J64k26p5N3K93l35K71j13R7q4j03M4l5K60j93
7086E6p8J6o0J08k2O2L1j9q5j54j9K34Kk10K61l6j95N4l6K2M32m63J61j72M1K59
7112A90j73K01p7j02j22K1J9L7j58K49k67J66j95L10j8Q8k73k4P2K02J56j70j01
7135C1p3K02q4k04Q3k5k71K15J2J1k6P4k40K2K85J12j15n7J10J67n8m36K64K8
7159B7l58L94j00L6N1l6j73K51l3k62K85l30L28q1J3o9L1j18J94q2R0q4K3J57
$$ y = [-202, 106, 184, -34, 43, -41, -135, 135, 78, -137, 21, -105, 103, 17, -38, -122, 30, -198, 61, -87, 346, -30, 19, 163, 50, -19, 108, -2, 222, -29, 206, 84, 38, 176, -158, 297, 96, 13, 172, 148, 167, -121, -186, 130, 113, -105, 59, -78, -181, 114, -61, 185, -239, -48, -84, -25, 32, -66, 110, -208, 181, -76, -206, -39, -51, 96, 201, -181, 189, 59, -223, 206, 33, 136, 38, 202, -24, -99, -46, 247, -88, 183, 70, 167, 83, -20, 24, -11, 249, 56, -22, -6, -66, 42, 20, 82, 113, 94, 9, -145, -164, 70, 72, -138, 123, 87, -108, -54, -90, -68, 364, -99, 62, -110, -69, 190, 17, 218, 141, 39, -83, -62, -43, -6, -164, 85, -182, -16, -211, 99, 81, 169, -104, -128, -56, 146, 302, 132, 31, -42, 160, 76, -128, -45, -70, -341, -126, -114, -103, -129, -55, -295, -273, 12, 124, 9, -48, 62, 229, 171, -265, -1, 27, -331, 63, -37, -1, 50, 14, -159, 92, 59, -203, 82, -248, 80, -1, 12, -57, -26, -144, 50, -32, 58, -26, -3, 154]
7183A54j96j20K97j37Q8m3Q5j42l1J40j22k10O1J30P5J47Jj70l1L9j93J24K46
7206A92j59RQk26N37k54m10O7P7K65j89n3J64k9k48O17l84n9Nr6K07j33m0J02
7230c0J89l89L04J5R1r2k98N3K73l68M00j28n0K39j34j90K41Pk09K1Mq0m4J33
7254d2R1L1n8P8j88N78o01Q3Q0K27k40M1K4M5j78J2K83m44K58j36J34k29K13J36
7278A98k13J03j48J71J61j92l22L58l03R3l5J77K53l81J21j1J0j01n6J09J16n6
7300E2J8P4O4l64J52J93j01Pk92K99M6m60K44mrl2J5L6J05m4K4K02j14j47L02
7325B66k44l2J00r7j68L15L5k33N1L6j5l9O4k8j22n1Q8K36j16j19J7k08R1Q1j44
7350b36P6J09P9j6J9jQ6p3k56J14Q1o8R3j37J63j35K49j46O4m34L22M22j25k96
$$ y = [154, -42, -162, 135, -2, 86, 43, 128, -14, -45, 95, -27, -237, -176, -46, 29, 176, 177, 7, -24, 15, -178, -54, 192, 33, 42, 50, -176, 361, 107, -303, -236, -159, 106, -83, -136, 28, -1, -249, 368, -16, -75, -70, -166, 41, -92, -132, -30, 159, -230, 74, 89, 180, 88, -210, -157, 116, -252, 148, 20, -30, 209, 75, -115, 126, 133, -76, -55, -51, -131, -175, -42, 49, 80, 22, 100, -88, 490, -111, -28, 52, 279, 39, 80, 104, 149, -29, -17, 266, -178, 80, -56, 78, -151, 62, 198, -15, 88, -60, 111, 272, 80, -242, 116, -187, -94, -129, 48, 301, -80, 41, 30, 40, -61, -117, -8, 108, 52, 70, 144, 208, -156, -4, 189, 88, 95, -197, 102, 148, -312, -68, -72, -81, -113, -98, -62, 43, -1, 23, 225, 111, -36, 266, 22, -10, 90, -7, -175, 140, 175, -58, -7, 29, 14, -25, 39, 11, -111, -162, -74, 162, 46, -73, -56, -264, -173, -92, -236, -160, -51, 28, 12, 31, 30, 116, 43, -213, -99, -18, -86, 7, -130, 33, -102, 147, 1, 65, -369, -47, 375, 250, -46]
7374d6K18j63j52K52k31J60p8O3L5j22J92n7l1J25l29J90k31K37l39M25Pj31N1
7397D5j15P0r2J42k31J41P2R5l20J96n2J47k44J39k18M8J62K72j58OL00k97J6
7420A24j18J33O9j4k13J00K84l09l5p1K74k33j18K39q3K9j56J88J7q4R1m6oj46
7444h4N0o0q9M37m71J43j56K78L8j1k7j5K9k91j2K84j00O1j48N2J84K6j08mj66
7469a60J19q7J12J02l94oK71L09j86o6Qk0k69M8L50k69K3L0L5q0n7K16j02J25
7493E2k29N2K07K25m45J55J11l12K56P3p2l1J9O1k64J21l32L07P8q2O0p1L78l20
7517ck7J47o0j25J6n0j01R9J64j55J03O6k43K47r8JM3Q4j66m6q7K37m3q0J81j07
7543cm6J49j47r3L40l01j09L02o0K8l0m7k2J82j4l11j1L47R7n31K70J2J5r7J42
$$ y = [-46, 172, 9, -143, 109, -122, 38, -40, 23, 58, -64, 128, 71, 40, 165, -164, 26, -205, 32, -307, 118, 125, -6, 45, -70, 0, -92, 50, -181, -40, 32, 127, -193, 3, -49, 98, -146, -7, -225, -177, -15, 257, 99, 105, 405, 108, 124, 6, 139, 208, 194, -19, 81, 365, 56, 21, -50, 224, -9, -127, 112, 29, 58, -98, 90, 107, 23, 114, 68, 62, -84, -34, -94, -183, 254, -217, -74, -230, 48, 86, 75, 48, 33, 62, -229, -241, 43, -57, 4, -144, -92, 92, 118, 10, 6, -160, -41, -128, -16, 86, -308, -314, -43, 266, 80, 14, 22, 2, -267, -219, 131, -138, -115, -85, -50, -130, -187, 29, -73, 52, -177, -125, 82, 307, -138, 17, 128, -184, 72, 145, 73, 42, 61, 122, -142, -21, -353, -46, 32, -50, 10, -61, 317, -3, -30, 117, 57, -68, -52, -102, -203, -104, 60, -95, 8, 74, -169, 78, -20, -19, 24, 108, -58, -104, -191, 46, 3, -77, 104, -3, -49, 100, -47, -140, 200, -101, -210, 92, 32, 60, 30, -17, -39, 143, 129, -182, -193, 154, 251, -280, -10, 2, 17, -80, 62]
7568F2k13K04k9o2k7K47r6k1r9J93j93P2o7J31j87K59k67L4j5K29j25j42J68K5
7592H1j41j51K68m0k7M2Q5L8k35K25R0j92k8j12L27j90j40P2%k0k39K83Q0k60
7616a84K01N7J33j72K9M9l79K78L3N4j97K14j27l9Q1j36J6J15K1j19j80K20L9
7639GJ3l03P2O5L29m9l27J81k1l00L02J14L0j27K2r9M1k19K36P1j58j87L37k36
7663b06J78J02k01J45k92K03L03k85L7q6Jj54L98J08m15q2K76J10j58ro1r5K16
7686C3j60K09j30j84M6K16R9Lk12j16K43J93k52Q6o5p8J90l50M9J75J52k70K02
7709G9j33K14l25P5P1K1j05j14k8L85j60J06j46J02k71K5K14j26J09J61j88M9
7731A5k39J61n9J96m2n5P2o0K00j4k39J46j86m1K08j18J87j37r7k8J60J60k58
$$ y = [62, -151, 53, 24, -38, -65, 182, 86, 65, -34, 159, -34, 38, -29, 102, -85, 174, -93, -59, -74, 155, 30, -112, 56, 81, -60, -211, 57, 17, -10, 32, 117, 155, -80, 145, 235, 43, 15, -97, 230, 40, -100, -28, -28, -48, -287, -4, 76, -184, 17, 74, 207, 35, 64, 113, -266, 12, 45, 99, -98, 116, -11, -50, 31, -105, -89, 26, 47, -72, -252, -32, 7, 20, -283, -211, -146, 183, 134, -193, -12, -33, -333, -31, 83, 113, -14, 8, -91, -50, -269, -33, 38, -120, -307, 30, -206, -28, 74, -127, 18, -274, -71, 232, -53, -16, -102, -101, -255, 143, 251, -164, -246, 30, 140, -18, -27, -88, -183, 33, -127, 82, -48, -232, -186, 30, 129, 132, -80, -196, 47, 240, -12, 74, 9, -69, 121, -229, -180, -5, 147, -123, 79, -54, 160, -165, -90, -19, 2, -103, -217, -245, 140, -20, 86, -60, 42, -229, -204, 10, -116, -7, 154, -34, 15, -224, -63, -122, 74, 32, -23, 49, -11, 189, 175, -64, 82, -104, -145, 63, -55, 132, -5, -102, -130, 30, 190, -68]
7754f8J69r9NJ06p5O0J9J46l17r2P2J01P3j42J90q6n0P3q2K29l43K35r6P4q9J01
7780A14l05L40M9l33L1J70j86Q0J18m1L05k24k11m3N2K78o0o0n1J1j40K25K2j52
7804a1k0m8k4J43K0q5l7O9O4J00J42n43L40Q4l45j08L87j58O3L47k92j39O3n5
7828d3J00J12l39K54m0K1k73K20r3J63j67N7P2j81L44k08L6L4l5Q7j61j04J44
7851@J44k65R7K99k09J64l80K64k20J78J05J79l43M5k4j84M72l76J84Rm31M55
7873A63N7l83J87J61n9j51q6J09R6Kk20o9K64R7j64l9J45k26J87K24l44j42J43
7896d8RM7Q5j58K93j23l04M0J05J13j92J59l7K06j12j1k72J18j7L54j90k11Kl2
7920a76M94k86O1l6n1k69K90j0j32P0J60k36L5lK62l16l2K00J7k75J99O2j85L1
$$ y = [-68, 101, 2, 7, 113, 38, 98, 117, 263, -54, -146, -74, 27, 100, -42, 148, 62, 12, 85, 3, 232, -111, 124, 28, 102, 13, 114, -191, 149, 198, -135, -104, 66, -120, -40, 78, 37, 342, 118, -93, -136, -84, 194, 134, 74, 23, 34, -106, 119, 141, -11, -31, -79, -103, 40, 60, -25, -62, 7, 71, 171, 313, -230, 110, 194, -151, -259, 128, -30, 33, 380, 88, -51, 12, -43, 57, 169, -170, 84, 44, 65, -208, 12, -81, 82, -85, -28, 44, -137, 207, -1, 35, 69, 34, 121, -40, -144, 0, 144, -121, -24, 275, 66, 230, -150, 114, -106, 72, 177, 356, 13, 58, 34, -150, 322, -54, 130, 139, -292, 163, 220, -163, 24, 185, 126, -25, -111, -2, 94, 96, -124, -193, 71, 168, 4, -35, 110, -116, 71, 295, -49, -191, -48, -39, 8, 93, -65, 228, 105, -199, -159, -54, 59, -133, 26, -11, 195, 83, 72, -200, -82, -99, 255, 65, -146, -144, -176, 318, 32, 93, 57, 6, -263, 27, 17, -115, -45, 115, -121, -86, -89, 173, -143, -175, 25, 42, -233, -34, 28, -157, -126]
7944a26R7J39j27L85n71K14R9K35k96j66Q2N2l8K72k46j30q9J94J0R3o3j54J17
7967a7k0j7J03l42J56R8qO4j45J39k78L36J2r5R0q2J17o3J07j40K10j00m0j6j59
7992i0p2L5J68J9k43J07J19J3pj6M0K2j79K03n26L23R8m7K11q2P0J58k37k45O2
8017i6J64k40J82k4M8l58K22K22k53n4K62j40J86l11mK09p3O0J22r4j28J88k63
8040a73J61K65l12P9J03k03M1M7j69J05j01R0l6N7l0P0M2k52J6L02J40k35N1J12
8064A70J30l02j6M6N1j06j30K11k5J89l51O8J5k5R8J94k34j33J67l6%J65j33P4
8088H7M6NK9j95j24O3QJ67j54N6N9j46L42n04K05J56k57K55j48J84J8k37Q9N1
8112E5k13P5R3J16k7l55K73k34J08J49p8J11M4p9o4K0j53p1K58Qn9n7K41j62J14
$$ y = [-126, -29, 110, -17, 368, -203, 11, 110, 345, 49, -117, -35, 17, -21, 251, 5, -125, -214, -20, -10, 83, 20, -134, -17, -37, -54, 49, -293, -137, -39, -47, 17, -128, 11, -267, 69, 81, -14, 76, -6, 111, 48, 155, 15, 225, 125, 85, 69, -90, -162, -127, 41, 60, -183, -76, 43, 56, 49, 33, 73, 95, -84, 119, -407, -84, 14, -33, 178, 96, 166, 324, 87, -158, -96, 68, -172, 10, -14, 34, -324, -102, 120, -133, -187, 75, -65, 121, -190, -194, 15, -58, 2, 124, 30, -98, 90, -173, -12, 253, -59, 20, 123, -80, -39, 8, -161, -56, -157, -67, -103, -46, -76, -6, 36, -216, -200, 102, 242, 7, 58, 170, 300, -2, -18, 28, 79, -27, -157, 54, 29, 218, -133, -65, -50, -75, 23, 217, -17, -150, 17, -19, -19, 146, 13, 87, 133, 138, 167, -28, -152, -89, -81, 86, -68, -12, 47, -99, 243, -261, -56, 100, -157, 98, -50, 134, 152, -85, 4, 55, -158, -83, 10, 126, 99, -256, 17, -217, -109, 40, -38, 73, 117, 38, -26, -6, -159, -230, 28, 36, -23, -80, 161, -1, 113]
8137A13l34k2J83M2K1j36K48M9k48k9J54J06j07QP4k67m4J94O1k48M16k47J07
8160I4j16R4Q3M4k33j10O9P7K25j23k16J15M8o9J3R2j27K51k61J36M9j05j14n7
8184a41J76p3K69k24J25R4k66
$$ y = [113, -221, -243, -60, -18, 3, -133, 115, 164, -84, -113, 41, 147, 40, 48, 122, -145, -189, 5, 66, -182, 234, -13, 94, -22, 72, 155, 199, -34, -144, -75, 2, 227, 104, -112, 3, 51, -18, -5, 87, -40, 211, -50, 86, 135, 30, -84, -141, 35, -38, 231, 7, 132, 226, -40]
8191d0
$$ Imaginary data points
##PAGE= N=2
##DATA TABLE= (X++(I..I)), XYDATA
0@%%%%%%%%%%%%%%Nj3J6j6J6j6K4l2L2m0M8n5O3p2Q6r7J08j22J41j61J80k03K28
37A20k53K82l15L52l91M33m80N31n86O45p11P84q64R52j048J155j276J411j565
56h24J740j939K175k456K792l210L743m448N427o877R252j3782K5344j06206k20433
71c09702L13135K41310k19458j76383J72488Q3041o6899n5912j2329M1208M4374
82E4873Q632o1247q4847P8209R8982o0862r4462J7404R7478j7268j00950L6841
94b7217L7645l3337L4820J4786o7539j2997Q9307J2723j21547K8740J28020p3869
106I535r3577P0407O2716l6789m1988K4452O53j5775O0409K405p8926Q254P4680
119D6456Q691r1080j3822J29681r200j57699Q451J48526P617j34975J102J09197
$$ y = [0, 0, 0, 0, 0, 0, 0, 0, 0, 0, 0, 0, 0, 0, 0, 5, -8, 8, -8, 8, -8, 16, -16, 16, -24, 24, -31, 32, -40, 46, -51, 57, -65, 76, -85, 95, -108, 120, -133, 149, -166, 186, -205, 228, -252, 279, -307, 338, -373, 411, -453, 499, -549, 606, -670, 741, -824, 916, -1023, 1152, -1304, 1488, -1722, 2021, -2427, 3000, -3877, 5375, -8407, 16937, -89269, -309702, 3433, 244743, 25285, -151098, 21390, 104431, 37532, -18380, -30709, 10499, 54873, 63505, 2258, -82589, -4380, 94602, 33740, -60722, -43318, 54160, 36892, -64058, -27217, 10428, -22909, 11911, 26697, -40842, -53839, 35468, 48191, -73356, -44616, 83404, 9535, -84042, -13635, 49081, 12292, -29696, -5244, -4591, -20366, 40043, 42448, -36478, -28224, 46456, 55147, -35933, -49755, 79926, 70726, -86973, -78522, 70004, 77621, -57354, -56252, 52945]
131E2945l8366o3913M7066J6164k1409J0948L627l4770n358O0695j042o1521J9587
144a5347M0612j1133k4051j1663K1702J9142Q76l740l6437j4863M7755K9651m1710
157G94m7848N0947N6886p6112m5763Q0163L3072n6006k5094L0924J789j6210L0889
170A8431n259m7538K1465L7692j7928k6856J0353K5952j2028j6729J6352K167
182F074j3558Q79J2642m82k6537J0548L9100k3027l1418K8292K4564k2531k1373
195a6827K0331P961j7526R970L13k0570J3240J4256j3045m866J4507M12k4871
208a6715O007L1787j1742k5255P565J8933m868k5703J0366L1940j4249k6658J1773
221f819K2393o469j7347J0124N147j3239Q618L177j6955O661J5957p363j5614
$$ y = [52945, 14579, -49334, -2268, 13896, -7513, 3435, 7062, -27708, -33066, 27629, 26587, -34934, -15347, 25265, 14132, -9919, -21582, 120, 19262, 20138, 16398, -20039, -34902, 12853, 42504, 794, -47054, 3893, 60779, -15333, -61096, 19067, 52139, -3867, -28961, 1963, 3752, -12458, 18431, 13172, -34366, -12901, 24791, 6863, -19993, -9640, 16312, 4284, -12445, 3907, 6074, -7484, -6605, 6037, 5555, -20982, -10434, 28666, 5639, -25779, 2513, 27077, 4546, -16827, 3504, 11465, -6061, 3909, 4222, -16348, -3108, 11148, -1897, -6763, 7744, 8156, -16715, -10708, 21079, 9337, -15918, -8353, 10580, 5712, -19991, -9625, 22315, 8066, -18592, -6819, 15574, 9105, -8242, 1882, 7029, -6210, 2408, 5585, -11370, -4709, 11248, 3885, -11729]
234a1729J0869J7205j8555j1028J9938L693j4703m537J0036M642j3579L98J4672
247G322m104j0675K242J1195P00r792L733K692p334O076K574j0452K45J0491j75
262D738j2620L386J6361o822j1676O500N045k983m124L79J382k747L394J838o806
277d755J546O861m20o218j273J0263j248j2208L685P929l400n729J791M754l303
292a725k66N369m207j714P540j589o444P9P279j118j0050M093Q200n181n085M481
308c38N523m069m722P164K095q305K7M981r82n008k54N086k098j998L172q26L46
325b06L208j101l140j10M855j297p752K396P046j980o036N72P546J142p713J93
341b377N032J278l878l825K418L794j650k427k036M272L999n161k931N067L392
$$ y = [-11729, -860, 16345, -2210, -13238, 6700, 10393, -4310, -8847, 1189, 5831, -7748, -7350, 7322, 3218, -7457, -5215, 5980, 6680, -3112, 621, 3313, -4021, 2055, 4629, -5823, -5578, 4913, 4738, -7882, -4496, 11865, 5043, -6633, -133, 4912, 1929, -2195, -1816, -434, -3181, 213, 2051, -4755, -3209, 3652, 3232, -2986, -4259, 6004, 4756, -7452, -3767, 4162, 762, -4967, -3176, 1578, -1725, -1991, 3378, -829, -2543, 4997, 3408, -3036, -2957, 4322, 3204, -6846, -2753, 5447, 266, -4819, -338, 5185, 1116, -3606, 3558, 5653, -2652, -2625, 2356, 1374, -3634, -3888, 1198, -900, -2898, 274, -552, -206, 3002, 1901, -1239, -1349, 3506, 2209, -5543, -3147, 3899, 1919, -4117, -3545, 4001, 5143, -2570, -2377, 2655, 3933, 55, -3770, -1352, 2442, 792, -1635, -3671, 601, 4600, -561, -3492, 1575, 4967]
356D967l695l881L718K590m948l75K005m25k49m87O17J267L48k0j481J267J989
373C207l428k644J579K879l49n997K38P019N72n825l40P283M60o314K38L326k067
390a63q90J892k142j409J412J665r42J39J658r09Q10P22l095l37J677J88P07j932
408i49l550J356N890n6o288J651O169k115l336j16O35K996J264o141l063N796
424A43L691m442j508L427o63Q6K081l799j835N327P26n915j589L700J593J231
440B254j313m771K854P341m163n609L831K407l351r73q47j971N333M445p825n534
456g892Q166L973k512q79j526r78N380q12r744J544J2967j678j1437l29N429L069
472B741P13l952j241N606p43q864J690Q783m151m217O057l444p932P687P902n241
$$ y = [4967, 1272, -2609, 1109, 3699, -1249, -1624, 381, -44, -293, -780, -163, 1104, 1452, 1432, -49, 1218, 3207, -221, -2865, -1286, 1593, 1244, -4753, -4515, 2504, 3076, -2749, -3089, 4194, 4654, -1660, -1422, 1904, -163, -1053, 839, -1303, -2712, -1300, 365, -577, -438, 1220, 311, 1121, 1843, -1252, -1589, 88, 276, 983, -949, -4499, -3143, 2747, 2691, -3597, -1946, 4223, 2108, -1228, -1344, -709, 2287, 3551, -2590, -5653, 143, 3834, -608, -2116, 1311, 648, 734, 2815, -984, -2819, 2508, 3234, -2681, -4270, -570, 1023, 2254, 941, -3830, -976, 6365, 2202, -3407, 424, 2831, -520, -1493, -2340, -4311, 1022, 5467, -2358, -7892, 274, 4247, 1735, 856, -670, -1648, 3732, 2920, -6824, -5280, 7687, 6009, -5428, -5757, -328, 2741, 3454, -498, -1739, 3867, 3124, -5740, -4050, 4733, 582, -3635, 2422, -1022, -8954, -1267, 6635, 1394]
488A394k543K269l224o47N695n87m266J495l60j559L324k277l975R419N113j3588
504d317n576J3136M401q838j454J261q96M140j70o637K719P351k309l958j78k921
520d246M324J2597p841j9120P792J6872p861j1113P868P094m151n833k050N616
534e2J0419l853j2382J600N214l072L379M579q908k680J0459k371j0562P885J0407
549A0062p476o645K527m68J994L155m698j344O386l136p214O687N415n613K001
564A633M706r058n108R117L082l060m7l440l926O882L102n713L134M865q313l341
580e485P927q39l000O331k909j2190M602J2072k630o028J597n33J578L246m883
595a144k259P784k13r052J740M734l974J097O427m798m410N667k63m225M011K621
$$ y = [1394, -1149, 1120, -2104, -2751, 2944, 2357, -1909, -414, -774, -2333, 991, -1286, -5261, 4158, 9271, -4317, -9893, 3243, 7644, -1194, -2648, -1387, -2283, 1857, 1687, -4950, -2231, 5120, 2811, -1147, -1325, -4246, 78, 12675, 4834, -14286, -6494, 10378, 2517, -8596, -728, 6366, 2215, -3618, -5668, -52, 10367, 6514, -5868, -4268, 946, -2126, 1253, 5832, -3076, -5756, 4703, 2332, -8230, -345, 10062, 2586, -4059, -1532, -2000, -6, 3149, -1549, -2893, 3493, 357, -6857, -170, 5245, -368, 1633, 6339, -2719, -7827, 1290, 4372, 1312, 1265, -2175, -6101, 781, 3883, -1830, 1304, 6169, -2144, -5485, 2442, 1603, -1397, 4934, 2025, -10165, -5563, 6509, 3879, -2149, -552, -1085, 493, 3739, -1144, -3403, 4381, 4168, -4884, -3144, 1590, -2384, -1287, 5140, 342, -4068, 1599, 1336, -2889, 1122, 3743]
611C743l695M36p18p155M023J1382m101q504L151N90k929O549M803p605l388L424
627Fj562m38M109j150j620J873m393k313R667L103r171j584N534j440j908L382
643B095l061k900N988J049p316J433M896j447o72K249k129j254J646k714l58O713
659D218k16r184R98N235p35P08L747l664m511K180K441N31K068k724n620K061
675b467M116j875J04K964l302l027M791O44k726K486J47m684O24M187j003k602
691a623P17l03J557K977k264l964K186L436k103p39L76k392K38K171j391j59L886
708B606j247n666K410O031m43l867j395mJ393J657j517p75J638j259k782L030
724a90M047k036k230r6m9R73J893j787l014J845K034k024k57J416J10q74Q11M46
$$ y = [3743, 48, 484, -234, -7389, -3366, 8016, 3915, -4589, -1438, -848, -3777, 2772, 7575, -30, -3418, 6, -1556, -1994, 2115, 965, -655, 1218, -3175, -5488, 4179, 7282, -1889, -3473, 2061, 621, -1287, 2095, -966, -3866, 2122, 3171, -4145, -2712, 2184, 737, 65, 2314, 185, -1069, 577, -2137, -2495, 4218, 4002, -5182, -4184, 1051, 316, 1024, 4771, 1107, -3404, -1224, 1217, 1748, 3816, 1092, -4528, -2467, 1649, -226, -122, 2842, -460, -3487, 1304, 1948, -778, 1708, 1855, -2829, -2205, 1982, 979, -1623, -906, -1209, 348, 3325, 1061, -2903, -717, 2719, 616, -123, 253, -2139, -1901, 270, -1121, -1280, 2606, 1359, -4307, -1897, 4134, 3691, -176, -1571, -1575, -182, 1475, -42, -817, 821, -438, -3220, -190, 3857, 1821, -409, -505, -554, 419, 2312, 525, -2489, -644, 1390, -634, -891, 525, 635, -239, 572, 1018]
742A018L35J82k496j081K166J281j300r13q2j119J660K628j159k259J297Q21j197
759b18q1J638m45j862r05Q63K354K17k336p84K272J168j149k22N4q23o00N43M65
778A49L00j51j098o93J394J650m03j360l48N77Q75r20o77J73K30q18K31J197L77
797F85r46m46J306L55l30j15n19q09m1O81N15q69o86L90Q64m51K64J024l1j230
817c89p7R05J00r73n97N02M80k52L94k36n3K41O34K34p70K53j26o01l62M81O21
838D09m15q86M79J004j92k24J90N13o34l06P03n86l85k58K62M16m08R0K31K27
858B30j5K0M66l81m13k7J98k46o89P10K10p38J72O46N47r4n58K34J79J42L1r26
880c02J57k22J27Q1k05k55J092P79j406n29J895k63j188l24M23L74l25n58o54
$$ y = [1018, 1353, 1535, -961, -2042, 124, 1405, 105, -808, -890, -2009, -349, 2279, 1120, -1139, 158, 979, -218, -299, 1339, 894, -968, -1873, -1010, 1344, 1561, -775, -1559, 713, 1881, 732, 510, 564, -259, -859, -316, 149, 449, 298, -800, -1493, -99, 1551, 1148, -212, -560, 17, 892, -28, -705, -532, -302, -1120, -889, 308, 685, -261, -707, 599, 954, 624, 509, -10, -819, -860, -179, 336, -533, -1219, -829, 35, -416, -152, 872, 841, -389, -466, 439, 539, -434, -1031, -529, -49, -301, 93, -143, -196, 45, 679, 913, 143, 396, 270, -331, -693, -212, 409, -6, -892, -413, 591, 399, 175, 365, 878, 244, -62, 641, 55, -330, -588, -326, 90, -318, -228, 3, 230, 215, 235, 701, 320, -93, -120, 78, -168, -857, -147, 63, -675, -503, 143, 690, 596, 38, 272, 451, 593, 624, -302, -145, -367, -240, -159, -364, -619, 473, 1252, -154, -683, 1212, 949, -239, -563, -140, 234, -91, -649, -1303]
899a303J085J014n86m90K40ML98P92j251j430J635O04j756l46J561Q7p82P97l16
918d3j55J051M05j299l22L47R2k85K48j040M70J466j031j024J928P93k023P46
936C24R76j911q63K085N03k224N25N11n64Q19M42p87J056L63j498p66J386m72
954i5k11J540j316k593K190J923j954m02K134o5j696K75r9M62J521j495k480J366
972i95J414j089N29J530j731o57K527q97k146K334J522l058j223J528K62L34L96
989E80j195K4K023j227k050K969O50k353K32J239k464k88L681o42k764J506P64
1006F85k096J210K076j096p30L14k058K61K851j046j498K438j049l142K323K901
1022B344j806l48O45k243L06K871j587j862K924L17l668J24K732m77N32Q99k628
$$ y = [-1303, -218, 796, 210, -280, -40, -36, 362, 1154, -97, -1527, 108, 712, -1044, -1390, 171, 258, -524, 273, -43, -198, 853, 1258, -41, -363, -16, 76, -209, 39, -1001, -531, 935, -96, -1120, 808, 1601, -422, 324, 1300, -611, -1474, 611, 1114, -1110, -585, -74, -638, 181, 623, -164, 892, 1255, -243, -1009, 377, -95, -306, 1234, -82, -2675, -485, 1438, -516, -918, 1216, 1151, -545, -270, -369, 93, 1614, 119, -2361, -995, 419, -670, -141, 1389, -342, -999, 1528, 631, -1515, 819, 2341, -717, -1940, -412, -150, 184, 580, -615, -591, 1432, 205, -1845, 1124, 1774, -579, -347, 892, -1572, -1860, 1821, 1179, -1585, -79, 685, -1411, -201, 1875, 779, 49, 363, -1695, -1434, 1417, 371, -1127, 1311, 262, -2880, -557, 2344, 538, 190, 835, -1408, -1102, 1769, 182, -1680, 1244, 1561, -2107, -1983, 749, 272, 804, 1703, -925]
1039i25r25L603o49k956J986K042k839m61M41p19K749J879l574k302L427L53k295
1056a165J632J554k636k04N99j572J561L142k537k395K230L96j630K022J000k526
1072e29k35J503k165k97M030r41l076J697Q52j962R80J309j210Q67L84l603L31
1089b065M196j336k366K382J60k899J371K265j513M37J692l408k008L579J081
1104A568j852L26j44j515J362P17j371J637J993l223k229L201O61j927J507M9
1120G60k549J075J579j875M46K666j251k246J460K55r29J376M08k502M22J855
1136I50k391K11L215p96k423J041N78j185J518P27j858J41Q08j716j3K784p76
1153H15j377J177o58j267J930R45k370L37J747j936j661K930L15j288K40O73j266
$$ y = [-925, -1850, 1753, 1104, -1852, 134, 2176, -663, -1124, -683, -1402, 1347, 3226, -348, -2650, 777, 1130, -1165, 467, 2021, -615, -819, -220, -1792, -231, 2911, 374, -2021, 209, 605, -1025, 997, 1997, -529, -764, 739, -1426, -1723, 2307, 1366, -1710, -13, 839, -1123, -143, 1166, -44, 823, 1207, -2396, -2065, 2131, 795, -1571, 811, 971, -1928, -557, 1708, 195, 632, 2324, -1084, -3092, 487, 1568, -284, 42, -102, -1617, -255, 462, -909, 728, 2721, -502, -2731, 470, 1131, -796, 711, 760, -1789, -714, 865, -1010, -564, 2102, 851, -1395, 65, 320, -609, 767, 1175, -1327, -905, 950, -1441, -1230, 1985, 1189, -1234, -193, 385, -800, 718, 1445, -413, -272, 536, -1180, -1193, 1591, 815, -562, 615, -43, -1310, 620, 1565, -805, -468, 1279, -657, -2318, 612, 927, -361, -121, 552, -714]
1170g14K74J359o40j25P92j544r22J821j94p66J007l04j660J188J407j233q4J610
1188A272j182j311J544J5q33L78N31j374K96J267r31K27J084r82n73J268l94j328
1206a026J174P01j532K1N60m99P3J288l16m68N8j62n03Q99K85o57l41M49o31J57
1226d70J480n69j515J082P28r81q3J063o81n22N48j39l58N64l75j68M01M71l6
1245D40m0n78j02L31Q72j089m49R99j77r48L71J022k68o72K05L32o2L46n59o65
1265f91L10N24j31J0k49l0K52L21o60O79M96q47n18O01O88o84o36k8K77M12M0
1286A36k53J59pL7j73L78o1k1k80l63L12L97K49j012k95Q77Q17k43r62M39K69
1307D00l73l49L37L73l11n99K98L40K83n4o07P3j1M90J99o04l57N44m5q8q6L25
$$ y = [-714, -440, 919, 279, 154, 946, -598, -1520, 301, 107, -659, 348, 44, -1616, -428, 979, -254, -338, 1272, 90, -1221, 323, 338, -495, -117, 414, -960, -664, 603, -328, -101, 983, 1, -572, 696, 302, -1026, 148, 849, -683, -662, -102, -601, -528, 760, 444, -24, 34, -128, -631, 268, 553, -104, -445, 4, -627, -470, 1010, 441, -1074, 8, 736, -245, -328, 735, 54, -468, 80, -59, -417, 147, -228, -396, 5, 476, 440, 400, -178, -280, 51, 923, -166, -615, 384, 207, -741, -370, 652, 384, -288, -83, 249, 187, 533, -26, -691, -381, 143, 12, 22, -227, -257, -5, 316, -344, 335, 831, -16, -534, 67, 755, 71, -565, -593, -316, 96, 136, -117, 42, 35, 72, -101, 277, 216, 195, -85, -448, -136, 261, 510, -502, -797, 80, 897, 654, -308, 131, 400, 27, -322, 15, 388, 77, -522, -224, 116, 399, 345, -262, -189, -200, 290, 489, -115, -472, 72, 27, -61, -147, 178]
1329A78N6p71M8J035L17j003l41L89M13p4k17j59j57J5L26L5p9J4J68l0j37P1
1351I7M51n26n42O2M38K34k87o5M3N75j38n07N72K8m20m8K65j01p9L28n35j95
1373c50L92J69m5l38L53p5J71l13O9K34j74n00J82M22k81J2o1K56k0k2l3j79L22
1396A91J39k4m80J43j9Q2k3j89o9M77k29o28P44L61n19l65N79n5m73M72J37p78
1418e26L57o2J78J79K83j75p2k2q9j73N11k68p16O99M3m66M4Q52n65m65O41K04
1440C92o45K46M26n28p0J86m86L38M77k84p9N21o71j32R45l96p38O47M21q73k60
1461e63P49q0n29N73j25m12P21L36p21K44L48j138K07P38j34n95Q72k25j020P19
1481c5M55q19N43O29q85o20Q20m4k09L62J4p94Q34K14r76L89Q91q88l45Q14j7
$$ y = [178, 234, -537, -489, 546, 863, -140, -481, -92, 321, 247, 30, -129, -286, -271, 55, 90, 11, 25, 193, 163, 26, 97, 548, 22, -520, -458, -20, 214, -73, -138, -95, 480, 342, -165, 407, 435, 15, -33, 232, 131, 52, 380, -155, -350, 42, 211, 166, -172, 181, 106, 277, -36, 33, 267, 93, -407, -225, 197, -84, -72, -133, 123, 103, 81, 48, -131, 191, 330, 306, -174, -31, -50, 32, 9, -180, -249, 228, -1, -629, 115, 476, -43, -408, 171, 116, -357, 115, 252, -526, -169, -231, -53, 126, 409, 234, 162, 140, 51, -122, 389, 121, -595, 104, 147, -319, -275, 577, 12, -453, 188, 392, -253, -7, 419, -109, -179, 7, -479, -141, 336, 52, -27, 494, -177, -309, 636, 240, -498, 149, 570, -303, -563, 186, 106, -423, 150, 25, -387, 334, 670, -51, 193, 541, -597, -390, 348, 214, -381, 491, 266, -754, -35, 420, -399, 144, 773, -112, -732, 88, 44, -165, 197, 211, -583, 251, 465, -511, -122, 769, -119, -464, 350, 333]
1502C33q12J027K4j208K06Q36p53k70J499o26q12O21m0o33J112Oq39n2P26r35
1522e90J46J157o92l12P17j52p07O92O60j131J45L59p14K0P53n8o17N44m13n43
1542g36Q38P56j289N71O17j123m18J112j53n19Q49j62j165M96R18n67J87O82j061
1561a67n94R07q5m50R68j95j499P01J038j038L36J129j056q84P66M14o15M98M35
1580F09j097n4Q10l85k4R34p40q18J185j96p74P62L43j180L18R93j158l43J427
1599F12p3r25O30k20o98R26L92q56L84Kq05q9J426n19l55N79l35j010R80R82j274
1620b46rO74n80o39J242r9q36M80p4o14R04N44r54q1P02n5r02N41M3m02Q50K8
1642E17j103M60N45o85k29R72J2q11m7q7mJ055q6j251p7J377j007J72J183l61
$$ y = [333, -479, 548, 572, -636, -430, 406, -347, -617, 882, 256, -556, 65, 25, -608, 504, 510, -329, -381, 345, -590, -444, 713, 21, -291, 426, 274, -433, 259, 919, -212, -67, 292, -422, -402, 351, 293, -324, 220, -193, -736, 102, 858, -431, 140, 757, -366, -784, 328, 175, -344, 505, 343, -822, -326, 592, 25, 212, 894, -167, -761, 146, 61, -389, 579, 384, -1115, -414, 624, -414, -78, 1051, -5, -889, -123, 291, -324, 174, 609, -488, -542, 268, -117, -141, 793, 53, -765, 420, 224, -550, 212, 555, -625, -307, 686, -472, -815, 612, 539, -386, 244, 24, -674, 252, 644, -212, 172, 174, -631, -720, 706, 187, -168, 411, 76, -934, 46, 1028, -246, -255, 419, -161, -800, 442, 343, -493, -13, -87, -701, 203, 747, -207, -288, 414, 359, -543, -2, 41, -361, 489, 517, -586, -126, 419, -266, -495, 477, 489, -322, -369, -456, -460, 595, 509, -742, -819, 558, -449, -277, 906, 545]
1662E45p22P9p0n4R09J3j123j67Q16k22j66J37K05k97L16j67m69P08Qq48J35J085
1684F51o99k89K29o9q9O65l95m37L51P29m08p0P8j20n07L38r1M12J68m06p25J44
1706e40R20j98l02L46n45jK62P4k44K56J54n27M15L46P0m07o5k50K52K57k03p63
1728f93P79L86l48n94M43K21m8j56K79j83q0k17l93O26P23n67m34PP1L77M04q16
1750b13N8N05o13n11N52J042o22r58L20M66K95k78k94K52L07J33l50j17K43L8
1770B55j42l34J36L41J02m61l11O37J51j54m46L28J46k19j4K4J75j06m21O3K63
1791A3K44j49l10K14k09N31N3m67j40L0L36j03j42K16l69K78o1J68J40k80O7n5
1813EJ74Rj44k97M13l84K82L47l25q7M4J71l53N0J93K18j92m06L81l7lj80K89
$$ y = [545, -177, -98, -168, -222, 687, 700, -423, -590, 226, 4, -162, -25, 180, -117, 199, 32, -437, 271, 279, -569, -434, 651, -48, -337, -108, -177, -266, 399, 4, -433, -82, 647, 239, 169, 247, 127, -380, -42, -133, 279, 447, 41, -684, -540, 380, 182, -120, 226, -319, -320, -58, 16, -228, 28, 182, -345, 70, 416, 486, 79, 14, -236, 16, 273, 70, -693, 86, 472, 124, -470, -27, 194, 146, -10, 269, 86, 6, -211, -604, 22, 745, 178, -256, -249, -178, 199, 603, -213, -155, 350, -263, -774, -222, 820, 198, -760, -440, 26, 321, 43, -251, 1, 308, 441, 91, -26, 217, 255, 113, -221, -85, 256, 358, -103, -414, 223, 374, 220, -226, 102, 248, 29, 15, 39, 214, 108, -313, -250, 13, 257, 108, -202, 12, -197, 334, 387, -80, -220, -190, 146, 43, -99, 117, -252, 26, -35, 133, 273, -7, 60, 5, 179, 188, 44, -253, 160, -224, 58, 405, 80, -7, 37, 208, -145, -95, 98, 316, 124, -282, 99, 62, 59, -121, 168]
1836A68k24J27p3j56K68l66M82l88R2K48j73P5r4L53l04r7r3J61M33l39Nj81L68
1859B92k15l52Q0N11l21m90L89j37L66k03j1L04l52j4J10L3J7k15J15k43L47j04
1881i3k2j15K54K73m06O0K39%j65j95l7N12k05k50KL18J48m96J61m3K07n0r6J7
1905A8K17j44j19L8k82M13Kl22p2J21K97m29L48K87l26k36J12R0n7k0N6K9J27
1928A48N8j82k8J95j11l34K94J53l25K48n1l68L75K04k56k51K75L9j82M5oJ85
1950A25j53j35J35j09M1j87K75J93k59k26L68K49n42J86L42j31K7j45k28K65R5
1971A86k66O8J89K0k11m1O50p44O1L06m03J59L6j36j93K64K01p58N53K80O8l97
1993a08J72j01j24M40m49M8K69J9n90N35L00o35M09J52m39R1R1j14p0L83j81m95
$$ y = [168, -56, 71, -2, -158, 110, -256, 226, -162, -70, 178, 5, 80, -14, 339, 35, -62, -155, 6, 439, 100, 105, -76, 292, 77, -275, -195, 316, -5, -495, -106, -243, 123, -80, -91, 213, -139, -153, -43, -10, 7, -208, -93, -336, 11, -93, -115, -230, 24, 297, -109, -49, 190, 190, 25, -170, -207, 305, 100, -150, -148, 170, 318, -178, -17, -60, 147, 97, 1, 18, 235, 91, -28, 10, -272, 141, 143, -179, -251, -130, 167, -262, 86, 373, 47, -189, -77, 13, -44, -64, -8, 21, 148, 206, 24, -4, 191, 80, -254, 40, 193, -132, 116, 65, -303, 72, 276, 20, -231, 44, 83, -99, -54, -60, 125, -28, -163, -28, -137, -96, -283, -8, 185, -74, -300, 68, 317, -225, -39, 303, 172, 199, 54, -174, 91, 186, -80, -12, 177, 197, -14, -55, 595, -149, -88, 218, -185, -26, 10, -126, -319, -55, 146, -612, -59, 221, 289, -108, 64, -37, -161, 279, -170, -122, 147, 166, -424, 111, 411, -224, 185, 337, -102, -11, 80, -34, -104, 279, 98, -397]
2015c97L62K56l48M29K66m68k28K48j63l73N82o1m44o3M57j1n3K49j87k18K66
2036A01k18j6J78j22j33K80j94n1P1K74L5j88K90l13k15L44L54o56l8O72l82l31
2058b58L30%O8Q1l47k1L95J10m18J34K4n3l58N58q9m46L46N7k84M8M94l71L7L27
2082C64l13n03N74J94l69Q4K94n32P6L62k92Q9L49l20m12N95j85j49J05L04k19
2103I6K25j60l75L34K42k65m04N61l38m71P64K67o83J25J30m02J97N01k65l48
2123b69L52j79r7J74jL9j97K04m48K98M99k66m85M07J30k34J84K57l13l1J89j99
2145A4j79M04j99j56J36L4k97K30k5K16p0K05n00K73Q7k32j88M10j49k89N6N19
2167C00j36k54L17l46j07J94j9J3o7J12k09J8K17N0r9K00j94j18M81k19k39k4
$$ y = [-397, -35, 221, -127, 302, 568, 100, -128, 120, -43, -416, 166, 105, -339, -402, 55, 44, -9, 240, 53, -165, 101, -117, -133, 45, -77, -210, 70, -124, -175, -104, 170, 205, 17, 307, -6, -221, 123, 477, -179, -217, 455, 73, -258, 72, 72, 140, 221, -126, -147, 248, 358, -60, 74, 98, 45, -313, 245, 156, -290, 56, 113, -171, -123, 371, 0, 37, 364, 51, -452, 122, 316, -53, 31, 325, -207, -131, 231, -61, 28, 377, 57, -355, 240, 55, -94, 11, 315, 96, 321, 161, -214, 120, 362, 97, -307, 254, -84, -555, 209, 476, -207, -82, 48, -354, -157, 344, 79, -269, 83, -96, -193, -19, -20, 19, -178, 26, -422, -124, 375, 109, -376, 31, 161, -73, 111, 368, 55, 24, 213, 14, -165, 239, 40, -116, 20, 54, -243, -13, -38, 178, 108, 313, -187, 86, 173, -59, -247, 163, 14, -275, -219, 300, 164, -90, 227, -119, -226, -32, -51, -38, -105, 7, -202, -184, 33, 83, -16, 184, -10, -128, 353, 134, -105, -129]
2189a29L82%m27K78l95l4J84K67j2j65RJ8Q1Q7j45n4O5l44M8M96J36l49J27r7
2213B7L3N0Q7K22n17N4M9j90K78q5m3J5Q2l6k28N22n32L58n3m4q5K99l16j21J93
2238A9J00p0j23j39m8J16L16k86K21jn6n9j05rK10l12K00j11N29j34j79l14J32
2261a03J03m0K64n4J13m23J05j44K95J51m66J24O0L14m25j63M89j41k66J47m4
2282a04j45P9L82l22J78j21J49j14kJ3L60j23m35J03m7K26J7j17L32k03j42J36
2304A00M5N8j03k99J55k2J98k92O4J75k1K28m7k74L6N9l8j57K15K04l59j00n3
2327b28M39p3j55j7j8N9P2n0l1j46n4L97o9Q6l3l33K00k1J88lj98j17j30M94k07
2352E2j90J26L5q4j42L09J26j30qJ41l58K89K08k97l35K46K53j86o5r2L04l79
$$ y = [-129, 253, 253, -174, 104, -291, -325, -141, 126, 114, -51, -42, -24, 57, 144, -1, -55, 10, -334, -286, 210, 346, -3, 124, 27, 60, 110, 197, 419, -98, -44, 5, -185, 93, 8, -35, -20, 62, 26, -202, 320, -212, 146, 93, 49, -36, 263, -53, -174, 19, 119, 49, -74, -213, -261, -145, 171, -115, 106, 105, 49, -10, -115, -124, 86, -226, -26, -137, 392, 258, 79, -235, -103, 0, -40, 224, 170, 283, -140, -35, -179, 116, 267, -199, -75, -15, 299, -126, -289, 200, 59, -207, -60, -104, -249, -170, 212, -110, 68, -53, 96, -18, -20, -7, 353, 230, -205, -102, -149, 77, 94, -23, 309, 106, -36, 100, 145, 203, 100, -199, -44, -66, 132, -160, -96, 79, 58, 286, 239, -35, 1, 60, 22, -135, 80, 284, -75, -175, -228, 211, 138, -17, -34, -52, 7, 79, 29, -2, -148, -202, 195, 126, 212, 179, -154, 46, 25, 213, 210, 12, -105, -235, 259, 52, -138, -12, 23, -61, -203, 106, 232, 102, 94, 235, -123, 166, 374, 77, -258, -12, 241, 55, -10, -102, 202, -177]
2374a77M8p0K20J25j67N1j10K61K8j72r5l9Q4K95j09l96N3K15l3o9J3l6K34m24
2398b70K82j81J46N3k54M26L9m78M5K91l0M3l05J73l6j43K04m26N23j21R2Q8j69
2421hO1J74K0m29P7K86j84j69K01J9q1j02J00J83j17K52j60l89L26m4m5j38K75
2444A08l4j18J6k43O0J90k33J56o0M39j26l47K90J36k60K7P3l36J13K32j62L1
2466d8o8O5P5J92l62M0M17j60k91M1K7O3j58K21k0k8j77K40Q1k64N9l0J83j19
2490b1k73J34K31j36J11j22O7J3j38J56O3L6j64J05k68J60R2k46L8K51k14P8L26
2513B79m14L8K67k11J56k82K56n2J63j52l39q0K35K16k88L95j16j6o4k5j17J24
2535b7k29J76j89N55m26J63j5M1L1j06M0r2n8M59o90J18K56R2k64M42N2k50J44
$$ y = [-177, -129, -199, 21, 146, -21, 30, -80, 181, 209, 37, -58, -97, -13, 282, 173, -223, -170, 45, 12, -57, -44, -80, 154, -270, 12, -169, -23, 30, -224, 202, 241, -237, -192, 99, 69, 112, -193, -20, -56, -199, 5, -421, 102, -19, 73, 161, -8, 53, 227, 247, -182, -105, 181, -3, -172, 29, 48, -33, -135, -35, 148, 31, 283, 123, -266, 60, 16, -29, -167, 108, 74, -44, -28, -271, -211, -21, -254, -98, -158, 281, 155, -192, 98, 234, -26, 1, 74, -262, -149, 83, -79, -48, -116, -51, 24, 216, -146, -106, 311, 151, -140, -99, -72, -9, -167, 54, 34, 6, -171, 69, 150, -114, -55, -85, 98, -21, -294, -160, 71, -65, 46, -76, -9, 4, -134, 22, 85, 121, -43, 62, -206, -46, 46, -200, -162, 89, -125, -47, 279, -135, -97, 170, -41, 115, -167, 89, 37, 200, 48, -291, -371, -136, 80, -208, 187, 71, 55, -9, -34, -151, -27, -256, -80, -269, 286, -140, 23, 8, 49, 80, -26, 14, -78, -136, 323, -367, -249, 7, 99, -165, 277, 329, 79, 223]
2558B23m01K18K04j80J24k33O6jl84M37l02K94k06J67q3o1K50l7j52K64m40R7
2580a36M86l05k03L77r9k2Q7j43nqJ82k94j39L69r3K4j13m8n2J96r3J43j10k29
2604b28L47l81J46J4K25k8O8k16J11q0k09J81Q5M8k9M7Q5k38k75M25k62J2L57
2627B05k11j6J83k20p0P5J81k96N3J30k93o7M53q1j6J55j47k09L22k92K88k1k85
2650a79K39k5J53j81p9K8j78L37j47J29p3m4J74r0k14K03k46Q1K00k96L51j5j99
2673g1J0Q5K45l07j25M03k68j22K40j10P4k37k2J39J70J58m39K02K4p7J18j35
2695d5J37j51j18J2L74N4k63P2j6J90j41J13k64O6o6q2L09l11r3J97J03j17J69
2718A29m5P7j01R3l71K83J9j74O5j08Q5kK07J6j55j69J21M3K6l1J18k21L1J32
$$ y = [223, -178, 40, 244, 64, 188, -45, 21, 20, -364, 73, -229, 65, -141, 26, -57, -118, 132, 95, -57, 207, -233, -136, 350, 45, -158, 219, 120, 98, 185, 42, 37, 29, 211, -83, -222, 147, 54, 78, -35, -83, -135, 61, -32, 111, 1, -228, 119, -262, -116, -102, 123, 95, 163, -53, 58, -22, -231, -50, 35, 83, 54, 101, 186, -52, -327, 98, -164, -152, 205, -6, -22, 161, -59, -129, -54, 127, -169, -116, 14, -279, -346, 107, 26, 10, 165, 18, -191, 131, -161, 127, 106, -179, 60, 35, 188, 7, -72, -44, -222, 115, -32, 97, 24, -20, 154, 64, -150, 53, -193, -112, 88, -208, 143, 128, -71, -61, 24, 269, -38, -163, 240, -28, -150, 90, -20, 54, -183, -205, -66, 104, 262, -177, 25, 49, -28, 90, -45, 92, -59, -177, -165, 209, 263, 0, 72, 56, 246, 105, 218, -46, 20, -46, -128, 181, -130, -223, -26, 77, -40, 129, 84, 161, 60, 153, -218, 65, 84, -90, -25, -133, -48, -50, 157, 173, 18, -151, -30, 13, 39, 8, 126, -95, -64, 68]
2742F8l07L31n8j14R1o1J42o3j07l43M82R0l3j65j20L23k14k17K68k3P4M4k14
2765a26K34k09k65N18l55R8m6K59l2p5qo7J18q9j19L06J50l45J82J9M3j0N2l28
2789i5O6J01K41k50L6j73J68k48J0j86L24j11R3q2OK16m27N63J02k38M6l44J6
2812a66J65m0k7j6jL5J78k8J3J07j55k15M1L21k29mj74j5J82n7q9k62K34K18J4
2837C0J15k78Q7p9L02n0j34m3k26K29j61L74N0k16r4L04k53l7M0O5m5l8J47k75
2861a86K25N6k96J72J77M9l6k65P0k48J91J06j80J69l78L00O7K12j34m25R9M59
2883B04o7j48j96J75J22k43R6LP8o4j11P7P5RJ21M9j28J37l42O5M2K93l07k4J46
2908F2P8J72k36J09k27L47J5m39J72o5j61J67j37oK23RN6%l2k93L12R6k03j44
$$ y = [68, -239, 92, 34, -80, 11, -50, 92, 29, -78, -421, 61, 151, 118, -47, -167, 156, -58, -275, -7, -30, 44, 88, -126, 108, -101, -366, 152, -203, -105, -151, 108, 76, 1, -7, -74, 44, -45, -164, 142, 292, -53, 129, 148, 191, 181, 233, -95, -29, 72, 313, 63, 99, -74, 94, -154, -144, -330, -6, -117, -24, -106, -100, 116, -311, 252, 354, 116, 162, -182, -166, -1, -41, -68, -84, -85, -50, 128, 100, 113, 220, 65, -150, -109, 212, -17, -21, -195, -210, -28, -85, -174, -436, -202, 16, 30, 145, -133, -46, -125, 177, 127, -7, -50, -276, -47, -208, 166, 216, 0, -94, 210, -43, -80, -40, 25, -20, -58, 89, -186, 39, 95, -201, -29, 148, 197, 161, -104, -34, -282, -91, 15, -165, 4, -374, -74, -7, 205, 71, -354, -255, 204, 137, -11, -207, -32, 90, -153, -57, -54, 24, -40, -151, -74, 1, 10, 131, 180, 52, 189, -153, -88, -46, 247, -60, -84, 62, 140, 312, 76, 185, -42, 305, 320, -119, 53, -12, -173, -6, -143, -149, 74, 83, 139, 139, 107, -186, 126, 222, 19, -125]
2932a25o9J93k33M16m73M60q2k00K93J16j83j98J49j10p4j31J36k2L49k10j23
2953a21O2R9j37q7K10R3r2j1K47l07m7J35O5j83J22J9L2O8N3k25Q6J96k60K7j78
2978a34J61n5j10J58k28M5R3O82p43K4L0j99K90O0j3m01R1K07N7k6p9J10o1L1
3002a0%k7P1l2J82P3k75J67l46m2K02P1M1J20j97O5jj09L72l37k46J73j4O8p5
3027a06K3j6J08QJ11j66K04j70l1q6l7K26j9j24M9J93j20P6l09K80l93J30J96
3050B7K3j46j75K72k33K80mj04j53M0J35j33L26m2j58p2R6j11O5k40M50k28J18
3073C3J30n6o6k14K13o8rq0j63J84O7l9M7K8m9n2M31l83L6r2j67r5L09R8l28O
3099b79K37l41P9L55j01M2M3j74J99L3j98L4L81m37O1J48l1m0p6J57K48k19j57
$$ y = [-125, -194, -1, -234, 182, -291, 169, 87, -113, 180, 296, 113, -85, 64, -46, -120, -251, -115, -137, 212, 2, -121, -59, 40, -97, -184, 26, 119, 27, 16, 263, -44, -91, 44, 109, -74, 48, 67, 99, 167, 220, -5, 81, 277, 17, 44, -134, 27, -28, -138, 20, -208, -163, -70, 612, -131, -107, -77, -276, 14, 74, 61, -340, -249, -42, 15, -11, -90, 20, -41, -10, -10, -37, 34, 2, 184, 257, -18, 149, -197, -239, -37, 34, 75, 195, -2, 63, 62, -47, 325, -12, -258, -85, -99, -31, -106, -83, -99, 9, 17, 128, -38, 166, -4, -35, -121, -158, 68, 49, -75, -26, 167, 47, 123, -186, 94, -299, -169, 27, 50, -96, -271, 1, -232, 48, 44, -60, -213, -173, -38, -171, 155, 113, -45, -117, -21, -132, -67, -307, 143, -85, 33, 163, 107, 41, -173, 40, -28, -37, -117, -280, -96, -29, -68, -21, 7, -42, -94, 337, -46, -10, -102, -269, -364, -55, 43, -285, -279, -42, -383, -304, 51, -50, -8, 35, -139, 60, 93, -105, -71, 310, -127, -66, 82, 51, 11, -65, 92, 340, 121, -36]
3122c6J81l8l55L59Q1k32O6k9J3J2N3j88K26L3l63J17K01j36o3L2R5j02J01j39
3146a11kK73j32m3K84l29K06k35j73L94o4l6J7N5o1J54l60K39K17Q5l36L83n25
3169a00K21k17J34j03p8J5k9K80n9r1P8K79m69K61j03k3j00J17J6K45l79J25K42
3192B62k75J27o0ok83L09K9l63K94qj84L41l29Q6K96j91k14J85L34n46M6K06m07
3215c51K47J31m6o7K57p5j05J45j2k42NN9J41j10j0K83l59j42J59p2K13j51K44
3238A42j7J3k91M02l72j56K2J25L07J1j42r1%M2LL09n15J61K02k79l5M32l26K0
3262c3K4Q1j58K6R9p8P2J82k2k4l47J43P3j68J10J22j10J89k77K62j05m4K62j53
3286A26k6l4J20j97K6J9P9r0l2k38L17j83M21m50q1M60m12O3q1K44j77J47Q1l7
$$ y = [-36, 145, 107, -248, 111, 192, -40, 26, -3, 10, 22, 75, -113, 113, 146, -217, -100, 101, -35, -98, -66, 29, -73, 28, -111, -113, 160, 28, -15, 269, -60, 146, -89, -262, 132, 68, 32, 49, 104, 43, 197, -163, 76, 293, 378, 42, 425, -100, 121, -96, 38, -65, -143, -128, -157, 123, 64, -27, 51, 330, -139, 122, 19, -4, -104, 13, 29, 274, -105, 20, 262, -13, 114, 54, 48, -235, 74, 103, -260, 34, 26, -158, 183, -146, -60, 236, 45, -169, 16, 350, -196, -150, 56, -351, -104, 27, -19, -86, 171, 96, -9, 136, 124, -118, -113, -54, 87, -23, -33, 250, -109, -251, -92, -164, 49, -102, 142, 125, 138, -153, 249, -123, -279, -257, -132, 175, 186, 44, -47, -47, -5, -2, 307, -208, -47, 155, -124, -159, 273, -53, -33, -9, 72, -86, -60, 39, -39, 33, 215, 193, 169, -178, -35, 38, -130, -20, 102, -8, 181, -96, 166, 61, 17, 279, 126, 100, 66, 186, -11, 15, 34, 113, 23, -9, -247, 70, -113, 308, -142, -223, 237, -175, -112, -193, 51, -126, 21, 102, 65]
3310F5j07J25J9J19m85R7J2J36L65l30O0L0j97JQ9J38j32l3Q4j46K01n0j65J42
3334C8k20J93j2L04k62q7pR9k07L32R8l11m6j20L00j38J46k94J73K05k06pK19
3357A90k0j06K38l16k02L63o3j63J19j95R1K52j36j22J56k25J43r0j08K27j64
3378a31J02K46j11k58L51o0k53N1J99p9K7LK04j60q4k05K29q8n3P0j13p7L93l5
3402A68j55p7j33L89k91N4n6n8OL9K27j97J96r7r8J2M93k10j38j3J51J0l59K07
3426G0J0k36Q4J54l2k03K48P7k94O5J18k5l56M43j43n4j2J72J31j86K56k54J83
3449B16l32L03k04j06MJ52K66j18k04P6m4J9L94k25l16L1J66k24K81k61J6k16
3471c26J15K90j07K29k83J75o6J3J27m36M15n46M30q2K2j87K67j66J94l6P9j76
$$ y = [65, -42, 83, 102, 221, -264, -167, -155, -19, 346, 16, 76, 106, -91, -90, -1, 137, 5, -28, 56, -90, 111, 61, -104, 38, -182, 11, -1, 303, 41, -46, -53, 46, -161, 171, 269, -42, -88, -208, 92, -46, 100, -194, -21, 184, -22, -29, 190, 170, 64, 302, -14, -216, 147, 84, -79, 40, -155, -64, 188, 52, -70, 86, -139, 4, -86, -194, 33, -131, -29, 217, 106, -152, 199, 139, -114, -63, 136, 57, 84, 87, 291, 131, 47, -158, 71, -17, -70, 0, -113, -190, 203, 168, 13, -64, -197, 192, -99, -45, -101, -159, -153, -114, 113, -84, 112, 15, -83, -71, 422, 212, 74, 61, 212, 222, -137, 70, 80, -156, -72, 82, 50, -153, 95, 172, -122, -57, 61, 36, -320, 123, -20, -74, -86, 86, 217, 31, 287, 33, 216, -116, 187, -17, -123, -119, 33, 299, 181, -23, 53, 9, 28, 422, 197, -119, -88, 78, -146, 135, -126, -110, -326, -211, 79, -28, 201, -82, 93, 27, 40, 167, -269, 146, -400, 30, -52, -30, -217, 50, -116, 78, 42, 121, -55]
3493e5j38J83J5k31Q0K73m9Ol19p5K59K6j0K42k22J17k49J08M0k22J38K63k73
3516i3J04P7k74j00K70L2K26k98m4J47K08j90j41r4J1PP6M0J95j39j46J41J51
3539A66K1k52K48m39jL37j34r8K64j18o6J31J0R7j1j04J15m38K58J08R1q6j48
3562d9o1k6M1j0L64k74l7K03j66J54K8k41K22q3m2K1l5k19K23L7l3j09J73r2J33
3587A22j09R5m8l6n5n9K58l23L5J94j56P4J58l28J65k57K26j7N2j8N4l05M89k51
3611d0K39j99o9N9Or6M07m62L36j71J69m44L58J16j82J78l4k99N1nROJ29r1k73
3636c02M19j0k10KO5NN0k15J29p9K15J50k32J70j38j15Q1k9K88j34p4j96RL31
3660A80j34l8o6j4J84q6J4k9K03p7m31K66j07J73k98L25J53j01j51N5j03P2J72
$$ y = [-55, -193, -10, 5, -226, -146, 127, 78, 84, -235, -310, -51, -25, -35, 207, -15, 102, -147, -39, 1, -221, -83, 180, -93, 11, 88, -186, -286, -16, 16, 242, -56, -100, 47, 255, 65, -76, -170, -159, -152, -76, -36, 159, 20, -126, 15, 166, 187, -65, 183, -256, -257, 80, -54, -152, 112, -6, -72, 59, 69, 166, 155, 51, 166, -272, -14, 94, 185, 99, -49, -110, -136, -95, -105, 259, -15, -52, 151, -15, 139, 167, -74, 148, 65, 23, 44, 9, -210, 13, 50, 17, -92, 81, -11, 122, 13, 108, 60, 24, -31, -90, 168, -155, -120, 74, -82, -8, 150, -178, -13, -270, -44, -61, -9, -27, 27, -278, 211, -40, 199, 0, -69, -10, -4, -100, 307, -155, 181, 10, 179, -265, 93, 209, 27, 205, 171, -128, -77, -82, -73, -67, 62, -29, -302, 117, 107, -103, -101, -36, -31, 19, -196, -67, -146, 69, 219, -13, 157, 19, -96, -15, -44, 244, 110, 36, -160, -151, 180, 46, 8, -58, -72, 112, 26, 40, 11, 214, 137, -294, -28, -135, 38, -260, 65, 218, 117, -34, 21, -82, -10, 162]
3683A62m36K80M4R5k97J10J93o9J05k10L1N9q3j83K14K9J81p3j96l2J03k18L39
3706A48j78l2M1R5j25R8J1j60n9M51Q6p8k59m8J76j63M2q1J45o6j07KK84j23k9
3731G1J69j55m01N16J8n45M35m9j23p3J53j2L24l69J1lj36R7j11Q1K38j84Ro9
3755a08K95o2k16J86k47J56K4l3l5K77j01j35n2M9r2J44j43J61j32J08l81L69
3777C2k67K34k15N42o33P6L65m76M76k29K9J2J8J06k5J88l56Q6K61k13j0J54j4
3800A41j56R5k9j09K85m03K55J4k73J62J2J1j63O0J50Q4L5l29J80m8KO5j59K9
3824h9l2k2J77J08O3k75K35r1q0r6K28j99K09k36j74K59l60M51l3o6L5j82J09
3847f1O1kO4O9m1l50J27J3j54N05j13M8n0k47j66K14k1L5J72J36j83j46K5j82
$$ y = [162, -274, 6, 50, 145, -152, -42, 151, 82, 187, -23, 8, 67, -16, -199, 15, 44, 225, 152, -44, -76, 27, -191, 148, -30, -62, -21, 74, -51, 47, 58, -102, -161, 290, 376, 298, 39, -9, 167, 4, 46, -35, 110, 44, -63, -61, 223, 100, 71, 240, 85, -316, 200, 218, -327, 108, 59, -64, -137, 16, 4, 328, -41, -30, -33, -169, -72, -183, -102, 136, -48, -39, -108, 187, 125, -91, 95, -152, 4, 28, -5, -40, 237, 136, 1, -51, -2, -94, 50, -93, 68, -64, 44, -337, 32, -235, -1, -216, 326, -307, -231, 134, -342, 134, -95, -66, -54, -36, 70, 45, 233, -123, -37, 224, 11, 1, 155, 141, -15, 80, 51, -58, 227, -176, 79, 93, -180, -18, -6, 5, -158, -98, 52, 136, 171, -158, 22, -26, -24, 41, -118, -89, -121, -143, 34, 142, 205, -70, 165, 74, -6, -102, 126, -73, 136, -100, -274, -15, -375, 76, 43, -23, 12, -170, -61, 0, -2, 62, 131, 90, -260, -133, -120, -274, 231, 118, 166, 116, -131, -297, -83, -104, -69, 103, 239, 56, -90, -65, -247]
3871b47K65J6RL2j01Q7j7m6k74L42J27n00J29J95Q8j25q5j24K99J38j32n9l3J57
3895A41j99N5Q1n9K32k31k86M89j56p8j28L55l48R9K67k10J99j99N9l1M9j98N4
3918d3q4N29n37K20j09Q0N8j31k76J12N9Q1J18n8j23J72J22l72K29k7O7m6O7n7
3942E1o6J11k05J19Kk19J19j51L89k03J14P3R1l63L19l37j42K57J54Q1r9k7R1
3965A59k03l8j73j2J80P6j10K47j29Q4O7j54j13M3J09M4l54J49K11k1N4p6J37
3988A77j76j21J29r8J57K02k39M1k08J7J73L4j95K8K54r6j30N8k94J11L57k69
4010h8N1ooJ71l01M05j47Q6j44J56L9j35o7o5J56l4j88k21K25K94l8J39m42J42
4034a8J15L1k24o2l38L84J8n1K98k83K32kJ28k75q0M10m44J73m7m5M7l6j65L62
$$ y = [-247, 18, 34, 43, 75, -26, 61, 44, -2, -276, 66, 193, -307, -178, 17, 105, -20, -105, -229, 70, 208, 76, 17, -16, 141, -58, -3, 78, 19, 251, 20, -266, 223, 67, -11, -139, 216, -132, -33, 234, 24, 223, 24, 83, 52, 101, -97, -43, -127, 402, -135, 85, -24, 56, 114, -17, -293, -181, -122, -41, 77, 19, -104, 68, 190, -182, 47, 20, 87, 41, 108, 51, -15, 96, -109, 10, 12, -207, -88, -239, 150, -53, 61, 134, 225, -138, 181, -156, -298, -41, 113, 194, 95, 68, 159, -44, -82, -255, -267, -87, -11, -121, 126, -3, 81, 148, -6, -119, -76, 33, 77, -277, -128, 83, 62, 116, 40, 177, 1, -120, 9, -89, 68, 270, 31, 72, -136, -119, 54, 88, -107, -79, 175, 79, -51, 7, -287, -176, 181, -88, -37, -43, -49, 122, -179, 226, 79, 165, 21, 177, 216, 81, 14, -51, 105, 71, -117, -338, -113, 181, 143, 282, -160, -18, 97, 128, -96, -158, -496, -112, -94, -145, 153, -130, 102, 100, 228, -47, -127, 283, -161, 12, -35, -80, -33, -69, -234, 128]
4058A28m0K42l92J48m6j37L42m21K3L01r7J45j02k64r9L36r9J01n6p8K3M1J58
4081A57l34K73k04L8J84l59J89k92K65L34m02j9K56j47K9J6kJ24j83R4P1j87P5
4104b4K34k77m6M7J1N2R8k46K90j37J8m6l9o5m21N17j69Q7P7L06j42l34Q8j64
4128b85L03q9J21q2qJ67j50J33l09L03n2j19j42N15l52l9J58o5K90m89J68J08
4150H5j86NK18j10r9r3n8J04J66J34n6l25M20k70K50j30KL6P4k32k2K43q3k37
4174a64O0J09K17k8l99J93l3n7l1k6J31L27l51q4L40k14k6J56k82J18p1J29K52
4197B66l40j20J75l07J18M84n39J58L3L3L6n9k7o9M15k17J84l92P8J58j10q9J68
4220C7QJ19j21j91J52o3J91k62K63j63j04M8Q3J06R1k07P8r1q8J19J77l22K5J87
$$ y = [128, 88, 330, -62, 86, 40, -97, 245, -176, -153, 148, 51, 196, 94, -170, -269, 67, -32, 69, 13, -65, -42, -1, 157, -177, 96, -108, -70, 114, -245, -56, -348, -83, 251, -151, -170, 86, -61, -32, -16, -18, 106, -77, 17, 88, -99, -24, 210, -67, -113, -66, -55, -3, 95, -151, 139, 2, 20, -26, -65, -130, -551, -34, -203, -116, -39, 267, 125, -209, -121, -285, 18, -71, 50, -32, -40, 127, -23, 110, -199, 104, 52, -67, -209, 306, -46, -85, 73, 8, 298, -191, -23, 85, -101, -96, 122, 12, -87, -180, -238, -134, 32, 166, 110, -215, 205, -65, 185, 55, 57, 93, 167, -65, -87, 156, 73, -164, -104, 5, 222, 194, -205, -12, -45, -102, -133, -159, -28, 299, -52, -136, 204, -10, -36, 120, -162, -44, -115, 14, 266, -74, -194, -19, -326, -208, 276, -263, -105, -72, -39, -3, -62, -89, -158, 257, 40, 224, -168, -90, 68, -42, -131, 37, 45, 164, 43, -148, 4, -59, 132, -130, 133, -30, -134, -86, -3, 103, 194, -13, 65, -26, -114, 5, 182, -140, -115, 72]
4244G2k2l5k64K73J1j96K58j51Q6N1l10K96j28K9l8K8n8q0K38rp2J2j28L36j10
4269H9k70J36Q2O7j52Q3k90M24k90r1J52L05m45K68M1l5k02R2K02j36J39j55n9
4292d5J08j75L5q5K29P2j52p6J27j49L0KR0j85L46Op9K5r2k0J1k72M97k90J54
4317A12k89M1L19J6k64R1J54j53o4J41l3jJ4k40K7N78m86j44L6L9L55L9j91j34
4341c7Q3QL4q5J10q2j30J75j86K38o3o2J80l63J44J85j11j60j26M38l04l5L28
4364A79k13J87n37J56J10J32q6J83k00J56P3k08J20Qr4k28K95K1J02j07j76j1
4386a38P6J31j23J43j90J82M9k83L60k56J42l52L37j63K86m34L21o2oj25o6K58
4408H7l08M29m14J52r7K47j3r7J74j37j88RL11K27n09J23k60L06J42k3j94O5j25
$$ y = [72, 50, 15, -249, 24, 35, -161, 97, -54, 32, 83, -227, 69, -59, -30, -68, -40, -98, -178, 60, 51, -21, -9, -137, 199, 89, -181, -45, 37, 104, -48, 35, -255, 169, -121, -212, -60, 245, -200, 68, 109, 74, -128, -36, 166, 30, 169, 14, -45, 63, -112, -77, -162, 67, 139, -13, -89, 38, -111, -81, -79, 11, -174, 172, 178, 99, 124, 32, 12, 23, -249, 248, -42, 112, -177, -136, 183, 199, -65, 26, 180, 27, -37, 104, 71, 70, 84, -156, -129, 449, -37, -181, -145, -106, 249, 288, 97, -37, 46, 54, 88, 3, 113, 31, -99, 76, -110, 128, 65, 3, 183, -180, -36, 149, 38, -122, -248, 190, -114, -149, 179, -34, 153, -384, -228, -118, 14, -72, 111, -89, 67, 140, -68, 52, 60, -34, -262, 33, 54, 156, 49, -127, -138, -62, 69, -54, 89, -101, 81, 130, -153, 207, -49, 93, -259, 78, -85, 201, -233, 88, 26, 20, -105, -171, 87, -221, 208, -206, -54, -151, 96, 83, -14, 160, 23, -165, -156, 155, 382, -127, -4, -264, 42, 184, 161, -33, 32, -93]
4431i3J92o1k08O1K00J08j33J36m7p8j70Jm6P3L28k76N3O4p2M9j04o7K56m5J30
4456B51k40k54M92j41j64k01J92J59j10p5M4J69j5j03R5k5J02m59N07k11r7K47
4478A63j44M2j04L85m01j4L9q1K66l31K16j19K19jl56K4J79n2j20L05l99L29j1
4501C4O7j59P5n4m7r9M8Q1k80K41R4K71j58j37J31j10j22J91J21j17j19J10J15
4524A77J0k10K48j56j30K17k53j96K24J38k85K51j16j38L22j70n5P4J96j2m31
4545b95J63q4N0Q3M4J5l7j51K43N2k00K23j90Q5j49L4j13M07l40J71j8J36K7j60
4569dR8J63l25o1J44J00j14j27O4o3R6J68j11k59K83k64K28J65j46k7O8q8l5j21
4593a68L88m54kJ74J4k52L46O6mk22J13n8K32j9K1j51k0Q9k00J40m9R5k87L63
$$ y = [-93, 99, 38, -170, -109, 91, 199, 66, 202, 155, 77, -93, -92, -138, -65, 263, -13, 40, 104, 32, 81, -23, -90, 166, 121, 251, 11, -243, 249, 108, -56, -257, -65, 94, -16, -91, -47, 122, 107, 4, 99, 74, 176, -283, 224, 13, -84, 163, 19, 61, -43, 342, -59, -73, -34, -115, 151, -180, 36, -83, 136, 135, -221, -197, -18, -70, -190, 115, -284, 45, 34, 101, -58, 17, -37, -84, -183, -135, -54, -334, -93, 1, 272, 114, -23, 108, -2, -124, 67, 188, 71, -48, 62, 177, 187, -23, 225, 69, -61, 156, -97, -293, -69, 69, -216, 35, -81, -219, 103, -67, -122, -48, 148, 136, -295, -132, -216, -166, -83, -39, -24, -61, -212, 31, 83, -117, 106, -84, 1, -148, -114, -227, 180, -160, 11, -7, 129, 156, -4, 94, 257, -68, -129, 15, 115, 1, -126, -62, -125, -29, 139, 28, -231, 52, -212, 16, 181, 35, 8, 76, -12, -47, -168, 220, -234, -236, -62, -48, -300, 46, 112, 108, -114, -1, -59, 173, 154, 175, 24, 4, 93, -107, 33, -16, 79, -208, 155]
4617A55j15j3j37J84l22M34l97J74L06k53lJ19k16J59nK9k15M4j22K42k01K14
4639F1k28l8L52j33q4p9L23J08l70J25M5J05M9k30lJ3J62k12M2K43j83k04rJ63
4663A8J86j21n1L2j04M1p9j90M43p1l02J30J66J7n7P1k53L05k16K14o4R6j01j51
4687d1K9K71k86q4k7j33L13P6N0l27l3l5L96j21r1J63j62j41L42j09l54K89m18
4710d33M15p4P2J39k57J54l6n3K24k2m1j23R2J34K0l34J74M6N7p8J4Q8j46J00
4734A32k94K07Q0j47rK45m72J55j4J35Q2K5l2l20K72j04J49qj97J84n5q5L7N3
4758A9o9L7m7J29j62K91k82J35j66R6j0j10K91l17R0N4O3l1jj25k6n0m5M39k94
4783i1q6M52k91j3k89L56N6R6l89M4M2J94j05j21J56o3o6J5M5K81n44J52J67O3
$$ y = [155, 40, 27, -110, 74, -248, 186, -211, -37, 269, 16, 13, 132, -84, 75, 70, 99, -116, -72, -194, 48, -153, 61, -167, -205, 147, 14, -70, -149, 174, 282, -88, 37, 82, 187, 236, 6, 3, 16, 178, -34, 8, 251, 68, -136, -145, 18, 204, 83, 32, 64, -40, 1, -78, -268, 175, 104, -198, -68, 98, 115, 58, 129, -124, 181, -35, 179, 115, 211, 110, -41, -12, 259, -27, -111, -138, -271, 42, 118, 168, -159, -192, -227, 169, 48, -43, 120, -42, -183, 159, 50, -304, -15, -433, -18, -92, -20, 119, -138, 16, -20, -73, 151, 129, 88, -35, 57, 191, 211, -123, 51, 97, 154, 76, 90, 178, 32, 132, -162, 45, 125, -22, -31, 214, -258, -103, -117, 18, 100, 125, 93, -227, 45, -59, 90, 82, -115, 69, 14, -71, -34, 19, -50, -13, -60, 69, -93, 198, -84, 51, -115, -19, -29, -139, 152, -165, -75, -21, 42, 11, 10, -115, -141, -191, -236, 203, -91, -177, 275, -16, -29, -318, 38, 94, 190, -199, -155, -113, 81, -24, -145, 11, -52, -118, -103, -58, 223, -321, -169, -2, 61]
4807F1l37J07J84nJ08k2N4o5j89J22J6j2k7j78L32m27J43J75J92m56M02l2j9r8
4831B9R6n3M7j12l8R4j5k24K20J09o8j41L5j16q5J13K02J05r3m1Q1m2j64J35j8
4856E6k8l46L20P6k0J22l30J34J19Ml4j59K36M5p7K9j82J1M8k44J84J19k16J66
4880C3J38j63K5k90K90j51O6N2j73Q0J60J31j38j56J77k61L45P1l11j24L20L1
4902A52j83r4N9K03p8k12K25m2j5m8J17k94N12j21m01K46j3j17o6P8L27k09L8
4925F4k55R4j01J51rJ26K4J99j25k27p4K04k31P8J91l24K53q5K24r9p5j77R6j22
4949b00M02l16J5O1L06P3m38K23j2J9l19r9j32M00Q3k24J96l2j59O5J21n3k0K38
4973A98l36K01L64l88qj03P0rq7L91l90L13l53J22M0N3q6q8j13M32nm4j41Q1l15
$$ y = [61, -276, -169, 15, 10, 118, 96, 150, 85, -104, 18, 34, 22, -5, -183, 149, -278, -135, 40, 232, -224, 178, 146, 127, 29, 125, 72, 119, 7, -31, 63, 48, -176, 44, 153, 85, -56, -21, -137, -222, -109, 93, 198, 105, 64, 145, 103, -61, 74, 56, 28, -318, 2, 78, 58, 180, -150, -16, 103, 107, 73, -86, 150, 195, 118, 147, -35, -24, 24, -220, -36, 83, -133, 33, 171, 8, 33, -257, 33, -118, -52, 0, -173, -93, 67, 198, 60, -96, 81, -180, 165, 236, -75, -199, 121, 152, -31, -125, -66, 137, 59, -153, 72, 30, 15, -33, 84, -210, 302, 181, -220, 26, 13, -104, -170, -92, 235, 26, 64, -191, -97, -198, -47, -56, 70, 94, 293, 168, -59, -133, 71, -160, -82, 109, -215, 38, -47, 177, 78, 3, -174, -78, -200, 202, -114, -99, -38, 268, 341, -97, 126, 114, 133, -186, -285, -417, -17, 66, -158, 38, 6, -153, -88, 33, -20, -40, 198, -138, 63, 427, 39, 31, -72, -2, -11, -98, 293, -97, 216, -137, -15, 25, 78, -8, -96, -209, 223, 218, 174, 33, 114, -201]
4998b01j1K83k23m3P2J20N4j75l8M71o54M45J47n04P5J22K68o1k97J92K01k84
5020d1J31j53K16l35N8J42l9J76j77J50J18m18J83O1j4j77J68j41J53j11l7m5
5042a32O6Q0n9r5L4j9K53N6j04K8k91K15L4J54k02l2K8K6OJ9O2k4j56J13Q6k43
5068i7PL8m7L11j45l8j55Q1O4l04M08J50l69L68k05j46j06L59l94J49K25k05p9
5091a30J06n1J46k88J72J55k07J07pj17L4J72k21J33M2j58K06m34K57p4K00j0
5113C3R0J92j23r4k20J28k6N8l8r5o0K95l58N29l44J20j17o2J31n9O1j77P6J00
5137D0j70K53q1P6j01j9pN1k0lo7J42j30k72L75l64L15J07m59N04j05j73J90j92
5161a10K93j88J39l3l64J74K20J64m09J89j24l1p9J14Q8k94O3J47J88n32M50P3
$$ y = [-201, -212, 71, -152, -195, -123, -3, 51, -124, -162, 309, -345, 100, 247, -257, -182, -60, 208, 147, -150, 42, 243, -41, 90, -63, 153, -182, -124, 18, -21, 155, -22, 128, 246, -172, 11, 72, 58, -119, 49, -92, 61, -50, -87, -132, -66, 14, -45, -140, -106, -125, 128, 184, 80, 108, -183, 32, 66, 220, 18, -14, 14, 40, 46, 65, 127, 103, -53, 60, 146, -97, -90, -52, -99, 212, 67, 29, -126, -45, 19, -285, 123, 273, -96, 272, 67, -79, -185, 174, -220, -71, 154, -51, -130, -24, -75, 71, -217, -45, 110, -97, 10, 3, -114, -80, 92, -129, 4, 46, -112, 94, -340, -83, -157, 43, 33, 123, 315, 192, 98, -122, 6, -20, 38, 0, -95, -155, 140, -218, 311, -33, 87, -30, -92, 39, -20, 41, -136, -60, 40, -130, 123, 42, 118, 17, -2, -9, 42, 22, 19, -48, 94, -36, -308, 67, -297, 18, 125, -334, 170, 65, -108, 82, -110, 183, -5, 134, 101, -263, -89, 131, 295, -114, 75, -49, -80, -159, -45, 43, -251, -188, -41, 147, -385, 65, 138]
5183A38o2j08PJ00Q7l60J61n4p1J93R7k14j58K68P2n0l53J78K72j98J85j29M7
5206D8o1K55k52K87k87K28m28J00P6n0j26K84K41k95j89L02k13k9j9j72K33k2
5228h9J06k04J10N8J26p0j11L29l54J19N0l8J32l47J61N9j34J99J05k15Q0Q1n0
5251A03n1l9k61J71N4J18j36J03j57L00k80J37j88L40q4j51N6j64L17j09j35K63
5273B07m24M82m16J44j66J48L7j79K48OQ0m7R2n32J95J87Kj44K25k04J55k8N7
5296A25k88R9n4L2o6l8J60j40K8j3K32j43K79k7q7j25j16N5P0p6J30k16K26m6
5320AK03l31K2lJ63j63J59j41K71j0j39j0J09p2j60P2O8k54K40J62k21K11k82
5343a05K92r2j44J40J93j14j01j38k0R9j46L8J71k33J74P1l23P0j51K26J56k25
$$ y = [138, 76, -32, -25, 75, 162, -198, -37, -91, -162, 31, 128, -86, -244, 24, 96, 46, -307, -129, 143, -55, 130, 1, 48, -13, 242, -10, 277, -10, 218, -210, -110, -34, -84, -210, 74, 315, 20, -169, 133, -80, -109, -128, -300, -67, -89, 17, -187, -77, -19, 107, 37, -74, 255, -99, 20, 70, 32, 164, -183, -22, 37, -97, 102, 207, -8, 72, 153, 103, 52, 13, -248, -77, -23, 95, -41, 62, -95, 205, -75, 62, -126, 214, 130, -21, 35, -129, 188, 79, -56, 207, -217, 265, -151, -7, -173, -25, 12, -167, 81, 87, 167, 120, 212, -320, -125, 62, 64, -80, 145, -59, 96, 68, 125, -163, -64, -118, -86, -152, -190, -30, -170, -142, -155, 77, -66, 213, 186, 99, -26, -142, -87, -17, -93, 37, -179, 47, 1, 204, -127, -105, -108, 55, -108, 51, -90, 181, 171, 32, 22, 131, 59, -101, -29, 39, -215, 25, 187, -34, 177, -105, 187, 95, -49, 91, 284, 170, 69, -69, -89, 10, -136, -98, 73, -160, 14, 85, -238, -168, -319, -93, 63, -162]
5365a62K63r1J48L9k82l9J45l1J5J32n7j20J89k71k9J56J23j87j1k6J33M00o11
5388a74J0Q5n1k6K53j80N4Q1j09K49J0l38M6K12j00j46J01j4r6Q6R8P5p3j13K3
5413c7K25j10k22n9j9K67Ro4q2j4l3K52J3l7j26M2k56K34R5l03QM71o91M59J26
5438A48J2l76NK65j30L2N6K15k41m4j30Q9K62j67K7M3o7NK09k17J07l09K05J10
5462A09j61R5j73NK29k32M6QQ3K21m59K45J5k40K72k38L3J83j92J5M0L10m7J1
5486A78k45M08j09j08J47k64j9p5K39r1k64M95j63J76n25L28n6M8l69L00K11l00
5508e8J97L9k31J21k86J52l2L63J6j77J10k31j7j25q6L82k37K30p0j13J12M1Q6
5531A86m74L17kj2r8J74J0j89k2k3J97J34j17M3m1j96L3P4Q3j45m5K41J39m58
$$ y = [-162, 101, 10, 158, 197, -85, -124, 21, -10, 5, 137, 80, -40, 149, -122, -151, 5, 128, -59, -70, -96, 37, 437, -174, -164, -79, -130, -156, 97, -83, -29, 52, -57, 192, 202, -136, -90, 122, 22, -124, -23, -37, -133, -47, 51, 126, 53, -60, -37, 188, 78, -144, -203, -222, 45, 54, -10, -92, -106, -139, 113, 126, 89, -37, 5, -251, -17, 78, -225, -217, 254, -437, 22, 148, 160, -216, -211, 54, -76, -44, 12, 227, -14, -58, -188, -99, 163, -4, 23, 66, -1, 4, 213, -4, 103, -206, -1, 109, -52, 43, -130, -125, 104, -128, -82, -74, 9, 230, -229, 16, 31, -209, 63, -175, -142, 41, -151, -136, -96, 214, 167, 178, -67, 341, 232, 124, 271, 7, -12, -87, 152, 61, -203, 292, 129, 305, -220, 108, 52, 100, -269, 31, 242, -58, 139, 178, -53, 68, -218, -66, -98, 265, 281, 104, 214, -17, -34, -159, -245, 137, -100, 130, 60, -53, 59, 100, 186, -288, 29, 27, 15, -83, 91, 101, -88, -110, -133, 64, 198, 81, 124, 83, -113, -80, -6, 77, -68, -113, 128, 267, -191]
5555a91K69l8k30K77r3j58J18N5J87j64j96J93J27l15j26L09J71L8n07M56l07
5576a25P1k53K25n7J21j79P3j19M36j67j1l7L65l02j48J92j26L22o33R6K18K3
5598a5o5J38n5k83K51K8J26j4j91N8j23Po4M90j93k57J91k03k00L18j93J27M54
5621C32k92l30O98m51n8K95m49N05j42k36K3J77J3q5p8k03M30J38n89L27k45L18
5643I8j0k8K9M9O1l10m3J99k3j23J61M4k32J77m9Q2j26O2j40L9k5J53qN1j42J03
5669D9k67J68j55J52R1j91L00M6k90K57Jo0M6M9k49j06J82J6j3j73J31J1j26m0
5693a71K1Q8k7N8j98J89J41MO5j42o9M9J60j40k53L52j88J91j93j14m3K32O7j24
5717d5K13m44J38K83k15k5m6k9J78m8K51k00J53j12j1J32l52n2P5K99n9J82p4
$$ y = [-191, 78, 40, -190, 87, -6, -164, -46, 9, 196, 32, -164, 29, 156, -159, -285, 24, 195, 233, -274, 182, -125, -54, -307, -82, -139, -18, -197, -124, -243, 193, 26, 15, -22, 343, 41, -107, 85, -41, 281, -352, -256, -38, -15, -80, 58, 3, -280, -29, -1, 125, 111, -80, -22, -145, -138, -202, 288, 95, -162, 29, -174, -374, -56, -249, -122, 332, 40, -290, 408, -43, -101, 194, -255, 250, 108, -128, -105, 72, 85, 0, -78, -281, 149, 287, -302, 25, -220, 98, 88, 60, 89, 138, 199, -111, -154, 45, 22, -101, 60, 104, -128, 49, 0, 82, -44, 18, -122, -83, -108, 45, 37, 88, -54, 49, -218, -50, -205, -53, 38, -153, 147, 193, -97, 160, 161, 101, 147, 196, -53, -159, 23, 39, 26, -147, -16, -5, -131, -171, -150, -62, -89, -31, -229, -40, 101, 105, 170, 28, -41, 8, 168, 28, -225, 127, -61, 130, -63, -177, -220, 12, 79, -45, 168, -276, -138, 145, -70, -95, -141, -170, 8, -40, 211, 11, 164, 52, 41, 173, -179, -231, -156, 143, 84, 266, 192]
5740A92j74K0Pj4j25J1JK64k38j0M3k42K90J59L6k27J06K07k71l2l9L7J49k24
5764g4L00Qq4j82K9L0l46J25O9J64L8j19L01m51L19j76K28l89K78J09j22j23K6
5787d2J94j64J78j59k90M34n4k47L26j27m3R0k74L16j10J23M1j99m0K53l94J50
5809c8K32P5j99n7R9J39k15K36j38k79l7J42J21k15N2J20k99K19L17j72j71r6
5831a64L65j48J6j80L39m00J17q1L41j67qj68p1L20l07L92L5k83p5L01l10J46
5853A0j4J83j25k8J25q6k84L28L7l29k5m8L26K7l33M89j41j50J04m0k00K10N3
5876H9j05N1P0j47N8j23M1M9J97k11J5K5K05l02M1J47j35K28j55j06J4K11k76
5899a19L04J7l47J23L2j47J22l1K16k34Qo6J30K0p3o6R8l2j09K02k36J21l1j1
$$ y = [192, 18, 38, 45, 31, -94, -83, -82, 182, -56, -66, -23, -265, 25, 184, 220, -7, 99, 306, 35, 3, -36, 1, 150, -74, 226, 234, 150, -32, -3, 27, -319, -194, -125, 39, 77, -42, 259, -192, 127, -49, 179, -210, 68, 177, 55, -68, -42, 152, -12, 166, 7, -283, 151, 97, -150, 176, 49, 6, 96, -178, 138, 28, 151, 192, -7, -47, 206, -188, -38, 194, 269, 70, 13, 112, 251, 36, 272, 134, -145, -182, -40, 81, -134, -82, 38, -261, -42, 275, 103, -68, -164, 201, 53, 69, -111, 228, -172, -55, -136, 205, 38, 30, -138, -209, 111, -196, 196, 231, -52, -127, 174, -136, 10, -4, 179, 54, 26, 151, 65, -219, 109, 146, -183, -208, -256, 70, 97, -236, 253, 112, -38, 66, 26, -174, 36, 89, -16, 35, 105, -42, 16, -107, -66, -17, 180, -31, -16, 9, 214, -88, -47, 100, -35, 193, 38, -68, -54, 157, -119, 185, 202, -145, -22, 10, -137, -15, -46, 170, -64, -56, -122, 8, 28, -45, -111, -13, -45, -154, 48, -188, -67, -98, -109]
5923a09K2J13p2K5J63J35n15L66j36K3o1k5K29j73n7j47K82q1K8j24j63K52M8
5946B3P1k7k50%p7J40J68j17K35j34O5k02K15j90K6L1j31j7L20lj99Nq6J16Q6
5971F8J46k62p8r8K28j19J09L1k17K13k5J9M24n77J08J30j96K6K67Lk8L5k18j12
5995a23K20J13l69Q8j4Q7j98J97J86j80J94k45K54k16L34l63K12m87K20J99k93
6016a84L41Ok57M1n5l4K68j38QK1p9N8j39J77k03J69jN0L0J78k11P7j7k87n5o0
6042b96K4J31K45l68O6L2n4K07K7j6K63l69K05j44k3K59K4j98J11Oj22P4j62J45
$$ y = [-109, -87, 26, -46, -21, 142, 277, -238, 128, -8, 15, -46, -71, 158, -15, -72, -219, 63, -18, 10, -114, -277, -25, 23, 94, 67, -183, -183, -260, -120, 48, -69, 166, 32, 97, -105, 110, -80, -54, -23, -154, -171, 149, 146, -53, -48, -134, -18, 68, 214, -48, -126, -224, 4, -115, -6, 25, -192, 21, -4, 15, 439, -138, -30, 100, -96, -70, 197, 200, 172, 207, -11, -123, 97, 210, -159, -71, -85, 2, -196, 1, 187, 7, 201, -44, 210, -6, 328, -35, 177, -310, -90, 109, -184, 157, 163, -94, -53, -108, -142, 126, -12, -4, 17, -62, -4, -143, 34, -169, 0, -1, 49, 79, 257, 46, 123, 106, -181, -236, -296, -272, -141, 104, -264, -198, -166, -220, -13, 14, -2, 261, -108, 97, -47, -70, 189, 213, 15, 126, 132, 10, 84, -78, 67]
$$ [...]
8191f2
##END NTUPLES=NMR FID
##END=
