##TITLE=1H_Pr AYE
 CDCl3, 8 sc, 
 27.5.2019
##JCAMPDX= 6.0         $$ Bruker NMR JCAMP-DX V2.0
##DATA TYPE= NMR FID
##DATA CLASS= NTUPLES
##ORIGIN= UXNMR, Bruker Analytische Messtechnik GmbH
##OWNER= root
$$ XWIN-NMR		Version 3.5
$$ Mon May 27 15:39:45 2019 Russian Standard Time (UT+4h)  she@DPX200
##.OBSERVE FREQUENCY= 200.1315
##.OBSERVE NUCLEUS= ^1H
##.DELAY= (6, 6)
##.ACQUISITION MODE= SIMULTANEOUS
##.ACQUISITION SCHEME= undefined
##.AVERAGES= 8
##.DIGITISER RES= 18
##SPECTROMETER/DATA SYSTEM= spect
##.PULSE SEQUENCE= zg30
##.SOLVENT NAME= CDCl3
##.SHIFT REFERENCE= (INTERNAL, CDCl3, 0, 15.7039)
##AUDIT TRAIL= $$ (NUMBER, WHEN, WHO, WHERE, WHAT)
$$ ##TITLE= Audit trail, XWIN-NMR		Version 3.5
$$ ##JCAMPDX= 5.01
$$ ##ORIGIN= Bruker BioSpin GmbH
$$ ##OWNER= she
$$ F:/spectra/data/she/nmr/H-F/1/audita.txt
$$ ##AUDIT TRAIL=  $$ (NUMBER, WHEN, WHO, WHERE, WHAT)
(   1,<2019-05-27 15:38:30.35 +0400>,<she>,<DPX200>,
      <created by zg, POWCHK disabled, PULCHK disabled
       configuration hash MD5:
       00 E9 B6 7A A2 85 ED C7 34 08 36 98 17 FE 4E 26
       data hash MD5: 16K
       47 24 8D 4B DF 7C 7E 18 CB B4 15 D0 85 42 8A 25>)
$$ ##END=
$$ 
$$ hash MD5
$$ 6F E0 21 46 22 C3 D8 BB 66 F1 27 A2 CE D7 74 F0
##$RELAX= 
##$RELAX= 
##$RELAX= 
##$RELAX= 
##$RELAX= 
##$RELAX= 
$$ Bruker specific parameters
$$ --------------------------
##$DU= <F:/spectra>
##$EXPNO= 1
##$NAME= <H-F>
##$PROCNO= 1
##$TYPE= <nmr>
##$USER= <she>
##$AMP= (0..31)
100 100 100 100 100 100 100 100 100 100 100 100 100 100 100 100 100 100 
100 100 100 100 100 100 100 100 100 100 100 100 100 100 
##$AQSEQ= 0
##$AQ_mod= 1
##$AUNM= <au_zg>
##$AUTOPOS= <>
##$BF1= 200.13
##$BF2= 200.13
##$BF3= 200.13
##$BF4= 200.13
##$BF5= 200.13
##$BF6= 200.13
##$BF7= 200.13
##$BF8= 200.13
##$BYTORDA= 1
##$CFDGTYP= 0
##$CFRGTYP= 5
##$CHEMSTR= <none>
##$CNST= (0..31)
1 1 145 1 1 1 1 1 1 1 1 1 1 1 1 1 1 1 1 1 1 1 1 1 1 1 1 1 1 1 1 1 
##$CPDPRG= <>
##$CPDPRG1= <>
##$CPDPRG2= <>
##$CPDPRG3= <>
##$CPDPRG4= <mlev>
##$CPDPRG5= <mlev>
##$CPDPRG6= <mlev>
##$CPDPRG7= <mlev>
##$CPDPRG8= <mlev>
##$CPDPRGB= <>
##$CPDPRGT= <>
##$D= (0..31)
0 1.2 0 0 0 0 0 0 0 0 0 0.03 0 0 0 0 0 0 0 0 0 0 0 0 0 0 0 0 0 0 0 0 
##$DATE= 1558957109
##$DBL= (0..7)
120 120 120 120 120 120 120 120 
##$DBP= (0..7)
150 150 150 150 150 150 150 150 
##$DBP07= 0
##$DBPNAM0= <>
##$DBPNAM1= <>
##$DBPNAM2= <>
##$DBPNAM3= <>
##$DBPNAM4= <>
##$DBPNAM5= <>
##$DBPNAM6= <>
##$DBPNAM7= <>
##$DBPOAL= (0..7)
0.5 0.5 0.5 0.5 0.5 0.5 0.5 0.5 
##$DBPOFFS= (0..7)
0 0 0 0 0 0 0 0 
##$DE= 6
##$DECBNUC= <off>
##$DECIM= 24
##$DECNUC= <off>
##$DECSTAT= 4
##$DIGMOD= 1
##$DIGTYP= 9
##$DL= (0..7)
0 120 120 120 120 120 120 120 
##$DP= (0..7)
150 150 150 150 150 150 150 150 
##$DP07= 0
##$DPNAME0= <>
##$DPNAME1= <>
##$DPNAME2= <>
##$DPNAME3= <>
##$DPNAME4= <>
##$DPNAME5= <>
##$DPNAME6= <>
##$DPNAME7= <>
##$DPOAL= (0..7)
0.5 0.5 0.5 0.5 0.5 0.5 0.5 0.5 
##$DPOFFS= (0..7)
0 0 0 0 0 0 0 0 
##$DQDMODE= 0
##$DR= 18
##$DS= 0
##$DSLIST= <SSSSSSSSSSSSSSS>
##$DSPFIRM= 0
$$ [...]
##$SUBNAM2= <"">
##$SUBNAM3= <"">
##$SUBNAM4= <"">
##$SUBNAM5= <"">
##$SUBNAM6= <"">
##$SUBNAM7= <"">
##$SUBNAM8= <"">
##$SUBNAM9= <"">
##$SW= 24.9337058887773
##$SWIBOX= (0..15)
0 0 2 0 0 0 0 0 0 0 0 0 0 0 0 0 
##$SW_h= 4990.01996007984
##$TD= 16384
##$TD0= 1
##$TE= 0
##$TE2= 300
##$TE3= 300
##$TEG= 300
##$TL= (0..7)
0 120 120 120 120 120 120 120 
##$TP= (0..7)
150 150 150 150 150 150 150 150 
##$TP07= 0
##$TPNAME0= <>
##$TPNAME1= <>
##$TPNAME2= <>
##$TPNAME3= <>
##$TPNAME4= <>
##$TPNAME5= <>
##$TPNAME6= <>
##$TPNAME7= <>
##$TPOAL= (0..7)
0.5 0.5 0.5 0.5 0.5 0.5 0.5 0.5 
##$TPOFFS= (0..7)
0 0 0 0 0 0 0 0 
##$TUNHIN= 0
##$TUNHOUT= 0
##$TUNXOUT= 0
##$USERA1= <user>
##$USERA2= <user>
##$USERA3= <user>
##$USERA4= <user>
##$USERA5= <user>
##$V9= 5
##$VALIST= <valist>
##$VCLIST= <CCCCCCCCCCCCCCC>
##$VD= 0
##$VDLIST= <DDDDDDDDDDDDDDD>
##$VPLIST= <PPPPPPPPPPPPPPP>
##$VTLIST= <TTTTTTTTTTTTTTT>
##$WBST= 1024
##$WBSW= 4
##$XGAIN= (0..3)
0 0 0 0 
##$XL= 0
##$YL= 0
##$YMAX_a= 265321
##$YMIN_a= -452939
##$ZGOPTNS= <>
##$ZL1= 120
##$ZL2= 120
##$ZL3= 120
##$ZL4= 120
##$ABSF1= 10
##$ABSF2= 0
##$ABSG= 5
##$ABSL= 3
##$ALPHA= 0
##$AQORDER= 0
##$ASSFAC= 0
##$ASSFACI= 0
##$ASSFACX= 0
##$ASSWID= 0
##$AUNMP= <proc_1d>
##$AZFE= 0.1
##$AZFW= 0.1
##$BCFW= 1
##$BC_mod= 2
##$BYTORDP= 1
##$COROFFS= 0
##$CY= 11.3945322036743
##$DATMOD= 1
##$DC= 2
##$DFILT= <>
##$DTYPP= 0
##$F1P= 18.9103706918063
##$F2P= -1.10871071338519
##$FCOR= 0.5
##$FTSIZE= 0
##$FT_mod= 4
##$GAMMA= 1
##$GB= 0.15
##$INTBC= 1
##$INTSCL= 1
##$ISEN= 128
##$LB= 0.24
##$LEV0= 0
##$LPBIN= 0
##$MAXI= 10000
##$MC2= 0
##$MEAN= 0
##$ME_mod= 0
##$MI= 1.114404
##$NCOEF= 0
##$NC_proc= 0
##$NLEV= 6
##$NOISF1= 3.799351
##$NOISF2= 2.8
##$NSP= 1
##$NTH_PI= 0
##$NZP= 0
##$OFFSET= 15.70392
##$PC= 1
##$PHC0= -8859.542
##$PHC1= 17.00026
##$PH_mod= 1
##$PKNL= yes
##$PPARMOD= 0
##$PSCAL= 0
##$PSIGN= 0
##$REVERSE= no
##$SF= 200.130013532006
##$SI= 16384
##$SIGF1= 3
##$SIGF2= 2
##$SINO= 400
##$SIOLD= 16384
##$SREGLST= <1H.CDCl3>
##$SSB= 0
##$STSI= 0
##$STSR= 0
##$SW_p= 3612.71676300578
##$SYMM= 0
##$S_DEV= 0
##$TDeff= 0
##$TDoff= 0
##$TI= <>
##$TILT= no
##$TM1= 0
##$TM2= 0
##$TOPLEV= 0
##$USERP1= <user>
##$USERP2= <user>
##$USERP3= <user>
##$USERP4= <user>
##$USERP5= <user>
##$WDW= 1
##$XDIM= 8192
##$YMAX_p= 0
##$YMIN_p= 0
$$ End of Bruker specific parameters
$$ ---------------------------------
##NTUPLES= NMR FID
##VAR_NAME=  TIME,          FID/REAL,        FID/IMAG
##SYMBOL=    X,             R,               I
##VAR_TYPE=  INDEPENDENT,   DEPENDENT,       DEPENDENT
##VAR_FORM=  AFFN,          ASDF,            ASDF
##VAR_DIM=   8192,          8192,            8192
##UNITS=     SECONDS,       ARBITRARY UNITS, ARBITRARY UNITS
##FACTOR=    0.0002004,     1,               1
##FIRST=     0,             0,               0
##LAST=      1.6414764,     0,               0
##MIN=       0,             -452939,         0
##MAX=       1.6414764,     265321,          0
$$ Real data points
##PAGE= N=1
##DATA TABLE= (X++(R..R)), XYDATA
$$ [...]
3539D067K166j5834M297J6117q381r505J0716J122j2408M796Q731o679o43O853
$$ 4067 6233 -9601 -5304 10813 2432 -7073 3643 4765 -7643 -2847 5884 -795 -1438 5415
3553E415n400m614O674l713m375J2959K970j7848J449J4387p741r676J3320M700
$$ 5415 15 -4599 2075 -1638 -6013 6946 9916 -7932 -6483 7904 163 -9513 3807 8507
3567H507j1485R04M651o932J563Q032n208k713P930m664r167J0353M596j3421
$$ 8507 -2978 -2074 2577 -4355 -2792 5240 32 -2681 5249 585 -8582 1771 6367 -7054
3581g054L296J5327r383j2974J0238N574q831K773O292o100k74L959q102j171
$$ -7054 -3758 11569 2186 -10788 -550 5024 -3807 -1034 5258 -842 -1116 2843 -5259 -6430
3595f430J3004k153j0337Q278L742j4391J648J5111o261r502J0095L369j1089
$$ -6430 6574 4421 -5916 2362 6104 -8287 -6639 8472 2211 -7291 2804 6173 -4916
3608d916R54N812l642K544N385q828k841J1300m177j1567J0303R384j2357k010
$$ -4916 -3962 1850 -1792 752 6137 -2691 -5532 5768 1591 -9976 327 9711 -2646 -4656
3622d656J0704o385q553J0700M987r009J696L798o370O86N998o423o72J2076m977
$$ -4656 6048 -337 -8890 1810 6797 -2212 -516 3282 -3088 -2402 3596 -2827 -3499 8577 3600
3637C600j4101Q985R605j1525k333J2571l341q583O633J106q556N112O436o758
$$ 3600 -10501 -1516 8089 -3436 -5769 6802 3461 -5122 1511 2617 -5939 -827 5609 -1149
3651a149K88N945p832l341J1397k390j0800R867Q479j4249n243J2719l0p187O100
$$ -1149 -861 5084 -2748 -6089 5308 2918 -7882 1985 10464 -3785 -9028 3691 3661 -3526 2574
3666B574N12p076M155L601q378K077R715o619n596R627j981j0913Q349Q517j1692
$$ 2574 3086 -3990 165 3766 -4612 -2535 7180 561 -5035 4592 2611 -8302 47 8564 -3128
3681c128k658J2303l108r592N525K599m434N269K064r876J534R835p467o410J2196
$$ -3128 -5786 6517 3409 -6183 -658 1941 -2493 2776 4840 -5036 -3502 6333 -1134 -7544 4652
3696D652J352j1564M172O923r696r74J1587l220q678N960K950o987L433L134p264
$$ 4652 6004 -5560 -1388 5535 -4161 -5135 6452 3232 -5446 514 3464 -3523 -90 3044 -4220
3711d220L236Q870r010p650J2121K647j1870L544R215q034l034P803l820n945
$$ -4220 -984 7886 -1124 -8774 3347 5994 -5876 -2332 6883 -1151 -4185 3618 -202 -6147
3725f147Q808K560q976L042L937p364J575Q679o696o002J0678J564j3181L725
$$ -6147 2661 5221 -3755 -713 3224 -4140 -2565 6114 -582 -6584 4094 5658 -7523 -3798
3739c798J0135p032l430P561l036m925P531k70q756N587O622q323j252Q231n801
$$ -3798 6337 -695 -4125 3436 400 -4525 3006 2736 -6020 -433 6189 -2134 -3386 4845 -956
3754i56n709J0489J562j1145L929Q748q465l988Q542j290m937O461j212q206N922
$$ -956 -6665 3824 5386 -5759 -1830 6918 -1547 -5535 3007 1717 -3220 3241 2029 -6177 -255
3769b55O722r339j421R821m019p119Q146J521r393M141P631q317k724Q821k083
$$ -255 6467 -2872 -4293 5528 1509 -5610 2536 4057 -5336 -1195 6436 -1881 -4605 4216 2133
3784B133o793O302J148p234N589N035r905j766J1228l484p796P592K470r074L003
$$ 2133 -4660 1642 2790 -4444 1145 6180 -3725 -5491 5737 2253 -5543 2049 4519 -4555 -1552
3799a552O802p335j859R011k942p545O855K234p631L813N612q747r36J0484m252
$$ -1552 5250 -2085 -3944 5067 2125 -5420 1435 3669 -3962 -149 5463 -3284 -4220 6264 2012
3814B012q188P167L441q214K348O738o931k557Q879l536o702P411K899r104K956
$$ 2012 -6176 991 4432 -3782 -1434 5304 -1627 -4184 4695 1159 -5543 1868 4767 -4337 -1381
3829a381O238p501j258R725l937q459P765L774q941K008O665o511j634P935l599
$$ -1381 4857 -2644 -3902 5823 1886 -6573 1192 4966 -3975 -1967 4698 -1813 -3447 4488 889
3844H89o505Q068K405r915K838P153o349k249Q017l889o685Q326L385r834J918
$$ 889 -5616 2452 4857 -5058 -2220 4933 -1416 -3665 4352 463 -6222 2104 5489 -4345 -2427
3859b427O993o004k395Q050l308o081P164K179r527L098P821o507l427P552k338
$$ -2427 4566 -1438 -3833 4217 909 -5172 1992 4171 -5356 -2258 5563 -944 -4371 3181 843
3874H43n898P619J937r390K342P832o238l035P614k197o358P296J553q708L154
$$ 843 -5055 2564 4501 -4889 -2547 5285 -953 -3988 3626 1429 -4929 2367 3920 -4788 -1634
3889a634P746p661l976R201j474o596O153J852q587L413P555p177l442Q375j661
$$ -1634 6112 -1549 -5525 3676 2202 -4394 1759 3611 -4976 -1563 5992 -1185 -4627 3748 2087
3904B087o713O278K200q189L300P004q075l059R698j458p862N315L127p019K720
$$ 2087 -4626 1652 3852 -4337 -1037 5967 -2108 -5167 4531 3073 -4789 526 3653 -3366 -646
3919f46O294p484l208R648j998p629N857L454p655K222O191o978k111R025k313
$$ -646 5648 -1836 -5044 4604 2606 -5023 834 4288 -3367 -1145 5046 -1932 -4043 4982 2669
3934B669q563O262M419p150J041N574o513j771R032k657q232O751L785q114J518
$$ 2669 -5894 368 4787 -2363 -1322 4252 -2261 -4032 5000 2343 -5889 862 4647 -3467 -1949
3949a949O459n939k249Q110k839p726P255M141q543N97O718m982k142P119l137
$$ -1949 4510 -1429 -3678 4432 1593 -6133 1122 5263 -3280 -2683 4035 -947 -3089 4030 893
3964H93o610P252L975r411P24Q052n242m099P955k120o124O296K983q673Q88P808
$$ 893 -5717 1535 5510 -3901 -3177 4875 -367 -4466 3489 1369 -4755 1541 4524 -4149 -3261 4547
3980D547m869l590P171k097o262O718L347r416J588Q413n642n248P732j52o037
$$ 4547 -322 -3912 3259 1162 -5100 1618 4965 -4451 -2863 5550 -92 -5340 2392 2240 -3797
3995c797M938K364p728K272P225o108m019P782j494o199O222K983r253K211Q165
$$ -3797 1141 3505 -4223 -1951 5274 -834 -4853 2929 1435 -4764 1458 4441 -4812 -2601 5564
4010E564n779n076P884O49p224M028K881o180K491N854o648l311Q937j433p702
$$ 5564 -215 -5291 2593 3242 -3982 46 2927 -3253 -762 5092 -1556 -4867 4070 2637 -5065
4025e065N607M104q071J296P451n825m605P900M54p200M182L670o442R59N916
$$ -5065 542 4646 -3425 -2129 5322 -503 -5108 2792 3246 -3954 228 3898 -2544 -1585 4331
4040D331o258k650R661k043q319N420M720p997J52P673m199m581O679K4p096M583
$$ 4331 -1927 -4577 5084 3041 -5278 142 4862 -3135 -2983 4690 491 -4090 2589 2613 -4483 100
4056A00L912o491J345N783o410k106Q310k221q460O563O034q559j449P478l787
$$ 100 4012 -2479 -1134 4649 -1761 -3867 4443 2222 -6238 325 6359 -2200 -3649 3829 42
4071D2m456O929K09o259M355K643p289K037O331n435k635Q294k683q869O296O497
$$ 42 -4414 2515 2724 -3535 820 3463 -3826 -1789 4542 -893 -3528 4766 2083 -6786 -490 6007
4087F007q431j320P850k646n108M927J48n294N032K840p461J516O734o432l713
$$ 6007 -2424 -3744 4106 1460 -3648 1279 1427 -3867 1165 4005 -3456 -1940 4794 -1638 -5351
4102e351R006m82q425N600N370r037j698Q405j975m199M694m23n313M773J732
$$ -5351 3655 3173 -5252 348 5718 -3319 -5017 3388 1413 -2786 1908 1485 -3828 945 2677
4117B677p255L310P786p149m940Q631k87q130M642O357p133j863O805k633n294
$$ 2677 -4578 -1268 6518 -631 -5571 3060 2773 -5357 -715 5642 -1491 -3354 3451 818 -4476
4132d476N066J131l823M487M14p788K796P719o891m457R899J140r816K077O438
$$ -4476 590 1721 -2102 2385 2799 -4989 -2193 5526 -1365 -5822 4077 5217 -4599 -2522 3916
4147C916n588q08O613l093m328N059p22m885M684K776p053K963O836q029n277
$$ 3916 -1672 -2480 4133 1040 -3288 1771 1049 -3836 848 3624 -3429 -466 6370 -1659 -6936
4162f936R869K137r529K972P190o016l069N066k288j662O295j530o385M803K638
$$ -6936 2933 5070 -4459 -1487 5703 -313 -3382 1684 -604 -2266 4029 2499 -3886 917 3555
4177C555q186K154Q828o079n326Q519O79r750K947P851m449k867M145k002k395
$$ 3555 -4631 -2477 6351 272 -5054 3465 4144 -5606 -2659 5192 743 -2124 2021 19 -2376
4192b376M826k199m582P107L296r919L09Q458n181n420Q212K833q767J849N383
$$ -2376 2450 251 -4331 2776 6072 -3847 -3538 4920 -261 -5681 2531 5364 -3403 -1554 3829
4207C829n927j941O466j342k133M225l265n552P224L260q999J374R826n386q188
$$ 3829 -2098 -4039 2427 1085 -1048 3177 -88 -5640 1584 4844 -4155 -2781 7045 1659 -6529
4222f529P086K972o550K136N361n010j979M491l359k348O220p32n438N860K646
$$ -6529 557 3529 -3021 -885 4476 -534 -2513 1978 -1381 -3729 2491 1759 -3679 2181 4827
4237D827j0561O74J1034l934p634P123K980p637P2M959l141M45M882m631l130
$$ 4827 -5734 -5060 5974 2040 -5594 1529 4509 -3128 -3056 1903 -1238 -793 4089 -542 -3672
4252c672O527j935o514O434N451r149r22R290m988p511P359M564o555M67L867
$$ -3672 2855 920 -5594 840 6291 -2858 -3780 5510 522 -6989 370 4934 -1621 -1154 2713
4267B713m249j021M519l723q46P401k115q480M950N947q514l34R762l423p911
$$ 2713 -1536 -2557 1962 -1761 -2607 4794 2679 -5801 -851 5096 -3418 -3752 6010 2587 -5324
4282e324N722K621o053J310M897l374l79L510m808k316Q039j158p959O082N977
$$ -5324 398 3019 -3034 -1724 3173 -201 -580 2930 -1878 -4194 3845 2687 -5272 810 6787
4297F787r322k828Q575j360n841N630L050o785M26M021m356L82N742m551k787
$$ 6787 -2535 -5363 3212 1852 -3989 1641 4691 -2094 -1668 2353 -2003 -1621 4121 -430 -3217
4312c217O924j506q562N247P472p366l339Q329j751o806M360L189m841K115L269
$$ -3217 3707 2201 -6361 -1114 6358 -1008 -4347 3982 2231 -4575 -215 2974 -1867 248 3517
4327C517n292J5M744m104k807P902N3q969L794O541p892l014R359l32o456L252
$$ 3517 -1775 -1760 2984 -1120 -3927 3975 4028 -4941 -1147 5394 -2498 -5512 3847 3515 -2941 311
4343C11J860n182K670K996m736O29O408n500m416P182Q93q031M156O634p255l453
$$ 311 2171 -3011 -341 2655 -2081 -1452 4956 -544 -4960 2222 3115 -4916 -760 5874 -1381 -4834
4359d834P866p48o339M180L042m866J700K196n625Q24P183m268n019P691P25q563
$$ -4834 3032 2284 -4055 125 3167 -1699 1 2197 -3428 -2604 4579 311 -4708 2983 3708 -4855
4375d855K596P058n863k487P082j585o326M048K547m762K429L438n940R27N814
$$ -4855 -2259 4799 -1064 -3551 3531 1946 -4380 -332 2215 -2547 -118 3320 -2620 -1693 4121
4390D121m815m910Q152K449r108K062O497n384k994O515j077m740M451J510n640
$$ 4121 -694 -5604 2548 4997 -4111 -2049 4448 -936 -3930 2585 1508 -3232 1219 2729 -2911
4405b911J766M146m903NO553m074n717P146J783q240K203P515m957l674N482j416
$$ -2911 -1145 3001 -1902 -1897 4656 582 -5135 2011 3794 -4446 -2243 5272 315 -3359 2123 707
4421G07m048M942Q90n699K986M746o508j510P194k865n142O901J727q305K036
$$ 707 -3341 1601 2491 -3208 -222 4524 -1984 -3494 3700 835 -4307 2594 4321 -3984 -1948
4436a948O526n100k981N876n20m309L606N55n545M104M449o682j646P744k531
$$ -1948 4578 -522 -3503 2373 1853 -2456 1150 1705 -3840 264 4713 -1969 -3615 4129 1598
4451A598o222N877K389o665J772N682n350k693O400j121n138M682J429n567K721
$$ 1598 -4624 1253 3642 -3023 -1251 4431 -919 -3612 2788 1667 -3471 1211 2640 -2927 -206
4466b06L522n983n15P599k719o311N258K790o348J347N429m718k062O087k131
$$ -206 3316 -2667 -3182 4417 1698 -4613 645 3435 -2913 -1566 3863 -855 -2917 3170 1039
4481A039m986N022K123o140K406M305n506j527P301k588o339N769L067o871J201
$$ 1039 -3947 1075 3198 -2942 -536 3769 -1737 -3264 4037 1449 -4890 879 3946 -2925 -1724
4496a724N124m250k319N839j779m869N565J488o575J784N497m952j831O275k390
$$ -1724 3400 -850 -3169 2670 891 -3978 1587 3075 -3500 -1716 3781 -1171 -3002 3273 883
4511H83n226N466K366o609J265N453m433k325N830j299n027M857J653o440K157
$$ 883 -4343 1123 3489 -3120 -1855 3598 -835 -3160 2670 1371 -3656 1201 2854 -3586 -1429
4526a429N478n106k327O347j382n532N114K011n813R72N708m792k336N752j374
$$ -1429 4049 -1057 -3384 2963 1581 -3951 1163 3174 -2639 -1667 4041 -751 -3087 2665 1291
4541A291m494M506J851o252J676N500n069k477O224r27n308M462K236o027J404
$$ 1291 -3203 1303 3154 -3098 -1422 4078 -991 -3468 2756 1829 -3479 983 3219 -2808 -1404
4556a404N474n106k233O140j396n315M813K432o329J674N566n484k114O098j143
$$ -1404 4070 -1036 -3269 2871 1475 -3840 973 3405 -2924 -1250 4316 -1168 -3282 2816 1673
4571A673n058M070K353n788J261N493m466k795O148j037n358M196K665o312J242
$$ 1673 -3385 685 3038 -2750 -1489 4004 -462 -3257 2891 1854 -3504 692 3357 -2955 -1713
4586a713N828n051k653O529j051n842M469K699n620J014N073m645k473O259j208
$$ -1713 4115 -936 -3589 2940 1889 -3953 516 3215 -2405 -1391 3682 -963 -3436 2823 1615
4601A615n504M623K819o181Q73N307m352k714O249r21n532M008L003n482P96M456
$$ 1615 -3889 734 3553 -2628 -1755 3552 -800 -3514 2735 1814 -3718 290 3293 -2189 -1393 3063
4617C063m488j895O080j198n318M198L211o053O84N170m207k507N833j116n335
$$ 3063 -1425 -3320 2760 1562 -3756 442 3653 -2400 -1716 3454 -753 -3260 2573 1457 -3878
4632c878M375L084n755K57N053l719k420N611j285n048M471L035o578Q10N484
$$ -3878 497 3581 -2174 -1917 3136 -583 -3003 2608 1323 -3725 746 3781 -2797 -1987 3497
4647C497l740k858N416p42m988M100K657o090Q10N567l626l027N167p90m913M604
$$ 3497 -243 -3101 2315 1573 -3415 685 3342 -2748 -1938 3629 3 -3024 2143 1353 -3560 1044
4663A044K219o081J034N504l871l419N458n3m922L696K313n489Q45N273m292k529
$$ 1044 3263 -2818 -1784 3720 -151 -3570 1888 1835 -3087 609 2922 -2567 -1722 3551 -741 -3270
4679c270N695l35n313L860K742n838P66N848m334l258N661kn229K791L154m857
$$ -3270 2425 2090 -3223 637 3379 -2459 -1693 4155 -179 -3437 2224 2222 -3007 -216 2938 -1919
4695a919J032M379m450k182N909q21n499L819L064n590L44N382l917l038N665
$$ -1919 -887 3492 -958 -3140 2769 1948 -3551 268 3332 -2258 -1914 3468 -449 -3487 2178
4710B178J98n364K853K885m567L08M444l583k281N617o22o180M173L422n731O1
$$ 2178 2376 -2988 -135 2750 -1817 -1509 2935 -648 -2929 2688 2066 -4114 59 3481 -2250 -2189
4726b189N337k809l300M717o11m204L478K890n509K09M781l362k759N705o08n484
$$ -2189 3148 339 -2961 1756 1145 -3059 419 3309 -2200 -1991 2790 -572 -3331 2374 1766 -3718
4742c718M016L603n796q33N639k375l235M423j37m356L071K087n069J198N254
$$ -3718 298 3901 -1895 -2728 2911 536 -2699 1724 1587 -2769 302 2389 -2680 -1482 3772
4757C772m144l015N626n45n521L530M238n437j092N388k313l407M022M95m033
$$ 3772 -372 -3387 2239 1694 -3827 -297 3941 -1496 -2588 2800 487 -2920 1102 1597 -2436
4772b436K984K106m974Q76M668m104k604O146k46o068L124L926n021j037N669
$$ -2436 548 2654 -2320 -1444 3224 -880 -3484 2662 2416 -3652 -528 3398 -1623 -2660 3009
4787C009j973l490L765j41l699K893K287m843R91M796m543l401O408L09n699L108
$$ 3009 1036 -2454 1311 1170 -2529 364 2651 -2192 -1201 3595 -948 -4349 2059 2368 -3331 -223
4803b23M145m953j531M463j210k879L808K26m178L170J706n426J211O096m197
$$ -223 3922 -1031 -2562 1901 691 -2188 1620 1846 -2332 838 2544 -2882 -1671 4425 228
4818B28l661N772O03o689K330M575l595j495M372k071k750L428O0l414L199K500
$$ 228 -3433 2339 2942 -3747 -1417 3158 -437 -1932 2440 369 -2381 1047 1107 -2307 892 3392
4834C392o086J033N470m196l562O432J304o639J675L906l793j644M342j263k109
$$ 3392 -2694 -1661 3809 -387 -3949 2483 3787 -2852 -1177 2729 -1064 -2708 1634 371 -1738
4849a738L804r78m262L317K527m958J060N702m432m384N733J261n793J922M851
$$ -1738 2066 1088 -3174 143 2670 -2288 -1228 4474 42 -4342 1391 2652 -3141 -1219 3632
4864C632l753j964L153j680j481M131j118l798M036J880o242J82O343k334m383
$$ 3632 -121 -2085 1068 -612 -2093 2038 920 -2878 1158 3038 -3204 -3022 3321 987 -3396
4879c396M998J459n989O54M775l227q05L803j577k374K982j187l809N012K472
$$ -3396 1602 3061 -2928 -2274 2501 -726 -1531 2272 695 -1679 1303 116 -3693 1319 3791
4894C791o128J05N912l179n227N250K637m703Q41L198l504j306L700j735j322
$$ 3791 -2337 -2232 3680 501 -4726 524 3161 -1542 -701 2497 -1007 -2313 1387 -348 -1670
4909a670M217j018m946L495K787n599p2P065k789n324M066K410m786P18L692k092
$$ -1670 2547 1529 -3417 78 2865 -2734 -2806 4259 1470 -3854 212 2622 -2164 -1446 2246 154
4925A54o56K533k572k453M714j90m338L793K797o124j169O402j837m686M764K453
$$ 154 -502 2031 -541 -2994 1720 1530 -2808 985 3782 -2342 -3511 2891 1054 -3632 1132 3585
4941C585n150k16L039k231J52L252k475j506M232j335n605L819M584n288j556
$$ 3585 -1565 -1781 1258 -973 -821 2431 -44 -1550 2682 1347 -4258 -439 4145 -1143 -2699
4956b699O240k180m997L570K550l907P20L210l017r49K776k124j590N332q99n522
$$ -2699 3541 1361 -3636 -66 2484 -1423 -703 2507 -510 -1459 1317 -807 -2397 2935 2036 -3486
4972c486L350L725n615j734O726m77n001K722J617l620Q81K738k379p6L709l613
$$ -3486 -136 3589 -2026 -3760 2966 2489 -2512 210 1827 -1793 -912 1826 -553 -629 3080 -533
4988e33k404M592l71m693L409M302n432k235N542o93m890L422K642l449P09J555
$$ -533 -2937 1655 1284 -3409 0 4302 -1130 -3365 2177 1484 -3406 16 2658 -791 -82 1473
5004A473l455O51M048k769k580M529K17n954K143N130m261j775N189m46m875K040
$$ 1473 -1982 -1331 2717 -52 -2632 1897 2114 -3840 -1697 3433 -828 -2603 2586 2140 -2735 -695
5020f95J897k535J382K374l602l8L792l501k613N418R05n703J978M388m342k544
$$ -695 1202 -1333 49 2423 -1179 -1217 2575 -926 -3539 1879 2784 -2919 -941 3447 -895 -3439
5036c439M896N41m066K702J091k909M86K194l242O38M118k658l460M723Q68n787
$$ -3439 1457 1998 -2068 634 1725 -1184 -698 1496 -1746 -1108 3010 352 -3108 1615 2483 -3304
5052c304K209M619l368k428L746k97l578K390J784k833J096J856l692M5M527k579
$$ -3304 -1095 3524 156 -2272 1474 1177 -2401 -11 1773 -1060 36 1892 -1800 -1755 2772 193
5068A93l165M793J528o015Q68M671l186k010M232n65l409K460J069l396J598K983
$$ 193 -2972 1821 3349 -2666 -1798 2873 -313 -2323 1909 1344 -2065 395 1464 -1932 -334 2649
5084B649l427o67M310k907l280M323J887m927P68M583l532k329L616k23k420K764
$$ 2649 -778 -1445 2865 -42 -3322 1001 2888 -2039 -1271 3312 -220 -2549 1067 844 -1576 1188
5100A188P11m023J772K340l704k11M734j864l776L678J267m682J017M443k621
$$ 1188 1899 -2124 -352 1988 -1716 -1927 2807 943 -2833 845 2112 -2570 -1553 2890 269
5115B69k405L639n91l120K822M99k850J588K818l922r88M438j417l950L863K108
$$ 269 -2136 1503 912 -2208 614 1113 -1737 -149 2669 -1253 -2241 2197 780 -3170 693 2801
5131B801m624M44L604k710j899L656j35k906K369P82l561J588L247l982r03M918
$$ 2801 -1823 -1379 2225 -485 -2384 1272 1137 -1769 600 1382 -2179 -591 2656 -1326 -2229 2689
5147B689j713m116L196K335m111N89L298k415j650L419p97l263L345J199l929
$$ 2689 976 -3140 56 2391 -1720 -1131 2167 -248 -1898 1521 724 -2539 806 2005 -1924
5162a924J400K817l161j375M369j102l704L285K075m227P2L702k523j391L364
$$ -1924 -524 2293 -868 -2243 2126 1024 -2680 605 2680 -1547 -1475 2227 -296 -1687 1677
5177A677r92k914L102R18m033J285L598l111j747M230j325l311L249J707m205
$$ 1677 685 -2229 873 1791 -2242 -957 2641 -470 -2217 2013 688 -2623 626 2333 -1872
5192a872M64L792k606j875L662r01k533K720J175m072J189L872l204k103M232
$$ -1872 -1408 2384 -222 -2097 1565 664 -1869 851 2026 -2046 -857 3015 -189 -2292 1940
5207A940o64l355K412J690l762O58L629k493j975L483p68k979K778J395l464O33
$$ 1940 1276 -2079 333 2023 -1739 -1081 2548 55 -1920 1563 795 -2184 594 1989 -1475 -842
5223h42L474k999j690L875o23l266K287J630l168L61L120k531j656L874r67l295
$$ -842 2632 -367 -2057 1818 1195 -2071 216 1846 -1322 -961 2159 -372 -2028 1846 879 -2416
5239b416K581J559l275N29L819l094j789L751o74l426L177J449m177J057K983
$$ -2416 165 1724 -1551 -1022 2797 -297 -2086 1665 991 -2435 742 2191 -1986 -929 2054
5254B054k599j167L392q62l268L039J593l739M85L528k739j886L248k24l186K638
$$ 2054 -545 -1712 1680 818 -2450 589 2182 -1557 -1072 2456 -283 -2169 1079 855 -2331 307
5270C07J782l709J44L382j947j766L581p85l400K657J761l677O07L067k425j687
$$ 307 2089 -1620 -1476 1906 -41 -1807 1774 989 -2411 246 2007 -1670 -1063 2004 -421 -2108
5286b108L634p12l137K728J459l368M81L134k379k016L909q63l030K731J254l151
$$ -2108 1526 814 -2323 405 1864 -1504 -1023 2111 -268 -2284 1625 762 -2268 463 1717 -1434
5302a434O31L058k515k113L622%l397K537J622l547N51K838j995j483L186k26
$$ -1434 -803 2255 -260 -2373 1249 1249 -2148 389 2011 -1536 -985 1853 -142 -1625 1561 1335
5318A335l672K726J937l788J68L416k320j675L268j91l482K827J539l649K23L540
$$ 1335 -2337 389 2326 -1462 -1294 2122 -198 -1873 1395 1204 -2278 549 2088 -1561 -1338 2202
5334B202k053k147L178k50k774K228J585l353K75L606k352k091L290l24k902K021
$$ 2202 149 -1998 1180 930 -1844 384 1969 -1384 -1109 2497 145 -1946 1344 1020 -1882 139
5350A39J827l410M91L267k393k004L272j02l064K176J729l392L00L463k405k004
$$ 139 1966 -1444 -953 2314 -79 -2083 1189 1087 -1977 199 1928 -1464 -1164 2299 -106 -2110
5366b110L271R7l035J687J797k929J60K695j838j831L381r4l791K748J934l576
$$ -2110 1161 1258 -1777 -90 1707 -1222 -1062 1633 -205 -2036 1345 1251 -2540 208 2142 -1434
5382a434N9L410k115k264L993m81l083K032J606l139K79L012k431j537L334Q6
$$ -1434 -1375 2035 -80 -2344 1649 1168 -1915 117 1723 -1416 -1137 1875 -556 -2093 1241 1327
5398A327l725K277K292l544p1L240j961j919L193j70k852J907K103l532K22L319
$$ 1327 -2398 -121 2171 -1373 -1444 1796 -165 -2084 1109 939 -1913 -6 2097 -1435 -1213 2106
5414B106k086j946L458l36l784K294K543l635m10L692j328k295K286J18k522K271
$$ 2106 20 -1926 1532 1196 -2588 -294 2249 -1386 -1796 1896 568 -1727 559 677 -1845 426
5430D26J141l081O40L069k208k257L511K79l550J928K340l408n96L454j349j813
$$ 426 1567 -1514 -874 2195 -13 -2270 1241 1520 -2030 -102 2238 -1170 -1766 1688 339 -1474
5446a474K461N38k922J613J359k747N78L110k271k531L836J55l912J679K842k928
$$ -1474 987 1525 -1397 216 1575 -1172 -594 2516 245 -2286 1550 1705 -2207 -528 2314 -614
5462f14o15L028j556k010K561N09k967J743J792l444M90L421k543j922L608J32
$$ -614 -1229 1799 243 -1767 794 1303 -1664 79 1871 -1573 -1083 2338 -205 -2127 1481 1613
5478A613l722J912K430k803j310L250r43j372J870j61k962K326J436k930M36L544
$$ 1613 -2109 -197 2233 -570 -1880 1370 427 -945 925 764 -2198 128 1564 -1366 -930 2614
5494B614k643k676L823K5l217J560K965k863j106K854j046j832K296k6k155J931
$$ 2614 -29 -2705 1118 1143 -2074 -514 2451 -412 -1518 1336 290 -1542 754 728 -1427 504
5510E04J044l340J68L808j826k727L670M89l842O64L060k269q81L068j279j764
$$ 504 1548 -1792 -1624 2184 358 -2369 1301 1790 -2052 -1388 1672 -597 -1478 1590 311 -1453
5526a453K216j44k816K327K135l874P47L454k902k796L899J465l849N22K950k222
$$ -1453 763 619 -2197 130 2265 -1609 -862 2592 -310 -3106 793 2258 -1591 -1069 1881 -341
5542c41j135K490q88j217K589p59l231K418J756l203J40M418k621k964L214Q90
$$ -341 -1476 1014 126 -1091 1498 739 -2492 -74 1682 -1521 -1381 3037 416 -2548 666 1556
5558A556l657J027L052j742j307K336j498j288K336j26k405K274K136m259n00
$$ 1556 -2101 -1074 1978 236 -1071 1265 -233 -1521 815 689 -1716 558 2694 -1565 -2065
5573b065M509j606l280L542J341l723K76K078j531m64K340q81j900K366n44k844
$$ -2065 2444 838 -2442 1100 2441 -1282 -1006 1072 -459 -923 1417 536 -1364 1002 458 -2386
5589b386K436K388l576l40M337k098l640K960J866l130O24J988j758l85J775j303
$$ -2386 50 2438 -1138 -1478 2859 761 -2879 81 1947 -1183 -559 1429 -329 -714 1061 -242
5605b42j034K704k85l027K143J979l848p90M723j387l119K516J524l467P38K317
$$ -242 -1276 1428 1143 -1884 259 2238 -1610 -2400 2323 936 -2183 333 1857 -1610 -872 1445
5621A445j244m53K028k405j369L330o65l026K580K883m010j082L571o86l127K451
$$ 1445 201 -252 1776 -629 -1998 1332 667 -2359 221 3104 -906 -1988 1583 897 -2230 221
5637B21J755k933N20J569j847k32K055j317r69K767q78l422K242K717l054j099
$$ 221 1976 -957 -437 1132 -715 -947 1108 -209 -1178 1589 711 -2711 -469 2248 -806 -1905
5653a905L855p38k969J253J458j814N04J839k126j54K078j822j571L510K5l152
$$ -1905 1950 1212 -1757 -504 954 -860 -356 1483 -643 -797 1281 -541 -2112 1398 1423 -1729
5669a729J672K792l772j623M289j61l272J994J165k360K16J557j869O17K655k165
$$ -1729 -57 2735 -1037 -2660 1629 1468 -1804 190 1355 -1005 -789 768 -1101 -484 2171 6
5685Fj856K708L21l409J739L072k835j626L188n38l093K305J553j950L41J719
$$ 6 -1850 858 1179 -2230 -491 2581 -254 -1880 1308 770 -2323 -18 1535 -415 -74 1645
5701A645k975R3K680j575j271K985L90m242J418K791k528j268L293m18k463J523
$$ 1645 -1330 -1237 1443 -132 -1403 1582 1972 -2270 -852 1939 -589 -1857 1436 1018 -1445 78
5717G8Q59j999Q96J661k147K7K635k332k166L607P13l665J048L116k835j646L221
$$ 78 937 -1062 -166 1495 -652 -625 2010 -322 -2488 1119 1832 -1833 -785 2331 -504 -2150 1071
5734A071k15k282J631J006k344J117J376k647M95K682j441k732L331O01l609P59
$$ 1071 856 -1426 205 1211 -1133 -16 1360 -1287 -792 1890 449 -2283 1048 1649 -1960 -1201
5750a201L383k085j625K880m76k553J937O43j879J069J614k557m88L383j962k745
$$ -1201 2182 97 -1528 1352 876 -1677 260 903 -976 93 1707 -850 -1338 2045 83 -2662
5766b662L226J649l665N63K477j901j567L137l38k133J612Q18k626J144J653k506
$$ -2662 564 2213 -1452 -889 1588 -313 -1880 1257 919 -1214 398 1216 -1410 -266 1387 -1119
5782a119r8L127j368l143K810J698l596N82L070j698j780K407m37k123K298M33
$$ -1119 -1217 1910 542 -2601 209 1907 -1689 -1107 1963 265 -1515 892 455 -1668 630 1063
5798A063k297J120K245l107p47L525j077k570K542J189l619P62K745j907j252
$$ 1063 -1234 -114 2131 -976 -1723 1802 725 -1845 697 1886 -1733 -971 1774 -133 -1385
5813a385K504l79j951J421Q32k425J391K099k887m23K992j184k876K465J744k649
$$ -1385 1119 740 -1211 210 1042 -1383 8 2107 -780 -1203 1789 605 -2271 194 1938 -711
5829g11j71K519j986j325K874o69j924J834P35k577J056K077k352p24L353q92
$$ -711 -882 1637 -349 -1674 1200 531 -1393 441 1176 -1401 -345 1732 -620 -1344 2009 1117
5845A117k947J855J618k885J60K466j567j014K564j017j794J852J048k896Q74
$$ 1117 -1830 25 1643 -1242 -1082 1384 -183 -1197 1367 350 -1444 408 1456 -1440 -566
5860e66K536k531r29K774n72k577K321J119k583kK609j678j125K235m58k109J977
$$ -566 1970 -561 -1490 1284 712 -1865 456 1575 -1008 -1010 1599 -79 -1204 1031 573 -1536 441
5877D41O57k779J030K802k507j323K934n74k422J996J193k703M41K378j787j443
$$ 441 1098 -1681 -651 2151 -356 -1679 1255 681 -1741 255 1448 -1255 -814 1564 -223 -1666
5893a666K579k56k565K407P83k607O23K134j741j493K939j79k646J754J318k864
$$ -1666 913 657 -1908 499 1282 -1325 -702 1432 -309 -1802 1137 958 -1688 66 1384 -1480
5909a480Q86K038j828j076K826o81k483K272J031l005J071K155k064j229K613
$$ -1480 -594 1444 -384 -1460 1366 685 -1798 474 1505 -1500 -429 1726 -338 -1567 1046
5924A046j54k711J989J209k414L24K105j818q13K310l09k390K021R66k423J32
$$ 1046 892 -1819 170 1379 -1035 -711 1394 -424 -1237 1073 764 -1626 395 1361 -1062 -930
5940i30K719j669j701K740l01k399J844J419k936N10K474k040p73K264l31k372
$$ -930 1789 120 -1581 1159 858 -1541 303 1722 -1214 -704 1770 -270 -1043 1221 890 -1482
5956a482K040J164k844O0K769j820j452K585k5k698J765J503k680M19K435j953
$$ -1482 558 1722 -1122 -1062 1707 -113 -1565 1020 995 -1703 62 1565 -1115 -696 1739 -214
5972b14j029K090l6k231J895J020k874O99K456j956j371K406j64k041J433J231
$$ -214 -1243 847 811 -1420 475 1495 -1379 -680 1776 -180 -1551 855 691 -1350 83 1314
5988A314k492N94K597k473q50K634m53k636K124J073k583N07K184j882r44K466
$$ 1314 -1178 -584 2013 -460 -1310 1324 871 -1765 359 1432 -1151 -644 1540 -342 -1286 1180
6004A180k53k474J795J177k399M45K324j622j610K602l94k400K043J185k672O6
$$ 1180 927 -1547 248 1425 -974 -529 1795 173 -1437 1165 771 -1629 414 1599 -1073 -1007
6020a007K756j754j447K441l9k423J720J048k742O00K402j777j433K683l14k708
$$ -1007 1749 -5 -1452 989 950 -1473 247 1295 -1447 -847 1555 -222 -1655 1028 714 -1994
6036a994K166J214k673L84K687k105j063K087P6k290J731J310k514L49K209j677
$$ -1994 172 1386 -1287 -903 1784 -321 -1384 703 779 -1511 220 1530 -984 -635 1574 -103
6052a03j392K855k91k670J674J400k647L60K173j217j716K480l74k056J535J366
$$ -103 -1495 1360 1069 -1601 73 1473 -1174 -814 1359 142 -1574 906 532 -1524 11 1377
6068A377k180R1K061j656j057K490q7k783J721J441k406J20K251j199j450K186
$$ 1377 -803 -712 1349 -307 -1364 1126 1039 -1744 -23 1418 -988 -868 1383 184 -1266 920
6084I20j31k289J453J406k644M83K592k172r45K335k91k410J867J461k381q3K346
$$ 920 789 -1500 -47 1359 -1285 -802 1790 -382 -1327 1008 717 -1693 174 1635 -746 -829 1517
6101A517j500j420K616m94j949J461J098k291K66K138j478j283K424p2k709J759
$$ 1517 17 -1403 1213 719 -1230 231 1329 -962 -696 1442 -36 -1319 1105 1033 -1676 83
6117H3J413k435j21K156q91j629K332N4k324J412R41k061Q35K169j898j750K713
$$ 83 1496 -939 -1060 1096 205 -1424 908 962 -1362 50 991 -1070 -235 1934 36 -1714 999
6134I99J68k410O66J999j968j97K021j427j139K146J63k144J117J116k285O33
$$ 999 1167 -1243 -577 1422 -546 -743 1278 -149 -1288 858 1021 -1123 -6 1110 -1175 -542
6150e42K308j771j219K353k74k562J441J501j777n15K458j193j689K175m26j700
$$ -542 1766 -5 -1224 1129 855 -1707 -266 1235 -542 -1057 1401 208 -1481 694 268 -1432
6166a432J646Q01j958L47K325k087j244K437N33k852J163K035k274o60K373p78
$$ -1432 214 1015 -943 -596 1729 -358 -1602 835 1368 -1484 -321 1714 -560 -1220 1153 375
6182C75j424J917k01k153J568J126k364O54J892j345j308J689N63k505J028K095
$$ 375 -1049 868 667 -1486 82 1208 -1156 -502 1390 45 -1263 426 989 -1516 -488 1607
6198A607k093n06K277j433q91J446J02j644J471O91k087q0K862j829j501K484
$$ 1607 -486 -992 1285 -148 -1039 407 509 -1135 336 1027 -1060 -1140 1722 -107 -1608 876
6214H76N09k322K99J848j909k9K050j127j038J418n8k025J733J340k566K61K506
$$ 876 1385 -937 -638 1210 -699 -728 1322 195 -843 575 517 -1508 225 1565 -1001 -740 1766
6231A766j670k143K538R65k486P51J685j601r07K029j080q58K222n84k114J776
$$ 1766 96 -2047 491 1456 -1030 -279 1406 -195 -1102 927 -153 -1011 1211 627 -1487 289
6247B89J138k790P6L199j424k124K362L34k146N17J887j486j67J378j175q59J685
$$ 289 1427 -1363 -1287 1912 488 -1636 726 1060 -1086 -569 1318 -168 -335 1043 -132 -991 694
6264F94l43k036K065J641l123j35K620p96k269K255J033k692L62J601j328l04
$$ 694 351 -1685 380 2021 -1102 -1237 1383 587 -1682 573 1606 -1086 -724 877 -451 -755
6280g55J649o31r09J714m43k414J962J577k906K64K681j238k270J872P40j522
$$ -755 894 263 -646 1068 625 -1789 173 1750 -1156 -892 1789 551 -1719 153 893 -629
6296f29M43J458j614k2J114r80o70J936j64k559J888J149k373n37K727n09j915
$$ -629 -186 1272 -342 -364 750 -230 -900 1036 872 -1687 201 1350 -1023 -1560 1167 658 -1257
6313a257J898N60k276N54Q72r17K07J464j334q79J999l41k231J884J764k389j011
$$ -1257 641 1201 -1075 -521 351 -566 -359 1105 -229 -1108 891 550 -1681 203 1967 -422 -1433
6330a433K747o79k342J932R08j677N32J114k000J51J562j108q81K425j73k861
$$ -1433 1314 635 -1707 225 1133 -544 -12 1102 -898 -747 815 -293 -1174 1251 1078 -1783
6346a783J465K143k617n81K940p44k062J260N71j187Q25Q70j577R7J584j415j360
$$ -1783 -318 1825 -792 -1373 1567 823 -1239 21 592 -595 230 1100 -477 -380 1204 -211 -1571
6363a571K573O3k349J202K047k527q45K603n65j538J155R17j694L17J112j533
$$ -1571 1002 1065 -1284 -82 1965 -562 -1407 1196 631 -907 248 1165 -529 -212 900 -633
6379f33J96K120j909j106K232K66l017J326K310j728j109J804k66j664J045Q36
$$ -633 -437 1683 -226 -1332 900 1166 -1851 -525 1785 57 -1052 752 486 -1178 -133 703
6395G03j295R03P87k092N78J899j544j573K431N69l062J090K174j884j290K554
$$ 703 -592 311 1098 -994 -416 1483 -61 -1634 797 1366 -1696 -606 1568 -316 -1606 948
6411I48k29j254O74M11j609Q48R98j597J81J939j550j535K235N10k598J219K130
$$ 948 719 -535 139 550 -1059 -211 787 -810 -629 1310 -240 -1775 460 970 -1628 -409 1721
6428A721j634j348K002k96j312J138O54j652J044N66k161L20K504j009k160K126
$$ 1721 87 -1261 741 445 -867 271 925 -727 317 883 -1278 -958 1546 537 -1623 503
6444E03P93k746M47K133j353q57J956o44j145J103J86j447J161J221j834q9K035
$$ 503 1296 -1450 -1003 1130 -223 -1080 876 232 -913 190 376 -1071 90 1311 -523 -612 1423
6461A423j454j903K456P77k335J06K346j488j122J916m94p20J097N7j760Q10J423
$$ 1423 -31 -1934 522 1299 -1036 -930 1416 -72 -1194 722 228 -492 605 662 -1098 -288 1135
6478A135j919J09K188j252j650J623J007k283L38K030j314r21J730n54j340J563
$$ 1135 -784 -675 1513 261 -1389 234 1241 -1042 -704 1326 12 -909 821 267 -1073 490
6494D90M06j692J071J001k085l23K584r79j872J748Q08k024J25K039j380p92J677
$$ 490 896 -796 275 1276 -809 -1132 1452 473 -1399 349 1157 -867 -742 1297 -83 -875 802
6511H02n51j482J857k4j708Q56J368j767m43K214p53j554J512J242k420L52J441
$$ 802 251 -1231 626 602 -1106 -250 1118 -649 -1092 1122 369 -1185 327 1569 -851 -499 942
6528I42j279k80J178l79j208J525L17j798O75J666k083m58K564j058j760J799
$$ 942 -337 -617 561 182 -1026 499 816 -982 -307 1359 -724 -1182 1382 324 -1436 363
6544C63N09j658N0J875j490p07J902n65j350J713J40j959J142J337j744p78K115
$$ 363 872 -786 -736 1139 -351 -1058 844 279 -1071 642 782 -1177 -35 1302 -442 -1220 895
6561H95k00j888J305R36k080N38J584j403p82J880m28j344J410L76j881N52J875
$$ 895 695 -1193 112 1048 -1032 -494 1090 -313 -1095 785 357 -987 423 799 -1082 -530 1345
6578A345j524j114K159r6k010J428R20j937N93J492j696n86K092o97j529J074
$$ 1345 -179 -1293 866 770 -1240 188 1108 -829 -236 1256 -440 -1026 1066 369 -1160 -86
6594h6J114j827L52J452j491k22J545r3j903J394Q44j753K6J580j051n99J635
$$ -86 1028 -799 -447 1005 -486 -708 837 744 -1159 235 1079 -674 -648 932 -119 -718 917
6611I17q03j578J899O12j955J85J722r81r43K078m01j965J528K19j046J84J293
$$ 917 114 -1464 435 1047 -908 -723 999 18 -925 1153 752 -1213 315 534 -512 -328 965
6628I65r99o29J367k38j479J409N08j978L72J650j125p58J803l79j574J231M07
$$ 965 -34 -663 704 466 -1013 396 904 -1074 -702 948 -177 -935 868 489 -1085 146 553
6645E53j700P02J381j129q50K016o20j355J249O70j676L5K422j935q27J640J33
$$ 553 -1147 -445 936 -193 -1043 973 353 -1002 247 917 -759 -724 1698 -237 -1064 576 709
6662G09j469R88P44j528N0J562j363n41J614k75j617J454P04j871N34J143j112
$$ 709 -760 228 972 -556 -506 1056 -307 -848 766 491 -1126 328 1032 -839 -305 838 -274
6679b74l95J590m85j846J455R61j649M29J232j410p61J754j02j439J007Q94j740
$$ -274 -669 921 436 -1410 45 1006 -643 -214 1018 -392 -1153 601 499 -940 67 961 -779
6696g79K87J567j414n32J646k86j566J171R48j636Q7J326p23j038J919o06j590
$$ -779 -492 1075 -339 -871 775 489 -1077 94 1042 -594 -507 819 96 -942 977 371 -1219
6713a219J515O11j650R5J794j354o56J661j89j253R60P11j676L6J646j247o44
$$ -1219 296 907 -743 -648 1146 -208 -864 797 608 -645 315 1026 -650 -614 1032 -215 -859
6730h59J595J82k041J012J145k133N79J665j096j213J825n1j635J035J188j990
$$ -859 736 918 -1123 -111 1034 -1099 -520 1145 49 -1164 661 610 -1025 10 1198 -792
6746g92P6J401p81q56K021l46j669J396L09j730L75J534r43r56J783k53j472J060
$$ -792 -716 685 -96 -952 1069 723 -946 450 759 -971 -596 938 -5 -961 822 569 -903 157
6764A57R75j604o5J605j242m58J380P6j816J235Q19j847q9J772r05r88J852n02
$$ 157 1132 -472 -537 1068 -174 -632 748 824 -992 243 1062 -785 -874 898 -7 -995 857 355
6782C55j188R97P73j601J29J630j119j137J603Q7j773J029J291j682K4J868j234
$$ 355 -833 164 937 -664 -535 1095 -24 -1161 442 529 -1244 -215 1076 -606 -582 1286 52
6799E2r52J314r7j266J223P25j588L0J777j695m82J464q8j479Q86J081j816K10
$$ 52 -900 414 317 -949 274 999 -589 -559 1218 -477 -959 505 417 -1062 -176 905 -911 -701
6817g01J599r40j067J471K88j533Q71O27j295k5J811j078j105J565K15k016J174
$$ -701 898 -42 -1109 362 650 -883 -12 615 -680 -705 1106 28 -1077 488 703 -1313 -139
6834a39J420j523m39J307o46o30J010l2j393J134O57j278j95J855j030q63J804
$$ -139 1281 -242 -681 626 -20 -650 360 328 -1065 69 726 -552 -747 1108 78 -785 1019
6851A019l56j666J124R82j783K66J178n34r67J159K9j301J017P18j429j34J868
$$ 1019 663 -1003 121 1103 -680 -414 764 230 -737 422 451 -850 167 885 -544 -678 1190
6868A190j087j216J670M70k083J050J239j841p2J178l58q11J113L0j264J111P03
$$ 1190 103 -1113 557 1027 -1056 -6 1233 -608 -680 498 140 -671 442 472 -792 319 1022
6885A022j872L17K148j315j658J882L13j830Q99P90j088k05J626j148j032J667
$$ 1022 -850 -533 1615 300 -1358 524 837 -993 -94 696 -392 -597 1029 -119 -1151 516
6901E16m1j308J149L04j436K23J663j198j212J702N45j960O36J072j041k27J439
$$ 516 475 -833 316 620 -816 -593 1070 -128 -1340 362 907 -1053 -417 655 -386 -613 826
6918H26r74q42J912o55j189R75J196k139K90J517p42j509J716K35j833R69J072
$$ 826 -148 -990 922 267 -922 53 1249 -890 -600 917 175 -1334 382 617 -1216 -247 825
6935H25j284j03R61p34l51J198l58j172J463Q36k071n21K277o09j399J714L05
$$ 825 -459 -562 399 -335 -686 512 154 -1018 445 1281 -790 -1311 966 357 -1042 672 977
6952I77j887O57Q79p26m61J199p38o57J234l57j549J587R79j721l91J798q44j144
$$ 977 -910 -253 626 -100 -561 638 -100 -757 477 120 -1429 158 1137 -584 -975 823 -21 -1165
6970a165J523M43j264K91Q73j625M02J281j018l30J386k62j552J157J313k109
$$ -1165 358 801 -463 -172 701 -924 -522 759 -259 -589 797 535 -1017 140 1453 -656
6986f56l95K128m32j833J535L85j505O23O57p32J89P00q53q21J690l09j372J191
$$ -656 -1051 1077 645 -1188 347 732 -773 -150 507 -225 -36 664 -189 -1010 680 371 -1001 190
7004A90R56j732n14J635m08r18Q18N75j160o3J143p95k04J091q28r33J943k3j985
$$ 190 1146 -586 -1100 535 127 -791 27 602 -558 -621 522 -273 -477 614 -214 -1147 796 773 -1212
7023a212J331J325j933m16J530k45j479R79Q11j260N43Q15j279k5J055j004l72
$$ -1212 119 1444 -489 -905 625 380 -1099 -120 691 -569 -26 789 -490 -515 540 -464 -836
7040h36J770j5j782O63J124j610l76K011m89j178Q26L37j060L07N76p91O71P67
$$ -836 934 919 -863 -200 924 -686 -1062 949 460 -718 108 445 -615 -308 268 -523 148 915
7058I15j224p74J558L88j797O00J832j534n15J138k33j270R57P39j274K61Q51
$$ 915 -309 -1083 475 863 -934 -334 1498 -36 -551 587 354 -916 41 780 -494 -233 618
7075F18j395K58J342j135n24J769K46k652J044J388j123p43J757m09j374J259
$$ 618 -777 -519 823 -312 -836 933 1179 -1473 -429 959 -164 -907 850 441 -933 326
7091C26n2j033J034L01j097k5J346r75j085K010o4j900Q80J494j442p89J860k48
$$ 326 274 -759 275 576 -521 -546 800 -175 -1260 750 686 -1214 -334 1160 -282 -1071 789 541
7109E41q84N87%p98O52P93j599J7J687p39j539J715K32j892Q14J514j164p08J554
$$ 541 -343 244 244 -554 98 891 -708 -691 996 257 -1282 433 665 -1227 -413 1101 -63 -771 783
7128G83o08p61N04M33o19N59K98j649L36J865q63j440J903L91j970L09J201q27
$$ 783 175 -586 -82 351 -268 291 589 -1060 -724 1141 278 -1162 741 1132 -838 -529 672 -155
7146a55m57J288o51n51P41K78j339R73R83j273m38J647j057j120J514P88j877
$$ -155 -612 676 25 -526 215 493 -846 127 1110 -163 -601 1046 -11 -1131 383 1171 -706
7163g06M16J095q90o33J347n33r51J247J42j367Q00P21j360k06J927p89j419J588
$$ -706 -290 805 -85 -718 629 96 -855 392 534 -833 -33 688 -672 -878 1049 260 -1159 429
7181D29J29j269J29J455j032m75J316r55m29J267j4j110O77Q16j308n56J661l80
$$ 429 558 -711 -582 873 -159 -634 682 -273 -702 565 551 -559 118 934 -374 -930 731 351
7199C51j560J460J30q18l03J402q54n80J415n08j046J392N3j511R63J034j439
$$ 351 -1209 251 381 -437 -740 662 -192 -772 643 135 -911 481 534 -977 -14 1020 -419
7216d19k26J831j032j278J036J059j640J46J039q14o37J432n23r47J163M10j171
$$ -419 -645 1186 154 -1124 -88 971 -669 -523 516 -298 -935 497 -26 -973 190 600 -571
7233e71O44R35j457k69J594n76j209R17J114j598K15J282j283k85J518o60r88
$$ -571 73 1008 -449 -718 876 300 -909 8 1122 -476 -261 1021 -262 -547 971 311 -677
7250f77J211K56j999J256J205j423n38J617o07j163R51O15j293N51P61r51l63
$$ -677 534 790 -1209 47 1252 -171 -709 908 301 -862 89 704 -589 -38 723 -228 -591
7267e91J313k79j335J309M1j058N39J136j696j94J710n70j347J085Q10j580N44
$$ -591 722 443 -892 417 458 -600 -61 1075 -621 -815 895 325 -1022 63 873 -707 -163
7284a63J277j420l27J216n79p95J133N10j429L16J297j394k24P98j71q78J331
$$ -163 1114 -306 -633 583 4 -791 342 852 -577 -261 1036 -358 -582 216 45 -833 498
7301D98L94j692L93R31o17m90J107j23j202J241K59j731N17J448j257n90J401
$$ 498 892 -800 -407 524 -93 -583 524 401 -801 440 699 -1032 -515 933 -324 -914 487
7318D87J58j406Q08O64j278K36J089j164j79J412o13j070J096O29j686O96P63
$$ 487 645 -761 47 711 -567 -331 758 -406 -585 827 214 -856 240 869 -817 -121 642
7335F42r27o51J907l18j301Q67J72q75L14J045j193o48J406j89j297J075J43p00
$$ 642 -285 -936 971 653 -648 219 391 -484 -170 875 -318 -966 440 251 -1046 29 172 -528
7353e28K20J371j348p76J912k56j403Q28N30j178Q16M97q67m83J293j0j669J247
$$ -528 -308 1063 -285 -1061 851 595 -808 20 550 -628 188 685 -182 -665 628 618 -1051 196
7371A96R35j465M40P21r79n48J433n79j011R86N63j060K63R14r63o10J392k76
$$ 196 1131 -334 106 827 -152 -700 733 154 -857 129 692 -368 -105 809 -154 -764 628 352
7389C52j424J240O76j561K54J518j221k44R93r6j150J053K87j153J50J131r76
$$ 352 -1072 168 844 -717 -463 1055 -166 -410 583 487 -663 390 677 -476 -326 805 -171
7406a71n78J503l78j445J169O32j565M52Q62l07j183J773n98r90J007O65j601
$$ -171 -749 754 376 -1069 100 732 -833 -381 481 174 -1009 764 166 -824 183 848 -753
7423g53M67J193j152p15J618k01j213O45O46j236K43J408j335k50J181l16j211
$$ -753 -286 907 -245 -960 658 457 -756 -111 535 -701 -458 950 -385 -635 546 230 -981
7440i81J215N20j604M13J307j543j34J295nj409J021N06j326M41J139j044p01
$$ -981 234 754 -850 -437 870 -673 -807 488 483 -926 95 601 -725 -284 855 -189 -890
7457h90J469j4j318Q10P53j212J77P59p63m41J365n06j208P85R40j237P9J332
$$ -890 579 565 -753 57 810 -402 -225 534 -229 -670 695 189 -1019 -234 706 -531 -452 880
7475H80p47q99J425k52j251R04N90r16J03J019j156p16J688j94j236R89N70j487
$$ 880 133 -766 659 407 -844 60 650 -266 -163 856 -300 -1016 672 478 -758 231 801 -686
7493f86O83R55r53m47J088l39j096Q86N88j042K22R41j122n5J055m79j108R56
$$ -686 -3 952 -1 -448 640 301 -795 91 679 -363 -141 800 -322 -377 678 199 -909 47
7511D7O75r72k30J241j093m14J635l57j046Q11M12j299M44J025q85n75J332k99
$$ 47 722 -250 -480 761 -332 -746 889 532 -514 297 709 -590 -146 879 -6 -581 751 452
7529D52j377R39P04j303O6J292o97r71J539n61j057J271M41j558K00J519j019
$$ 452 -925 14 718 -585 -519 773 76 -895 644 83 -974 297 738 -820 -620 899 -120
7546a20r16J676j83j289J121O18j162o08J476q43l65J132m28o83Q18O52j828P13
$$ -120 -1036 640 457 -832 289 907 -255 -863 613 -230 -595 537 109 -574 244 896 -932 -219
7564b19J352j201q62J311j35j034P39N67o65k43J148r52p54J513j79j018Q64L55
$$ -219 1133 -68 -930 381 246 -788 -49 518 -147 -390 758 -194 -948 565 386 -632 232 587
7582E87j305N17J186j012j020J659J1j203L34R79o83l91J025r55j97J064m64j072
$$ 587 -718 -201 985 -27 -1047 612 623 -580 -246 733 50 -341 684 -271 -468 596 132 -940
7600i40J218K92j062k3J247j034o37J523K62j829P40R39j101n6J044p29j97J433
$$ -940 278 570 -492 -515 732 -302 -939 584 846 -983 -243 696 -405 -461 583 -146 -343 1090
7618A090o80j492J447O52j721J60J379r65m56R48k23j457J322O28p10l53Q73l19
$$ 1090 410 -1082 365 1017 -704 -544 835 -130 -586 362 139 -1318 4 632 -78 -431 442 123
7636A23o04J073o77p62Q83J133j928J11J635p23j053J226K18j288M70J067j394
$$ 123 -481 592 -85 -847 36 1169 -759 -648 987 264 -789 437 655 -633 -163 904 -490
7653d90J18J251r51m34J099p24r69J050J083j681j69J741j059q83J183O62r72
$$ -490 -372 879 -72 -506 593 -131 -1100 -50 1033 -648 -817 924 -135 -1018 165 827 -145
7670a45K17N02q00L10L41q20n04J661q8j591R13Q81j685K16J289n54r05Q26N33
$$ -145 72 574 -226 84 425 -395 -899 762 674 -917 -4 877 -808 -592 697 143 -762 64 597
7689E97j150P0Q92p03J15O92j057j92J234o9j083P48Q93j623l10J678n93j061
$$ 597 -553 -483 409 -294 -179 513 -544 -736 498 429 -654 94 987 -636 -946 732 139 -922
7707i22J339K54j173M45R6n84J89R06r29m21J792l56j714Q61R81j045k09J282
$$ -922 417 671 -502 -57 39 -545 -356 550 -379 -800 992 636 -1078 -217 764 -281 -490 792
7725G92l52j243O87L36q61O85N38r58J24P03r05m28J729j59j683J112J088j580
$$ 792 440 -803 -116 220 -641 44 582 -376 -252 451 -454 -882 847 688 -995 117 1205 -375
7743c75n80J500j20r40Q34r6p27M85N15j090K77J382j258l48J301k02j693J209
$$ -375 -955 545 425 -515 319 223 -504 -19 496 -594 -317 1065 -193 -541 760 558 -1135 74
7761G4J103j361n77J103q2o28N99j76o26J116o6j171K97J281j032r05J653N5j573
$$ 74 1177 -184 -761 342 260 -368 231 55 -571 545 479 -692 -395 886 -146 -1051 602 657 -916
7780i16O64J294j370n40J582l22j027P37J64j051J022M24j399L11J115r57o89
$$ -916 -252 1042 -328 -868 714 392 -635 102 266 -785 237 661 -738 -427 688 -269 -958
7797i58J409M14j674Q15P53j135k92J270m41p03P03K26r60P68L2o78P8J444j179
$$ -958 451 865 -809 6 759 -376 -668 602 161 -542 161 387 -573 195 227 -451 -373 1071 -108
7816a08j007J740J72j451K68R46p05k82R94n93k85N10L53r58K83J077j427J99
$$ -108 -1115 625 797 -654 -386 560 -145 -427 567 -26 -311 199 552 -406 -123 954 -473 -274
7834b74J028j126p46J869K77j756M19J115q72j97M28Q8o59P71m0j066P57Q81j526
$$ -274 754 -372 -1118 751 1028 -728 -309 806 -66 -263 165 253 -406 365 325 -741 16 897 -629
7853f29m3J516m92j219R89N18j439Q72P89j058o84J212j39n39N43J95j159R43
$$ -629 -672 844 352 -867 122 640 -799 73 862 -196 -880 332 193 -346 197 392 -767 176
7871A76N28j238j37J620n21j342J131K21r38L47J049j327j95J509r31p00J176
$$ 176 704 -534 -671 949 428 -914 217 438 -500 -153 896 -431 -626 883 -48 -748 428
7888D28l1j354R06R59j518P3J439q97j167J456L57j267N03R49j247K88Q84p47
$$ 428 397 -957 -51 908 -610 -537 902 5 -1162 294 651 -616 -113 836 -411 -123 761 14
7906A4n23R26j19r40L33R97j212j93J745r70j152J383L93j242M72P47p69o9P30
$$ 14 -509 417 298 -642 -309 688 -524 -717 1028 58 -1094 289 682 -560 -88 659 -110 -179 551
7925E51l63r79J168M52j224N55L44j031l78J466n90p64Q07O33r57k29J587j339
$$ 551 188 -791 377 829 -395 160 504 -527 -905 561 -29 -793 14 647 -310 -539 1048 -291
7943b91J39R30n27j051J241J44j491Q53J132j451l46J222o29q56J232M94j294
$$ -291 -152 778 251 -800 441 585 -906 -53 1079 -372 -718 504 -125 -981 251 745 -549
7960e49L50R84j202r6J291r24n73R96K75j193J52J030q07m60J049l00p90J296
$$ -549 -199 785 -417 -513 778 -146 -719 277 552 -641 -489 541 -266 -726 323 23 -767 529
7978E29j28j252N44J252j441J90J088p30p82J372j3j447Q46P53r55l74R89J7j182
$$ 529 401 -851 -307 945 -496 -306 782 52 -730 642 629 -818 28 781 -174 -548 441 458 -724
7997g24J379j69j103N09P76j157M5J016l81j045J376K70j407N33Q69j138o02J627
$$ -724 655 486 -617 -108 668 -489 -444 572 191 -854 522 792 -615 -82 787 -351 -953 674
8015F74k57r87O33L15q23M60M05n83k28J230p45p28R73M95j368M73P66j185k04
$$ 674 417 -570 63 378 -445 15 420 -163 -391 839 94 -634 339 834 -534 -61 705 -480 -684
8034f84J369r9j380R02K41p16O08J65o76l64J491p68q43Q70O69j392L42R18j090
$$ -684 685 586 -794 108 349 -367 241 406 -270 -634 857 89 -754 116 785 -607 -265 653 -437
8053d37P4Q93l92q67J206M09j490K16J158r62l63J451q34p36J098J53j245j0J542
$$ -437 -363 530 138 -729 477 886 -604 -388 770 -192 -555 896 62 -674 424 577 -668 -678 864
8072H64j201O6Q23o30o70R07K54j174L38J297j051k29Q48l77r34J120M86j642
$$ 864 -337 -271 552 -78 -748 159 413 -761 -423 874 -177 -406 442 65 -869 251 737 -905
8090i05Q21R26p64q19R65O8p63P51L21j474O01J165j152n64J423l94j169J232
$$ -905 -84 842 78 -741 224 292 -471 280 601 -873 -272 893 -259 -823 600 206 -963 269
8108B69K61j348P50J132j054p67J182k9r85N73L52r53P67Q52j403j27J356o72
$$ 269 530 -818 -68 1064 10 -757 425 396 -589 -16 336 -617 150 1002 -401 -528 828 156
8126A56r37J017N06j345M19R65j118m92J497n59o75O40P44j254K93R46j193k34
$$ 156 -781 236 742 -603 -184 781 -337 -829 668 109 -566 74 818 -436 -143 803 -390 -624
8144f24R44j42r44O72Q04j310K19J103o45p81J429m93j069J186M13j408K79J006
$$ -624 320 178 -766 -94 710 -600 -381 722 77 -704 725 232 -837 349 762 -646 -367 639
8162F39q01l90J033o8j473J261P28j563K64J067p18n65J273m75j008J040L37j378
$$ 639 -162 -552 481 413 -1060 201 929 -634 -370 697 -21 -586 687 212 -796 244 581 -797
8180g97L76J184r63l75R85Q1j401J034Q17j451j
$$ -797 -421 763 -200 -575 410 491 -910 124 941 -510 -511
8191e11
$$ Imaginary data points
##PAGE= N=2
##DATA TABLE= (X++(I..I)), XYDATA
0@%%%%kKlJ1j6J6j9K7l2M0n3O1p2Q8j05J23j41J61j85K16k52K86l21L66m20M73
$$ 0 0 0 0 0 -2 0 -3 8 -8 8 -11 16 -16 24 -29 32 -40 48 -57 66 -75 86 -99 117 -135 151 -170 196 -224 249
30B49n31N96o64P44q30R21j024J137j264J402j549J714j897K101k332K587k874
$$ 249 -282 314 -350 394 -436 485 -539 598 -666 736 -813 901 -996 1105 -1227 1360 -1514
47a514L207l588M031m558N193n977O975q290J0108j2787J7125k5289M5621j79996
$$ -1514 1693 -1895 2136 -2422 2771 -3206 3769 -4521 5587 -7200 9925 -15364 30257 -149739
61a49739l03200N10044J72654k61568J4791J15038j51483K388P0566j27806O0024
$$ -149739 -452939 57105 229759 -31809 -17018 98020 -53463 -51075 19491 -108315 -48291
72d8291K46951j48376k03176J78977K5676k04634J84599J61252l41325n3159M51235
$$ -48291 198660 50284 -152892 26085 51761 -152873 31726 192978 -148347 -201506 249729
83B49729l5342m45171K9665K60834q475J5946K9158j70414j068J47329j71144
$$ 249729 214387 -230784 -201119 59715 51240 67186 96344 -74070 -75138 72191 -98953
94i8953q4903L57726O7990l58582P625J83154j98520j7148L70500n2487l69729
$$ -98953 -183856 173870 241860 -116722 -109097 74057 -124463 -141611 228889 176402 -193327
105a93327Q2305K28458r6459o7020L5148o2901J10452J59886k49753j73739L23069
$$ -193327 -111022 117436 20977 -46043 -10895 -73796 36656 196542 -53211 -226950 96119
116I6119O9076l52919P1188L34006j26929j86100J22163p6365j57012K61833K06446
$$ 96119 165195 -187724 -116536 217470 90541 -95559 26604 -49761 -206773 55060 261506
127B61506k26389j35790N8376m5296P9293J59391j72207j05472K93248k4677m06338
$$ 261506 35117 -100673 -42297 -87593 -8300 151091 -21116 -126588 166660 141983 -264355
138b64355J08987M04261j37032k62834J37872P0241r5946R3975K515j99513Q4262
$$ -264355 -155368 248893 111861 -150973 -13101 57140 -38806 55169 57684 -141829 -57567
149e7567K02355j10125o3365J09172j49825j17089K84845P0028k88928Q6581K55580
$$ -57567 144788 34663 -28702 80470 -69355 -186444 98401 168429 -120499 -33918 221662
160B21662k48581k44736K54324J81101j02621j7370o1090j45799J45468J74952
$$ 221662 -26919 -271655 -17331 163770 61149 43779 -17311 -163110 -17642 157310
170A57310j80715o8001J95946p7347j61580J90000N4951k52488P7455K48655j78284
$$ 157310 -23405 -91406 104540 27193 -134387 55613 110564 -141924 -64469 184186 5902
181E902j71768K26849O9995k04139j4115P0512l715J44117L5588l03551o0139
$$ 5902 -165866 60983 130978 -73161 -87276 -16764 -20479 123638 159226 -144325 -204464
192b04464L01837n416j92501J46688Q5253k34255J388J88942j10073p1768K17954
$$ -204464 97373 91957 -100544 46144 131397 -102858 -101470 87472 -22601 -94369 123585
203A23585j8546k40922M9349J39670m1446L6018O690k03584N1734L03046j12685
$$ 123585 105039 -135883 -86534 53136 11690 47708 54398 -149186 -97452 205594 92909
214I2909k98467J50852J84749j67685j9887J63456r7260r9602J30757m1201j28123
$$ 92909 -205558 -54706 130043 -37642 -57529 105927 8667 -90935 39822 -1379 -129502
225a29502J75331J18761j90015n7239P8609p9017O3148K17628j55388k59230J97977
$$ -129502 45829 164590 -25425 -82664 -4055 -83072 -19924 197704 42316 -216914 -18937
236a8937J83584k09346n5082J83031m9181r9243R4159l0471q0726J58742L1632
$$ -18937 164647 -44699 -99781 83250 34069 -65174 28985 -1486 -82212 76530 108162
247A08162k32080K6001K10348o6553q1701R5482j01671j26517K36771J33583k55780
$$ 108162 -123918 -97917 112431 45878 -35823 59659 -42012 -168529 68242 201825 -53955
258e3955o9136J86476m1168r7845J10061P659p8678R6806j7166j96809J03339
$$ -53955 -123091 63385 22217 -75628 34433 42092 -36586 60220 43054 -153755 -50416
269e0416K34682j34495j68381J16599J9010p8821J40340L4824k32383J5466K24637
$$ -50416 184266 49771 -118610 -2011 16999 -61822 78518 113342 -119041 -103575 121062
280A21062o8109j35574J05688J8314r8800P1622K2133j21549J10435J49450k21680
$$ 121062 52953 -82621 23067 41381 -57419 14203 36336 -85213 25222 174672 -47008
291d7008j55281K32471J04669j41084P609J4388j25975Q5401J75649j41247j30348
$$ -47008 -202289 30182 134851 -6233 1376 15764 -110211 -24810 150839 9592 -120756
302a20756J60691K8015j46480O0889Q1305r3786L8824P8806j76816m7593K62552
$$ -120756 39935 67950 -78530 -17641 63664 -30122 8702 87508 -89308 -136901 125651
313A25651J6723k46233J3889J29186m8778K8837P8248j49600p0036J88081J756
$$ 125651 142374 -103859 -89970 39216 -9562 19275 97523 -52077 -122113 65968 67724
324F7724j61672R1439J05218j39281k9363J04915o9633j3546J68193p2951k20642
$$ 67724 -93948 -2509 102709 -36572 -65935 38980 -30653 -44199 123994 51043 -169599
335a69599J09917J82520r4308n9887N7334q4224j6604J71575l4417j71269R7346
$$ -169599 -59682 122838 28530 -31357 25977 -58247 -74851 96724 62307 -108962 -11616
346a1616J08377j46235k7299J40860l9619o0865Q9113o5987j27133J68920J38775
$$ -11616 96761 -49474 -76773 64087 24468 -36397 52716 -13271 -140404 28516 167291
357A67291j86570r5013J21278r75k1478R9004o6606j40304J27531J02299j61171
$$ 167291 -19279 -114292 6986 6011 -15467 83537 16931 -123373 4158 106457 -54714
368e4714j6708J65707n4054j20444P3149J3000n3129J23754K7275k17696o733
$$ -54714 -71422 94285 40231 -80213 -7064 5936 -47193 76561 103836 -113860 -120593
379a20593K16808j7271j23525N1233q848p6141J14207O0716j59164P419J56407
$$ -120593 96215 78944 -44581 6652 -2196 -78337 35870 96586 -62578 -55159 101248
390A01248r1665j23572J30124O1861r5854L1554J3000j29276O6409J85766j04890
$$ 101248 9583 -113989 16135 77996 -17858 13696 26696 -102580 -36171 149595 44705
401D4705j60184R9664N7064p4705O5539M1828j39629J1683J39458q3932r1153
$$ 44705 -115479 -15815 41249 -33456 32083 73911 -65718 -54035 85423 1491 -89662
412h9662J43962L0481j47189K0916P4925o4660M3735J02736j42352j16776J67808
$$ -89662 54300 84781 -62408 -41492 33433 -31227 12508 115244 -27108 -143884 23924
423B3924P8716j21932N479M3606q9224L2788J21302r5210q6794J39840J4408j57035
$$ 23924 102640 -19292 -13813 29793 -59431 -26643 94659 -551 -87345 52495 66903 -90132
435i0132M2773J22690n7194k5590M3198j01552k7321J90780J2370j93891J1924
$$ -90132 -47359 75331 18137 -7453 35745 -65807 -93128 97652 110022 -83869 -71945
446g1945J16581m9249n763P5849q3805o1295J28428l713j38343Q1083J23111j15441
$$ -71945 44636 -4613 -10376 65473 -18332 -79627 48801 45088 -93255 -12172 110939 -4502
458d502p4621Q3200j0616r440J06468o1343j66792R8012J52783r9093o7989Q3198
$$ -4502 -79123 4077 -6539 -15979 90489 29146 -137646 -39634 113149 14056 -53933 29265
470B9265l8020n3325J03540q99j10811P7444Q0838j40356l9935J44744j212p4569
$$ 29265 -8755 -62080 41460 40561 -70250 7194 88032 -52324 -92259 52485 51273 -23296
482b3296M5909l7128r1338J30103J10865j58799p7905J27121K791o6232P0437
$$ -23296 22613 -14515 -105853 24250 135115 -23684 -101589 25532 28323 -37909 32528
493C2528j147r6720O5555O5480j18811k625J46865m6603j24188N8984L7055m6105
$$ 32528 31381 -65339 216 65696 -53115 -55740 91125 44522 -79666 -20682 16373 -29732
505b9732Q2585L4996j71857k3809J83199q41j21702L9143L1476o3106M4818M2165
$$ -29732 52853 87849 -84008 -107817 75382 74541 -47161 -8018 23458 -39648 5170 47335
517D7335r3512K4235J22507r4960j25173J20844Q6115r0127n003K6350q7966L6654
$$ 47335 -46177 -21942 100565 5605 -119568 1276 87391 -2736 -7739 18611 -69355 -32701
529c2701J50096p2603j48318P7441Q0487o4975J1810L9140p1705J2197Q2820r2472
$$ -32701 117395 44792 -103526 -26085 54402 -10573 1237 40377 -31328 -19131 63689 -28783
541b8783o5469J63108M4842j74218j9802J08436k1211l327O9029q1627r0013J15777
$$ -28783 -94252 68856 113698 -60520 -80322 28114 6903 3576 72605 -9022 -99035 16742
553A6742N8459j05100N701O5118o1281l705P7599o7517n2452J31907J025j71185
$$ 16742 75201 -29899 -24198 40920 -20361 -24066 53533 -13984 -66436 65471 66496 -104689
565a04689M1219J63083m8673r1596L1268k2063j6511J13318P476j32339J9722
$$ -104689 -63470 99613 50940 -40656 -9388 -31451 -47962 65356 72832 -59507 -39785
576c9785Q1929o5621j1217R3857m6691o7347R3112n204j35232P2241J51797r3545
$$ -39785 42144 -23477 -34694 59163 12472 -54875 38237 33033 -102199 -29958 121839 28294
588B8294j18650O9172M5598j9163L4185m2032q6905Q9332R3083j08081m3343J03780
$$ 28294 -90356 -21184 24414 5251 39436 -2596 -89501 -169 92914 -15167 -58510 45270
600D5270l4158q5520Q5983M0839r0610L9896P5883j20349o9935J38968O0451p5090
$$ 45270 11112 -74408 11575 52414 -38196 1700 77583 -42766 -112701 26267 86718 11628
612A1628k2368k4645k9865R9742M9183j33583j4789J42988m2077j26595Q0177
$$ 11628 -10740 -35385 -65250 34492 83675 -49908 -64697 78291 36214 -90381 -10204
623a0204P5095q7613k850O8116o0747k3618R9488k0888j02373L3580N0677j6545
$$ -10204 64891 -22722 -25572 42544 -18203 -41821 57667 36779 -65594 -32014 18663 2118
635B118M9987Q41j41123P522J63657l4328j23500Q7869P3160j22587l7509R0675
$$ 2118 52105 52946 -88177 -80655 83002 48674 -74826 13043 86203 -36384 -73893 16782
647A6782j784r812N3035n6550p9267P6400M7410o2890K2536L1098q9812K0744
$$ 16782 14998 5186 58221 1671 -77596 -1196 46214 -16676 5860 36958 -52854 -32110
659c2110J34219p3883j45668R9272J09422r7756l9025Q4924j2336m9542J4904
$$ -32110 102109 28226 -117442 -18170 91252 -6504 -45529 39395 27059 -22483 -7579
670g579k7526J589J15016k229j42933M594Q5116m4891L648J05373o2604j24096
$$ -7579 -35105 -33516 81500 79271 -63662 -59068 26048 -18843 -15195 90178 27574 -96522
682i6522Q9215Q1810j08071k6634J09348n89o5392K645j0920R485P8270m3308
$$ -96522 -7307 74503 -33568 -60202 49146 48557 -16835 -14190 -25110 -15625 62645 19337
694A9337j19115Q4956J30777r9929r3923Q2355N193o6628Q3236O2051j09188l7386
$$ 19337 -99778 -14822 115955 16026 -77897 4458 9651 -56977 26259 88310 -20878 -58264
706e8264P4960j8805l5474N7298J0746k5412K7662n4014r0124J13107J27239j25765
$$ -58264 16696 -2109 -37583 19715 30461 5049 32711 -21303 -111427 1680 128919 3154
718C154r9845J17620L3751r9472K2304N5588n6345L974O8887m1050m3308M5774
$$ 3154 -96691 20929 54680 -44792 -22488 33100 -23245 -19271 49616 8566 -34742 11032
730A1032j6976l8145O6877R613p0920O1951N6876j50827o1965J85105O6907j33870
$$ 11032 -5944 -44089 22788 32401 -38519 23432 80308 -70519 -132484 52621 119528 -14342
742a4342l1417M9993k6762M457M4507l2539j328O3270n2231p9038P3352M4058
$$ -14342 -45759 4234 -22528 -18071 26436 -6103 -7431 55839 3608 -75430 -2078 41980
754D1980p1719L0451O2725r7726l7850J39768N2j53566J6537J23758j089m4078
$$ 41980 -29739 712 63437 -34289 -72139 67629 67681 -85885 -69348 54410 53321 9243
766I243j4176m1831K0720P2864m7074n0787J05558K6210j45423j5410J13459j5440
$$ 9243 -4933 -46764 -26044 46820 -254 -51041 54517 80727 -64696 -80106 33353 17913
778A7913l2384P7715k6985j21462M0856J01970l7262m1917K6563q250J1173L6749
$$ 17913 -14471 63244 36259 -85203 -44347 57623 20361 -21556 5007 -3243 7930 44679
790D4679p1043n1302J18131L8852j34784L960J30599m1252j02109M4593L2579
$$ 44679 -26364 -77666 40465 79317 -55467 -51507 79092 37840 -64269 -19676 12903
801A2903l4860N4071L8991r3005m0583N6696N700J0767M9048n7660o4766Q6898
$$ 12903 -21957 32114 71105 -21900 -62483 -5787 -87 10680 59728 2068 -62698 24200
813B4200K2389j23299K9021J49645m8418j26310M3164N8839l0518Q870M329n4169
$$ 24200 46589 -76710 -47689 101956 53538 -72772 -29608 29231 -1287 7583 11912 -42257
825d2257L3118P3250n6153n3091N1812j1094l9918Q3671K7514j15134M504J04373
$$ -42257 -9139 64111 7958 -45133 6679 -4415 -44333 39338 66852 -48282 -43778 60595
837F0595o1626q8931R8849Q0679p1330n1826l909p215O5909N2853q8049m2469
$$ 60595 -1031 -89962 8887 89566 18236 -33590 -37499 -44714 21195 74048 -14001 -56470
849e6470R0043o950q5222N1762N7362p5267m300Q1550m7506o6567P6783L2839
$$ -56470 33573 26623 -58599 -6837 50525 -24742 -29042 52508 5002 -61565 15218 48057
861D8057q2188m646N6552j359R486k793q9224j79J30560k768j10062L4340O0776
$$ 48057 -34131 -38777 17775 16416 25902 23109 -66115 -66294 64266 61498 -48564 -14224 46552
874D6552p9007k1645Q8533p870m7009M6630o089p8085L0437O8115k8299j2927
$$ 46552 -32455 -54100 34433 26563 -20446 26184 20095 -57990 -27553 40562 12263 -664
886f64J6120n3572N907J01198l5163j18996N9309R8366o7030m4748O3892j2103
$$ -664 15456 -38116 -32209 68989 33826 -85170 -25861 72505 5475 -39273 24619 12516
898A2516m8393M1055Q404m0195M9251L1946q5642k2469O7701o294q171N8567m8854
$$ 12516 -35877 5178 13582 -26613 22638 54584 -31058 -53527 14174 7880 -291 58276 9422
911I422r7336P5525R1115q3402m7387Q1372K246n8075K1413J1120k4454M3602
$$ 9422 -87914 -12389 78726 -4676 -52063 29309 31555 -26520 -5107 6013 -18441 25161
923B5161J0350q4997J3905R6975l3206p0050M1435O712m4459O2867M7607j01105
$$ 25161 35511 -49486 -35581 61394 28188 -41862 -427 6285 -38174 24693 72300 -28805
935b8805l7583R1378M617n4293L3161J7878m2294J6047R048n5160L7965Q8010
$$ -28805 -66388 24990 29607 -24686 8475 26353 -15941 106 9154 -46006 -8041 79969
947G9969o5323q6551O5154M3790n1488J8813K9660o9411l683Q7194k0912o7909
$$ 79969 14646 -71905 -6751 37039 -14449 4364 34024 -35387 -39070 48124 27212 -40697
959d0697L9315K3530m5420K0052K8192m6445J6182N6625p1202n8825J03678M9804
$$ -40697 -1382 22148 -23272 -3220 24972 -21473 -5291 51334 -19868 -78693 24985 74789
971G4789q8988k0749L8491k6536J5041O2717m7087o2306O1479K5872o2851J6483
$$ 74789 -14199 -34948 3543 -22993 -7952 54765 7678 -54628 6851 32723 -30128 -13645
983a3645M6444m1526o228M2767m8658k8582R6889J1467j14467J832Q6575j1974
$$ -13645 32799 -8727 -14955 27812 -20846 -49428 47461 58928 -55539 -53707 32868 20894
995B0894k4701K1852l9694k4160P7397Q639p9959K4862N8080n5527k7565N9018
$$ 20894 -3807 18045 -21649 -45809 31588 40227 -39732 -14870 43210 -12317 -39882 19136
1007A9136q892k7077N1585j7979q7406M7263R2990m9450n8340L4435o20j2261
$$ 19136 10244 -16833 34752 16773 -70633 -23370 69620 20170 -38170 -3735 -4355 -16616
1019a6616N3227j2291p3744L7617O0511o2730k6477P2759n583n3646K8689M757
$$ -16616 36611 24320 -49424 -11807 48704 -14026 -40503 32256 26673 -26973 1716 6473
1031F473m4129N1093N2665q3074m6468P5559J8501l5896K2963j1048n4103M6041
$$ 6473 -37656 13437 66102 -16972 -63440 12119 30620 -5276 17687 6639 -47464 -1423
1043a423N3923o7286k3011P6588j4151o7885L5128L2972l2725K2021J8294p7061
$$ -1423 52500 -14786 -37797 38791 24640 -43245 -8117 24855 -7870 14151 32445 -44616
1055d4616l447J01367o624q0187J7090K5660k8928L2417K9826o8611j0337P8779
$$ -44616 -48063 53304 46680 -33507 -16417 9243 -19685 12732 42558 -26053 -36390 42389
1067D2389k5367o8121N4185M4696n5557r622K4058l4130J9644P3125n0584q3833
$$ 42389 17022 -51099 3086 47782 -7775 -17397 6661 -27469 -7825 65300 14716 -69117
1079f9117N7617N5119m6519l526K7263m4563j028O3669l0501n3205O3161K6950
$$ -69117 -11500 43619 -2900 -6426 20837 -23726 -24754 38915 8414 -44791 18370 45320
1091D5320p9232l045O1407j5736j1142L1980m6512m2892Q1822L8416q0841j2815
$$ 45320 -33912 -36957 24450 8714 -2428 29552 -16960 -59852 21970 60386 -20455 -33270
1103c3270M9199k3383q559M9272k7388m5757N4538J6079p2090J7635P0803l5682
$$ -33270 15929 -7454 -16013 33259 5871 -39886 14652 30731 -41359 -23724 47079 11397
1115A1397m1103L2643j1315j8595O5427L882r1807P715P6508k2187l0179L6716
$$ 11397 -29706 2937 -8378 -26973 38454 42336 -49471 -41756 34752 12565 -17614 19102
1127A9102j9171l7139N1572J4495o4188K4379O0889n5116m5516N8205J5281k9552
$$ 19102 -69 -37208 14364 28859 -35329 -10950 49939 -5177 -50693 7512 22793 -6759
1139f759K7666j2505o5564M2973P8274n3899n4352M9637P177l5037L5990J1438
$$ -6759 20907 8402 -57162 -14189 64085 10186 -44166 5471 12648 -22389 13601 25039
1151B5039n4840K2920M6984n9687k6032P9609O028o4120J2392J5846l1123M0181
$$ 25039 -29801 -6881 40103 -19584 -45616 33993 40021 -24099 -11707 4139 -26984 13197
1163A3197M4272p5944l9293P8627J3465n4607K2119J9771m5291J4543M0024m5630
$$ 13197 57469 -18475 -57768 20859 34324 -20283 1836 21607 -23684 -9141 30883 -14747
1175a4747j0894O8532k0488p2921L7684M7012l5229L714K2377n7700r238Q6224
$$ -14747 -25641 42891 22403 -50518 -12834 34178 -1051 2663 25040 -32660 -41898 44326
1187D4326l003p5291K0028L5352l6581P944L6592l8417j1569N5370k8214n9503
$$ 44326 41323 -33968 -13940 21412 -15169 -7225 29367 -9050 -20619 34751 6537 -52966
1199e2966N8230M8950o1495k0136L6332k2266O47O0739l0222p4399M3895N3549
$$ -52966 5264 54214 -7281 -27417 8915 -13351 -12704 48035 17813 -56586 -12691 40858
1211D0858m3503j0640L1921k9679j0282M8569k4366m2904O4583K6518q9130j2335
$$ 40858 -2645 -13285 18636 -11043 -21325 27244 2878 -40026 24557 51075 -38055 -50390
1223e0390P6367k740k9390K3309k5916l8722O1336L4134o7829q711N1657k3391
$$ -50390 25977 23237 -6153 17156 -8760 -47482 13854 47988 -19841 -28552 23105 -286
1235b86k2015M2339j4788l6753N1972J1744q0232J6159Q7828l1455o6008K7772
$$ -286 -22301 20038 5250 -31503 20469 32213 -48019 -31860 55968 24513 -41495 -13723
1247a3723J8215j3375L7273o24p0801J3684O3821l1603k8899N0723q055n0790
$$ -13723 4492 -8883 28390 27766 -43035 -29351 34470 2867 -26032 24691 16636 -34154
1259c4154L4727K1291n4944K2549O7543n1616o3251N2842L5940l0384M593l210
$$ -34154 573 21864 -33080 -10531 57012 5396 -57855 -5013 30927 543 5136 1926
1271A926l8887L6400N1713n8616l7743O4145L667n5046L3537L4467n0879j256
$$ 1926 -36961 -561 51152 -7464 -45207 18938 22605 -32441 1096 35563 -15316 -16572
1283a6572M4533m2115l0108P3438K1711o5300j0935J7604r884L6424K9219o9672
$$ -16572 27961 -14154 -44262 29176 50887 -14413 -25348 -7744 -17628 18796 48015 -21657
1295b1657k4098Q0037m532p5607L4110N6546m5837k1132L8107k0363j7106N0910
$$ -21657 -45755 34282 29750 -45857 -11747 44799 -1038 -22170 15937 -4426 -21532 29378
1307B9378q879o0756K8448M5604k8411n503J2147m8490M616Q6504j7046q5424
$$ 29378 20499 -40257 -11809 33795 5384 -119 12028 -36462 -31846 54658 37612 -47812
1319d7812L6388N5408n9963k6381O1688P041k5589J3320k5003l4806N6117L5303
$$ -47812 -11424 43984 -15979 -42360 19328 26369 780 14100 -10903 -45709 10408 45711
1331D5711n6394p886M0017l2221j3727N9879j9759o8918N0355N9997o2846l2772
$$ 45711 -10683 -18569 21448 -10773 -24500 35379 15620 -53298 -2943 57054 -5792 -38564
1343c8564N4106j699l4932J9808M676j0598M0020o864q0246J4248P9627k0261
$$ -38564 15542 13843 -21089 -1281 3395 -7203 32817 25953 -54293 -40045 39582 19321
1355A9321l6596M1748j4021o3185M1765N4995n1087k0166N5670j0661m6864J8006
$$ 19321 -17275 24473 10452 -52733 -10968 44027 -7060 -27226 28444 17783 -29081 -11075
1367a1075J2819p383L1849j0467o4023L4423P4459n7547o4996O1834L4162m5903
$$ -11075 1744 -5639 26210 15743 -48280 -13857 60602 3055 -61941 -107 34055 -11848
1379a1848J4968K8052n4474j5744N4822m117k5845L3245O78m1023J3135N800l3284
$$ -11848 3120 31172 -23302 -39046 15776 11659 -14186 19059 19737 -21286 -8151 -2351 -35635
1392c5635M6949O1063p6974o7523P6405L9788o4403O95M6243k3769j4906K7624
$$ -35635 11314 72377 -4597 -72120 4285 44073 -20330 -19635 26608 2839 -12067 15557
1404A5557k2584j9899M3247j419l8469L3487K0940n4206O107M7572m9438k9246
$$ 15557 -7027 -26926 16321 14902 -23567 9920 30860 -23346 -17239 30333 -19105 -48351
1416d8351R0948K3583r5176j9087N4478k350n367K5229k0424j7192L1916k1344
$$ -48351 42597 66180 -28996 -48083 6395 4045 -1322 23907 3483 -13709 18207 -3137
1428c137m2553N3518M1434n8337j1465M8341l5025l4924O7335J4303p4603R640
$$ -3137 -45690 7828 49262 -9075 -20540 27801 -7224 -42148 25187 39490 -35113 -25473
1440b5473O6412j9627l9807O181n394J1867M6681k4979n1820M4541K8106p5632
$$ -25473 40939 21312 -18495 -12314 -17708 -5841 40840 15861 -35959 8582 36688 -38944
1452c8944o779Q6586k846n3684K1081N76n1535L1477O1665l1570l5892K1119m495
$$ -38944 -45723 40863 38017 -15667 5414 5990 -45545 -14068 47597 16027 -19865 1254 -3241
1465c241p044K8119k1381l2105O0606K6959q6042j2956Q5652j2829o8572L1118
$$ -3241 -10285 17834 -3547 -35652 24954 51913 -34129 -47085 38567 25738 -42834 -11716
1477a1716M0780k6166K229J0091m6126l383N5722j583k1945K2145k2790m4440
$$ -11716 29064 2898 5127 15218 -30908 -34291 21431 19848 -2097 20048 -2742 -47182
1489d7182M8228L6963o1745Q22P7033l2784q2344L6663N6510k2861j0619P696
$$ -47182 1046 38009 -23736 -22914 54119 21335 -61009 -24346 32164 9303 -1316 6380
1501F380k5900J2549L7814l7480l2519N1891J0834m3770K7451K5119o3647q140
$$ 6380 -19520 -6971 30843 -6637 -39156 12735 23569 -20201 7250 32369 -31278 -39418
1513c9418P2766j5615n4417M4753L6703n5040k6896K5662Q227K5736K0109n9728
$$ -39418 33348 17733 -36684 8069 44772 -10268 -37164 -11502 -3275 22461 42570 -17158
1525a7158l2342O5854J1666o0016K3407M9834m5035k4733M7068j3585l9635M4393
$$ -17158 -49500 16354 28020 -31996 -8589 41245 -3790 -28523 18545 4960 -34675 9718
1537I718K5832n1317n053L8602j0906j0725Q658l1618L994P4247j1111q8803J8202
$$ 9718 35550 -15767 -20820 17782 6876 -3849 4809 -26809 -22815 51432 40321 -48482 -30280
1550c0280O4871l5835k7467N2668J661m2711J4669O756l2710K6969M1995l5291
$$ -30280 34591 -1244 -28711 23957 25618 -17093 -2424 4332 -28378 -1409 40586 5295
1562E295k4088K3661j6260o919N3424j2471o9402L5780O3889n1641m3736N1178
$$ 5295 -18793 4868 -11392 -18311 35113 22642 -46760 -10980 52909 1268 -42468 8710
1574H710J1567l5983J7085J3631k5859J6987J4788m8476k176O0641q502l6702
$$ 8710 20277 -15706 1379 15010 -10849 6138 20926 -27550 -29726 30915 22413 -14289
1586a4289K5665p164m9320M1385N8200n3297l9655N1674P081m3134J4653K1849
$$ -14289 11376 4212 -45108 -3723 54477 1180 -38475 13199 20280 -22854 -8201 13648
1598A3648j7381J3651O770m7097Q467O1712k5121n4273L7642K6993l7971J2716
$$ 13648 -3733 9918 16688 -30409 -21942 39770 14649 -39624 -1982 25011 -12960 -244
1610b44K9423m9816j8720O3032N108m7359J4544J8347k8184N989J8585k5662J2822
$$ -244 29179 -20637 -39357 23675 28783 -18576 -4032 14315 -13869 -7880 10705 -14957 -2135
1623b135M4686m4753n4262N7046M1498m8906q617L1520k6565j1016M5030j1232
$$ -2135 42551 -2202 -56464 582 42080 -6826 -15443 16077 -10488 -21504 23526 12294
1635A2294m1503K9510K1694l5755N771K6795k8567m040L6975k8775l2788O0024
$$ 12294 -29209 301 21995 -13760 -7989 18806 -9761 -13801 23174 -5601 -38389 21635
1647B1635K3641p0289j1198N0715p595j3579K8012j9472l4467L6740J8714m0304
$$ 21635 45276 -25013 -36211 14504 6909 -6670 21342 1870 -32597 4143 22857 -17447
1659a7447J0666L4013l3088j6580L7859j3835k6985M6866R685o5842O073O1189
$$ -17447 -6781 27232 -5856 -22436 15423 1588 -25397 21469 31154 -34688 -28615 32574
1671C2574j6142l3661J9149n246j5279L8918M819n1159J2405M2043l3628k0744
$$ 32574 16432 -17229 1920 -3326 -18605 20313 25132 -26027 -13622 28421 -5207 -25951
1683b5951M4892k128l4449K4665N561m4408K3964N4161l8275m3635L3375J3993
$$ -25951 18941 16813 -17636 7029 12590 -31818 -7854 46307 8032 -35603 -2228 11765
1695A1765j7324K0397k737m0941K2780M0632m1100k3297N1089k29m4813J8377
$$ 11765 -5559 14838 12101 -28840 -6060 34572 -6528 -29825 21264 21035 -23778 -5401
1707e401K1185k7268J4204K7745m5824k2537N5907J0946m0716Q090R639k6330
$$ -5401 15784 -11484 2720 30465 -15359 -37896 18011 28957 -11759 -3669 5970 -20360
1719b0360K1263L1852m2647j8278N0625n780m7900K5753L2677l0712l271J9225
$$ -20360 903 32755 -9892 -28170 22455 16675 -31225 -5472 27205 -3507 -6778 12447
1731A2447l1044k463N4745j0884n5325J9864L0801k3621N663K1243l6552j0414
$$ 12447 -18597 -21060 33685 22801 -32524 -12660 18141 -5480 183 21426 -15126 -25540
1743b5540M9428r519m5479L1460L0843m1949j0007L0200j2593k966L4093k6110
$$ -25540 23888 14369 -31110 350 31193 -10756 -20763 9437 -3156 -6122 27971 1861
1755A861m5418M2286L8386m0944j3228K6744j7649p198L7468j4257l7922L5550
$$ 1861 -43557 -1271 37115 -3829 -17057 9687 -7962 -15160 22308 8051 -29871 5679
1767E679K2738m9122m111M6592j0174k3050J8003j3440k0784M6240J8429n8701
$$ 5679 28417 -20705 -24816 21776 11602 -11448 6555 -6885 -27669 18571 37000 -21701
1779b1701q041M7214r171k0777K5240q349k8171L0997J4969m4520P912M6819k5600
$$ -21701 -29742 17472 8301 -12476 12764 4415 -23756 7241 22210 -22310 -14398 32421 6821
1792F821l5657K8620R586j7596K3723K399m9390J1351N3641k1662l4538K7244
$$ 6821 -28836 -216 9370 -8226 15497 17896 -31494 -20143 33498 11836 -22702 4542
1804D542L777k5898K3583J3731l7145Q940L7390l2975k8628M4636J2983l4606
$$ 4542 8319 -17579 6004 19735 -17410 -8470 28920 -4055 -32683 11953 24936 -9670
1816i670P697Q163k8377K0274M0216l7739l4908M0266J3199l1578J4531J4598
$$ -9670 -1973 6190 -22187 -1913 38303 564 -34344 5922 19121 -12457 2074 16672
1828A6672l1585O548L1830l0207j8537M7562J646m8058J0997K7672j8138O653
$$ 16672 -14913 -8365 23465 -6742 -25279 22283 23929 -24129 -13132 14540 -3598 3055
1840C055K1001l8721j8183N2934O786m5643J0894K4602k6022N98K7084k2574j3134
$$ 3055 24056 -14665 -32848 20086 26872 -18771 -7877 16725 -9297 -8699 18385 -4189 -17323
1853a7323L9016r800m5296K7585L7048l0726j3779K0653j7730n735M2731q115
$$ -17323 21693 11893 -33403 -5818 31230 504 -13275 7378 -10352 -16087 26644 18529
1865A8529m8676J9628L3017k7478o882K8010j6734j6108K9787p902l2128L2925
$$ 18529 -30147 -10519 22498 -4980 -11862 16148 -586 -16694 13093 5191 -26937 5988
1877E988K7191m5395j5042L7903m934j4594K4730j0916l6132K9048L1958l5471
$$ 5988 33179 -12216 -27258 10645 5711 -8883 15847 4931 -31201 -2153 29805 -5666
1889e666j1684L0203j3214j6812K9104l187k9310K7059J7508m6608k844N0320
$$ -5666 -17350 12853 -361 -17173 11931 8744 -20566 6493 24001 -22607 -25451 24869
1901B4869q467l2470J5407J370k0070K8957J8571m3349o528L8766j2241k2451
$$ 24869 16402 -16068 -661 709 -19361 9596 28167 -15182 -21710 17056 4815 -17636
1913a7636K7128J122k8588K1296J5625l9848N062M7856k1209m1758K5919K0309
$$ -17636 9492 10614 -17974 3322 18947 -20901 -15839 32017 10808 -30950 -5031 15278
1925A5278j7605R351L733l4807J0213M2045k1373k9275L1351N387l4077J6023
$$ 15278 -2327 7024 10757 -24050 -13837 28208 6835 -22440 8911 14298 -19779 -3756
1937c756K2674k8177J714L3949k7682l2758L8655K2939l1219l488J0785j6673
$$ -3756 18918 -9259 -7545 26404 -1278 -34036 4619 27558 -3661 -7149 3636 -13037
1949a3037J3062K7775l3056k4325M2859Q528m0377J2299K8141k7461r051K8835
$$ -13037 25 27800 -5256 -29581 13278 21806 -18571 -6272 21869 -5592 -14643 14192
1961A4192j3842j8875L5127O223m2623K450K7318q675L852J5156l3396j5715M7541
$$ 14192 350 -18525 16602 22825 -19798 -17348 9970 1295 5147 20303 -13093 -28808 18733
1974A8733L932m6824J5141L6926k8669j9377K7214k787j4937K4014l423l3675
$$ 18733 22665 -24159 -9018 27908 -761 -20138 7076 4289 -10648 13366 9943 -23732
1986b3732J8951K9424k5906j1780J9567j4725n266M0839r107n2208K0448M1936
$$ -23732 -4781 24643 -1263 -13043 6524 -8201 -13467 27372 18265 -33943 -13495 28441
1998B8441l0280k0845L4786L821k4421O198k640j3825L0929J7826m2808j0584
$$ 28441 -1839 -22684 12102 15923 -8498 -2300 -4940 -18765 12164 29990 -12818 -23402
2010b3402L5575q916j8797K8301j108l6762K2165L3621l7604k1439L8103N302
$$ -23402 12173 3257 -15540 12761 11653 -25109 -2944 30677 -6927 -28366 9737 15039
2022A5039k6346Q568Q143j0403J4262k33l8183J2592N1236j8977m0524K2977J1798
$$ 15039 -11307 -2739 5404 -4999 9263 9030 -29153 -16561 34675 15698 -24826 -1849 9949
2035I949k9552J5744L0691k7915j7479K9677m222k6687J7163J4443j2937Q006
$$ 9949 -19603 -3859 26832 -1083 -18562 11115 6893 -19794 -2631 11812 -1125 6881
2047F881N94l1254J4744M2358l0545l9576M0523K7607l7194o832K2464j7427p148
$$ 6881 7475 -23779 -9035 33323 2778 -36798 3725 31332 -5862 -12694 9770 -7657 -14805
2060a4805K9839l615k1531J5531J470k5071J2850J8537j8951Q159K7123l7896
$$ -14805 15034 11419 -10112 5419 6889 -18182 -5332 13205 -5746 2413 29536 -8360
2072h360l5075M9915L0135m3995j0131L1471q275j5724J3205n759p363K4789k076
$$ -8360 -43435 6480 36615 -7380 -17511 13960 5685 -10039 3166 -2593 -9956 14833 12757
2085A2757l0534J6491K0864l1231m464L4160j4904k3149L8086R883n3276m851
$$ 12757 -17777 -1286 19578 -11653 -16117 18043 3139 -20010 18076 27959 -25317 -30168
2097c0168M6151J318j8671O302p437r080J8557n947k1589L0715K3611m3573j7339
$$ -30168 15983 17301 -1370 4932 -2505 -11585 6972 1025 -20564 10151 33762 -9811 -27150
2110b7150L9238m982k6576K7837J4401l7727m7L3790j3320k3222J4283O076o06
$$ -27150 12088 7106 -19470 8367 22768 -14959 -15006 18784 5464 -17758 -3475 2601 1995
2123A995J6184j5251l0120K6003K4454l8024p177N0123n348m6670J0003K1369
$$ 1995 18179 2928 -27192 -1189 23265 -14759 -21936 28187 22839 -23831 -13828 7541
2135G541j7177Q020K5845k0245k1540J5506J109o556J8494m689k3771K4516J7998
$$ 7541 -9636 -1616 24229 3984 -17556 -2050 -941 -7497 10997 6308 -17463 7053 25051
2148B5051m5566j0442N3135q01m4646J4857K9069j9018j1769R498j0227L749K7942
$$ 25051 -20515 -30957 22178 21377 -23269 -8412 20657 1639 -10130 -632 -10859 -7110 20832
2161B0832j0266k3478J3826j259k2596K5709K6763l5441j3433L8941j0494m3735
$$ 20832 10566 -12912 914 -345 -22941 2768 29531 -5910 -19343 19598 9104 -34631
2173c4631K4502L9089j8550j9077O299n664N021J7839j8702j5244L3094O046l6020
$$ -34631 -10129 28960 10410 -8667 -2368 -8032 -3011 14828 -3874 -19118 13976 20022 -15998
2186a5998P476K5887k7482j0481M1062j811l7273J4492K2478k6713j0892K3712
$$ -15998 -8522 17365 -10117 -20598 20464 18653 -18620 -4128 18350 -8363 -19255 4457
2198D457O007r0K523k8558j2900M1835J0801l9789Q193L3061k5639k4639L0017
$$ 4457 10464 10374 12897 -15661 -28561 13274 24075 -15714 -7521 25540 -99 -24738 5279
2211E279O317k3713J5826J5779k6875n995K1081n392p513J1549j0292m745L2051
$$ 5279 11596 -12117 3709 19488 -7387 -13382 7699 2307 -5206 6343 -3949 -8694 23357
2224B3357p446m9359J3846M8562j7733k9008K4738O956k7339M674J4089j0749
$$ 23357 15911 -33448 -19602 28960 11227 -17781 6957 13913 -13426 -8752 5337 -5412
2236e412R275J6873k3777j5430K0827j617r307K4580k293l8092J5682L8061k9473
$$ -5412 3863 20736 -3041 -18471 2356 739 -8568 16012 13719 -24373 -8691 29370 -103
2249a03l0435L4059J8164k5902j608J0758j0432M582R317k0704J207L4181j0568
$$ -103 -30538 3521 21685 -4217 -5825 4933 -5499 -917 8400 -12304 -11097 23084 12516
2262A2516l2917J5109J2576k2246J4206L0014k9013k8209L0509J2230k6669N455
$$ 12516 -20401 -5292 7284 -14962 -756 29258 245 -27964 2545 14775 -11894 -6439
2274f439J8057r792k176L970j9475N035L3519j4492l3532K4233K2602k8596n077
$$ -6439 11618 1826 -350 3620 -15855 -10820 22699 8207 -25325 -1092 21510 -7086 -12163
2287a2163K3342j4632j3043L0100L282l1019M971J6834j2736J212J4093j2991
$$ -12163 11179 -3453 -16496 13604 16886 -14133 -9162 7672 -5064 -3852 10241 -2750
2299b750j645K1066j9975k7591L4782K7616l5141j4583K6012n602j3911J9608
$$ -2750 -4395 16671 -3304 -30895 3887 31503 -3638 -18221 7791 2189 -11722 7886
2311G886m04k0625J4537J3403k2409j148J9333j2387p577K2010r381k1608K7006
$$ 7886 7482 -13143 1394 14797 -7612 -8760 10573 -1814 -9391 12619 3238 -18370 8636
2324H636J4003l9710n713L9492j758k2488Q680m71j4006J6786J0874k2953L863
$$ 8636 22639 -17071 -22784 16708 14950 -7538 1142 671 -13335 3451 14325 -8628 -4765
2337d765K1112j8962j4917K5302J433k0735J7339J0321l2074R85L5674j0493k6272
$$ -4765 16347 -2615 -17532 7770 9203 -11532 5807 16128 -15946 -14961 20713 10220 -16052
2350a6052J4001R013j1577J0525L837k4415P248K5343j8044j5744K6787J542k7354
$$ -16052 -2051 6962 -4615 5910 9747 -14668 -7420 17923 -121 -15865 10922 12464 -14890
2363a4890J0172J5749j8989L240K5508j8886k4485K2535J2786j6466N498M567
$$ -14890 -4718 11031 -7958 -4718 20790 1904 -22581 -46 12740 -3726 1772 6339
2375F339j8659P425K3144k0830j5929K9575L186k9967R302J9944j6371l221J7299
$$ 6339 -12320 -4895 18249 -2581 -18510 11065 14251 -15716 -6414 13530 -2841 -6062 11237
2388A1237j5961j2335K8024M964k7944L790J5194j3067M026J7891k0265j3974
$$ 11237 -4724 -17059 10965 15929 -12015 -8225 6969 -6098 -2072 15819 -4446 -18420
2400a8420K9009J087k9328J2915K2921j9801r623J6240p347o625K3129m632k9528
$$ -18420 10589 11676 -17652 -4737 18184 -1617 -11240 5000 -2347 -8972 14157 9525 -20003
2413b0003J3489K2411j7834n111J6469j3357r999K5519r49k7562J3898K0522k3432
$$ -20003 -6514 15897 -1937 -7048 9421 -3936 -13935 11584 10635 -16927 -3029 17493 -5939
2426e939q833K3490l522j1551J4046n762k1467K0941K0639k6356j0688K2609n304
$$ -5939 -14772 8718 5196 -6355 7691 1929 -19538 1403 22042 -4314 -15002 7607 2303
2439B303j1654J8734k226k2832J5036J7217k4599n540K7307n614j9362J2522J807
$$ 2303 -9351 9383 7157 -15675 -639 16578 -8021 -13561 13746 8132 -11230 1292 3099
2452C099j3848J7550J1260l0730m959L1599l888k0210J3161K763j7288J3090J2729
$$ 3099 -10749 6801 18061 -12669 -17628 13971 10083 -10127 3034 5797 -11491 1599 14328
2465A4328k3484r74K7046j1725k2966J8544J1062j6154O117O454k2204M947K9936
$$ 14328 -9156 -10130 16916 5191 -17775 769 11831 -4323 1794 8248 -13956 -9009 20927
2478B0927j3310k5896J8198J0820j7908P032J1206j8825O24K2012j4408j9194
$$ 20927 7617 -18279 -81 10739 -7169 -137 11069 -7756 -7132 14880 472 -18722
2490a8722K5706R986k5322P62J4031j1628K882J9813j8910k0111K6267J1344k4142
$$ -18722 6984 16970 -8352 -7590 6441 -5187 -2305 17508 -1402 -21513 4754 16098 -8044
2503h044K837J5123j5125k292J9210j2359j4135K4946L358k9489O229K3375j1961
$$ -8044 -5207 9916 -5209 -7501 11709 -650 -14785 10161 13519 -15970 -9741 13634 1673
2516A673p585J3815j2642j1063K6950M615k9950N194K1210j3988o890J7654p961
$$ 1673 -5912 7903 -4739 -15802 11148 15763 -14187 -8993 12217 -1771 -8661 8993 1032
2529A032j2389J9292N3k5506J3401K3521j9782j4064J8111k182q739J7589j834
$$ 1032 -11357 7935 7988 -17518 -4117 19404 -378 -14442 3669 1487 -7252 10337 8503
2542H503k6702J1372K4232j8337j1049J9327l929j4469J5717J896j9462J3648
$$ 8503 -18199 -6827 17405 -932 -11981 7346 3417 -11052 4665 6561 -12901 747
2554G47J7135k5582j0322K7147Q37j7608R744J929j7411J3305J7912k2621r460
$$ 747 17882 -7700 -18022 9125 9962 -7646 2098 4027 -13384 -79 17833 -4788 -14248
2567a4248K3460l279j7621J5129N308j8504R093J3390k2015l644K9032n965k5229
$$ -14248 9212 5933 -11688 3441 8749 -9755 -662 12728 -9287 -12931 16101 10136 -15093
2580a5093J2059J1104j3858P797J1100k1815m264K5743o208j9239J6503P198k0385
$$ -15093 -3034 8070 -5788 2009 13109 -8706 -12970 12773 6565 -12674 3829 11027 -9358
2593i358N694J5489j7672l166K4572r945k4060J7862J5423j7980l01R849j4340
$$ -9358 -3664 11825 -5847 -9013 15559 5614 -18446 -584 14839 -3141 -3442 6407 -7933
2606g933J096K3022j1563k1207J9183R530k2177M615J9292j5412p606J9466q935
$$ -7933 -6837 16185 4622 -16585 2598 12128 -10049 -5434 13858 -1554 -9160 10306 1371
2619A371j7501K1022J2652k4077k497J4925q666p15J6214j3373j6309K3307Q880
$$ 1371 -16130 4892 17544 -6533 -9030 5895 -2771 -3486 12728 -645 -16954 6353 15233
2632A5233k7079L228K2649j4021j1572J8879k749j4604J5187M842k2972L887K1804
$$ 15233 -11846 -8618 14031 10 -11562 7317 4568 -10036 5151 9993 -12979 -9092 12712
2645A2712r906q550J2246j0317j1490K4766O043k9235N172K4597j6086j5501K0201
$$ 12712 2806 -5744 6502 -3815 -15305 9461 15504 -13731 -8559 16038 -48 -15549 4652
2658D652K899j4318J0003K616j8280Q585J8591j7342r772J9192l553j3487J8142
$$ 4652 7551 -6767 3236 5852 -12428 -3843 14748 -2594 -12366 6826 3273 -10214 7928
2671G928J930k7822Q903K8009j6489j6785J9459K934j7910O936P066j0331J0406
$$ 7928 9858 -17964 -9061 18948 2459 -14326 5133 8067 -9843 -2907 4159 -6172 4234
2684D234J0444k4548p345K7410j631j9613J4686P002k2884O005K1998j7778j3963
$$ 4234 14678 -9870 -17215 10195 8564 -11049 3637 10639 -12245 -6240 15758 -2020 -15983
2697a5983K3091M722j9841M784Q627j0591N978P916j8658J379K8582j1577k9293
$$ -15983 7108 11830 -8011 -3227 5400 -5191 787 8703 -9955 -8576 20006 8429 -20864
2710b0864J6058J8070j7653Q07J7754j4873j3348J9233J115j5859J1144J0143
$$ -20864 -4806 13264 -4389 -3582 14172 -701 -14049 5184 6299 -9560 1584 11727
2722A1727j4803L7Q097j4872L382K5847j3469k7409K2534J9465k6382q349K1434
$$ 11727 -3076 -3039 5058 -9814 -6432 19415 5946 -21463 1071 20536 -5846 -14195 7239
2735G239l222r490J3992l865j5741J1309P164j5892O651J6058j5667o781J8066
$$ 7239 4017 -5473 8519 4654 -11087 222 7386 -8506 -1855 14203 -1464 -8245 9821
2748I821j1165j9349K6677J8798l0381j0954K3006j667j2514R689J284p427J1878
$$ 9821 -1344 -20693 5984 24782 -5599 -16553 6453 4786 -7728 1961 3245 -4182 7696
2761G696r43k1583R345K0297j7124r247K2965l880k2204J5685J2029k5381j165
$$ 7696 6753 -14830 -5485 14812 -2312 -11559 11406 7526 -14678 1007 13036 -12345 -13510
2774a3510K9047l413k0583M572J919m854J3023R43j7031J1295J5792k6199j3010
$$ -13510 15537 12124 -8459 -3887 -1968 -6822 6201 7144 -9887 1408 17200 -8999 -22009
2787b2009L0908N198k3353Q747J1856k0143k801K1513o486j3477J2705M112j1008
$$ -22009 8899 14097 -9256 -509 11347 -8796 -11597 9916 3430 -10047 2658 6770 -4238
2800d238O432j451j5847J4876J9049k2976j2226K9325j096l1196R113K3600j0098
$$ -4238 2194 743 -15104 -228 18821 -4155 -16381 12944 11848 -19348 -10235 13365 3267
2813C267o294J1034j0657j0684J5336L215r887J1389J198j9685P435J7134k0131
$$ 3267 -3027 8007 -2650 -13334 2002 5217 -4670 6719 7917 -11768 -4333 12801 -7330
2826g330q220L1411K62l1978O539K2343j3172q921J2857j735l310J1246r228j5861
$$ -7330 -15550 15861 16123 -15855 -9316 13027 -145 -9066 3791 2056 -1254 9992 764 -15097
2840a5097J5334R309j6983O889J8553k1324j5387K5156L595k3537J1808K1390
$$ -15097 237 9546 -7437 -548 18005 -3319 -18706 6450 10045 -13492 -1684 19706
2852A9706j7764j4772J0961J162j38J1190r128j2843J7979N649k5868M063K5142
$$ 19706 1942 -12830 -1869 -707 -845 10345 1217 -11626 6353 12002 -13866 -9803 15339
2865A5339j2541j5024K1103K275k4774O444J8105j2289n727J5467k643r436N110
$$ 15339 2798 -12226 8877 11152 -13622 -7178 10927 -1362 -7089 8378 5735 -3701 1409
2878A409p750o188K4388O372k9369j04K4753j3154j7862K2337R549j9512J599
$$ 1409 -6341 -12529 11859 18231 -11138 -11242 13511 357 -17505 4832 14381 -5131 -3532
2891c532J1117j3981k381J6032l943p795J0676m772j2217J5968M278k5239O838
$$ -3532 7585 -6396 -8777 7255 3312 -4483 6193 1421 -10796 5172 9450 -15789 -8951
2904h951L0397j3978k5023J6294J0126j7038L426J3373q488j781Q599j2655p033
$$ -8951 21446 7468 -17555 -1261 8865 -8173 -4747 8626 138 -1643 6956 -5699 -12732
2917a2732J9323J220j5125J1727N311k4076L973K6399j2641j9919K0284J0950
$$ -12732 6591 7811 -7314 4413 9724 -14352 -10379 16020 3379 -16540 3744 14694
2929A4694k0574k733J1691n614J426R621j2067m845J9373n449k2975J4649J6716
$$ 14694 -5880 -8613 3078 -2536 -1110 8511 -3556 -8401 10972 5523 -17452 -2803 13913
2942A3913j7043k148J8032j3914j7323K0909J1158j8569O54J2566r925l757Q747
$$ 13913 -3130 -5278 12754 -1160 -18483 2426 13584 -4985 -4331 8235 -1690 -5447 3300
2955C300p922r93K0283q029k3999J4647J8193j9399p569K0506m218j3829J4194
$$ 3300 -4622 -5615 14668 6639 -17360 -2713 15480 -3919 -11488 9018 4800 -9029 5165
2968E165L154j9196N227J5142r718k753J0541r440o748J5722m361j7386J8512
$$ 5165 8319 -10877 -5650 9492 -226 -2979 7562 -1878 -8626 7096 2735 -14651 3861
2981C861J6932k5859j1531K2461L84j3272J0430L666j4259O485R534j4820j043
$$ 3861 20793 -5066 -16597 5864 6248 -7024 3406 7072 -7187 -702 8832 -5988 -7031
2994g031J7218p996j0159J4296j138j7747J3238J3857k1882n199K5212k626k0195
$$ -7031 10187 2191 -7968 6328 5190 -12557 681 14538 -7344 -12543 12669 10043 -10152
3007a0152O771P196q432P327O701j6071J34J7075j1188j2340J8722M786j8571
$$ -10152 -3381 3815 -4617 2710 9411 -6660 -6526 10549 -639 -12979 5743 10529 -8042
3020h042O044J1557j7264k081K2488o157j8863J1719Q574j1669K217O703j2628
$$ -8042 -1998 9559 -7705 -9786 12702 6545 -12318 -599 7975 -3694 -1477 5226 -7402
3033g402L555J6803j2663j4226J9244M875k0769N453J6070j2261n238J4859q293
$$ -7402 -3847 12956 293 -13933 5311 10186 -10583 -5130 10940 -1321 -6559 8300 7
3046Gj3525J6350P977j6043J834Q686j1208J044J5428j0941j2012J9045L833k2107
$$ 7 -13518 2832 10809 -5234 -3400 5286 -5922 -4878 10550 -391 -12403 6642 10475 -11632
3060a1632N205J8190j2302p690J3556m180r971J4445K484j8403N516J4085j1136
$$ -11632 -6427 11763 -539 -8229 5327 1147 -8824 5621 8105 -10298 -4782 9303 -1833
3073a833l142J3297q960j1004J6948M330j9960O104J6943j4069r230J5226j577
$$ -1833 -4975 8322 -638 -11642 5306 9636 -10324 -4220 12723 -1346 -10576 4650 3073
3086C073r155J1282K31j6640Q429J5379j4957n933J5477m847j1666J4436L571
$$ 3073 -6082 5200 5431 -11209 -2780 12599 -2358 -8291 7186 2339 -9327 5109 8680
3099H680j8676O601J5196j4104p738J7120j493j2773R119K440j2852R339J1921
$$ 8680 -9996 -3395 11801 -2303 -10041 7079 5586 -7187 1932 4372 -8480 859 12780
3112A2780j7230o473J8669k674j3496J1536M120j5539N649J3401j3961n427J7249
$$ 12780 -4450 -10923 7746 5072 -8424 3112 7232 -8307 -2658 10743 -3218 -8645 8604
3125H604l337j5037J0701O003j2605N810R635j6147l372K0142m017j6112R702
$$ 8604 5267 -9770 931 6934 -5671 139 9774 -6373 -9745 10397 6380 -9732 -30
3138c0P134j3311M244J1476j2882m273J6561n349j4884J2740Q176j4720J840R989
$$ -30 7104 -6207 -1963 9513 -3369 -7642 8919 3570 -11314 1426 9602 -5118 -3278 6711
3152F711j1807j539J7787o809j6755J2372R452j4212J166J1248j0814l757J5189
$$ 6711 -5096 -6635 11152 4343 -12412 -40 9412 -4800 -3634 7614 -3200 -6957 8232
3165H232o250j3096J4449O716j7472J267J3694q237m656J2960p256j2649J5295
$$ 8232 1982 -11114 3335 10051 -7421 -6154 7540 -697 -5353 7607 351 -12298 2997
3178B997Q265j7837L10J3941q883n476J3188m932j1290J3585M804j8318L655J6455
$$ 2997 11262 -6575 -6265 7676 -1207 -6683 6505 1573 -9717 3868 8672 -9646 -5991 10464
3192A0464r414q828J1914k943r362J3421L589j8341L138J6260r615p970J2668
$$ 10464 1050 -7778 4136 1193 -8169 5252 8841 -9500 -6362 9898 283 -7687 4981
3205D981k103j0881J1071L627j5477N452J5160j2465j0024J4891P16j0715Q626
$$ 4981 2878 -8003 3068 6695 -8782 -3330 11830 -635 -10659 4232 4948 -5767 2859
3218B859K809j5123N901J5404j2408r100J4609j95j2100Q906M890j3044M709J2186
$$ 2859 5668 -9455 -3554 11850 -558 -9658 4951 4756 -7344 1562 6452 -6592 -1883 10303
3232A0303j3662p287J8154p5j5218O987O035j0941M643J1445j3567o785J6815
$$ 10303 -3359 -10646 7508 7433 -7785 -798 5237 -5704 -1061 10384 -3183 -9968 6847
3245F847o45j4748Q669P458j2554K386J0864j1283m704J6651l061j6599Q760J0373
$$ 6847 6202 -8546 123 7581 -4973 -2587 8277 -3006 -7710 8941 5880 -10719 -1959 8414
3259H414j1061L59Q808j0456l561J5936l291j4874J0468Q343j4228J91J2279q240
$$ 8414 -2647 -2288 6520 -3936 -7497 8439 5148 -9726 742 9085 -5143 -4952 7327 -913
3273i13n412J3605m057j4397J1482J0441j4342k296J1292o731l710J2791n207
$$ -913 -6325 7280 3223 -11174 308 10749 -3593 -5889 5403 -1328 -5038 7753 2546
3286B546j3300J1968Q311j5656M70J4324q291q445J2491j283j1258J0172P074
$$ 2546 -10754 1214 9525 -6131 -5661 8663 372 -8073 4418 3135 -8123 2049 9123
3299I123j5180q57J3588n849o047J0266l494j0821J1747O714j6449M85J6195q303
$$ 9123 -6057 -6914 6674 825 -5222 5044 1550 -9271 2476 9190 -7259 -6774 9421 1118
3313A118r864J2162J266j1208P138N704j3122K657J3401q747q468J1370p91j0204
$$ 1118 -8746 3416 4682 -6526 612 6316 -6806 -4149 9252 505 -7963 3407 2616 -7588
3327g588J0882N611j6054P68J5719q799j0242J3336L144j2432M727N814j0161
$$ -7588 3294 8905 -7149 -6381 9338 539 -9703 3633 6777 -5655 -928 4886 -5275
3340e275K704J1574j0408p260J4017n05j2249Q180O461j3728J816J5050q966j1425
$$ -5275 -2571 9003 -1405 -8665 5352 4847 -7402 778 7239 -6489 -4673 10377 1411 -10014
3354a0014J2913K876j1886M880P423q772J423Q030j1000m654J6677j238j4754
$$ -10014 2899 5775 -6111 -1231 6192 -2580 -1157 6873 -4127 -8781 7896 6658 -8096
3367h096P472Q490j3065l15J4177p613r415J2838J881j2797M109P853q058J078
$$ -8096 -624 7866 -5199 -5514 8663 1050 -8365 4473 6354 -6443 -2334 5519 -2539 -1461
3381a461Q019r137l700J4547l737j6365J0260J2900j2660m344J1635n319q952
$$ -1461 6558 -2579 -6279 8268 4531 -11834 -1574 11326 -1334 -5678 5957 638 -8314
3394h314J1651K309j0695N164O205j0452m10R684o835l003J3328m208j6401J0758
$$ -8314 3337 5646 -5049 115 6320 -4132 -4542 5142 -1693 -4696 8632 4424 -11977 -1219
3408a219J2449j4556n184J4340j253r367O702L2q819P260O247j0530J080J0624
$$ -1219 11230 -3326 -8510 5830 4577 -4790 1912 1944 -6875 385 6632 -3898 -2818 7806
3422G806r510o813J2827o17j2614J0951R783j6614o231J5520k36r122O254J890
$$ 7806 -1704 -8517 4310 3693 -8921 2030 11813 -4801 -11032 4488 4252 -4870 1384 3274
3436C274p309N208K477j1601M594J3674r779r201J3258N11j3954O646J0499j1574
$$ 3274 -4035 1173 3650 -7951 -3357 10317 538 -8663 4595 5106 -8848 -2202 8297 -3277
3450c277k861J4023l754j2607O232M360m245N524J519j1400L613J1074j1534p592
$$ -3277 -6138 7885 4131 -8476 -2244 2116 -2129 3395 4914 -6486 -2873 8201 -3333 -10925
3464a0925J7611L878j6798J762J0159q882k775J2323k708q792P190J653q649L810
$$ -10925 6686 10564 -6234 -4472 5687 -3195 -5970 6353 3645 -5147 2043 3696 -4953 -1143
3478a143M610p957M671J0683j2600r842J5891L220j6391M587J4980p837p825O460
$$ -1143 3467 -4490 181 10864 -1736 -11578 4313 7533 -8858 -4271 10709 2872 -4953 1507
3492A507k776m125R861J247r442M815L519j1460K271J3153p845q034J4440Q34
$$ 1507 -1269 -5394 4467 5714 -3728 1087 4606 -6854 -4583 8570 725 -7309 7131 7965
3506G965j8206L355J5021o192p080P999J9n028M235k765p516J0851P025j2941
$$ 7965 -10241 -6886 8135 1943 -5137 2862 2881 -2147 2088 -677 -8193 2658 9683 -3258
3520c258j352J2221q333j0134J4223N288j3644K547J0739r390p524R390K274l081
$$ -3258 -4610 7611 -722 -10856 3367 8655 -4989 -2442 8297 -1093 -8617 773 3047 -34
3534c4M560l760q371Q644N773j3923J181J6730o233j4061R711N346j2034K559
$$ -34 4526 766 -7605 1039 6812 -7111 -5930 10800 4567 -9494 217 5563 -6471 -3912
3548c912J1122o078m804P262l539n879O724Q46n920Q989L762j6756j047J6633
$$ -3912 7210 1132 -3672 3590 51 -5828 896 1742 -4178 4811 8573 -8183 -9230 7403
3562G403m049j2063J1221O809j3053k358Q262l886j441Q418l294o242O931j450
$$ 7403 3354 -8709 2512 9321 -3732 -6090 2172 -1714 -3155 5263 1969 -4273 2658 1208
3576A208q803Q036P520j2458k64J4405o822j4548R820R549r372q80P847n433l667
$$ 1208 -7595 441 7961 -4497 -4761 9644 2822 -11726 -1906 7643 -1729 -2609 5238 -195 -3862
3591c862N575l900k811J1419j6j2498M647P514j1985p95J5967l982j2945P922
$$ -3862 1713 -2187 -4998 6421 6405 -6093 -1446 6068 -5917 -6712 9255 5273 -7672 250
3605B50O460j1213r72R201j944k053M692o287m454J0490m48j1568P843J0996j2024
$$ 250 6710 -4503 -5475 3726 1782 -271 4421 -1866 -6320 4170 3722 -7846 -3 10993 -1031
3620a031o565J1797k498r546R407P265j0724j705O655m761j628O982l237l431
$$ -1031 -7596 4201 1703 -7843 1564 8829 -1895 -3600 3055 -1706 -3334 3648 411 -3020
3634c020R569l043j3647P363J2594j0608n934J1932k77j1114N223M691p753K274
$$ -3020 6549 3506 -10141 -2778 9816 -792 -6726 5206 4929 -6185 -962 3729 -4024 -1750
3648a750P939o095l623O690m207n008J0565N23j1363O131R374j2449p290J4596
$$ -1750 6189 94 -3529 3161 -1046 -6054 4511 5034 -6329 -198 9176 -3273 -10563 4033
3662D033K457r992L280L808p370J675N815o191o12R449m660q508Q485J961j0270
$$ 4033 6490 -3502 -222 3586 -3784 -2109 3706 -2485 -3097 6352 1692 -6816 1669 3630 -6640
3677f640N268J0114j0202o019J2654o51j1465M313P012m823P76L461q067j32J0227
$$ -6640 -1372 8742 -1460 -7479 5175 4524 -6941 -2628 4384 -439 337 3798 -4269 -4401 5826
3692E826m846q099J0468L575j2325J191R533p162l791J1350j524j0772N022N862
$$ 5826 980 -7119 3349 6924 -5401 -4210 5323 -1839 -5630 5720 4196 -6576 -1554 4308
3706D308o858M32N764n502n34Q741o475q753J1060N020j1834M42J0886o280o480
$$ 4308 -2550 -2118 3646 -1856 -2390 6351 -124 -8877 2183 7203 -4631 -4189 6697 417 -6063
3721f063Q611o63p045O874M308r818O06O889n315j630Q925m713p983R723L473
$$ -6063 2548 1885 -5160 1714 6022 -3796 -3190 3699 -1616 -3246 5679 966 -7017 2706 6179
3736F179j2404J522J1911n457o770P182J29o704N622K966q844L168P916o985m570
$$ 6179 -6225 -4703 7208 1751 -5019 2163 2292 -4412 1210 4176 -4668 -1500 6416 -569 -5139
3751e139Q907k274p220Q158M067j1188J259J0258o798o619R386J670p783M169
$$ -5139 3768 1494 -5726 2432 6499 -4689 -3430 6828 30 -6589 2797 4467 -3316 853
3765H53K326p901L640Q258q462m439J0437j469r046O296M951r379J388R008o958
$$ 853 3179 -4722 -1082 7176 -1286 -5725 4712 3243 -5803 493 5444 -3935 -2547 6461 -497
3780d97n174R002L47q341M474M078p117K443O354q216l606J1053j017r654N690
$$ -497 -5671 3331 3678 -4663 -189 3889 -3228 -785 5569 -2647 -6253 4800 3783 -5871 -181
3795a81N495q775M28P912n468m323Q706q38q806N432N148p777J144O732o579l242
$$ -181 5314 -3461 -3033 4879 -589 -4912 3794 2956 -5850 -418 4730 -3047 -1903 4829 -1750 -4992
3811d992R788j461r971O475N635q369m19P959m955m381P807l58q462O344M850
$$ -4992 4796 3335 -6636 -161 5474 -2895 -3314 4645 -310 -4691 3116 2758 -5704 640 5490
3826E490r097K88P887n136m125Q832j546r147O249O383r032q27Q244m608m470
$$ 5490 -3607 -3319 4568 -568 -4693 4139 2593 -6554 -305 6078 -2954 -3781 4463 -145 -4615
3841d615P930r95p461N710M907r447L91Q873m926n470Q095o12q051O569N132r215
$$ -4615 3315 2320 -5141 569 5476 -3971 -3580 5293 367 -5103 2992 2380 -5671 898 6030 -3185
3857c185q45Q846m309m900P478n84p458N714M204q386J81R066n222n810P574N03
$$ -3185 -4030 4816 507 -4393 3085 2501 -4957 757 4961 -3425 -3244 5822 600 -5210 2364 2867
3873B867p217N321L864q654K21R336m797n823P335R03p638M657M391q395O43Q854
$$ 2867 -4350 971 4835 -3819 -3598 5738 941 -4882 2453 3356 -4282 375 4766 -3629 -2986 5868
3889E868n643n815Q165J211p557L496M655p649Q98Q198n673n785Q269J195p970
$$ 5868 225 -5590 2575 3786 -3771 -275 4380 -3269 -2371 5827 154 -5631 2638 3833 -4137
3904d137L743M955p480L31P911n602n578R233P21q577K918N979o499l35P246n775
$$ -4137 -394 4561 -2919 -2588 5323 -279 -5857 3376 4097 -4480 -1562 4417 -2082 -2417 4829 -946
3920i46m737R233N17q969L874N685o886p15P254m680m410Q390l21r103M247O967
$$ -946 -5683 3550 4067 -4902 -1028 4657 -2229 -2944 4310 -370 -4780 3610 3289 -5814 -1567 5400
$$ [...]
8191E16
##END NTUPLES=NMR FID
##END=
