##TITLE=1H_Pr AMPD
 200.13MHz,D2O,
 8 sc
 
 26.8.2025
##JCAMPDX= 6.0         $$ Bruker NMR JCAMP-DX V2.0
##DATA TYPE= NMR FID
##DATA CLASS= NTUPLES
##ORIGIN= UXNMR, Bruker Analytische Messtechnik GmbH
##OWNER= pz
$$ XWIN-NMR		Version 3.5
$$ Tue Aug 26 14:50:20 2025 Russian Standard Time (UT+4h)  she@DPX200
##.OBSERVE FREQUENCY= 200.1313
##.OBSERVE NUCLEUS= ^1H
##.DELAY= (6, 6)
##.ACQUISITION MODE= SIMULTANEOUS
##.ACQUISITION SCHEME= undefined
##.AVERAGES= 8
##.DIGITISER RES= 18
##SPECTROMETER/DATA SYSTEM= spect
##.PULSE SEQUENCE= zg30
##.SOLVENT NAME= D2O
##.SHIFT REFERENCE= (INTERNAL, D2O, 0, 14.3821)
##AUDIT TRAIL= $$ (NUMBER, WHEN, WHO, WHERE, WHAT)
$$ ##TITLE= Audit trail, XWIN-NMR		Version 3.5
$$ ##JCAMPDX= 5.01
$$ ##ORIGIN= Bruker BioSpin GmbH
$$ ##OWNER= she
$$ F:/spectra/data/she/nmr/H-C/1/audita.txt
$$ ##AUDIT TRAIL=  $$ (NUMBER, WHEN, WHO, WHERE, WHAT)
(   1,<2025-08-26 14:49:01.37 +0400>,<she>,<DPX200>,
      <created by zg, POWCHK disabled, PULCHK disabled
       configuration hash MD5:
       00 E9 B6 7A A2 85 ED C7 34 08 36 98 17 FE 4E 26
       data hash MD5: 16K
       B1 5A C8 2D CC 66 3E 73 21 A6 98 FB FD A7 3F D7>)
$$ ##END=
$$ 
$$ hash MD5
$$ EB 4D 0C 58 D4 7A 45 A5 34 2B C7 EF 06 4F E9 CF
##$RELAX= 
##$RELAX= 
##$RELAX= 
##$RELAX= 
##$RELAX= 
##$RELAX= 
$$ Bruker specific parameters
$$ --------------------------
##$DU= <F:/spectra>
##$EXPNO= 1
##$NAME= <H-C>
##$PROCNO= 1
##$TYPE= <nmr>
##$USER= <she>
##$AMP= (0..31)
100 100 100 100 100 100 100 100 100 100 100 100 100 100 100 100 100 100 
100 100 100 100 100 100 100 100 100 100 100 100 100 100 
##$AQSEQ= 0
##$AQ_mod= 1
##$AUNM= <au_zg>
##$AUTOPOS= <>
##$BF1= 200.13
##$BF2= 200.13
##$BF3= 200.13
##$BF4= 200.13
##$BF5= 200.13
##$BF6= 200.13
##$BF7= 200.13
##$BF8= 200.13
##$BYTORDA= 1
##$CFDGTYP= 0
##$CFRGTYP= 5
##$CHEMSTR= <none>
##$CNST= (0..31)
1 1 145 1 1 1 1 1 1 1 1 1 1 1 1 1 1 1 1 1 1 1 1 1 1 1 1 1 1 1 1 1 
##$CPDPRG= <>
##$CPDPRG1= <>
##$CPDPRG2= <>
##$CPDPRG3= <>
##$CPDPRG4= <mlev>
##$CPDPRG5= <mlev>
##$CPDPRG6= <mlev>
##$CPDPRG7= <mlev>
##$CPDPRG8= <mlev>
##$CPDPRGB= <>
##$CPDPRGT= <>
##$D= (0..31)
0 0.7 0 0 0 0 0 0 0 0 0 0.03 0 0 0 0 0 0 0 0 0 0 0 0 0 0 0 0 0 0 0 0 
##$DATE= 1756205340
##$DBL= (0..7)
120 120 120 120 120 120 120 120 
##$DBP= (0..7)
150 150 150 150 150 150 150 150 
##$DBP07= 0
##$DBPNAM0= <>
##$DBPNAM1= <>
##$DBPNAM2= <>
##$DBPNAM3= <>
##$DBPNAM4= <>
##$DBPNAM5= <>
##$DBPNAM6= <>
##$DBPNAM7= <>
##$DBPOAL= (0..7)
0.5 0.5 0.5 0.5 0.5 0.5 0.5 0.5 
##$DBPOFFS= (0..7)
0 0 0 0 0 0 0 0 
##$DE= 6
##$DECBNUC= <off>
##$DECIM= 32
##$DECNUC= <off>
##$DECSTAT= 4
##$DIGMOD= 1
##$DIGTYP= 9
##$DL= (0..7)
0 120 120 120 120 120 120 120 
##$DP= (0..7)
150 150 150 150 150 150 150 150 
##$DP07= 0
##$DPNAME0= <>
##$DPNAME1= <>
##$DPNAME2= <>
##$DPNAME3= <>
##$DPNAME4= <>
##$DPNAME5= <>
##$DPNAME6= <>
##$DPNAME7= <>
##$DPOAL= (0..7)
0.5 0.5 0.5 0.5 0.5 0.5 0.5 0.5 
##$DPOFFS= (0..7)
0 0 0 0 0 0 0 0 
##$DQDMODE= 0
##$DR= 18
##$DS= 0
##$DSLIST= <SSSSSSSSSSSSSSS>
##$DSPFIRM= 0
$$ [...]
##$SUBNAM0= <"">
##$SUBNAM1= <"">
##$SUBNAM2= <"">
##$SUBNAM3= <"">
##$SUBNAM4= <"">
##$SUBNAM5= <"">
##$SUBNAM6= <"">
##$SUBNAM7= <"">
##$SUBNAM8= <"">
##$SUBNAM9= <"">
##$SW= 18.0517328524113
##$SWIBOX= (0..15)
0 0 2 0 0 0 0 0 0 0 0 0 0 0 0 0 
##$SW_h= 3612.71676300578
##$TD= 16384
##$TD0= 1
##$TE= 0
##$TE2= 300
##$TE3= 300
##$TEG= 300
##$TL= (0..7)
0 120 120 120 120 120 120 120 
##$TP= (0..7)
150 150 150 150 150 150 150 150 
##$TP07= 0
##$TPNAME0= <>
##$TPNAME1= <>
##$TPNAME2= <>
##$TPNAME3= <>
##$TPNAME4= <>
##$TPNAME5= <>
##$TPNAME6= <>
##$TPNAME7= <>
##$TPOAL= (0..7)
0.5 0.5 0.5 0.5 0.5 0.5 0.5 0.5 
##$TPOFFS= (0..7)
0 0 0 0 0 0 0 0 
##$TUNHIN= 0
##$TUNHOUT= 0
##$TUNXOUT= 0
##$USERA1= <user>
##$USERA2= <user>
##$USERA3= <user>
##$USERA4= <user>
##$USERA5= <user>
##$V9= 5
##$VALIST= <valist>
##$VCLIST= <CCCCCCCCCCCCCCC>
##$VD= 0
##$VDLIST= <DDDDDDDDDDDDDDD>
##$VPLIST= <PPPPPPPPPPPPPPP>
##$VTLIST= <TTTTTTTTTTTTTTT>
##$WBST= 1024
##$WBSW= 4
##$XGAIN= (0..3)
0 0 0 0 
##$XL= 0
##$YL= 0
##$YMAX_a= 227770
##$YMIN_a= -245996
##$ZGOPTNS= <>
##$ZL1= 120
##$ZL2= 120
##$ZL3= 120
##$ZL4= 120
##$ABSF1= 10
##$ABSF2= 0
##$ABSG= 5
##$ABSL= 3
##$ALPHA= 0
##$AQORDER= 0
##$ASSFAC= 0
##$ASSFACI= 0
##$ASSFACX= 0
##$ASSWID= 0
##$AUNMP= <proc_1d>
##$AZFE= 0.1
##$AZFW= 0.1
##$BCFW= 1
##$BC_mod= 2
##$BYTORDP= 1
##$COROFFS= 0
##$CY= -3
##$DATMOD= 1
##$DC= 2
##$DFILT= <>
##$DTYPP= 0
##$F1P= 0
##$F2P= 0
##$FCOR= 0.5
##$FTSIZE= 0
##$FT_mod= 4
##$GAMMA= 1
##$GB= 0.15
##$INTBC= 1
##$INTSCL= 1
##$ISEN= 128
##$LB= 0.25
##$LEV0= 0
##$LPBIN= 0
##$MAXI= 10000
##$MC2= 0
##$MEAN= 0
##$ME_mod= 0
##$MI= 1.114404
##$NCOEF= 0
##$NC_proc= 0
##$NLEV= 6
##$NOISF1= 3.799351
##$NOISF2= 2.8
##$NSP= 1
##$NTH_PI= 0
##$NZP= 0
##$OFFSET= 14.38212
##$PC= 1
##$PHC0= -1722.424
##$PHC1= 11.59228
##$PH_mod= 1
##$PKNL= yes
##$PPARMOD= 0
##$PSCAL= 0
##$PSIGN= 0
##$REVERSE= no
##$SF= 200.129724274929
##$SI= 16384
##$SIGF1= 3
##$SIGF2= 2
##$SINO= 400
##$SIOLD= 16384
##$SREGLST= <1H.CDCl3>
##$SSB= 0
##$STSI= 0
##$STSR= 0
##$SW_p= 3205.1282051282
##$SYMM= 0
##$S_DEV= 0
##$TDeff= 0
##$TDoff= 0
##$TI= <>
##$TILT= no
##$TM1= 0
##$TM2= 0
##$TOPLEV= 0
##$USERP1= <user>
##$USERP2= <user>
##$USERP3= <user>
##$USERP4= <user>
##$USERP5= <user>
##$WDW= 1
##$XDIM= 8192
##$YMAX_p= 0
##$YMIN_p= 0
$$ End of Bruker specific parameters
$$ ---------------------------------
##NTUPLES= NMR FID
##VAR_NAME=  TIME,          FID/REAL,        FID/IMAG
##SYMBOL=    X,             R,               I
##VAR_TYPE=  INDEPENDENT,   DEPENDENT,       DEPENDENT
##VAR_FORM=  AFFN,          ASDF,            ASDF
##VAR_DIM=   8192,          8192,            8192
##UNITS=     SECONDS,       ARBITRARY UNITS, ARBITRARY UNITS
##FACTOR=    0.0002768,     1,               1
##FIRST=     0,             0,               0
##LAST=      2.2672688,     0,               0
##MIN=       0,             -245996,         0
##MAX=       2.2672688,     227770,          0
$$ Real data points
##PAGE= N=1
##DATA TABLE= (X++(R..R)), XYDATA
0 0 0 0 0 0 0 0 0 0 0 0 0 0 0 0 0 0 0 0 0 0 0 0 0 5 -4 6 -8 8 -8 8 -8 9 -12 13 -13 14 -18 20 -21 21 -26 26 -31 34 -36
45 -36 40 -46 48 -55 58 -66 71 -79 89 -97 111 -123 142 -162 187 -221 268 -329 420 -560 795 -1241
67 -1241 2261 -5548 37435 226419 187948 116863 80908 -68036 -119608 -34056 -100844 -191857
79 -191857 -52604 96620 145052 227770 171056 -81172 -175965 -100289 -107510 -83700 27381
90 27381 26529 35729 188594 199297 13881 -93327 -152279 -215236 -91810 89807 75689 49003
102 49003 123650 98464 26694 22839 -87779 -236819 -153534 15330 73445 142555 170040 35583
114 35583 -36819 15546 -47170 -149881 -112111 -68580 -23973 144961 224075 87737 -12695
125 -12695 -38718 -118642 -117890 -26998 -46440 -59168 81493 161656 114467 87413 -4370 -167452
137 -167452 -161126 -43371 -24773 4143 91636 81410 59955 114569 48784 -115238 -146688 -109146
149 -109146 -87361 32434 143432 88115 41161 73800 16480 -67420 -67518 -108000 -141742 -9428
161 -9428 122368 112702 102364 78038 -41356 -87986 -37386 -73452 -111144 -21324 48523 71670
173 71670 144569 126190 -27399 -94218 -74583 -100220 -69074 24803 25767 25945 117886 120219 16242
186 16242 -32605 -82947 -153381 -85933 35793 43165 50590 102106 64181 9333 17840 -47469
198 -47469 -145753 -102579 -14426 19291 91322 133520 46959 -11252 6105 -45387 -101973 -65757
210 -65757 -47453 -32264 79860 144081 73871 21173 -8900 -87972 -96547 -29054 -33605 -36838
222 -36838 53259 97968 72809 74564 20438 -100617 -113905 -49407 -37514 -845 71195 59585
234 59585 39050 78930 40588 -64255 -87526 -80635 -83066 2935 94651 69550 42415 58106
246 58106 8899 -45774 -37522 -68836 -104017 -23408 65469 72699 85660 73363 -19542 -62133
258 -62133 -31668 -53818 -74556 -17221 19837 36087 99695 100984 1393 -52532 -56747 -83176
270 -83176 -55693 15731 16791 14475 75437 82172 24458 -2927 -48998 -113786 -75432 10226 26094
283 26094 41760 75603 42827 7691 21557 -21402 -94568 -77186 -29387 -4049 62152 103247
295 103247 43887 -1088 4592 -32920 -66164 -40696 -39825 -38562 42022 97427 63111 34249 4219
308 4219 -64749 -74153 -24255 -25246 -27392 30217 57258 49034 65216 31940 -59191 -81091 -48070
321 -48070 -39807 -3681 52009 41460 25868 55937 34742 -31519 -50283 -60054 -73579 -12974
333 -12974 59311 52357 40042 47448 6765 -30218 -20341 -43981 -75419 -27143 30454 42439 66532
346 66532 66233 -2259 -39780 -25434 -43462 -54164 -12038 8125 15261 64918 75505 14344 -21510
359 -21510 -34624 -66742 -51229 3780 10357 12018 53341 55153 18882 7986 -22390 -75156 -59948
372 -59948 -8347 5542 28364 60895 38050 8969 14954 -13811 -60676 -49944 -25761 -16005
384 -16005 31181 69598 40725 14329 11225 -25268 -52162 -31602 -27391 -27208 23187 58196 40962
397 40962 33297 18541 -34763 -53343 -28543 -29022 -21422 25026 41420 31152 43146 26325 -29743
410 -29743 -45472 -34581 -41355 -16947 31020 34246 27840 43681 21663 -23198 -29591 -35219 -50835
423 -50835 -18354 26606 28820 34731 46868 13754 -20831 -19992 -35034 -50247 -16038 16108 19415
436 19415 40501 50140 11623 -14552 -16369 -39992 -47123 -11120 7779 12923 42691 47167 11398
449 11398 -3927 -12876 -44551 -44114 -10398 -632 11523 44978 41412 11494 5254 -11632 -45488
462 -45488 -38209 -12631 -9544 11802 45203 35494 14920 12935 -13342 -44528 -32137 -16427 -15400
475 -15400 13774 41789 29071 19892 18636 -14530 -40340 -27855 -22737 -18908 16479 37122 24562
488 24562 24864 20215 -15630 -32925 -23976 -29168 -20945 16868 30863 23540 30656 19078 -16803 -25678
502 -25678 -21886 -33106 -19754 14833 22332 23675 36031 17962 -15243 -19572 -23471 -35752 -15884
515 -15884 12429 14575 24024 37674 15870 -9990 -12924 -26589 -37743 -13146 8403 10147 26480
528 26480 36083 12484 -3927 -7387 -28416 -36425 -12415 1468 7257 29908 33960 10674 1496
541 1496 -5393 -29437 -32019 -11839 -5766 5053 31044 30729 11931 7480 -5832 -30492 -27307 -12177
555 -12177 -10880 4817 29496 25760 14594 13579 -6351 -29907 -23545 -14835 -14412 6778 27130
568 27130 20407 16992 17253 -6511 -25955 -20199 -19655 -17297 8704 24259 17513 20031 17432 -7699
582 -7699 -20198 -16460 -23571 -19008 8045 19299 17222 24609 16466 -9052 -15614 -14718 -24953 -17110
596 -17110 6079 12234 16571 28400 16580 -7174 -11936 -16839 -26508 -13344 5289 6609 15414
609 15414 27899 15386 -1947 -6191 -19342 -29275 -12154 3497 5247 17409 25266 10982 1898
622 1898 -441 -18507 -28185 -13490 -3161 3574 21908 25244 8556 3048 -343 -17609 -21970 -11650
636 -11650 -10107 -1140 21642 24982 12150 7650 -3360 -21117 -18220 -8553 -10843 -1950 16877 18589
650 18589 15209 15536 -1530 -22153 -19266 -12089 -10693 3417 16072 11708 12715 17250 1824 -15248
664 -15248 -16650 -19205 -16230 5347 18207 12773 13157 12709 -1699 -8905 -8992 -19339 -20081 40 12866
679 12866 15548 21108 12988 -6709 -10242 -7750 -15776 -14217 -1594 2911 10766 24746 17871 -1999
693 -1999 -9260 -14288 -19768 -8808 3201 1272 6786 19044 15002 5322 -105 -15027 -25461 -12437
707 -12437 1639 4633 12428 16390 6958 4096 4980 -9334 -21105 -14920 -7853 659 17849 20975
721 20975 7230 1909 290 -10066 -12993 -8845 -11921 -6341 13290 20321 13586 9073 -2228 -16663
735 -16663 -13579 -5391 -8100 -3945 8283 11152 12905 16608 3401 -15161 -16319 -12019 -9511 2570
749 2570 11653 7032 8101 13987 5177 -6929 -10577 -16750 -16661 692 13185 10901 11213 9887 -793
764 -793 -4871 -3993 -13206 -16951 -4331 5633 10836 18258 13193 -2869 -7440 -6228 -11639 -10544 -2479
779 -2479 -732 5121 17748 16115 2919 -3928 -10624 -16899 -8906 1218 551 4214 13007 11107 6042
794 6042 3548 -8224 -19153 -12421 -2623 1373 9527 13689 6239 3544 4868 -4861 -13796 -11357 -8964
809 -8964 -3650 10924 16568 8412 4263 1257 -7731 -9836 -6361 -9237 -6870 6745 13261 11360 10439
824 10439 2020 -11083 -11399 -6238 -7355 -3504 5416 7001 8801 13536 5838 -7887 -11091 -10977 -10470
839 -10470 -553 8181 6054 6689 10748 4782 -3134 -5664 -12039 -14743 -3159 7148 8062 10464 9612
854 9612 409 -3284 -2398 -9116 -12901 -5191 1062 5890 14340 12850 774 -4237 -5016 -9900 -8475
869 -8475 -2347 -1996 1700 12214 13122 5151 219 -6808 -14201 -9024 -659 -158 2955 9318 8079 5708
885 5708 5418 -3583 -13959 -11499 -4987 -1046 7135 11398 5606 3035 4415 -2046 -8919 -8624 -9050 -6165
901 -6165 6357 13190 8627 5202 1794 -5925 -7308 -4138 -7325 -7227 2351 8560 9679 10988 4329
916 4329 -7825 -9803 -5957 -6132 -2869 3333 3591 5620 11552 7543 -3334 -8007 -10247 -10685 -1743
931 -1743 6488 5004 4804 7811 4408 -142 -2060 -8916 -13549 -5603 3671 6725 9762 8583 466
946 466 -2581 -1030 -5743 -9661 -5863 -2069 2684 11739 12390 2941 -2710 -4669 -8317 -6403 -1582 -2531
962 -2531 -656 8006 10797 6608 3009 -4537 -12409 -8910 -1463 -83 2434 6635 5351 4651 6336
977 6336 -368 -10037 -10287 -6561 -2749 5649 10126 5130 2540 3516 -831 -5460 -5854 -8294 -7364 2929
993 2929 10159 8351 6214 2404 -5004 -6164 -3171 -5548 -6224 340 4864 7173 10386 5858 -4710
1008 -4710 -7926 -6116 -6126 -2550 2750 2487 3642 8994 7040 -592 -4633 -8363 -10402 -3281 4431 4358
1024 4358 4784 6661 3434 216 -410 -6008 -10911 -5968 708 4059 8513 8693 1697 -1701 -1069 -4877
1040 -4877 -7482 -4486 -2686 431 8325 10477 4266 -63 -3094 -7664 -6495 -1887 -1976 -530 5873
1055 5873 7850 5496 4065 -1632 -9201 -8195 -3247 -1591 2002 6284 4932 3808 4963 366 -6749
1070 -6749 -7453 -6152 -4330 2802 7968 5466 3684 3530 -1128 -4737 -4367 -6272 -6336 968 6501 6512 6567
1087 6567 4059 -3030 -5384 -3728 -5298 -4890 502 3399 4833 8251 5833 -1907 -5095 -5508 -6784
1102 -6784 -3501 1965 2550 3463 7186 5399 127 -2336 -5783 -8869 -4357 1775 3048 4861 6725
1117 6725 3229 52 -349 -4462 -8337 -5033 -867 1703 6552 8069 2935 -282 -933 -4706 -6407
1132 -6407 -3536 -2439 -466 5865 8199 4295 1793 -1397 -6463 -6246 -2492 -2121 -384 4786 5923
1147 5923 4360 4180 1 -6641 -6903 -3888 -2707 1224 5525 4393 3317 4361 681 -4693 -5469 -5510
1163 -5510 -4924 1046 6180 4956 4021 3570 -763 -3806 -3357 -5096 -5718 -314 4293 5063 6309 4603
1179 4603 -1636 -4336 -3396 -4702 -4324 -36 1994 3316 6890 5828 -261 -3391 -4703 -6513 -3663
1194 -3663 1164 1844 2712 5751 4655 1043 -735 -4235 -7811 -4791 309 1997 4202 5999 3014
1209 3014 440 340 -3010 -6577 -4736 -1989 151 5088 7291 3348 582 -513 -3802 -5202 -3044
1224 -3044 -2681 -1459 3984 6672 4462 2752 -262 -5290 -5642 -2674 -2252 -704 3463 4472 3801 4405
1240 4405 1153 -4633 -5695 -4193 -3373 296 4427 3789 3076 3993 1204 -3084 -3920 -4851 -5157 -347 4346
1257 4346 4223 4198 3869 -156 -2934 -2680 -4252 -5133 -995 2495 3572 5605 4831 -245 -2966 -2976 -4645
1274 -4645 -4190 -330 1267 2341 5533 5166 763 -1517 -3274 -5821 -4176 -84 1047 2362 5178
1289 5178 4140 1101 64 -2671 -6080 -4392 -1023 328 3095 5562 3494 1098 524 -2626 -5431
1304 -5431 -3809 -1979 -827 3232 5609 3546 1885 725 -3123 -4999 -3148 -2483 -1321 2985 4850
1319 4850 3413 3037 1223 -3301 -4584 -3156 -3182 -1237 3046 4089 3265 3589 1314 -3010 -3848 -3394 -3871
1336 -3871 -1232 2853 3510 3507 4151 1111 -2649 -3195 -3622 -4184 -1067 2288 2723 3784 4499 1108 -2009
1353 -2009 -2634 -4134 -4417 -876 1783 2204 4013 4252 1024 -1079 -1975 -4543 -4575 -1083 960 2160 4567
1370 4567 4093 801 -443 -1667 -4456 -4014 -1359 -250 1856 4922 4043 1217 153 -2009 -4602 -3474
1386 -3474 -1397 -877 1661 4538 3631 2043 1059 -2176 -4761 -3281 -1809 -1114 1993 4062 2926 2395
1402 2395 1741 -1915 -4205 -3269 -2731 -1459 2279 3902 2742 2651 1651 -1908 -3267 -2836 -3479 -1926 2057
1419 2057 3400 2995 3405 1521 -2130 -2733 -2670 -3571 -1698 1579 2423 3111 4010 1571 -1795 -2382 -3069 -3776
1437 -3776 -1293 1328 1706 2999 4060 1630 -939 -1677 -3500 -4083 -1238 888 1537 3251 3775 1257
1453 1257 -293 -1150 -3508 -3964 -1462 28 1333 3710 3722 1187 148 -983 -3461 -3507 -1570 -825 1010
1470 1010 3854 3542 1609 806 -1224 -3655 -3035 -1609 -1274 901 3409 2995 2082 1592 -1185 -3570 -2912
1487 -2912 -1998 -1514 1159 3154 2413 2182 1980 -917 -3037 -2721 -2755 -1894 1333 2878 2354 2575 1816 -1048
1505 -1048 -2267 -2186 -3131 -2193 928 2410 2550 3220 1759 -1222 -1997 -2033 -3022 -1888 558 1379 2412 3645
1523 3645 1955 -792 -1643 -2565 -3304 -1408 567 842 2102 3451 1958 70 -799 -2797 -3788 -1632
1539 -1632 357 953 2528 3048 1334 476 -150 -2463 -3476 -1944 -769 659 3063 3207 1251 448
1555 448 -326 -2332 -2605 -1658 -1564 -107 2714 3222 2013 1218 -744 -2862 -2454 -1332 -1405 -52 1989 2250
1573 2250 2251 2241 -161 -2797 -2735 -1999 -1433 654 2130 1559 1788 2235 218 -1715 -2206 -2881 -2273 641 2357
1592 2357 1942 2090 1567 -357 -1082 -1242 -2680 -2607 -217 1401 2277 3189 1884 -753 -1438 -1404 -2263 -1719
1610 -1719 -264 235 1504 3315 2518 203 -1149 -2239 -2899 -1322 312 275 1136 2477 1944 1038 114
1627 114 -2072 -3462 -1973 -246 581 1938 2381 1060 689 595 -1333 -2744 -2126 -1456 -116 2417 2956
1644 2956 1409 652 -105 -1631 -1773 -1310 -1713 -856 1619 2592 2182 1641 -157 -2336 -2030 -1197 -1289 -376
1662 -376 1174 1471 1889 2450 643 -1831 -2298 -2122 -1673 265 1623 1218 1401 1938 652 -796 -1419 -2567
1680 -2567 -2527 -133 1516 1680 1992 1503 -116 -697 -735 -1998 -2300 -749 498 1532 2754 2063 -93
1697 -93 -889 -1165 -1949 -1583 -414 -217 722 2522 2340 747 -165 -1586 -2600 -1508 -138 64 833 1936
1715 1936 1591 1051 640 -1142 -2642 -1972 -851 13 1424 2111 1133 756 690 -764 -1900 -1775 -1551 -752
1733 -752 1368 2413 1514 985 238 -1212 -1533 -1088 -1507 -992 888 1805 1749 1740 490 -1471 -1694 -1303 -1309 -494
1753 -494 773 1008 1363 2061 949 -880 -1518 -1827 -1796 -247 1118 983 1263 1590 675 -348 -825 -1854
1771 -1854 -2250 -722 693 1245 1814 1658 224 -365 -479 -1432 -1895 -850 -117 819 2150 2010 462 -405
1789 -405 -845 -1648 -1365 -492 -375 255 1725 1850 1049 317 -1003 -2137 -1480 -409 -162 588 1410 1160 998
1808 998 914 -381 -1905 -1752 -1136 -451 1013 1799 1038 678 626 -381 -1211 -1242 -1485 -1119 765 1847 1530
1827 1530 1167 449 -889 -1139 -787 -1225 -1022 279 1047 1344 1815 889 -883 -1463 -1167 -1180 -485 487 505
1846 505 895 1754 1171 -227 -988 -1573 -1787 -528 741 805 971 1237 701 95 -218 -1291 -2008 -1037 204
1865 204 832 1612 1511 352 -252 -255 -932 -1419 -915 -533 209 1617 1917 763 -16 -607 -1409 -1100 -383 -441
1885 -441 -95 1065 1484 1207 743 -506 -1799 -1562 -586 -208 399 1055 812 837 1051 29 -1303 -1477 -1297
1904 -1297 -676 605 1450 1002 625 596 -136 -751 -889 -1341 -1243 234 1225 1343 1218 567 -571 -900 -661
1923 -661 -1031 -971 -60 606 1035 1627 1042 -369 -1017 -1081 -1156 -529 339 375 667 1369 1096 115 -473 -1213 -1634
1944 -1634 -734 317 607 885 1189 598 108 -43 -939 -1577 -1014 -180 422 1281 1466 539 -3 -199 -902
1963 -902 -1148 -819 -511 16 1082 1525 883 335 -306 -1141 -1157 -542 -460 -79 882 1122 950 717 -124 -1221
1983 -1221 -1288 -796 -552 237 955 883 779 842 74 -914 -1093 -1091 -855 259 1030 866 800 723 -153 -741 -729 -1098
2005 -1098 -995 15 818 959 1172 835 -264 -719 -741 -974 -815 -24 483 737 1302 1019 -99 -617 -888
2024 -888 -1192 -714 118 343 631 1175 834 81 -303 -905 -1448 -801 85 354 910 1137 625 113 -35 -767
2044 -767 -1256 -826 -306 169 988 1264 645 140 -173 -808 -1049 -622 -546 -102 861 1208 837 438 -206 -981
2064 -981 -985 -571 -442 12 740 925 803 739 -39 -974 -1067 -795 -554 175 839 770 683 741 64 -637 -842 -931 -898
2087 -898 97 849 826 812 621 -134 -594 -580 -893 -884 -11 594 765 1166 734 -146 -585 -688 -911 -713 1 281
2109 281 564 1156 918 28 -385 -821 -1121 -643 71 225 587 1032 694 197 -132 -699 -1268 -777 -83 242
2129 242 803 1073 475 114 -77 -579 -998 -754 -365 79 861 1147 603 200 -45 -690 -840 -572 -470 -195
2149 -195 708 1002 712 541 -130 -856 -908 -549 -447 -15 678 786 668 676 30 -782 -919 -809 -561 142 771
2170 771 730 659 596 78 -561 -686 -854 -771 55 647 739 746 607 -35 -546 -581 -829 -742 -86 409 661 913 675
2193 675 -78 -505 -625 -879 -601 31 322 539 987 681 54 -259 -631 -1019 -647 11 224 546 956 551
2213 551 182 -110 -593 -966 -574 -141 132 671 973 569 192 -75 -666 -997 -562 -296 34 714 864 546
2233 546 305 -4 -713 -885 -602 -412 -1 699 809 534 420 -19 -678 -757 -595 -534 -96 683 753 622 556
2254 556 -51 -646 -689 -652 -538 -39 564 682 731 651 -87 -624 -633 -711 -597 92 479 570 749 620 -16 -442 -651
2277 -651 -891 -623 49 428 577 786 550 1 -344 -500 -912 -634 -46 314 612 898 564 -6 -207 -510
2297 -510 -801 -564 -111 72 636 914 555 118 -150 -647 -810 -513 -132 80 576 847 564 324 -75 -690
2317 -690 -915 -503 -242 49 685 778 479 368 16 -573 -825 -586 -428 53 697 736 518 393 -24 -580 -587
2338 -587 -548 -540 -84 587 638 712 528 -132 -595 -586 -600 -515 14 457 589 684 588 -26 -511 -626 -696 -561 104 431
2362 431 369 663 608 1 -307 -533 -802 -574 41 380 478 765 497 -1 -268 -505 -839 -594 -80 184 577
2383 577 826 510 -45 -231 -597 -801 -492 -93 90 539 789 532 195 -88 -580 -839 -465 -175 68 512
2403 512 700 476 327 41 -592 -858 -510 -320 86 563 683 411 326 67 -563 -682 -582 -462 -14 556
2423 556 696 497 380 -47 -469 -539 -510 -483 -3 472 671 638 498 -76 -551 -524 -550 -392 -20 367 437 689
2445 689 574 28 -378 -600 -687 -558 81 330 373 602 540 71 -195 -513 -829 -583 -20 326 522 639 417
2466 417 7 -136 -395 -643 -606 -157 98 504 855 501 54 -195 -459 -619 -451 -176 19 384 691 578
2486 578 255 -121 -562 -764 -402 -139 9 403 524 486 347 51 -459 -751 -577 -270 128 497 551 370 330
2507 330 109 -305 -532 -581 -521 -63 500 647 466 335 -30 -376 -385 -423 -504 -199 332 493 636 560 -6 -465
2529 -465 -499 -435 -414 -57 226 265 534 609 126 -313 -554 -630 -462 0 350 351 477 418 187 -127 -361 -719 -667
2552 -667 -107 191 446 610 385 5 -85 -254 -529 -516 -191 4 369 716 467 66 -101 -410 -543 -361 -231
2573 -231 -113 262 574 564 281 18 -511 -655 -366 -171 37 226 405 412 424 143 -352 -588 -513 -363 22 437
2595 437 504 312 288 42 -250 -381 -420 -518 -170 376 451 504 343 -25 -334 -338 -332 -453 -148 228 331 552 565 55
2619 55 -281 -444 -422 -364 -64 195 230 456 499 176 -136 -361 -533 -521 -63 162 263 430 387 143 -47 -243
2641 -243 -548 -502 -183 84 348 593 397 50 -4 -193 -459 -421 -222 -75 256 616 468 169 -71 -330 -440
2662 -440 -309 -148 -173 188 432 397 356 126 -314 -571 -382 -250 -117 245 365 305 288 226 -201 -414 -460 -396 -133
2685 -133 272 383 302 299 158 -117 -252 -397 -459 -307 147 436 450 433 80 -232 -230 -283 -382 -180 45 192 374
2708 374 527 221 -176 -350 -422 -376 -110 88 160 334 442 221 6 -198 -471 -479 -153 82 188 395 310 154
2730 154 43 -60 -383 -463 -284 -23 214 470 382 98 27 -182 -281 -289 -271 -185 150 451 385 231 88 -229 -435
2753 -435 -338 -234 -162 15 261 338 324 274 -162 -426 -363 -258 -111 124 233 175 289 288 -40 -252 -368 -388 -209
2776 -209 115 300 315 251 101 -47 -147 -274 -415 -255 52 267 325 385 183 -101 -140 -251 -292 -241 -48 111
2798 111 299 431 252 -50 -139 -365 -321 -135 -8 75 225 289 263 104 -85 -320 -461 -198 -64 121 285 252
2820 252 185 111 34 -285 -323 -248 -171 -7 351 349 232 111 -48 -219 -249 -202 -265 -58 192 352 327 181 -29 -240
2844 -240 -263 -202 -256 -39 124 194 322 308 48 -231 -251 -281 -197 8 163 143 268 280 83 -155 -237 -371 -313 -37
2868 -37 133 217 312 216 22 -51 -151 -333 -287 -121 54 220 336 285 1 -16 -182 -323 -253 -196 -23 133 381
2891 381 344 196 1 -188 -307 -251 -117 -78 144 291 284 222 142 -156 -306 -266 -211 -73 145 275 238 210 146 -130
2915 -130 -284 -291 -244 -132 173 298 253 228 114 -142 -231 -265 -269 -166 58 238 222 341 144 -96 -250 -259 -305 -172
2939 -172 40 159 289 357 170 -92 -205 -337 -401 -160 54 118 271 348 217 19 -159 -346 -408 -266 69 171
2961 171 319 349 172 29 -41 -309 -410 -246 -105 116 265 410 172 3 -58 -303 -316 -247 -143 76 336 336
2983 336 228 142 -121 -342 -336 -236 -136 39 286 271 258 176 -48 -314 -349 -264 -151 56 314 259 278 195 -67 -246
3007 -246 -283 -340 -258 34 268 300 338 242 -72 -198 -285 -319 -228 15 252 319 391 244 -49 -219 -341 -345 -200 26
3031 26 137 220 425 262 17 -151 -385 -367 -210 -3 72 256 369 260 83 -71 -322 -415 -237 -109 130 328
3053 328 317 227 97 -28 -333 -428 -305 -104 13 259 441 288 52 -52 -260 -358 -272 -170 22 246 391 268
3075 268 182 -58 -305 -304 -310 -190 58 254 335 285 192 -81 -293 -343 -322 -262 15 267 321 321 255 17 -207 -346 -391
3100 -391 -230 -37 222 268 318 285 -46 -214 -230 -367 -280 4 205 274 420 273 37 -117 -288 -452 -246 -26
3122 -26 152 255 436 272 68 -109 -281 -425 -256 -56 84 277 402 280 75 -61 -279 -352 -299 -144 35
3143 35 255 358 288 160 23 -321 -374 -264 -127 8 312 398 219 140 -4 -341 -401 -387 -192 3 298 318 284
3166 284 179 32 -277 -280 -307 -285 -2 254 288 319 275 -75 -283 -233 -297 -236 -47 149 245 402 241 24 -262 -261
3190 -261 -359 -274 44 189 234 315 309 33 -136 -289 -404 -316 -57 223 273 367 272 -5 -97 -258 -439 -287 -23 141
3214 141 317 441 261 -6 -90 -277 -309 -236 -126 37 260 428 269 160 -86 -338 -435 -267 -147 25 278
3235 278 366 298 175 -21 -369 -360 -240 -129 83 305 290 249 214 -10 -301 -294 -283 -205 13 282 333 245 198 -66 -293
3260 -293 -255 -363 -281 41 236 352 309 255 -107 -243 -300 -315 -212 -47 197 257 351 317 -46 -299 -250 -321 -231 50
3284 50 137 217 378 288 -7 -165 -310 -397 -302 22 179 292 356 289 9 -130 -288 -398 -281 -93 178 315 396
3307 396 284 -12 -68 -310 -402 -204 -38 41 338 403 206 84 -109 -298 -401 -230 -88 87 281 335 256 127
3329 127 -63 -403 -437 -274 -121 50 313 362 233 142 -22 -261 -354 -296 -186 61 334 375 279 186 -79 -277 -275
3352 -275 -303 -228 26 219 335 325 252 -62 -313 -308 -309 -178 22 272 182 364 309 -67 -233 -327 -369 -181 94 230
3376 230 299 380 229 -40 -174 -368 -451 -226 14 240 381 396 191 -44 -178 -287 -314 -187 -3 87 325 436
3398 436 222 -9 -122 -401 -320 -140 -25 58 294 459 229 112 -141 -404 -376 -229 -64 113 269 301 234 156
3420 156 -105 -330 -397 -279 -134 116 383 266 182 128 -73 -311 -305 -330 -218 105 357 350 305 118 -170 -296 -261
3443 -261 -255 -209 90 253 306 337 185 -129 -377 -338 -247 -183 103 182 278 351 256 -44 -291 -403 -370 -207 180 274 297
3468 297 372 162 -23 -132 -370 -508 -276 25 279 356 315 93 -115 -185 -341 -371 -226 -38 109 399 485 191
3490 191 -69 -225 -371 -341 -149 54 113 367 367 209 69 -223 -490 -427 -180 -25 209 356 289 198 124 -98 -439
3513 -439 -418 -291 -94 176 399 341 200 101 -176 -303 -339 -285 -159 196 384 404 278 52 -240 -397 -313 -266 -187
3536 -187 85 285 306 368 201 -216 -293 -367 -331 -132 191 258 310 330 212 -136 -355 -425 -387 -145 118 265 380
3559 380 314 123 -39 -216 -377 -394 -200 71 220 396 451 66 -107 -252 -337 -370 -133 -33 151 402 372 207
3581 207 -36 -244 -422 -370 -170 -6 129 353 360 233 16 -174 -454 -467 -253 13 126 396 348 172 77 -196
3603 -196 -417 -354 -230 -142 226 403 377 189 47 -170 -366 -313 -304 -139 197 406 371 309 88 -277 -410 -339 -273
3626 -273 -93 161 286 369 398 194 -191 -351 -417 -376 -110 244 240 245 343 231 -77 -225 -397 -438 -206 151 321
3649 321 412 322 81 -56 -249 -353 -406 -203 80 341 514 460 126 -131 -252 -322 -349 -124 -38 112 466 461 155
3672 155 -72 -300 -458 -379 -126 78 168 366 358 214 128 -187 -499 -486 -202 -20 215 466 291 208 74 -178
3694 -178 -412 -377 -271 -126 277 474 396 259 9 -254 -316 -312 -312 -162 154 420 400 405 93 -290 -392 -340 -334 -50
3718 -50 118 300 345 434 201 -179 -421 -409 -387 -77 265 321 360 387 125 -69 -200 -410 -487 -193 189 354 451
3741 451 372 117 -77 -211 -379 -390 -242 -5 248 466 419 121 -121 -294 -395 -427 -158 -23 134 427 440 238
3763 238 10 -273 -516 -435 -173 -48 245 431 423 196 87 -200 -431 -450 -204 -66 217 473 312 183 117 -198
3785 -198 -434 -455 -366 -88 192 421 395 341 77 -159 -365 -360 -355 -123 198 370 453 408 175 -229 -462 -402 -368 -136
3809 -136 187 357 431 444 182 -143 -362 -449 -430 -131 184 330 363 387 220 -124 -271 -439 -480 -179 45 301
3831 301 425 421 124 -73 -193 -495 -465 -208 26 195 475 453 209 -43 -210 -444 -439 -225 -49 220 470 461 250
3854 250 58 -244 -501 -404 -233 -37 182 400 419 247 125 -197 -452 -415 -315 -93 213 472 437 292 114
3875 114 -176 -432 -379 -338 -205 184 411 423 290 155 -188 -345 -364 -387 -216 98 371 414 424 194 -156 -387
3897 -387 -387 -396 -141 135 307 433 437 193 -116 -317 -436 -475 -212 132 266 373 416 196 -115 -224 -438 -424 -205
3920 -205 15 262 478 474 149 -21 -214 -444 -392 -235 8 219 436 468 257 10 -229 -491 -506 -238 0 177
3942 177 459 465 241 107 -266 -456 -474 -315 -110 138 351 390 353 116 -240 -414 -451 -313 -197 160 439 391
3964 391 341 156 -167 -388 -365 -346 -253 163 360 394 353 211 -161 -348 -408 -375 -180 90 317 413 504 213 -134
3987 -134 -327 -439 -393 -224 91 247 373 491 200 -92 -237 -424 -447 -227 32 221 341 451 261 16 -173
4008 -173 -425 -460 -279 36 177 403 446 185 29 -184 -309 -448 -276 -41 156 433 434 219 48 -170 -412
4029 -412 -470 -231 -104 125 420 426 297 73 -161 -352 -414 -252 -154 133 373 391 348 189 -160 -386 -435 -329 -162
4052 -162 75 325 352 359 281 -120 -369 -438 -347 -161 98 295 366 323 257 1 -315 -350 -415 -231 82 313 347 381
4076 381 252 -58 -241 -298 -475 -243 -20 220 437 398 216 -35 -272 -426 -394 -266 -66 108 256 476 360
4097 360 -41 -191 -351 -450 -258 -22 162 336 379 275 86 -74 -378 -478 -286 -86 94 333 400 233 57
4118 57 -45 -352 -433 -269 -100 21 385 394 320 161 -124 -364 -391 -320 -196 68 319 425 361 216 -99 -379 -369
4141 -369 -282 -264 -5 240 337 326 214 -51 -280 -430 -415 -230 53 248 332 381 206 5 -216 -378 -420 -256 8
4164 8 227 328 425 261 -9 -147 -322 -341 -335 -20 148 321 459 266 36 -146 -325 -422 -242 -58 75 250
4186 250 468 303 92 -123 -339 -409 -281 -82 85 302 368 314 133 -40 -359 -440 -329 -165 62 318 421
4207 421 303 115 0 -252 -374 -347 -212 -7 300 463 303 193 -66 -262 -361 -314 -248 12 258 326 376 193
4229 193 6 -230 -371 -350 -244 30 239 280 354 263 45 -227 -367 -420 -301 1 242 313 373 281 90 -164 -276
4252 -276 -464 -345 -77 126 322 405 263 27 -95 -270 -342 -281 -94 84 255 434 296 109 -125 -332 -419
4273 -419 -323 -78 25 239 384 334 145 -68 -262 -438 -362 -157 21 275 403 281 146 59 -264 -411 -289
4294 -289 -236 6 306 401 262 169 37 -138 -354 -332 -262 -56 221 385 380 270 15 -281 -311 -266 -250 -78 158
4317 158 258 369 284 135 -254 -318 -417 -336 -33 246 206 373 363 120 -129 -356 -408 -367 -46 205 290 350 283 60
4341 60 -61 -255 -400 -349 -154 43 283 397 341 106 -141 -189 -339 -308 -108 12 279 412 386 59 -108 -256
4363 -256 -367 -296 -101 21 202 367 358 241 31 -283 -439 -384 -182 11 292 342 309 224 53 -193 -397 -343 -287
4386 -287 -59 301 378 286 270 9 -170 -387 -327 -298 -109 206 362 350 288 6 -251 -313 -307 -329 -84 141 277 315
4410 315 360 128 -209 -334 -425 -312 -32 129 251 304 344 103 -77 -275 -457 -378 -121 115 284 366 326 80
4432 80 -43 -179 -426 -378 -146 86 290 366 392 169 -75 -223 -352 -329 -201 -41 175 377 416 136 58 -230
4454 -230 -432 -333 -182 -72 208 332 254 263 135 -219 -399 -354 -273 -24 184 354 340 273 167 -118 -336 -393 -376
4477 -376 -133 207 361 346 317 103 -153 -305 -341 -413 -178 77 340 376 332 118 -172 -270 -339 -288 -149 124 222
4500 222 337 386 172 -114 -253 -350 -329 -98 129 259 350 336 78 -60 -192 -396 -417 -198 5 219 357 362 125
4523 125 3 -155 -337 -375 -218 -68 217 321 398 183 -41 -191 -385 -338 -204 -85 137 382 362 275 81 -157
4545 -157 -402 -318 -238 -69 121 323 367 286 200 -153 -416 -408 -272 -100 137 329 325 237 216 -40 -299 -353 -377 -140
4569 -140 124 328 396 289 150 -60 -264 -345 -421 -253 81 300 387 423 161 -106 -285 -381 -347 -135 -38 225 352
4592 352 434 257 -50 -274 -315 -381 -184 56 223 357 366 272 37 -182 -420 -480 -223 -91 215 389 315 209 48
4615 48 -90 -423 -414 -323 -118 197 383 423 259 98 -145 -348 -370 -243 -144 75 321 416 402 147 -117 -349 -418
4638 -418 -271 -143 156 364 344 293 165 -69 -383 -419 -326 -215 127 311 367 349 148 -93 -276 -365 -342 -254 69
4661 69 282 366 421 189 -68 -246 -387 -372 -311 -6 263 379 415 302 -48 -185 -354 -338 -280 -37 205 358 413
4684 413 234 11 -217 -384 -453 -281 -12 161 301 394 303 72 -84 -338 -472 -323 -93 159 389 416 318 79
4706 79 -97 -343 -408 -309 -196 103 348 354 343 135 -122 -361 -397 -297 -198 105 323 390 320 156 -25 -386 -429 -332
4730 -332 -197 31 291 373 377 256 -36 -301 -416 -427 -259 62 307 384 363 262 -50 -255 -364 -390 -275 -24
4752 -24 238 359 427 260 -129 -249 -314 -401 -277 -2 207 384 432 315 -11 -188 -344 -431 -320 -106 108 336
4774 336 483 310 69 -143 -370 -435 -273 -105 151 347 418 313 148 -125 -328 -438 -319 -107 128 321 417
4795 417 333 145 -49 -309 -391 -263 -228 63 379 408 377 151 -56 -303 -381 -312 -229 15 328 374 360 285 31 -323
4819 -323 -371 -368 -200 -3 265 406 399 277 -6 -260 -350 -417 -307 -11 163 311 394 265 -24 -218 -332 -433 -372
4842 -372 -74 212 309 419 298 64 -155 -293 -425 -288 -57 126 314 448 339 131 -137 -289 -432 -292
4862 -292 -106 78 328 381 317 143 -55 -340 -448 -390 -93 77 263 422 353 175 -31 -356 -406 -334 -236 101
4884 101 300 401 293 164 23 -283 -384 -413 -176 18 241 379 344 228 8 -262 -390 -366 -296 -80 270
4905 270 364 376 297 46 -274 -397 -335 -312 -62 211 335 382 331 31 -167 -320 -401 -382 -35 157 299 403 381
4928 381 133 -80 -341 -468 -343 -117 121 305 390 311 180 -75 -304 -432 -384 -184 100 334 398 318 90 -73
4950 -73 -272 -430 -358 -187 -10 327 456 336 195 -27 -265 -407 -329 -169 47 254 431 355 241 44 -263
4971 -263 -418 -304 -256 -91 250 410 377 248 98 -246 -370 -398 -271 -64 231 364 320 314 98 -200 -312 -385
4993 -385 -404 -123 161 352 410 358 62 -213 -297 -406 -296 -154 149 303 472 343 159 -126 -354 -425 -375 -152
5015 -152 95 284 408 327 158 -102 -306 -461 -413 -154 120 260 433 378 178 -14 -275 -410 -449 -213 30
5036 30 217 434 342 200 -48 -246 -400 -381 -229 -22 173 406 368 239 41 -244 -400 -405 -208 -39 193 333
5058 333 388 295 65 -206 -427 -402 -277 -55 227 331 335 270 79 -168 -377 -467 -311 -94 181 334 350 310 134
5081 134 -109 -294 -443 -425 -179 122 318 415 333 130 -156 -283 -345 -382 -152 78 289 368 390 226 -60 -227
5103 -227 -423 -368 -174 16 235 362 390 208 28 -183 -387 -389 -187 11 270 427 364 269 26 -195 -360 -388
5125 -388 -254 -53 188 397 368 223 29 -203 -377 -431 -279 -112 177 427 394 276 114 -166 -388 -327 -274 -128
5147 -128 125 299 378 318 98 -147 -359 -388 -331 -128 143 331 315 385 111 -92 -283 -419 -364 -197 108 301
5169 301 445 389 189 -70 -243 -356 -363 -271 51 288 334 407 141 -67 -197 -336 -423 -252 8 142 377 401 350
5192 350 55 -256 -413 -450 -265 -57 138 380 409 314 55 -119 -408 -454 -320 -42 129 357 388 204 99 -100
5214 -100 -354 -390 -327 -125 144 382 411 284 102 -75 -303 -372 -335 -147 80 314 445 336 171 -132 -341 -360
5236 -360 -291 -171 59 276 352 380 203 -85 -282 -384 -331 -192 102 227 351 325 239 11 -251 -373 -442 -271
5258 -271 91 230 399 376 154 -9 -214 -222 -391 -282 -83 213 324 412 270 29 -189 -337 -393 -269 -58 81
5280 81 308 448 350 123 -110 -416 -439 -246 -62 125 333 401 301 161 -131 -395 -366 -302 -119 180 381 450
5302 450 303 127 -51 -319 -386 -366 -231 64 248 408 348 132 -68 -248 -362 -350 -194 4 256 325 312 223
5324 223 -41 -309 -326 -358 -148 -15 217 318 384 240 6 -240 -338 -372 -258 -32 199 295 327 240 21 -155 -316
5347 -316 -370 -258 -58 188 274 368 283 49 -88 -311 -350 -246 -86 145 270 383 313 54 -133 -310 -366 -269 -58
5370 -58 53 235 351 353 138 -80 -265 -421 -263 -156 35 318 331 301 180 -20 -250 -382 -340 -175 77 248
5392 248 396 291 253 53 -275 -344 -375 -249 -22 331 335 341 152 1 -231 -356 -338 -270 -9 187 359 350 250 -10
5416 -10 -190 -330 -337 -307 -65 193 323 299 277 79 -180 -265 -359 -245 -85 171 295 361 293 74 -136 -287 -377 -287
5440 -287 -99 151 270 388 322 118 -108 -252 -348 -325 -143 37 236 370 362 124 -48 -236 -373 -270 -159 4
5462 4 253 349 294 200 -31 -289 -379 -360 -173 -14 179 337 303 236 40 -185 -359 -347 -247 -46 198 298 283 220
5486 220 34 -180 -273 -343 -208 -45 162 359 379 265 75 -169 -287 -342 -277 -113 151 270 369 299 51 -114
5508 -114 -262 -343 -220 -86 82 222 301 328 83 -135 -227 -371 -312 -130 105 242 257 307 104 -67 -169 -366
5530 -366 -344 -130 76 260 376 268 109 13 -213 -350 -311 -167 -29 257 357 341 155 -50 -188 -285 -242 -218
5552 -218 -55 153 333 317 220 44 -188 -291 -330 -200 -23 124 275 250 277 87 -144 -274 -352 -219 -50 154
5574 154 322 318 262 83 -111 -299 -330 -198 -130 101 234 346 280 66 -35 -245 -291 -274 -142 41 256 291 284 85
5598 85 -66 -265 -307 -290 -199 39 187 340 298 177 14 -154 -328 -298 -139 2 158 290 346 181 5 -166
5620 -166 -331 -399 -153 -56 133 297 254 142 17 -180 -304 -339 -189 -65 158 271 322 188 43 -176 -287 -273
5642 -273 -243 -43 127 215 263 257 90 -55 -302 -290 -272 -167 124 215 358 224 97 -139 -277 -218 -228 -80 67
5665 67 276 283 281 162 -66 -189 -255 -227 -158 81 277 260 269 113 -36 -187 -240 -300 -93 39 165 358 271 123 23
5690 23 -147 -254 -279 -144 43 158 236 280 169 25 -195 -256 -301 -214 -26 169 319 357 213 -59 -120 -240 -305
5713 -305 -221 -82 101 264 287 152 29 -103 -263 -300 -194 -68 132 296 237 230 85 -119 -237 -333 -215 -101
5735 -101 60 172 279 294 92 -90 -242 -283 -192 -116 59 211 294 286 155 -41 -189 -232 -276 -162 80 198 261
5758 261 279 124 -41 -174 -268 -220 -130 64 188 295 216 120 -58 -147 -275 -234 -197 -13 196 251 261 212 -7 -152
5782 -152 -256 -276 -211 0 169 310 313 207 -56 -64 -260 -278 -129 7 87 231 215 174 75 -172 -236 -231 -207 -65 55
5807 55 165 260 155 30 -94 -212 -286 -265 -51 56 219 282 216 59 -28 -212 -253 -232 -94 94 179 236 246 74
5831 74 -51 -209 -219 -239 -173 -7 204 237 190 168 0 -217 -218 -227 -129 27 187 279 201 151 -8 -148 -213 -238 -156 -10
5857 -10 215 269 242 178 7 -100 -235 -223 -183 -39 142 226 233 224 23 -123 -226 -229 -168 -7 110 223 245 224 65
5882 65 -73 -222 -303 -248 -16 111 155 268 166 60 -53 -228 -237 -200 -2 93 206 288 212 106 -44 -191 -273 -214
5906 -214 -75 55 148 218 135 115 -50 -153 -221 -211 -82 54 186 187 216 144 -85 -133 -206 -196 -128 -35 142 215 187 178
5932 178 -33 -142 -198 -203 -170 42 146 198 272 188 -12 -133 -159 -255 -149 -26 105 179 185 145 2 -51 -193 -288 -143
5957 -143 10 60 208 297 189 36 -89 -205 -238 -180 -18 21 143 199 176 72 -67 -220 -219 -182 -100 89 193 254
5981 254 147 70 -39 -178 -253 -200 -83 18 148 140 204 95 -38 -176 -210 -202 -65 41 163 190 210 121 -41 -107
6005 -107 -224 -237 -124 56 147 209 195 160 -51 -156 -193 -199 -96 29 149 240 216 114 9 -91 -247 -210 -127 -32
6029 -32 84 158 210 161 57 -146 -230 -216 -160 -33 105 208 212 125 5 -50 -189 -205 -124 -96 27 181 181 202 34 -107
6055 -107 -170 -204 -193 -94 34 141 153 131 38 -53 -137 -202 -143 -77 -49 153 149 200 101 -18 -106 -188 -172 -74 -14 170 176 116
6083 116 111 63 -114 -212 -167 -103 -30 120 192 215 119 -26 -91 -144 -177 -84 -49 113 172 177 156 -9 -100 -177 -126 -105 -6 67
6111 67 158 192 124 1 -118 -190 -232 -110 -37 44 125 188 133 -2 -58 -125 -182 -176 -81 82 184 170 120 39 -68 -101 -189
6138 -189 -119 -89 73 177 200 108 60 -100 -91 -182 -120 -52 25 145 137 110 110 -52 -115 -149 -113 -64 -20 74 96 188 103 -36
6166 -36 -63 -120 -176 -76 56 87 139 135 82 7 -93 -134 -144 -106 -43 54 143 113 85 -37 -54 -135 -107 -102 10 -15 155 156 90
6195 90 19 -72 -165 -93 -108 -84 63 89 149 97 24 -10 -154 -145 -185 56 85 102 146 84 76 -19 -123 -113 -166 -21 2 122
6223 122 197 141 23 12 -66 -173 -96 -45 -55 164 130 104 30 -3 -87 -136 -138 -48 -42 70 141 121 82 19 -108 -111 -123 -61 -39
6252 -39 77 112 95 92 -33 -32 -114 -140 -63 19 56 119 119 123 5 -103 -123 -124 -137 -38 84 120 170 82 -29 -28 -140 -96 -73 6
6282 6 16 107 61 92 19 -29 -116 -117 -123 -68 33 69 147 120 -3 -82 -34 -70 -63 -64 56 79 121 149 100 -50 -67 -96 -88 -43 11
6313 11 64 93 87 65 -30 -25 -29 -69 -56 -27 51 123 118 30 20 -75 -73 -100 -60 3 70 115 114 40 -22 -42 -5 -120 -76 -17 54 95 57
6346 57 73 -3 -52 -58 -62 -79 -48 63 70 102 73 24 -27 -3 -98 -85 -6 33 105 42 57 -19 -65 -136 -85 -88 1 34 49 67 126 46
6378 46 40 -109 -100 -12 -62 13 35 64 62 36 41 0 -72 -88 -27 -10 60 96 95 26 -23 -32 -69 -107 -64 45 46 59 108 41 3 -59 -48
6411 -48 -81 -40 -33 26 115 54 -10 34 30 -34 -56 -55 -26 -17 53 50 82 25 17 5 -26 6 -24 5 58 106 92 26 -11 0 -30 -43 -41 61
6445 61 58 57 28 2 60 -18 -34 -71 9 10 29 114 65 5 -18 -20 -32 -24 -31 -20 39 1 -25 32 38 -37 -40 -36 -50 1 -24 42 34 43 40 21
6481 21 -49 -28 -50 -28 -2 0 30 7 19 53 -53 -32 -70 -53 54 11 95 39 45 29 -37 -52 3 -40 20 -2 18 -34 -6 20
6511 20 12 22 -45 4 -9 3 45 27 9 -8 10 38 -43 -25 21 16 59 70 39 7 -9 10 -71 15 -23 27 55 52 50 -3 11 -5
6543 -5 -19 -33 -4 6 -27 4 66 31 -4 -33 -48 -3 12 35 30 10 55 48 -4 28 -38 -56 -66 -4 20 22 -5 79 -19 -15 -35 -46 -27
6576 -27 -7 -48 -42 21 13 36 -22 -15 -40 -31 3 31 -12 58 98 28 -1 16 -31 11 42 11 37 -3 47 -37 -44 -29 -33 -71 -22 -36 -58
6609 -58 9 -44 27 42 40 -15 -45 -56 -19 -18 -20 27 84 -15 17 4 14 6 -37 40 11 22 29 51 20 -1 -15 -74 -36 -6 50 9 54
6642 54 -30 31 36 -2 -16 35 -19 -12 -11 3 36 17 -27 14 -26 13 8 18 62 28 63 2 -26 -12 -13 -50 -38 41 -7 -2 -17 -21 3 -14
6676 -14 -27 -92 -11 -8 25 0 1 39 33 35 19 19 -32 -30 6 6 6 10 15 -21 -35 -27 -36 9 -7 12 -18 32 77 3 22 -25 -17 -29 -26 -14 31
6713 31 37 14 34 -15 -54 -56 -49 -1 18 39 47 86 33 -21 -88 -60 -27 -44 21 51 66 69 41 13 1 -41 -2 -46 -21 49 47 28 -3
6746 -3 -28 -4 -43 -51 -31 -14 63 28 25 -4 11 6 -57 -49 -8 -4 16 42 96 -33 1 -49 -3 -57 -44 -34 -11 29 40 7 17 -16 -64
6779 -64 -34 31 -24 48 82 6 -7 -2 -31 -79 -71 12 8 6 46 75 41 8 10 -38 -37 -53 -50 56 24 86 28 -16 -38 -46 -22 -31 -37 -6 38
6814 38 30 9 14 -11 16 -6 -54 -47 2 -5 39 15 27 -11 -50 -70 -55 -29 25 47 46 58 37 -25 -22 6 -16 -6 -55 27 35 36 48 -13
6848 -13 -36 -49 5 -60 17 32 81 17 30 -7 -61 -1 -36 41 4 14 62 105 -27 15 -30 -1 -39 -38 -28 41 41 100 80 48 -1
6879 -1 21 -14 -38 -71 10 29 32 34 57 -27 -31 -87 -49 27 12 32 43 8 8 36 -75 -4 12 -28 0 48 30 109 37 48 -36 -25
6911 -25 -41 -17 46 -8 50 87 -2 -25 -44 -65 -99 -46 11 19 -11 11 25 -33 -40 31 -13 -26 -36 -21 89 25 105 35 -49 -86 -79
6942 -79 -66 16 -1 -28 35 25 24 -42 -19 -17 -93 -30 57 37 75 56 -7 -3 -47 -69 -87 -65 -15 52 52 -6 29 17 8 -56 -65 -47 7
6975 7 9 41 52 31 -24 27 -60 -49 -50 -7 21 114 19 31 11 -11 14 -48 -47 68 12 9 48 -29 35 -43 2 -25 -27 -33 1 28 55
7008 55 37 -24 -32 -51 -38 -62 -4 21 60 25 -11 12 -48 11 -36 -5 34 -25 -2 50 42 35 -24 -65 -90 -59 -46 30 -50 57 40
7039 40 23 -10 -50 -61 -69 -21 -4 4 23 57 26 -20 -73 -78 7 47 28 51 80 64 -17 -6 -46 -64 -32 -26 -30 3 45 50 22 -9 -71
7072 -71 -38 -77 -54 8 35 62 36 -25 -36 -18 -39 -14 -60 -9 28 44 35 19 68 3 -8 -50 -78 17 50 72 83 -2 -19 -3 3
7103 3 -66 -23 39 -6 72 57 20 26 -41 -71 -13 -29 -73 21 -1 24 41 36 -26 -88 -12 -10 -24 39 74 -13 18 -75 44 37 -114 -23
7135 -23 -21 -16 48 32 60 11 -19 -1 -8 -40 -28 -8 42 -11 51 38 37 0 -17 -39 -7 -17 0 53 31 1 -2 -50 28 -70 -33 -97 26
7168 26 -2 20 95 78 3 -57 -56 -68 16 23 -5 36 -12 -5 -41 -19 -39 -27 -27 -2 10 30 88 45 -46 -53 -2 -50 38 34 86 86 44 -11
7202 -11 -10 -5 -55 -35 -8 -35 62 95 69 41 7 -12 -26 -16 20 16 43 38 35 34 26 -41 -28 -18 -34 -8 76 0 -14 -11 -27 -10 -94 -19
7236 -19 -56 16 70 40 50 24 -10 -11 -51 -90 -12 -40 44 43 1 24 14 -6 -7 -59 2 10 -15 16 10 27 6 -41 -2 17 -8 -1 15
7269 15 30 19 13 5 -10 -55 6 -2 -18 -21 18 42 3 -95 -57 -66 -68 4 14 44 15 11 -31 24 -5 -8 -70 7 24 -18 38 62 54 1 -26
7304 -26 -44 -17 -5 -30 21 59 64 41 14 1 -58 -70 39 -7 18 9 25 66 22 -35 -39 -40 -22 -1 37 25 40 -5 -11 -68 -61 -32 71
7337 71 -38 58 104 -25 0 -14 9 -59 31 -51 -26 49 7 46 21 -22 -13 -3 -28 -64 -28 -65 22 -41 -28 16 -2 -6 -4 -47 -70
7368 -70 71 46 23 21 -13 -57 -31 -2 -61 -51 -32 7 47 3 10 -22 31 -48 -2 -5 -4 -3 17 -3 -31 12 7 -63 -10 -4 57 -7 7
7401 7 18 -10 30 -3 -38 -4 -14 30 11 25 8 37 28 -1 -16 6 23 20 -23 28 56 -42 -10 37 -40 -88 -27 7 61 56 35 -22
7433 -22 1 -15 -46 -8 8 0 -2 49 69 -33 17 -57 6 -71 -27 4 9 -10 5 -28 11 -36 -47 -17 -46 61 51 24 87 31 17
7464 17 -16 25 9 -26 -4 13 6 54 6 -15 -42 17 -36 19 1 53 108 29 67 6 18 -28 29 -36 -2 43 32 -3 -19 52 -24
7495 -24 -58 -7 -42 -33 64 -16 23 51 31 1 -15 -16 -11 -13 2 38 49 35 5 -24 -63 33 -8 -57 50 32 69 -58 37 -15 -18 10
7527 10 -40 11 12 54 81 34 8 2 -22 -14 -73 4 -71 20 -12 56 14 41 -5 -48 -6 -6 45 4 33 28 24 8 -6 -37 -6 49 41 35
7561 35 12 36 11 6 -55 2 -80 7 -15 2 39 67 -3 -18 -40 -86 -13 -17 -15 26 59 84 -23 2 -1 -38 24 27 -47 40 37 40 -8
7594 -8 2 81 -54 8 19 -33 0 6 -17 40 -10 -36 -16 -61 -17 -10 -12 13 72 -14 -1 -30 -58 -38 -29 -24 25 16 9 18 -30 -6 -38 -28
7628 -28 -4 31 35 58 42 59 50 -28 6 17 0 19 63 37 30 35 42 -6 -30 -42 33 -26 -10 13 4 16 -3 2 65 8 -20 -19 -33 15
7662 15 9 0 28 -38 -58 1 -34 12 -5 23 55 41 22 4 -13 -24 -20 14 -10 12 23 59 63 -4 12 -33 35 -32 18 23 118 -13
7694 -13 41 25 17 31 -24 -16 -2 52 46 7 71 30 -11 -16 -39 -1 -54 46 -12 22 -5 -28 23 18 -31 -11 28 22 36 56 45 50 31
7727 31 -16 -5 -52 8 20 5 59 54 11 27 19 -26 -15 15 -13 19 -7 39 44 -7 -32 -20 -24 22 -7 62 64 -3 -24 34 -45 23 -97
7760 -97 -79 23 24 26 -7 41 18 -14 -11 1 32 13 17 59 42 -15 15 -30 -38 2 -29 -21 -60 7 72 12 98 34 30 13 -14 -2 47
7793 47 21 43 74 -32 41 22 -76 -27 21 -46 45 -7 -11 35 27 43 -42 -3 -20 -11 -11 -17 -4 21 -21 -15 -28 -11 -57 32 -27 44 71
7826 71 5 39 -32 -84 -46 -45 37 12 50 -16 9 20 -12 -25 -1 42 23 -10 24 -7 -3 57 -76 -32 -32 -13 -49 25 20 9 32 9
7858 9 3 -63 -19 -61 7 10 0 30 27 48 9 29 -32 -22 9 -31 -21 49 23 -31 39 -55 -61 -28 -3 29 27 4 52 14 -4 -31 -60
7891 -60 -2 -37 25 54 21 60 38 62 16 -20 -8 -46 -4 -30 -35 39 27 1 76 -9 -57 -22 -20 -7 -27 58 38 29 -8 -20 -27 -50
7923 -50 -26 -19 40 -5 17 9 -43 -38 -34 19 30 4 -7 55 -2 1 17 17 -29 -38 3 -60 -44 10 -2 -43 -11 -8 -11 43 -59 -46 27 24 64
7958 64 52 -13 -17 -33 2 -59 -32 34 44 12 -38 -10 -32 -29 -28 14 -16 25 47 42 -15 16 -2 -66 -6 -28 -10 4 39 -14 53 -23
7990 -23 -42 17 -19 -42 -25 35 -11 4 16 27 -40 -15 24 -25 -3 10 -24 -17 8 -48 -7 -35 5 -68 24 -11 -22 -23 30 24 15 0
8022 0 -29 -48 14 -36 8 42 21 29 38 58 -57 -11 10 39 43 -41 113 57 9 6 19 -47 -44 -18 5 33 24 37 -26 18 7 -29 15
8055 15 -23 25 5 10 33 -9 58 -56 -39 -45 18 -17 90 54 29 -21 16 -34 -1 -89 -20 -28 -23 27 -5 -6 5 -34 -36 -58 -25 10
8087 10 56 -4 65 42 8 -6 -27 -10 -65 -23 20 44 34 24 40 44 -19 -36 -40 -37 22 17 34 27 29 2 12 -5 -9 0 36 16 58 46
8121 46 28 -10 -3 44 -19 -1 52 0 13 18 3 -29 1 -8 0 -14 -23 -8 29 13 -31 16 -51 -15 -28 16 7 6 34 12 64 38 -5 -48
8155 -48 -29 -16 -17 6 24 6 69 1 41 2 57 -30 -37 1 58 38 -20 -12 8 -74 15 28 -7 -51 3 39 24 13 -39 18 -16 -19
8187 -19 -66 -23 12 47
8191D7
$$ Imaginary data points
##PAGE= N=2
##DATA TABLE= (X++(I..I)), XYDATA
0 0 0 0 0 0 0 0 0 0 0 0 0 8 -8 8 -8 8 -16 16 -24 25 -32 39 -43 51 -59 71 -82 96 -109 125 -142 164 -186 211
34 211 -238 269 -301 337 -376 419 -468 519 -575 639 -704 778 -861 948 -1044 1150 -1267 1395
52 1395 -1540 1699 -1876 2078 -2307 2570 -2876 3238 -3671 4204 -4875 5755 -6954 8710 -11523
67 -11523 16761 -29915 136598 179376 -60184 -68674 -160286 -160706 -35225 -4723 -73718 75317
79 75317 212395 162534 92190 458 -217113 -245996 -61660 18352 22723 116217 112553 54284
91 54284 111592 80379 -134724 -214027 -142321 -90383 43093 205464 143558 25424 49176
102 49176 20522 -86025 -90873 -111471 -168734 -32300 170638 175065 118155 78270 -62327 -143592
114 -143592 -58079 -51347 -117327 -36430 70820 94733 164464 164924 -29446 -156471 -115447 -103401
126 -103401 -70972 47157 62462 24818 114234 151276 25008 -62196 -107836 -184778 -116777
137 -116777 61266 95920 66634 106167 72734 -8039 720 -43934 -168508 -140252 -8110
148 -8110 49546 115388 168629 62996 -44716 -23172 -48009 -117391 -79492 -36390 -28208 87219
160 87219 185535 101786 3648 -31343 -110800 -130068 -31666 -7217 -30887 57238 125649 86364
172 86364 70146 22137 -122388 -159366 -61289 -20341 9979 94374 88303 35252 69110 47841
184 47841 -79124 -120083 -90324 -85998 1429 126644 106359 42860 51677 6207 -70964 -59102
196 -59102 -65862 -111040 -31462 90974 100805 92981 83939 -22574 -97217 -54602 -52177 -81021 -15282
209 -15282 45343 49492 103682 119951 2270 -82501 -76176 -92826 -70883 25989 47697 24296
221 24296 79501 97936 19455 -24285 -56736 -128274 -98296 18968 53094 53464 90300 57530
233 57530 -7283 1621 -23879 -108745 -96083 -20866 10663 70212 127460 62027 -16820 -13572
245 -13572 -40685 -85270 -51228 -26091 -31245 45856 121426 79450 25055 -4562 -77877 -101827
257 -101827 -32669 -9591 -20244 37980 78199 55960 59470 33804 -71133 -110896 -58711 -32225
269 -32225 1904 69984 64932 25262 48341 37959 -41783 -71505 -67039 -77928 -16148 81424
281 81424 80235 43212 43694 3188 -48740 -34472 -41422 -81442 -35197 46080 62958 76077 76911
294 76911 -5103 -67105 -43306 -41923 -56758 -10625 22301 21640 69403 93671 19194 -42051 -52654
307 -52654 -78414 -61721 14390 33235 17038 53317 65541 19771 -533 -27290 -91309 -81936
319 -81936 -3883 27418 41699 72372 44101 -3943 4513 -10675 -69181 -66734 -27291 -10307
331 -10307 40841 94163 56126 955 -4849 -32099 -62603 -34725 -19789 -29554 21740 77699
343 77699 58742 32740 12900 -49771 -77457 -32755 -14733 -16327 27717 52201 34936 44725
355 44725 34859 -37252 -71154 -47082 -38578 -11354 47590 51010 23975 37274 26998 -26308 -42287
368 -42287 -42205 -59937 -24831 43439 52179 39426 44559 10039 -34413 -27850 -31072 -55934 -25677
381 -25677 23905 33281 49773 61837 11708 -34644 -30399 -39643 -49381 -10448 16909 15495 45131
394 45131 61872 17662 -16291 -24999 -54454 -54482 -4815 15422 15845 46012 49434 12167 -335
407 -335 -13651 -55954 -54673 -12028 3012 20151 55180 43291 7847 5002 -12999 -51454 -43356
420 -43356 -16659 -12130 18020 56883 41209 14847 10825 -19707 -51039 -33631 -18287 -18119 17668
433 17668 49694 34577 24230 19037 -22362 -48419 -30396 -24919 -19547 21641 42465 28026 30256
446 30256 22100 -22170 -39929 -28035 -33592 -20959 23054 35225 26510 36384 20698 -21970 -30646
459 -30646 -26795 -39296 -19518 20937 26105 27183 41496 18349 -18909 -22218 -28907 -43038 -16159
472 -16159 17185 18485 29543 42896 14738 -13142 -14541 -31578 -43915 -14058 10271 13162 33784
485 33784 42248 11579 -6929 -10131 -33972 -40640 -12061 1801 8860 36646 39931 11380 625
498 625 -9126 -36945 -36026 -10791 -5129 7104 36671 34522 13151 9075 -8582 -38195 -31961 -12981
512 -12981 -10785 9070 35984 27874 14977 15012 -8688 -35269 -26979 -17937 -16254 11130 34088 23862
526 23862 18655 17308 -10842 -30271 -21739 -22255 -19457 11380 28724 21507 24532 18491 -12635 -25367
540 -25367 -19272 -25931 -18812 11199 21510 19459 29084 18669 -11516 -19457 -19685 -29780 -16632 10691
554 10691 15284 18915 31158 16719 -8370 -12617 -20799 -32661 -14952 7983 10624 20870 31572
567 31572 13222 -4903 -6850 -21551 -32527 -13443 2484 6256 23867 31503 11116 -1103 -4368
580 -4368 -23028 -29215 -11274 -3429 2557 24907 29543 11681 4842 -3901 -25638 -26062 -9879 -7261
594 -7261 1705 23830 24461 12684 11360 -2646 -25992 -23880 -12302 -10749 4177 23608 19117 12566
608 12566 14661 -1739 -22184 -19865 -16753 -15861 5381 23435 17407 14657 14485 -4436 -17868 -13942
622 -13942 -18297 -18964 3269 18577 16888 20867 15854 -7513 -16637 -12244 -18352 -16053 3057 10638
636 10638 12862 24504 18786 -4653 -13446 -15482 -22678 -12732 6061 7517 10166 21997 16177 264
650 264 -4911 -15554 -27530 -14808 4068 7677 14590 21317 9663 -118 453 -11678 -24536 -15574
664 -15574 -4159 2675 18983 25514 9498 -660 -2109 -13262 -18255 -9562 -8102 -4423 15558
677 15558 24582 14312 7028 -2919 -19912 -18975 -6279 -5708 -2443 11988 15459 12650 15053 3093
691 3093 -18804 -21038 -12562 -8819 3614 16453 11342 7653 13048 4436 -10889 -14085 -17052 -17399
705 -17399 1365 18213 15085 11563 9873 -2714 -9631 -6404 -12988 -18069 -3809 9954 13931 19870
719 19870 15005 -5043 -13033 -8900 -12017 -11083 -490 2814 6146 19337 18866 1594 -8269 -13515
733 -13515 -19541 -10346 4653 4895 5298 14214 12587 4371 1496 -9469 -22765 -15394 -211 5161
747 5161 12145 16700 6775 118 2782 -5313 -16481 -13306 -7774 -2476 13195 21372 10277 1416
761 1416 -1288 -9909 -12876 -6326 -7144 -6692 7827 17150 13210 9655 1083 -14517 -16039 -6535 -5092
776 -5092 -2394 7565 9733 8821 13256 6436 -10535 -15411 -12192 -10162 507 12148 9417 6165 9935
791 9935 4486 -5704 -8231 -12513 -15795 -3284 10813 11520 11261 10078 -741 -7080 -4531 -8959 -13671
806 -13671 -4983 3989 7910 15429 14618 137 -7992 -7501 -10897 -9641 -880 1261 3014 13056 14786
821 14786 4481 -2356 -8294 -16007 -11093 666 2910 4445 10991 9537 4036 3222 -4394 -15719
835 -15719 -13238 -3969 751 8355 14100 7454 1538 2506 -3345 -11278 -9642 -7423 -5038 7077 15716
850 15716 10088 4422 1064 -7540 -10516 -5400 -5847 -6233 3940 11117 10030 10102 4377 -9047 -12748
865 -12748 -7100 -5827 -2605 5575 6666 5981 10667 7200 -5044 -10172 -10436 -10865 -2252 8596 7843
880 7843 5639 8144 4112 -2851 -4231 -8784 -13751 -5691 5702 8537 10340 9840 664 -5153 -3146
895 -3146 -6267 -10442 -5326 343 3893 11969 13803 3028 -4751 -6062 -9428 -8132 -961 161 445
910 445 8593 11928 6107 1343 -4987 -13608 -10993 -1047 1924 3597 8255 6723 3527 4655 -714
925 -714 -11151 -11852 -6167 -1797 6274 12370 6937 1420 2064 -1562 -7100 -6801 -7319 -6986 3075 12195
941 12195 10064 5726 1728 -6257 -8679 -3946 -4247 -5689 849 6583 8005 10261 6350 -5707 -10765
956 -10765 -7404 -5667 -1952 4384 4380 3556 8337 7586 -1205 -6456 -9223 -11150 -3733 6510 7025 5079
972 5079 6251 2980 -1311 -1446 -5786 -11758 -7042 1937 6007 9683 9807 1281 -4241 -2662 -4574 -7587
988 -7587 -4479 -1699 807 8896 12391 4890 -1910 -4913 -8866 -7408 -863 22 -240 5754 8835 5829
1004 5829 3437 -2025 -10738 -10396 -2907 545 3246 7240 5507 2696 4230 818 -7521 -9264 -6520
1019 -6520 -3869 3729 10357 6995 2491 2071 -1609 -5581 -4737 -5672 -6723 629 8464 8343 6604 3518
1035 3518 -4359 -7668 -4171 -4028 -4586 597 4475 5322 8401 6767 -2523 -7534 -6636 -6533 -3120 3385
1051 3385 4158 3322 6614 6013 -196 -3666 -6414 -9626 -5052 3223 5197 5295 6654 3077 -1251 -1372
1067 -1372 -4268 -8822 -5958 23 3011 7242 9152 3166 -2101 -2375 -4867 -6873 -3556 -1209 38
1082 38 6118 9460 4837 617 -2429 -7405 -7562 -2195 -572 218 5179 6811 4303 3405 -274 -7491
1098 -7491 -8439 -3991 -1635 1880 6690 5543 2837 3403 470 -5605 -6497 -5273 -4494 1252 7528 6350
1114 6350 3779 2971 -1246 -5176 -4201 -4535 -5419 -76 5546 5990 6133 4565 -2132 -5960 -4294 -4512 -4223
1131 -4223 670 3529 3876 6612 6059 -739 -4804 -5305 -6645 -4056 2053 3489 3210 5861 4894 40
1147 40 -2025 -4427 -8078 -5259 1196 3256 4798 6555 3278 -836 -937 -3311 -7105 -4993 -987 1213
1163 1213 5444 8193 3861 -630 -1618 -4371 -6050 -3065 -1411 -719 4250 7586 4698 1785 -883
1178 -883 -5948 -6896 -2748 -1017 -41 4123 5436 3658 3592 941 -5382 -7092 -4288 -2623 907 5542
1194 5542 4942 2579 3229 968 -3905 -4914 -4755 -4922 -248 5643 5610 4021 3323 -726 -4169 -3276 -3778
1211 -3778 -4953 -1024 3534 4573 5837 5100 -797 -4624 -3925 -4275 -3876 182 2315 2622 5462 5774
1227 5774 683 -2952 -4285 -6281 -4305 1025 2680 2706 4893 4277 754 -709 -2991 -6839 -5289 -321
1243 -321 1894 3986 6040 3382 -149 -393 -2490 -5710 -4351 -1722 -207 3852 6935 4095 682
1258 682 -581 -3691 -5486 -2980 -1667 -1123 2983 5944 4176 2688 583 -4339 -5981 -3158 -1877
1273 -1877 -570 3425 4597 3127 3354 1549 -3592 -5306 -3907 -3489 -561 4077 4467 3064 3370 1108
1289 1108 -3129 -3886 -3771 -4475 -1179 3547 4111 3942 4065 447 -3214 -3115 -3685 -4520 -1017 2542 3121 4466
1307 4466 4826 619 -2710 -2924 -4382 -4477 -528 1921 2383 4621 4717 781 -1517 -2518 -4993 -4488 -571
1324 -571 1210 2354 4934 4245 803 -625 -2297 -5143 -4161 -980 229 2295 5241 3974 1156 222
1340 222 -2379 -5158 -3695 -1397 -491 2407 4996 3565 1727 900 -2378 -4938 -3521 -2178 -1039 2646
1356 2646 4807 3168 2273 1261 -2465 -4318 -3092 -2903 -1620 2615 4308 3261 3138 1334 -2699 -3746
1372 -3746 -2849 -3308 -1637 2292 3333 3221 3904 1560 -2543 -3337 -3247 -3742 -1169 2236 2618 3101 4170
1389 4170 1548 -1779 -2582 -3684 -4410 -1185 1948 2331 3499 4055 1114 -1206 -1722 -3704 -4390 -1407
1405 -1407 1020 1928 4116 4156 916 -761 -1523 -3796 -3877 -1267 -18 1359 4286 4134 1354 -33 -1651
1422 -1651 -4214 -3556 -1155 -510 1229 4045 3571 1731 1027 -1491 -4336 -3430 -1697 -927 1619 3929
1438 3929 2920 1930 1557 -1387 -3777 -3076 -2375 -1610 1700 3809 2812 2281 1589 -1553 -3289 -2611 -2811
1455 -2811 -2034 1434 3220 2779 3029 1756 -1684 -2887 -2455 -3088 -1868 1334 2346 2588 3607 2003
1471 2003 -1399 -2366 -2689 -3459 -1574 1278 1751 2515 3594 1805 -761 -1495 -2946 -3864 -1530 924 1559
1488 1559 2862 3515 1379 -408 -986 -2847 -3791 -1715 101 1055 3262 3678 1337 -65 -847 -2946
1504 -2946 -3347 -1445 -610 534 3196 3529 1739 679 -875 -3351 -3077 -1309 -871 481 2904 2898 1869
1521 1869 1590 -542 -3296 -3029 -1853 -1297 929 2909 2346 1759 1838 -366 -2588 -2555 -2572 -2033 859 3008
1539 3008 2382 2118 1584 -814 -2102 -1749 -2494 -2420 302 2146 2432 3079 1977 -1047 -2151 -1838 -2454 -1813
1557 -1813 322 1129 1806 3284 2457 -324 -1621 -2361 -3190 -1577 772 1044 1528 2800 1990 300 -451
1574 -451 -2175 -3654 -2098 276 1038 2290 2892 1231 85 -15 -1607 -3077 -2155 -917 238 2684
1590 2684 3459 1491 146 -497 -2066 -2350 -1295 -1247 -523 1990 3126 2181 1365 -429 -2794 -2647 -1123
1607 -1123 -856 -23 1680 1974 1772 2150 481 -2314 -2836 -2155 -1507 574 2253 1697 1310 1733 469 -1315
1625 -1315 -1860 -2526 -2591 -10 2286 2227 2055 1435 -407 -1306 -1039 -1842 -2404 -590 1036 1867 2982 2321
1643 2321 -358 -1646 -1570 -1990 -1481 -62 310 924 2664 2615 550 -827 -1933 -3028 -1711 325 625
1660 625 1100 2069 1660 752 381 -1294 -3074 -2220 -522 543 1860 2545 1188 224 343 -915 -2236
1677 -2236 -1838 -1345 -545 1826 2934 1784 656 -81 -1620 -1931 -1077 -1211 -874 1083 2247 1954 1658
1694 1658 320 -2003 -2311 -1329 -1088 -273 1118 1350 1399 2034 943 -1269 -2050 -1987 -1822 -119 1621 1523
1712 1523 1304 1590 569 -730 -1080 -1907 -2408 -656 1256 1681 1929 1721 8 -986 -787 -1519 -2002 -709
1730 -709 317 1053 2331 2262 359 -884 -1202 -1814 -1509 -251 130 547 1930 2130 883 10 -1194 -2446
1748 -2446 -1860 -303 273 873 1784 1452 715 566 -610 -2198 -1977 -972 -152 1245 2163 1303 535 397
1766 397 -626 -1600 -1390 -1243 -900 978 2214 1644 1041 292 -1135 -1638 -1030 -987 -865 554 1455 1544 1704
1785 1704 866 -1161 -1840 -1356 -1173 -415 786 986 1032 1596 1068 -541 -1363 -1701 -1871 -522 1030 1195
1803 1195 1155 1369 588 -280 -589 -1289 -2114 -984 492 1117 1676 1704 236 -636 -570 -1140 -1532 -848 -201 397
1823 397 1787 2104 759 -323 -867 -1653 -1375 -350 -83 127 1304 1653 1097 509 -625 -1968 -1782 -514
1841 -514 31 614 1328 1059 647 755 -55 -1522 -1646 -1149 -613 799 1842 1200 513 418 -336 -1057 -970 -1205
1861 -1205 -1107 262 1559 1569 1227 506 -903 -1303 -804 -813 -880 137 829 1154 1685 1128 -543 -1401 -1286 -1144
1881 -1144 -486 575 657 653 1329 1161 8 -715 -1431 -1824 -839 660 926 1051 1163 553 -84 -263 -870 -1730
1901 -1730 -1135 -37 726 1488 1716 543 -401 -473 -874 -1246 -702 -428 81 1236 1814 936 112 -605 -1405
1920 -1405 -1237 -356 -141 35 882 1300 916 750 -175 -1537 -1568 -801 -207 449 1179 939 639 691 75 -1006
1940 -1006 -1281 -1161 -885 370 1379 1168 728 511 -255 -874 -818 -945 -1052 -5 1139 1200 1196 789 -412
1959 -412 -1066 -812 -834 -784 93 589 799 1299 1140 -188 -908 -1046 -1206 -698 350 596 682 1167 963 100
1979 100 -442 -950 -1496 -929 265 589 910 1202 655 -32 -207 -722 -1329 -923 -200 321 1121 1471 662 -90
1999 -90 -295 -877 -1174 -696 -403 -48 920 1394 897 401 -204 -1081 -1227 -589 -229 33 861 1051 785 610
2019 610 -6 -1010 -1270 -794 -545 196 1037 966 611 689 55 -838 -956 -964 -786 135 1032 1034 791 655 -128 -834
2041 -834 -759 -849 -894 -35 711 907 1123 828 -183 -768 -730 -917 -678 91 470 667 1079 894 -1 -659 -848
2062 -848 -1119 -711 198 459 659 1056 801 52 -316 -728 -1255 -854 23 453 787 1127 602 16 -108 -618
2082 -618 -1093 -796 -320 99 868 1282 666 66 -259 -861 -1009 -519 -312 -72 698 1153 784 399 -116 -975
2102 -975 -1083 -593 -259 32 691 870 636 595 7 -853 -1041 -769 -567 81 894 840 611 557 3 -662 -804
2123 -804 -868 -795 113 820 871 800 607 -162 -684 -588 -726 -774 -111 557 738 1029 831 -153 -701 -725 -824 -654 17
2146 17 354 532 920 858 56 -393 -766 -1081 -663 114 439 625 883 633 58 -189 -577 -1118 -729 -43 302
2167 302 766 1031 561 38 -120 -586 -1003 -707 -261 31 755 1083 620 147 -76 -730 -921 -520 -297 -10
2187 -10 640 988 635 403 -14 -797 -919 -563 -354 42 688 827 541 504 -14 -714 -809 -643 -529 20 722
2208 722 725 610 589 -8 -625 -706 -695 -643 12 634 645 707 640 -78 -655 -587 -736 -664 15 553 617 823 652 -39
2232 -39 -438 -599 -822 -650 -1 378 601 881 679 -21 -348 -591 -930 -668 1 185 588 969 743 108
2252 108 -235 -660 -954 -531 -21 158 513 929 611 189 -108 -647 -948 -554 -141 159 638 853 465 204
2272 204 -27 -642 -908 -581 -364 45 681 894 480 297 19 -615 -785 -508 -470 -81 593 760 580 436
2292 436 -62 -677 -766 -492 -500 37 574 690 673 601 33 -624 -689 -670 -577 95 530 539 583 588 29 -492 -574 -793 -630
2317 -630 18 487 602 731 543 -72 -371 -539 -776 -649 -67 346 580 859 550 -1 -279 -560 -822 -545
2337 -545 -101 140 522 818 599 34 -225 -598 -847 -448 -91 110 544 819 518 205 -47 -594 -914 -514
2357 -514 -178 78 631 771 490 291 10 -547 -733 -531 -338 70 621 760 501 279 -96 -693 -687 -566 -415
2378 -415 -9 570 693 554 488 -69 -562 -663 -545 -495 19 439 514 611 552 21 -590 -669 -652 -520 99 496
2400 496 515 552 524 21 -304 -534 -716 -618 -8 428 589 692 558 -19 -327 -426 -745 -570 -34 217 512 866
2422 866 512 -11 -254 -491 -723 -461 -127 97 427 797 527 132 -120 -592 -777 -482 -72 85 491 734
2442 734 414 331 49 -526 -795 -524 -226 120 628 709 421 227 -31 -467 -676 -525 -400 13 568 691 503
2463 503 221 -31 -555 -574 -415 -395 -101 449 580 579 477 -49 -602 -608 -468 -362 -4 356 377 520 547 102 -387
2486 -387 -580 -637 -505 34 402 422 481 447 110 -181 -366 -645 -710 -50 339 534 674 397 -42 -267 -293 -540
2508 -540 -580 -184 108 413 788 580 19 -216 -510 -635 -352 -46 10 261 666 579 283 -84 -498 -776 -455
2529 -455 -78 75 385 477 342 260 138 -375 -718 -586 -315 90 594 615 373 200 13 -265 -440 -460 -472 -127
2551 -127 446 647 492 304 -61 -400 -452 -320 -366 -156 232 451 520 526 81 -425 -534 -451 -338 23 281 251
2573 251 405 506 144 -254 -478 -596 -469 27 385 386 471 350 93 -79 -213 -577 -591 -169 215 455 587
2594 587 448 20 -142 -338 -450 -439 -254 6 308 653 526 143 -110 -409 -503 -347 -97 -47 209 532 459
2615 459 284 72 -282 -636 -456 -209 -48 273 475 327 296 193 -253 -504 -470 -348 -84 424 523 329 252
2636 252 111 -252 -393 -333 -428 -212 231 463 407 403 38 -332 -332 -429 -344 -194 130 344 454 542 186 -236 -405
2659 -405 -435 -416 -82 219 216 350 426 278 -147 -262 -543 -481 -84 227 318 427 405 102 -77 -150 -436 -469 -185
2682 -185 54 292 548 383 112 -67 -222 -397 -387 -189 -72 129 562 469 243 37 -255 -489 -309 -183 -43
2703 -43 133 371 374 288 161 -182 -508 -466 -244 -87 259 379 318 251 200 -109 -402 -435 -401 -189 206 447 344
2726 344 284 65 -113 -268 -302 -323 -200 162 302 368 399 171 -235 -318 -307 -319 -192 34 252 357 417 277 -120
2749 -120 -267 -418 -337 -74 77 131 237 364 234 9 -163 -406 -488 -185 83 189 343 299 147 65 -14 -281
2771 -281 -437 -286 -88 121 430 424 109 -12 -86 -266 -284 -259 -179 36 308 403 260 57 -110 -385 -306 -152 -42
2794 -42 71 239 284 363 263 -45 -279 -394 -249 -101 106 294 209 216 205 32 -210 -352 -406 -309 86 292 235
2817 235 314 165 5 -147 -222 -314 -319 -61 169 361 390 281 -72 -158 -164 -294 -185 -57 46 161 385 325 15
2840 15 -87 -249 -346 -200 -44 55 218 348 217 93 -17 -190 -376 -278 -106 41 209 268 177 96 33 -190 -337
2863 -337 -241 -192 -33 222 372 251 165 -20 -212 -232 -239 -231 -100 197 255 292 246 94 -190 -298 -241 -159 -7 138
2887 138 241 330 236 130 -133 -248 -300 -287 -39 160 209 302 211 138 -59 -183 -322 -352 -105 57 215 305 260 84
2911 84 -51 -197 -289 -318 -123 18 140 363 379 169 -24 -194 -336 -265 -137 -9 114 296 317 190 37 -184
2933 -184 -302 -271 -148 -53 141 297 320 247 78 -64 -379 -344 -203 -76 127 322 256 232 164 -83 -304 -283 -276 -133
2957 -133 128 287 307 254 146 -103 -327 -272 -278 -136 91 276 277 310 211 -47 -319 -266 -295 -158 90 181 206 348
2981 348 258 -40 -171 -287 -400 -209 99 136 272 328 160 -18 -150 -316 -416 -245 -8 206 287 371 213 1
3003 1 -70 -242 -391 -228 -6 38 329 413 218 78 -56 -376 -381 -213 -119 13 238 329 258 136 -24 -369 -384 -241
3027 -241 -156 143 307 350 219 262 40 -284 -388 -314 -179 114 354 319 258 185 -3 -231 -319 -363 -280 -58 283
3050 283 327 356 221 -27 -295 -274 -332 -275 31 241 324 396 241 -32 -232 -344 -402 -254 -11 116 250 376 268
3073 268 7 -114 -287 -424 -251 -1 159 297 341 280 32 -60 -261 -420 -327 -42 86 285 417 214 44
3094 44 -95 -295 -476 -255 -117 47 283 425 306 107 -19 -260 -374 -235 -128 -22 316 352 300 220 -31
3115 -31 -331 -376 -297 -252 51 305 378 300 243 14 -280 -351 -336 -210 8 267 325 274 219 -23 -252 -343 -328 -243 -29
3140 -29 250 265 364 303 20 -210 -308 -374 -295 0 196 304 383 256 33 -167 -316 -412 -292 -58 146 310 392
3163 392 339 5 -147 -277 -385 -240 -67 114 224 357 348 88 -73 -374 -363 -253 -83 59 308 367 284 158
3185 158 -70 -363 -370 -296 -113 63 365 365 215 155 -60 -252 -372 -279 -178 59 349 398 216 183 3 -245 -330
3208 -330 -313 -223 -25 244 380 289 264 -70 -343 -333 -258 -220 59 213 342 336 340 5 -271 -338 -349 -244 10 192
3232 192 283 360 250 17 -143 -275 -389 -300 -24 191 254 389 224 9 -123 -253 -335 -292 -90 126 371 408
3254 408 321 -13 -130 -288 -397 -270 -67 112 252 426 204 86 -88 -291 -426 -202 -38 68 294 424
3274 424 220 119 8 -325 -369 -311 -70 70 318 382 199 149 -17 -311 -399 -312 -227 74 293 386 231 162 -34
3297 -34 -316 -311 -279 -240 -15 253 393 333 285 -42 -316 -308 -335 -192 80 269 323 342 246 12 -272 -296 -335 -229 50
3322 50 229 284 352 267 -68 -242 -263 -410 -236 19 239 323 437 235 -89 -173 -250 -359 -261 -1 103 386 434
3345 434 240 3 -123 -300 -370 -217 -15 78 289 429 281 113 -133 -375 -455 -158 -76 42 323 367 238 98
3367 98 -45 -319 -395 -223 -89 112 364 396 181 124 -29 -344 -371 -241 -152 93 304 454 247 103 -106 -319
3389 -319 -238 -220 -183 27 255 331 360 192 -175 -340 -382 -285 -136 126 255 228 345 228 -27 -282 -402 -388 -174
3412 -174 121 259 290 240 170 -66 -151 -246 -409 -325 103 229 372 390 91 -125 -203 -275 -343 -222 -38 91 360
3435 360 462 185 -53 -208 -347 -343 -160 24 83 318 429 223 87 -173 -417 -430 -164 40 122 338 318 195
3457 195 91 -54 -355 -423 -276 -105 150 394 389 186 54 -123 -317 -308 -267 -154 93 384 424 286 141 -204
3479 -204 -353 -329 -209 -122 95 283 324 334 197 -131 -387 -373 -318 -124 160 267 239 321 221 -123 -282 -425 -430
3502 -430 -201 165 306 384 270 125 -84 -239 -354 -393 -205 92 299 408 399 141 -135 -262 -331 -324 -139 41
3524 41 148 377 495 168 -49 -241 -413 -347 -187 53 195 266 418 251 55 -158 -481 -406 -167 10 197
3545 197 400 302 151 69 -189 -401 -386 -277 -132 274 449 369 214 45 -211 -406 -309 -217 -117 130 400 352
3567 352 271 147 -233 -461 -374 -242 -94 124 314 299 332 135 -187 -375 -387 -348 -137 254 313 274 309 194 -79
3590 -79 -253 -415 -405 -201 190 345 368 327 79 -168 -271 -338 -391 -150 80 258 401 372 108 -147 -236 -335 -311
3613 -311 -99 17 177 375 452 217 -34 -227 -472 -408 -184 62 178 356 364 183 56 -208 -521 -465 -252 40
3635 40 266 437 291 148 73 -144 -356 -390 -323 -124 183 515 395 156 53 -202 -336 -344 -189 -112 166 411
3657 411 401 346 103 -212 -441 -399 -283 -137 160 284 328 303 171 -143 -389 -435 -365 -130 204 350 315 302 167
3680 167 -82 -253 -424 -386 -223 189 368 449 339 25 -150 -263 -314 -397 -215 106 217 475 433 206 -132 -259
3702 -259 -321 -367 -103 5 168 374 446 224 -44 -264 -493 -392 -106 66 227 340 381 188 83 -192 -473
3723 -473 -463 -265 -11 303 437 373 202 28 -144 -386 -421 -299 -133 246 509 429 261 44 -239 -410 -346 -274
3745 -274 -164 134 409 407 346 143 -218 -455 -395 -348 -188 230 340 366 377 166 -199 -399 -454 -430 -158 189 377
3768 377 344 398 178 -122 -285 -408 -468 -188 178 368 459 377 144 -136 -256 -381 -444 -232 58 218 451 457 182
3791 182 -94 -291 -428 -421 -136 56 168 418 418 224 -18 -242 -476 -434 -167 34 183 405 412 251 0 -188
3813 -188 -478 -466 -219 -100 196 398 427 233 77 -161 -430 -381 -284 -101 190 492 409 343 73 -255 -378 -410
3835 -410 -350 -152 120 390 417 361 137 -203 -437 -380 -352 -162 123 317 401 397 203 -92 -381 -374 -377 -160 164 305
3859 305 388 374 204 -163 -310 -418 -473 -207 88 290 397 491 179 -53 -201 -427 -422 -189 15 235 412 447
3881 447 173 -16 -219 -453 -426 -211 17 201 494 443 254 14 -257 -427 -479 -254 -40 189 488 385 288
3902 288 99 -181 -425 -475 -277 -124 201 473 452 316 79 -134 -426 -427 -326 -167 148 397 410 333 124 -175
3924 -175 -404 -363 -376 -185 134 361 399 429 240 -169 -352 -425 -384 -238 157 358 412 380 231 -53 -330 -423 -418 -195
3948 -195 101 346 357 435 194 -57 -263 -374 -453 -295 61 268 484 480 231 -23 -226 -410 -468 -244 -2 192
3970 192 397 476 257 -27 -246 -444 -510 -213 -29 143 383 453 243 90 -216 -448 -475 -247 -104 184 429
3991 429 443 261 77 -104 -414 -465 -324 -86 168 420 423 290 137 -168 -343 -404 -330 -184 48 368 383 295 163
4014 163 -130 -355 -403 -399 -169 127 320 359 451 255 -144 -297 -350 -367 -264 46 270 353 494 269 -111 -295 -394
4037 -394 -413 -183 67 286 385 508 258 -21 -191 -384 -454 -286 41 218 379 390 258 47 -158 -360 -480
4058 -480 -285 -4 193 417 413 245 47 -197 -320 -425 -257 -125 120 353 484 306 138 -158 -403 -406 -319 -179
4080 -179 100 389 429 354 184 -129 -356 -389 -316 -173 172 311 339 333 245 -37 -339 -365 -375 -193 123 335 361 306
4104 306 187 -36 -289 -370 -365 -217 48 280 373 397 238 -33 -256 -313 -385 -262 69 245 290 443 196 -41 -270
4127 -270 -381 -385 -247 -29 210 292 435 287 -2 -189 -396 -467 -220 12 153 371 368 286 25 -128 -277 -427
4149 -427 -330 -98 129 328 424 206 100 -101 -355 -414 -326 -146 63 332 459 321 158 -85 -335 -345 -302 -158
4171 -158 77 309 363 335 223 -44 -324 -371 -358 -224 14 297 332 309 217 -13 -281 -371 -352 -223 35 252 321
4194 321 307 301 34 -208 -339 -408 -281 17 234 382 422 284 -1 -239 -254 -314 -298 -5 108 355 429 356 37
4217 37 -115 -315 -456 -249 -13 135 309 370 285 108 -106 -316 -445 -297 -88 112 296 398 264 102 -5
4238 -5 -275 -396 -339 -182 31 280 405 308 146 -33 -283 -367 -324 -229 -91 299 373 329 233 0 -275 -357 -335 -203
4262 -203 -19 305 284 319 315 9 -282 -374 -350 -307 18 212 331 353 280 71 -224 -353 -395 -327 -70 241 262 405
4286 405 282 87 -153 -260 -370 -376 -89 147 265 428 325 24 -154 -275 -354 -302 -127 29 230 447 367 101
4308 101 -97 -344 -402 -317 -66 100 213 369 338 144 11 -284 -463 -342 -175 34 311 351 292 170 37 -210
4330 -210 -379 -355 -221 -24 298 445 347 140 -2 -195 -313 -287 -256 -61 141 353 365 297 34 -281 -418 -332
4352 -332 -234 -72 205 245 365 328 44 -212 -345 -370 -353 -19 154 255 318 288 130 -145 -267 -381 -379 -76 187
4375 187 305 390 259 95 -107 -274 -341 -314 -170 38 275 437 340 143 -76 -262 -337 -291 -161 11 196 356
4397 356 390 213 -59 -234 -439 -363 -164 40 230 369 344 226 73 -266 -403 -413 -180 6 202 357 290 207
4419 207 49 -151 -370 -364 -240 -77 242 429 365 224 12 -202 -322 -289 -309 -142 172 336 417 309 81 -213
4441 -213 -391 -353 -282 -144 130 257 420 357 138 -155 -272 -354 -357 -113 130 252 384 282 158 -64 -249 -356
4463 -356 -407 -164 68 265 379 292 118 -60 -187 -374 -401 -239 44 213 428 377 146 -58 -231 -433 -320
4484 -320 -175 6 115 400 378 242 46 -249 -402 -353 -227 -3 155 310 337 215 74 -125 -375 -387 -322 -90
4506 -90 206 364 281 230 185 -133 -356 -357 -312 -184 173 348 365 261 87 -216 -312 -305 -319 -178 109 288 366 357 103
4531 103 -181 -289 -344 -301 -161 112 212 327 373 233 -96 -313 -397 -416 -132 107 217 345 338 196 -27 -172
4553 -172 -340 -386 -243 -1 278 426 376 144 -52 -182 -341 -350 -215 -90 147 410 390 235 71 -200 -364 -368
4575 -368 -235 -39 77 392 418 296 141 -214 -404 -388 -248 -51 158 326 351 285 169 -59 -378 -369 -372 -169 230
4598 230 398 305 280 118 -61 -289 -361 -370 -230 83 365 402 340 177 -153 -274 -344 -367 -235 63 273 345 409 240
4622 240 -85 -317 -388 -320 -198 122 247 356 412 227 -2 -243 -399 -387 -208 66 245 289 395 182 5 -148
4644 -148 -396 -487 -293 -79 202 364 466 213 35 -146 -410 -424 -292 -105 127 359 445 354 60 -195 -412
4665 -412 -396 -263 -125 99 375 437 304 136 -91 -370 -420 -302 -116 138 307 380 290 175 -32 -334 -406 -359
4687 -359 -203 91 345 411 388 204 -12 -289 -355 -402 -207 96 219 379 406 249 -29 -255 -362 -325 -259 46
4709 46 271 362 348 240 -55 -244 -371 -430 -212 -12 150 356 395 289 -27 -238 -380 -472 -270 -17 203 368
4731 368 426 283 23 -146 -351 -411 -376 -17 120 403 433 249 100 -132 -321 -417 -289 -130 99 358 469 296
4753 296 92 -110 -344 -387 -356 -142 77 263 406 323 176 -85 -343 -310 -329 -183 42 292 355 315 224 11 -325
4776 -325 -405 -339 -226 -24 311 406 352 227 -4 -281 -374 -387 -304 30 255 374 412 275 -12 -253 -363 -411 -271
4799 -271 -59 193 357 438 250 71 -203 -331 -428 -303 -76 178 318 453 270 49 -181 -321 -427 -327 -72
4820 -72 124 322 411 303 108 -107 -319 -425 -302 -81 98 338 446 328 129 -71 -330 -423 -312 -180 47
4841 47 324 457 366 196 6 -293 -403 -339 -192 80 340 370 371 193 41 -263 -389 -323 -229 -11 269 373 359
4864 359 243 62 -264 -375 -412 -300 -42 279 426 410 276 34 -215 -289 -416 -337 -105 218 324 351 335 48
4886 48 -184 -373 -443 -311 -68 155 348 397 335 70 -100 -329 -477 -314 -88 136 268 451 313 115 -86
4907 -86 -327 -422 -363 -129 75 271 420 347 164 -9 -294 -439 -404 -165 -11 285 386 382 179 4 -249 -435
4929 -435 -387 -266 -58 261 398 408 275 24 -235 -379 -375 -224 -46 248 373 326 302 93 -238 -319 -393 -307 -69
4952 -69 213 292 420 313 43 -253 -324 -433 -306 -62 132 328 375 387 113 -54 -359 -477 -430 -132 183 356
4974 356 377 311 111 -105 -280 -368 -382 -150 69 279 430 404 141 -63 -294 -433 -370 -228 -4 264 485 366
4996 366 248 -9 -282 -362 -379 -196 -22 214 387 398 258 49 -249 -432 -411 -231 -53 202 366 336 267 85
5018 85 -141 -358 -377 -360 -74 252 432 396 292 93 -194 -342 -399 -317 -121 147 335 349 300 135 -212 -347 -375
5041 -375 -319 -191 124 250 380 362 166 -113 -338 -437 -351 -123 152 307 380 337 147 -62 -250 -447 -410 -163
5063 -163 71 298 392 414 199 -53 -251 -382 -394 -186 -11 237 465 444 201 -41 -264 -373 -362 -238 37 200
5085 200 413 428 294 62 -217 -362 -382 -233 -92 205 352 347 286 110 -210 -381 -433 -260 -104 135 304 295 267
5108 267 122 -114 -372 -433 -380 -162 126 339 393 328 190 -135 -347 -414 -399 -180 106 351 402 363 156 -87 -215
5131 -215 -383 -369 -199 67 274 401 427 256 -54 -266 -398 -403 -211 48 216 419 405 241 23 -179 -348 -474
5153 -474 -217 -15 257 451 441 221 49 -189 -337 -425 -270 -21 152 356 419 213 24 -232 -348 -368 -223
5174 -223 -126 140 400 381 306 117 -176 -380 -388 -230 -132 150 325 387 339 184 -100 -374 -384 -274 -181 150 347
5197 347 415 302 185 -26 -294 -373 -388 -238 103 346 386 336 131 -95 -253 -353 -399 -239 -14 238 399 388
5219 388 286 -57 -290 -358 -359 -210 -50 239 420 404 304 -6 -175 -405 -370 -248 -7 207 316 389 235 93
5241 93 -141 -363 -496 -308 -59 151 394 441 295 95 -125 -300 -382 -284 -104 77 346 416 269 119 -135 -341
5263 -341 -335 -276 -152 24 314 437 370 203 -105 -309 -400 -296 -202 53 254 342 331 240 -4 -291 -396 -401 -175 45
5287 45 279 321 322 242 -47 -281 -316 -357 -298 8 197 333 372 224 -21 -172 -327 -371 -223 -51 169 347 377 254
5311 254 -10 -205 -310 -323 -253 -123 177 318 425 358 90 -124 -371 -440 -285 -70 124 282 397 312 163 -52
5333 -52 -264 -436 -313 -129 95 347 383 263 184 -79 -258 -351 -266 -186 18 369 380 333 241 -72 -259 -346 -325 -193
5357 -193 33 220 365 373 284 -14 -291 -399 -291 -216 15 271 307 376 256 57 -230 -369 -416 -295 -61 173
5379 173 326 339 227 47 -169 -298 -378 -310 -47 163 255 371 351 76 -145 -273 -343 -352 -79 87 295 407 355
5402 355 98 -82 -287 -332 -312 -127 92 263 337 301 120 -37 -296 -385 -335 -141 68 212 319 288 213 -48 -215
5425 -215 -345 -305 -192 73 228 305 290 212 27 -178 -357 -351 -241 -79 245 347 339 223 29 -243 -305 -255 -284 -85
5449 -85 170 320 355 263 74 -193 -349 -380 -220 -8 174 291 330 295 77 -110 -282 -410 -291 -65 101 306
5471 306 361 246 55 -60 -258 -332 -337 -125 40 262 344 285 96 -81 -185 -354 -246 -163 -21 276 381 379 143
5494 143 -80 -244 -364 -306 -166 56 244 311 253 180 -31 -202 -338 -313 -179 5 212 310 326 201 23 -214
5516 -214 -288 -350 -289 -94 225 382 261 224 45 -189 -271 -321 -240 -50 120 347 305 269 66 -198 -319 -315 -254 -75
5540 -75 153 289 301 338 103 -133 -277 -325 -261 -116 97 253 284 254 180 -83 -286 -329 -327 -96 100 260 306 270
5564 270 145 -18 -162 -296 -312 -159 -18 224 378 255 153 -20 -239 -289 -310 -163 -17 172 276 360 225
5585 225 10 -149 -321 -262 -167 -17 204 254 367 232 19 -127 -321 -275 -210 -17 100 300 344 265 51 -129
5607 -129 -247 -350 -280 -34 177 304 266 189 26 -113 -268 -323 -238 -123 120 302 341 227 112 -160 -242 -332 -253
5630 -253 -103 115 255 339 298 145 -67 -230 -281 -259 -190 21 193 290 249 137 1 -181 -285 -306 -98 40 153
5653 153 266 322 169 -34 -133 -288 -296 -148 55 199 289 294 175 -5 -152 -296 -316 -165 -59 124 297 253 156
5676 156 77 -124 -234 -277 -192 -29 100 254 304 214 87 -130 -251 -284 -235 -101 125 245 276 236 85 -76 -213
5699 -213 -277 -268 -66 107 232 271 182 189 -21 -221 -300 -262 -183 55 260 308 254 115 -33 -175 -291 -311 -120 -24 173
5724 173 280 291 126 -59 -182 -329 -245 -178 31 126 276 322 196 18 -165 -319 -285 -169 -3 150 322 242
5746 242 185 37 -156 -265 -244 -221 -52 167 273 265 190 10 -86 -290 -290 -147 -100 47 209 288 178 79 -133 -254
5770 -254 -267 -214 -62 60 241 245 189 122 -76 -221 -344 -220 -109 75 220 268 207 83 -51 -182 -268 -267 -147 47
5794 47 238 274 233 143 -58 -226 -269 -247 -165 29 171 251 295 160 -47 -145 -241 -283 -129 51 171 235 276 208 -10
5819 -10 -90 -306 -231 -160 18 192 257 295 182 -3 -163 -250 -300 -183 -56 122 214 284 167 30 -117 -282 -279 -202
5843 -202 -42 98 236 263 190 99 -49 -218 -253 -265 -79 58 221 210 132 66 -50 -251 -222 -186 -102 39 165 276
5867 276 192 123 -8 -224 -288 -202 -71 77 170 171 246 150 22 -151 -237 -259 -121 43 129 183 218 178 -32 -72 -259
5892 -259 -248 -124 31 130 217 226 124 20 -142 -209 -254 -146 -45 150 172 220 123 38 -87 -225 -239 -129 -21 81
5916 81 151 272 167 27 -82 -173 -273 -208 -1 38 192 175 167 78 -46 -246 -295 -162 -51 93 169 281 190 49
5940 49 -84 -250 -268 -167 -47 3 172 254 212 85 -84 -175 -239 -225 -108 8 178 231 222 87 -30 -206 -186 -222
5964 -222 -137 34 119 205 235 148 13 -122 -165 -196 -148 104 138 172 182 142 -3 -103 -173 -289 -147 -18 114 199 204
5989 204 112 52 -177 -225 -196 -197 11 167 197 196 189 25 -108 -244 -218 -129 -77 33 123 261 195 142 5 -203 -283 -153
6015 -153 -100 40 164 193 173 66 -88 -210 -197 -212 -99 78 116 185 163 86 -17 -159 -177 -248 -111 -7 159 204
6039 204 203 78 -60 -112 -185 -160 -135 13 142 179 183 151 17 -121 -195 -213 -111 18 96 183 217 130 -13 -119 -219
6064 -219 -192 -118 -5 142 142 202 125 24 -122 -152 -200 -159 -48 126 121 165 130 26 -51 -179 -184 -167 -80 79 124 219 81
6091 81 26 -79 -131 -167 -104 -48 30 188 133 142 35 -53 -176 -230 -133 -76 0 115 133 148 75 -36 -108 -216 -148 -97 27
6118 27 124 160 157 78 -30 -114 -190 -227 -103 30 142 134 149 101 -46 -137 -176 -173 -116 -46 141 169 125 104 -13 -83 -153 -170
6146 -170 -117 -34 99 157 211 136 27 -97 -152 -195 -121 14 54 122 179 70 -1 -14 -163 -171 -153 -46 97 151 162 99
6172 99 41 -45 -138 -155 -152 -47 30 152 153 159 78 -7 -92 -168 -115 -22 61 152 152 94 64 16 -59 -169 -84 -69 -19 74 173 85 71
6203 71 -28 -89 -192 -158 -66 -18 93 106 144 101 -27 -81 -108 -180 -95 4 84 189 112 68 -28 -121 -110 -144 -150 -32 87 108
6231 108 134 113 48 -99 -146 -130 -152 5 56 150 90 106 12 -35 -143 -150 -90 -16 20 67 132 52 1 -27 -141 -96 -90 -26 77
6260 77 58 106 101 21 -51 -80 -151 -135 10 -38 114 133 121 86 -41 -87 -53 -104 -105 44 66 126 93 69 24 -78 -131 -88 -98
6289 -98 -45 46 65 106 103 20 -66 -74 -91 -88 -53 75 84 95 17 24 -38 -99 -93 -80 -55 37 63 140 91 -12 -33 -108 -38 -78 19 58
6321 58 66 48 74 -2 -54 -97 -88 -31 -29 37 58 122 46 65 -4 -101 -48 -110 -44 38 52 125 88 17 -27 -7 -31 -75 -67 6 68 106
6353 106 68 -2 -16 -6 -80 -104 -17 56 42 94 69 55 6 -5 -62 -51 -78 -41 16 90 116 85 46 -43 -68 -82 -61 -10 34 65
6383 65 37 18 4 -25 -105 -84 -57 -40 17 34 110 36 -15 -43 -104 -47 -107 -9 29 55 140 76 13 -19 -86 -93 -45 -46 17 41 82
6414 82 53 52 6 -60 -43 -81 -4 -4 62 15 33 30 14 -27 -101 -48 -44 -12 68 51 -14 18 -8 -58 -73 -109 -35 0 3 4 -23 82 -5
6447 -5 -28 -79 -88 -12 -6 -17 18 91 50 21 27 -61 -24 -45 5 39 -25 24 14 98 -40 -50 9 -77 19 -43 63 56 48 15 -18 -15 -32
6480 -32 -28 6 31 -6 45 63 22 42 -26 -10 -119 -30 28 33 -11 53 50 -5 -54 -69 -3 -64 7 -12 27 -8 42 8 -6 -72 -52
6511 -52 -25 -57 39 -26 -31 32 15 -61 -61 -56 -47 26 -6 35 4 25 46 30 8 -20 12 -35 -34 41 7 17 21 43 -26 -19 -26 51 -38 -17
6545 -17 50 22 4 -24 6 -8 26 -42 32 5 -30 29 -6 6 -20 -78 -22 -61 -2 -24 -2 38 -28 48 23 18 -20 -16 -2 -26 33
6576 33 16 -38 66 30 13 -26 -47 -20 25 34 13 52 58 34 -1 -28 -27 -24 7 -24 46 49 5 69 0 1 -16 -58 -74 14 5 82 23
6609 23 4 -20 9 15 -1 -29 19 43 23 8 22 18 27 -30 -19 -12 -32 -20 27 18 33 53 -33 -3 -14 -33 10 8 7 17 -13 3 52 -18
6643 -18 -45 -12 -58 51 70 83 27 59 -16 -38 -22 -54 -62 -26 52 74 63 -4 19 38 -50 10 -41 -24 -36 6 41 6 19 -19
6673 -19 -38 1 -59 -31 -7 -18 23 48 -12 1 -41 -56 -64 -44 -31 38 0 54 39 39 37 -30 0 -15 -1 25 26 20 41 17 -9 -70 -48
6706 -48 -24 -46 42 3 67 25 15 -6 -16 -16 -30 -17 -34 -17 47 54 -36 -19 -17 -39 -65 -55 -32 50 -7 1 41 -35 30 -73 -47 26
6738 26 21 40 51 77 32 61 20 -39 14 23 -2 35 21 42 20 52 6 17 -31 13 -31 0 -6 -38 15 -46 26 -40 -30 31 29 -1
6770 -1 -38 31 -2 39 9 9 -66 -9 -48 -35 33 43 22 24 -60 -90 -68 3 -27 -21 54 32 48 39 7 -59 -71 -61 -9 -26 -7 39 -4
6803 -4 -44 -25 -114 -58 -20 -38 -29 8 53 44 50 71 17 -73 -38 -7 9 26 66 48 -2 -4 -32 -47 -60 -72 -57 29 32 36 6 63 33 -23
6837 -23 -40 -51 -20 2 66 49 52 9 36 -17 -33 -58 -54 -54 22 101 77 69 -31 -32 -69 -62 -55 4 -3 93 19 56 -2 -21 -66 -43 -119 18
6871 18 31 37 41 35 7 -35 -17 -31 -41 13 -8 54 37 36 55 34 -29 -14 -75 -69 66 54 72 42 13 -3 -70 -83 -70 12 -34 30
6903 30 115 25 38 -15 -47 -20 -32 -11 33 47 68 2 -1 -12 -35 -30 -61 24 15 23 63 49 15 -23 -50 1 -57 -30 -31 10 97 43 59
6936 59 24 10 -31 5 16 -3 78 28 26 98 30 -4 -49 -23 2 53 14 -37 90 4 0 32 -95 -91 -46 -38 27 48 77 9 13 -43
6968 -43 -20 -50 -2 8 -23 40 55 44 19 -28 -42 -25 -17 -32 20 -14 60 98 36 7 -46 -72 -47 15 44 39 63 15 -1 -14 -61
6999 -61 -77 16 -69 -5 36 22 16 -7 -45 -57 -106 -25 -34 18 25 30 20 12 -10 -5 34 -42 -36 45 61 72 95 44 13 -34 -61 -46 -3 -24
7033 -24 48 76 40 53 17 -21 -46 -84 -61 -32 -18 -24 59 12 -13 26 -82 -62 57 -40 53 41 0 58 26 -3 32 -26 -79 -51
7063 -51 12 57 25 19 47 -55 -24 -55 -17 -19 7 45 58 61 0 -48 -80 -89 -23 10 -5 42 38 45 31 16 -52 -65 -40 -10 34 36 74
7096 74 70 54 2 -65 -60 -58 23 -3 68 99 35 -9 27 -9 -43 -86 -68 31 -5 64 31 -12 13 -23 -11 -87 -54 13 -2 38 6 44
7128 44 25 -71 18 -43 -2 65 -19 5 32 1 -4 -57 -8 -87 17 -32 -28 18 68 -24 -49 -28 -32 -15 -18 35 -20 -12 48 24 43 31
7160 31 -48 -83 -63 -63 16 -32 20 81 -1 25 -18 -6 -18 -24 -14 24 31 39 6 -23 -44 -71 -65 -17 54 -7 54 6 26 2 -75 -32 -7
7193 -7 69 34 26 44 58 -82 13 -48 -59 -70 -9 47 -1 90 67 38 18 34 -13 -21 -19 -7 84 52 27 18 -37 -73 -25 -5 -33 -17
7225 -17 6 39 18 20 -18 2 -26 -15 -12 45 25 39 55 8 25 -14 -6 -85 28 -75 -6 91 35 60 -50 -6 -34 -16 2 -46
7255 -46 31 28 116 4 7 41 -53 -30 -49 14 22 54 10 28 21 -1 30 -29 -52 -16 50 14 33 12 -25 -9 29 -76 -7 14 53
7286 53 -4 50 11 9 -20 -14 18 -3 -19 2 59 16 28 -7 -18 -33 13 -47 5 57 -10 16 -10 23 -11 -14 -29 -26 -25 -37 17 37 63
7319 63 -25 -9 -51 -55 33 -22 -48 62 34 16 18 1 -25 -53 -7 -17 89 -37 48 69 -1 -27 -14 -18 -16 15 -6 7 49 101 28
7350 28 20 12 -79 -8 7 -10 17 34 -2 -26 10 -30 8 -77 -20 59 7 11 13 12 -5 2 -22 -51 18 -62 23 47 80 -36 5 8 -7
7383 -7 -13 7 7 0 44 42 -31 34 -19 -55 -17 -4 -23 23 51 21 11 28 -42 -69 2 13 -52 14 21 36 49 2 -10 2 -55 5 -7
7416 -7 11 11 46 63 62 3 -37 -45 1 -2 41 31 20 22 -1 -5 -10 23 -42 17 29 51 26 21 -41 7 -31 -5 -4 -59 -29 26 71 -24 38
7451 38 -6 16 -58 -58 24 -19 39 49 35 30 -8 -28 -32 -70 -31 -13 79 2 23 19 -31 -10 34 -37 -20 25 26 -30 40 9 -11 -52 -14
7484 -14 -41 -25 17 -20 7 29 -36 44 -18 -14 5 21 29 -16 33 26 26 -13 -62 2 -85 -22 23 -16 55 27 44 -8 -15 49 -50 -15 61
7517 61 12 11 10 9 -4 -15 -49 -72 -42 -27 25 16 25 -15 9 -32 -51 -78 -24 -50 -11 -25 28 11 19 -70 -15 -26 -48 -7 92 35 2
7550 2 87 -24 -16 -60 26 -68 32 -2 -3 34 -9 6 -55 -35 -38 -54 45 40 14 66 75 43 -5 -3 -33 -17 -9 -15 -35 17 79 -7 2 -12
7584 -12 -11 -15 -9 -2 27 24 52 32 -10 -57 -15 -2 -29 -38 49 78 -12 51 -58 -55 -43 -50 76 -7 39 28 0 18 11 -44 -24 -35 -12 -9
7618 -9 21 54 -17 12 -9 -64 -39 -25 -72 81 70 44 13 38 36 -1 17 28 10 33 17 93 11 18 -47 -16 -14 -9 -37 -22 24 3
7650 3 54 35 32 -3 11 -14 -31 13 45 40 44 62 28 -48 -55 -51 1 -24 31 45 19 22 17 21 -61 -9 -6 -105 62 18 50 -6 -26 -23 -83
7685 -83 3 -56 -15 31 7 -4 33 3 -75 -9 -43 3 -45 66 55 27 52 -3 -4 28 -9 -37 -43 31 39 26 38 0 -9 -47 -20 -22
7717 -22 31 -5 1 -36 56 39 -12 -69 -19 -78 6 -30 29 -22 30 3 -32 9 0 12 10 -24 7 -11 41 12 -28 -14 -21 -77 -24 18
7749 18 77 22 37 -9 15 6 -42 -59 -20 -12 -12 63 -31 -8 63 2 -50 -33 -12 15 18 45 -3 54 29 31 -12 -76 -62 -21 -5 15 0
7782 0 12 13 10 -25 -41 -52 -13 65 24 32 -35 53 27 -65 -83 -50 -24 5 68 -2 43 6 38 5 -32 -57 -53 -71 105 -16 48 -37
7814 -37 -21 43 -48 -41 6 -55 -21 1 50 18 -8 -25 -38 -8 -52 10 -55 21 -7 25 61 4 10 -18 -18 -27 53 19 65 69 -3 -14 -25
7847 -25 -82 -36 2 -62 5 -2 16 -7 -20 8 -18 4 -28 -33 -3 35 49 29 10 -1 -86 17 22 -28 48 56 13 59 16 -1 -42 -40
7879 -40 -16 -23 -8 62 53 4 13 -4 -34 33 -60 31 -2 38 78 -7 -24 13 -24 -29 -41 32 -13 -10 7 15 12 -38 -1 -56 -4 -39 30 53
7913 53 -47 -26 35 33 -55 -61 -116 8 -19 -5 10 37 -14 -36 -36 -47 -38 -22 17 31 -6 9 6 45 -11 -26 -4 -2 -64 45 -26 -14
7945 -14 64 -9 5 -55 23 -44 -38 7 -32 -26 34 34 4 29 -34 31 -17 -28 -4 23 66 18 4 -3 -98 -37 -62 -23 16 7 47 -11 3
7978 3 -19 -36 -25 28 -68 30 7 -1 18 -34 -20 -56 -8 -21 18 56 72 5 19 2 7 38 -7 -34 29 -7 46 30 54 -22 -36 -34
8010 -34 -31 -44 -46 -34 37 35 38 76 41 45 -13 -36 -56 -6 7 48 73 56 8 9 -1 3 -80 -42 -24 88 -26 16 -2 -92 -32 -15 -5
8043 -5 9 26 63 -1 -3 23 -76 -14 -10 -44 31 -17 23 31 74 7 4 19 -20 -20 39 -34 -21 71 10 -12 21 -32 -57 -35 -29 -21 38 30 10
8078 10 4 3 -22 -23 -31 -8 -18 7 6 -7 18 8 -28 23 -32 -11 -42 -1 19 -12 27 -34 14 -7 -68 -10 -52 47 10 -9 -6 4 7 -39
8112 -39 -29 -27 -7 7 15 10 9 -6 6 26 -48 -18 -65 35 22 -11 72 60 13 -36 -32 -41 -49 -37 36 52 52 15 -12 -17 28 -10 -34 1
8146 1 25 55 31 -78 4 30 -118 -48 25 -18 -4 43 36 0 -30 20 -71 -48 -63 7 -14 18 7 0 2 5 -6 -39 -19 20 28 36 36
8179 36 24 40 -26 20 6 -43 -26 -4 14 39 60 -27
8191b7
##END NTUPLES=NMR FID
##END=
