##TITLE=1H_Pr AM-SA
 CD3OD,8 sc, 
 5.02.2021
##JCAMPDX= 6.0         $$ Bruker NMR JCAMP-DX V2.0
##DATA TYPE= NMR FID
##DATA CLASS= NTUPLES
##ORIGIN= UXNMR, Bruker Analytische Messtechnik GmbH
##OWNER= root
$$ XWIN-NMR		Version 3.5
$$ Fri Feb  5 12:02:10 2021 Russian Standard Time (UT+4h)  she@DPX200
##.OBSERVE FREQUENCY= 200.1315066352
##.OBSERVE NUCLEUS= ^1H
##.DELAY= (6, 6)
##.ACQUISITION MODE= SIMULTANEOUS
##.ACQUISITION SCHEME= undefined
##.AVERAGES= 8
##.DIGITISER RES= 18
##SPECTROMETER/DATA SYSTEM= spect
##.PULSE SEQUENCE= zg30
##.SOLVENT NAME= MeOD
##.SHIFT REFERENCE= (INTERNAL, MeOD, 0, 15.7039)
##AUDIT TRAIL= $$ (NUMBER, WHEN, WHO, WHERE, WHAT)
$$ ##TITLE= Audit trail, XWIN-NMR		Version 3.5
$$ ##JCAMPDX= 5.01
$$ ##ORIGIN= Bruker BioSpin GmbH
$$ ##OWNER= she
$$ F:/spectra/data/she/nmr/H-F/1/audita.txt
$$ ##AUDIT TRAIL=  $$ (NUMBER, WHEN, WHO, WHERE, WHAT)
(   1,<2021-02-05 12:01:14.00 +0400>,<she>,<DPX200>,
      <created by zg, POWCHK disabled, PULCHK disabled
       configuration hash MD5:
       00 E9 B6 7A A2 85 ED C7 34 08 36 98 17 FE 4E 26
       data hash MD5: 16K
       AA 62 F8 BD 4B 4D AE A4 36 64 53 B7 6F ED A1 47>)
$$ ##END=
$$ 
$$ hash MD5
$$ FB 3E E5 DE FA 57 8A E5 CD 39 ED C1 CC 0D 56 F2
##$RELAX= 
##$RELAX= 
##$RELAX= 
##$RELAX= 
##$RELAX= 
##$RELAX= 
$$ Bruker specific parameters
$$ --------------------------
##$DU= <F:/spectra>
##$EXPNO= 1
##$NAME= <H-F>
##$PROCNO= 1
##$TYPE= <nmr>
##$USER= <she>
##$AMP= (0..31)
100 100 100 100 100 100 100 100 100 100 100 100 100 100 100 100 100 100 
100 100 100 100 100 100 100 100 100 100 100 100 100 100 
##$AQSEQ= 0
##$AQ_mod= 1
##$AUNM= <au_zg>
##$AUTOPOS= <>
##$BF1= 200.13
##$BF2= 200.13
##$BF3= 200.13
##$BF4= 200.13
##$BF5= 200.13
##$BF6= 200.13
##$BF7= 200.13
##$BF8= 200.13
##$BYTORDA= 1
##$CFDGTYP= 0
##$CFRGTYP= 5
##$CHEMSTR= <none>
##$CNST= (0..31)
1 1 145 1 1 1 1 1 1 1 1 1 1 1 1 1 1 1 1 1 1 1 1 1 1 1 1 1 1 1 1 1 
##$CPDPRG= <>
##$CPDPRG1= <>
##$CPDPRG2= <>
##$CPDPRG3= <>
##$CPDPRG4= <mlev>
##$CPDPRG5= <mlev>
##$CPDPRG6= <mlev>
##$CPDPRG7= <mlev>
##$CPDPRG8= <mlev>
##$CPDPRGB= <>
##$CPDPRGT= <>
##$D= (0..31)
0 1.2 0 0 0 0 0 0 0 0.06 0 0.03 0 0 0 0 0.0002 0 0 0 0 0 0 0 0 0 0 0 0 
0 0 0 
##$DATE= 1612512073
##$DBL= (0..7)
120 120 120 120 120 120 120 120 
##$DBP= (0..7)
150 150 150 150 150 150 150 150 
##$DBP07= 0
##$DBPNAM0= <>
##$DBPNAM1= <>
##$DBPNAM2= <>
##$DBPNAM3= <>
##$DBPNAM4= <>
##$DBPNAM5= <>
##$DBPNAM6= <>
##$DBPNAM7= <>
##$DBPOAL= (0..7)
0.5 0.5 0.5 0.5 0.5 0.5 0.5 0.5 
##$DBPOFFS= (0..7)
0 0 0 0 0 0 0 0 
##$DE= 6
##$DECBNUC= <off>
##$DECIM= 32
##$DECNUC= <off>
##$DECSTAT= 4
##$DIGMOD= 1
##$DIGTYP= 9
##$DL= (0..7)
0 120 120 120 120 120 120 120 
##$DP= (0..7)
150 150 150 150 150 150 150 150 
##$DP07= 0
##$DPNAME0= <>
##$DPNAME1= <>
##$DPNAME2= <>
##$DPNAME3= <>
##$DPNAME4= <>
##$DPNAME5= <>
##$DPNAME6= <>
##$DPNAME7= <>
##$DPOAL= (0..7)
0.5 0.5 0.5 0.5 0.5 0.5 0.5 0.5 
##$DPOFFS= (0..7)
0 0 0 0 0 0 0 0 
##$DQDMODE= 0
##$DR= 18
##$DS= 0
##$DSLIST= <SSSSSSSSSSSSSSS>
$$ [...]
##$SUBNAM2= <"">
##$SUBNAM3= <"">
##$SUBNAM4= <"">
##$SUBNAM5= <"">
##$SUBNAM6= <"">
##$SUBNAM7= <"">
##$SUBNAM8= <"">
##$SUBNAM9= <"">
##$SW= 16.9725356469052
##$SWIBOX= (0..15)
0 0 2 0 0 0 0 0 0 0 0 0 0 0 0 0 
##$SW_h= 3396.73913043478
##$TD= 16384
##$TD0= 1
##$TE= 0
##$TE2= 300
##$TE3= 300
##$TEG= 300
##$TL= (0..7)
0 120 120 120 120 120 120 120 
##$TP= (0..7)
150 150 150 150 150 150 150 150 
##$TP07= 0
##$TPNAME0= <>
##$TPNAME1= <>
##$TPNAME2= <>
##$TPNAME3= <>
##$TPNAME4= <>
##$TPNAME5= <>
##$TPNAME6= <>
##$TPNAME7= <>
##$TPOAL= (0..7)
0.5 0.5 0.5 0.5 0.5 0.5 0.5 0.5 
##$TPOFFS= (0..7)
0 0 0 0 0 0 0 0 
##$TUNHIN= 0
##$TUNHOUT= 0
##$TUNXOUT= 0
##$USERA1= <user>
##$USERA2= <user>
##$USERA3= <user>
##$USERA4= <user>
##$USERA5= <user>
##$V9= 5
##$VALIST= <valist>
##$VCLIST= <CCCCCCCCCCCCCCC>
##$VD= 0
##$VDLIST= <DDDDDDDDDDDDDDD>
##$VPLIST= <PPPPPPPPPPPPPPP>
##$VTLIST= <TTTTTTTTTTTTTTT>
##$WBST= 1024
##$WBSW= 4
##$XGAIN= (0..3)
0 0 0 0 
##$XL= 0
##$YL= 0
##$YMAX_a= 206935
##$YMIN_a= -133280
##$ZGOPTNS= <>
##$ZL1= 120
##$ZL2= 120
##$ZL3= 120
##$ZL4= 120
##$ABSF1= 10
##$ABSF2= 0
##$ABSG= 5
##$ABSL= 3
##$ALPHA= 0
##$AQORDER= 0
##$ASSFAC= 0
##$ASSFACI= 0
##$ASSFACX= 0
##$ASSWID= 0
##$AUNMP= <proc_1d>
##$AZFE= 0.1
##$AZFW= 0.1
##$BCFW= 1
##$BC_mod= 2
##$BYTORDP= 1
##$COROFFS= 0
##$CY= 11.3945322036743
##$DATMOD= 1
##$DC= 2
##$DFILT= <>
##$DTYPP= 0
##$F1P= 15.9154993809931
##$F2P= -4.1035820241983
##$FCOR= 0.5
##$FTSIZE= 0
##$FT_mod= 4
##$GAMMA= 1
##$GB= 0.15
##$INTBC= 1
##$INTSCL= 1
##$ISEN= 128
##$LB= 0.24
##$LEV0= 0
##$LPBIN= 0
##$MAXI= 10000
##$MC2= 0
##$MEAN= 0
##$ME_mod= 0
##$MI= 1.114404
##$NCOEF= 0
##$NC_proc= 0
##$NLEV= 6
##$NOISF1= 3.799351
##$NOISF2= 2.8
##$NSP= 1
##$NTH_PI= 0
##$NZP= 0
##$OFFSET= 15.70392
##$PC= 1
##$PHC0= -10757.82
##$PHC1= 4.800944
##$PH_mod= 1
##$PKNL= yes
##$PPARMOD= 0
##$PSCAL= 0
##$PSIGN= 0
##$REVERSE= no
##$SF= 200.130013532006
##$SI= 16384
##$SIGF1= 3
##$SIGF2= 2
##$SINO= 400
##$SIOLD= 16384
##$SREGLST= <1H.CDCl3>
##$SSB= 0
##$STSI= 0
##$STSR= 0
##$SW_p= 3612.71676300578
##$SYMM= 0
##$S_DEV= 0
##$TDeff= 0
##$TDoff= 0
##$TI= <>
##$TILT= no
##$TM1= 0
##$TM2= 0
##$TOPLEV= 0
##$USERP1= <user>
##$USERP2= <user>
##$USERP3= <user>
##$USERP4= <user>
##$USERP5= <user>
##$WDW= 1
##$XDIM= 8192
##$YMAX_p= 0
##$YMIN_p= 0
$$ End of Bruker specific parameters
$$ ---------------------------------
##NTUPLES= NMR FID
##VAR_NAME=  TIME,          FID/REAL,        FID/IMAG
##SYMBOL=    X,             R,               I
##VAR_TYPE=  INDEPENDENT,   DEPENDENT,       DEPENDENT
##VAR_FORM=  AFFN,          ASDF,            ASDF
##VAR_DIM=   8192,          8192,            8192
##UNITS=     SECONDS,       ARBITRARY UNITS, ARBITRARY UNITS
##FACTOR=    0.0002944,     1,               1
##FIRST=     0,             0,               0
##LAST=      2.4114304,     0,               0
##MIN=       0,             -133280,         0
##MAX=       2.4114304,     206935,          0
$$ Real data points
##PAGE= N=1
##DATA TABLE= (X++(R..R)), XYDATA
$$ plain form
0 0 0 0 0 0 0 0 0 0 0 0 0 2 -8 8 -8 8 -8 15 -16 23 -24 31 -32 39 -47 55 -63 73 -85 97 -109 127 -143 160
34 160 -182 204 -228 257 -286 317 -355 393 -434 481 -532 586 -646 714 -787 865 -954 1051
52 1051 -1158 1279 -1414 1569 -1742 1945 -2180 2461 -2802 3224 -3762 4475 -5468 6944 -9362
67 -9362 13996 -25976 120421 206935 -132021 -23557 70882 -120685 -92873 140631 96643
78 96643 -30559 -40209 -41672 -59804 -14892 53818 90001 5324 -78401 -51321 -33488 -14092
90 -14092 82907 65017 -27813 -34248 -54781 -63319 58200 85248 2563 16091 -17253 -108853
102 -108853 -7193 96094 29446 18740 28617 -63698 -72972 15245 57331 53774 19127 -28516
114 -28516 -40051 -50401 -18163 80100 56876 -40871 -5513 -22462 -107752 22005 122933 -20332
$$ packed form
0@%%%%%%%%%%%Kj0J6j6J6j6K3l1L9m7N5o3P1q6J02j18J36j58J82k06K36k70L03
34A60l42L86m32M85n43O03o72P48q27R15j013J118j232J360j501J652j819K005
52A051k209K437k693K983l311L687m125M641n263O026o986Q237r943J2412j6306
67i362K3358l9972J46397Q6514l38956J08464R4439j91567K7812K33504m3988
78I6643j27202r650j463j8132M4912O8710L6183q4677q3725K7080J7833J9396
90a4092R6999j7890r2830o435k0533q538J21519K7048q2685J3528l3344r1600
102a08853J01660J03287o6648j0706R877r2315r274Q8217M2086l557l4647m7643
114b8516j1535j0350L2238R8263k3224r7747L5358j6949q5290J29757J00928j43265
$$ plain form
126 -20332 -42452 42918 -64294 -103749 68511 96897 -22052 -23539 3791 -44938 -48356 36201
138 36201 86542 23286 -44923 -21655 -14496 -30691 38304 78275 7333 -26179 -21777 -45163
150 -45163 2547 67777 23593 533 7592 -61190 -52809 47978 38485 -1558 25000 -18848
162 -18848 -78336 -20539 40438 25979 11433 2164 -27159 -50303 -30419 37348 57217 -4707
174 -4707 -20228 -1692 -45507 -32643 61409 50692 -13446 -939 -15315 -50719 7894 58528
186 58528 24609 4236 -2449 -33633 -32282 13228 48761 32779 -11470 -21922 -16652 -31614 299
199 299 56489 26841 -29011 -21653 -23020 -29977 20372 41389 4929 -8260 -25292 -45704 -4130
212 -4130 36376 19187 8034 -1354 -34352 -33018 8187 31634 28651 8415 -14589 -23309 -22204
$$ packed form
126b0332k2120Q5370j07212l9455J72260K8386j18949j487K7330m8729l418Q4557
138C6201N0341o3256o8209K3268P159j6195O8995L9971p0942l3512M402k3386
150d5163M7710O5230m4184k3060P059o8782Q381J00787r493m0043K6558m3848
162a8848n9488N7797O0977j4459j4546r269k9323k3144J9884O7767J9869o1924
174d707j5521J8536m3815J2864R4052j0717o4138J2507j4376l5404N8613N0634
186E8528l3919k0373o685l1184J351M5510L5533j5982m4249j0452N270j4962L1913
199B99N6190k9648n5852P358j367o957N0349K1017l6460j3189j7032k0412M1574
212d130M0506j7189j1153r388l2998J334M1205K3447k983k0236k3004q720J105
$$ plain form
225 -22204 8102 43637 25598 -6490 -5021 -21751 -33175 21187 50713 5306 -11215 -1941
237 -1941 -30187 -26977 27108 38054 4003 -12403 -20273 -25482 -12840 18161 32761 5853 -21106
250 -21106 -21547 -22088 -11907 29726 32489 -8884 -16141 -9813 -27274 -3980 43592 25440 -9993
263 -9993 -8974 -15325 -18256 13559 35095 19021 -1755 -15838 -23016 -9170 18563 31085 12453
276 12453 -10347 -14339 -20046 -15875 21230 34510 -2097 -17094 -11511 -24792 -12819 28255 24233
289 24233 -8081 -10915 -17455 -28149 3090 31901 13801 -7140 -8009 -16197 -20960 7653 35751
302 35751 17588 -12254 -9106 -8101 -17318 11347 38647 11623 -12566 -7374 -13834 -13487 22674
315 22674 31043 -1442 -9926 -7777 -22441 -10446 26310 22890 -7126 -13651 -12294 -19201 -6230
$$ packed form
225b2204L0306L5535j8039l2088J469j6730j1424N4362K9526m5407j6521R274
237a941k8246L210N4085J0946l4051j6406p870n209J2642L1001J4600k6908k6959
250b1106m41n41J0181M1633K763m1373p257O328j7461K3294M7572j8152l5433
263i993J019o351k931L1815K1536j6074k0776j4083p178J3846K7733J2522j8632
276A2453k2800l992n707M171L7105J3280l6607j4997N583j3281J1973M1074m022
289B4233l2314k834o540j0694L1239K8811j8100k0941q69q188m763K8613K8098
302C5751j8163k9842L148J005r217K8665K7300k7024k4189N192o460L47L6161
315B2674Q369l2485q484K149j4664J1995L6756l420l0016o525J357o907J2971
$$ plain form
328 -6230 22793 19831 -8299 -15769 -12918 -18258 2973 28064 11267 -11272 -6956 -12611 -19157 13244
342 13244 32908 5367 -11062 -3674 -13445 -12176 19445 29387 4044 -7932 -7279 -14788 -5858 22390
356 22390 23395 -3403 -9651 -6511 -18512 -6112 26551 17525 -11620 -11440 -7957 -19843 -2662
369 -2662 25727 11937 -12137 -10470 -12403 -15492 8137 23165 5203 -8241 -6506 -14933 -11877
382 -11877 17397 25410 518 -8439 -1192 -12691 -9489 23123 25824 -3581 -7787 -1431 -13882
395 -13882 -5073 24326 17911 -7425 -7757 -6895 -16349 29 24242 9620 -10820 -8297 -10211 -16042
409 -16042 4279 21135 4785 -10206 -7973 -11964 -12969 11389 21086 2 -8965 -3388 -12224
422 -12224 -9095 18502 22332 -3273 -8798 -1112 -9549 -5252 20094 20493 -2814 -8855 -4786 -9399
$$ packed form
328f230K9023k962k8130p470K851n340K1231K5091j6797k2539M316n655o546L2401
342A3244J9664k7541j6429P388r771J269L1621R942k5343j1976O53p509Q930K8248
356B2390J005k6798o248L140j2001J2400L2663r026k9145J80L483j1886J7181
369b662K8389j3790k4074J667j933l089K3629J5028j7962j3444J735q427L056
382a1877K9274Q013k4892q957P247j1499L202L2612K701k9405m206O356j2451
395a3882Q809K9399o415k5336l32Q62r454J6378K4213j4622k0440K523j914n831
409a6042K0321J6856j6350j4991K233l991j005K4358R697k1084q967N577q836
422a2224L129K7597L830k5605n525P686q437M297K5346L99k3307o041M069m613
$$ plain form
436 -9399 1197 19923 11683 -5934 -5618 -9020 -14230 7154 21676 -504 -11290 625 -12269
449 -12269 -19617 12440 22809 -7472 -13456 1973 -11667 -16885 16079 22209 -6583 -10679 652
462 652 -9388 -7630 17913 18505 -3709 -7747 -3134 -6959 1050 17518 12285 -1234 -5214 -8534
476 -8534 -6762 8924 14891 4278 -1361 -4371 -13540 -8525 11670 13782 -1584 -6937 -5194 -11843
490 -11843 -10106 10016 16014 -3032 -11400 -4299 -8198 -7550 11929 15013 -4798 -7742 -2466 -10422
504 -10422 -315 19882 8712 -7857 242 -1747 -13472 5707 25332 3522 -10595 3788
516 3788 -2290 -15431 8209 24226 -829 -13051 1343 -4039 -13851 7885 19092 -3386 -12419
529 -12419 -3522 -7460 -7359 8696 10571 -2008 -8235 -9258 -7738 2477 8872 5008 1076 -3574
$$ packed form
436i399J0596J8726q240j7617L16l402n210K1384J4522k2180j0786J1915j2894
449a2269p348L2057J0369l0281n984J5429j3640n218L2964O130k8792m096J1331
462F52j0040J758K5543N92k2214m038M613l825Q009J6468n233j3519l980l320
476h534J772J5686N967j0613n639l010r169N015K0195K112j5366n353J743o649
490a1843J737K0122N998j9046q368P101l899O48J9479L084j9811k944N276p956
504a0422J0107K0197j1170j6569Q099j989j1725J9179J9625k1810j4117J4383
516C788o078j3141K3640J6017k5055j2222J4394n382r812K1736J1207k2478r033
529a2419Q897l938J01J6055J875j2579o227j023J520J0215O395l864l932m650
$$ plain form
543 -3574 -10498 -6184 8860 12181 3550 -911 -1363 -6757 -6685 9006 16923 2205 -6255 146 -4383
558 -4383 -7776 9086 15726 -738 -8259 -2162 -6480 -6512 9845 11756 -5162 -8159 -2938 -9128 -4999
573 -4999 12413 8030 -8996 -6062 -935 -10806 -2389 16448 6008 -10661 -1617 409 -9877 3389
587 3389 17805 3656 -7432 -438 -1757 -5661 7411 14830 1761 -5448 -2162 -3997 -2259 8535
601 8535 10240 -949 -5725 -3704 -6276 -1839 9866 6772 -5641 -4982 -4147 -9473 -616 11911 3113
616 3113 -8170 -3362 -3426 -8524 1965 13034 2895 -6852 -2386 -2310 -5583 4936 13742 1693 -5893
631 -5893 88 -1883 -4091 8907 13021 -2282 -5132 1134 -4033 -3229 11751 8597 -5973 -4290
645 -4290 -697 -7585 -2009 11328 4754 -8139 -4631 -2271 -7916 -422 10846 1661 -8347 -3073
$$ packed form
543c574o924M314J5044L321q631m461m52n394P2J5691P917j4718q460O401m529
558d383l393J6862O640j6464p521O097m318l2J6357J911j6918k997N221o190M129
573d999J7412m383j7026K934N127r871Q417J8837j0440j6669R044K026j0286J3266
587C389J4416j4149j1088O994j319l904J3072P419j3069p209L286j835J738J0794
601H535J705j1189m776K021k572M437J1705l094j2413O59Q35n326Q857J2527q798
616C113j1283M808o4n098J0489J1069j0139r747M466P6l273J0519Q806j2049p586
631e893N981j971k208J2998M114j5303k850O266n167Q04J4980l154j4570J683
645d290L593o888N576J3337o574j2893L508K360n645P494J1268r185j0008N274
$$ plain form
659 -3073 -2722 -7270 3342 11671 -1033 -6901 -188 -2892 -5237 8297 11475 -2564 -4323 1659
673 1659 -3786 -2284 11076 9259 -3888 -3662 1593 -4811 -1514 11324 6225 -6865 -3325 79
687 79 -6353 -549 10494 1907 -8582 -2803 -2749 -7872 1825 9979 -1671 -8128 -1199 -3416 -6296
702 -6296 5871 9696 -3208 -5737 746 -3198 -3591 9451 9175 -4082 -3296 2238 -3551 -1019 11591
717 11591 6552 -5368 -1769 1001 -4778 938 10895 2554 -6505 -1369 -1445 -6311 2546 9014 -1136
732 -1136 -7345 -1182 -3171 -6302 4518 7531 -3738 -5870 148 -4313 -4773 7427 6703 -4858 -3532
747 -3532 1370 -4598 -1599 10532 5776 -5278 -861 1981 -4272 813 11583 3892 -5809 90
761 90 868 -4989 2305 9974 370 -6766 -80 -1580 -5537 3475 8104 -2910 -6557 -119 -3519 -5211
$$ packed form
659c073L51m548J0612Q329j2704n868O713k704k345J3534L178j4039j759N982
673A659n445J502J3360j817j3147K26N255o404L297J2838n099j3090L540L404
687G9o432N804J1043q587j0489N779N4n123R697Q154j1650o457O929k217k880
702f296J2167L825j2904k529O483l944l93J3042k76j3257P86N534n789K532J2610
717A1591n039j1920L599K770n779N716R957q341r059N136p6m866Q857O468j0150
732a136o209O163j989l131J0820L013j1269k132O018m461m60J2200p24j1561J326
747c532M902n968K999J2131m756j1054M417K842o253N085J0770p691r701N899
761I0P78n857P294P669r604p136O686j500l957R012M629j1014l647O438l400j692
$$ plain form
777 -5211 5470 6197 -5189 -4798 422 -4284 -2788 7692 4602 -5207 -2101 1256 -3907 134 9266
792 9266 3762 -4809 -577 1675 -3579 2860 10035 1700 -4588 945 -126 -3896 4134 8613 -2637
807 -2637 -4739 1011 -2819 -4379 5586 5757 -4215 -4940 -349 -4291 -3869 6403 4002 -5645 -3456 -266
823 -266 -4599 -1076 7847 2174 -5069 -685 670 -4373 1949 9376 662 -4114 1448 819 -4330 4197
839 4197 8081 -957 -3462 1496 -609 -3655 4791 6596 -2883 -4732 1434 -2081 -4095 4504 3636
854 3636 -5888 -3211 -457 -4438 -2238 6048 1229 -4450 -1205 -889 -4438 504 5848 -19 -4759
869 -4759 75 706 -3609 3300 8306 -126 -3803 2672 -136 -3131 4305 8214 -1752 -2635 1378 -2154
885 -2154 -3861 4680 4998 -3729 -2462 1659 -3700 -3208 5673 1842 -5869 -2066 -194 -4917 -1090 5788
$$ packed form
777e211J0681P27j1386L91N220m706J496J0480l090r809L106L357n163M041R132
792I266n504q571M232K252n254O439P175q335o288N533j071l770Q030M479j1250
807b637k102N750l830j560R965J71r972p25M591l942M22J0272k401r647K189L190
823b66m333L523Q923n673p243M384J355n043O322P427q714m776N562o29n149Q527
839D197L884r038k505M958k105l046Q446J805r479j849O166l515k014Q599q68
854C636r524K677K754l981K200Q286m819n679L245L16l549M942N344n867m740
869d759M834O31m315O909N006q432l677O475k808k995P436L909r966q83M013l532
885b154j707Q541L18q727J267M121n359M92Q881l831p711L803J872m723L827O878
$$ plain form
901 5788 -148 -6332 294 399 -5964 1296 7172 -941 -5162 1883 744 -3781 4138 7018 -647
916 -647 -3001 1459 -41 130 5250 4217 -1269 -1241 -177 -1158 215 4252 2006 -3839 -2107 -355
932 -355 -4398 -316 5795 -852 -5205 -2 -360 -5149 651 5422 -1649 -6408 624 138 -4902 2376
948 2376 5989 -2253 -4829 1494 812 -3613 4149 6659 -2326 -2753 3274 -1176 -1937 6414 4061 -3963
964 -3963 252 2561 -3103 -176 7112 1387 -5643 -549 820 -3786 -155 5394 -1300 -4581 -1128
979 -1128 -468 -4393 434 4252 -1207 -3913 227 -545 -2988 2939 3216 -2417 -876 1682 -2471 -244
995 -244 6108 2860 -2482 224 1607 -2895 1308 6290 1749 -4001 532 1201 -2884 305 6318 679
1011 679 -5848 469 503 -5091 766 5583 -2797 -5583 1347 -1570 -4628 3050 3526 -3954 -3092 1229
$$ packed form
901E788n936o184O626J05o363P260N876q113m221P045j139m525P919K880p665
916f47k354M460j500J71N120j033n486K8J064r81J373M037k246n845J732J752
932c55m043M082O111o647m353N203l58m789N800M771p071m759P032m86n040P278
948B376L613q242k576O323o82m425P762K510q985m27O027m450p61Q351k353q024
964c963M215K309n664K927P288n725p030N094J369m606L631N549o694l281L453
979a128O60l925M827L818n459k706M140p72k443N927K77n633J541K558m153K227
995b44O352l248n342K706J383m502M203M982m541n750M533O69m085L189O013n639
1011F79o527O317L4n594N857M817q380k786O930k917l058P678M76p480Q62M321
$$ plain form
1027 1229 -1979 -2143 4273 2749 -3511 -1261 1726 -1522 -758 5102 2552 -3541 381 2504 -2178
1042 -2178 1298 6434 517 -3177 1488 946 -2945 2655 3778 -2207 -2780 560 -1423 -2906 2288
1057 2288 2983 -2791 -3234 484 -2128 -3123 3035 2511 -4129 -2593 1702 -2214 -1782 4780 1801 -3785
1073 -3785 -162 1643 -2741 1137 5152 910 -2757 1722 1120 -1969 2652 5312 -578 -2441 1618
1088 1618 647 -2527 2304 4206 -1927 -2757 1487 -1273 -3152 3337 2138 -4056 -2026 1314 -3311
1103 -3311 -1686 3437 732 -4121 -1007 806 -2565 -569 3757 901 -2993 109 1250 -1816 956
1118 956 4394 807 -2702 1634 1185 -1948 2063 4987 -1537 -2248 2572 -452 -1976 2993 2698 -3050
1134 -3050 -1526 937 -1926 -1414 2543 484 -3446 -1948 611 -2976 -1960 2969 431 -3612 -461
$$ packed form
1027A229l208j64O416j524o260K250K987l248P64N860k550o093L922K123m682
1042b178L476N136n917l694M665n42l891N600J123n985n73L340j983j483N194
1057B288O95n774m43L718k612r95O158n24o640J536M295l916M32O562k979n586
1073c785L623J805m384L878M015m242l667M479o02l089M621K660n890j863M059
1088A618r71l174M831J902o133q30M244k760j879O489j199o194K030L340m625
1103c311J625N123k705m853L114J813l371J996M326k856l894L102J141l066K772
1118I56L438l587l509M336m49l133M011K924o524p11M820l024j524M969k95n748
1134c050J524K463k863N12L957k059l930J498K559l587J016M929k538m043L151
$$ plain form
1149 -461 1424 -3102 145 4113 -766 -3000 1731 858 -2335 2768 3104 -1082 -1167 1121 -193 -1932
1165 -1932 3234 3293 -1510 -1488 2013 -1089 -1908 2842 1814 -3539 -768 1466 -2088 -1135 3358 229
1181 229 -4144 -161 158 -2543 -46 2986 -1363 -3647 -156 61 -2470 1392 3179 41 -1465 1486
1197 1486 1137 -1212 1950 4195 -1106 -1927 2470 260 -1854 3128 2668 -3661 -754 2372 -1268 -310
1213 -310 2613 1670 -2834 -771 1025 -2101 -935 2317 -504 -3790 -270 558 -2215 -603 2890 -1273
1229 -1273 -3473 767 125 -1939 1288 3270 -2013 -1247 1934 -663 -1154 3409 2209 -2546 -380 2401
1245 2401 -918 -506 3855 1519 -2963 134 1810 -1651 -665 3113 -197 -3620 417 909 -2899 -30
1261 -30 2901 -1792 -2976 1036 -86 -3221 1480 2132 -2497 -1997 1464 -730 -2398 2282 1882 -2309
$$ packed form
1149d61J885m526L247L968m879k234M731q73l193N103L36m186q5K288j314j739
1165a932N166N9m803K2L501l102q19M750j028n353K771K234l554R53M493l129
1181B29m373L983L19k701K497L032m349k284L491K17k531L862J787l138j506K951
1197A486l49k349L162K245n301q21M397k210k114M982m60o329K907L126l640R58
1213c10K923r43m504K063J796l126J166L252k821l286L520Q28k773J612L493m163
1229a273k200M240o42k064L227J982n283P66L181k597m91M563j200m755K166K781
1245B401l319M12M361k336m482L097J676l461R86L778l310l423M037M92l808K869
1261c0K931m693j184M012j122l135M701O52m629N00L461k194j668M680m00m191
$$ plain form
1277 -2309 -713 1954 -143 -961 3229 1894 -2328 74 2792 -914 -572 3937 588 -2450 844
1292 844 1317 -1670 494 3073 -1304 -3107 543 465 -2534 534 2260 -2126 -2640 770 -529 -2438
1308 -2438 1588 1677 -2906 -1464 1505 -1171 -1515 2729 1310 -2527 -356 1899 -1121 -138 3589 860
1324 860 -2322 997 1801 -1234 740 3705 -265 -2236 1325 897 -2022 888 2592 -1442 -2109 1087
1340 1087 -83 -2258 1054 1499 -2601 -1916 1010 -1559 -2088 1799 1002 -2768 -591 1136 -1630 -806
1356 -806 2701 602 -2360 466 1582 -1330 417 3518 69 -2055 1524 1337 -1323 1086 3073
1371 3073 -568 -1635 1373 428 -1392 1447 2116 -2239 -1588 1316 -829 -2009 1622 1274 -2816 -1222
1387 -1222 1121 -1707 -1667 2407 105 -3145 43 1428 -1841 -529 2873 -128 -2301 1220 1650 -1081
$$ packed form
1277b309J596K667k097q18M190j335m222K402K718l706L42M509l349l038L294
1292H44M73k987K164K579m377j803L650p8k999L068J726m386n14L410j299j909
1308b438M026Q9m583J442K969k676l44M244j419l837K171K255l020R83L727k729
1324H60l182L319Q04l035J974K965l970j971L561m28k919K910J704m034o67L196
1340A087j170k175L312M45m100O85K926k569n29L887p97l770K177J727k766Q24
1356h06L507k099k962K826J116k912J747L101l449k124L579j87k660K409J987
1371C073l641j067L008r45j820K839O69m355O51K904k145j180L631l48m090J594
1387a222K343k828M0M074k302l250L188J385l269J312L402l001k173L521M30k731
$$ plain form
1403 -1081 874 2999 -221 -1646 2073 645 -1257 2232 2221 -1576 -795 2108 -11 -1139 1860 1317
1419 1317 -1988 -444 567 -1621 -1171 1678 204 -1844 -912 361 -2278 -28 2292 -704 -2369
1434 -2369 708 453 -1838 574 1959 -883 -1651 1362 455 -1188 1109 2848 -879 -726 1737 333
1450 333 -1203 1699 2051 -1681 -518 1782 -374 -1164 1653 360 -2386 -467 917 -1703 -1124 1751
1466 1751 -521 -2838 193 679 -2201 -767 1786 -976 -2406 870 487 -1544 833 2209 -1207
1481 -1207 -1266 1636 768 -1110 1720 1943 -1234 -711 1965 -101 -816 2239 1394 -1390 -202 1362 -939
1498 -939 -514 1853 -79 -2157 102 791 -1706 -402 1888 -720 -2541 566 224 -2120 45 1727
1514 1727 -1599 -1672 1354 397 -1573 1317 1671 -1606 -645 1835 30 -750 1876 1472 -1330 74 1816
$$ packed form
1403a081J955K125l220j425L719j428j902L489j1l797P81K903k119j128K999n43
1419A317l305J544J011k188M50K849j474k048R32J273k639K250K320k996j665
1434b369L077k55k291K412J385k842p68L013r07j643K297J739l727J53K463j404
1450C33j536K902L52l732J163K300k156p90K817j293k746J919J384k620N79K875
1466A751k272k317L031M86k880J434K553k762j430L276l83k031K377J376l416
1481a207n9K902q68j878K830K23l177N23K676k066p15L055q45k784J188J564k301
1498i39M25K367j932k078K259O89k497J304K290k608j821L107l42k344K165J682
1514A727l326p3L026r57j970K890L54l277R61K480j805p80K626m04k802J404J742
$$ plain form
1531 1816 -412 -541 2097 668 -1714 661 1462 -1274 -531 1930 -569 -2385 379 413 -1664 76
1547 76 1723 -1598 -2036 306 -17 -1828 178 1670 -1888 -1348 934 -222 -1078 693 1352 -1770 -446
1564 -446 1732 232 -483 2000 1211 -1276 262 1516 -643 -94 2697 526 -1307 1029 764 -1506
1580 -1506 55 1892 -825 -1971 1298 -292 -2172 778 1371 -2007 -834 433 -689 -1930 963
1595 963 766 -1625 -579 1303 -345 -1012 1277 388 -1410 233 1570 -1067 -309 2301 300 -1360
1611 -1360 1374 918 -1176 279 2027 -392 -1089 1804 677 -1022 179 1380 -1728 -1671 797 -619
1627 -619 -1162 1568 -199 -1724 -1612 1840 -500 -2016 1516 468 -2097 -643 349 -251 -1049 2026
1643 2026 360 -630 1006 1042 -1155 738 1404 -1867 -337 556 651 180 1145 2013 -1048 -1316 1076 866
$$ packed form
1531A816k228j29K638j429k382K375Q01k736P43K461k499j816K764L4k077J740
1547G6J647l321m38K342l23j811K006J492l558N40K282j156q56J771O59l122J324
1564d46K178j500p15K483p89k487J538J254k159N49K791k171j833K336k65k270
1580a506J561J837k717j146L269j590j880K950N93l378J173J267j122j241K893
1595I63j97k391J046J882j648o67K289q89j798J643J337k637P58K610k001j660
1611a360K734m56k094J455J748k419o97K893j127j699J201J201l108N7K468j416
1627f19n43K730j767j525J12L452k340j516L532j048k565J454R92o00p98L075
1643B026j666r90J636L6k197J893O66l271J530Q93R5m71R65Q68l061k68K392k10
$$ plain form
1661 866 -1625 666 1422 -2136 -900 921 -536 -2315 1902 -15 -2109 -1059 1089 -1524 -892 1418
1677 1418 427 -1623 39 787 -1483 503 1930 -290 -508 617 554 -1352 329 1632 -492 -708
1693 -708 1190 790 -1013 1530 1457 -1350 -417 1144 -194 -843 828 457 -1806 -215 1119 -1238 -1314
1710 -1314 947 -531 -2002 -91 983 -1331 -908 1341 -389 -1742 424 874 -1043 609 1284 -653
1726 -653 -1442 1293 444 -1100 1300 1704 -792 -308 1498 40 -1407 1468 1252 -1891 -654 814
1742 814 -935 -911 1557 2 -1522 65 672 -1603 -399 1351 -902 -1978 -215 646 -1683 -287
1758 -287 1025 -1092 -1201 799 -47 -1308 342 1129 -754 -431 1573 162 -535 1374 916 -1218 129
1775 129 1567 -496 -400 1570 776 -1596 89 1609 -607 -565 1209 -368 -1412 578 812 -1272 217
$$ packed form
1661H66k491K291P56l558J236J821j457j779M217j917k094J050K148k613O32K310
1677A418r91k050J662P48k270J986J427k220k18J125o3j906J681J303k124k16
1693g08J898m00j803K543p3k807R33J561j338o49J671l71k263J591J334k357p6
1710a314K261j478j471J911J074k314M23K249j730j353K166M50j917J652O75j937
1726f53p89K735q49j544K400M04k496M84J806j458j447K875k16l143J237J468
1742H14j749K4K468j555j524J587O07k275J204J750k253j076J763Q61k329J396
1758b87J312k117j09K000q46j261J650P87j883L23K004j411o97J909m58k134J347
1775A29J438k063R6J970p94k372J685J520k216M2J774j577j044J990K34k084J489
$$ plain form
1792 217 779 -1071 -1284 654 -271 -1482 276 1059 -1022 -1560 1390 -49 -1176 729 824 -962 -51
1809 -51 1134 -359 2 1599 749 -1234 682 1624 -659 -382 1730 245 -1273 703 935 -761 -356
1826 -356 829 -447 -1188 329 146 -1302 205 664 -1304 -1154 643 -73 -1631 407 999 -1436 -790
1843 -790 1260 -308 -1026 1027 658 -945 106 1280 -246 52 1429 126 -1033 928 1112 -631
1859 -631 406 1646 -180 -1164 760 786 -1052 -394 1226 -753 -1015 462 -111 -951 34 382 -1688
1876 -1688 -556 651 -388 -1344 911 551 -1115 11 859 -622 -836 1704 756 -1177 354 789
1892 789 9 601 893 -191 -103 1162 633 -751 334 1047 -382 -706 862 626 -1289 212 1253
1909 1253 -513 -1135 309 29 -1521 -131 630 -1872 -195 755 -1053 -401 954 58 -1819 359
$$ packed form
1792B17N62j850k13J938r25j211J758P83k081n38K950j439j127J905R5j786R11
1809e1J185j493L61J597q50j983J916R42k283K77K112j485j518J976K32j696M05
1826c56J185j276p41J517j83j448J507M59j968J50J797p16j558K038N92k435O46
1843g90K050j568p18K053l69j603J051J174j526K98J377j303j159J961J84j743
1859f31J037J240j826r84J924K6j838O58J620j979k62J477n73q40R85L48k070
1876a688J132J207j039r56K255l60j666J126Q48j481k14K540r48j933J531M35
1892G89p80N92K92j084Q8J265n29j384J085P13j429l24J568k36j915J501J041
1909A253j766o22J444k80j550J390P61k502J677R50j808O52J355q96j877K178
$$ plain form
1925 359 1364 -862 -394 1052 -203 -1351 649 659 -1531 932 1281 63 -1369 97 398 -1231
1941 -1231 169 927 -875 -333 1269 -14 -1304 594 1182 -1892 -465 243 -299 -574 -274 -273 -1347
1958 -1347 -489 68 -850 -399 1119 140 -1066 507 635 -868 -110 1162 -53 -805 1471 1129 -698
1975 -698 1379 1010 -359 -1031 1825 -33 -227 974 661 -574 -332 970 -186 -884 1216 645 -909
1992 -909 -360 278 -312 -928 548 100 -1163 -50 -28 -1185 219 916 -591 -511 466 833 -1257 -13
2010 -13 1661 -415 -935 785 763 -559 905 939 -457 125 679 158 -279 1108 -180 -1403 -87 1082
2028 1082 -1143 -27 1267 -519 -1443 -403 550 -543 -471 1096 38 -1338 -325 -312 -696 287 907
2045 907 -784 -595 1139 278 -1200 560 1305 -1255 -350 1035 183 -589 1026 1232 -400 -482 658
$$ packed form
1925C59J005k226M68J446j255j148K000J0k190K463L49j218j432J466L01j629
1941a231J400P58j802N42J602j283j290J898N88l074J427P08n42k75L00Jj074
1958a347Q58N57r18M51J518r79j206J573J28j503P58J272j215p52K276l42j827
1975f98K077l69j369o72K856j858j94J201l13j235K42J302j156o98K100n71j554
1992i09N49O38n90o16J476m48j263J113K2j157J404O97j507Q0R77L67k090J244
2010a3J674k076n20J720k2j322J464L4j396N82N54n21m37J387j288j223J316J169
2028A082k225J116J294j786r24J040R53j093P2J567j058j376J013J3l84R83O20
2045I07j691J89J734q61j478J760P45k560R05J385q52p72J615K06j632q2J140
$$ plain form
2062 658 -259 -617 808 488 -462 422 353 -409 -124 1016 -447 -1184 504 636 -1304 -434 897 -723
2080 -723 -1253 616 -62 -710 -104 392 -803 196 1248 -283 -1032 591 696 -1142 239 1145 64
2097 64 -544 1221 511 -48 430 705 -25 41 733 -404 -425 518 357 -1065 -95 949 -1001 -859 693
2116 693 353 -1351 -55 736 -659 -1237 355 -236 -784 450 96 -872 23 622 -604 -336 662 330
2134 330 -757 532 1132 26 -384 1305 427 -756 308 792 -354 208 586 -295 -363 806 21 -777
2152 -777 237 625 -941 -502 778 19 -1165 244 493 -848 -854 448 127 -630 205 108 -629 51 618
2171 618 -326 -65 1124 37 -692 648 946 -586 30 1115 77 -539 579 615 -286 362 464 -65
2189 -65 -518 468 -189 -936 526 431 -1195 -110 787 -440 -904 508 379 -1139 -606 713 -411 -954
$$ packed form
2062F58r17l58J425l20r50Q84o9p62K85J140j463p37J688J32j940Q70J331j620
2080g23n30J869o78o48O06M96j195R99J052j531p49J623J05j838J381R06j081
2097F4o08J765p10n59M78K75p30O6O92j137k1R43j61j422R70J044j950J42J552
2116F93l40j704J296P91j395n78J592n91n48J234l54r68Q95N99j226K68R98l32
2134C30j087J289O00j106m10J689q78j183J064M84j146N62L78q81o8J169p85p98
2152g77J014L88j566M39J280p59j184J409K49j341oJ302l21p57Q35r7p37O80N67
2171F18r44K61J189j087p29J340K98j532O16J085j038o16J118L6r01O48J02n29
2189f5m53R86o57p47J462r5j626J085Q97j227m64J412j29j518N33J319j124n43
$$ plain form
2207 -954 543 85 -614 152 532 -521 219 1071 -189 -411 872 826 -585 329 1189 -216 -580 815
2225 815 580 -683 200 597 -408 -263 608 -120 -539 446 -41 -1227 -80 503 -676 -1005 702 17
2243 17 -988 -243 441 -497 -733 456 -82 -655 -27 248 -400 137 560 -350 -332 840 536 -608 169
2262 169 945 -434 -414 1250 8 -233 -64 264 -417 -717 18 -33 -636 849 -408 -1042 -5 623 -1010
2281 -1010 -300 772 -336 -1260 200 657 -651 -134 659 53 -627 419 399 -314 506 465 -382 137 1027
2300 1027 -45 -601 888 981 -744 -132 1081 0 -684 589 532 -638 -125 383 -531 -365 345 -490
2318 -490 -638 189 98 -989 -173 584 -496 -1056 421 126 -991 -338 471 -342 -657 565 73 -298 265
2337 265 536 -563 270 828 -371 -224 1012 534 -712 198 931 -663 -484 725 93 -736 57 587
$$ packed form
2207i54J497m58o99P66L80j053P40Q52j260k22J283m6j411R14Q60j405l64J395
2225H15k35j263Q83L97j005J45Q71p28m19R85m87j186J147N83j179l29J707o85
2243A7j005P45O84r38k36J189n38n73O28K75o48N37M23r10J8J172l04j144P77
2262A69P76j379K0J664j242k41J69L28o81l00P35n1o03J485j257o34J037O28j633
2281a010P10J072j108r24J460M57j308N17P93o06o80J046k0p13Q20m1q47N19Q90
2300A027j072n56J489R3j725O12J213j081o84J273n7j170N13N08r14J66P10q35
2318d90j48Q27r1j087Q16P57j080n60J477k95j117O53Q09q13l15J222m92l71N63
2337B65K71j099Q33N58j199J47J236m78j246R10P33j594J79J209o32q29P93N30
$$ plain form
2355 587 -384 -193 414 -454 -768 90 -221 -1004 60 401 -1097 -684 499 58 -917 324 632 -444
2373 -444 -391 830 77 -460 686 319 -409 125 611 -187 171 822 179 -690 485 726 -396 -286 903
2392 903 90 -795 286 352 -740 -354 301 -464 -562 404 -283 -880 247 372 -657 -514 704 -404 -962
2411 -962 357 284 -649 62 525 12 -405 801 254 -502 330 557 -40 357 790 106 -354 819 561
2430 561 -630 184 881 -145 -559 597 205 -747 5 227 -545 -272 243 -181 -765 96 61 -1137 -26
2449 -26 474 -646 -724 506 268 -635 -60 502 -302 -307 627 152 -500 410 492 -340 221 514 75 -451 564
2470 564 264 -600 237 563 -290 -447 485 41 -736 197 196 -565 -311 283 -339 -545 464 69 -911 86
2490 86 318 -682 -296 539 -59 -437 339 512 -547 -9 747 10 -358 621 433 -230 443 723 25 -75
$$ packed form
2355E87r71J91O07q68l14Q58l11p83J064L41j498M13J183m41r75J241L08j076
2373d44N3J221p53n37J146l67p28N34M86p98L58O51o43q69J175K41j122J10J189
2392I03q13q85J081O6j092L86O55p65r8R66o87n97J127J25j029J43J218j108n58
2411i62J319p3r33P11M63n13m17J206n47p56Q32K27n97L97M33o84m60J173k58
2430E61j191Q14O97j026m14J156l92r52P52K22p72K73N15m24n84Q61l5j198J111
2449b6N00j120p8J230k38r03N75N62q04nR34m75o52R10Q2q32N61K93m39n26J015
2470E64l00q64Q37L26q53j57R32m44p77R33jp61K54N94o22k06J009l95r80R97
2490H6K32j000L86Q35n98l78P76J73j059N38P56p37l68R79j88o63O73K80o98j00
$$ plain form
2510 -75 598 68 -376 646 287 -541 -151 680 -231 -497 350 245 -505 -16 215 -471 -496 270 -63 -831
2530 -831 -19 168 -301 -165 446 -215 -440 548 350 -623 -28 516 -88 -166 840 221 -389 68 615 -353
2550 -353 66 576 42 -434 521 173 -631 -153 647 -247 -513 338 -359 -628 -255 162 -278 -116 341 -161
2570 -161 -518 282 187 -599 50 547 -359 -411 471 173 -516 219 597 -301 -100 661 238 71 541 300 -603
2591 -603 98 631 -284 -444 548 143 -467 254 414 -484 -276 442 -410 -723 125 116 -570 -297 333 -329 -384
2612 -384 434 -125 -605 306 523 -531 -407 608 337 -317 544 547 -392 -338 564 -22 -253 759 239 -379
2632 -379 122 563 -352 -299 346 -297 -431 389 366 -848 -322 591 -334 -492 107 93 -783 -52 386 -481 -353
2653 -353 302 -134 -518 253 586 -321 12 454 -310 -368 572 477 -254 424 581 -160 -308 565 264 -415 237
$$ packed form
2510g5O73n30m44J022l59q28L90Q31r11k66Q47j05p50M89K31o86k5P66l33p68
2530h31Q12J87m69J36O11o61k25R88j98r73N95N44o04p8J006o19o10M57N47r68
2550c53M19N10n34m76R55l48q04M78Q00q94k66Q51o97k69L73M17m40J62M57n02
2570a61l57Q00r5p86O49M97r06n2Q82k98o89P35L78q98K01P61m23j67M70k41r03
2591f03P01N33r15j60R92m05o10P21J60q98K08P18q52l13Q48ro86K73O30o62n5
2612c84Q18n59m80R11K17j054J24J015k71o54Q61Lr39N4R02n86k31J012n20o18
2632c79N01M41r15N3O45o43j34Q20k3j214N26R13r25j58N99j4q76P31M38q67J28
2653c53O55m36l84P71L33r07L33M42p64n8R40r5p31O78J57p41j48Q73l01o79O52
$$ plain form
2674 237 272 -417 11 328 101 -391 416 170 -578 76 397 -442 -428 193 -271 -830 -32 319 -403 -158 151
2695 151 -119 -294 471 47 -532 120 379 -474 -22 647 262 -317 170 588 -169 34 480 4 -315 405
2715 405 383 -250 229 172 -299 -400 345 -54 -294 269 269 -753 -335 247 -284 -825 -12 -44 -466 -345 471
2736 471 -634 -234 287 -54 -556 1024 -26 395 481 650 239 -940 527 -124 -280 680 781 -548
2754 -548 -571 490 178 -276 112 471 -185 -399 613 51 -420 210 -23 -398 -170 149 -413 -507 231 -165
2774 -165 -492 -27 351 -234 -191 226 126 -418 163 263 -226 135 577 -25 -132 590 327 -130 3 528
2794 528 -101 74 477 -46 -399 180 95 -245 -24 101 -211 -310 122 -21 -532 -125 330 -572 -376 3 -182
2815 -182 -557 314 157 -579 -47 400 61 -397 430 171 -191 135 422 -152 37 683 366 -286 232 306
$$ packed form
2674B37L5o89M28L17k27m92Q07k46p48O54L21q39J4O21m64n59P98L51p22K45L09
2695A51k70j75P65m24n79O52K59q53M52O69l85n79M87M18p57K03M46m76l19P20
2715D05k2o33M79n7m71j01P45l99k40N63%j022M18N82n31n41Q13l2m22J21Q16
2736D71j105M00N21l41n02J580j050M21Q6J69m11j179J467o51j56R60J01j329
2754e48k3J061l12m54L88L59o56k14J012n62m71O30k33l75K28L19n62r4P38l96
2774a65l27M65L78n85M3M17j00n44N81J00m89L61M42o02j07P22k63m57J33N25
2794E28o29J75M03n23l53N79q5l40K21J25l12r9M32j43n11M07M55r02J96L79j85
2815a82l75Q71j57p36N32M47l39m58Q27k59l62L26K87n74J89O46l17o52N18P4
$$ plain form
2835 306 -381 -118 650 85 -348 275 -63 -552 -55 211 -454 -353 391 -185 -435 214 78 -556 -162 281
2855 281 -240 -280 43 88 -467 172 158 -216 -234 690 146 -411 147 396 -443 -90 454 -13 -96 315 345 -380
2877 -380 51 564 -68 -41 272 141 -409 176 301 -308 -194 213 -386 -325 61 285 -605 -273 256 -350 -451
2898 -451 432 -140 -514 330 185 -247 -209 400 -103 -447 372 -58 -107 -69 665 86 -251 536 -13 -320 520
2919 520 647 -365 -184 426 -219 -237 332 140 -567 -136 440 -207 -420 337 -26 -526 145 252 -377 -171
2939 -171 343 -169 -473 363 -133 -292 -212 422 -31 -297 444 38 -369 223 715 -108 140 534 232 -466
2959 -466 509 615 -14 293 270 -246 -199 235 127 -501 93 150 -528 -214 147 -269 -494 304 85 -268 67
2980 67 322 -106 -400 516 205 -506 -72 159 -206 -128 130 308 -227 250 420 -69 165 387 -242 -115 454
$$ packed form
2835C06o87K63P68n65m33O23l38m89M97K66o65J01P44n76k50O49j36o34L94M43
2855B81n21m0L23M5n55O39j4l74j8R24n44n57N58K49q39L53N44m67q3M11L0p25
2877c80M31N13o32K7L13j31n50N85J25o09J14M07n99O1L86K24q90L32N29o06j01
2898d51Q83n72l74Q44j45m32L8O09n03l44Q19m30m9L8P34n79l37P87n49l07Q40
2919E20J27j012J81O10o45j8N69j92p07M31N76o47k13P57l63n00O71J07o29K06
2939a71N14n12l04Q36m96j59Q0O34m53k66P41m06m07N92M92q23K48L94l02o98
2959d66R75J06o29L07k3n16M7M34j08o28N94N7o78L14L61m16k25P98k19l53L35
2980F7K55m28k94R16l11p11M34K31l65P8K58J78n35M77J70m89K34K22o29J27N69
$$ plain form
3001 454 279 -280 -6 93 -305 -177 298 -22 -397 51 117 -349 -237 223 -353 -241 87 -28 -405 -117 457
3022 457 -233 -351 232 51 -344 419 488 26 8 446 318 147 481 271 -137 130 491 -273 -13 589 233
3043 233 -195 326 322 -466 -330 399 -281 -259 150 -147 -650 -61 122 -534 -215 202 -171 -388 214 192 -300
3064 -300 -204 197 -63 -242 -33 219 -247 203 281 -237 80 622 122 83 151 513 -41 -156 316 113 -180
3085 -180 213 181 -456 -82 173 -76 -222 99 -74 -349 22 28 -496 -125 256 -172 -322 426 -17 -164 -202
3106 -202 -70 -4 -188 235 69 -233 148 385 -67 -23 344 154 -241 476 165 -338 -82 330 14 -355 362
3127 362 208 -302 113 440 -227 -295 266 -241 -278 176 282 -499 -356 232 -201 -256 -3 167 -294 -43 235
3148 235 -244 -60 400 -4 -383 317 63 -228 187 181 10 -238 394 159 -227 -100 87 -166 153 119 -7
$$ packed form
3001D54j75n59K74R9l98J28M75l20l75M48O6m66J12M60n76J12L28j15l77K88N74
3022D57o90j18N83j81l95P63O9m62j8M38j28j71L34k10m08K67L61p64K60O02l56
3043B33m28N21mp88J36P29o80K2M09k97n03N89J83o56L19M17l73k17O02k2m92
3064c00R6M01k60j79K09K52m66M50P8n18L17N42n00l9O8L62n54j15M72k03k93
3085a80L93l2o37L74K55k49j46L21j73k75L71On24L71L81m28j50P48m43j47l8
3106b02J32O6j84M23j66l02L81K37m52M4L67j90l95P17l11n03K56M12l16l69P17
3127C62j54n10M15L27o67o8N61n07l7M54J06p81J43N88m33n5K53J70m61K51K78
3148B35m79J84M60m04l79P00k54k91M15oj71k48O32k35l86J27J87k53L19l4j26
$$ plain form
3169 -7 -243 -24 -27 -364 17 455 -230 -455 159 -259 -293 -158 142 -324 -116 291 29 -264 70 17 -61 46
3191 46 720 127 -152 445 301 -256 259 226 -256 -249 200 154 -227 300 393 -321 45 264 -135 -276 102 163
3213 163 -456 -202 169 -152 -16 112 -76 -301 -127 112 -416 -1 289 -242 -204 73 -101 -296 141 290
3233 290 -156 -105 404 386 -298 229 337 80 169 470 53 -120 316 89 -255 225 313 -178 -231 139 168 -325
3255 -325 14 140 -393 -69 122 -419 -462 91 82 -395 -56 216 -205 -141 190 -129 -189 76 131 23 44 237
3277 237 204 -37 362 198 -135 133 263 35 -256 297 251 -79 -32 194 -381 -259 97 -31 -342 3 -238
3298 -238 -531 -191 151 -261 -161 240 177 -213 93 198 -25 -174 247 113 -174 -1 248 -10 -2 315 -47
3319 -47 6 363 -16 41 -108 -157 -283 -6 199 8 10 339 -95 -306 -127 321 -154 -97 113 -99 -200 15
$$ packed form
3169gk36K19ll37L81M38o85k25O14m18l4J35L00m66K08M07k62k93L34n3p8J07
3191D6O74n93k79N97j44n57N15l3m82PM49m6l81N27R3p14L66K19l99j41L78O1
3213A63o19K54L71l21J36J28j88k25J74K39n28M15K90n31L8K77j74j95M37J49
3233B90m46N1N09j8o84N27J08k57Q9L01m17j73M36k27l44M80Q8m91n3L70K9m93
3255c25L39J26n33L24J91n41m3N53rm77L39K72m21O4L31l19o0K65N5j08K1J93
3277B37l3k41L99j64l33K68J30k28k91N53m6l30M7K26n75J22L56j28l11L45k41
3298b38k93L40L42m12J00M01o3l90L06J05k23j49M21j34k87J73K49k58QL17l62
3319d7N3L57l79N7j49m9j26K77K05j91KL29m34k11J79M48m75N7K10k12j01K15
$$ plain form
3341 15 135 -392 -196 14 -115 -226 32 144 -82 -41 362 -264 -163 267 272 108 190 511 -107 -111 287 184
3363 184 -410 194 119 -165 -125 410 -8 -161 262 -5 -225 2 -11 -327 33 86 -119 -428 -90 148 -424
3384 -424 -153 136 -144 -62 87 -163 -377 0 183 -202 -114 452 3 -204 187 195 -94 217 442 86 -330
3405 -330 177 241 -204 -199 171 -102 33 217 105 -76 103 31 -429 -99 3 -203 -121 -44 86 -509 111 453
3427 453 -104 -193 64 23 -239 40 71 -328 -140 287 117 -158 160 325 -70 200 464 -155 -76 226 94
3448 94 -417 68 53 -331 -76 136 -228 -110 150 -80 -518 -62 6 -125 -112 234 -22 -301 -90 54 -353
3469 -353 -55 271 -11 -167 147 295 -212 155 137 148 -112 241 75 120 222 254 74 -110 377 -66 -131 -14
3491 -14 72 -19 188 120 -1 69 373 59 -159 -55 234 -261 -60 -205 -32 -345 169 224 -208 -179 280 -46
$$ packed form
3341A5J20n27J96K10j29j11K58J12k26M1M03o26J01M30Nj64Q2L21o18mL98j03
3363A84n94O04p5k84M0N35m18j53M23k67k20K27j3l16L60N3k05l09L38K38n72
3384d24K71K89k80Q2J49k50k14L77J83l85Q8N66m49k07L91Qk89L11K25l56m16
3405c30N07O4m45NL70k73J35J84j12j81J79p2m60L30J02k06Q2P7J30n95O20L42
3427D53n57q9K57m1k62K79L1l99J88M27j70k75L18J65l95K70K64o19P9L02j32
3448I4n11M85j5l84K55K12l64J18K60k30m38M56O8j31J3L46k56k79K11J44m07
3469c53K98L26k82j56L14J48n07L67j8J1k60L53j66M5J02L2j80j84M87m43o5J17
3491a4Q6r1K07o8j21P0L04l14k18J04K89m95K01j45J73l13N14N5m32K9M59l26
$$ plain form
3513 -46 -367 201 105 28 360 303 12 -81 326 -13 47 189 172 -98 189 276 254 -277 109 43 -125 72 10 -109
3537 -109 -288 51 -51 -359 116 115 -74 31 -3 -117 -29 -146 -180 -337 -3 219 -106 -211 277 -133 -19 55
3559 55 195 -161 41 317 -88 117 152 220 -112 90 154 -232 -77 388 128 -229 -37 86 -95 -136 -26 -178
3581 -178 -202 61 18 -247 -85 -55 -158 -270 238 28 -321 63 41 -183 -119 215 11 -71 134 -75 70 243
3603 243 72 -256 -107 370 58 -185 221 389 -68 49 317 77 167 8 -91 -160 -71 33 202 -884 353
3624 353 -262 -414 -146 -91 -231 288 222 -46 -309 -177 89 -247 226 118 -108 -189 34 -108 68 134 192 -83
3646 -83 98 261 -63 159 241 257 -70 33 410 -161 -198 57 -102 -210 -52 152 -130 -278 357 -155 -241 17
3668 17 395 -194 -241 125 -67 -291 238 125 -184 145 205 -69 -107 291 -85 213 234 42 78 1 152 24
$$ packed form
3513d6l21N68r6p7L32n7k91r3M07l39O0J42j7k70K87Q7k2n31L86o6j68J97o2j19
3537a09j79L39j02l08M75jj89J05l4j14Q8j17l4j57L34K22l25j05M88m10J14P4
3559E5J40l56K02K76m05K05L5O8l32K02O4l86J55M65k60l57J92J23j81m1J10j52
3581a78k4K63m3k65J62L0j03j12N08k10l49L84k2k24O4L34k04q2K05k09J45J73
3603B43j71l28J49M77l12k43M06J68m57J17K68k40R0j59r9o9Q9J04J69j086J237
3624C53o15j52K68N5j40N19o6k68k63J32K66l36M73j08k26q1K23j42J76O6N8k75
3646h3J81J63l24K22Q2J6l27J03L77n71l7K55j59j08J58K04k82j48O35n12q6K58
3668A7L78n89m7L66j92k24N29j13l09L29O0k74l8L98l76K98K1j92L6p7J51j28
$$ plain form
3690 24 226 235 246 -283 -137 109 -108 39 79 164 -466 -212 75 -328 -141 223 -162 -183 240 -27 -197 159
3712 159 -127 -124 -152 177 -3 -72 92 28 -259 -87 221 -300 -162 249 126 81 48 17 7 -68 180 -130 -165 163
3736 163 276 -118 -277 -84 -20 -116 146 -38 -198 -55 -23 -147 86 24 -180 -239 3 87 -117 -72 247 -82
3758 -82 -284 26 94 -38 28 414 -48 47 52 71 -206 100 325 5 36 -70 139 -125 -24 -154 -22 79 245
3781 245 -68 -287 68 -74 -25 82 177 -98 -224 -31 -92 74 -67 -22 -248 153 368 -369 -137 -226 157 5
3803 5 104 206 8 213 182 -112 137 -134 424 -2 114 251 -147 -1 104 84 -148 -147 187 -184 -119 0 -219
3826 -219 -265 48 -184 -281 94 -80 106 70 3 62 -117 30 46 40 -18 192 87 -167 220 122 -126 6 92 49
3850 49 -168 26 127 -83 46 123 -24 -218 -28 -100 -184 105 30 -164 49 -5 107 -89 12 -251 -262 154
$$ packed form
3690B4K02RJ1n29J46K46k17J47M0Q5o30K54K87m03J87L64l85k1M23k67j70L56
3712A59k86Lk8L29j80o9J64o4k87J72L08n21J38M11j23m5l3l1j0p5K48l10l5L28
3736A63J13l94j59J93O4r6K62j84j60J43L2j24K33o2k04n9K42Q4k04M5L19l29
3758h2k02L10O8j32O6L86m62R5NJ9k77L06K25l20L1j06K09k64J01j30J32J01J66
3781B45l13k19L55j42M9J07R5k75j26J93o1J66j41M5k26M01K15p37K32q9L83j52
3803ER9J02j98K05l1k94K49k71N58m26J16J37l98J46J05k0k32JL34l71O5J19k19
3826b19m6L13k32r7L75j74J86l6o7N9j79J47J6on8K10j05k54L87r8k48J32Q6m3
3850D9k17J94J01k10J29P7j47j94J90p2q4K89p5j94K13n4J12j96J01k63j1M16
$$ plain form
3872 154 -64 -51 -73 171 17 -233 -6 -26 -282 344 -14 96 -231 348 265 -265 -10 -132 248 -7 401
3893 401 63 -267 363 290 -140 -188 339 217 47 1022 193 718 428 20 -390 -505 -72 -250 -252 357 -231
3914 -231 -80 -37 157 -87 -135 256 204 -342 46 172 66 -129 147 141 18 220 166 -186 147 499 105 -80
3936 -80 342 5 -51 171 4 -12 29 195 -423 71 123 218 -233 42 -17 -117 -283 134 -86 -182 -91 0 -174
3959 -174 86 -169 -37 -95 188 -100 -189 105 182 111 -141 281 229 -102 -85 372 28 -40 19 67 -187 225 186
3982 186 -52 87 291 -117 131 236 -20 -233 -102 12 -127 -159 221 -28 -91 -30 72 -172 170 182 -122
4003 -122 17 119 112 -161 -7 -148 116 -133 436 46 -258 -186 -15 -12 -135 -65 15 -85 -83 -258 -76 165 -173
4026 -173 -268 -59 107 752 -488 -163 -177 -365 -262 65 -116 -130 -96 -29 11 57 163 6 -12 107 -108 -26 180
$$ packed form
3872A54k18J3k2K44j54k50K27k0k56O26l58J10l27N79q3n30K55j22L80k55M08
3893D01l38l30O30p3m30m8N27j22j70R75q29N25k90m08m10j15M33j78kO09n88
3914b31J51M3J94k44m8L91n2n46L88J26j06j95K76oj23K02n4l52L33L52l94j85
3936h0M22l37n6K22j67j6M1J66o18M94N2R5m51K75n9j00j66M17k20r6R1R1j74
3959a74K60k55J32n8K83k88q9K94P7p1k52M22n2l31J7M57l44o8N9M8k54M12l9
3982A86k38J39K04m08K48J05k56k13J31J14j39l2L80k49o3O1J02k44L42J2l04
4003a22J39J02pk73J54j41K64k49N69l90l04P2J71Lj23P0Q0j00Kj75J82K41l38
4026a73r5K09J66O45j240L25j4j88J03L27j81j4L4O7M0M6J06j57j8J19k15Q2K06
$$ plain form
4049 180 -39 18 -137 84 81 -50 72 66 -238 84 189 137 -91 54 230 -136 -334 -19 -21 10 161 -76 -83 110
4073 110 -65 -93 -280 60 -68 -73 9 191 -22 24 -37 -36 -75 19 147 128 197 -11 -24 222 -7 83 -36 289 155
4098 155 -200 189 63 -153 -121 234 -9 -136 224 215 227 -36 110 8 -160 -19 -80 -121 -203 121 -281 -237 86
4121 86 -229 -285 -1 82 -49 -156 19 -84 -111 192 -45 59 -30 74 436 -65 39 138 -34 -42 104 -105 -39
4144 -39 205 44 -22 181 207 -130 -192 114 -228 11 105 -219 -119 191 -60 -225 -90 218 -32 10 -5 39 85
4167 85 43 1 -75 -113 -63 47 263 282 77 -18 -10 159 -135 -215 1 6 61 -159 57 -12 -30 -79 207 -136 -78 -33
4193 -33 199 -95 105 10 20 261 12 -311 -149 187 -80 80 -102 102 -128 -92 131 167 -75 85 -257 204
4215 204 282 -65 20 132 26 -433 -80 30 -128 59 64 242 272 157 32 27 -198 -182 -100 -48 -11 446 10 -330
$$ packed form
4049A80k19N7j55K21lj31J22ol04L22J05n2k28J45J76l66j98L15kL1J51k37pJ93
4073A10j75k8j87L40j28nQ2J82k13M6o1Jl9R4J28j9O9k08j3K46k29R0j19L25j34
4098A55l55L89j26k16L2L55k43j27L60rJ2k63J46j02j68J41o1m1q2L24m02M4L23
4121H6l15n6K84Q3j31j07J75j03k7L03k37J04q9J04L62n01J04R9j72qJ46k09O6
4144c9K44j61o6K03K6l37o2L06l42K39R4l24J00L10k51j65J35L08k50M2j5M4M6
4167H5m2m2p6l8N0J10K16J9k05r5QJ69k94q0K16NN5k20K16o9j8m9K86l43N8M5
4193c3K32k94K00r5J0K41k49l23J62L36k67J60j82K04k30L6K23L6k42J60l42M61
4215B04P8l47Q5J12j06m59L53J10j58J87NJ78L0j15j25nk25J6Q2N2L7M57m36l40
$$ plain form
4239 -330 -76 -35 -92 -68 13 -214 -25 20 126 -157 -49 592 84 156 12 -36 111 -176 -115 15 73 -94 -224
4262 -224 -112 39 72 246 15 -179 -49 167 197 71 -573 53 -122 173 -6 214 -227 39 430 -345 -120
4283 -120 332 -323 -270 -18 315 131 -29 201 108 158 41 229 3 -263 278 -139 293 -169 -487 -262 -285
4304 -285 48 566 14 172 136 -677 -24 293 88 -111 -110 234 112 1 98 -387 -411 -195 -351 -4 -17 110
4326 110 -66 302 -199 -335 -130 126 -324 -337 -443 42 384 -247 -27 102 574 198 290 -50 -109 263 -261
4347 -261 -97 48 244 -360 134 111 52 508 -117 -66 93 179 -32 -291 -70 492 -339 -323 -262 -471 40 -189
4369 -189 314 146 186 437 75 -541 -321 484 -195 -411 -274 41 257 -237 280 -22 -287 -6 153 -247
4389 -247 140 -227 46 -330 -158 -365 -741 47 719 -132 -232 574 151 -71 -331 -117 62 -333 -689 350
$$ packed form
4239c30K54M1n7K4Q1k27J89M5J06k83J08O41n08P2j44m8J47k87O1J30N8j67j30
4262b24J12J51L3J74k31j94J30K16L0j26o44O26j75K95j79K20m41K66L91p75K25
4283a20M52o55N3K52L33j84j60K30r3N0j17J88k26k66N41m17M32m62l18K25k3
4304b85L33N18n52J58l6q13O53L17k05j99JL44j22j11R7m85k4K16j56L47j3J27
4326A10j76L68n01j36K05K56m50j3j06M85L42o31K20J29M72l76R2l40n9L72n24
4347b61J64J45J96o04M94k3n9M56o25N1J59Q6k11k59K21N62q31J6O1k09N11k29
4369a89N03j68M0K51l62o16K20Q05o79k16J37L15K16m94N17l02k65K81J59m00
4389b47L87l67K73l76J72k07l76P88O72q51j00Q06m23k22k60K14J79l95l56J039
$$ plain form
4409 350 189 23 -407 215 -345 -276 171 102 -547 7 -145 59 70 316 530 -663 -231 484 -233 -111 20
4430 20 -963 145 -673 -167 381 -161 -213 157 144 -201 -203 -235 -54 -64 302 45 -11 -170 94 -82 -1 57 -40
4453 -40 -67 76 -8 -111 -128 110 34 12 -82 -67 -59 129 -9 92 76 126 -254 -161 35 -113 -194 29 -107 -298 201
4478 201 -2 -264 87 -37 -202 -163 -34 246 65 2 -102 -60 -33 146 -211 -209 164 84 -150 212 111 -140
4500 -140 -50 76 158 -179 69 48 25 210 2 138 -92 128 46 67 -161 -157 -209 -196 -37 182 121 -60 35 -31
4524 -31 -296 113 35 -221 30 -57 14 -149 71 -122 -95 67 200 -202 81 264 -104 154 211 -89 -33 106
4546 106 136 -20 -16 81 61 -9 -48 -87 -91 124 133 7 245 152 -214 -140 -131 -15 66 82 -48 43 -115 53 90 -148 -79
4573 -79 383 30 -155 165 169 283 -23 112 -154 -127 145 60 181 -15 -76 -153 -625 577 -306 -21 144 -45
$$ packed form
4409C50j61j66m30O22n60O9M47o9o49N54j52K04J1K46K14j193M32P15p17J22J31
4430B0r83J108q18N06N48n42n2L70j3l45kl2J81j0L66k57n6j59K64j76Q1N8r7
4453d0k7J43q4j03j7K38p6k2r4J5QJ88j38J01j6N0l80R3J96j48q1K23j36j91M99
4478B01k03k62L51j24j65L9J29K80j81o3j04M2K7J79l57KL73q0k34L62j01k51
4500a40R0J26Q2l37K48k1k3J85k08J36k30K20q2K1k28Mn2J3J59K19o1j81R5o6
4524c1k65M09p8k56K51q7P1j63K20j93K7J62J33m02K83J83l68K58N7l00N6J39
4546A06L0j56MR7k0p0l9l9mK15Rj26K38r3l66P4RJ16Q1J6j30R1j58J68L7k38O9
4573g9M62l53j85L20MJ14l06J35k66K7K72q5J21j96o1p7m72J202q83K85J65j89
$$ plain form
4595 -45 381 -1010 -209 -765 -34 581 224 -32 -274 -485 -91 66 -9 -132 -156 58 186 -29 -200 322 -31
4616 -31 -36 -53 21 27 74 -179 -113 16 83 149 -49 187 13 -125 -101 81 -28 85 -27 -24 -164 72 122 63 -63
4641 -63 -49 -209 -221 55 88 92 109 25 -19 71 210 110 -117 -49 21 305 248 111 -151 41 84 302 -24 43 54
4666 54 -18 -69 349 199 96 192 42 -68 31 58 81 -15 37 33 -137 -19 27 -192 16 245 -164 -377 144 -34
4690 -34 -48 -67 -28 -11 -274 100 -57 -64 146 195 -201 58 -92 -41 -40 28 -110 65 -105 173 2 157 105 7 -66
4715 -66 152 136 199 -93 -151 3 140 -13 156 9 -140 -55 79 -82 -100 -37 -11 -7 -86 -124 -196 -5 -151 -151 -10
4740 -10 7 -102 69 253 120 -12 163 -38 -24 218 186 -4 -97 224 141 177 351 30 -124 -2 31 -39 -68
4763 -68 61 -287 -32 -51 124 -320 -241 -79 212 288 -78 357 1 179 57 -6 -83 29 -126 -95 -102 -34 114
$$ packed form
4595d5M26j391Q01n56P31O15l57k56k42k11L94J57p5j23k4K14J28k15j71N22l53
4616c1nj7P4OM7k53O6J29O7O6j98K36j74j38K4J82j09J13j12Lj40K36N0n9j26
4641f3J4j60j2K76L3MJ7q4m4R0J39j00k27O8P0K84n7j37k62J92M3K18l26O7J1
4666E4p2n1M18j50j03R6j50j10R9K7K3r6N2mj70J18M6k19K08K29m09k13N21j78
4690c4j4j9L9J7k63L74j57pK10M9l96K59j50N1JO8j38J75j70K78j71J55n2r8p3
4715f6K18j6O3k92n8J54J37j53J69j47j49Q5J34j61j8O3K6Mp9l8p2J91j46%J41
4740a0J7j09J71J84j33j32J75k01J4K42l2j90r3L21q3L6J74l21j54J22L3p0k9
4763f8J29l48K55j9J75m44P9J62K91P6l66M35l56J78j22o3p7J12j55L1pO8J48
$$ plain form
4786 114 109 153 -66 -221 28 103 118 16 -138 -174 -132 40 -294 -75 72 119 -93 -62 68 57 -104 -91 -177 -112
4810 -112 -44 109 -244 -248 -87 -176 -108 68 48 -13 -82 1 -269 179 198 -47 -277 103 14 -75 109 124 160 -16 -104
4835 -104 84 -4 -41 30 -21 -71 182 -216 161 -196 -67 -126 -46 131 31 207 -138 -170 42 -207 12 -96 34
4858 34 -164 -316 104 139 -49 152 69 57 155 -29 -20 23 90 30 191 -234 89 -134 -160 -329 -1 221 -137 -249
4882 -249 -87 -13 -80 68 -89 -316 -200 168 56 197 73 -105 -87 -26 -15 28 -270 97 -184 135 82 -344
4904 -344 242 -188 155 324 268 41 -44 63 184 91 -244 -308 -322 -77 -320 -171 -197 72 -239 123 -52 -442
4926 -442 173 6 -58 39 -251 -273 117 81 177 -152 27 -48 243 143 64 -17 167 85 338 197 -54 501 -248
4949 -248 -205 -89 71 455 191 323 -119 153 286 65 94 -7 -272 212 129 721 -86 -84 95 224 -215 -183
$$ packed form
4786A14nM4k19j55K49P5J5j02j54l6M2J72l34K19J47M7k12L1J30j1j61J3q6O5
4810a12O8J53l53mJ61q9O8J76k0o1o9Q3k70M48J9k45k30L80q9q9J84J5L6j76q8
4835a04J88q8l7P1n1n0K53l98L77l57J29n9Q0J77j00J76l45l2K12k49K19j08J30
4858C4j98j52M20L5j88K01q3j2R8j84RM3O7o0J61m25L23k23k6j69L28K22l58j12
4882b49J62P4o7J48j57k27J16L68j12J41j24j78J8O1J1M3k98L67k81L19n3m26
4904c44N86m30L43J69n6k27q5J07J21r3l35o4j4K45k43J49k6K69l11L62j75l90
4926d42O15j67o4R7k90k2L90l6R6l29J79p5K91j00p9q1J84q2K53j41k51N55p49
4949b48M3J16J60L84k64J32m42K72J33k21K9j01k65M84q3N92q07KJ79J29m39L2
$$ plain form
4971 -183 323 -201 -163 26 70 522 -7 -96 199 -372 -194 -759 419 -209 -127 -209 288 49 -68 366 491
4992 491 50 -91 -487 400 -313 -624 549 545 616 -191 15 169 148 120 -173 131 -487 504 -335 -41 -224
5013 -224 -185 977 -292 0 386 -253 387 -298 -186 106 487 437 -674 131 -5 -394 -591 583 97
5032 97 646 664 420 576 -145 78 277 -190 -222 -924 470 262 194 1032 1241 97 10 128 -88 144 199
5053 199 612 -465 161 -9 -521 287 -341 119 1193 242 -391 -259 -275 -787 80 113 -78 429 -40 59
5073 59 167 -162 -303 52 -46 -39 207 -149 -79 136 68 106 83 172 153 226 264 128 -19 -262 -68 -79 -231 321
5097 321 281 15 -46 436 162 66 72 398 -66 -136 278 110 230 -21 -6 186 189 -250 -293 85 -99 45 -230
5120 -230 384 179 -30 367 -77 -5 -29 -44 -26 -101 -41 -188 57 -25 -226 -100 231 161 -11 24 189 2 65
$$ packed form
4971a83N06n24L8J89M4M52n29q9K95n71J78n65J178o28Q2q2M97k39j17M34J25
4992D91m41j41l96Q87p13l11J173mP1q07K06J54k1k8k93L04o18R91q39K94j83
5013b24L9J162j269K92L86o39O40o85J12K92L81n0j111Q05j36l89j97J174m86
5032I7N49J8k44J56p21K23J99m67l2p02J394k08o8Q38K09j144q7J18k16K32N5
5053A99M13j077O26j70n12Q08o28M60J074r51o33J32j6n12Q67L3j91N07m69R9
5073E9J08l29j41L55r8PK46l56P0K15o8L8k3Q9j9P3L8j36j47k43J94j1j52N52
5097C21m0k66o1M82k74r6OL26m64p0M14j68J20k51J5J92Lm39m3L78j84J44k75
5120b30O14k05k09L97m44P2k4j5J8p5O0j47K45q2k01J26L31p0j72L5J65j87O3
$$ plain form
5143 65 56 -137 -12 160 132 -100 -148 78 -81 -52 359 -166 -30 -237 -67 -56 -16 -102 31 266 -164 161 -166
5166 -166 196 -105 -177 227 -630 79 579 209 96 1161 385 -249 -427 -234 -361 -401 272 -38 112 -47
5186 -47 -28 294 -77 87 379 115 126 -2 -184 51 -116 -2 103 214 38 -111 88 -201 -33 -54 194
5207 194 -236 42 -139 -70 -26 -82 64 -27 166 9 -63 -169 124 12 12 3 67 88 -55 205 7 129 90 205
5231 205 81 -12 86 -86 -20 40 132 -88 32 37 -58 34 32 163 180 -213 -10 -405 159 189 -54 -159 -164 1 -5 -163
5257 -163 -21 198 -147 -108 108 -15 67 24 163 224 -91 -51 -113 39 24 -33 117 228 -322 4 181 -29 64
5280 64 68 221 19 110 222 -147 -73 131 45 -158 107 31 -105 -127 8 -121 201 25 147 62 -156 -94 16
5303 16 -5 -49 -22 197 -132 132 -144 76 -59 195 64 151 -341 -362 645 344 -110 290 134 -183 74 101
$$ packed form
5143F5rj93J25J72k8k32m8K26j59K9M11n25J36k07J70J1M0q6J33K35m30L25l27
5166a66L62l01p2M04q57P09N00l70j13J065p76o34j78J93j27m0O73l10J50j59
5186d7J9L22l71J64K92k64J1j28j82K35j67J14J05J11j76j49J99k89J68k1K48
5207A94m30K78j81O9M4n6J46r1J93j57p2j06K93j12%rO4K1j43K60j98J22l9J15
5231B05j24r3R8j72O6O0R2k20J20Nr5R2kJ31J7l93K03l95N64L0k43j05nJ65oj58
5257a63J42K19l45L9K16j23Q2m3J39O1l15M0o2J52j5n7J50J11n50L26J77k10R3
5280F4MJ53k02R1J12l69P4K04q6k03K65p6j36k2J35j29L22j76J22q5k18O2J10
5303A6k1m4K7K19l29K64k76K20j35K54j31Q7m92k1J007l01m54M00j56l17K57K7
$$ plain form
5325 101 283 -111 -144 -184 -149 -216 -144 30 175 -151 62 -293 25 -73 101 -288 -2 55 83 -121 -64 65 127
5348 127 64 -27 -39 212 99 25 62 67 187 64 45 48 186 -91 -108 -105 140 -82 -48 -115 198 44 -86 -25 -39 6
5374 6 -306 128 2 86 55 85 30 9 -33 28 -89 -210 93 17 153 -81 -55 -70 148 21 57 -129 -84 -123 170
5399 170 98 99 -95 39 -119 84 153 166 141 -20 139 -47 -187 -301 28 -226 -28 -19 49 -399 -191 -11 150
5422 150 -81 -162 -252 113 -228 -170 -61 14 -9 -45 -53 160 141 212 -66 19 -49 -106 156 44 -118 197 87 387
5446 387 -240 74 -37 438 -380 33 -103 -73 310 -301 -393 349 -325 528 -143 -289 99 -406 -424 -274 182
5467 182 -131 69 -67 57 -108 3 -150 -27 -75 -157 154 201 -147 49 -28 60 -64 -69 -122 94 -45 23 123
5490 123 -24 24 -46 -299 71 94 -145 -142 48 -5 -41 172 -26 48 -85 211 -162 56 -21 120 150 -79 -36 175
$$ packed form
5325A01J82l94l3m0L5o7P2J74J45l26K13l55L18r8J74l89K86N7K8k04N7J29O2
5348A27o3r1j2K51j13p4L7NJ20j23j9LJ38k77j7LK45k22L4o7L13j54j30O1j4M5
5374Fl12M34j26Q4l1L0n5k1m2O1j17j21L03p6J36k34K6j5K18j27L6j86M5l9K93
5399A70p2Jj94J34j58K03O9J3k5j61J59j86j40j14L29k54J98RO8m48K08J80J61
5422A50k31q1r0L65l41N8J09P5k3l6qK13j9P1k78Q5o8n7K62j12j62L15j10L00
5446C87o27L14j11M75q18M13j36L0L83o11r2P42o74Q53o71j46L88n05j8J50M56
5467A82l13K00j36J24j65J11j53J23m8q2L11M7l48J96p7Q8j24nn3K16j39O8J00
5490A23j47M8p0k53L70K3k39LJ90n3l6K13j98P4j33K96l73K18p7J41L0k29M3K11
$$ plain form
5514 175 216 285 -9 159 173 89 24 -108 176 24 -51 -49 -62 -39 185 -157 115 79 66 0 -148 78 83 152 5
5539 5 -17 -218 -31 110 254 -24 153 -216 74 161 100 -107 -6 -45 -54 18 167 151 -212 -311 -92 -62 -186 -178 -39
5564 -39 -103 85 24 116 -97 69 27 -73 129 85 -292 -205 -61 122 121 41 47 -91 -53 180 -56 -85 183 52 -130
5589 -130 33 6 -136 207 -58 139 -54 -27 75 -74 78 115 84 -152 -78 -149 -143 216 -147 220 -58 -176 -70
5612 -70 92 -109 123 -67 -192 78 39 81 32 58 149 107 -69 176 -66 -166 40 -48 -18 -101 -37 -35 -91 -39 106
5637 106 0 -102 54 -110 -63 17 -83 -131 58 -34 140 57 54 -134 30 -13 59 -49 -59 -134 80 174 3 -27
5661 -27 160 -233 15 194 -62 78 69 178 4 69 -146 81 -46 -122 -347 5 75 -44 257 0 106 169
5683 169 -56 79 -30 45 79 -7 -24 149 -46 -50 48 -55 110 303 -13 -47 114 225 -41 -104 16 6 -148
$$ packed form
5514A75M1O9k94J68J4q4o5j32K84j52p5Kj3K3K24l42K72l6j3o6j48K26NO9j47
5539Ek2k01J87J41J44k78J77l69K90Q7o1k07J01l9rP2J49j6l63r9K19L0j24QJ39
5564c9o4J88o1R2k13J66m2j00K02m4l77Q7J44J83jq0Oj38L8K33k36k9K68j31j82
5589a30J63k7j42L43k65J97j93K7J02j49J52L7l1k36P4p1OL59l63L67k78j18J06
5612g0J62k01K32j90j25K70l9M2m9K6R1m2j76K45k42j00K06q8L0q3O4Kn6N2J45
5637A06j06j02J56j64M7Q0j00m8J89r2J74q3lj88J64m3P2j08j0p5K14R4j71l0
5661b7J87l93K48J79k56J40rJ09j74O5k15K27j27p6k25L52P0j19L01k57J06O3
5683A69k25J35j09P5L4q6j7J73j95mR8j03J65J93l16l4J61J11k66o3J20j0j54
$$ plain form
5706 -148 177 161 -57 0 -13 -219 -55 -267 -16 75 -4 80 -198 -146 65 246 -102 -96 38 -120 5 -66 -25 182
5730 182 122 -20 -137 41 -68 28 -50 36 63 -35 -44 -70 -22 112 126 -233 70 -35 147 -130 -120 -214 -306 78 -90
5755 -90 136 126 201 -163 23 -108 59 -90 35 -199 -220 -50 34 17 112 -123 -2 74 65 53 -32 -132 121 -23
5779 -23 -233 141 50 -111 -52 15 -66 75 -68 42 106 -8 203 -92 170 -35 123 142 13 -151 -224 -194 -19
5802 -19 -68 11 -68 209 8 -229 169 -81 -108 -156 -156 -96 82 118 147 112 -24 -61 -52 61 -76 -202 8 -61 -45 -13
5828 -13 87 -158 -99 229 -100 87 -321 50 206 24 -186 -25 -89 -48 -13 180 -44 2 266 -56 -101 -113 26
5851 26 74 91 90 -259 76 -117 -131 37 -110 170 -166 96 -74 -32 -9 -116 -172 -92 150 50 -78 -42 242 -1
5875 -1 -4 -31 0 -111 -21 145 102 -27 121 -142 -61 287 105 136 -2 180 -138 -223 -99 105 62 -148 82 -59
$$ packed form
5706a48L25j6k18N7j3k06J64k12K51R1p9Q4k78N2K11J81l48OJ34j58J25p1M1K07
5730A82o0j42j17J78j09R6p8Q6K7r8rk6M8J34J4l59L03j05J82k77J0r4r2L84j68
5755i0K26j0P5l64J86j31J67j49J25k34k1J70Q4j7R5k35J21P6rj2q5j00K53j44
5779b3k10L74r1j61N9O7q1J41j43J10O4j14K11k95K62k05J58J9j29j64p3L0J75
5802a9m9P9p9K77k01k37L98k50k7m8%O0J78L6K9l5j36l7RJ13j37j26K10o9J6L2
5828a3J00k45N9L28l29J87m08L71J56j82k10J61o4M1L5J93k24M6K64l22m5j2J39
5851B6M8J7jl49L35j93j4J68j47K80l36K62j70M2K3j07n6Q0K42j00j28L6K84k43
5875alk7L1j11R0J66m3j29J48k63Q1L48j82L1j38J82l18q5J24K04m3k10K30j41
$$ plain form
5899 -59 177 114 -26 173 85 32 133 -200 340 -65 21 134 128 33 88 227 -71 -168 -127 -9 5 100 162 5 147
5924 147 -90 115 44 154 35 74 -175 -47 22 51 231 62 -66 43 -136 46 89 109 -43 -5 12 -249 -9
5947 -9 -151 -49 99 63 9 302 62 75 119 -57 -129 -88 -78 20 41 -62 -25 231 11 -209 -30 -140 28 70
5971 70 6 12 -191 -140 -60 94 -275 -18 61 -180 -52 34 -14 -142 -16 346 -97 -142 -123 39 -208 -49 126 69
5995 69 -5 6 -27 12 49 236 54 139 189 -117 127 39 -130 -69 187 212 -282 -34 -32 -105 -109 -8 -36 -232 96 -177
6021 -177 -30 -54 -170 -53 -115 -104 105 0 -127 -48 -27 49 -176 -67 66 -82 16 -161 80 51 -76 -235 59
6044 59 103 157 186 231 -47 -2 99 234 167 -122 29 52 58 85 -119 -95 -104 31 85 112 0 70 167 115 67 73 -154
6071 -154 -109 -22 224 35 29 -76 -14 -79 -40 177 164 -40 1 58 -88 -73 172 89 -79 -47 70 173 -153 112
$$ packed form
5899e9K36o3j40J99q8n3J01l33N40m05Q6J13or5N5J39k98r7M1J18J4R5O2j57J42
5924A47k37K05p1J10j19L9k49J28O9K9J80j69j28J09j79J82M3K0j52L8J7k61K40
5947ij42J02J48l6n4K93k40J3M4j76p2M1J0R8K1j03L7K56k20k20J79j10J68M2
5971G0o4Ok03N1Q0J54l69K57P9k41J28Q6m8j28J26L62m43m5J9J62k47J59J75n7
5995F9p4J1l3L9L7J87j82Q5N0l06K44q8j69O1K56K5m94K48Kp3mJ01k8j96L28k73
6021a77J47k4j16J17o2J1K09j05j27P9K1P6k25J09J33j48R8j77K41k9j27j59K94
6044E9M4N4K9M5k78M5J01J35o7k89J51K3OK7k04K4rJ35N4K7j12P0R7n2m8Ok27
6071a54M5Q7K46j89oj05O2o5L9K17j3k04M1N7j46J5K45q3j68L2J17J03l26K65
$$ plain form
6095 112 160 -46 177 238 115 150 -32 127 -147 64 199 22 -67 -215 -53 205 162 -72 9 -91 174 -161
6117 -161 -220 -1 13 150 3 107 -50 -155 69 84 -81 -14 -184 -55 73 21 -11 263 -200 -92 78 11
6139 11 66 -141 -277 -77 37 195 102 7 177 98 152 47 -217 -52 -133 -65 46 -163 181 22 -54 -192 -166
6162 -166 107 59 138 54 -25 62 76 -43 95 -26 13 -164 -50 30 -158 -50 250 24 35 -231 -5 147 -28
6185 -28 5 -6 33 -118 -140 125 66 -209 33 -200 -47 134 -222 -166 -168 105 161 108 28 -33 62 -107 -67 -104 -8 9
6211 9 -21 -170 33 -12 176 -67 -213 -186 138 131 169 163 -266 79 -73 193 -6 26 14 15 -116 9 6 1 -190 -95
6237 -95 115 -47 7 360 -46 -101 67 -49 -35 -106 256 -178 -28 79 9 37 -7 -40 32 145 104 211 -98 28
6261 28 -184 6 -45 61 47 -162 -140 -1 -226 -125 222 -33 0 23 177 71 63 172 25 -3 151 39 -291
$$ packed form
6095A12M8k06K23O1j23L5j82J59k74K11J35j77q9j48J62K58m3k34Q1j00K65l35
6117a61n9K19J4J37j47J04j57j05K24J5j65O7j70J29J28n2l2K74m63J08J70o7
6139A1N5k07j36K00J14J58r3r5J70p9N4j05k64J65q1O8J11k09L44j59p6j38K6
6162a66K73m8P9q4p9Q7J4j19J38j21L9j77J14Q0j88J08L00k26J1k66K26J52j75
6185b8L3j1L9j51k2K65n9k75K42k33J53J81l56N6kK73N6n3q0o1R5j69M0l7R6J7
6211Il0j49K03m5J88k43j46K7L24pL8om29L45j52K66j99L2j2Jj31J25lnj91R5
6237i5K10j62N4L53m06n5J68j16J4p1L62m34J50J07p0K8m4l3P2J13m1J07l09J26
6261B8k12J90n1J06j4k09K2J39k25J01L47k55L3K3J54j06qJ09j47k8J54j12l30
$$ plain form
6284 -291 -184 45 152 -160 -243 35 -197 -31 56 184 -151 55 24 144 -75 -71 -28 22 75 -93 -170 -105 52
6307 52 -50 -62 38 6 73 -192 -148 -306 -52 176 140 175 91 -2 -139 218 -138 101 94 189 198 -149 137 27 -96
6332 -96 8 -58 163 97 107 -41 124 133 151 -71 141 -64 149 125 54 -66 202 -126 117 25 -113 265 18
6355 18 -289 114 74 -74 112 139 -148 -96 266 40 -46 -51 63 -58 85 42 34 44 -58 118 111 35 73 -11 -231
6380 -231 195 -87 15 146 -147 -25 -15 -74 -196 -44 46 69 56 -152 -89 94 303 73 -55 -342 -315 -209
6402 -209 -278 -629 -59 38 -357 214 -300 93 342 -111 251 -351 227 161 -25 165 -138 483 -628 -294 -18
6423 -18 -88 70 -402 -56 -218 -198 341 483 317 166 91 -53 -131 -195 -200 -274 -185 506 384 -96 -332 -246 69 -95
6447 -95 -194 8 2 362 -105 155 -230 -168 -52 -133 -110 -194 174 -373 -208 277 92 -60 -68 13 168 130 -251 -539
$$ packed form
6284b91J07K29J07l12q3K78k32J66Q7J28l35K06l1J20k19MM3N0N3j68p7O5J57
6307E2j02j2J00l2O7k65M4j58K54K28l6L5q4r3j37L57l56K39pR5Rl47K86j10j23
6332i6J04o6K21o6J0j48J65RJ8k22K12k05K13k4p1j20K68l28K43r2j38L78k47
6355A8l07M03m0j48J86K7k87N2L62k26q6nJ14j21J43m3qJ0j02J76pp6L8q4k20
6380b31M26k82J02J31k93J22J0n9j22J52R0K3j3k08O3J83K09k30j28k87K7J06
6402b09o9l51N70R7l95N71n14L93K49m53L62o02N78o6j86J90l03O21j111L34K76
6423a8p0J58m72L46j62K0N39J42j66j51p5j44p8o4np4Q9O91j22m80k36Q6L15j64
6447i5r9K02oL60m67K60l85O2J16q1K3q4L68n47J65M85j85j52qQ1J55l8l81k88
$$ plain form
6471 -539 392 76 221 -321 209 -386 156 -15 126 68 -110 -185 266 -357 725 -252 -158 139 46 382 -588
6492 -588 674 -90 409 -106 154 514 111 -31 37 184 86 -36 19 28 66 -168 30 230 112 59 121 63 -11
6515 -11 -95 63 -5 -51 -111 18 -2 5 -63 -204 -78 -14 -46 -115 -113 -107 60 -37 -420 -34 -120 -125 154 -6 -162 22 -132
6542 -132 62 147 45 -17 13 33 223 -36 -41 47 14 -116 8 -117 9 15 115 83 -159 91 47 254 146 -104
6566 -104 106 6 0 -192 -25 -101 78 -82 5 252 -26 174 240 -140 19 84 -67 31 23 -49 87 -230 -71
6589 -71 234 -16 52 -7 -65 -64 275 -176 -275 -195 143 76 -73 207 213 109 -107 60 235 -61 3 -97 176 -143
6613 -143 -184 -77 -23 -56 -90 138 -79 -89 -17 125 -179 49 -223 -209 217 -61 -12 -66 -133 427 17 -47 168 -178
6637 -178 6 28 -75 -117 28 19 29 -12 -82 42 49 -135 114 -26 -166 170 213 27 47 -38 -199 205 236 -127
$$ packed form
6471e39R31l16J45n42N30n95N42j71J41n8j78p5M51o23J082r77R4K97r3L36r70
6492e88J262p64M99n15K60L60m03j42O8J47r8j22N5RL8k34J98K00j18n3O2n8p4
6515a1q4J58o8m6o0J29k0Po8j41J26O4l2o9KOJ67r7l83L86q6nK79j60j56J84j54
6542a32J94Q5j02o2L0K0J90k59nQ8l3j30J24j25J26OJ00l2k42K50m4K07j08k50
6566a04K10j00oj92J67p6J79j60Q7K47k78K00O6l80J59O5j51R8qp2J36l17J59
6589g1L05k50O8n9n8JL39m51r9Q0L38o7j49K80Oj04k16J67J75k96O4j00K73l19
6613a43m1J07N4l3l4K28k17j0P2J42l04K28k72J4M26k78M9n4o7N60m10o4K15l46
6637a78J84K2j03m2J45rJ0m1p0J24Pj84K49j40j40L36M3j86K0q5j61M04L1l63
$$ plain form
6661 -127 -123 76 10 -68 -207 103 51 30 -124 -6 42 -37 267 50 68 -86 -141 23 -9 106 66 -92 23 79
6685 79 -44 -113 -22 -68 156 -273 -160 -200 70 52 156 14 133 -106 -18 -133 285 25 11 124 45 107 137 82
6709 82 -36 42 -91 66 -93 80 -100 -113 82 27 -116 181 -55 215 201 -119 122 251 68 -80 57 9
6731 9 -33 200 -40 -34 -19 61 246 -6 86 -51 232 -125 57 36 58 8 -181 -231 341 2 -85 -72 39 89 123
6756 123 59 91 112 -36 -85 -281 140 -98 -62 -38 -61 -17 -143 60 132 -126 120 17 25 -30 62 -31 -125 150 -1
6781 -1 68 -113 17 64 -87 112 -33 33 107 -76 -33 92 210 -56 -35 131 -16 -38 93 202 180 6 121
6804 121 103 -69 140 92 -55 -28 78 -9 313 -232 102 214 -75 148 134 -80 30 98 -72 254 -80 53
6826 53 170 -89 -234 39 -3 -38 35 126 142 155 -4 0 29 -89 -4 -103 33 345 -85 104 -197 20 -136 137
$$ packed form
6661a27MJ99o6p8j39L10n2k1j54J18M8p9L04k17J8j54n5J64l2J15m0j58J15N6
6685G9j23o9R1m6K24m29J13m0K70j8J04j42J19k39Q8j15M18k60j4J13p9O2L0n5
6709H2j18P8j33J57j59J73j80j3J95n5j43K97k36K70j4l20K41J29j83j48J37m8
6731Im2K33k40OJ5Q0J85k52R2j37K83l57J82k1K2n0j89n0N72l39q7J3J11N0L4
6756A23o4L2K1j48m9j96M21k38L6K4k3M4j26K03P2k58K46j03Qn5R2r3r4K75j51
6781aO9j81J30M7j51J99j45O6P4j83M3J25J18k66K1J66j47k2J31J09k2j74J15
6804A21j8j72K09m8j47K7J06q7L22n45L34J12k89K23j4k14J10O8j70L26l34J33
6826E3J17k59j45K73m2l5P3R1J6J3j59MK9j18Q5r9J36L12m30J89l01K17j56K73
$$ plain form
6850 137 62 85 -28 80 130 14 -167 60 276 -63 -63 -45 232 16 -193 114 -76 -184 128 -146 284 49
6872 49 292 -17 -13 23 75 96 60 5 124 18 181 265 76 457 90 187 -70 -44 -52 191 -231 29 -178 -69
6896 -69 -36 -13 113 -20 -1 3 169 76 -75 126 53 136 -122 -43 -131 -14 157 -153 26 96 -159 54 -15 22 -96
6921 -96 -232 110 1 20 184 195 -215 -178 2 -26 -275 -221 -143 173 57 4 -50 -115 -213 -19 185 -103 259 -116
6945 -116 167 115 95 -5 162 80 64 129 -271 160 -102 -235 -167 -22 87 38 1 -175 54 176 130 -75 -43
6968 -43 -7 175 -16 30 34 61 119 -205 -52 108 -118 -90 -118 -7 174 18 239 -44 143 84 71 38 -2 50 151
6993 151 -115 -23 -147 215 130 -113 -177 60 -83 -14 20 -31 -110 -38 216 39 96 52 -114 -15 -144 -96 87 79 106
7018 106 56 116 -196 -32 69 196 194 -98 -130 67 -59 -56 31 50 110 -95 19 -2 -112 94 110 95 46 130 41
$$ packed form
6850A37p5K3j13J08N0j16j81K27K16l39%J8K77k16k09L07j90j08L12k74M30k35
6872D9K43l09ML6N2K1l6n5J19j06J63Q4j89L81l67R7k57K6qK43m22K60k07J09
6896f9L3K3J26j33J9MJ66r3j51K01p3Q3k58P9q8J17J71l10J79P0k55K13o9L7j18
6921i6j36L42j09J9J64J1m10L7J80k8k49N4P8L16j16n3n4o5r8J94K04k88L62l75
6945a16K83n2k0j00J67q2j6O5m00M31k62j33O8J45J09m9l7j76K29J22m6k05L2
6968d3L6J82j91M6MK7N8l24J53J60k26K8k8J11J81j56K21k83J87n9j3l3m0N2J01
6993A51k66R2j24L62q5k43o4K37j43O9L4n1p9P2K54j77N7m4j66R9j29M8J83qK7
7018A06n0O0l12J64J01J27kk92l2J97j26LQ7J9O0k05J14k1j10K06J6j5m9Q4q9
$$ plain form
7043 41 128 -79 -18 -8 46 103 -36 77 100 -57 -116 -20 61 144 -139 124 74 12 172 -49 -148 -49 102 51 -34 -74
7069 -74 17 144 188 -33 -168 -5 156 -152 39 -60 -14 170 148 340 -99 42 -17 -135 -68 105 -250 -276 70
7092 70 -152 -194 -63 57 -57 -116 -240 -104 41 -248 -112 142 -133 -102 104 -126 124 160 -329 -88 114 257
7114 257 -15 -163 -44 -103 243 -170 14 12 163 -64 -180 93 -135 264 309 90 54 154 -40 -80 -81 162 -129
7137 -129 22 26 118 108 -196 101 54 0 -84 -38 -155 -256 91 117 -170 -120 39 149 149 -15 -65 -72 15 247 179 -290
7163 -290 -157 -19 -39 -151 60 -36 -26 -86 -44 218 52 150 -42 -21 189 99 77 -132 -140 -36 71 -32 91 157
7187 157 -114 78 -118 67 41 203 101 -234 -84 -262 2 -24 54 -78 -99 -211 -31 148 139 -137 -6 -211
7209 -211 -198 166 177 -52 -116 -15 261 -81 -8 -91 -78 142 17 69 6 34 -107 89 54 -50 -133 -8 66 -194
$$ packed form
7043D1Q7k07O1J0N4N7j39J13K3j57n9R6Q1Q3k83K63n0o2J60k21r9R9J51n1q5m0
7069g4R1J27M4k21j35J63J61l08J91r9M6J84k2J92m39J41n9j18O7J73l55k6L46
7092G0k22m2J31J20j14n9j24J36J45k89J36K54k75L1K06k30K50L6m89K41K02J43
7114B57k72j48J19n9L46m13J84kJ51k27j16K73k28L99M5k19l6J00j94m0jK43k91
7137a29J51MR2j0l04K97m7n4q4M6j17j01L47K6k87N0J59J10%j64n0pQ7K32o8m69
7163b90J33J38k0j12K11r6J0o0M2K62j66R8j92K1K10r0k2k09qJ04J07j03J23O6
7187A57k71J92j96J85k6J62j02l35J50j78K64k6P8j32k1j12J80J79rk76J31k05
7209b11J3L64J1k29o4J01K76l42P3q3J3K20j25N2o3K8j41J96l5j04q3J25P4k60
$$ plain form
7233 -194 38 -133 15 -127 -130 -150 107 -26 19 58 -80 -57 0 121 67 10 -411 147 38 286 -144 -102 1
7256 1 119 -66 -26 44 -172 -47 -287 -14 68 96 -1 48 -135 1 -126 126 -49 214 -147 -85 185 210 38
7279 38 226 60 70 -8 75 119 22 154 -204 -130 -8 -93 71 20 186 -113 34 192 -100 -249 86 217 -11
7302 -11 -236 -194 84 -73 176 53 158 -89 51 -220 80 -39 157 170 8 -51 6 192 -195 -64 -51 27
7324 27 -64 -229 11 115 -79 -137 -106 21 59 5 -40 -218 200 19 9 -100 -118 -94 -30 -151 227 -71 -32 101
7348 101 5 -308 60 273 94 -111 339 145 117 65 10 -56 335 104 -21 -126 -72 70 -66 197 27 -252
7370 -252 -26 132 -298 8 -47 60 114 -67 -112 -28 -95 118 20 27 -107 -25 180 57 8 111 -79 17 -110 -126
7394 -126 -139 160 0 -160 61 225 55 -86 4 -172 -89 126 -76 16 127 -234 -99 -121 -39 249 144 -45
$$ packed form
7233a94K32j71J48j42lk0K57j33M5L9j38K3N7J21n4n7m21N58j09K48m30M2J03
7256AJ18j85M0P0k16J25k40K73Q2K8r7M9j83J36j27K52j75K63l61O2K70K5j72
7279C8J88j66J0p8Q3M4r7J32l58P4J22q5J64n1J66k99J47J58k92j49L35J31k28
7302a1k25M2K78j57K49j23J05k47J40k71L00j19J96J3j62n9N7J86l87J31J3P8
7324B7r1j65K40J04j94n8L1J27L8n4m5j78M18j81j0j09j8K4O4j21L78k98L9J33
7348A01r6l13L68K13j79k05M50j94k8n2n5o6L91k31j25j05N4J42j36K63j70k79
7370b52K26J58m30L06n5J07N4j81m5Q4o7K13r8Pj34Q2K05j23m9J03j90R6j27j6
7394a26j3K99j60j60K21J64j70j41R0j76Q3K15k02R2J11l61J35k2Q2K88j05j89
$$ plain form
7416 -45 53 -216 11 163 87 13 5 -106 -3 -210 -278 82 -108 158 16 -267 181 126 -33 -77 42 -374 3
7439 3 69 -139 164 -16 -108 -46 45 272 15 -251 139 54 -111 30 -156 195 106 23 218 188 -20 42 -25 53
7463 53 274 -175 80 58 -144 -31 -118 -72 105 85 39 -61 42 -355 -73 68 201 229 -42 78 -135 -83 38
7486 38 55 -109 -22 33 -102 23 34 -5 191 106 -50 -161 -48 62 41 -125 -278 71 165 -191 -238 -193 209 151
7510 151 -8 40 22 62 -49 89 -149 -41 -66 46 -130 -91 100 -165 49 -32 226 0 -129 -141 -37 -158
7532 -158 -30 166 76 -140 -83 97 161 -141 -179 101 132 21 57 -87 42 51 -105 56 56 229 -44 -32 -213 138
7556 138 96 -5 -219 -20 -79 -12 113 20 -90 -16 87 -104 162 35 -42 -28 -1 -105 -171 20 -36 -178 -49
7579 -49 -157 112 112 -53 273 -253 51 23 -91 -102 178 44 -113 -166 -150 97 -31 -121 -134 -104 105 -12 -70 -70
$$ packed form
7416d5R8k69K27J52p6p4qj11J03k07o8L60j90K66j42k83M48n5j59m4J19m16L77
7439CO6k08L03j80r2O2R1K27k57k66L90q5j65J41j86L51q9q3J95l0k08O2o7P8
7463E3K21m49K55k2k02J13q7M6J77k0m6j00J03l97K82J41J33K8k71J20k13N2J21
7486C8J7j64Q7N5j35J25J1l9J96q5j56j11J13J10k1j66j53L49R4l56m7M5M02n8
7510A51j59M8j8M0j11J38k38J08k5J12j76L9J91k65K14q1K58k26j29j2J04j21
7532a58J28J96r0k16N7J80O4l02l8K80L1j11L6j44J29Rj56J61%J73k73J2j81L51
7556A38m2j01k14J99n9O7J25r3j10P4J03j91K66j27p7J4K7j04o6J91n6j42J29
7579d9j08K69%j65L26n26L04k8j14j1K80j34j57n3J6K47j28r0j3L0K09j17n8%
$$ plain form
7603 -70 163 -70 229 -92 79 -283 145 75 -82 -6 75 270 -101 445 -158 35 -37 36 -12 53 -3 60 175
7626 175 -27 24 -145 44 43 -104 84 -80 -42 -95 197 -8 -67 -14 48 177 2 12 -12 -288 -129 260 -93
7649 -93 13 -155 31 -220 -10 70 154 114 -99 -9 26 98 -1 -153 89 87 -66 -69 18 90 -143 -22 -61 98 12
7674 12 21 -76 249 -66 -26 37 115 99 3 7 -18 -26 -57 -282 81 -68 -193 107 -197 -46 -93 146 15 -73 -129 -83
7700 -83 -46 -309 -47 121 34 -59 86 86 26 -271 -45 -120 53 -69 121 28 -196 50 11 -107 128 18 170
7723 170 97 -200 118 -167 -307 55 62 -148 -179 -8 -67 61 144 33 118 -95 104 -1 52 73 -76 -77 -59 -156
7747 -156 28 14 250 -39 -276 -36 23 -30 84 127 -78 -41 86 324 -50 23 43 -43 -61 -62 135 136 -57 16 134
7772 134 -112 -151 -63 126 -11 33 89 -151 55 -23 0 101 183 -161 62 152 5 32 -84 -72 -61 -128 155 202
$$ packed form
7603g0K33k33K99l21J71l62M28p0j57P6Q1J95l71N46o03J93p2P3m8O5n6O3J15
7626A75k02N1j69J89jj47J88j64L8n3K92k05n9N3O2J29j75J0k4k76J59L89l53
7649i3J06j68J86k51K10Q0Q4m0k13R0L5P2r9j52K42kj53lQ7P2k33J21l9J59q6
7674A2Rr7L25l15M0O3P8j6r6Mk5ql1k25L63j49j25L00l04J51m7K39j31q8n6M6
7700h3L7k63K62J68q7r3J45%o0k97K26p5J73j22J90r3k24K46l9j18K35j10J52
7723A70p3k97L18k85j40L62Pk10l1J71n9J28Q3j11Q5k13J99j05N3K1j49jJ8r7
7747a56J84j4K36k89k37K40N9n3J14M3k05L7J27K38l74P3K0q6j8jJ97Jj93P3J18
7772A34k46l9Q8J89j37M4N6k40K06p8K3J01Q2l44K23R0j47K7j16J2J1o7K83M7
$$ plain form
7796 202 -205 9 -7 -36 -21 -9 29 -42 32 -88 -315 -107 -78 -26 201 200 -184 -197 190 -173 -3 84 225 -3
7820 -3 219 12 -4 51 -172 -19 179 117 68 175 124 -70 -144 84 18 8 -39 55 -174 -119 11 53 -65 2 -97
7845 -97 -81 -28 54 -10 346 12 113 48 -139 104 74 197 80 -33 59 -105 8 -188 220 -109 -120 19 94
7868 94 -14 -344 181 91 -83 148 218 -21 -41 118 114 -130 158 174 -126 -122 -136 -226 -45 65 112 -44 74 -73
7892 -73 -62 31 -85 -105 128 43 -177 -143 -96 96 94 -60 -20 54 195 -50 239 -122 74 13 117 61 34 13 125
7917 125 19 -158 17 77 -26 -222 218 -48 106 -111 -168 -5 -2 -113 74 -21 110 -86 67 85 166 39
7939 39 45 -288 -117 184 -123 -87 70 130 23 42 36 -126 246 -56 -36 39 -85 332 -101 47 -165 31 34 -56
7963 -56 -169 -65 20 148 -73 -143 51 -123 -148 78 71 83 75 -47 -15 72 -73 35 27 19 256 -215 271 91 -34
$$ packed form
7796B02m07K14j6k9J5J2L8p1P4j20k27K08K9N2K27jl84j3L87l63J70Q7J41k28
7820cK22k07j6N5k23J53J98o2m9J07n1j94p4K28o6j0m7R4k29N5J30M2j18O7r9
7845i7J6N3Q2o4L56l34J01o5j87K43l0J23j17j13R2j64J13j96M08l29j1J39P5
7868I4j08l30N25r0j74K31P0k39k0J59mk44K88J6l00Mj4r0J81J10M7j56J18j47
7892g3J1R3j16k0K33q5k20L4M7J92kj54M0P4J41k45K89l61J96o1J04n6k7k1J12
7917A25j06j77J75O0j03j96M40k66J54k17n7J63Lj11J87r5J31j96J53J8Q1j27
7939C9Ol33J71L01l07L6J57O0j07J9oj62L72l02K0P5j24M17m33J48k12J96Lr0
7963e6j13J04Q5J28k21p0J94j74k5K26pJ2qj22L2Q7j45J08qqK37m71M86j80j25
$$ plain form
7988 -34 104 0 -217 -222 -49 101 -198 2 -76 59 -68 21 48 140 60 238 -52 -84 216 107 144 85 -65 101
8012 101 69 31 -25 182 -95 105 76 28 304 -171 -81 -10 7 -238 89 -154 -57 -222 -162 -118 154 131 123 -57 -108
8037 -108 -3 -122 -135 162 -2 77 20 -30 32 -234 -40 33 -105 58 -17 -196 -152 0 -27 3 57 61 -166 203
8061 203 -63 -73 -99 -105 -85 -61 -85 -120 115 0 -103 51 261 29 -26 -240 -21 -207 42 223 110 -22 78
8084 78 208 93 -33 58 -23 -54 -115 155 123 -91 37 -150 -73 145 169 -196 -52 -140 44 50 10 -112 -2 -34
8108 -34 -1 -45 -221 -99 -93 -223 -138 -95 204 -68 281 9 -39 -92 97 25 -270 30 -107 86 35 -415 -138 -269
8132 -269 201 -163 -23 41 -30 173 105 -183 266 -146 -273 18 -21 225 -125 -89 -214 -7 -41 -74 -190 20
8154 20 -275 -53 135 90 -37 112 -79 -130 86 -60 -288 94 -51 -44 -66 35 -66 15 -131 -39 170 147 -61
$$ packed form
7988c4J38j04k17nJ73J50k99K00p8J35j27Q9K7R2q0J78k90l2L00j09L7n9j50J66
8012A01l2l8n6K07k77K00k9m8K76m75R0P1J7k45L27k43R7j65O0M4K72k3qj80n1
8037a08J05j19j3K97j64P9n7n0O2k66J94P3j38J63p5j79M4J52k7L0N4Mk27L69
8061B03k66j0k6oK0K4k4l5K35j15j03J54K10k32n5k14K19j86K49J81j13j32J00
8084G8J30j15j26R1q1l1o1K70l2k14J28j87P7K18K4l65J44q8J84Om0j22J10l2
8108c4L3m4j76J22Oj30Q5M3K99k72L49k72m8n3J89p2k95L00j37J93n1m50K77j31
8132b69M70l64J40O4p1K03o8k88M49m12j27K91l9K46l50L6j25K07l4l3j16K10
8154B0k95K22J88m5j27J49j91n1K16j46k28L82j45Pk2J01j01Q1j46R2K09k3k08
$$ plain form
8177 -61 -223 -78 109 97 -176 20 -53 -61 37 -76 -84 25 82 34
$$ packed form
8177f1j62J45J87j2k73J96p3qR8j13qJ09N7m8
8191C4
$$ Imaginary data points
##PAGE= N=2
##DATA TABLE= (X++(I..I)), XYDATA
$$ plain form
0 0 0 0 0 0 0 0 0 0 0 0 0 0 -7 8 -8 8 -8 15 -16 23 -23 31 -35 40 -48 56 -69 78 -89 102 -117 133 -154 172
34 172 -195 220 -249 278 -312 347 -387 430 -479 531 -586 647 -715 789 -871 957 -1056 1163
52 1163 -1280 1412 -1560 1725 -1912 2127 -2375 2662 -3007 3424 -3944 4611 -5499 6749 -8648
67 -8648 11911 -19040 71433 -124179 -133280 111164 -59622 -61601 154381 111831 -89935 -70011
79 -70011 -17878 -8267 26861 74689 58149 -26023 -103613 -41511 20859 23124 66237 42965 -74451
92 -74451 -68750 -25762 -21125 60857 84110 -35599 -50316 -23036 -75955 5168 117682 24299
104 24299 -40023 -5641 -54234 -54549 52559 80467 31074 -14682 -47901 -34735 -4856 23091
116 23091 81930 52440 -62653 -39197 8549 -50545 31064 133082 -18720 -92143 24814
$$ packed form
0@%%%%%%%%%%%%pJ5j6J6j6K3l1L9m6N4o6P5q8J04j25J47j67J91k19K50k87L26
34A72l67M15m69N27n90O59p34Q17r09J010j117J233j362J504j660J828k013K219
52A163k443K692k972L285l637M039m502N037n669O431p368Q555j0110J2248j5397
67h648K0559l0951R0473j95612r101K44444j70786j979K15982m2550k01766J9924
79g0011N2133R611L5128M7828j6540q4172p7590O2102O2370K265M3113k3272j17416
92g4451N701M2988M637Q1982K3253j19709j4717K7280n2919Q1123J12514r3383
104B4299o4322L4382m8593l15J07108K7908m9393m5756l3219J3166K9879K7947
116B3091N8839k9490j15093K3456M7746n9094Q1609J02018j51802p3423J16957
$$ plain form
127 24814 -20552 -77981 76172 107424 -51812 -70337 -1384 -24295 -26680 45863 69821 -10383
139 -10383 -78507 -36669 10482 -2601 33382 61963 -18566 -61695 -19429 -9743 18584 71937
151 71937 18869 -35730 -9984 -33163 -28550 68707 59960 -20729 -6453 -12807 -57510 4065 70155
164 70155 31048 -12707 -17284 -30493 -31515 -56 48099 48785 -24234 -50563 -9169 -19130 -17214
177 -17214 59264 44656 -44786 -35596 -8999 -30521 15180 63537 10673 -29932 -18635 -24623
189 -24623 -13110 32710 49948 16202 -29827 -31201 -2912 630 17092 54676 18507 -45580
201 -45580 -28170 2048 -1247 29642 42841 -8855 -30833 -22157 -23764 11770 46510 12236 -19275
214 -19275 -18373 -31387 -21166 22732 35019 9740 -16552 -30366 -22737 -4829 18687 38879 11941
$$ packed form
127B4814m5366n7429J54153L1252j59236j8525O8953k2911k385P2543K3958q0204
139a0383o8124M1838M7151j3083L5983K8581q0529m3129M2266R686K8327N3353
151G1937n3068n4599K5746k3179M613R7257q747q0689J4276o354m4703O1575O6090
164G0155l9107m3755m577j3209j022L1459M8155O86p3019k6329M1394r961J916
177a7214P6478j4608q9442R190K6597k1522M5701M8357n2864m0605J1297n988
189b4623J1513M5820J7238l3746m6029j374K8289L542J6462L7584l6169o4087
201d5580J7410L0218l295L0889J3199n1696k1978Q676j607L5534L4740l4274l1511
214a9275R02j3014J0221M3898J2287k5279k6292j3814P629J7908K3516K0192k6938
$$ plain form
227 11941 -28229 -20998 -9054 -11550 28426 51696 -4075 -33266 -4988 -9350 -9476 39392 39460 -9330
241 -9330 -26130 -15606 -7690 7990 28825 27246 -7224 -32858 -18548 -3565 4739 29561 23489
254 23489 -25609 -32955 -6874 -9688 3499 38587 13374 -33042 -24572 -8199 -6174 18333 31179
267 31179 3480 -20475 -22371 -12378 6468 28041 27309 -267 -22198 -14879 -2982 3952 29370
280 29370 32991 -10161 -28596 -7316 -3170 3425 32877 22319 -21183 -22185 -8926 -10908 11851
293 11851 33048 4959 -24571 -17727 -11048 -8632 12656 30042 3816 -30097 -20253 -2127 -2704
306 -2704 12871 31451 428 -29663 -12710 252 26 25225 27883 -10275 -20986 -3078 -4548
319 -4548 4248 31601 21491 -15917 -20083 -4677 -2111 6843 25473 14439 -18444 -23320 -6209
$$ packed form
227A1941m0170P231J1944k496L9976K3270n5771k9191K8278m362j26M8868O8m8790
241i330j6800J0524P916J5680K0835j579l4470k5634J4310J4983Q304K4822o072
254B3489m9098p346K6081k814J3187L5088k5213m6416Q470J6373K025K4507J2846
267C1179k7699k3955j896R993J8846K1573p32k7576k1931P319J1897O934K5418
280B9370L621m3152j8435K1280M146O595K9452j0558m3502j002J3259j982K2759
293A1851K1197k8089k9530O844O679K416K1288J7386k6226l3913R844J8126n77
306b704J5575J8580l1023l0091J6953J2962k26K5199K658l8158j0711J7908j470
319d548Q796K7353j0110l7408m166J5406K566Q954J8630j1034l2883m876J7111
$$ plain form
332 -6209 -2814 8516 26083 3959 -25146 -15582 -5390 -8528 13594 26941 -5828 -27206 -10040
345 -10040 -3766 -4495 19090 23929 -8251 -21629 -7570 -2854 4070 24961 19088 -11302 -17515 -1697
359 -1697 -1921 5437 29262 16343 -19270 -16479 1522 -3016 5923 26721 8069 -22329 -15592 -3518
373 -3518 -2900 11273 20575 -3544 -21542 -11522 -7536 -4108 16948 19067 -11166 -21803 -4981
386 -4981 -4288 -3837 20728 20230 -14500 -19266 -377 -1283 2658 24268 15211 -15489 -12988 917 -1639
401 -1639 7892 25746 7166 -17154 -10167 -165 -2456 10287 21755 237 -19345 -10379 -2566
414 -2566 -3003 13489 17692 -8879 -19646 -6850 -4990 -3671 15879 15561 -13749 -19795 -2054 -1980
428 -1980 -818 17819 14678 -12055 -16525 -1337 1511 6778 19145 7948 -12075 -9239 -533 -2223
$$ packed form
332f209L395J1330J7567k2124k9105R564J0192l138K2122J3347l2769k1378J7166
345a0040O274p29K3585M839l2180j3378J4059M716O924K0891n873l0390o213J5818
359a697k24P358K3825j2919l5613K791J8001m538Q939K0798j8652l0398O737J2074
373c518O18J4173R302k4119j7998J0020L986L428K1056K119l0233j0637J6822
386d981O93M51K4565m98l4730m766J8889r06L941K1610r057l0700K501J3905k556
401a639R531J7854j8580k4320O987J0002k291J2743J1468k1518j9582Q966P813
414b566m37J6492M203k6571j0767J2796J860J319J9550l18k9310o046J7741P4
428a980J162J8637l141k6733m470J5188K848N267J2367j1197k0023K836Q706j690
$$ plain form
442 -2223 11970 23266 -1491 -17031 -638 749 -8111 15165 24959 -10439 -21677 1612 -1243
455 -1243 -10119 14882 19852 -14577 -21459 -255 -2077 -4979 14367 12188 -14207 -16774 -2304 -279
469 -279 3757 14723 6397 -10264 -10433 -3707 1008 12840 15290 -432 -7859 -4045 -4601 1150 16646
484 16646 15088 -5317 -10868 -2803 -2177 -928 13297 14292 -7532 -16653 -3588 324 -1772 10925
498 10925 11016 -11762 -15714 -2216 -3569 669 15716 3622 -17153 -7247 761 -7942 5193 21734
512 21734 -409 -19190 -820 4779 -7508 8407 23634 -2921 -18750 1110 6237 -5156
524 -5156 10119 19403 -4675 -16098 -204 2512 -637 10487 9392 -6714 -11563 -5959 -1547 5734
538 5734 8442 -152 -6945 -7873 -8696 -2872 9834 9467 -4104 -9262 -5269 -4757 -2652 9364 13591
$$ packed form
442b223J4193J1296k4757j5540J6393J387q860K3276R794l5398j1238K3289k855
455a243q876K5001M970l4429o882K1204j822k902J9346k179k6395k567J4470K025
469b79M036J0966q326j6661j69O726M715J1832K450j5722p427L814n56N751J5496
484A6646j558k0405n551Q065O26J249J4225R95k1824r121J3065L912k096J2697
498A0925R1k2778l952J3498j353M238J5047j2094k0775R906Q008q703J3135J6541
512B1734k2143j8781J8370N599j2287J5915J5227k6555j5829J9860N127j1393
524e156J5275R284k4078j1423J5894K716l149J1124j095j6106m849N604M412P281
538E734K708q594o793r28q23N824J2706l67j3571n158L993N12K105J2016M227
$$ plain form
553 13591 -3186 -12746 -1848 1647 -1696 9920 15007 -3498 -11875 255 2498 478 11507
566 11507 11633 -7017 -10662 1005 70 479 12504 6919 -12450 -9799 2014 -3007 -602 13504
580 13504 2813 -16933 -7205 2801 -5553 1977 14172 -1373 -15408 -3999 1794 -2603 6347
593 6347 11466 -2718 -10918 -2718 1723 2223 9688 8510 -3793 -7572 -995 1564 3530 11373 5464
608 5464 -8149 -6014 711 -1544 2890 11902 1564 -11914 -5531 474 -3397 2451 10249 -1523
622 -1523 -13427 -6021 860 -2733 3625 9325 -3192 -12734 -2856 1851 -1459 6651 9634 -5501
636 -5501 -9571 1539 1396 -451 10839 8232 -8270 -6525 3520 472 1730 11680 4857 -9766
650 -9766 -4926 3022 -1359 2792 10456 552 -11782 -4190 1828 -3203 3431 8866 -4010 -11672 -2130
$$ packed form
553A3591j6777r560J0898L495l343J1616N087j8505q377J2130K243k020J1029
566A1507J26j8650l645J1667r35M09J2025n585j9369K651J1813n021K405J4106
580A3504j0691j9746R728J0006q354P530J2195j5545j4035J1409N793m397Q950
593F347N119j4184q200Q200M441N00P465j178j2303l779O577K559J966P843n909
608E464j3613K135O725k255M434R012j0338j3478O383O005l871N848P798j1772
622a523j1904P406O881l593O358N700j2517r542R878M707l310Q110K983j5135
636e501m070J1110j43j847J1290k607j6502J745J0045l048J258R950o823j4623
650i766M840P948m381M151P664r904j2334P592O018n031O634N435j2876p662R542
$$ plain form
665 -2130 292 -3571 5374 7896 -6967 -9848 849 -213 -1659 8315 6776 -7696 -7244 3204
679 3204 655 790 10691 5954 -8603 -4280 3735 -319 2220 11320 2303 -9790 -2842 3624 -1915
694 -1915 3370 9793 -2353 -10794 -1261 944 -3352 4465 7246 -6610 -10319 -399 -280 -3159 6086
709 6086 5588 -8276 -7995 1885 -475 -975 8471 4462 -8282 -4494 3789 -287 2010 10524 2096
724 2096 -8264 -1195 3969 -756 4174 9799 -1256 -8462 135 2488 -1706 4999 7402 -5215
738 -5215 -8649 402 84 -3058 5766 4890 -8093 -7914 1715 -1504 -2628 7424 2837 -9652 -5384
753 -5384 3054 -1707 -372 9079 1648 -8675 -2045 4334 -1126 2436 9794 515 -7794 496 3863
768 3863 -1187 4448 8619 -2490 -7378 1501 1816 -1948 5386 5934 -6159 -6926 1446 -843 -2089
$$ packed form
665b130K422l863Q945K522j4863k881J0697j062j446R974j539j4472M52J0448
679C204k549J35R901m737j4557M323Q015m054K539R100r017j2093O948O466n539
694a915N285O423j2146q441R533K205m296P817K781j3856l709R920J19k879R245
709F086m98j3864K81R880k360n00R446m009j2744L788Q283m076K297Q514q428
724B096j0360P069N164m725M930N625j1055p206Q597K353m194O705K403j2617
738e215l434R051l18l142Q824q76j2983J79R629l219j124J0052m587j2489M268
753e384Q438m761J335R451p431j0323O630O379n460L562P358r279q309Q290L367
768C863n050N635M171j1109m888Q879L15l764P334N48j2093p67Q372k289j246
$$ plain form
783 -2089 5850 2885 -8498 -5535 1678 -2340 -1024 6578 913 -8556 -3187 2515 -2211 1507 7435
798 7435 -475 -7586 526 3193 -1505 4044 7931 -2504 -6194 2604 2416 -1265 5811 6547 -4683
813 -4683 -5433 2815 872 -1737 5923 3497 -7006 -5192 2300 -1867 -1498 5746 1325 -8825 -3373
828 -3373 2034 -3247 430 6317 -1408 -8037 -844 1958 -2551 2889 7000 -2397 -6535 1842 3682
843 3682 -1104 3903 7423 -2605 -6317 1604 2295 -756 4922 5642 -5459 -4623 2798 -268 -712 5699
859 5699 1429 -6571 -2938 1377 -1708 -222 5263 -809 -7689 -1524 1010 -2590 860 5561 -3124
874 -3124 -7932 504 2086 -2292 2860 5748 -3311 -6078 1934 2046 -563 5263 5137 -3733 -3424 4223
890 4223 1717 125 6134 2829 -5990 -2411 3437 -502 -310 5184 590 -7697 -1002 2954 -3134
$$ packed form
783b089P939k965j1383K963P213m018J316P602n665r469N369N702m726L718N928
798G435p910p111Q112K667m698N549L887j0435l690Q798j88l681P076P36j1230
813d683p50Q248j943k609P660k426j0503J814P492m167L69P244m421j0150N452
828c373N407n281L677N887p725o629P193K802m509N440M111r397m138Q377J840
843C682m786N007L520j0028l712P921O91l051N678P20j1101Q36P421l066m44O411
859E699m270q000L633M315l085J486N485o072o880O165K534l600L450M701q685
874c124m808Q436J582m378N152K888r059k767Q012J12k609N826j26q870L09P647
890D223k506j592O009l305q819L579N848l939J92N494m594q287O695L956o088
$$ plain form
905 -3134 62 5998 -2473 -8383 -299 2077 -3381 1582 4828 -3600 -5777 1115 1372 -1687 3206
920 3206 3636 -2944 -2947 1354 985 1360 5111 2236 -3305 -2354 3106 -710 719 6636 619 -5361 -491
937 -491 2719 -2756 1686 5623 -1060 -7694 -455 1961 -3581 1062 4274 -3077 -7270 265 1564
952 1564 -2779 1252 4121 -4549 -5660 2718 521 -3130 4114 3915 -5149 -2142 4469 -464 -265 6326
968 6326 1632 -6157 1015 3726 -901 1298 5570 311 -4846 -242 3103 -1224 973 4089 -1936
983 -1936 -5301 -125 1132 -1995 1346 1832 -4235 -3915 1880 -1606 -1503 4293 597 -5365 -1861 2994
999 2994 -1374 -175 5202 1025 -5032 125 3769 -675 521 5769 967 -6017 1111 4486 -1732
1014 -1732 978 6199 -1645 -5706 2410 2768 -2636 2255 4357 -4297 -4099 1295 -343 -2443 2993
$$ packed form
905c134L196N936q471n910Q084K376n458M963L246q428k177O892K57l059M893
920C206M30o580lM301l69L75L751k875n541R51N460l816J429N917o017n980M870
937d91L210n475M442L937o683o634P239K416n542M643L212p351m193P535J299
952A564m343M031K869q670j111Q378k197l651P244j99r064L007O611m933J99O591
968F326m694p789P172K711m627K199M272n259n157M604L345m327K197L116o025
983a936l365N176J257l127L341M86o067L20N795l486J03N796l696n962L504M855
999B994m368J199N377m177o057N157L644m444J196N248m802o984P128L375o218
1014a732K710N221p844m061Q116L58n404M891K102q654J98N394j638k100N436
$$ plain form
1029 2993 1532 -5558 -3130 1451 -567 -1692 3347 1310 -5495 -2023 2948 -1452 -336 4806 115
1044 115 -5228 573 2949 -1230 2096 5032 -1328 -3129 2188 1550 -1267 2906 3697 -2339 -3286 1960
1060 1960 848 -2181 2542 3478 -3434 -3844 1946 -444 -2420 3350 1193 -5509 -1897 2841 -2179
1075 -2179 -785 3908 -115 -4661 251 1336 -1538 1052 3695 -901 -3750 1751 2359 -617 2186
1090 2186 4353 -1605 -2794 3160 1948 -1448 3091 3270 -3761 -2161 3011 -717 -1900 3341 975
1105 975 -5051 -2051 1752 -1632 -1145 2358 -216 -4313 -1145 1350 -1933 -589 2434 -431 -4444
1120 -4444 6 2473 -1787 523 4234 -1955 -3474 2700 2155 -1450 2913 3191 -2332 -1527 2526 943
1136 943 -487 2741 2027 -2895 -1275 2079 524 -943 2344 621 -4336 -1253 1941 -1473 -1602 3239
$$ packed form
1029B993j461p090K428M581k018j125N039k037o805L472M971m400J116N142m691
1044A15n343N801K376m179L326K936o360j801N317o38k817M173P91o036r47N246
1060A960j112l029M723R36o912m10N790k390j976N770k157o702L612M738n020
1075b179J394M693m023m546M912J085k874K590K643m596k849N501O08k976K803
1090B186K167n958j189N954j212l396M539J79p031J600N172l728j183N241k366
1105I75o026L000L803l384M87L503k574m097L168K495l283J344L023k865m013
1120d444M450K467m260K310L711o189j519O174n45l605M363K78n523Q05M053j583
1136I43j430L228p14m922J620L354j555j467L287j723m957L083L194l414j29M841
$$ plain form
1152 3239 -1435 -4899 377 880 -2032 1234 2080 -2329 -3134 1454 330 -563 1585 2609 -2141 -2008
1168 -2008 2658 1108 -794 2449 2719 -2854 -1231 2538 665 -684 2995 944 -3373 -339 3290
1183 3290 -929 -452 2864 -391 -3859 384 1127 -1916 -698 2327 -2192 -3712 1061 507 -1549 -220
1199 -220 2653 -2487 -3202 2212 1204 -1644 2549 2201 -2704 -1414 3776 372 -1218 3336 1079 -2387
1215 -2387 566 1880 19 534 3351 46 -2272 900 2059 -999 -206 2623 -1104 -3145 420
1230 420 1364 -1939 178 1834 -3655 -3389 1131 -77 -2174 1632 1121 -3452 -1742 2057 255 -832
1246 -832 2495 1202 -2724 108 2552 126 -144 3628 701 -2718 591 2442 -381 762 3712
1261 3712 -599 -3257 1236 1595 -2196 726 1719 -2422 -3002 1219 365 -2100 449 1396 -2582 -2606 1725
$$ packed form
1152C239m674l464N276N03k912L266Q46m409q05M588j124q93K148J024m750J33
1168b008M666j550j902L243K70n573J623L769j873j349L679k051m317L034L629
1183C290m219M77L316l255l468M243P43l043J218L025m519j520M773n54k056J329
1199b20K873n140p15N414j008k848M193l48m905J290N190l404j590M554k257l466
1215b387K953J314j861N15K817l305k318L172J159l058P93K829l727k041L565
1230D20R44l303K117J656n489K66M520j208k097L806n11m573J710L799j802j087
1246h32L327j293l926K832K444k426k70L772k927l419L309J851k823J143K950
1261C712m311k658M493L59l791K922R93m141n80M221q54k465K549R47l978k4M331
$$ plain form
1278 1725 -71 -1607 1179 1193 -3331 -913 2089 -746 -864 2888 745 -3048 355 2884 -219 429
1294 429 3358 20 -2162 1289 2299 -654 685 2540 -1047 -2260 1272 1138 -1536 812 1498 -2618
1310 -2618 -2361 1577 -433 -1680 1199 866 -3580 -1492 1803 -1120 -1360 2146 250 -3482 22 2041
1326 2041 -1203 -373 3113 -157 -2355 1350 2381 -1051 640 3043 -628 -2356 2171 1581 -1330
1341 -1330 1305 2471 -1765 -1690 2110 -32 -1622 1466 958 -3007 -1214 1548 -1040 -1481 1836 -13
1357 -13 -3256 -841 1680 -1445 -1015 2091 -232 -3028 667 1773 -1134 305 2402 -574 -2092 1694
1373 1694 1632 -739 1326 2320 -1215 -1415 2316 941 -1097 1768 1646 -2164 -1162 2229 -393 -1527
1389 -1527 1971 539 -3138 -581 1764 -1545 -1358 1910 -577 -3634 87 1146 -1715 -346 2232
$$ packed form
1278A725j796j536K786J4m524K418L002k835j18L752k143l793L403K529l103O48
1294D29K929l338k182L451J010k953J339J855l587j213L532j34k674K348O86m116
1310b618K57L938k010j247K879l33m446K088L295k923k40L506j896l732L504K019
1326B041l244Q30L486l270k198L705J031l432J691K403l671j728M527n90k911
1341a330K635J166m236P5L800k142j590L088n08l965J793K762k588m41L317j849
1357a3l243K415K521l125M30L106k323k796L695J106k907J439K097k976j518L786
1373A694o2k371K065R94l535k00L731j375k038K865j22l810J002L391k622j134
1389a527L498j432l677K557K345l309J87L268k487l057L721J059k861J369K578
$$ plain form
1404 2232 -1042 -2918 1159 1614 -1501 955 2483 -1194 -1488 2137 1654 -589 2578 1679 -2043 -251
1420 -251 2085 549 -430 1369 1010 -2647 -311 1228 39 -1332 1977 -296 -3030 296 985 -1690
1436 -1690 -1092 1257 -1291 -2317 337 550 -1763 289 1860 -1859 -1869 1297 920 -1391 990 2285
1452 2285 -1476 -1007 2343 901 -874 1566 1915 -1951 -233 2476 33 -897 2178 527 -2546 -22
1468 -22 1944 -963 -791 1806 -696 -2671 567 961 -2044 -245 1553 -1625 -2507 631 547 -1683 507
1485 507 1200 -1722 -1337 1738 329 -1038 1571 1513 -1936 -41 2190 361 -193 2258 825 -1532
1501 -1532 398 2028 -577 -238 2030 31 -2006 609 1471 -1450 -123 1504 -1159 -2410 774
1516 774 460 -1936 85 988 -2029 -1931 947 18 -1811 803 670 -1865 -678 1792 -77 -1024 1991
$$ packed form
1404B232l274j876M077M55l115K456J528l677k94L625m83k243L167q99l722J792
1420b51K336j536r79J799l59l657K336J539j189j371L309k273k734L326O89k675
1436a690N98K349k548j026K654K13k313K052J571l719j0L166l77k311K381J295
1452B285l761M69L350j442j775K440L49l866J718K709k443r30L075j651l073K524
1468b2J966k907J72K597k502j975L238L94l005J799J798l178q82L138q4k230K190
1485E07O93k922L85L075j409j367K609n8l449J895K231j829n54K451j433k357
1501a532J930J630k605L39K268j999k037K615Q62k921J327J627k663j251L184
1516G74l14k396K021R03l017R8K878r29j829K614j33k535J187K470j869r47L015
$$ plain form
1533 1991 820 -1507 134 1969 -471 -573 2077 237 -1843 751 1771 -1003 87 2008 -959
1548 -959 -1421 1032 876 -1253 -57 1103 -1538 -1883 1270 213 -1858 -96 888 -2848 -1431 1383
1564 1383 -68 -1153 888 628 -2397 -67 2269 -614 -1290 2385 664 -1598 163 1261 -713
1579 -713 523 2217 -104 -1044 1669 970 -266 140 2747 -413 -1404 1185 238 -1146 574 1950
1595 1950 -1701 -1390 321 -678 -1288 1361 130 -2923 -1147 1898 -1218 -977 1631 174 -1358 148
1611 148 1067 53 328 1982 -527 -1103 989 2024 -411 679 1958 -1502 -359 1528 483 -1067
1627 -1067 1648 741 -1151 -965 1703 -361 -1193 254 468 -1813 -822 1888 -702 -993 683 -456
1643 -456 -1872 75 716 -654 -82 1149 287 -2366 855 1024 -641 -509 1561 -399 -1785 1811
$$ packed form
1533A991j171k327J641J835k440j02K650j840k080K594J020k774J090J921k967
1548i59m62K453j56k129J196J160k641l45L153j057k071J762R84l736J417K814
1564A383j451j085K041k60l025K330K336k883o76L675j721k262J761J098j974
1579g13J236J694k321r40K713o99j236M06K607l160r91K589r47j384J720J376
1595A950l651L11J711r99o10K649j231l053J776L045l116K41K608j457j532J506
1611A48R19j014K75J654k509n76K092J035k435J090J279l460J143J887j045j550
1627a067K715r07j892J86K668k064q32J447K14k281R91K710k590k91J676j139
1643d56j416J947O41j370N72J231q62k653L221J69j665J32K070j960j386L596
$$ plain form
1659 1811 369 423 1108 2037 -1047 -530 1808 107 -297 856 1001 -1928 -534 1628 -174 -1424 878
1676 878 673 -2094 -373 909 -1379 -467 985 -589 -1892 256 952 -1443 -338 1483 -72 -989
1692 -989 1220 1741 -800 754 1975 -1058 -834 2408 347 -380 1455 1572 -1002 -311 2004 -46
1708 -46 -1025 1505 626 -1614 -55 1696 174 -1039 1856 -425 -1447 -200 899 -1109 -85 835
1724 835 -732 -1458 740 117 -1303 -21 1151 -1500 -727 1517 385 -1269 1239 1021 -1439 108
1740 108 1982 654 -475 1743 489 -1037 607 1129 -245 -441 1739 343 -1504 479 988 -511
1756 -511 -1162 1623 -569 -1939 448 592 -1259 -249 503 -1298 -1102 976 -130 -917 562 860 -1757
1773 -1757 -541 1448 -25 -854 1271 1062 -1077 137 1928 -74 -647 1257 325 -1204 550 1605
$$ packed form
1659A811j442N4O85R29l084N17K338j701m04J153J45k929J394K162j802j250K302
1676H78k05k767J721J282k288R12J452j574j303K148O96k395J105J821j555r17
1692i89K209N21k541J554J221l033K24L242k061p27J835J17k574O91K315k050
1708d6r79K530q79k240J559J751j522j213K895k281j022J247J099k008J024R20
1724H35j567p26K198o23j420J282J172k651P73K244j132j654K508k18k460J547
1740A08J874j328j129K218j254j526J644N22j374j96K180j396j847J983N09j499
1756e11o51K785k192j370K387J44j851J010P52j801J96K078j106p87J479K98k617
1773a757J216J989j473q29K125k09k139J214J791k002n73J904r32j529J754J055
$$ plain form
1789 1605 -698 49 1364 -459 -1147 587 837 -1636 -5 984 -716 -1480 841 143 -1623 -14
1805 -14 752 -1107 -782 827 125 -1367 1018 592 -1385 -275 1532 -435 -548 1577 325 -1254 478
1822 478 1581 -294 -224 1248 345 -764 647 994 -292 98 1176 -590 -1133 1146 330 -1461 399
1839 399 824 -1331 -1137 897 -115 -1510 358 603 -1556 -588 589 -499 -661 786 -3 -1363 238
1856 238 1004 -831 -502 1767 228 -1044 844 1538 -294 27 1583 -203 -695 765 751 -621 -28
1873 -28 727 -641 -735 1035 230 -989 663 419 -1485 -491 1230 -524 -1759 736 526 -1929 -832
1890 -832 757 -59 -746 438 -732 -880 564 1057 -893 -1 972 -101 -775 1619 1304 -440 473
1907 473 2070 -70 -182 1386 670 -626 718 1045 -844 -274 905 303 -605 1011 288 -1841 42
$$ packed form
1789A605k303P47J315j823o88J734K50k473J631R89j700p64K321o98j766J609
1805a4P66j859L25J609p02j492K385m26j977J110J807j967j13K125j252j579J732
1822D78J103j875P0J472r03j109J411L47j286L90J078j766n43K279q16j791J860
1839C99M25k155J94K034j012j395J868K45k159R68J177j088j62J447p89j360J601
1856B38P66j835L29K269j539j272J888O94j832L21J556j786m92J460j4j372N93
1873b8P55j368r4J770q05j219J652k44j904R94J721j754j235K495k10k455J097
1890h32J589q16o87J184j170j48J444M93j950Q92R73j073o74K394l15j744R13
1907D73J597k140j12J568p16j296J344L27j889N70J179o02r08J616p23k129J883
$$ plain form
1924 42 1145 -1086 -1417 1507 511 -1744 -275 904 -698 -124 859 -577 -470 1089 460 -270 192
1941 192 737 -345 -357 1109 1026 -1240 501 1235 -953 -592 1532 797 -512 277 104 -872 -23 1024
1959 1024 -846 -348 285 -324 -1053 153 89 -808 -1082 1647 -596 -1821 645 641 -1001 -309 877 -621
1977 -621 -639 630 -292 -590 572 1241 -468 -403 2056 431 -607 558 761 -1340 167 1707 97
1994 97 -691 661 582 -1081 -69 258 -993 -197 859 -689 -1319 41 384 -1584 -893 609 -543
2011 -543 -643 744 -187 -489 -303 784 -624 -425 966 502 -727 1389 657 -956 -516 1004 39
2028 39 -761 1305 754 -841 152 1404 27 -463 325 277 -694 54 982 -690 -245 475 -1175 -1280 522
2047 522 349 -1150 7 743 -797 -1495 420 -591 -1230 -242 765 -739 -730 1024 258 -346 487 533
$$ packed form
1924D2J103k231l31K924r96k255J469J179j602N74R83j436J07J559o29p30M62
1941A92N45j082j2J466q3k266J741P34k188L61K124p35j309P89j73r76Q49J047
1959A024j870M98O33o09p29J206o4q97k74K729k243j225K466mj642O92J186j498
1977f21j8J269r22k98J162O69j709O5K459j625j038J165K03k101J507J540j610
1994I7p88J352p9j663J012L27j251P96J056j548o30J360L43j968O91J502j152
2011e43j00J387r31l02J86J087j408J99J391m64j229K116p32j613M40J520r65
2028C9q00K066n51j595R93J252j377m90P88m8r71P48R28j672M45P20j650j05J802
2047E22j73j499J157P36j540o98J915j011o39R88J007j504RJ754p66o04Q33M6
$$ plain form
2065 533 -740 699 1175 -42 -848 1900 469 -1092 590 1072 -729 -261 742 264 -472 394 392 -855
2083 -855 80 105 -859 -1035 509 -298 -1257 -28 484 -1047 -285 784 -112 -1265 345 559 -998 -366
2101 -366 832 -59 -121 835 150 -297 723 974 -637 -143 1398 -274 -766 908 764 -848 -13 1242
2119 1242 -153 -706 -22 520 -901 193 134 -912 -350 401 -716 -698 669 314 -1365 32 878 -708
2137 -708 -797 891 375 -591 92 565 -435 -241 904 -109 -334 861 745 -536 286 1144 -301 -795
2155 -795 1196 285 -625 399 923 -797 -739 744 -63 -791 180 296 -787 -403 478 -653 -661 305 -345
2174 -345 -1067 417 868 -825 -671 891 -37 -686 295 1044 -271 -209 933 -68 9 634 201 -439 374
2193 374 571 -543 -257 1064 -192 -696 422 778 -824 -737 898 95 -1182 137 66 -870 -255 76
$$ packed form
2065E33j273J439M76j217q06K748j431j561J682M82j801M68J003m78p36Q66kj247
2083h55R35K5r64j76J544q07r59J229N12j531P62J069q96j153J610K14j557O32
2101c66J198q91o2R56o85m47J020K51j611M94J541j672m92J674j44j612Q35J255
2119A242j395n53O84N42j421J094n9j046N62P51j117J8J367l55j679J397Q46j586
2137g08q9J688n16r66O83M73j000J94J145j013k25J195j16j281Q22Q58j445m94
2155g95J991r11r10J024N24j720N8J483q07p28R71J16j083L84Q81j131qR66o50
2174c45p22J484M51j693J54J562r28o49R81P49j315O2J142j001P7O25m33o40Q13
2193C74J97j114K86J321j256n04J118L56j602Q7J635q03j277J319p1r36O15L31
$$ plain form
2211 76 -568 -567 610 -468 -1015 437 426 -1012 -173 993 -310 -891 815 568 -411 55 975 -247 -256
2230 -256 873 342 -281 646 473 -603 214 1019 35 -520 566 435 -1144 -21 828 -473 -1042 586
2248 586 -91 -675 -219 293 -681 -253 373 -326 -543 326 299 -1078 443 1003 -757 35 900 790 -608
2267 -608 654 888 -120 -444 611 576 -285 771 572 -533 113 816 -491 -118 1030 -75 -1191
2284 -1191 190 687 -789 -543 581 -364 -820 -74 75 -667 122 250 -589 -597 467 -1 -632 481 623
2303 623 -956 -256 1003 158 -683 453 675 -507 146 815 297 -258 747 89 -652 432 637 -777
2321 -777 -58 648 -248 -814 474 293 -940 -358 605 -257 -862 30 141 -744 -101 59 -812 -345 429
2340 429 -185 -688 798 132 -619 67 1136 -117 -547 498 300 -854 465 1019 -87 60 583 295
$$ packed form
2211G6o44JJ177j078n47J452j1j438Q39J166j303n81J706k47r79M66R20j222r
2230b56J129n31o23R27j73j076Q17Q05r84n55J086j31j579J123Q49j301n69J628
2248E86o77n84M56N12r74M28O26o99k17Q69k7j377J521N60j760P92Q65j10j398
2267f08J262K34j008l24J055l5q61J056j99j105O46P03j307L73J148j105j116
2284a191J381M97j476K46J124r45m56P46J49p42P89J28q39qJ064m68o31J113J42
2303F23j579P00J259q45q41J136K22j182O53O69n18n55J005o58p41J084K05j414
2321g77P19P06q96n66J288j81j233N82R63q62o05Q92J11q85O43J60q71M67P74
2340D29o14n03J486o66p51O86J069j253m30J045j98j154J319N54j106J47N23k88
$$ plain form
2358 295 -534 626 159 -572 -74 691 -595 -646 396 222 -1088 -111 521 -561 -934 335 5 -747
2376 -747 88 156 -604 -30 459 -431 -503 544 199 -956 359 843 -152 -42 791 352 -446 438 953 -278
2396 -278 -113 643 -61 -591 535 217 -453 38 495 -351 -334 344 -121 -764 288 330 -464 -554 434 -287
2416 -287 -765 58 330 -580 -7 452 -650 -330 367 -58 -600 375 569 -558 -53 1037 125 -599 704
2435 704 727 -337 253 684 -39 -357 641 341 -687 406 465 -703 -291 502 -212 -643 336 27 -978
2454 -978 -182 620 -330 -605 490 -26 -750 105 492 -327 -276 656 70 -337 663 460 -553 255 944
2473 944 -136 -295 675 509 -317 231 715 -169 -179 552 -69 -570 151 314 -498 6 659 -290 -978 348
2493 348 77 -877 3 415 -512 -717 449 -222 -770 269 434 -519 -34 586 -115 -490 735 245 -261
$$ packed form
2358B95q29J160m67p31M98P65j286n1J042j74j310R77O32j082l73J269l30p52
2376g47Q35O8p60N74M89q90p2J047l45j155J315M84r95J10Q33m39p98Q84N15j231
2396b78J65P56p04n30J126l18o70M91M57q46J7O78m65o43J052M2p94r0R88p21
2416b87m78Q23K72r10N73M59j102L20O97m25n42R75J94j127N05J090r12p24J303
2435G04K3j064N90M31p23l18R98l00j028J093N9j168M12P93p14m31R79l09j005
2454i78P96Q02r50k75J095n16p24Q55L87q19N1R32n86m07J000k03j013Q08O89
2473I44j080j59R70j66q26N48M84q84j0P31o21n01P21J63q12N04O53r49o88J326
2493C48k71r54Q80M12r27k05J166o71n48J039J65r53M85O20p01l75J225m90n06
$$ plain form
2512 -261 296 695 -270 -152 852 277 -489 465 632 -123 98 682 -220 -303 315 198 -622 111 414 -631
2532 -631 -386 484 -175 -664 120 203 -798 -539 390 -93 -591 357 294 -412 153 502 -243 -322 640 310 -310
2553 -310 560 437 -565 45 756 -64 -426 550 280 -588 167 498 110 -224 500 131 -758 137 478 -681
2573 -681 -222 286 -251 -673 401 190 -509 -26 407 -324 -487 360 81 -604 235 512 -240 -35 769 24
2593 24 -259 517 443 -287 13 655 -188 -287 466 129 -387 299 531 -299 -178 551 -285 -532 129 162 -709
2614 -709 1 214 -605 -664 101 -283 -783 68 323 -489 -493 364 -52 -517 236 408 -374 -41 666 -125 -211
2635 -211 747 283 -251 405 507 37 23 862 134 -523 560 573 -393 -177 403 -178 -674 361 51 -622
$$ packed form
2512b61N57L99r65J18J004n75p66R54J67p55K21N84r02q3O18j17q20P33L03j045
2532f31K45Q70o59m89P84Q3j001K59R29m83m98R48o3p06N65L49p45p9R62l30o20
2553c10Q70j23j002O10P11q20l62R76k70q68P55L31l88l34P24l69q89Q95L41j159
2573f81M59N08n37m22J074k11o99M83M33p31j63Q47k79o85Q39K77p52K05Q04p45
2593B4k83P76p4p30L00O42q43r9P53l37n16O86K32q30J21P29q36k47O61L3q71
2614g09P10K13q19n9P65l84n00Q51K55q12mQ57m16m65P53J72p82L33P07p91q6
2635b11R58m64n34O56J02m70j4Q39p28o57J083J3r66K16N80n81m96J035l10o73
$$ [...]
8191i5
##END NTUPLES=NMR FID
##END=
