##TITLE=1H_Pr AM-PiK
 CDCl3, 8 sc, 
 1.9.2020
##JCAMPDX= 6.0         $$ Bruker NMR JCAMP-DX V2.0
##DATA TYPE= NMR FID
##DATA CLASS= NTUPLES
##ORIGIN= UXNMR, Bruker Analytische Messtechnik GmbH
##OWNER= root
$$ XWIN-NMR		Version 3.5
$$ Tue Sep  1 12:09:55 2020 Russian Standard Time (UT+4h)  she@DPX200
##.OBSERVE FREQUENCY= 200.1315066352
##.OBSERVE NUCLEUS= ^1H
##.DELAY= (6, 6)
##.ACQUISITION MODE= SIMULTANEOUS
##.ACQUISITION SCHEME= undefined
##.AVERAGES= 8
##.DIGITISER RES= 18
##SPECTROMETER/DATA SYSTEM= spect
##.PULSE SEQUENCE= zg30
##.SOLVENT NAME= CDCl3
##.SHIFT REFERENCE= (INTERNAL, CDCl3, 0, 15.7039)
##AUDIT TRAIL= $$ (NUMBER, WHEN, WHO, WHERE, WHAT)
$$ ##TITLE= Audit trail, XWIN-NMR		Version 3.5
$$ ##JCAMPDX= 5.01
$$ ##ORIGIN= Bruker BioSpin GmbH
$$ ##OWNER= she
$$ F:/spectra/data/she/nmr/H-F/1/audita.txt
$$ ##AUDIT TRAIL=  $$ (NUMBER, WHEN, WHO, WHERE, WHAT)
(   1,<2020-09-01 12:08:44.68 +0400>,<she>,<DPX200>,
      <created by zg, POWCHK disabled, PULCHK disabled
       configuration hash MD5:
       00 E9 B6 7A A2 85 ED C7 34 08 36 98 17 FE 4E 26
       data hash MD5: 16K
       FF 9A 83 CF 75 4C 1F 79 19 FA 9D F9 F4 38 E1 89>)
$$ ##END=
$$ 
$$ hash MD5
$$ 32 40 65 9A A1 5D B5 9D CB 03 3C AE 76 5A A4 1F
##$RELAX= 
##$RELAX= 
##$RELAX= 
##$RELAX= 
##$RELAX= 
##$RELAX= 
$$ Bruker specific parameters
$$ --------------------------
##$DU= <F:/spectra>
##$EXPNO= 1
##$NAME= <H-F>
##$PROCNO= 1
##$TYPE= <nmr>
##$USER= <she>
##$AMP= (0..31)
100 100 100 100 100 100 100 100 100 100 100 100 100 100 100 100 100 100 
100 100 100 100 100 100 100 100 100 100 100 100 100 100 
##$AQSEQ= 0
##$AQ_mod= 1
##$AUNM= <au_zg>
##$AUTOPOS= <>
##$BF1= 200.13
##$BF2= 200.13
##$BF3= 200.13
##$BF4= 200.13
##$BF5= 200.13
##$BF6= 200.13
##$BF7= 200.13
##$BF8= 200.13
##$BYTORDA= 1
##$CFDGTYP= 0
##$CFRGTYP= 5
##$CHEMSTR= <none>
##$CNST= (0..31)
1 1 145 1 1 1 1 1 1 1 1 1 1 1 1 1 1 1 1 1 1 1 1 1 1 1 1 1 1 1 1 1 
##$CPDPRG= <>
##$CPDPRG1= <>
##$CPDPRG2= <>
##$CPDPRG3= <>
##$CPDPRG4= <mlev>
##$CPDPRG5= <mlev>
##$CPDPRG6= <mlev>
##$CPDPRG7= <mlev>
##$CPDPRG8= <mlev>
##$CPDPRGB= <>
##$CPDPRGT= <>
##$D= (0..31)
0 1.2 0 0 0 0 0 0 0 0.06 0 0.03 0 0 0 0 0.0002 0 0 0 0 0 0 0 0 0 0 0 0 
0 0 0 
##$DATE= 1598947724
##$DBL= (0..7)
120 120 120 120 120 120 120 120 
##$DBP= (0..7)
150 150 150 150 150 150 150 150 
##$DBP07= 0
##$DBPNAM0= <>
##$DBPNAM1= <>
##$DBPNAM2= <>
##$DBPNAM3= <>
##$DBPNAM4= <>
##$DBPNAM5= <>
##$DBPNAM6= <>
##$DBPNAM7= <>
##$DBPOAL= (0..7)
0.5 0.5 0.5 0.5 0.5 0.5 0.5 0.5 
##$DBPOFFS= (0..7)
0 0 0 0 0 0 0 0 
##$DE= 6
##$DECBNUC= <off>
##$DECIM= 32
##$DECNUC= <off>
##$DECSTAT= 4
##$DIGMOD= 1
##$DIGTYP= 9
##$DL= (0..7)
0 120 120 120 120 120 120 120 
##$DP= (0..7)
150 150 150 150 150 150 150 150 
##$DP07= 0
##$DPNAME0= <>
##$DPNAME1= <>
##$DPNAME2= <>
##$DPNAME3= <>
##$DPNAME4= <>
##$DPNAME5= <>
##$DPNAME6= <>
##$DPNAME7= <>
##$DPOAL= (0..7)
0.5 0.5 0.5 0.5 0.5 0.5 0.5 0.5 
##$DPOFFS= (0..7)
0 0 0 0 0 0 0 0 
##$DQDMODE= 0
##$DR= 18
##$DS= 0
##$DSLIST= <SSSSSSSSSSSSSSS>
$$ [...]
##$SUBNAM2= <"">
##$SUBNAM3= <"">
##$SUBNAM4= <"">
##$SUBNAM5= <"">
##$SUBNAM6= <"">
##$SUBNAM7= <"">
##$SUBNAM8= <"">
##$SUBNAM9= <"">
##$SW= 16.880792210976
##$SWIBOX= (0..15)
0 0 2 0 0 0 0 0 0 0 0 0 0 0 0 0 
##$SW_h= 3378.37837837838
##$TD= 16384
##$TD0= 1
##$TE= 0
##$TE2= 300
##$TE3= 300
##$TEG= 300
##$TL= (0..7)
0 120 120 120 120 120 120 120 
##$TP= (0..7)
150 150 150 150 150 150 150 150 
##$TP07= 0
##$TPNAME0= <>
##$TPNAME1= <>
##$TPNAME2= <>
##$TPNAME3= <>
##$TPNAME4= <>
##$TPNAME5= <>
##$TPNAME6= <>
##$TPNAME7= <>
##$TPOAL= (0..7)
0.5 0.5 0.5 0.5 0.5 0.5 0.5 0.5 
##$TPOFFS= (0..7)
0 0 0 0 0 0 0 0 
##$TUNHIN= 0
##$TUNHOUT= 0
##$TUNXOUT= 0
##$USERA1= <user>
##$USERA2= <user>
##$USERA3= <user>
##$USERA4= <user>
##$USERA5= <user>
##$V9= 5
##$VALIST= <valist>
##$VCLIST= <CCCCCCCCCCCCCCC>
##$VD= 0
##$VDLIST= <DDDDDDDDDDDDDDD>
##$VPLIST= <PPPPPPPPPPPPPPP>
##$VTLIST= <TTTTTTTTTTTTTTT>
##$WBST= 1024
##$WBSW= 4
##$XGAIN= (0..3)
0 0 0 0 
##$XL= 0
##$YL= 0
##$YMAX_a= 123250
##$YMIN_a= -117301
##$ZGOPTNS= <>
##$ZL1= 120
##$ZL2= 120
##$ZL3= 120
##$ZL4= 120
##$ABSF1= 10
##$ABSF2= 0
##$ABSG= 5
##$ABSL= 3
##$ALPHA= 0
##$AQORDER= 0
##$ASSFAC= 0
##$ASSFACI= 0
##$ASSFACX= 0
##$ASSWID= 0
##$AUNMP= <proc_1d>
##$AZFE= 0.1
##$AZFW= 0.1
##$BCFW= 1
##$BC_mod= 2
##$BYTORDP= 1
##$COROFFS= 0
##$CY= 11.3945322036743
##$DATMOD= 1
##$DC= 2
##$DFILT= <>
##$DTYPP= 0
##$F1P= 16.9975609425685
##$F2P= -3.02152046262296
##$FCOR= 0.5
##$FTSIZE= 0
##$FT_mod= 4
##$GAMMA= 1
##$GB= 0.15
##$INTBC= 1
##$INTSCL= 1
##$ISEN= 128
##$LB= 0.24
##$LEV0= 0
##$LPBIN= 0
##$MAXI= 10000
##$MC2= 0
##$MEAN= 0
##$ME_mod= 0
##$MI= 1.114404
##$NCOEF= 0
##$NC_proc= 0
##$NLEV= 6
##$NOISF1= 3.799351
##$NOISF2= 2.8
##$NSP= 1
##$NTH_PI= 0
##$NZP= 0
##$OFFSET= 15.70392
##$PC= 1
##$PHC0= -9976.307
##$PHC1= 13.60092
##$PH_mod= 1
##$PKNL= yes
##$PPARMOD= 0
##$PSCAL= 0
##$PSIGN= 0
##$REVERSE= no
##$SF= 200.130013532006
##$SI= 16384
##$SIGF1= 3
##$SIGF2= 2
##$SINO= 400
##$SIOLD= 16384
##$SREGLST= <1H.CDCl3>
##$SSB= 0
##$STSI= 0
##$STSR= 0
##$SW_p= 3612.71676300578
##$SYMM= 0
##$S_DEV= 0
##$TDeff= 0
##$TDoff= 0
##$TI= <>
##$TILT= no
##$TM1= 0
##$TM2= 0
##$TOPLEV= 0
##$USERP1= <user>
##$USERP2= <user>
##$USERP3= <user>
##$USERP4= <user>
##$USERP5= <user>
##$WDW= 1
##$XDIM= 8192
##$YMAX_p= 0
##$YMIN_p= 0
$$ End of Bruker specific parameters
$$ ---------------------------------
##NTUPLES= NMR FID
##VAR_NAME=  TIME,          FID/REAL,        FID/IMAG
##SYMBOL=    X,             R,               I
##VAR_TYPE=  INDEPENDENT,   DEPENDENT,       DEPENDENT
##VAR_FORM=  AFFN,          ASDF,            ASDF
##VAR_DIM=   8192,          8192,            8192
##UNITS=     SECONDS,       ARBITRARY UNITS, ARBITRARY UNITS
##FACTOR=    0.000296,      1,               1
##FIRST=     0,             0,               0
##LAST=      2.424536,      0,               0
##MIN=       0,             -117301,         0
##MAX=       2.424536,      123250,          0
$$ Real data points
##PAGE= N=1
##DATA TABLE= (X++(R..R)), XYDATA
$$ [...]
1880B64l55l2K10j78L23m28L88l88O05l17K22n0k52N82o48L83m26N48ll16L95
1901E27l30K54j62K36m51J39N8O7J38m66N04p69N88l72K43n24K00M02m24P33r13
1922c22M77k61L97o07M33r9l52L72m47M47n39K80j72J99L3k82M25k64L82l70J45
1943a25l41J63R3k08K45k24M45l38K32l38K82k51K73K66k86K45k51M18l37N1K02
1964B16j19K85m00N04l58J60j30J18l8j40K77l20N13l78K46o23O04p8j51N6k98
1985e4N36o27L18j23RO3N2K26o30N34o39M06k46J64L0j52J19j61J59j45J35l07
2007c33K52l25J18L49l47M20o32M30l68K05k0j71L05l21L49l20M11m38M00k16
2027b52j53M39l51N50m75L24j59K51o4J0J87n03M85m37N45l47J35q4R0K45k92
$$ plain form
1880 264 -91 -123 87 -91 232 -196 192 -196 409 92 314 264 12 594 -54 329 -97 451 448 132 527
1901 527 197 451 289 525 74 213 271 338 476 10 514 -255 333 -39 204 -320 -120 282 -142 591 -322
1922 -322 155 -106 291 -316 117 18 -334 38 -409 38 -501 -221 -393 -194 -161 -443 -18 -282 100 -270 -125
1943 -125 -466 -303 -210 -418 -173 -397 48 -290 -58 -396 -114 -365 -92 174 -112 133 -118 300 -37 14 216
1964 216 97 382 -18 486 128 288 158 276 238 98 375 55 568 190 436 -187 417 339 188 244 -54
1985 -54 482 -145 173 50 59 122 174 400 -230 304 -335 71 -175 -11 19 -133 -14 -175 -16 -161 -26 -333
2007 -333 -81 -406 -288 61 -286 134 -498 -68 -436 -231 -251 -422 -117 -438 -89 -409 2 -436 -36 -252
2027 -252 -405 34 -317 233 -242 82 -77 174 110 120 307 -196 289 -148 397 50 185 101 191 436 144
2048A44J70j74L47m87N72k35l51N01l27K16k18J93k1K7j17Q9K0k33N38o72K62
2069B44m18K19j87K00L9m03O07o25M48k26J70m47J81K47n43O12q27Q80k96K2r9
2090b02R3K00p38P04n56N61l46J63m5J77O6n01L94k96K17j55N19m36K88m4j48
2111h5M86l67J50k32L65k38P6K78m97L15l74N41n50P41n78l9J83j52N45o16M13
2132C65k67J61j34N7P5m31N35o04Q18p11K28j90N8K55m61O07o53N54o86L25R8
2153aj39j22J48k22p8K60l37K04p1K07j16k31O12o10L39k34K77Q9j13Q8n07M63
2175i4l59L15q3K24q1j42K41k8M5l24J81j72N70j37kj72P8L98m87K13j48K20L70
2198F26m05Q7p0oM6K56n14N03o58K26M5j12L47n05L53l74N05j83n5K74p35M28
$$ plain form
2048 144 314 140 487 0 572 337 -14 487 160 376 158 351 330 357 240 329 349 116 654 -18 244
2069 244 -174 45 -142 58 97 -306 301 -324 124 -102 68 -379 -198 49 -494 118 -709 171 -125 -103 -202
2090 -202 -109 91 -647 57 -499 62 -284 -121 -166 11 77 -424 -30 -326 -109 -264 255 -181 107 63 -85
2111 -85 401 34 184 -48 317 79 155 433 -64 251 -123 418 -132 609 31 -8 175 23 568 -48 365
2132 365 98 259 125 182 257 -174 361 -243 575 -136 92 -98 -40 215 -246 361 -292 262 -424 -99 -1
2153 -1 -140 -262 -114 -336 -414 -154 -491 -287 -358 -151 -267 -498 114 -496 -157 -391 -114 -25 -138 -50 -557 -94
2175 -94 -453 -138 -221 3 -78 -220 21 -7 38 -286 -105 -277 293 156 154 -18 60 458 -29 184 36 256 626
2198 626 221 308 238 232 278 534 20 523 -135 91 136 24 371 -134 219 -155 350 167 112 386 -349 79
2220G9q9Q0r0N7J17k02N0l73K97k64L54m08J65NN0O4k56N41o65N85l23j58K36
2243a48o0J38j08J17l30K81k26M05l20K80p1j71K01k08L70l08L89l35J04pJ5P1
2265G9m13Q76l47M1n4O4p2j6J52m84O79l71J96l77M03r3r4K02n34L59k06K29j53
2288F6K25l57k23P62m86J36j73L25m27J11J82k84L53o29K89j47J02k5Pp1N1J12
2310a01k16R5j94K74j95K23o1j69M67l09K80n58L06L1n6K64k57J42q2L04m96N08
2332B00k39P5K12k28q5j61M64m10N17n79M42r8K0L5j23J93l19N53l99L30l66q
2354B6K05l64L83k33M00n08L78k09N9K27m60L73l40J14k06K71j98N8L12l63K82
2375B07m02J89j52Q8j8j20L12m10N9k99M90m06K93R1j42k9p2K63k21J59k74J85
$$ plain form
2220 79 -10 70 -20 37 154 -48 2 -371 -74 -338 16 -392 -227 -222 -172 -108 -364 177 -488 97 -226 -384 -148
2243 -148 -208 -70 -178 -61 -391 -110 -336 69 -251 29 -42 -213 -12 -220 150 -158 231 -104 0 -7 8 79
2265 79 -334 542 195 236 182 246 174 158 310 -174 505 134 330 -47 356 263 169 371 -163 196 -10 219 66
2288 66 291 -66 -289 473 -13 123 -50 275 -152 -41 141 -143 210 -419 -130 -277 -175 -200 -193 -264 -213 -101
2310 -101 -317 -222 -416 -142 -337 -114 -175 -344 123 -186 94 -464 -158 -127 -183 81 -176 -34 -116 188 -308 200
2332 200 -39 36 248 20 -65 -226 238 -172 345 -234 208 110 130 165 42 235 -84 469 70 400 34 26
2354 26 231 -133 250 17 417 -91 287 78 137 364 -96 277 -63 51 -155 116 -82 -24 288 -75 207
2375 207 -195 -6 -158 -70 -88 -208 104 -306 -247 -546 -56 -462 -169 -78 -220 -249 -321 -58 -279 -120 -394 -209
2397b09j19K46j12j44M59l35L30m66M54j62p4L83m56L96m67N48k75J81j40j08
2417g0J13k27L36k45K18k07K11M10l07K9j10L1J07q3j23j4M8k04K12j06N63n36
2439D6K54j25J39k33j67O7k4N12o29K73l05P1j31M77l56j43L36l00M15n10K27
2460a06k59M45l48j02J22j38M03o85N53j49q1J09o7L56m60L05j79K53QM5ko8L14
2483B69m31L25j25M20m16j42K12k48K70k04L12n30M96R9n9J5k88L03k72L19j62
2504A63J11p6j8k01Q1J67q7Lp7P2k62K36r0j20L48q6r9l11K91j42K44Lm10L66
2528A06k82L16k37J45k95J36J33N1j40k29M79n54L76p6m14M52j54K28k97J90j35
2549b01J37l34K71j75J42K35l28M63m45J65pL12o6k64L05k98K14m76M88j64L88
$$ plain form
2397 -209 -328 -82 -194 -338 121 -214 116 -350 104 -58 -132 251 -205 191 -276 272 -3 178 38 -70
2417 -70 43 -184 152 -93 125 -82 129 539 232 261 151 182 289 206 83 69 117 -87 125 19 582 46
2439 46 300 175 314 81 -86 -19 -43 469 -160 113 -192 -121 -252 225 -131 -274 62 -238 177 -333 -106
2460 -106 -365 80 -268 -370 -248 -386 17 -668 -115 -264 -345 -236 -303 53 -407 -102 -281 -28 -20 25 23 -45 269
2483 269 -162 163 38 458 42 -100 112 -136 134 -70 242 -288 208 307 248 263 -25 278 6 325 163
2504 163 274 198 180 -21 60 227 140 143 66 138 -124 112 22 -98 250 164 65 -246 45 -97 147 150 -260 106
2528 106 -176 140 -97 48 -247 -111 22 73 -67 -296 183 -371 5 -71 -485 -33 -187 41 -256 -66 -201
2549 -201 -64 -398 -127 -302 -160 75 -253 210 -235 -70 -77 235 169 -95 210 -88 126 -350 138 -26 362
2570C62j05l6n5j16K87k26K37l49L21l8m10O02m29J00k65M28k32q1L34p5J59m40
2592b7N43m16j04L6k7p7M1O7l18M88m05N00m70P8J55n9J14o16N66l39J41k5K09
2615E5k68J47L2m07L95l82K35O4M0j58J38k4j58L16l34O60n44J07J5k42L21n4
2637d6L30m32N07k67Q8j73L1J82l15K30j36L71l12K08k88n5M70j76J8k70L70o6
2659B69k28J78O9k28j4J97j81J58k02k64J36K65j75J94k11j58J33K18j2k28J31
2680D7j8m06K74L2O4r1K51l38Q1j99J91j12J27k5k79K16k61M84j3k12k7j22J43
2703a93r6J05k0KM58m59K15r6R5J15O4l65L43j82J39j18k92O14k76M72n14R1k6
2726G6k59O61k65J96m41L47k20J90p4l75N06l27M09l96q4R1K15k75K6J64l25L73
$$ plain form
2570 362 257 221 166 50 337 111 348 -1 320 282 -128 474 45 145 -120 308 76 -5 329 254 413 -27
2592 -27 516 100 -4 32 5 -72 -31 36 -282 206 -199 301 -169 -91 64 5 119 -497 69 -270 -129 -154 55
2615 55 -213 -66 -34 -441 -46 -428 -193 -129 -89 -247 -109 -133 -291 25 -309 351 -193 -86 -71 -313 8 -46
2637 -46 284 -148 359 92 180 7 38 220 -95 135 -1 370 58 266 -22 -77 393 217 235 -35 335 269
2659 269 41 219 288 60 46 243 62 220 18 -246 -110 155 -20 174 -37 -195 -62 156 144 -84 47
2680 47 29 -377 -103 -71 -7 -98 153 -185 -104 -303 -112 -224 -97 -122 -401 -185 -446 38 25 -187 -214 -336 -193
2703 -193 -289 -184 -204 -202 256 -203 12 -84 11 126 190 -175 168 -14 125 7 -285 329 53 525 11 102 76
2726 76 -183 478 213 409 -32 315 95 285 211 -164 342 15 424 28 -56 35 250 -25 1 165 -160 213
2748B13l55K15o1j44L89l99K07k28J24p6j03K4RJ60k25J34Q2O0l10N1p6J53J03
2771e3k21M09n48L35l8Om1K59p6m5J23j03J38l27Q3Jj59J86L43m3m71M46l60K24
2795F8O6m2L94m04L31l02K27k91J74p1l8K8j40K71k54M49n81K21m07O44l55j50
2817a62K76o2L79n09R2J47r7k48J42K30k85J28k98J03L2R3J23j56K98k61K65o52
2839d22K80j66L07J11k95J70j97J35j92L51l06J26J04k31J43p3Q8k03L08k56M18
2860B00k91RO4j04L96m59M7q0K61k8l3M28m52K52k20L38l92Q1O7LQ3k33L80k62
2884E5K63j65q8Q0J07j95k35N52p02M34k10K04J90l90K37j14k2j25J74o8o6j00
2906a84J33K86n14L37l05n4m0P6K59l04K16k2J51k87K47J8n0j42J40J0j29J10
$$ plain form
2748 213 -142 73 12 -132 257 -142 65 -163 -39 -115 -218 -194 -185 -25 -250 -116 -34 26 -284 -233 -309 -156 -53
2771 -53 -274 135 -413 -78 -116 -110 -151 108 32 -13 110 7 145 -182 -99 -98 -257 -71 272 229 -242 204 -156 68
2795 68 134 92 486 82 413 111 338 47 221 150 112 140 0 271 17 466 -115 106 -301 343 -12 -162
2817 -162 114 52 431 -78 14 161 64 -184 -42 188 -97 31 -267 -164 -132 -39 84 -72 226 -35 230 -422
2839 -422 -142 -308 -1 110 -185 -15 -212 -77 -269 82 -224 -98 6 -225 -82 -155 -67 -270 38 -218 200
2860 200 -91 -82 -18 -122 274 -185 -138 -218 43 15 -18 410 -42 210 -10 328 -64 17 84 87 170 -63 317 55
2884 55 318 153 65 145 252 57 -178 374 -328 106 -104 100 290 -100 137 23 1 -124 50 -18 -84 -184
2906 -184 -51 235 -279 58 -247 -301 -341 -265 -6 -310 -94 -116 35 -252 -5 13 -37 -179 -39 -29 -158 -48
2928d8k18L00l65K13j56L82Mm71M28k03L94l09J36j30p3J30j45J89j26J90Q7n3
2950A56j20M02j59k40M02n75M91j49L9p5K05j63j60K43k04N0j91L26l82J59J73
2971B28j90J76q4J4l35J90J44m83K62l8K40m65L11K3J80l68PqNj17j15N53l61
2994b31K67k80K06Pp4K61m39L58l53J15LK6J9J0M01k76j6J28k48l1r8K75j00J41
3018G1j34J81J4j69L6lJ97j48Q7j48O6j71L35j68J14K03m34N04l89O9J9K95m38
3041a1j4K81k59J11r9J65k68N63n39L17k25j66R4o0J19l00M55l93P7j36K17N6
3063a5o0L5k29J00r3L92N2k42L9j30J8j27j15N0L09o2J8j26K78j86K1Q6Q3J54
3087B50k55J26j20n4J35l62N1K03J95q1j05K54l55J73Q9J33k11K06J47l68N7j11
$$ plain form
2928 -48 -266 34 -331 -118 -274 108 112 -359 69 -134 260 -49 87 -43 -116 14 -131 58 -68 122 209 156
2950 156 36 438 279 39 441 -134 357 208 247 172 377 214 54 297 93 143 -48 278 -104 55 228
2971 228 38 214 130 144 -191 -1 143 -340 -78 -116 124 -341 -30 -7 173 -195 -188 -196 -191 -308 -423 130 -231
2994 -231 36 -244 -38 -31 -105 156 -283 75 -278 -163 -160 -134 -115 -105 296 20 4 132 -116 -147 -245 30 -70 71
3018 71 -63 118 132 -37 -1 -4 193 45 132 -16 50 -121 214 46 160 363 -71 433 44 113 132 427 -11
3041 -11 -25 256 -3 108 9 174 -94 469 -70 247 22 -144 -50 -110 9 -291 164 -229 -152 -288 -71 -15
3063 -15 -75 -40 -269 -169 -262 130 182 -60 -21 -151 -133 -260 -375 -325 -16 -78 -60 -186 92 -94 -73 13 96 250
3087 250 -5 121 1 -53 82 -280 -229 -26 169 88 -17 237 -118 55 144 277 66 272 419 51 108 -3
3109cK61l36J65J47q9j26L43k75k32M56k52J12j80J9L36k51J88n54L89l79N11
3130B50m15j7L44o1m4j76J68j70p2l9K2J80M4o2j28O5j9J18m6J19k92m7K86j51
3154a43L31m01L3O1P7pO8q6O8K56l44L43l28K36K1l82M64j04R7m92K37M9K0N6
3178A30n3Q3L3Mj55J09r2J28K9l22N61l80Q0j00K45k12J89k37r0J20r7L18l91
3201a00J42l0j24o8K52k15lL14k99Q9j86L13j46r1M01n80L84l31L56l58J8K41
3223b1J58k71r5K62k29L52l48R5k39J47np7M17m37K75j36M13m12J86Lj01m0K0
3246h3L12j04K24r9m49K38K3L1J47K9j33Mq0L5M42n06L2L3K1P7J8m3J16k24j33
3271g2M37n12J70l7KK09l63K75J3R5l16M2k0k0p6J02k52M70j29j60m3n2L6P3R9
$$ plain form
3109 -3 258 -78 87 234 145 19 362 87 -145 311 59 171 -9 10 346 95 283 -271 118 -261 250
3130 250 -165 -182 162 101 57 -119 49 -121 -193 -232 -210 -30 14 -48 -176 -111 -130 -12 -58 61 -231 -278 8 -143
3154 -143 188 -213 -180 -119 -42 -49 19 -67 1 257 -87 256 -72 164 185 -197 267 163 260 -232 5 54 74 130
3178 130 77 160 193 197 42 151 59 187 216 -106 455 75 155 55 300 88 277 40 -50 70 -27 291 -100
3201 -100 42 12 -112 -180 72 -143 -146 168 -131 -42 -228 85 -61 -152 249 -331 53 -278 78 -280 -262 -21
3223 -21 137 -134 -229 33 -196 156 -192 -97 -336 -189 -194 -271 146 -291 -16 -152 261 -151 35 38 -63 -103 -83
3246 -83 229 125 349 250 -199 39 62 93 240 269 136 140 60 95 537 31 63 96 117 194 212 169 285 61 -72
3271 -72 365 -147 23 -14 -12 197 -166 109 122 217 -99 -57 -77 -97 -173 -71 -323 147 18 -142 -185 -237 -201 -128 -29
3296b9Q0m17L90n2p7m8N4j58J99M4k63M60k21L04k93J90l32M01k25k6K04l31M18
3319B72m36M52j6l22J34k4P9K8K40l80R4k76K09O6K43l8j47n3o0P5m2k6pJ70r9
3344A36l28L64j97K79r7J58K0k41k7j26N21n76K03j48K3L8j00J03N9k17J94K34
3366B75m04p6K98L0j8m81N22o46M70k91L05p4K9k20J43J59l03K97L8K14l30J9
3388d4m6j51J82l3J8J19j00n7J31J95l27K31j74J88R4j85J15J7j4k9j08JK32j57
3412I8m1M9j75K32j11m1J2l9j37K30M8k07K36k51P4k47L72j61r1j8L98k71j90
3435b31M73j24k09P0p2q2O8M4k47L35N4k31J50r2J73k60L9k3L8J9J68J22m70K10
3459g8o3j89L49K8j99J30Q0j23L67k90j91J20K99k01l9n1J70J24l73K75J47k23
$$ plain form
3296 -29 51 -366 24 -28 -105 -153 -99 -257 -58 -14 -277 183 -38 266 -27 163 -169 232 7 -19 185 -146 272
3319 272 -164 288 272 -50 84 60 139 167 407 27 121 -155 54 120 363 325 178 125 65 140 98 72 65 235 136
3344 136 -192 172 -25 254 157 315 335 94 67 -59 462 -114 89 -59 -36 2 -98 5 64 -153 41 275
3366 275 -129 -205 93 123 105 -376 146 -500 -30 -321 -16 -90 -61 -281 -138 21 -282 15 53 267 -63 -44
3388 -44 -90 -241 -59 -92 -74 45 -55 -112 19 214 -113 118 -56 132 226 41 156 173 159 130 22 23 255 98
3412 98 57 106 -69 163 52 11 23 -16 -153 77 125 -82 154 -97 -23 -270 102 -59 -150 -168 230 -41 -231
3435 -231 242 118 -91 -21 -93 -175 -107 -63 -310 25 79 -152 -2 -94 79 -181 -142 -165 -127 -108 60 182 -288 -78
3459 -78 -141 -330 19 47 -152 -22 58 -65 302 12 -179 -59 240 39 0 -51 119 243 -130 145 292 69
3481F9j34K09j68M2kj43J50J28K71k92J45j93Q8k97Q2o5K4m2M6L7p1M19k75k30
3505b02K67j43J55k10O6k17M33q7r5J25l24N49k07n8k22K6j27L29k59kJ86J10
3527I3j02j85J68n8J66K5p7O7q8L4l61K39j9K0J87k64L92k49K26k07o9Q7O1l2
3551E4L4k3O7M8rj00k4K15j83l3q0l5K82k04J84j97J08J17k86K02m3j27j08K13
3575G2q0K06j70j36J33j31K39N1l06p2L01j26j26P5j65J40q6j4K64j32j42J9j6
3598b02O5%l24M60k87L66J9n0Mp8k66K57J7q8N0k01J94J20j32n6m2L77j09J71
3622B65m36K78J4k91K38p4K26l71K72l5l8L6jK3oJ71j07k10K3q5K20P8q9m22M55
3647A34k75M91m33K61j32k37J34j04M10j94k0j10j05K05q8J9K4Q3K5j61R0j04
$$ plain form
3481 69 -65 144 -24 18 16 -127 23 151 422 130 275 82 170 -127 -45 -110 -86 -128 -82 -45 -116 303 28 -202
3505 -202 65 -78 77 -133 -67 -284 149 62 -33 92 -232 317 110 52 -170 -144 -271 58 -201 -203 -17 93
3527 93 -9 -194 -26 -84 82 107 30 97 9 43 -318 -79 -98 -78 109 -155 237 -12 214 7 -62 25 86 54
3551 54 88 65 132 180 171 71 47 262 79 46 -34 -69 213 9 193 -4 104 221 -65 137 94 -33 -141 72
3575 72 -8 198 28 -108 25 -106 133 184 -122 -194 107 -19 -145 -70 -235 -95 -181 -195 69 -63 -205 -186 -202
3598 -202 -137 -137 -461 -1 -288 78 97 47 51 -27 -293 -36 -19 -107 -57 -258 -64 56 -76 -132 -174 203 94 265
3622 265 -171 107 121 -170 68 -6 220 -151 121 86 48 84 83 106 100 271 164 -46 -23 -108 112 190 101 -321 134
3647 134 -141 350 -83 178 46 -191 -57 -161 249 55 35 -75 -180 25 -63 -44 -20 63 88 -73 17 -87
3669h7k1k07L85k52j33Q0K50L7r4P6L0K54m55r3K06l7L9j43K87j10Q6j43kK60
3693B13m10K01J58k55Q6R2j64L17m99K70R1L2j33L5J68l31L71l41q1Q5j2K17j49
3716c9J25k15K34j90j05K96k32J67p0J94l8mj86JJ04j80K31j87J85K0j1k74J38
3739c6Q4q5L7j54J12j25R4M8l03J50K95k73j43K04k0P2j14J90j65O1J02k14J24
3762e9rL47k09J03l30L69j55j8m0M1K18l70J85j24m1Kn8J85P1qj97K61q9j75L08
3787B08q2j97M9j0K10j56j91M13j92j78J28M4m0P6r0l5K19k5k70Q0R5p8j92L09
3811I5j60m9L5pk0J46J71m54LJ10J31p0L3j21N8J42j3k10m1K05k0p1J92l92M06
3836I9j13J5n3J43jj55K4j49J58j08J82j58J13K1jj09j00N62l25J00P9rj42k2
$$ plain form
3669 -87 -108 -315 70 -182 -315 -235 15 52 -42 34 64 318 -137 -230 -24 -61 -22 -165 122 12 98 -45 -47 213
3693 213 -197 4 162 -93 -7 85 -79 238 -261 9 100 132 -1 34 202 -129 242 -99 -180 -95 -107 110 -39
3716 -39 86 -129 105 -85 -190 106 -126 41 -29 165 127 123 -63 -62 42 -138 93 -94 91 111 100 -174 -36
3739 -36 48 -37 0 -154 -42 -167 -73 -25 -328 -178 117 -156 -299 -95 -115 -43 -157 33 -132 -71 31 -183 -59
3762 -59 -68 279 70 173 -157 212 57 39 -1 40 258 -112 73 -51 -92 -90 -148 37 108 100 -97 164 75 -100 208
3787 208 126 -71 -22 -32 178 22 -169 244 52 -126 2 46 6 82 -8 -43 176 151 -119 -39 56 -22 -214 95
3811 95 -65 -114 -79 -86 -106 40 211 -243 -240 -130 1 -69 -36 -157 -99 43 30 -180 -221 -16 -36 -107 85 -307 99
3836 99 -14 1 -52 91 90 -65 -41 -190 -32 -140 42 -116 -3 18 17 -92 -192 370 45 145 224 215 73 51
3860E1M4k51L13j67R3RK35k78k3J18k36J31j39L58K7j68k78J94j20k57J12Q8J5
3883a29P7J01J6K8j94P9J72j65k0j75J92J17j23O0j46o2r1J98j26Q9j09J46j33
3906a98j78M26j37J00R0o6k49K82j61MJ60j38L21l14K79%O0n6j70M6j81K53j24
3929D9J09j35j44L05j08j37J34Pj90M38n83J15L91j88Kj11J90k09J40l0o0J33
3951A18j82J64j70m6j21K20Q2j98J89j63K32j28K03l54J04K9k23L4J29K48j81
3972a4j98k21M13j35q6J27q9K03k10K94k32J10k0p0R0j19R4N4P6n4k0j82L53j21
3996D3j06K09j75J79j89J56q6K9J44k41J39M3p5L1O9j89K08%p2M0k60K28o4k28
4020a67K32k19l7J99o9q3J35K5O9P9n86M59j72L15k21J24m42M65j58m1k0l07M86
$$ plain form
3860 51 95 -156 157 -10 83 92 327 49 26 144 -92 39 -100 258 285 117 -161 33 -87 -344 -232 -144 -129
3883 -129 -52 49 65 93 -101 -22 150 -15 -35 -210 -18 99 -24 36 -110 -172 -263 -65 -191 -102 -211 -65 -198
3906 -198 -376 50 -87 13 103 37 -212 70 -91 -87 73 -65 256 -58 221 221 281 225 55 101 -80 173 49
3929 49 158 23 -121 184 76 -61 73 80 -110 328 -255 -140 251 63 65 -46 144 -65 75 45 -15 118
3951 118 -64 100 -70 -116 -237 -17 65 -133 56 -107 125 -3 200 -154 -50 -21 -244 -210 -81 167 -14
3972 -14 -212 -433 -20 -155 -241 -114 -203 0 -210 84 -148 -38 -58 -128 -38 -157 -63 -9 67 13 -7 -189 164 43
3996 43 -63 146 -29 150 -39 117 31 60 204 -37 102 145 70 101 170 -19 189 189 117 157 -103 125 61 -167
4020 -167 65 -154 -191 8 -61 -144 -9 16 85 164 -422 37 -135 180 -41 83 -359 106 -52 -93 -113 -420 66
4043F6k20pK58r0Ln2m8j60L96k72K99l36R3q3M7j23K36J33j82j60o0L31j19l2
4067h2O7j59k1K7N08k70q5OJ95j54j91J52j37M03j60K6p0J31q3j36J04Jp2P3r0
4092a7n6J26j4n5L01l64J53k67L45k91K35r4J29Kk57J15l0l24L12M5J18l17K39
4115C4L2J4q3j13m0J50J10n7p5J44j64k3l8n0L43l2j14q0m1m1M2J21k94K09K67
4140B21m10L93j89K27k93m6l8L44k21n2J88l7Mq7J92j81L07m5k24K32l77J44k8
4163B4K39j94M5J01j25R2j23P0l27J17%J69j14o0K3k8J22q9J09pL5j46kJ28j71
4188a12L25k94j79j2K62J2j0l1j40K54m68K12K80j12O4k60L59m01K72l3L2k5n2
4211e7j81K39R4l71L20L3K9q4j51K97k76r3J80R9j15o1K42J3k02P2r8j23K06k4
$$ plain form
4043 66 -154 -161 97 7 10 -42 -90 -250 146 -126 173 -163 -70 -153 -106 -229 7 140 -42 -202 -262 69 -50 -82
4067 -82 -15 -174 -195 -168 340 70 -15 -9 186 32 -159 -7 -144 259 99 125 55 186 103 -33 71 72 0 73 -17
4092 -17 -73 53 39 -16 285 -79 74 -193 152 -139 96 2 131 133 -124 -9 -39 -363 -51 -6 112 -205 34
4115 34 66 80 -3 -116 -156 -6 104 47 -28 116 -48 -71 -109 -159 184 152 38 -42 -83 -124 -82 39 -255 -46 221
4140 221 -189 204 15 242 -51 -97 -135 209 -12 -64 124 87 91 4 196 15 322 277 53 285 -92 52 24
4163 24 263 69 114 215 90 182 59 129 -198 -81 -81 88 -26 -86 -63 -91 31 -58 51 44 79 -67 -69 59 -112
4188 -112 213 -81 -260 -272 -10 2 -8 -39 -179 75 -393 -181 99 -13 51 -209 150 -251 21 -12 20 -5 -57
4211 -57 -238 1 95 -276 44 77 106 22 -129 168 -108 -201 -21 78 -37 -98 144 157 -45 27 -71 -194 12 -12
4235a2J68k5O8l8l11K9J67L8j58J94K4j6r7j77J65k86L13k68M32k65j25J21J5
4258d4J74o3O8k59J65l15J26K2j9M5N1K00j73qm4O1r5Q3Q8j47J44l06M19q5oj56
4284g4m7P5K9J47j73R5l10K87J14j60j26K44j53j65J85K28k3k43L17n18O0K73
4306F2j3r7J0J16PJ19k78J69q7l6q7K58k09J05k73J03j0K69j78k3J3Lj66K13K18
4331B08k77J32k61L42k98J01J56k63L33j05m6r3lq9p8K12p3m5J6J65j59K08l68
4354b85L70q0n0oj07n7J8P3o8J76P0j45L08k2Q4j82J04k27K47j49k32J93J32n4
4378A11ll11J81J02O2k3j19P0n6O5j87K12J7j75J27k13J13J12j52L8L6j20K34
4401A21j32j50K87J49k65J78k70nq3P3k4J71J21k32J37j45j12J13pq2K93k49K11
$$ plain form
4235 -12 156 131 199 161 -150 -121 46 84 -74 120 144 128 31 -146 19 -267 46 -222 210 -55 -180 -59 -44
4258 -44 130 67 135 -124 41 -274 -148 -126 -145 -100 -49 151 -22 -30 -74 -13 -108 -25 63 -84 60 -246 173 88 82 -74
4284 -74 -121 -46 -17 130 -43 52 -258 29 143 -17 -143 101 -52 -217 -32 196 173 -70 247 -271 -211 62
4306 62 49 -48 -38 78 85 204 -74 95 8 -28 -115 143 -66 39 -234 -131 -141 128 -50 -73 -60 -57 -223 -10 208
4331 208 -69 63 -198 144 -154 -53 103 -160 173 68 22 -71 -74 -163 -241 -29 -102 -147 -131 34 -125 83 -285
4354 -285 85 5 -45 -51 -158 -215 -197 -124 -192 -16 54 -91 217 195 279 97 201 -26 221 72 -160 33 165 111
4378 111 108 -203 -22 80 142 119 0 70 14 79 -108 104 121 -54 73 -140 -27 85 -67 -29 7 -113 121
4401 121 -11 -161 126 275 10 188 -82 -87 -170 -97 -121 50 171 -61 76 -69 -181 -68 -75 -157 136 -113 98
4424I8l8L0l31O6K24M6Krj17K02l64K08q7p7K42rJ44k80L00l32R2j75L49j50j99
4449a65J4K8J85j04K58l05J20l7M4J20k21jK98j83k6K9L2k07L11k77K18k41Q3
4472b7Q7J08j85k7K83k91J04O2j01j13K24r9K5j16M6K8M0O7k19K0J43l5J12k74
4496a38Q5K4J14k51J09p1K13k67J72J67j55J81j34k6j81J02Q3r8K0J08k19K38
4518G6R0k47nK90l17P8O1R2O8j59o0L35k09qj80K94j04k05K44k93L21n4j76J35
4542F7O4J02m63K97n0J45p3j0j62j43L19j01j49M33q5j27q2J86p8j30K43j91j50
4565a38K64k5k30K31r8K36m67K16k20R7Q5j89L39k48K58j15Q9n5q9J99k8k08M
4588i2K39k30J28P0J25n27K42J00k27L11j46J77l85M10k81n1L32k36m1K48l64
$$ plain form
4424 98 60 90 -241 -175 49 95 97 88 -29 173 -191 17 -70 -147 95 86 230 -50 250 -82 10 -165 184 34 -165
4449 -165 -151 -123 62 -42 216 -89 31 -6 38 158 -63 -64 234 51 25 54 86 -121 190 -87 131 -110 -27
4472 -27 60 168 -17 -44 239 -52 52 114 13 -100 124 25 50 -66 -20 8 48 115 -104 -84 59 24 136 -138
4496 -138 -53 -29 85 -166 -57 -128 85 -182 -10 157 2 183 49 23 -158 -56 27 -71 -51 57 -162 76
4518 76 166 -81 -86 204 -113 -35 26 118 186 27 -33 302 93 85 -95 199 95 -110 134 -159 162 108 -68 67
4542 67 131 233 -230 67 17 162 89 79 -83 -226 93 -8 -157 276 191 64 -18 168 90 -40 203 12 -138
4565 -138 126 101 -129 102 4 240 -227 -11 -231 -134 -49 -238 101 -147 111 -4 85 30 -59 140 112 -96 -92
4588 -92 147 -83 45 115 240 -287 -45 55 -172 139 -7 170 -215 195 -86 -137 195 -41 -82 166 -198
4609a98J17J14M4k27P8K3q5L37l6l04L05n0j01K28m26L36l89M09l90K32k19K80
4631G8J04l4j32o0J0jj48j06K00K24o2l23P1L75l41o3J32O5N1Qp9J12j84L4k2
4656i1J32k7j50K29j29j05J32k36L43R4k48K7L8J20l18j09K52J36k88K59K2n1
4678C2k57J83J34j78l6K48l7j52J23R1l64N1L40P4J3k12Nj68K18j10K30j40m01
4701c13K56k14N02j39j75j38O4J54J51m51L17K87m04J28j19L72n87K88o3M8o8
4722a04R8M5r7R2l69P9K55J21l84J59J18P2k68K18j25q4L9J67m0L6j37K11k11
4745a09P2J02jnk3r4J53o8p3J80M6k1K15k94k3M6j24q3K16k91n9L99O1k36K9P4
4771H9m2l90K16K00KJ18J1o3k63K8J25p3K0Ll3m3j0J0J5J83l55J25L2j89N16j60
$$ plain form
4609 -198 -81 33 77 -150 -72 -49 -134 203 167 -137 168 118 17 245 -181 155 -234 175 -215 17 -202 78
4631 78 182 148 16 -44 -34 -35 -183 -289 -89 135 73 -250 -179 196 -145 -208 -76 -11 40 48 -31 81 -103 -69 -91
4656 -91 41 14 -136 93 -36 -141 -9 -245 98 192 -56 -29 9 129 -189 -298 -46 90 -198 61 83 32
4678 32 -225 -42 92 -86 -122 126 89 -63 60 151 -213 -162 178 252 265 53 58 -110 108 -2 228 88 -313
4701 -313 -57 -271 231 92 -83 -221 -157 -3 148 -303 14 301 -103 25 -94 278 -309 -21 -84 -36 -104
4722 -104 -6 39 -58 34 -335 -256 -1 120 -264 -105 13 85 -183 35 -90 -174 -135 32 -8 28 -109 102 -109
4745 -109 -37 65 64 59 36 -58 95 27 -46 134 180 159 374 80 57 103 -21 -104 112 -179 -238 161 222 -14 15 89
4771 89 47 -343 -127 73 75 193 204 141 -122 -94 31 -42 -22 -19 -52 -95 -105 -95 -80 103 -252 -127 -95 -284 232 72
4797G2j98j44K19j32O9J15n9J47k05Q0J76j56J4n9J59j97J6j48K16j96J39O5J74
4820A67p1JJ16j56k33K44R9j60K57l7k44P9j66L07P4l39L69l25J21k03M26k33
4842I3q7l9R6L7k94K24j27K53l27K37k04K94k51J94k9r6J40l5m1j88K34j5j72
4865a03J81J76k93k22K03m0J77k12j64K21Q3J22k76J25j14L4l2J92O1j11k46K87
4887D9j50J8K12k8qo0L0K45m90N10l76O6k03k6L04l20K19J49k57J46P3l45L97
4910A55j07K10j37n1M8k6j45j90K84j80J47P5k29L50o2r1k69J12Q6p7qN5J20k8
4934D2J31j30q5nK8M0o4J18k27K42k24J85K0M8k62J23L26m44Q1N6j1q0J83o5n1
4959b5J46j03K01j76j52P9J3K04M1k78J71l5l87K73m2qJ98p0j05r9M87m92J69
$$ plain form
4797 72 -126 -270 -51 -183 -114 1 -58 89 -116 -36 140 -16 -2 -61 98 -99 -83 -231 -15 -211 -72 -7 167
4820 167 96 97 213 57 -176 68 167 7 264 227 -17 62 -104 203 277 -62 307 -18 103 -100 326 93
4842 93 6 -33 63 100 -194 30 -97 156 -171 66 -138 156 -95 99 70 -26 114 79 38 -150 84 69 -103
4865 -103 78 254 -39 -261 -58 -98 79 -133 -297 -76 7 129 -147 -22 -136 -102 -134 58 119 8 -238 49
4887 49 -101 -83 129 101 93 33 63 308 -182 328 -48 18 -185 -211 93 -227 -8 141 -116 30 103 -242 155
4910 155 48 258 121 70 118 92 -53 -243 41 -139 8 83 -146 204 142 51 -218 -106 -20 -97 -105 -50 70 42
4934 42 173 43 -42 -47 -19 21 -43 75 -152 90 -134 51 71 119 -143 -20 306 -138 -57 -1 -12 -92 91 26 -25
4959 -25 121 18 219 43 -109 -30 -17 187 228 -50 121 86 -301 -28 -70 -78 120 50 -55 -154 333 -159 10
4982A0L9J69k84J79k40L64j3l36K12r1K21k54j9J58n3J34m77K00J01m1j7pR9M8
5006A02J86n41L48m7r6k0O8J65k71O9p7J17k8K9n0j9J4J30Rn3l12K29J93j93n7
5031a05J89%k35M9J04k52J76n1L2K44m68M47J52r4l15J8J1K00q9n6K02j03j57
5054a01K25j60J64o9L2k51K33K2j3j05J36j07K76j52k04J60o9m8N5r5M9l8K23
5077A63k67L06m75K76J58j57J41m48J07L98m55K21Q2k52L18o5k13J62%%j33P8
5099e5k9K51M7l54j0Q4J09lK8m07K94J02q4j01J69K6j4j1k42K75r3J51j55K18
5123A96k38K16l2l26J58J93J43l59K44K5j73K42k75j36K66J41j78j94K37j73j15
5144a38M82k33j48J02K21J6k77q0j8k8L70l33l6L32l70J04q5J64j67J56k2O2q
$$ plain form
4982 10 49 218 -66 113 -127 237 224 -112 100 9 230 -24 -43 115 62 196 -281 -81 20 -21 -38 -45 54 102
5006 102 288 -253 95 48 -48 -68 0 165 -106 -37 -114 3 -25 4 -46 -65 -51 79 88 35 -277 -48 145 -48 -105
5031 -105 84 84 -151 -102 2 -250 -74 -125 -93 151 -317 130 282 188 -127 -109 -98 102 13 -43 159 56 -101
5054 -101 124 -36 128 59 91 -160 73 95 82 -23 113 6 282 130 -74 86 17 -31 24 -71 -22 -60 163
5077 163 -104 202 -273 3 161 4 145 -303 -196 202 -253 -32 50 -202 116 51 -162 0 0 0 -133 -55
5099 -55 -84 167 214 -140 -150 -66 43 40 68 -339 -45 57 -27 -128 41 67 53 42 -200 75 -18 133 -22 196
5123 196 -42 174 142 -184 -26 167 310 -49 195 220 47 289 14 -122 144 285 107 -87 150 -23 -138
5144 -138 344 111 -37 65 286 302 25 -55 -73 -101 269 -64 -100 232 -138 -34 -119 45 -122 34 12 74 66
5167F6k52K31m22K09J9P8rp5L39k31kJ52j04k1J9m2j20J31j2N9n6r9J5K66k35
5192i6K86M2j65r5J8nJ37j32M4l6L22j25k47K79j79l7o1j60K79q9J06q9Qp1K17
5217A51j25n3m6K69r8K05l40j16J57j83L57k63K9r4P1o7K18j9j17M6J14l89J80
5240a13K04j46q9L7J41J07r4J02k96LJ54O2j59M9q8n6J52M4j07r0J83j9rM1n6
5265d3J17j56J05O4k7L63m70n1M8J0J93Nn52K49Q0J4K3J7L3q0j47K43M3J21m1
5290A61O3m54K63p4R3k20K61J05o1j09mN9q5N5k01K58k12J3m8K7R7l9j58L28j66
5315d8J02J34j73k1R2Q3Ml98J4M36j10l63J77J40q7K26m00K36j06j06J08j66K37
5338A1K6l5p0O8N2n4j7P4O0k55J17j59J78r1J76K7l21J10J64j13J56j85n6L10
$$ plain form
5167 66 -186 45 -377 -168 -149 -71 -80 -155 184 -47 -49 103 -1 -22 -3 -45 -165 -34 -46 13 -43 -142 -127 139 -96
5192 -96 190 232 67 -28 -10 -15 122 -10 34 -2 320 195 -52 227 48 11 -50 -210 69 -20 86 -3 5 -66 151
5217 151 26 -27 -73 196 98 303 -37 -153 4 -179 178 -85 -56 -150 -79 -146 72 53 -64 -18 96 -293 -113
5240 -113 91 -55 -144 -107 34 141 47 149 -147 -144 10 72 -87 -38 -126 -182 -30 14 -93 -183 0 -19 -28 13 -43
5265 -43 74 -82 23 87 60 423 -47 -98 -50 -40 153 158 -394 -145 -65 -51 -28 -11 22 -58 -205 38 81 202 161
5290 161 224 -230 33 -41 52 -168 93 198 137 28 24 83 -2 53 -148 110 -102 -89 -137 -110 -13 -52 -210 118 -48
5315 -48 54 188 15 -6 86 169 173 -225 -211 225 115 -248 -71 69 -18 208 -192 44 -62 -168 -60 -226 11
5338 11 37 2 -68 0 52 -2 -19 55 115 -140 -23 -182 -4 -95 81 108 -213 -103 61 -52 104 -81 -137 173
5362A73j86M8l7k98J84J45M1J09k96K15k77K48j14n3n6J11l2M8p0K92k34O1j52
5385a30QK09L3j73J66K6k31J60lp1K15k99K37m2q2r1J2J29k56L13k72r1K21j28
5409a40Q9J41j32r7K08n9R2k36K80k43K36j07N4l29J88K3kr4L9K19k10R5L3n1
5433cK13m43J84R7n7j5l1K9o0K51j5j11lk29J96N6k9j81J84n0n9J23j70q8L54
5458A43J07l30J85r2N0j34K1n9M19k57n4M6N4j51J07j36LO2j37J36n5R1m8n0m0
5483a19J47q8J43j94j7K47k26q5K23k5N1Q5k81J19M1j5k3J2j3q4O9k76K43K42
5507A76Lk72K52j3j83L5j7N2k0K81l24p4J23J08j65O4p3nJ82j67J52o2j2J20k66
5532a05Q0J7j88J98q3N0J30j51k2j74K30R6p6O8n5M9j56J62j32o9J16J08l0j01
$$ plain form
5362 173 -13 35 -2 -300 -116 29 70 179 -117 98 -179 69 -45 -98 -154 -43 -75 -27 -97 195 -39 22 -130
5385 -130 -122 87 120 -53 113 139 -92 68 65 -6 209 -90 147 105 23 -68 -56 73 -183 130 -142 -233 -12 -140
5409 -140 -51 90 -42 -139 69 10 102 -134 146 -97 139 32 86 -243 -55 -32 -34 -128 -89 130 -80 15 48 -3
5433 -3 210 -233 -49 48 -9 -24 -55 -26 -86 165 150 39 36 -193 3 59 30 -151 33 -17 -76 47 -123 -211 143
5458 143 250 -80 105 13 63 -71 -50 -109 310 53 -1 45 99 -52 55 -81 -78 -16 -153 -17 -72 19 -29 -79 -119
5483 -119 28 -60 83 -111 -128 119 -107 -192 31 6 57 142 -139 -20 21 6 -17 -5 -18 -102 -33 -309 -66 176
5507 176 179 -93 159 146 -37 -2 -19 33 13 294 -30 -104 19 127 -38 26 -47 -52 130 -37 115 53 41 161 -105
5532 -105 -25 -8 -196 2 -81 -31 99 -52 -74 -248 -18 78 2 70 15 64 -92 70 -62 -131 -15 93 63 -38
5556c8j2K18n14M65p4p6J18j01l4J75j92j65M00l92L99k89J19j39J97l22J21J55
5578A9q5J11j17P9k6k3P1J1n9J54j85R9Lj37K15o2q1J47k49K72k26J62j35Q2L6
5603G6j42N5nm6L02m01J18k1L8jK01j56j58K1m8K69j21J1N7J43l09J06J08nk09
5628a17r3PJ88l9qj46L7L15L5N4j10nJ73l42O4mr4Qk1K15n0j80R3J05k27L6L1
5655g5J30M1k28J89j43J81n1m1k1r8Q3J46j24OJ94J03m44M73l65P2k53J57p4J37
5679eO1p3j48K60j91K16o0qk19L01j22Q0k49J98rj98K96k38k0J93k42J58K63k59
5703a5J01j37k5q8R2K20k01N7j82J57J43j68J2OJ33J51j14m0k35K48j16j11M7
5726f5J17J0k2k43R0%J16j70J09L87m39L10k20q9K85k45k2K48k68jJ84j13J89
$$ plain form
5556 -38 -50 168 -346 119 45 -31 87 -14 -48 127 -65 -230 170 -222 177 -112 7 -132 65 -257 -136 19
5578 19 -66 45 -72 7 -19 -42 29 40 -19 135 -50 49 52 -85 130 68 -13 134 -115 157 -69 93 -42 40 76
5603 76 -66 -11 -16 -62 240 -161 -43 -64 -26 -27 174 18 -140 -119 -167 102 -19 -8 49 192 -117 -11 97 92 -117
5628 -117 -210 -203 -15 -54 -62 -208 -171 144 179 233 123 118 291 -51 13 9 -85 -77 -98 117 67 -113 -20 85 -142 -106 -75
5655 -75 55 96 -132 57 -86 95 44 3 -18 -116 -33 113 -11 -5 189 292 -152 321 -44 28 -225 -68 -142 -5
5679 -5 56 -17 -165 95 -96 120 60 52 -167 134 12 92 -157 41 32 -166 130 -108 -128 65 -177 -19 244 -15
5703 -15 86 -51 -76 -164 -72 148 -53 4 -178 -21 122 -46 -34 -28 105 256 142 102 -133 115 -1 -112 -65
5726 -65 52 62 40 -203 -113 -113 3 -167 -58 329 -110 200 -20 -109 176 -69 -91 157 -111 -112 72 -41 148
5749A48l21K45j47j12K08j19M4P9%j34J72j07k81L90k44K34k4j59P4P8p1m7l9
5772a33L34J0r5m1j33r8K02j68J43R0j74RoJ23p0p9K8O1J81k04M4Q0qk15r0J57
5798e2J06K23l70nM7K05j97Q6k7q3o5M8K83p9K8j74L6j04K73n38M84o9k51J53
5822d2k60O99l66l9k06J65j25M93k72P7m22K78J40R3k00k09J87j8l6l3j26K63
5844D1p1m5p9K15pj35p0K88l95J06J15nq0l3J94J25j23m11J81K63nqK8J4j79L3
5870d3K58l09j05L83n9j61J05m11K17o8LL60j26j20K57m3j46r8j5J37P5R3l5k95
5894a46J83oj22PL1j04KJ77L4j86J83j52J76n3K5l2o5J71M9k27n7J91r8n7J64
5919H8j67k65N24n9l3k7K0q6R1N7l23L41k77R9O0j17m6j9O6J10J31k54k8J14L57
$$ plain form
5749 148 -173 72 -75 -187 21 -98 -54 25 25 -109 63 -44 -325 65 -179 55 31 -128 -54 24 -47 -94 -133
5772 -133 201 211 116 75 -58 -156 46 -122 21 111 -63 -54 -60 63 -7 -86 -58 3 184 -20 24 104 96 -119 -209 -52
5798 -52 54 277 -93 -98 -51 154 -43 43 16 -67 -132 -84 199 120 148 -26 10 -94 179 -359 125 56 -195 -42
5822 -42 -302 397 31 -8 -214 -49 -174 319 47 124 -298 -20 120 213 13 -196 -9 -27 -63 -96 -222 41
5844 41 -30 -75 -154 61 54 -81 -151 137 -258 -152 -37 -42 -122 -155 39 164 41 -370 -189 74 69 61 89 103 -76 -43
5870 -43 215 -94 -199 184 125 -36 69 -342 -125 -193 -190 170 44 -76 181 138 -8 -106 -121 16 91 184 149 -146
5894 -146 37 31 -91 -84 -53 -157 -155 22 56 -130 53 -99 77 24 49 17 -48 123 172 -55 -112 79 -19 -76 88
5919 88 -79 -344 180 121 88 61 81 -5 86 143 -180 161 -116 -17 43 -74 -120 -139 -73 37 168 -86 -114 0 357
5944C57l76j9K05j28j21J61k42J67o1J84J2l43J35J55j60J04j60J72j13mM2J00
5966F7Pk76K42j15L69j44k1j83K18l4j81J05q6J63o0n4j32J44N5k39K24j35P8
5989A2j11L5M0J30q3j00J10N7k39K40j5J35k59p3K19r7J44j83J40J86l77j1N7
6012d3r1J79k97L08k73K00J08k76K74r9O1K4k1J3J53k68rr0J60oP4Pm5j38m5K66
6038A26J4j19j03N8n7K32l14L58k36RJ76Q3j97l1K57k63L6L3p7K43j75j18K94
6061B29j69j11o4M5o8K13j95M54k35j83J56ro4J20nl12J8j68N37j79K03K7n5l99
6085b14M30k64K0k43K32J8j26Q4J80k11PJ66j19N3M8M4k68K54j6k5p9j18J82J84
6109B19m13J37J50o8n7J54K2j98J71j73j12P3N9nN9o1P9J2O9K7j38K42k08J17
$$ plain form
5944 357 -19 -38 167 39 -82 79 -163 4 -57 127 139 -204 -69 86 -74 30 -130 42 -71 -75 -33 67
5966 67 74 -202 40 -75 294 150 129 -54 164 130 -51 54 -32 131 71 17 -115 29 84 -155 69 -66 12
5989 12 -99 -64 -24 106 23 -77 33 90 -149 91 76 211 -48 -121 98 1 145 -38 102 288 -89 -100 -43
6012 -43 -134 45 -252 56 -217 -17 91 -185 89 -10 51 75 54 67 220 -48 -57 -147 13 7 81 88 43 -95 -140 126
6038 126 140 21 -82 -24 -81 151 -163 195 -41 -32 144 227 30 -1 256 -7 29 62 -15 228 53 -65 229
6061 229 60 -51 -115 -70 -138 75 -120 334 99 -84 72 63 -1 119 114 -198 -180 -348 189 10 213 240 185 -214
6085 -214 216 -48 -28 -271 -39 -21 -147 -63 117 -94 -87 79 -40 13 61 105 -163 91 75 50 -29 -147 35 219
6109 219 -194 -57 93 25 -32 122 144 -54 117 -56 -168 -95 -36 -41 18 -43 36 48 117 144 6 248 40 157
6133A57o5j62o3j43M09p9L6P2j85J15J0k1k81J62R2l5j15J72o1K1n0q0K29j01
6157C4j85J61PK09l95K74k3j71qq5J92J40j14K6r9P6PP5p8j55M39n08K25N5P6
6182A75l1j86J79n4m0J14k54R6l9p4k32K32J0k1OQ9r7K49k20n3K81k1j10j12k9
6207a42j60K66k1J77m5n1J13J1o4j61n6O5L1k53J77K60j81j94O9J96l6R9k85K3
6231a62J51k8J3k6J31j67M37o28J88P4J4l6P7j7J24nk84L17J4j0k37N9n1J44j
6256I1Pj83K25k73L54k29K3J00j9o8q3J26k63M80k55j71K63l19J86L7K6k24J17
6279e2j58J06J98k1M5Q0l61K25jl0r5Q3M5l1j06J51k00j88K23J87P4j84J8l2O6
6304D2m5k66K09L00k81l3J40L0l25J19K10k1j33J27p0J0J3K23m15K15lq4K61j44
$$ plain form
6133 157 92 -70 -133 -276 133 54 90 162 -23 92 102 81 -200 -38 54 19 -96 76 15 36 -14 -94 135 34
6157 34 -151 10 17 226 -169 105 82 -89 -97 -182 10 150 36 62 -37 39 46 121 43 -112 327 -181 44 99 175
6182 175 144 -42 137 83 43 157 -97 -1 -40 -114 -346 -114 -104 -125 -119 -30 -127 122 -98 -151 130 109 -1 -113 -142
6207 -142 -302 -36 -57 120 75 24 137 148 84 -77 -133 -68 -37 -290 -113 147 -34 -228 -159 37 1 100 -185 -162
6231 -162 -11 -39 -26 -52 79 -88 349 -279 -91 -17 -3 -39 38 21 145 140 -144 173 187 177 -60 -1 -52 92 91
6256 91 98 -85 140 -133 221 -8 15 115 96 28 -55 71 -192 288 33 -138 125 -194 -8 29 55 -169 -52
6279 -52 -210 -104 94 73 118 198 -163 62 61 31 -64 19 64 33 -73 78 -122 -310 -87 100 174 -10 8 -24 42
6304 42 -3 -269 -60 240 -41 -74 66 96 -229 -110 100 79 -54 73 3 13 26 249 -166 49 46 -38 223 79
6328G9j54O8J26m4l29J32L15m8k14K7n9k08L14O2k52L11j35J02K64k81r6J48m8
6351H0j13M3j19pJ27n5J51k15m9L12j65M4m5R6P0k11j03J28j21J15p2r3K46j21
6375g7J34j09J77k27L3J2N7j14r3L43k06K57l90L2K59Lp9j37o5J47R2R2k12J53
6399H2k75K44Q5J53k00p2j62Q7P1j12J7J69J91l36N8j31J08K7J83p0k11J31kj8
6423A7Q9Ql0RL0K9k76j10K56k63N07k98J53J51l46O3j41K10K1j3j87j42K49j14
6447a28K80j65j48J22j9l5RL09k02j35%kK03k30J14R1j00p0K10j78J98l4J74l06
6471d2L2J58q1l03N22k80j88L99j15l16M53l38P3j38J49q5R8N7K36m05J45L12
6493C43m36J48k58P6N50m55N2N1n5r3J21P0pj45m5jj6J60K25m24L63j93q5o5K61
$$ plain form
6328 79 -75 -7 119 75 -254 -122 193 145 -69 -42 -101 -309 5 67 -185 126 -9 93 357 76 -20 128 80
6351 80 -33 10 -109 -116 11 -44 107 -108 -157 155 -10 34 -11 85 155 -56 -159 -31 -152 -37 -109 -202 44 -77
6375 -77 57 -52 125 -102 -69 -57 0 -114 -207 136 -70 187 -203 -171 88 91 12 -125 -190 -43 49 141 -71 82
6399 82 -193 51 136 289 89 17 -145 -58 13 -99 -82 87 278 -58 0 -131 -23 4 187 117 -94 37 35 17
6423 17 106 114 84 93 123 152 -124 -234 22 -241 266 -32 121 272 -74 -11 -152 58 79 66 -121 -263 -14 -128
6447 -128 152 -13 -161 -39 -58 -93 -84 225 23 -112 -112 -114 89 -141 -27 64 -36 -106 104 -74 124 90 264 -42
6471 -42 -10 148 67 -236 286 6 -182 217 102 -214 239 -99 -26 -164 -15 -100 -2 55 291 -114 31 343
6493 343 -93 55 -203 -127 423 -32 20 71 16 -77 44 114 107 -38 -83 -84 -100 60 285 -139 224 31 -54 -119 142
6518A42J71m57P0J58j63J83r1J43r0j86J88R0r4M2J23m21J52j08n3K03j35J83
6540E0J14L2j91K0m7j41J91k59J49j65J71K95q5o5R1N8J3j10o0j37M9j96R8j01
6564b26M3M27j92M2J17k55K08k43K20j62o1J31J26k27P5Pj27J26o8l5Q6n5J08
6587F5j00J87k13Q2p3N2j10QP8r6J92qk92M87m78K04q8L5J54j58m2R8R3q5J28
6612A20l52K29R5L7J09j44Pj58J09l6OR8j41J75j53J46l03J06J02m7n0K07l53
6635a91o0M50l25J38J23j27k57M04j00O8O5k72j46L0J41Q3M0j21M9J06o9j61J22
6658a0j05K61K2j54j9ok00K01O3J12k42M2n4J57R2k67J11j5j39O7R7l1j69K9K95
6683A38q8j20R2j9J80j46Q8n2j47n4J66RJ6J3k46OL21j67k9k6n4n6L47k26O0l
$$ plain form
6518 142 313 -144 -74 84 -79 104 13 156 66 -120 68 158 64 106 229 -192 -40 -148 -201 2 -133 50
6540 50 164 196 5 25 -22 -163 28 -231 -82 -247 -76 219 134 69 160 218 231 121 61 -76 -27 -223 -125 -226
6564 -226 -183 244 52 94 211 -44 164 -79 141 -21 -82 49 175 -52 23 30 -97 29 -39 -74 12 -43 65
6587 65 -35 152 -61 21 -52 0 -110 -102 -24 -120 72 64 -228 259 -219 -15 -103 -68 86 -72 -114 -16 77 -8 120
6612 120 -232 -3 92 129 238 94 101 -57 52 16 22 120 -21 154 1 147 -156 -50 52 5 -45 162 -191
6635 -191 -251 199 -126 12 135 8 -249 155 55 123 188 -84 -230 -200 -59 24 64 -57 -8 98 29 -132 -10
6658 -10 -115 146 168 14 -5 -11 -211 -10 53 165 -77 -35 -89 68 160 -107 4 -11 -150 -83 14 -17 -186 -157 138
6683 138 50 -70 22 3 183 37 125 73 -74 -128 38 47 63 76 -170 -164 157 -10 -39 -65 -119 -175 172 -54 6 3
6709Cko6M0j01J95j31N5K4m3JJ17j24j84J14j20Q7N5p0Q4J97k41Q6P8N1N7j4m3
6736A05m3j67M7l9J56j12R0j81M1K5P7l5j39L5K40k34L73q2k53j43L15L0j04l5
6760c3O1R7j55l4Q9p0m1J79L4R6k01J26Qk76K34K9J6J24m87J83j22M04j22q8r
6785D2j1J51j16J89j66j9j11J01q5j2K58m7k60q1J09K26m30K82O6o6j52J57p7
6808e2J25l46M25k63J24P4j83J6J45q0J49j70j77J05lM2q1J72J1J13J5k2r0Nk89
6833b35N7J98k7q8K05n5k03l4K53k94L24k85mQJ64q0l0J15P6j93q9mK38M3o0m
6859dJ92j47j22Q2R2j12p7Q0M9k8L00k32l7j12n5L98l38J5K08Oo7Q4k30Q8O4l1
6885F6m8P8k28J36l1M3O5k09K21q3j23qL33mk36K0r5N4M2J6n8R4p2M7n1J53l39
$$ plain form
6709 3 1 -65 -25 -126 69 -62 -7 17 -26 -25 92 -32 -216 -102 -222 -135 -80 -150 -66 131 -110 -24 54 105 162 148 105
6736 105 62 -105 -58 -97 59 -53 37 -144 -103 -78 -1 -36 -175 -140 100 -134 239 157 -96 -239 76 106 2 -33
6760 -33 28 125 -30 -64 25 -45 -86 93 127 223 22 148 156 -120 114 143 159 283 -204 -21 -143 261 139 51 42
6785 42 31 182 66 255 89 70 -41 60 -25 -37 221 174 -86 -167 -58 168 -262 20 86 20 -132 25 -52
6808 -52 73 -273 152 -111 13 87 -96 -80 65 -15 134 -36 -213 -108 -111 -69 -150 22 33 146 161 139 49 54 -235
6833 -235 -178 20 -7 -95 110 55 -148 -182 71 -223 101 -184 -188 -180 -16 -96 -126 -11 65 -128 -217 -221 17 60 0 -4
6859 -4 188 41 -81 1 93 -19 -96 -16 33 5 305 73 36 -76 -131 267 -71 -56 152 158 91 175 -55 33 97 66
6885 66 18 96 -132 4 -27 16 81 -128 93 10 -113 -121 212 208 -28 -8 -103 -49 -7 9 -49 45 -27 20 -31 122 -217
6912b17J85o7J67j23J20lj2Q4L0ol5n6j33J47m87K37L15l26J49K24k32P5R1J12
6936B39j11j93K8O8k03L55k01jj00j6J48j6o9pJ42k71l1L36N2J2j71j51P7K63
6960A79k07NQ8r9KM3k73J39J95l8m1J69k20J8J27l1j96J71K22k79M0j35L53k73
6984d1L9k42K79J15o0P7j85J02n5K0j29K11n0k80M28l71K15j43Q4pm3K49k29O0
7008D4j25p5K68j97L6L9J32l49R4L16k24J26j79J69j56N3k80M30p1j4K70k51r8
7031d2j11k7J12m7Q4P1r6J33k90J17R3o4N1M94m89J37k34P5J86k02K03j20k62
7054b28rK78rjN0j93Rj12L90m43J95o4K44j8j78j8K65l80J92K57j36j17o9M2J2
7079d1J4J42q5p7J08j34J80j54M2l8K58k96m4L27q3K08k02r1j34J96m5k9K6o4
$$ plain form
6912 -217 -32 -99 68 -55 65 62 50 134 164 158 123 67 -66 81 -406 -169 146 -180 -31 193 -39 36 127 239
6936 239 128 -65 -37 31 -172 183 -18 -19 -119 -135 13 -3 -72 -79 63 -208 -239 97 149 161 -10 -161 -84 179
6960 179 -28 -23 65 -34 -32 11 -262 -123 72 34 -7 162 -58 -40 87 56 -140 31 253 -26 14 -121 232 -41
6984 -41 -2 -244 35 150 90 167 -18 84 29 49 -80 131 81 -199 229 -142 73 -70 14 7 -36 213 -16 44
7008 44 -81 -156 112 -85 -49 -10 122 -227 -133 183 -41 85 -94 75 -81 -28 -308 122 51 37 307 56 -42
7031 -42 -153 -180 -68 -115 -31 40 -56 77 -213 -96 -3 -67 -16 478 -11 126 -108 -33 153 -49 154 34 -228
7054 -228 -237 41 32 31 81 -112 -103 -215 175 -268 -73 -137 107 89 -89 -107 158 -222 -30 227 91 -26 -95 -53 -41
7079 -41 -27 115 30 -47 61 -73 107 -47 -5 -43 215 -81 -125 202 119 327 125 34 -100 96 51 22 48 -16
7103a6J71k04J2R0K8j31K2N3l7j32K31J72j81p6k91M29j07j28J75p9J82j57K9
7126E5l1J40k56K11k32np7J14m2L06n5q7k21R9p8L08r9k35K20Q8J9n6o5n2J20
7151H9j31J66j34m0R6J78l60q0K04M6J5q9J35N2j87o6Q0P2j53K29M5l89R0J62
7175C0J29np0K53o52K30M57k61l1r1k20L22l9j14l8p9J66j28P3R7n0N5j03j1N6
7200b4j11Nj22J1K83r8Q6q1o2Q9j32P1O4K06k54p8J01O4O6l30L26m2j33M2j98
7225b51K48k98J05J44P1K37l41LK82kl56J47k6k05K79l49L87k82L10j37K85k82
7247c1P6J1j00R0j51K0R5K78k47n8o9j7L6L09l46M8J71l55J90j41L15k02J47p8
7271ik0J72O4l63K50j61L4k98M79k67R8k0O1k79K43j01J8r4L04m9j65J66j65J77
$$ plain form
7103 -16 155 -49 -37 53 81 -50 -28 25 -12 -144 87 259 78 2 -289 140 33 -95 80 1 183 26 55
7126 55 24 164 -92 119 -113 -118 -195 -81 -123 183 128 41 -180 -81 -159 149 50 -185 35 123 142 86 21 -31 89
7151 89 -42 124 -10 -50 46 224 -136 -216 -12 34 49 -40 95 147 -40 -106 -26 46 -107 122 167 -222 -132 30
7175 30 159 154 84 337 -315 -85 372 111 80 -11 -231 91 52 -62 -100 -179 -13 -141 -68 29 -21 34 -69 -80 -24
7200 -24 -135 -130 -252 -241 42 -56 30 -51 -113 -24 -156 -85 -21 185 -69 -147 -46 18 84 -246 80 38 -95 -53 -251
7225 -251 -3 -301 -196 -52 19 256 -85 -82 200 198 -158 -11 -37 -242 37 -312 75 -207 103 -34 251 -31
7247 -31 45 56 -44 46 -105 -85 10 288 41 -17 -86 -103 -67 242 -104 -56 115 -240 -50 -191 124 -78 69 -9
7271 -9 -29 143 207 -156 94 -67 -33 -331 148 -119 -21 -41 20 -259 -16 -117 -99 -193 111 62 -103 63 -102 75
7295G5p4M1KN7p0K0L7j27k61L36L%j68j7J44K36l94K86R4k57J41j06n1m9L19k61
7321d4k4%J25J59l16K0K5J31k21L4J45j10L5K48J47k81%k10L09l92P6j03L57k09
7345i9PL09k39n7n6L19l86O2J73j02J16k13P6J56j6j05Q3k2k0j81J77M5k4q8m9
7370a34L95j61j9Q9k82J32j60M56l18r5o9N4L73l46J54j2k65K48j7J09j86k6J72
7393I2j84N9j46K11j70o1K25q5J54r1l7j47J21l9k6o1k1l1K76k9j33q2P5J51L0
7418E1j2j9j25J93J62l72k0J68n6O4q4kJ64l6J06j30L6k9k79K62J00l19K61j4
7442G0k12R9J24j6j57J95j51J16N2l31K75J61n3p5l3J78m23Q3O0Q7J20j90l3k28
7466b82J01L31j19j97O3k5M8L5K8K7l3p8j1M12k64o1k27M29j17j53P0j84L04k13
$$ plain form
7295 75 1 42 44 101 31 51 88 -39 -300 36 39 39 -129 -146 -2 234 -160 126 220 -37 104 -2 -53 -102 217 -44
7321 -44 -68 -68 57 216 -100 -80 -55 76 -145 -111 34 -76 -41 207 354 73 73 -137 172 -220 -144 -247 110 -99
7345 -99 -92 217 -22 -79 -135 184 -202 -140 33 -69 47 -166 -90 66 50 -55 28 6 -14 -195 -18 27 3 -85 -134
7370 -134 261 100 81 170 -112 20 -140 316 -2 -97 -166 -112 261 -85 69 57 -208 40 23 132 -54 -80 92
7393 92 -92 -33 -179 32 -138 -199 26 -59 95 4 -33 -180 -59 -98 -124 -185 -206 -237 39 10 -123 -205 -130 21 51
7418 51 39 20 -105 88 250 -122 -142 26 -30 34 -50 -52 112 76 182 52 88 59 -220 42 142 -177 84 70
7442 70 -142 -43 81 65 -92 103 -48 68 120 -211 64 225 172 97 64 242 -181 -98 -38 49 169 -21 -54 -282
7466 -282 -181 150 31 -166 -103 -128 -80 -45 -17 10 -23 -101 -112 300 36 -25 -252 177 60 -93 -23 -207 97 -116
7490a16L30p9j80J26l13J42J24j41P2J13j74J69r1L3m9k39K56j07K62k09L20j97
7512E2q5J74j47N9k01J36k32M63j91j38Q1K02o4n3j0R6M7r5J9K0O7k26qJ84k35
7537h5Q7m7l1J77q0Qj9N7J54j36j55K58k41k5J26m4k0J49k97N6j58K96j9N6j68
7562a01K41rj00p5j34M05k64K41j78K8mL0k22J79pj68K04R3k59mj8mK36l9j70
7587i9J58j52p3L3J53k31J81K5j02L22j34Q7k02j74L25l38J31J82j24M2J18k34
7609a06J42o8K71m41J51K75l15J69j29Q0K27k05q5O2j50j27L96k28j27L11j95
7630i2j00J06L5Q4q4Lp3J89M3j68R5RO5j01N4q3o8l7Q7p6N9l6M3j66P2K15L19
7657C94m32K6k9k37O9K55j76K53l91K33n2J42L0j59K2J73j18J64q7k33J61J26
$$ plain form
7490 -116 214 135 -45 81 -232 -90 34 -107 -35 78 -96 73 -18 15 -34 -273 -17 -124 138 -71 249 52
7512 52 -33 141 -6 53 -148 -12 -244 219 28 -110 -29 173 109 56 46 142 189 94 113 133 200 -26 -34 150 -85
7537 -85 2 -45 -76 101 21 29 10 67 221 85 -70 188 -53 -78 48 4 -16 133 -164 -108 -266 30 11 67 -101
7562 -101 140 131 31 -44 -178 227 -37 204 26 54 50 80 -142 37 30 -138 66 159 -100 -104 -122 -126 110 71 -99
7587 -99 59 -93 -166 -133 20 -211 -30 -5 -107 215 81 168 -34 -208 117 -221 -90 92 -32 10 128 -106
7609 -106 36 -32 239 -202 -51 224 -91 78 -51 29 256 51 -34 28 -122 -249 147 -81 -208 103 -92
7630 -92 -192 -86 -51 33 -51 -48 -121 68 111 -57 38 47 112 11 65 -18 -86 -123 -36 -112 -53 -89 -46 -212 -140 75 394
7657 394 -38 -12 -41 -278 -209 46 -130 123 -268 -35 -87 55 85 -74 -52 121 3 167 80 -153 8 134
7679A34K34m45o6k9K00N0J61k48j02K61q7K31l33J86J03k47J31o7J13l57K51K3
7701I7k81K49rq2mJ85j55L03k07o7j66J01N2J60j62J13j05j02O0j61j6J37R5n5
7725b0m4LK2J53j81N8J34l38K25k83K50K43k18J75k35J88l70J86j0q7M56k10j88
7748i1J0K4K99l18L05Q0l62j47J43j81J23K42o3nq7K8J06j11k9p8m9J36K01j71
7772Ej55L61j59j08Q8p6j26J17r2q8m5J83K14L0N0j54J79j69j39P1m9K53j65O
7796C2j26j06J63J54j39lj20N1J02J40j22p3L7j7L5K29j91j63N8l4P0k62M25r2
7820D8mj33K26k02N9k60R3J10k1p3J05J6j15J94N9J48k72K1%Q0j22J09j89J06
7844a7k50K98k97M61k58P8J38k02m4KK98l34M8N3R7k24L04l15O1R4R4k0k06R2
$$ plain form
7679 134 368 -77 -143 -172 28 78 239 -9 -111 150 63 294 -39 147 250 3 134 67 180 -177 74 97
7701 97 -184 65 56 -26 -30 155 0 303 96 29 -137 -36 16 176 14 127 22 -80 -20 -181 -197 -60 35 -20
7725 -20 -64 -61 -39 114 -67 -9 125 -213 12 -271 -21 222 4 179 -56 132 -238 -52 -62 -149 307 97 -91
7748 -91 -81 -57 242 -76 229 309 -53 -200 -57 -238 -115 127 64 59 -28 0 106 -5 -34 -112 -161 -25 176 5
7772 5 -150 211 52 -56 32 -44 -170 -53 -145 -233 -278 -95 119 149 199 45 224 55 -84 -13 -62 191 26 32
7796 32 -94 -200 -37 117 -22 -25 -145 -94 8 148 26 -47 -10 -27 8 237 46 -117 -59 -93 -23 -285 140 48
7820 48 44 -89 137 -65 -6 -266 -173 -63 -84 -157 -52 -36 -151 43 102 250 -22 -1 -1 79 -43 66 -123 -17
7844 -17 -267 31 -266 195 -63 15 153 -49 -93 -91 207 -127 -79 -26 71 -153 151 -164 -103 -9 85 65 -141 -49
7868d9n2m5K54O9j11L2j66k87K10q6K11l1M4L2j96L62k97Rk5M75l42n5j6K15k88
7893a33j56L95j1j78J49j54J41J16j36J18K20j01j29r0j35K06j20n8J41l4k37
7914a86J56n2K24P3j64k0m0k79K06mK20q4M0k48J3K88j33K2k8L9j04J79k07K02
7938A13j8l38K5J65O1O6Ol8J13j76j01J16K1r8J3K40m5j39m3K1J47l9l6K02l33
7963i5K7J09k66J68J01P9L6l32M55j59j91o8K01j55j1R5R8k4n0K5k4J05n6r3m5
7988g0J17%J1J17p1j48J67j36K2K09J4j94p1kM2j71j2J48k95K96j23L4K23j39
8012c2k1M8N1O9j30j10P8K39j64PM1K3o9j79J25K04l1l36l7K22J2j50P7J36J49
8037B22l72J59K2j33J11l6QJ38k09K28l87M09k40J48Q1j49j29O9q0N3M0L6J05
$$ plain form
7868 -49 -101 -146 108 177 66 98 -68 -355 -145 -231 -20 -51 -7 25 -171 191 -106 -97 -122 353 11 -44 -60 155 -133
7893 -133 -289 106 95 -83 66 -88 53 169 33 151 371 270 141 51 -84 122 2 -56 85 51 -186
7914 -186 -30 -82 142 215 51 31 -9 -288 -82 -86 134 50 90 -158 -145 143 10 32 4 43 -61 118 -89 113
7938 113 95 -243 -218 -53 8 74 80 42 155 -21 -122 -6 15 -83 -70 170 125 -14 -57 -36 111 72 36 238 -95
7963 -95 -68 41 -225 -57 44 123 159 -173 282 123 -68 -136 65 -90 -101 -6 92 68 18 43 19 124 68 -25 -70
7988 -70 47 47 58 175 104 -44 123 -13 9 218 232 38 -33 -35 7 -164 -176 -28 -323 -27 -150 -116 107 -32
8012 -32 -53 -5 46 115 -15 -125 -47 192 28 35 76 99 30 -149 -24 180 149 -187 -224 -2 10 -140 -63 73 222
8037 222 -150 9 31 -102 9 -27 -19 119 -90 138 -249 160 -80 68 149 0 -129 -60 -140 -87 -47 -11 94
8060I4k4N2j40J20j43l6L4k3J22r5p8J37O6q4J63k17K38j78Rl71N57l77K13Nk37
8085a93N82k86k81J74R8o4J4K7j01l64L60J77k37J42m7l35J73J51o4J3K12j26
8107B5j03M5j5J32j61n6L20l07K4N4J24k26K02r9NJ55J33k39R9%j84J66j22j04
8131a32K66j29J73j36j76j05M53l05J00J98j57N5k7m3j01K3j09K52j39P0k03Q4
8153h8K39l72L36K3k49J99m0oq2r1K74k08M9J95j98O5j17qQ8M8m6j28R6Q4n4J02
8179A11k46l9k9L16k61R4R1o6jj8J32k32
$$ plain form
8060 94 70 122 -18 102 -41 -77 -43 -66 56 -39 -117 20 86 2 165 -52 186 8 17 -354 203 -174 39 44 -193
8085 -193 389 103 -178 -4 94 30 44 71 -30 -394 -34 143 -94 48 1 -334 -161 -10 -74 -61 151 25
8107 25 -78 -33 -48 84 -77 -133 187 -120 -96 -42 82 -144 58 -41 -36 119 252 13 112 112 -72 94 -28 -132
8131 -132 134 5 178 42 -134 -239 214 -91 9 207 50 105 78 35 -66 -43 -152 100 -39 31 -172 -88
8153 -88 151 -221 115 138 -111 88 48 42 -40 -131 143 -65 -16 179 -19 46 -71 -79 9 57 11 -117 -21 63 9 111
8179 111 -135 -174 -203 113 -148 -54 37 -29 -30 -48 84 -148
8191a48
$$ Imaginary data points
##PAGE= N=2
##DATA TABLE= (X++(I..I)), XYDATA
0@%%%%%%%%%%%%qJ6j6J6j6K4l2M0m8N6o4P2q8J04j20J36j60J85k09K40k73L08
34A63l49L96m45M99n58O22o92P68q53R47j047J157j278J408j551J709j884K075
52A087k286K519k783L082l415L798m240M758n377O129p064Q265r875J2151j5636
67h887K1698l5163J19323l4971j79301J86416P773j32877J7772P4091o1896J8343
79g679j8580J2886O7914n4996l0321R4931k7299o6450M3246J1k3966n200j8600
92c4103L3392J3885m8699K4612O8845o9787J355N8375m9005j3390K8522l3080
104a9078m272K6622l7605K3456K1152l2507L7427Q224m5124M4851J5781r1775
116e2848N5131M0303j04696K8851P5809p2830j0978Q4086m1934j4476M4835k4766
$$ plain form
0 0 0 0 0 0 0 0 0 0 0 0 0 0 -8 8 -8 8 -8 16 -16 24 -24 32 -32 40 -48 56 -64 72 -88 97 -112 128 -145 163
34 163 -186 210 -235 264 -294 328 -364 404 -449 498 -549 608 -670 738 -813 896 -988 1087
52 1087 -1199 1320 -1463 1619 -1796 2002 -2238 2520 -2857 3272 -3792 4473 -5402 6749 -8887
67 -8887 12811 -22352 96971 62000 -117301 69115 76888 -55989 -38217 35874 -26022 -7679
79 -7679 -26259 -13373 54541 -455 -30776 64155 36856 -29594 13652 13663 -10303 -15503 -34103
92 -34103 -711 13174 -35525 -10913 57932 -11855 -10500 47875 -1130 -14520 14002 -19078
104 -19078 -23350 3272 -34333 -10877 10275 -22232 15195 23419 -21705 23146 38927 -52848
116 -52848 2283 42586 -62110 -33259 42550 -30280 -41258 42828 894 -13582 31253 6487
128F487r581J9278k2538j1524K2898k0315L335P333j478K0801j0522p022L0198
141B7350n311l9387L3523j057l7745K1495j09j6645K3559J63k6211M6331J43m2800
155a6701L0597J6816l5645q303J8581o012k850k1931J8165L8372m4822j1406O5014
168C9875j2783o3635M9210K1841n5613K51K7583q994j5713O710O773J7556j7006
181c945n696K8490p101k0295M298J1612j3751o132m997J6715L452k5555K0677
194b228K3766k5282r131L7921j8946k2489K2460l805j6210N012Q417p842Q032
207c25j111O037N940r480P801J479j1235k087J0919j7768K119J2736j3218N966
221b227J1072n574k272J6659j3307l717J0939j0753n683L076K100p287N431j64
$$ plain form
128 6487 -3094 16184 -6354 -17878 5020 -15295 -11960 -4627 -6105 14696 4174 -2848 27350
141 27350 22039 -17348 16175 15118 -22627 -1132 -1241 -17886 5673 5836 -20375 25956 26099 -16701
155 -16701 13896 30712 -4933 -13236 5345 -667 -3517 -25448 -7283 31089 -13733 -25139 39875
168 39875 27092 -36543 12667 34508 -21105 -20854 6729 -2265 -17978 -11268 -4495 13061 -3945
181 -3945 -9641 18849 11748 -8547 -4249 7363 -6388 -12520 -17517 -802 2650 -22905 -2228
194 -2228 21538 -3744 -12875 25046 6100 -16389 6071 2266 -13944 -8932 -515 -8357 -325
207 -325 -1436 4601 10541 1061 8862 10341 -894 -2981 7938 -9830 -7711 5025 -8193 -2227
221 -2227 8845 3271 999 17658 4351 634 11573 820 -4863 -1787 313 -6974 -1543 -1707
235a707O710k97n684J2519l246r090K355N660j5642L023N628j0373P270K477l575
250c972M076R655j2302L730P658j1810j653J774L23p183L034N53O186l743j643
265e317J4106o323n582O293L075j5197N404L968r781M392J746N98Q96N760m273
280b35O035l17n933M501l610j981k091K495l229M707j400K96Q691n669J131M284
296G675q52q766O358j602p799M966j337M98j75M551j961M630j985j486M216o327
312F04L07j320n40l754L840j870l7N863m337L548J239j022m063M540m041m444
328e487M052l018J15j035M462j595K266l21K285J164n878L926j453k783l314N485
344a129k809j714M731q38K997j831K922p32J503m001l35K561m716J130p55L214
$$ plain form
235 -1707 5003 4706 -978 11541 8295 -795 1560 7220 -8422 -5399 229 -10144 -2874 -397 -3972
250 -3972 104 9759 -2543 1187 8845 -2965 -4618 -2844 -2521 -9704 -6670 -6117 69 -3674 -5317
265 -5317 8789 2466 -3116 3177 6252 -8945 -3541 427 -9354 -4962 -3216 -2618 -1722 4038 -235
280 -235 5800 5483 -450 4051 441 -1540 -3631 -1136 -4365 342 -1058 -762 7929 2260 3391 7675
296 7675 6823 -1943 4415 2813 -4986 -20 -1357 -859 -1034 3517 1556 6186 4201 2715 6931 604
312 604 911 -409 -949 -4703 -863 -2733 -2770 3093 -1244 2304 3543 2521 -1542 2998 -1043 -5487
328 -5487 -1435 -4453 -4338 -5373 -911 -2506 -240 -561 1724 2888 -2990 936 -517 -3300 -6614 -1129
344 -1129 -3938 -5652 -921 -1759 1238 -593 2329 1597 3100 -901 -1236 1325 -3391 -2261 -3016 198
360A98j708K417k13L002J289m511M084j669r44m064L385j001j761R29J38M998
376D569l545J228J055L399m929j826L755k347k087l887O560j367l060M83O992
391D993j146p070O922K17l777l777M681k112k557Q19l49L507k883J151Q60L252
407B731l459p68K271k221K68l160J845j457K720k437L10M977j095k104p55P533
423E199n661l926L031L698n121m160P910O10k171m123Q417K672o964k500Q452
438E363J637j4389N336Q826o067q679J0749M211r231K905L320J575m563K71m55
453H09L072k345o341O229J984l934l183R215k078m686L439K15r88j349Q03m827
469c965O147j325o949L970O970n238o910J1783j49p380j521P346q46p569P00M597
$$ plain form
360 198 -1510 907 694 3696 4985 474 4558 2889 1945 -2119 1266 265 -1496 -567 -429 4569
376 4569 1024 2252 3307 6706 1777 -49 3706 1359 -728 -4615 1945 578 -2482 -1999 4993
391 4993 3847 -3223 3699 3916 139 -3638 1043 -1069 -3626 -2807 -3156 351 -2532 -1381 -521 2731
407 2731 -728 -1496 775 -1446 -1178 -4338 -2493 -3950 -1230 -3667 -3357 1620 525 -1579 -2334 5199
423 5199 -462 -4388 -1357 2341 -2780 -6940 970 1580 -591 -4714 3703 6375 -589 -3089 5363
438 5363 7000 -7389 -2053 6773 706 -7973 2776 6987 -2244 661 3981 5556 993 1264 809
453 809 3881 1536 -4805 1424 3408 -526 -3709 5506 3428 -1258 2181 2396 1408 59 862 -3965
469 -3965 2182 857 -6092 -2122 4848 -390 -7300 4483 4334 -3046 -4567 2779 1933 -5636 -4936 -339
485c39L528j0611J783J0825k079j1886O902J1516j3507l725J0024J801j1849L772
499c845O393l899n30k01L673O24q74n214O967J551r846L822N859n202m777J0218
515D719l571l619O828j215m600M180M051j0969M324N591n460m650O441L349q242
530b843K523L275K599o363k50M896K94n821k744R709l521p214K921R327o947n864
546f023R342L83n311j595N407k242j048k545Q85N701o081k316O434L120j0393
561f282M764N884p196k08L194j086l101M991m047j16N028k530k767L339M591p439
577b981O42M195O53o624J396O837m789k099K286M465m341p3J591J786m47n522
593c025M726J922l659l779P950j288n350L751J728l04l364K394O08P42m708J449
$$ plain form
485 -339 3189 -7422 -5639 5186 3107 -8779 -1877 9639 -3868 -7593 2431 4232 -7617 -3845
499 -3845 2548 -1351 -1881 -2082 1591 2215 1341 -3873 3094 4645 -5201 -1379 4480 -722 -5499 4719
515 4719 1148 -2471 4357 3142 -1458 2722 6773 -4196 128 5719 259 -4391 2050 5399 -2843
530 -2843 -320 2955 5554 -809 -1059 3837 4131 -1690 -4434 5275 1754 -5460 -2539 6788 -159 -6023
546 -6023 3319 3702 -1609 -3204 2203 -39 -1087 -3632 -2747 2954 -3127 -5443 991 4111 -6282
561 -6282 -1518 4366 -2830 -3038 156 -930 -4031 960 -3087 -3203 1825 -705 -3472 -133 4458 -2981
577 -2981 -2339 1856 2509 -4115 -2719 4118 -671 -2770 -484 3981 -360 -433 1158 2944 2497 -3025
593 -3025 1701 3623 -36 -3815 4135 2847 -2503 1248 2976 2672 -692 1702 2310 3052 -1656 -207
609b07M780o245k99M448J87n854M994J072m577K330P94o77k829L198j531q07p60
626a983K025L49l448L620l86r68j167K998k285m98J269k591K652j364q89Q04L926
643B064m606j82N220l344j011Q79K573l131J88J54J712o02k885M782p06k020L05
660f10L443l131J39K339l250J806P5n80m22L006k992N09K713k382P26r67K137
677B559j681j88l39J731j286k403M564k164q01P65K054l394J270J373k884J621
693G97r77J07o02J378j992J141J392k414J470r70J004j595N83k35N81j034j114
710b480L442l132M37J276M87k654K078R49k555J898r40M59p78R82j161J411Rr37
728a209J885j445J208q40O14m28Q99j114m15K835k955J108R59K01j886K115M52
$$ plain form
609 -207 4573 -1672 -1971 2477 2664 -3190 1804 2876 -1701 629 1423 746 -2083 1115 -416 -1223 -1983
626 -1983 42 391 -3057 563 177 -791 -1958 1040 -1245 -1743 -474 -3065 -413 -1777 -2666 -1862 2064
643 2064 -2542 -2724 2496 -848 -1859 -980 1593 -1538 -1350 -1196 516 -86 -2971 1811 1105 -915 -610
660 -610 2833 -298 -159 2180 -1070 736 811 231 -191 2815 -177 332 3045 663 1389 422 2559
677 2559 878 690 351 2082 796 -1607 2957 793 -8 757 2811 -583 687 2060 -824 797
693 797 -180 -73 -675 703 -1289 -148 1244 -1170 300 -670 334 -1261 -678 -913 -332 -1366 -2480
710 -2480 962 -2170 -1733 -457 30 -2624 -546 403 -2152 -254 -1194 -735 -1513 -531 -1692 -281 -272 -1209
728 -1209 676 -769 439 -401 213 -215 684 -430 -845 1990 -965 143 1102 1303 -583 1532 1984
745A984k088J550p53R79j680J109m96O89p26l55J772j728J281r74R77j011M65
762I95m36n16J333k658K054m73j35p99J942o32j914J927r95N34j971J826q66k11
780i95j26J92R59k317K503q26L07r94P18j21n79Q18j374J491j054R65r41R61O6
799c47n28J021r22J223j923J542n54N51o17K06R71j108J678j592J539p05K93m90
817B38O59N76k221J643m02Q03j507J502k97n85R96r43J586j839J065q74O32m80
835E52n52R09q52J203j938J478r3r0p81M67J118k325O36l87J577k261O22R52n58
854c23j82q23J858j325J58q20J557o21j795J565K72L69k234K333n18j82m39Q17
872c33O52j694J066p89J778j861L56J018k04j66q48J968j372R04n95O15m2l5j68
$$ plain form
745 1984 -104 1446 693 1672 -8 1101 605 1294 568 213 1985 257 1538 564 1541 530 995
762 995 559 43 1376 -1282 772 299 164 -635 1307 675 -1239 688 -307 227 -1744 82 -784 -995
780 -995 -1121 -929 30 -2287 216 -610 -303 -1297 -579 -700 -1279 -461 -1835 -344 -1398 -433 -1374 -413 -347
799 -347 -875 146 -776 447 -1476 66 -488 63 -554 -348 623 -485 1193 -399 1140 435 728 238
817 238 897 1473 -748 895 493 1296 -211 1291 994 409 1405 462 2048 209 1274 400 1032 552
835 552 0 909 57 1260 -678 800 707 617 -164 303 1421 -904 -268 -655 922 -1339 -717 235 -323
854 -323 -505 -1328 530 -795 -637 -1457 100 -521 -2316 -751 -479 -110 -2344 -11 -529 -711 -1150 -333
872 -333 319 -1375 -309 -1098 680 -1181 -825 193 -11 -177 -1025 943 -429 475 -120 495 453 418 250
891B50q19K462k097L33J29J809j845n59K385q59n75n09J859j464K04n33O23J081
909A875k365J107P26K42l080K202J323k465j14J022O95k512J664n32O93q80m22
926h21J092l46l3j443J927j012l65k25R73l27j185K068j542R02m83J25q61J557
944AO0k538K856n10r05n90K812j727m66J412o64N32j029P89l50J370k046K23K674
963A904j991p73J323J689l130J149J228m28m98l55J404j536J201j467J546o03
979F63l16K19P0Q61j808J710p77K08j003Q60l20o46J704j869M47K47K28j583J624
998E19L30k290J483l4Q4j180J350r88M91r9j200J955r10n87k07J847j705m71J523
1017h9m62k93o73J764j140L26l76J007j75r32J088m61P24j203Q41l18L92j39k87
$$ plain form
891 250 -569 1893 -204 129 258 2067 222 -337 2048 1189 614 105 1964 500 704 171 794 1875
909 1875 -490 617 1343 1585 -1495 707 2030 -435 -549 473 1168 -1344 320 -212 481 -399 -821
926 -821 271 -75 -108 -1551 376 -636 -1001 -1226 -253 -580 -1765 303 -1239 -337 -820 -695 -1556 1
944 1 61 -2477 379 -131 -1036 -1626 1186 -541 -1007 405 -259 273 -756 33 -317 1053 -993 -770 1904
963 1904 -87 -860 463 2152 -978 171 1399 971 473 118 1522 -14 1187 -280 1266 663
979 663 347 566 636 1497 -311 1399 622 830 -173 687 367 -279 1425 -444 3 250 478 -1105 519
998 519 849 -1441 42 8 92 -1088 262 -726 -235 -334 -1534 421 -489 -1076 -1283 564 -1141 -1612 -89
1017 -89 -551 -844 -1517 247 -893 -567 -943 64 -111 -1043 45 -416 308 -895 -54 -372 20 -119 -406
1036d06J167j035R43q16O86p11Q40m56k70J337j491O13R6Q26j129O46K20o57P82
1055A185q90P97n51L95q90R58k97j030J269o94O37j204J202o88L5r5n6O93j597
1074h21J346q79M90r74O57J93l73M30p74O89j257Q94l86J05J8p9O78j397J239
1093b01n91N35o80P67l42j77Q43j283J237j040P97l73P38n21j32R17j061R89q17
1112c95O57o12P92j62l24Q12r25J019r79R21m55K61j74q8O38r29J013p94M50l18
1132D08L30l78K52J63r10J224j146N89j39J27n23L49Q2q89J057r91P77m38J24
1151F8k18n2M25j200J543j375N04l26M80n38J76L84p29Q34j025O71m25L72m43
1170h74J40L22o36J099j062J137m36j75j68N36P0p85J558j398R33l13M7k15K79
$$ plain form
1036 -406 761 -274 669 -147 539 -172 668 212 -58 1279 -212 401 497 1323 194 840 1060 403 1185
1055 1185 295 1092 541 936 46 1004 707 -323 946 252 889 -315 887 199 234 139 83 776 -821
1074 -821 525 -354 136 -838 -181 12 -361 69 -705 -16 -1273 -379 -765 -660 -642 -721 -43 -1440 -201
1093 -201 -792 -257 -937 -170 -512 -689 154 -1129 108 -932 -135 -508 230 -291 -423 494 -567 422 -395
1112 -395 262 -350 442 280 -44 768 -157 862 -117 804 349 610 436 348 986 57 1070 276 726 408
1132 408 738 360 612 775 -135 1089 -57 532 393 520 -3 346 428 -461 596 -395 382 -56 68
1151 68 -150 -202 223 -977 566 -809 -305 -631 -151 -689 -513 -129 -858 -24 -1049 -378 -803 -431 -874
1170 -874 -734 -412 -1048 51 -1011 126 -310 -485 -653 -117 -47 -832 726 -672 261 -52 -5 -220 59
1189E9O1m12J250j255R68m26J78j25J22K1j71Q91j233J023k01j32n0L59n80l38
1209IJ240j327J130q46J27j47L71o7n64R40j331Q68n35L01l58j03K78m27M54r66
1229i53J123o00k9N9J11Q8n89O55r08J092r40K24J64j97J9L4N84j352J576q83
1249g22L10J45Q4q5k51Q46j317J362r50K64J45J28J99k58Q90j101R49r67M63n6
1269G8K15J55j96N48q65R31r63R37n05J56J75m13N78o67R03j042O33k76J27P4
1289E83m43L74o32Q25j085P77P3n99K78R1L55j218J023r86N69o8l04J8p8K83q87
1310a051J357j286M74l01K32L87m83L54n18P66q33P21k79K56j28m41J019o06J82
1329a78o53Q79j47j28J61P4J16m62Q77p44N61l62J97K52k88K21m53Q74q14O82
$$ plain form
1189 59 120 -292 958 -297 671 245 423 298 420 441 270 1161 -72 951 750 618 568 927 347 9
1209 9 1249 -78 1052 206 333 186 557 490 -74 866 -465 403 -132 169 -189 -292 -14 -441 13 -953
1229 -953 170 -430 -459 -400 -289 -201 -790 -135 -1043 49 -891 -667 -503 -700 -681 -647 -63 -1415 161 -722
1249 -722 -412 -267 -183 -268 -519 327 -990 372 -578 -314 -169 -41 158 -100 790 -311 638 -329 134 78
1269 78 293 448 252 800 -65 866 -97 840 335 491 666 253 831 164 1067 25 658 382 509 583
1289 583 140 514 -118 707 -378 399 472 -127 151 242 597 -621 402 -584 -15 -83 -387 -369 -447 -164 -1051
1310 -1051 306 -980 -506 -807 -575 -188 -671 -317 -835 -69 -902 -181 -460 -204 -332 -773 246 -360 -178
1329 -178 -831 48 -99 -227 -66 8 124 -338 539 -205 356 -6 191 443 155 376 -77 797 -17 665
1349F65j72j81L08l85O57p18L95k49N78p11M45j41l73O62o53N11n36O05r78M13
1369A42J73k29L69n18N52r93R85n54lp7k58J50q4M96p87P28k46m08n5K39K62p02
1391h18Q19o10N29m42K72m08J05K86o52Q50n69N89m60N33j8l81O50o86N91n00
1411c20O29n70M96j11l81Q48m39N27q79Q24n25K82j66p8M21n11O66n39P26q06
1431I4L85P0j33p4l15P00p38N72r8j56k77Q4M42p71N63m32P1k38M17l87M3O21
1453D43j010P02n86L56m71L55k16L1J21l84K66q1L94m60L68q2m68N85l80K42n47
1474h22P62m67K70k16P9R0r7O44q37Q07m58M27l92L45O1l21N42o14N88k08J04
1495B87j65R9N3l28N75o03Q43o30L41j85N6M15p50O75p17O54m40M70o22K17L74
$$ plain form
1349 665 493 312 620 235 892 174 569 320 898 187 632 491 118 780 127 638 102 707 -271 142
1369 142 315 86 455 -63 489 -504 481 -73 -76 -153 -411 -261 -345 151 -636 92 -154 -562 -617 -378 -116 -818
1391 -818 1 -609 -80 -522 -250 -658 -553 -267 -919 -69 -638 -49 -509 24 6 -375 275 -411 180 -320
1411 -320 309 -261 235 124 -257 591 152 679 -200 624 99 381 215 137 558 47 713 174 900 94
1431 94 479 549 416 342 27 727 -11 561 463 307 30 114 556 -215 348 -84 -13 -251 166 -221 -178 443
1453 443 -567 135 -451 -95 -566 -211 -427 -396 -275 -659 -393 -474 -80 -540 -172 -254 -722 -137 -517 -275 -822
1474 -822 -60 -527 -257 -473 -394 -304 -401 243 -594 213 -245 182 -210 135 196 -125 417 -197 391 183 287
1495 287 122 221 274 -54 521 -82 761 131 472 287 343 758 8 683 -34 620 180 650 28 245 619
1516F19m85R6k49O43q13M23k21L2O4k85M69q51R37n49j52K49k95K23q6K16n71
1537e86O54o31K85q7q3L5j33M64p78P50l67N06n19J88L5o6M62p18N88m79M25j94
1559b49K64J15k89M84m94N62o41P80k14J08L9m68N64n23M46l42M26l60K33N9k73
1580B27L54m40O50p92M28l58J47K99l47M61p02N64n20J12R0j45L82m81K98l48
1600a21K81n63P24n02J33j41l74O72n28N01o95N09m05K68k0n15Q79p65N91n71
1620f42O89n18P9K76n01M83l79O91n31N26n88L05J32q4Q7o97R08n29O18l70N0
1641Em7M0M59m41O21q34O60l11N2J91j49L02m84N39n48L90j41J13k11L6K84o51
1663a25O39l67K22m71p3M47p4j32j69M37o17O12m79J29Ll42M07n12P69o60Pj31
$$ plain form
1516 619 134 230 -19 624 -189 234 13 45 109 -176 293 -558 379 -170 -322 -73 -368 -145 -231 -15 -586
1537 -586 68 -563 -278 -365 -448 -413 -546 -82 -860 -110 -477 29 -490 -302 -267 -333 129 -589 -1 -480 -55 -249
1559 -249 15 130 -159 325 -169 393 -248 532 318 426 465 -3 561 38 484 142 568 208 441 500 227
1580 227 581 141 791 -1 427 69 216 515 168 629 -73 491 -29 83 173 28 410 -71 227 -121
1600 -121 160 -403 321 -181 -48 -189 -563 109 -419 82 -613 -104 -509 -241 -261 -776 103 -662 -71 -642
1620 -642 47 -471 -392 -116 -617 -134 -513 178 -353 173 -415 -110 22 -62 25 -672 236 -293 325 -45 5
1641 5 -42 -2 457 16 637 -197 463 152 204 395 246 548 64 603 55 445 304 417 206 242 526 -125
1663 -125 514 147 369 -102 -175 272 198 66 -103 334 -283 329 -150 -21 -18 -360 47 -465 304 -356 -349 -480
1685d80O6R3p1M30o44N59m04M60m01J33j41q1K55k22L23m81N94l45M21k01k75
1706d12L65m73L84k04M06k18K76k80J81K27m39N20n34N60o19O94j4p8J82o52Q64
1727G36q14O48o36M78R6k72J33l34M06m97P70m09n7j31J02J47l54N60m77M04o44
1748a45L40j24k68L94n41M37m47N29n24L12j90J3K89m70M86o90L75j64K71k98
1768d15k30M60k62M39l22N10q07O68l94k34O26l92L99m19O42n24K79q3k2M36m88
1789a33L54o43Q02k43R1r1r0J15l3J16m3K66l93M33m30L85K7n37N38m19M64m08
1811A28L40k25l04M97m53M14k57K38l81K43k96J94K49n82O43p71M19n63M47r3
1831a13k33N69m29J40m23O53n36K58N8k93M21n48M03m41N30k87M0j1M5J99n77
$$ plain form
1685 -480 -414 -321 -392 38 -606 -47 -451 9 -392 -259 -400 -481 -226 -448 -125 -606 -12 -357 64 -137 -412
1706 -412 -47 -520 -136 -340 66 -152 124 -156 25 252 -187 333 -201 359 -260 434 420 342 524 -128 736
1727 736 -78 570 -66 412 508 236 369 35 441 -56 714 305 248 117 219 366 12 572 95 499 -145
1748 -145 195 71 -197 197 -344 93 -354 175 -349 -37 -227 -214 75 -395 91 -599 -224 -388 -117 -415
1768 -415 -645 -185 -447 -8 -330 180 -627 41 -353 -587 39 -353 46 -373 269 -255 24 -59 -81 355 -133
1789 -133 221 -422 380 137 228 137 47 162 129 245 202 468 75 508 78 463 490 -47 491 72 536 128
1811 128 468 243 -61 436 -17 397 140 378 -3 240 -56 138 387 -195 448 -323 96 -467 -20 -113
1831 -113 -346 223 -206 -66 -489 164 -372 -114 -56 -349 72 -476 -73 -514 16 -271 -231 -242 -197 2 -575
1852e75M70o42O64m35L97k71K09J05k51M41k65K67k28L01j99J15J45j09j5j10
1872A4M43o80N35j3K1k02J54J25o8K00m39N58l96K07j00k44L34m78N21m96L34
1893C30m9jk16l0N7l50M35k26Q8j47M7k0j36M26m53L20m08N09m83k7j5o3K89k60
1917c83K38j11K20m65M29k31j94K58m45O85o85M81j8j12J03Q3p2N1L84k97J46
1938F5k55L80l93N8N29m27L51m54O20n89L58L3k28J57j92K93l82K78q9J37M8j78
1960A20L80m05K44k22K32j51J51K1j40K78l32M3m99M85l26J89J33j07O3n04M65
1981A18l77L01j95K10k54o7N30o99M70n65N19n43M16k80J03J75n16O47n83N31
2001e9l95L96j70J21j29o3K70k49M40l44K80j6k06K26m15O10l95L35k96L09k47
$$ plain form
1852 -575 -105 -747 -83 -518 -121 -392 -183 -78 -329 112 -153 114 -114 187 -12 103 248 139 124 14
1872 14 457 -223 312 299 320 118 272 397 329 529 90 648 252 459 359 115 449 -29 492 -4 330
1893 330 281 280 64 34 91 -259 176 -50 38 -109 -62 -82 -218 208 -245 75 -333 176 -307 -334 -349 -412 -123 -383
1917 -383 -145 -256 -36 -501 -72 -303 -497 -239 -684 1 -684 -203 -221 -333 -230 -147 -219 -168 216 -81 65
1938 65 -190 190 -203 -145 384 -43 308 -146 474 -115 243 276 48 205 13 306 -76 202 113 250 298 120
1960 120 500 95 339 117 349 198 349 370 230 508 176 219 -280 205 -121 68 201 94 157 -347 118
1981 118 -259 42 -153 57 -197 -264 266 -433 37 -528 -9 -552 -136 -416 -313 -138 -654 -7 -590 -59
2001 -59 -454 -58 -228 -107 -236 -299 -29 -278 162 -182 98 82 -124 102 -313 297 -98 237 -59 250 3
2022CK38L9l13L69n44O85m51L07j39j3r3k41O11o77P94m41K42j74K5j05j1J81
2044B92m78N75l10K74j40r9j6k87O02p45N98k27J6k21J74J22m72K48m06M05k64
2065c59M09l72K18K99n18K86m95N83p15P73k04j23L05n54M98l85L44l52L00j44
2085b06L3K26p4K33l31Q0k9J82n2J48o7k31M73o68O16k92N2K27N5Ok25J31l50
2108f3P14o01K62L1l13J32k13M54m54L73j73j3k75k3L11m54L18l80N28j83R9l36
2130b59R5K21l18K91m84N20l32J35k11J17K0j36N10n45J47k88O10o09J89J94k89
2151d22M53l48K53n04O13m28K28J92m04M50l10M24n14K32j33O9K44j06j0j6L49
2172C12k85M55o73L65J26l21P60p56N29m45L96m44L93M6n07N53m60K88l3J29k39
$$ plain form
2022 3 241 280 -33 336 -208 477 26 333 194 181 88 -153 458 -219 575 134 376 202 227 122 111 292
2044 292 -186 389 79 353 213 114 98 -189 413 -332 266 39 55 -166 8 130 -342 -94 -500 -95 -359
2065 -359 50 -322 -104 195 -323 -37 -532 51 -664 109 -95 -218 87 -467 31 -354 -10 -362 -62 -206
2085 -206 -173 53 -21 212 -119 -39 -68 114 62 210 143 -88 385 -283 333 41 93 320 375 381 156 287 -63
2108 -63 651 50 312 343 30 162 -51 403 -51 322 149 136 -139 -162 149 -305 13 -367 161 -22 77 -259
2130 -259 -164 57 -261 30 -454 66 -266 -131 -342 -225 -205 -341 169 -376 -229 -517 93 -516 -327 -133 -422
2151 -422 31 -317 -64 -568 45 -383 -155 37 -367 83 -227 197 -317 -85 -218 -149 95 -11 -21 -37 312
2172 312 27 482 -191 174 300 -21 739 -17 512 67 463 19 412 458 -49 504 44 332 299 428 189
2193A89J11j26k90L82l83O01m22o3j24J99k02k2N7j58K80l43K90l15m1K81J2q5
2215a72j65K65l03K06q1j02J56j34L13k36L05k52J71k36J79L0m38K95l3K81k41
2236a92K02k62L31j63j3J04p3L22l52O20m60J11Q1j40J88m09M40m51O11m96L43
2257C42j62J17Q5k20K47n00N90n61J52L7J75o6m03L74j88M00o02K88l4j18L0m14
2279d31N82m79M93n00L92M3m44L37j30K05n29M14n03N40k26j40K00j8P5j76k6
2300c21qK32j63K05j49j68L86l55J71J02j15j17L07M2l53M30m44N32l7l0l49L28
2322A26Nj50K74k52K97l44J83o1k9K74k32K69j07K29n10N72k15k32L3k2J04l65
2344a53K65j5j8J0m7O5r1K40k97R5j28m4o0rL16m83K94k87K67l97N27k37k42N13
$$ plain form
2193 189 300 174 -116 266 -117 484 62 -1 -125 74 -128 -150 -93 -251 29 -314 -24 -339 -380 -99 -87 -172
2215 -172 -337 -72 -375 -169 -250 -352 -196 -330 -17 -253 52 -200 -29 -265 -86 -56 -494 -199 -232 49 -192
2236 -192 10 -252 79 -84 -97 7 -66 256 -96 524 64 175 256 116 304 -105 335 -116 495 -1 342
2257 342 180 297 382 162 409 -91 499 -62 90 127 302 236 -167 207 19 419 -183 105 71 -47 -17 -431
2279 -431 151 -328 165 -335 57 100 -344 -7 -137 68 -461 -47 -550 -10 -236 -376 -176 -194 -119 -295 -321
2300 -321 -329 -97 -260 -55 -204 -372 14 -341 -170 -68 -183 -300 7 49 -304 126 -318 214 177 147 -202 126
2322 126 131 -19 255 3 300 -44 139 78 49 323 91 360 253 482 -28 544 329 97 130 108 212 -153
2344 -153 112 97 79 89 42 107 16 256 -41 54 -74 -118 -178 -187 129 -354 -60 -347 -80 -477 50 -187 -429 84
2368H4o65O01o56O20j11o0l63K89jl25P17m89L23l42M33j01R5m4n5P9j15M5j59
2391b00K20n9J25K4k16M59n76K96J9J68l29K44K26n6k47k1J76J13k1j07O8j17
2413A89N9J61l38J13J1P6L0KO9j18j35k68M09l62L56j30l09K23k23J83j66L34
2435A66m32J47%m5K79k96R0m32M97k59J26r2Q9J03l99L42k91M50m63N08k25J00
2457c7jj60J36o0J61j90L31m12J09Q3n9K68n24N13k94L12k32J79J92k48P1j08
2479C0L40m57L31k8o2N5j50L46j61j30j71L05m0J42j44j60K48k12J28k96K00m45
2501c31P50l26J3jj15R0l49L46l90L64L2j37J77m39K94j54J43j93j3J31k39K72
2523g5k63N75n42K70j36K61l91OK29j26J95l29N20l08k8J23l7L0k41L21j50L79
$$ plain form
2368 84 -581 20 -636 -16 -127 -187 -550 -261 -262 -587 130 -359 -36 -378 55 -46 49 5 -50 29 -86 -41 -200
2391 -200 20 -39 86 110 -106 353 -223 73 92 260 -69 175 401 345 98 77 253 366 345 238 306 189
2413 189 248 409 71 184 195 271 301 303 372 254 119 -149 260 -102 254 124 -185 38 -185 -2 -168 166
2435 166 -266 -119 -119 -164 115 -181 -91 -523 -26 -285 -159 -251 -162 -59 -458 -116 -407 43 -420 88 -137 -37
2457 -37 -38 -198 -62 -122 39 -151 180 -232 -123 -40 -99 169 -355 158 -136 176 -56 123 315 67 138 30
2479 30 370 -87 244 216 154 209 59 405 244 114 -57 248 208 350 206 46 294 82 210 -86 114 -331
2501 -331 419 93 106 105 -10 80 -269 77 -313 51 83 -54 123 -316 -22 -176 -33 -226 -239 -108 -347 -75
2523 -75 -338 237 -305 -35 -171 90 -301 -295 -66 -192 3 -326 194 -114 -142 -19 -56 -26 -267 54 -96 283
2545B83l08k8M57k72Q4l19L07l14L96k24J71k2qL11o11Q03n33o0j00L08k13j18
2567a0K73m63M01k12K81Nj58J2o4o3P5J92l16R3j51J01m8j77N5j2K08j87R4k77
2591c48L22q3J51j07k11J41j57K17j33P1j36K48K6j55K53l76L11n03L01P6k45
2612c37L67j46O2n1K40k67Q0l2L63j99j25K86j64M2j39J17j10K22N9j53K28l59
2634a6L84m19J89L32l95L96k88oj11L92m42J67k34Q1J32j20R8k93M56m45L39r4
2656A03P7k11j49L53m45L11l34M37l94K1k5J35J89m07K53j83J49k66K58j54J9
2677b63L24l07J95j13J32k4m8n9k1K16l18K19j60M18k60K1K37j16J27j46J34k46
2699e8K95k33J73k33Q0J10n3K17m27L94J00k99J37Q9K30m29j26j52L98l9R6l70
$$ plain form
2545 283 -25 -53 404 132 216 -103 204 -110 286 62 233 211 203 514 -97 706 173 113 13 321 108 -10
2567 -10 263 -200 201 -11 270 275 117 129 65 2 77 269 -47 46 -105 -4 -52 -229 -174 -186 22 -165 -71 -348
2591 -348 -26 -109 42 -65 -276 -135 -292 -75 -208 -137 -273 -25 1 -154 99 -277 34 -469 -168 -92 -337
2612 -337 30 -116 -54 -105 135 -132 -52 -84 279 80 -45 241 77 119 -20 97 -13 209 268 115 343 -16
2634 -16 368 -51 138 470 75 471 183 177 66 458 16 183 -51 30 162 42 140 -153 303 -142 197 103
2656 103 180 -31 -180 173 -272 39 -295 142 -252 -231 -256 -121 68 -339 -86 -269 -120 -386 -128 -282 -263
2677 -263 61 -246 -51 -164 -32 -56 -104 -163 -184 32 -286 -67 -227 191 -69 -48 189 73 200 54 188 -58
2699 -58 237 4 177 -56 24 134 81 298 -129 265 365 66 203 292 522 93 -33 -185 213 174 270 -100
2721a00J78K29m20L47l36L86p0k0j16k80K30j42L54n18K35j2n4J26j00J8k37L98
2743I6l61L07k31j7J23j81K06k92K28k44M22m72K78Q1j61J63l01M45l62M53l25
2764a45K50j0j52J72m64M39k8L9p5J08j44j61L93k94K58k94K44n1M6p7P7J77j29
2787A79J27j55J23m39K39K11j13j14j11M39k81J85k57m1J23j2K07l52J90k47L77
2808B78m27K2N2n9J48k57K95j48K9l28L05j7r3K97J5k09m4J62j88j32Q4j4J81
2831d8k9l0m3J89l38J73n2J77o2p7K4J12M1n9j35K58o3K83k64m3P7K47l92J32
2855G8J05Kp9n3K14m68N49j55M7l51Q0L67k10J86l51J86J44k28JN2K53k48j4l32
2879b25M09j91O1l43L67o7r7J64j07N1j32K09k25q9J62k15J60j18J13l42K29Q8
$$ plain form
2721 -100 78 307 -113 234 -102 284 214 194 78 -202 28 -114 240 -278 -43 -55 -109 17 -83 -65 -302 96
2743 96 -265 42 -189 -206 -83 -264 -58 -350 -122 -366 56 -416 -138 -57 -218 -55 -356 89 -273 180 -145
2764 -145 105 95 -57 115 -349 90 62 101 26 134 -10 -171 222 -72 186 -108 136 85 131 54 131 308 179
2787 179 306 151 274 -165 74 285 172 58 -53 386 105 290 33 -8 115 103 310 -42 148 -99 278
2808 278 -149 -127 -75 -134 14 -243 52 -96 -67 -395 -90 -107 -200 97 112 -97 -141 21 -167 -299 -215 -229 -48
2831 -48 -77 -107 -150 39 -299 -126 -178 -1 -63 -140 -116 -4 37 -22 -157 101 38 321 57 14 91 338 -54 78
2855 78 183 185 106 53 267 -201 348 193 240 -111 -31 336 126 312 -39 147 291 63 64 116 369 121 107 -225
2879 -225 184 -7 54 -289 78 11 -86 78 -29 22 -110 99 -126 -215 -53 -268 -108 -226 -113 -455 -226 -138
2901a38O8J33k24L12m17L71m08L35j81o2l1J00M03m37K34m90M62Q1r6m9K29J47
2923C42n04K56q6K01R0k56R4m11J59k4M77j65j17K12Pj02k67J47k62L67j53KJ01
2946A08j7N8p7J73k03K86l89J51k37K0K58r7K48m34j84K23K67o0j11M4k16J77
2968a2j78K98l70L46l85R7M1k09L45k49P6k07O55n71J89K75l51J54J01J28j38
2989C5j16j51J98p0o2J81j20L05l22N14n26M11j72j96K24k26L78l70O1K77k11
3010D2J12j85K14j61L24n19M68O2j45n0k63N34k27k01q0K84k31j64L08p2Q6l59
3032b23L18k51M68n89K87mn9P5l23L11l41J93J33p6P0j32J71j08P3l09L51l72
3054c37J54O6k2L30m53M59k44J57l54K33r5j0k6K00N5r5J88m32K29j27L2K56j78
$$ plain form
2901 -138 -70 63 -161 151 -266 105 -303 32 -149 -211 -242 -142 261 -176 58 -432 30 111 15 -34 195 342
2923 342 -162 94 8 209 299 43 137 -274 -115 -139 338 173 56 268 275 173 -94 53 -209 158 5 7 108
2946 108 91 149 72 245 42 328 -61 90 -147 -127 131 34 282 -152 -336 -113 154 94 -17 27 -189 -12
2968 -12 -190 108 -262 84 -301 -204 -163 -372 -27 -276 -200 -407 248 -323 -134 141 -210 -56 45 173 35
2989 35 -81 -232 -34 -104 -166 15 -105 200 -122 392 -134 277 105 -91 133 -93 285 -85 -24 253 42
3010 42 154 -31 183 22 346 -173 295 357 212 162 -101 433 206 5 -75 209 -22 -186 122 50 136 -223
3032 -223 95 -156 312 -277 10 6 -53 22 -301 10 -331 -138 -5 -81 -11 -143 28 -80 -7 -316 35 -337
3054 -337 -183 -117 -139 191 -262 197 -47 110 -244 -11 -106 -116 -142 58 113 18 206 -226 3 -124 -92 164 -14
3077a4K01l21M48m47L77j08j50L07l43N40p09M11k67J20j14q1J65Q3L58k76j08
3098G2O1r4K36r3J23k94L5j27K36q2l3l19L39j86j81L99l80M36k88j6J74j23J2
3121i3m5J17k57L89l53J51r5q4L72k92J9R4Q1j64N9m0J55j49J93o6n9N1j31R4
3145e3k4PM4j78M52m59K08J22J38j05m9J14k44L40m87L10N9K02l07R9J14k11J96
3168B88l26L97l19L20j28p5J36m27K99p5N5k12O5R4O9j76k8q6J7K72m56K22j21
3191a95Q2j5j63K79o0K64l33J24L2l12L02j56j30j25K45J31P1p5n5J7j54Q0J42
3214dK92m27J22j60K85n3j25K03k42O5n4K56l00J81R7q0P9l68M50Lk0j06J28J8
3238B40m8k26J11J22Kq8k38L64l05O8J67J9k7J5l9j06K69l54j46R0L9K19j31k8
$$ plain form
3077 -14 187 -134 314 -133 244 136 -14 293 -50 490 -219 192 -75 45 -69 -150 15 98 456 180 72
3098 72 133 39 275 182 305 11 46 -81 155 73 40 -279 60 -126 -307 92 -288 148 -140 -156 18 -105 -93
3121 -93 -138 -21 -278 111 -242 -91 -186 -270 102 -190 -171 -77 4 -160 -101 -141 14 -135 58 -8 -67 -16 -147 -53
3145 -53 -77 -70 -26 -204 248 -211 -3 119 257 152 103 217 -27 313 -174 136 195 397 90 189 303 92 288
3168 288 -38 359 40 360 232 157 293 -134 165 90 145 -67 -2 92 161 -15 -43 -129 -112 160 -296 -74 -195
3191 -195 -113 -128 -291 -12 -72 192 -141 -17 15 -297 5 -151 -281 -406 -161 -30 41 -34 -89 -72 -226 -146 -4
3214 -4 288 -139 -17 -177 108 55 -70 133 -109 -44 -98 158 -142 39 136 56 135 -233 217 220 200 94 222 240
3238 240 192 -34 77 199 201 113 -125 239 -66 2 169 188 161 176 137 31 300 -54 -200 -110 -71 148 17 -11
3262a1k1K98j85k93K88j23P4l96L74j39L2L6L2k33j5k3J37L29k58J55j70J03J5
3285Fr1m8o7K65k78J40%j94L42r6J08m17J03J0J99m9J19l4N9q3O7K18k68J92l
3310B00n4j56M2K39l29ml7M22n9j12o5J09R9k38J08r6K16k53L0jl2N2k21L89m69
3335b20K99j89M5J91m1K95n36k0%p6J77o3q9K10k0qo2mk09L42l89L7J9L58k18
3360a71J78p7o0L0M7J54j03N2j09J43j33K51j81k99K94K33k31K7j11O3P1K55n2
3383B71j01m4J92k23j37K6L71k03m9J60k98M45l58K31l17J04k28L31j21k61J21
3404h8J03m3j11L49m1l16L69j98p8J7k0O4p9J0O4j12J71J07k32k1P2l5K6J01j24
3429d5O6k52Q1K66p5K17m67J96j63J41J0k13P9p4K30k94M00j95M3k02K86p2J82
$$ plain form
3262 -11 -32 266 81 -212 76 -47 27 -369 5 -134 -102 -66 -34 -267 -282 -305 -168 161 -97 58 -112 -9 6
3285 6 -85 -133 -200 65 -213 -73 -73 -267 75 -21 87 -330 -227 -217 -18 -67 52 18 77 -6 61 279 11 203 200
3310 200 146 -10 32 271 -58 -62 -99 323 264 152 87 196 295 57 165 69 285 32 62 61 29 81 -140 249 -220
3335 -220 79 -110 -65 126 85 380 -156 -176 -176 -252 -75 -138 -227 -17 -37 -45 -107 -111 -320 22 -367 -330 -311 47 -171
3360 -171 7 -70 -130 -100 -53 101 -2 50 -59 84 -49 202 21 -278 16 249 18 45 -66 -3 68 323 271
3383 271 170 126 318 95 -42 -16 355 152 103 263 -35 410 52 283 -34 70 -158 173 52 -209 -88
3404 -88 15 -28 -139 210 169 -147 222 24 -54 -37 -57 7 -72 -62 2 -110 61 168 -64 -85 -13 -48 -22 79 -45
3429 -45 21 -231 -150 116 41 258 -209 -13 -176 -35 -25 -238 -159 -233 -3 -297 103 -92 -49 -251 35 -37 145
3452A45J94m17R6N7n6J61l48K47l48N54k10Q3M2j54M3j67L17l18J47R3k73K28
3474A16PJ30l60L53m64M19K56l57J53l4l7k62K1o9K92k77K3Q9j96L11k48J44k65
3497b55K63l11L84j75p5r2J38J11j50M8Q6J4q5J58q4Pj93L6J28M7O3r0k19R8q7
3522b35K96p7p1P8J20K01j67j44k15R0K64J80l61K90k05K8n7l4K08j37J3j79K37
3545A23r6Q7j03l1L43k56k07O8Q8J29r8m0R1k8q9K19l42O9J57j91L05j98l9j43
3569a82M8j8J27k0k78K34j35J88k29O6k6m8k5M71k21k94J63RL41l70K00J04r3
3592A2O3j09J16j7l04J34J60J21j60K49l27K28k5k11K04l03J36k79L08n3J93q1
3614E5J89j46j6K37k07j31J88j90J7M52l53k01O2M5o2r0K51j58J99k53j36L52
$$ plain form
3452 145 339 -78 18 75 19 180 -168 79 -269 285 75 158 200 46 89 -78 239 -79 68 161 -112 116
3474 116 123 253 -107 246 -218 201 457 100 253 219 182 -80 -59 -128 164 -113 -90 -1 -197 114 -134 10 -255
3497 -255 8 -303 81 -94 -169 -261 -123 -12 -162 -114 -28 -14 -99 59 -25 -18 -211 -175 -47 0 63 -27 -246 -148 -235
3522 -235 61 -16 -87 -9 111 312 145 1 -214 -124 140 320 -41 249 44 72 15 -19 189 52 65 -114 123
3545 123 27 114 11 -20 323 67 -140 -72 16 145 47 7 98 70 -19 200 -142 -73 84 -107 198 0 -39 -182
3569 -182 -134 -152 -25 -45 -323 -89 -224 -36 -265 -199 -225 -273 -298 173 -48 -342 -179 -170 171 -199 1 105 12
3592 12 75 -34 82 65 -239 -105 55 176 16 265 -62 166 141 -70 134 -169 -33 -312 -4 -57 136 55
3614 55 244 98 82 319 112 -19 169 -21 -4 448 95 -106 -44 1 -61 -151 100 -58 141 -112 -248 104
3636A04j69K55k01M5j31J31j78J70l05J62J95l77L35j84K01l77K87r8j91L75r2
3657d3O8jj00Km9J50L3K28m05J97o6R2k41K75J31k23l98J26L34j75j4QM41m43
3681g3K19q4m9l0J07N6j48L16k52K04k85J03k50J78Rj86L18o6k68J41M28l72j
3704A5Q8j16k0J8j81L05l2l75J76L41k87J89j86l7j94N1J96k40L49K23j07n12
3726c36L61P0l62K27j04J30j29K3NK9rj17J67m15K82N0J35k25J42J66n8j01o7
3749a36K52k00O5Q6J36j22l82K91N2Q7j08R6l6j03N9J77j30o8L56m16o6n1K01
3772D0P8j12K11l90K98j10j09J63jl9j29K96j76K10l78J00j86P6L19l64K65M7
3794A09j32l31M80j9j17j74J07J92k63K27m13O63n38J05L7j42L9k8L23k00K40
$$ plain form
3636 104 -65 190 -11 34 -97 34 -144 26 -279 -117 78 -299 36 -148 53 -324 -37 -135 -326 49 -43
3657 -43 25 24 -76 -74 -123 27 60 288 -117 80 14 106 -135 140 271 48 -350 -224 110 -65 -79 -71 370 -73
3681 -73 146 62 13 -17 90 146 -2 314 62 266 -19 84 -166 12 21 -165 153 87 -181 -40 388 16 15
3704 15 103 -13 -33 -15 -196 109 77 -298 -122 219 -68 121 -65 -102 -296 -245 -49 -289 60 283 176 -336
3726 -336 25 95 -267 -40 -144 -14 -143 -120 -115 -86 -95 -212 -45 -460 -178 -128 7 -218 -76 90 32 -69 -136
3749 -136 116 -84 -19 67 203 81 -301 -10 42 129 21 117 81 -22 37 214 84 16 372 -44 -110 -161 40
3772 40 118 6 217 -173 125 15 -94 69 68 29 -100 196 20 230 -148 -48 -234 -158 161 -203 62 109
3794 109 -23 -354 126 107 -10 -184 -77 115 -148 79 -334 329 -209 -104 -67 -209 -170 -198 125 -75 165
3815A65k4J08k46O4J51j75k27j06L41j56j7J32p7K86k54K04k27J07J26J6k65J69
3837I5k1O0J00k39P1J55R1k24l2j66J69J82l19K18rl7j29Q7q1J87J05l40N2o9
3861i4Q3J0j11J65l26K7K45J14l30K20j85r9O8j58L46o7R6k04R9J91Oq1J61k22
3885d6m1K59k13J40j39k34J34l1P4p7K49p4P4j96J15o3J47N8m4Q7Q4l11N0Q0K02
3910B84k75J69k57L10j91m5q5M14k43j04P8K7J75j43Q1k47J17o3j24J82n5k9o0
3933h4J17J41j37r1L0L5k24J91J5k47q9M07j45k00J14j4j9P9Q7Q8j13K7LK18l18
3958a29RK42o1j50J37q6K6R4q1J53k02j08K27m2k7J49j10n8N5j00J54Pj97R2O1
3983E5J03k59L83l12Q9K3K54k77j20L08l78L07j89M4j08J29L5o9K30j90K11l59
$$ plain form
3815 165 141 249 3 67 218 43 -184 -290 51 -105 -122 10 -67 219 -35 169 -58 49 175 191 -74 95
3837 95 74 134 234 -5 66 221 312 88 56 -110 59 241 -78 140 131 94 -35 52 -29 158 263 -77 -25 -94
3861 -94 -11 -1 -112 53 -273 -246 -1 113 -217 3 -182 -281 -213 -371 -25 -92 4 -200 -101 90 96 15 176 -46
3885 -46 -87 172 -41 99 -40 -274 -140 -171 -97 -174 75 1 75 -121 -6 -69 78 136 92 179 263 -48 2 82 284
3910 284 9 178 -79 231 40 -5 -90 324 81 -23 55 82 257 114 195 -52 65 2 -122 60 5 -24 -84
3933 -84 33 174 37 -54 -24 11 -213 -22 -7 -254 -343 64 -81 -281 -167 -181 -200 -121 -34 54 -59 -32 -29 189 -129
3958 -129 -120 122 61 -89 48 -38 -12 82 1 154 -48 -156 71 29 2 151 41 -17 38 -62 92 99 -98 -6 55
3983 55 158 -101 282 -30 59 82 336 59 -61 247 -131 176 -13 31 -77 52 87 18 248 58 269 -90
4005i0l1J57K0j32Ok2j6J72n4r0J84m4j75K41j07j70n8L6J4J75R3m0j92O2J85
4030A24r7k11PJ27K10k71o1L71j95pk15L25p7j92K12k7Q2j69l2q6M06m75L33p4
4054HR2j33kL44k36j13P3P6j35J92n3k9K43k40ML12m50J53O3n8k42M29l27K91
4078B62j84l6P7m73L33k86N03l84J81r8J37j35J19%O8J11k69K62m33L71ln4r5
4101b6p3N6p1J14j47K3k1M7J30n3p9P5J3k57J92N2P5K1j71J59J53k37j46K02j23
4126i2K4O9M4q2J02J12k67J40j4J12l78L74R0o03L56J7J50J3j09L5N8k31k77L01
4150e6K54r1j05J69j87K4J58k08O7j55J49j16J17J08j35qJ29j04j67L5R5k0J11
4173F4j37L4j87L5J37M5qKKj37J81j04N4o4J75j48q3J60n7J33o9M1lP0l13Q4J71
$$ plain form
4005 -90 -121 36 56 -76 -70 -92 -108 64 10 -80 104 60 -115 126 19 -151 -209 -173 -159 16 109 69 -123 -61 124
4030 124 27 -184 -177 -50 160 -111 -172 199 4 -3 -218 107 30 -162 50 23 105 -64 -96 -182 224 -251 82 8
4054 8 100 -33 -35 309 73 -40 33 109 -26 166 113 84 327 87 91 403 -47 106 169 111 -131 298 -29 262
4078 262 78 42 119 -354 -21 -307 196 -188 -7 -105 32 -103 16 16 84 195 -74 188 -245 126 123 69 -26
4101 -26 -99 -43 -114 0 -147 -124 -145 -98 32 -21 -100 -25 -12 -269 -77 -25 50 71 -100 59 212 -25 -171 31 -92
4126 -92 -68 1 45 -37 65 177 -90 50 36 148 -230 144 234 -369 -13 4 154 167 58 93 151 -80 -357 -56
4150 -56 198 107 2 171 -16 8 166 -42 25 -130 19 -97 20 128 -7 -15 114 10 -157 -122 -27 -47 64
4173 64 -73 -39 -226 -191 -54 -9 -17 -15 -13 -150 31 -73 -19 -83 92 -56 -139 21 -36 97 28 69 66 136 -177 -93 78
4200G8j82K23k14J34n7M2j26J1l5R9O4j53O4J58M3k2k13M9j20L18r6k9j12j06
4224a82Q3J43Q0O4l95L63k6p4j2j1q2q9K78j89j0p0K91l67J62M8J27l37J90k00
4248b15M07k63L7r1J04L9j81K83l17Kq5pP6J66k2q8K52l21N0R7mJ8J21k88J19
4273a11L61l14Q3lJ35l85K76p8J11O0p6j00%J34o2J72r2n2r7N9R9K9j79J06o2
4298A4NJ22j62j1J68l74L23j70K15j38j20L24N7m49K50k08P1J75k46j26J51L6
4320i3J75M0j39p4J60j90j29K15R0j13K02p1j94M0p8Q7Q0J01j23M9l3J85N1l36
4344i8N4lK9J79j57o3J25J03j07J6N5O1k12M2L15m77K00l45L39j17R0pP9J40r9
4369A42L0j41j1j07Pj29L75J42k23J36l25J02p0j18L27l44K54j2m9J55m47J64
$$ plain form
4200 78 -104 119 -95 39 -18 24 -102 -91 -126 -27 37 -116 -52 106 149 127 -86 -37 -157 161 65 36 -76 -182
4224 -182 -99 44 124 188 -207 156 130 56 44 33 -49 -138 140 -49 -59 -129 162 -205 -43 5 132 -205 -15 -215
4248 -215 192 -71 -34 -125 -21 18 -163 120 -197 -195 -280 -287 -211 -45 -67 -155 97 -224 -174 -77 -81 -63 58 -230 -111
4273 -111 250 -64 19 16 151 -234 42 -36 75 135 59 -41 -41 93 31 203 111 59 -38 21 120 149 -30 76 14
4298 14 19 141 -21 -32 136 -238 85 -85 130 -8 -128 196 253 -196 54 -154 -83 92 -154 -280 -129 -93
4320 -93 82 122 -17 -91 69 -121 -250 -35 55 -58 144 73 -121 -81 -159 -72 8 109 -14 35 2 187 238 -98
4344 -98 -44 -47 -18 161 4 -59 66 169 62 78 133 194 -18 24 339 -138 62 -283 56 -61 29 22 101 241 142
4369 142 172 31 20 -87 -80 -209 166 308 85 221 -104 -2 -72 -190 137 -207 47 35 -14 141 -306 -142
4391a42P6r6j87N89j30r7m2L8Pk37J07n5L19m40K39j99J58q9K31l3j38l8N3R5
4415a1k5K1Rk17M48k96L7k8J50j50R3l12K07L95l99K29k11K45l37J66J19l70M2
4438a95l6L87k54L1J80K8J92k41j71K69k64K16k03J11p5M3o8J21j24NJ77k63o4
4461a98K56J81k26lL6J64l30q0K14l44L23K2j99L9O7k2O2k2Q7J83l74J83j62K2
4485a21J87j40J29q3klPR2P1j83Q9J03L6l20M5J87j81J37K4K4M7K29l41o2J83
4510A54j54J36j79n5R2N5R7j42K32j17J1j23o1l1k8J15J84N4m40L44l5k1k41L81
4534B28k08L7J6j1j63J05L8k05J40k00J96K1n0N6j7K30j91j94K08k35R7M7K36
4557A81k58J09j68J54k97J27J25q5K20o4Qo3J1j42P7L3Q1l5k23L28k62J84J28
$$ plain form
4391 -142 -66 -162 -349 240 110 13 -29 9 16 -221 -114 -169 150 -290 -51 -250 -92 -181 50 17 -121 -159 -106 -11
4415 -11 -36 -15 -6 -223 225 -71 -34 -62 88 -62 31 -281 -74 321 -78 151 -60 185 -152 14 133 -237 -195
4438 -195 -231 156 -98 -67 113 141 333 92 -79 190 -74 142 -61 50 -25 18 -50 71 -53 -48 129 -134 -198
4461 -198 58 239 13 10 46 210 -120 -200 14 -330 -7 15 -184 -145 -78 -100 -38 -60 27 210 -164 19 -143 -121
4485 -121 66 -74 55 -28 -30 -33 -26 66 137 -46 43 146 182 -138 -93 94 -87 50 74 98 145 374 33 -29 154
4510 154 0 136 -43 -98 -6 49 146 4 236 119 130 7 -54 -85 -113 2 186 240 -200 144 109 88 -153 228
4534 228 20 57 73 62 -101 4 42 -163 -23 -223 -27 -6 -56 0 -17 213 22 -172 36 -199 -102 -55 181
4557 181 -77 32 -136 18 -279 -152 -27 -112 108 44 52 -11 0 -142 -65 -32 49 14 -209 119 -143 41 169
4580A69K4Pl32Q9L46j18k62K2K58j42J14l08oJ81K1N5m11L39J4K7j33k44J43J8
4604a29o6J64J8j28J26K9J15j86M2N3k46J2M5J00R4J03j86r8R1J14p7O6l11K96
4628D1j04J7L08j99j87J75k3r0n8J68p8J53l4l3k41j4J48j15J13L7J67L3k50P3
4652GNJ07k08K55j21J73l01R5l8j29J17K9j55K66L2j41l29K88L72j99k85L8J04
4675a8J2J6J06l29J23nK9R8k90K30j6K31l25N2L26k36j60J80j1j18o9k1K55j25
4699f5r5K01r7O0l19L43%O8k06J7r7O7K13j62J98q4J28k31M4j9J79k97K68k38
4723a24Q3J48L4k36J39n0r1j99K88L3p3J04m1O9m6Q2j97L7K57o7j64J30o8k27
4747a79J86j70M41l6l30J03K44r3l29N3J35q0o5J28R4j02j11Q4j43K49j25O6j35
$$ plain form
4580 169 193 200 -132 -43 303 185 -77 -55 203 61 175 -133 -139 42 63 118 -293 46 60 87 -46 -290 -147 -129
4604 -129 -195 -31 -13 -141 -15 14 129 -57 -15 38 -208 -196 -151 -51 43 146 -40 -138 -47 67 -10 56 -255 41
4628 41 -63 -46 262 63 -124 51 28 -62 -120 48 -30 123 89 56 -185 -199 -51 -166 -53 -16 151 184 -66 7
4652 7 12 119 -89 166 45 218 -83 12 -26 -155 -38 -9 -164 102 134 -7 -336 -48 324 125 -160 -122 -18
4675 -18 -6 10 116 -213 -90 -95 -66 32 -258 -28 -44 187 -138 -86 240 4 -156 24 13 -105 -174 -195 60 -65
4699 -65 -160 41 -56 4 -315 28 28 96 -110 -93 -190 -123 90 -72 126 42 170 -61 -17 -36 143 -154 114 -124
4723 -124 -41 107 141 -95 44 -6 -97 -296 -8 25 -48 56 15 84 38 120 -77 -40 217 150 -14 116 48 -179
4747 -179 7 -163 278 242 -88 15 259 166 -163 -110 25 -55 -120 8 102 0 -111 -27 -170 79 -46 20 -115
4770a15K62l06K24j55k78K42J18K07j94n5J59P7k99p9P8K29l94L37k69K41J03
4791A33l89M23kk04j91K68K4Q5m95M29m3R0j01J33mk18R4J03J45k87K19l3k19
4814d0m9K2J8J05j33K68L2m0k18J96q5N6k3N7k22l4K24m4j40k28L91J54m55J89
4838AO4o1j46J50N4M1j54M9N7k64L37k06ML09m50J73k16K54Mj23Q8J56k22J55
4862E4j2k95L13k88L73l46J05M3l4m0J08N0k21K40k4L7j60j48L60M0j21j29j8
4885a13J54M6k67J03K35j46l66L41J67r3j74J87m0K78k23k18M6O8k3R5J60j64
4907E3j02K3Q8Q4j93L84r8k71k93M76l52K35l35J60j32K45j82l3J83P3j45j90
4929c22L37j56K19o4o5j2N8J8m3J49k55L15k29k03L99r1K04m90M21k88K01m3N9
$$ plain form
4770 -115 147 -159 65 -90 -368 -126 -8 199 5 -50 109 186 -113 -192 -114 115 -279 58 -211 30 133
4791 133 -256 167 165 -39 -230 38 62 147 -348 81 38 128 27 160 156 -62 32 135 280 -7 212 179 -40
4814 -40 -89 -67 -49 56 -77 191 223 183 -35 161 76 132 109 166 -56 -90 134 90 -50 -278 113 267 -188 1
4838 1 65 4 -142 8 62 103 -51 -2 55 -209 128 -78 -74 235 -215 -42 -258 -4 0 -123 -35 121 -101 54
4862 54 42 -253 60 -228 145 -201 -96 -53 -87 -127 -19 31 -190 50 26 63 -97 -245 115 155 34 -95 -113
4885 -113 41 87 -180 -77 158 12 -354 -13 154 61 -113 74 34 312 89 -129 -83 -15 -38 57 217 53
4907 53 -49 -26 62 146 -47 337 239 -32 -325 151 -201 34 -301 -141 -273 -28 -210 -243 -60 13 -132 -322
4929 -322 15 -141 78 14 -51 -63 -5 13 -30 119 -136 179 -50 -253 146 55 259 -231 190 -98 103 60 119
4952A19k72J67p2r1J83m1kj03k6K93j87q0J99J56J58m99L0K86l22J19J69j69m9
4975c4N9j56J76kJ46j08l1j03L50m10j14J99J8P1j77J09q3J05J21oj06J53l62
4998a85J94J34k76K34j83J68j57n0q0oR4J9K02k04J22K7m6J22n0m64L01J24j59
5021a19N2Q9%k9j4NO7j32K05j95K13k11J49J02P6l06J62j48j04K33j33j79L15
5044I8j81n8J27J67J15k42J99k15P5J15k30J44Oj90N4r0K69j80J78j55J05j83
5066g2K01k90J46k26J48K41j74N6j0Kj53J10P1j28j68M6K72k62L7J51k9K3k78
5089b86N87l65J79j86q2k4L61l31j61L73j27K97k07M8j47R0Q2J63l1r8k63J16
5111a2k2N4Q9j30Jk9J44j46J31N3k69L03p3j97J5l8L05j4k59JJ66r7J47k46J91
$$ plain form
4952 119 -153 14 -58 -149 34 -7 -9 -112 -138 155 -32 -112 87 243 401 -98 -68 218 -104 15 184 15 -34
4975 -34 25 -131 45 43 189 81 50 -53 297 -113 -227 -28 -10 61 -116 -7 -90 15 136 130 24 177 -185
4998 -185 9 143 -133 101 -82 86 -71 -121 -201 -207 -113 -94 108 -96 26 53 7 129 79 -385 -84 40 -119
5021 -119 -67 22 22 -7 -21 -16 51 -81 124 -71 142 -69 80 182 258 -48 114 -34 -138 95 -38 -217 98
5044 98 -83 -141 -14 153 268 26 225 10 85 200 -30 114 120 -70 -16 -106 163 -17 161 6 111 -72
5066 -72 129 -161 -15 -241 -93 148 -26 30 20 22 -131 -21 50 -78 -246 -200 72 -190 -153 -2 -31 -8 -286
5089 -286 301 -64 115 -71 -153 -177 184 -147 -308 65 -62 235 28 76 -71 19 101 264 233 135 -128 -12
5111 -12 -34 20 109 -21 -20 -49 95 -51 80 133 -136 167 94 -103 -88 -126 179 165 -94 -93 73 -24 123 -123 68
5136F8N6L8k88n9J66J04q9o5m1N4j23K09l4k56K53lO8j55J86j34R3j28J68k28
5160a40k0j98N27k07k30K85Q5k16K27l26J49j49K82p6j78R1J88P7l13L5J40p6
5182d3K20j85l4J90j08m4j3l4J22J16L7q8k7J2j63j56K33k41L8M0J81J22j27O8
5206A16k5M2P1l04P0j62J17m2J58N9j45o9N3R9k15L18J50m85L23k23j94J74K8
5229h6J63p6N5j60k06K51J53k25O5j4Q1j55L09l16J21qk06L21k74L10j3k13j96
5252c19M20O2m13K24O7OP1j98O7J68j17Nm%r8M5n2qJ61M8k18L3k38M24p3RJ26
5279A98k90J48j84K72j16M8m0p3Q9J43k0k12j57j3J69o8K03p9k09L53q5J33l71
5302a61m7K61j03j37K22l2k38K42p4kN3N2j81K25j58R4k69K40J08j9p2k59N5K22
$$ plain form
5136 68 124 162 -126 -185 -19 85 -4 -69 -110 -56 -179 30 -4 -260 -7 -10 58 -97 89 -45 48 -80 88 -140
5160 -140 -160 -358 169 -38 -268 17 102 -114 113 -213 -64 -213 69 -7 -185 -94 94 171 -142 -107 33 -43
5182 -43 177 -8 -42 148 40 -4 -17 -51 71 187 224 136 109 121 -42 -198 35 -206 -168 -128 53 175 48 116
5206 116 91 133 204 -100 -30 -192 -75 -117 41 100 -45 -114 -61 38 -177 141 291 -194 129 -94 -288 -114 -86
5229 -86 77 1 56 -104 -310 -59 94 -131 -66 -80 1 -154 155 -161 -40 -48 -254 67 -207 103 90 -123 -319
5252 -319 101 163 -250 -26 41 47 118 -80 -13 155 38 43 39 39 -59 -14 -66 -74 87 135 -83 -50 -288 136 63 72 198
5279 198 -92 56 -128 144 28 76 36 -37 52 195 175 -37 -194 -207 -38 -106 97 18 -191 162 77 210 -161
5302 -161 -208 53 -50 -187 35 3 -235 7 -67 -69 -16 36 -145 80 -78 16 -253 -13 95 76 4 -255 -200 22
5326B2r0J99j99L2J69j78J49o7N9J72j22k9j92K20m0J10o7j09n6k3K93j77J30
5349B06j18j6Lp4k99M10l08J90k65L51j24j92J17o1M79m18J01j04K29j01PKl32
5372c17J21J49K09j49p2q0JJ48j3J1r3R0J09j21q3J63j17O5j59L01k77n7N4L2
5396h5O2j5l5L93l75J47j02J04j83LJ81j17L7M8j18L2m0o1l1J02P9N0k10M1k2
5421a15Q4J28M0l22NJ01J12P2l90K35j07L1l9L10O7k75J23l14J83j94J79Q9q1
5444g8k6Q6LM4MKJ34j35k77K32j70L31l37j08M92r7k46j27K30j17P6J00PK5l32
5469b84K97L9n0J17l20J02j4L0R2j10K68Q6l30K52l43K31J33j50j23r8R0J66J29
5492B10Ml37J32j36J7J30o7q6P8P9K2J14j43J37j68L9k61J54Q7l07K68l6J20j25
$$ plain form
5326 22 -68 131 -68 -36 133 -45 104 37 96 268 146 117 -75 145 105 215 148 39 -17 -40 253 76 206
5349 206 88 72 75 1 -298 112 -196 -6 -271 80 -44 -236 -119 -180 299 -119 -18 -122 107 6 13 15 -317
5372 -317 -196 -47 162 13 -59 -139 -138 10 -3 8 -85 5 114 -7 -90 73 -44 21 -138 163 -114 -171 -117 -85
5396 -85 -23 -38 -73 320 -55 92 -10 94 -89 -86 95 -22 15 63 -55 -23 -63 -124 -155 -53 26 76 -134 -93 -115
5421 -115 -31 97 137 -185 -180 -79 33 105 -285 -50 -157 -126 -165 145 212 -63 60 -254 -71 -265 -86 3 -78
5444 -78 -104 -18 -15 29 33 35 169 34 -243 -11 -181 150 -187 -295 197 100 -146 -273 -43 -160 -84 16 23 48 -284
5469 -284 13 52 2 119 -201 -99 -113 -83 9 -101 167 253 -77 175 -168 63 196 46 -77 -175 -85 81 210
5492 210 214 -123 9 -127 -110 20 -47 -133 -55 24 46 160 17 154 -14 25 -236 -82 5 -302 -34 -70 50 -75
5516g5P6N5j85p8K21J7K04j65l1m5j10J50j9l11J70QK4J63j4k01JJ20j5O3k6n6
5542e9K70k67k66K86m3l7oK75j40J34j38J31J09l02j2P2k97O00m92L19l29K16
5564B4k28L18j77J15p3k75L53j71J04p9J42m4Kn8R6n2j3P5k01M3N1M7J44J3j93
5589c7r9n5K93M9l68J88N5j17j1J91o0j80J54R2m1j06p9J69j55J93j00J09m13
5612c28L09k92K6L93K2j5Kq7r0K32o4r4O6J20m40J25j4J21R8lj26L27k85P2K28
5637C03k75j09J79m5J5k16K71n9j04J47j2m2lq0Q0j4o3Q0mL5LK8p7j53J41M8j35
5664f1L22j73p0j31Q9l6j3J42O7O5l88j6O9k6O6l0K32j72J78l5mj4q3j00L5L00
5690B13n4k74P6J1P5k49L26l71J23J26j8L7q0K17j01J56j87n2J74K3k47L63m60
$$ plain form
5516 -75 1 56 -129 -207 14 31 235 70 39 -6 -116 34 15 -296 -126 -118 -94 69 55 -146 -145 -25 -40 23 -3 -59
5542 -59 211 -56 -322 -36 -79 -116 -122 153 13 147 9 140 249 -53 -65 7 -290 310 -182 137 -192 24
5564 24 -204 114 -63 52 -21 -296 57 -114 -10 -89 53 9 11 -47 49 -3 -16 59 -142 -99 -48 -1 143 156 -37
5589 -37 -136 -191 102 151 -217 -29 26 -91 -102 89 29 -151 3 95 54 -52 -131 38 -117 76 -24 85 -328
5612 -328 -19 -311 -285 108 130 115 117 30 -60 172 108 14 80 200 -240 -115 -129 -8 90 87 -39 288 3 75 303
5637 303 28 -81 98 53 68 -148 123 64 -40 107 95 53 50 -30 50 36 -27 53 49 84 87 115 38 -115 26 74 -61
5664 -61 261 88 18 -113 -24 -60 -73 69 136 201 -187 -203 -134 -160 -94 -124 108 -64 114 79 75 61 -22 -122 -87 213
5690 213 159 -115 -39 -28 47 -202 124 -247 -124 2 -16 21 -59 158 57 213 26 -26 148 171 -76 287 -173
5713a73L03k37J21n3P9j08Q6J29o1j29J8O1m9j92K31Q1j46K7j20K02k20P2M6J93
5737A61q5n2n2K3j30j4J76Lk06J29k82K40NL24l20K46j58L8L1j28k80L98r1J37
5761A13m7p5K68l26j64p0L1J40J99J08m2p5Q8k12j30J95l4k11K29m0J2j11L00
5784A46j7j37j08J70k54p1K77K79j62l07K79j02nJ78k87O3pR8j58K48j23Q4n4
5807C0k95K76n1J12k18L67j97K0o4Jm3RK51P5l6r3l10L26k57K55l93J40K11j26
5831a0M6l34L10OJ12k38L07k56m0N4jOj0Q6j64M1n0j31J95q4J08K13l41J05J60
5856I0k98L16O5j83J56k7Oo0J33k58J01m2L6Q0J76l84K25l6k58K21k37K5J66j8
5880ek28K00J65j84R2J0k53L35j32L3j71J56m2J6J38k22J51k45J81qj50L72k97
$$ plain form
5713 -173 130 -107 14 -39 40 -68 18 147 86 -43 -25 36 -13 -205 26 107 -39 -12 -132 70 -150 -78 -32 161
5737 161 76 24 -28 -5 -135 -149 27 30 -176 -47 -329 -89 -84 240 -80 166 8 46 77 -51 -331 67 -24 113
5761 113 66 -9 259 -67 -231 -301 -270 -130 69 177 135 60 148 -64 -194 1 -33 -244 -15 -55 -43 -154 146
5784 146 129 -8 -116 54 -200 -271 6 285 123 -184 95 -7 -12 166 -121 -58 -65 33 -125 123 0 84 30
5807 30 -265 11 -40 72 -146 221 24 44 -20 -19 -62 -53 198 273 237 144 -166 160 -97 158 -235 -95 116 -10
5831 -10 36 -298 12 18 130 -108 199 -57 -97 -43 -44 -38 -48 38 -126 -85 -135 -266 -71 -155 -47 166 -175 -70 90
5856 90 -208 108 173 -10 146 119 125 65 198 -60 41 -1 35 115 291 -93 132 96 -162 59 -178 -153 13 -5
5880 -5 -233 -33 132 -52 40 50 -203 132 0 33 -138 18 -24 -8 130 -92 59 -186 -5 -13 -163 209 -88
5903h8N9q6M78n04n7K57j46K03N7r0l34J62Q3Rk8Q5o5r9J12j35J15J6L8o0K1P2
5929G5M9k28J7p2K51j30j87J47pO8M3k1J22j04j91J57j60K73p7n3o4K01J28j45
5953I2k90M14l07K11j76jO9r6J5l3K26j69l3j83N49j22k92K63j14L9R0j87M0R5
5977A00P7p5K2k17K07R4k64J19o6J45j87J76j16o1j00J44j4Q9l06J12j39K60j64
6000a64l6L4k03M24m9J75P3k03Lk5j25Q6k1P7J02k12j2J02O6LQ2J05k82n1O5r8
6026h4M0j25J09P8q0J14j49K35k47J10R7l2k71J72%qm1P1LK74m93L80o6p5L5k22
6052a75M5P4k0n4J36O4j49n7L12j69m6j33K23J04mj04j10nr1K32k35L23j40p6
6076e5k16J33K9L4p5Q6J42q4L7J51j79j9L5M7j24J19m5K12j55MJ14l16L44m32
$$ plain form
5903 -88 -29 -115 363 -141 -198 59 -87 116 173 83 -251 -89 -6 3 -25 60 -5 -104 8 -127 -12 4 42 -18 3 75
5929 75 124 -104 -87 -159 92 -38 -225 -78 -85 -17 26 5 127 23 -168 -11 -171 102 25 -28 -92 109 237 92
5953 92 -198 216 -91 120 -56 -57 12 -84 -69 -102 124 -45 -78 -261 288 166 -126 137 23 62 152 -35 5 100
5977 100 177 102 124 -93 114 208 -56 63 -3 142 -45 131 15 -46 -146 -2 -16 73 -233 -121 -260 0 -164
6000 -164 -200 -166 -369 55 6 181 254 51 54 29 -96 -10 -31 46 148 -64 -76 26 92 95 177 282 0 -51 14 -84
6026 -84 -44 -169 -60 18 -62 52 -97 138 -109 1 98 66 -205 -33 -33 -41 -82 -11 -8 266 -227 153 87 12 47 -175
6052 -175 -130 -56 -76 -130 6 70 -79 -136 176 7 -39 -172 51 155 151 47 -63 -68 -159 73 -162 161 21 -55
6076 -55 -271 -138 -109 -75 -150 -64 78 -6 31 182 3 -16 19 66 -58 61 16 228 73 77 191 -125 219 -213
6100b13J78J3R1o6J12Ml04M19q2j53N3K91k08j10J40q9j04N0m2Q3j83J19N6J48
6124B03k51K4Q6n9j07l8J29l6J01Q9j61J0J35k50N0J61k2J7j14K8j67J30J83j96
$$ plain form
6100 -213 -35 -22 69 3 115 119 -185 234 152 -1 52 343 135 25 165 76 -28 22 -20 63 -120 -1 55 203
6124 203 -48 -24 62 3 -104 -142 -13 -49 52 141 -20 -10 125 -125 -75 86 64 81 -33 -5 -172 -42 141 -55
$$ [...]
8191a02
##END NTUPLES=NMR FID
##END=
