##TITLE=1H_Pr AM-8
 CDCl3,8 sc, 
 11.03.2021
##JCAMPDX= 6.0         $$ Bruker NMR JCAMP-DX V2.0
##DATA TYPE= NMR FID
##DATA CLASS= NTUPLES
##ORIGIN= UXNMR, Bruker Analytische Messtechnik GmbH
##OWNER= root
$$ XWIN-NMR		Version 3.5
$$ Thu Mar 11 11:56:58 2021 Russian Standard Time (UT+4h)  she@DPX200
##.OBSERVE FREQUENCY= 200.131506
##.OBSERVE NUCLEUS= ^1H
##.DELAY= (6, 6)
##.ACQUISITION MODE= SIMULTANEOUS
##.ACQUISITION SCHEME= undefined
##.AVERAGES= 8
##.DIGITISER RES= 18
##SPECTROMETER/DATA SYSTEM= spect
##.PULSE SEQUENCE= zg30
##.SOLVENT NAME= CDCl3
##.SHIFT REFERENCE= (INTERNAL, CDCl3, 0, 15.7039)
##AUDIT TRAIL= $$ (NUMBER, WHEN, WHO, WHERE, WHAT)
$$ ##TITLE= Audit trail, XWIN-NMR		Version 3.5
$$ ##JCAMPDX= 5.01
$$ ##ORIGIN= Bruker BioSpin GmbH
$$ ##OWNER= she
$$ F:/spectra/data/she/nmr/H-F/1/audita.txt
$$ ##AUDIT TRAIL=  $$ (NUMBER, WHEN, WHO, WHERE, WHAT)
(   1,<2021-03-11 11:55:44.98 +0400>,<she>,<DPX200>,
      <created by zg, POWCHK disabled, PULCHK disabled
       configuration hash MD5:
       00 E9 B6 7A A2 85 ED C7 34 08 36 98 17 FE 4E 26
       data hash MD5: 16K
       80 4C 0C 8C 10 C7 4D D8 D7 DA 9E C8 E4 0D B5 E6>)
$$ ##END=
$$ 
$$ hash MD5
$$ 6B 82 41 11 A6 92 5F 6C 5A 76 C0 82 11 A5 F4 E3
##$RELAX= 
##$RELAX= 
##$RELAX= 
##$RELAX= 
##$RELAX= 
##$RELAX= 
$$ Bruker specific parameters
$$ --------------------------
##$DU= <F:/spectra>
##$EXPNO= 1
##$NAME= <H-F>
##$PROCNO= 1
##$TYPE= <nmr>
##$USER= <she>
##$AMP= (0..31)
100 100 100 100 100 100 100 100 100 100 100 100 100 100 100 100 100 100 
100 100 100 100 100 100 100 100 100 100 100 100 100 100 
##$AQSEQ= 0
##$AQ_mod= 1
##$AUNM= <au_zg>
##$AUTOPOS= <>
##$BF1= 200.13
##$BF2= 200.13
##$BF3= 200.13
##$BF4= 200.13
##$BF5= 200.13
##$BF6= 200.13
##$BF7= 200.13
##$BF8= 200.13
##$BYTORDA= 1
##$CFDGTYP= 0
##$CFRGTYP= 5
##$CHEMSTR= <none>
##$CNST= (0..31)
1 1 145 1 1 1 1 1 1 1 1 1 1 1 1 1 1 1 1 1 1 1 1 1 1 1 1 1 1 1 1 1 
##$CPDPRG= <>
##$CPDPRG1= <>
##$CPDPRG2= <>
##$CPDPRG3= <>
##$CPDPRG4= <mlev>
##$CPDPRG5= <mlev>
##$CPDPRG6= <mlev>
##$CPDPRG7= <mlev>
##$CPDPRG8= <mlev>
##$CPDPRGB= <>
##$CPDPRGT= <>
##$D= (0..31)
0 1.2 0 0 0 0 0 0 0 0.06 0 0.03 0 0 0 0 0.0002 0 0 0 0 0 0 0 0 0 0 0 0 
0 0 0 
##$DATE= 1615449344
##$DBL= (0..7)
120 120 120 120 120 120 120 120 
##$DBP= (0..7)
150 150 150 150 150 150 150 150 
##$DBP07= 0
##$DBPNAM0= <>
##$DBPNAM1= <>
##$DBPNAM2= <>
##$DBPNAM3= <>
##$DBPNAM4= <>
##$DBPNAM5= <>
##$DBPNAM6= <>
##$DBPNAM7= <>
##$DBPOAL= (0..7)
0.5 0.5 0.5 0.5 0.5 0.5 0.5 0.5 
##$DBPOFFS= (0..7)
0 0 0 0 0 0 0 0 
##$DE= 6
##$DECBNUC= <off>
##$DECIM= 32
##$DECNUC= <off>
##$DECSTAT= 4
##$DIGMOD= 1
##$DIGTYP= 9
##$DL= (0..7)
0 120 120 120 120 120 120 120 
##$DP= (0..7)
150 150 150 150 150 150 150 150 
##$DP07= 0
##$DPNAME0= <>
##$DPNAME1= <>
##$DPNAME2= <>
##$DPNAME3= <>
##$DPNAME4= <>
##$DPNAME5= <>
##$DPNAME6= <>
##$DPNAME7= <>
##$DPOAL= (0..7)
0.5 0.5 0.5 0.5 0.5 0.5 0.5 0.5 
##$DPOFFS= (0..7)
0 0 0 0 0 0 0 0 
##$DQDMODE= 0
##$DR= 18
##$DS= 0
##$DSLIST= <SSSSSSSSSSSSSSS>
$$ [...]
##$SUBNAM2= <"">
##$SUBNAM3= <"">
##$SUBNAM4= <"">
##$SUBNAM5= <"">
##$SUBNAM6= <"">
##$SUBNAM7= <"">
##$SUBNAM8= <"">
##$SUBNAM9= <"">
##$SW= 16.9725357007746
##$SWIBOX= (0..15)
0 0 2 0 0 0 0 0 0 0 0 0 0 0 0 0 
##$SW_h= 3396.73913043478
##$TD= 16384
##$TD0= 1
##$TE= 0
##$TE2= 300
##$TE3= 300
##$TEG= 300
##$TL= (0..7)
0 120 120 120 120 120 120 120 
##$TP= (0..7)
150 150 150 150 150 150 150 150 
##$TP07= 0
##$TPNAME0= <>
##$TPNAME1= <>
##$TPNAME2= <>
##$TPNAME3= <>
##$TPNAME4= <>
##$TPNAME5= <>
##$TPNAME6= <>
##$TPNAME7= <>
##$TPOAL= (0..7)
0.5 0.5 0.5 0.5 0.5 0.5 0.5 0.5 
##$TPOFFS= (0..7)
0 0 0 0 0 0 0 0 
##$TUNHIN= 0
##$TUNHOUT= 0
##$TUNXOUT= 0
##$USERA1= <user>
##$USERA2= <user>
##$USERA3= <user>
##$USERA4= <user>
##$USERA5= <user>
##$V9= 5
##$VALIST= <valist>
##$VCLIST= <CCCCCCCCCCCCCCC>
##$VD= 0
##$VDLIST= <DDDDDDDDDDDDDDD>
##$VPLIST= <PPPPPPPPPPPPPPP>
##$VTLIST= <TTTTTTTTTTTTTTT>
##$WBST= 1024
##$WBSW= 4
##$XGAIN= (0..3)
0 0 0 0 
##$XL= 0
##$YL= 0
##$YMAX_a= 474274
##$YMIN_a= -468465
##$ZGOPTNS= <>
##$ZL1= 120
##$ZL2= 120
##$ZL3= 120
##$ZL4= 120
##$ABSF1= 10
##$ABSF2= 0
##$ABSG= 5
##$ABSL= 3
##$ALPHA= 0
##$AQORDER= 0
##$ASSFAC= 0
##$ASSFACI= 0
##$ASSFACX= 0
##$ASSWID= 0
##$AUNMP= <proc_1d>
##$AZFE= 0.1
##$AZFW= 0.1
##$BCFW= 1
##$BC_mod= 2
##$BYTORDP= 1
##$COROFFS= 0
##$CY= 11.3945322036743
##$DATMOD= 1
##$DC= 2
##$DFILT= <>
##$DTYPP= 0
##$F1P= 15.9154993809931
##$F2P= -4.1035820241983
##$FCOR= 0.5
##$FTSIZE= 0
##$FT_mod= 4
##$GAMMA= 1
##$GB= 0.15
##$INTBC= 1
##$INTSCL= 1
##$ISEN= 128
##$LB= 0.24
##$LEV0= 0
##$LPBIN= 0
##$MAXI= 10000
##$MC2= 0
##$MEAN= 0
##$ME_mod= 0
##$MI= 1.114404
##$NCOEF= 0
##$NC_proc= 0
##$NLEV= 6
##$NOISF1= 3.799351
##$NOISF2= 2.8
##$NSP= 1
##$NTH_PI= 0
##$NZP= 0
##$OFFSET= 15.70392
##$PC= 1
##$PHC0= -11116.73
##$PHC1= 9.600939
##$PH_mod= 1
##$PKNL= yes
##$PPARMOD= 0
##$PSCAL= 0
##$PSIGN= 0
##$REVERSE= no
##$SF= 200.130013532006
##$SI= 16384
##$SIGF1= 3
##$SIGF2= 2
##$SINO= 400
##$SIOLD= 16384
##$SREGLST= <1H.CDCl3>
##$SSB= 0
##$STSI= 0
##$STSR= 0
##$SW_p= 3612.71676300578
##$SYMM= 0
##$S_DEV= 0
##$TDeff= 0
##$TDoff= 0
##$TI= <>
##$TILT= no
##$TM1= 0
##$TM2= 0
##$TOPLEV= 0
##$USERP1= <user>
##$USERP2= <user>
##$USERP3= <user>
##$USERP4= <user>
##$USERP5= <user>
##$WDW= 1
##$XDIM= 8192
##$YMAX_p= 0
##$YMIN_p= 0
$$ End of Bruker specific parameters
$$ ---------------------------------
##NTUPLES= NMR FID
##VAR_NAME=  TIME,          FID/REAL,        FID/IMAG
##SYMBOL=    X,             R,               I
##VAR_TYPE=  INDEPENDENT,   DEPENDENT,       DEPENDENT
##VAR_FORM=  AFFN,          ASDF,            ASDF
##VAR_DIM=   8192,          8192,            8192
##UNITS=     SECONDS,       ARBITRARY UNITS, ARBITRARY UNITS
##FACTOR=    0.0002944,     1,               1
##FIRST=     0,             0,               0
##LAST=      2.4114304,     0,               0
##MIN=       0,             -468465,         0
##MAX=       2.4114304,     474274,          0
$$ Real data points
##PAGE= N=1
##DATA TABLE= (X++(R..R)), XYDATA
0@%%%%%%%%%Kj0J6j6K4l2M0m8N6p2Q8j04J25j49J76k08K40k79L24l73M28m88N54
32B94o27P12q05R05j016J137j270J416j575J750j939K146k374K622k893L189l514
49a842L870m263M698n178N713o313O991p763Q650r685J0911j2384J4191j6475
63h879J9459k3531K9438l8772N5658r5103L37089J29334q73158M90126K71114
74B92775m15769P1549J40446m7501P982j58741J76856J13321l08812L8790K63600
85A74496j52215j22921J77444M5293k16098O7276K02371j89714j23146J77063
95C9849j654l0775m2101n7196J57795m6330j54367J75671k2320j49001J20222
106a0207J2726j0379K2309j29304J21137J15734k10679L1741J39043j26298J0067
$$ plain form
0 0 0 0 0 0 0 0 0 0 0 2 -8 8 -8 16 -16 24 -24 32 -40 48 -56 69 -80 96 -112 128 -151 173 -200 228 -260 294
32 294 -333 379 -426 479 -537 600 -670 746 -829 921 -1018 1128 -1246 1376 -1517 1672 -1842
49 -1842 2028 -2235 2463 -2715 2998 -3315 3676 -4087 4563 -5122 5789 -6595 7596 -8879
63 -8879 10580 -12951 16487 -22285 33373 -61730 275359 404693 -468465 21661 292775
74 292775 -122994 -51445 89001 41500 49482 -109259 67597 180918 -127894 -89104 174496
85 174496 22281 -100640 76804 122097 -94001 -26725 175646 -14068 -137214 39849
95 39849 38195 7420 -34681 -91877 65918 19588 -134779 40892 18572 -130429 -10207
106 -10207 2519 -7860 14449 -114855 6282 122016 -88663 -56922 82121 -44177 -34110
117c4110J05315q2562l5373O8835L088j7540k340m3817K9629O4134r3230K0881
129a7090J11273j67557J6117K34653j99216j00455K40790j08318o8865J60573
139A01905j26013k8826J45319r3195k6815O8334o0225r2K5398n89J1648n7483
151d0634K26Q1382j3180o7088j100N7692m663m2789M9309j7750n2660R4423j2472
164C0696p5441O7850k1207l3377O9284m0058j5970L3351n1166N8284K8769j05623
176e4608L5154M7645l9203L1033k2568l9355O7991k611l8681K5718q911j4915
188a3311J9062O696p801j1963j0230J2622L2405j5515n9198L2177N0360n6109
200b0805N458L2229o0141L3486N5119o9566N30M2465l7155J4381K7773k8095j1533
$$ plain form
117 -34110 71205 -11357 -46730 22105 25193 7653 5313 -38504 -8875 55259 -37971 -17090
129 -17090 94183 -73374 -57257 177396 -21820 -122275 118515 10197 -58668 101905
139 101905 -24108 -52934 92385 -810 -27625 40709 -19516 -19608 5790 5201 16849 -40634
151 -40634 -40408 40974 27794 -39294 -40394 17298 12635 -30154 19155 1405 -51255 43168 30696
164 30696 -44745 23105 1898 -31479 37805 -2253 -18223 15128 -36038 22246 51015 -54608
176 -54608 -19454 28191 -11012 20021 -2547 -41902 26089 23478 -15203 10515 1604 -13311
188 -13311 5751 12447 4646 -7317 -17547 -4925 27480 11965 -47233 -15056 35304 -20805
200 -20805 -15347 16882 -43259 -9773 45346 -24220 -23690 18775 -18380 -3999 23774 -4321 -15854
213a5854K942K9409J4144m7143j017L3582j5826M148J2366l4487k191M7295k598
226B4770n0322J9055L6177m3007M426M9220m2916k8335M5280J1388j0418k3887
238h569j2808M2961j824l0242J7851j1087j1984L4498q048k3865P468j271J0562
251C642N010j7108J040J326k570K0588K422l4309m404M0366O882l8809K261J8407
265D744j2209J5006L629k9911J2960J2493j5618J7059j167k9151J3342J9822J143
278A2142j4800j8605K1105J8379j8162k81j540j2240K6440Q736l0999j72J8575
291H578o461m162J5383j0478k5173K0803K3662k0609j0698L519n15K0761k383
304A2227k7234O513J5451Q49k916r765K063N113m905J3996k212k5069R999J5439
$$ plain form
213 -15854 -12912 16497 30641 -16502 -17519 16063 237 4385 16751 -17736 -19927 27368 24770
226 24770 -25552 -6497 29680 -13327 -8901 40319 -2597 -30932 14348 25736 15318 -8569
238 -8569 -21377 21584 19760 -10482 7369 -3718 -15702 18796 10748 -13117 -5649 -6920 3642
251 3642 8652 -8456 -7416 -6090 -8660 11928 14350 -19959 -24363 16003 22885 -15924 -13663 4744
265 4744 -7465 7541 11170 -18741 -5781 6712 -8906 8153 6986 -22165 -8823 10999 12142
278 12142 -2658 -21263 -158 18221 59 -222 -1762 -14002 12438 21174 -9825 -9997 8578
291 8578 2117 -2045 13338 2860 -22313 -1510 22152 1543 -9155 -5636 -6151 14610 12227
304 12227 -15007 -8494 6957 7806 4890 -4875 -2812 2301 -2604 11392 9180 -15889 -5890 9549
318I549m408M5j1178j1157K2196J3731k0570j3843J2400J0899m724J76n201p901
332i986J3401O002r700K135m284q879J8556Q552j9499j2055R831J9078m358j8738
346i944R90O355L431Q320j1326j2145J4780K050n681Q991m859j6690J0919K0247
360A5438j1013j8072O655R773j127N237r152j6210J6637J7691j4711j3180Q289
373c745O703l294J474O135j0778r131J7978Q915j1587q340k219J2500J3523j6033
387B101j4797J4510P480n618p3j885p769N342J3685p145j2776O071L241k824J1075
402A0618l847k0491O865J9545k426j5568m895R209N984k340k408p612j186J3578
416E026j738r245M136l940k918J3742K483j6878m620J2777J0672o883j1699O2
$$ plain form
318 9549 5141 5186 -5992 -17149 5047 18778 -1792 -15635 -3235 7664 2940 3116 -2085 -9986
332 -9986 3415 9417 -283 1852 -2432 -11311 7245 15797 -3702 -15757 -5926 13152 8794 -9944
346 -9944 -8954 -2599 832 9152 -2174 -14319 461 2511 -3170 5821 962 -15728 -4809 15438
360 15438 4425 -13647 -6992 2781 1654 6891 -2261 -18471 -1834 15857 1146 -12034 -3745
373 -3745 2958 -336 1138 7273 -3505 -12636 5342 14257 2670 -5670 -7889 4611 18134 2101
387 2101 -12696 1814 9294 3676 3603 1718 -6051 -709 12976 5831 -6945 -874 2367 -457 10618
402 10618 6771 -13720 -6855 12690 10264 -5304 -10199 -990 4994 2654 246 -7366 -8552 5026
416 5026 3288 -5957 -1821 -5761 -8679 5063 7546 -9332 -13952 -1175 9497 2614 -9085 -9023
430i023P319J0396l951j4275N281R581q577N589Q611j8247m209K0989L206j6000
444c310k224P218l08L922M915j5017p821K2459M476j7420j374L525L014N412o223
459A244n442O192m517j536J4136k837k1927K634K6102k723k4411L240J4870l678
473A347k558L907o458m938R649R674j0169j1049R505O248m154J782P27r626J102
488e011J4409K206j6225m838J2736O917m338j0083j811J2336p53q064P533l707
502A307j2477J4180J0219j5682q115R086M704k193J739o842j0471J3912J3845
515A3212j9084q348J5680l560m257R907m890j1188O630J0671k376q210q09L463
529c159L632O747o967j1047R804Q277j973j914r381K573J6803o351j0738R157
$$ plain form
430 -9023 -1704 8692 4741 -9534 -4253 5328 -3249 2340 10951 -7296 -11505 9484 12690 -3310
444 -3310 -5534 1684 1376 5298 10213 -4804 -12625 9834 14310 -3110 -4484 -959 2055 7467 1244
459 1244 -4198 1994 -2523 -4059 10077 7240 -14687 -12053 14049 11326 -13085 -9845 5025 1347
473 1347 -1211 2696 -3762 -8700 949 10623 454 -10595 -1090 5158 1004 2786 3513 -6113 -5011
488 -5011 9398 11604 -4621 -9459 3277 10194 5856 -4227 -6038 6298 5545 -2519 5014 1307
502 1307 -11170 3010 13229 -2453 -10568 -1482 3222 1029 2768 -4074 -14545 -633 13212
515 13212 -5872 -14220 1460 -2100 -6357 3550 -1340 -12528 -5898 4773 2397 -5813 -6622 -3159
529 -3159 473 7220 253 -10794 -990 7287 5314 3400 -5981 -3408 13395 7044 -3694 5463
543E463j331o321R131O380j0557j0889J0204J4346r938j2094O127M265l14J157
557E629l227q416K964J2741n412j2187N326L066n726P634N44j3378J630R021J505
572A714l156o806k815P966P400n583j0337L544R564j978k980J304l999J91R138
587C167Q59q534r9L172K118O786l484j3652O965J5264q207o507M972l104K434
602B150Q761o575p819N668K223M08J406m383n968M155R176k392j0863j087Q476
617C336K015k947k955m770J813R323p81j1777K088P569o036J397P562j0410p534
632a2107J4329M388q759n033J293P290L004o068l908J713L477L833k403m352l06
647c609J915N715K97p438o77M363J95K945J452j1054j664J5377J172j4727R09
$$ plain form
543 5463 4132 -2189 6942 13322 2765 -8124 2080 16426 6488 -5606 521 4786 4472 5629
557 5629 2402 -6014 -3050 9691 4279 -7908 -2582 484 -5242 2392 2936 -10442 -8812 209 1714
572 1714 -1442 -8248 -11063 -3097 4303 -1280 -11617 -8073 1491 -487 -3467 -2163 -6162 -5971 3167
587 3167 4026 -4508 -4607 -1435 683 7469 3985 -9667 -2702 12562 4355 -2152 2820 -284 2150
602 2150 10911 4336 -3483 2185 4408 4816 6222 1839 -4129 26 9202 6810 -4053 -5140 3336
617 3336 5351 2404 -551 -5321 -3508 5815 5034 -6743 -4655 2914 -3122 -1725 5837 -4573 -12107
632 -12107 2222 6610 -2149 -7182 -5889 1401 4405 -1663 -5571 -3858 -381 3452 1049 -3303 -3609
647 -3609 -1694 4021 4318 -3120 -3797 566 761 3706 5158 -5896 -7560 7817 8989 -5738 -4829
662d829Q389k631O01K781p223j595Q015L47l453o73l253J246P008L52q012m238
678g168P235O954n197o116K387K49L884L197p096m249O966J470k263K707l814
693h54n257P109O884o846n989K703M142K856j368p514p89Q516J470n273j409O10
709a009Q13J323L127l123o669L408O775j710l922j643k073O569N007q678o436
724h241P597M654m088p09j115k700M292M135m653k420J175q15M225L445p136n641
740g995P125O954m489o244J649L221P60K182l324n325N151M481l560p50J232m415
756c347K208P509k826q324J780P099K35k223l590k273N404M666n121m461L074
771a90J751l69J369j073m482O29N814R75n203k339J320L136L534m058p570M648
$$ plain form
662 -4829 3560 929 1530 4311 -2912 -4507 3508 3855 402 -271 -3524 -2278 4730 5082 -2930 -7168
678 -7168 67 7021 1824 -4292 -1905 -1656 2228 5425 -1671 -5920 1046 2516 253 2960 -854
693 -854 -6111 998 7882 1036 -4953 -2250 1892 4748 3380 -4134 -4923 3593 5063 -210 -1619 -1009
709 -1009 -196 1127 4254 1131 -5538 -2130 4645 2935 -987 -2630 -4703 1866 6873 -1805 -8241
724 -8241 -644 4010 -78 -787 -1902 -4602 -310 3825 -828 -3248 -2073 -2888 1337 4782 -2354 -7995
740 -7995 -870 6084 1595 -4649 -3000 221 981 3163 -161 -5486 -335 4146 586 -164 1068 -3347
756 -3347 -1139 6370 3544 -4780 -3000 4099 4334 2111 -1479 -3752 1652 6318 1197 -3264 -190
771 -190 1561 1192 2561 1488 -2994 -2365 3449 4424 -779 -3118 -1798 1338 4872 814 -6756 -2108
787b108O893k632m757R57N8N38L246o69m808k15L527R24Q09j964n168K364P958
804D953j763p774N54M823Q45m63j789l460K063N343j913l712J405Q4r22M536J109
821C919p567j528P734K518n235k610N24K596L884k586n391J650M926j683j007
836A44J313l338j243O286J346n977j476L102J228J823o82o462L00Q070M47o398
852a517q29K754J114N32o27k660k28K081J321l99j481k752J48O337O13p377k227
869e197O373K610l084k727k90J434J525J294k492k894J792K044K57j09k445k918
885d827M317M127l971l128R68J780J932J510n517k939Q066K468p669R45M438m769
901b269J552O123m774n044M670K682k95l90m879L4P643l14o385M65K641o92J514
$$ plain form
787 -2108 4785 2153 -2604 -1647 -1589 -1051 2195 1526 -3282 -3497 30 954 1763 -201 -5369 -3005 4953
804 4953 3190 -4584 -4030 793 1638 1175 -614 -4074 -2011 3332 1419 -2293 -888 -804 -1726 2810 3919
821 3919 -3648 -5176 2558 5076 -159 -2769 -2245 351 4235 1649 -3742 -2092 2834 1151 144
836 144 1457 -1881 -3124 3162 4508 -1469 -2945 157 1385 3208 2526 -3936 -3636 4434 4881 -1517
852 -1517 -2346 408 1522 2054 1427 -1233 -1461 620 1941 1542 61 -2691 -2543 3794 4407 -2970 -5197
869 -5197 1176 3786 702 -2025 -2315 -881 644 1938 -554 -3448 -1656 388 645 536 -1909 -4827
885 -4827 -510 3617 -354 -3482 -2514 -734 1198 2708 -2809 -5748 2318 4786 -2883 -1938 2500 -2269
901 -2269 -717 5406 632 -4412 258 2940 2645 2255 -2624 -2590 5053 4739 -1646 -1181 1460 768 2282
918B282R60m581j016M528N27k252n78j357O22L042M84l349l282J852N401k73o372
935c362m55M284J364k011r54q20k41K367P95j179j251j535R75N675j417p848K817
952b796N838k088j382J120m085J971O951m446n179M669J059l365M972r75o910
967d646M209M552m006k2K38l959L814N457n865m713M853K842k336k92j320r73
983b167K846N49j428K60k161n94N648k83n379o47L362K124j032k600n07J551J542
1000A084J032j832l176J912M014o21l472K74J662j408J640L018n370l698P727
1015B786K073n358r18J344j33K609m91m304R39K795r42l8J225l859p79N515m00
1032B064m794J167L92L31L451k242n462L028M300j658j946l67k76J522K127j704
$$ plain form
918 2282 3242 -1339 -2355 2173 2700 448 -130 -1487 -865 2177 2661 -688 -3970 -2118 3283 3010 -3362
935 -3362 -3817 467 1831 -180 -1134 -1954 -2195 172 967 -212 -1463 -2998 -2023 3652 2235 -5613 -2796
952 -2796 3042 954 -428 692 -3393 -1422 5529 1083 -4096 573 1632 -1733 3239 2264 -4646
967 -4646 -437 4115 109 87 325 -3634 180 5637 -228 -4941 -88 2754 418 126 -1194 -2167
983 -2167 679 1228 -200 60 -2101 -2695 2953 2670 -2709 -3356 6 2130 1098 -1502 -2009 -458 1084
1000 1084 2116 284 -2892 -980 3034 2413 -1059 -785 877 -531 1109 4127 -1243 -4941 2786
1015 2786 4859 -499 -1417 -73 -206 2403 1912 -2392 -1453 1342 400 362 1587 -2272 -3051 2464 2064
1032 2064 -2730 -1563 -1171 -840 2611 369 -5093 -2065 2235 577 -1369 -1736 -2012 -490 1637 -67
1048f7k051J56J796J173N5j396j851J041L321J010m510j710M299J847k313q08
1064hj79m19K564J152k808j345J498Q20P73O18l283j490L671K091k920k058P89
1081e34R86J656jl803p02L571P85k366J19p46j166K589K159l765j869K133R82
1098B8J057r49l191j31N068j14l867qJ404L51M91K63j855j089K198K340j733j908
1116a645L44N09K060J213l210k553L021L378j985k237K43P74J051J257k088j538
1132a406J489R36K10K85j888j913L421J842k128k022J58K128Q73m90k471p57K255
1149E22J993k147j528J034l78P30J731j703l143J717K822n52j635j054J33J990
1165E32J775k603k404J974J669l37o44o33q30R34K028o57k416k10J871P32N25
$$ plain form
1048 -67 -2118 -1962 -166 1007 1062 -334 -2185 -1144 2177 3187 -1323 -3033 1266 3113 800 -8
1064 -8 -187 -606 1958 3110 302 -1043 455 1275 2048 2666 -617 -2107 1564 3655 735 -1323 -534
1081 -534 452 2108 2107 -1696 -2398 1173 1958 -408 -289 -1035 -2201 388 2547 -1218 -3087 -954 28
1098 28 1085 136 -3055 -3186 1882 1768 -2099 -2107 -703 -352 139 402 -1453 -2542 -344 1996 263 -1645
1116 -1645 -1301 -792 1268 2481 -729 -3282 -261 3117 1132 -1105 -862 -88 963 2220 132 -1406
1132 -1406 83 1019 1229 1514 -374 -2287 1134 2976 848 -1174 -1016 1112 1985 1495 -976 -1733 522
1149 522 2515 368 -1160 -126 -504 226 1957 254 -2889 -1172 1650 1098 -537 -1591 -1458 532
1165 532 2307 -296 -2700 -726 943 606 -38 -671 -1501 -567 1461 804 -1612 -1822 49 781 1306
1182A306j416k491J460L884j477l156O41J216O04Q74j269k034J075K154j197J67
1198C41o38j517J428L107j660l166J067J904Q70r69j847j40J362J871j116j924
1214a027J12J733m73Q35l83k287K58K707O44k652p05Q35J403R98j026k962J346
1231f44K554o98j238l91m73O67J563k15j987n66J428J657j055j053j135N04K924
1248A842j60l010n05K190M87n61m97j099N5K013M25j845m39K23K27J709l2k720
1266a697l86K891N82j457j108q2J315R17j33k040N3J615M65p38k77p22m36K083
1284H45J449k437j714J392J362M35p56j898K80K547J10k272P6O15M4Q26L30j730
1302d96p04J328J575q02j295m55O94J396M76k220j376K023J791j084j260l44J5
$$ plain form
1182 1306 -110 -2601 -1141 2743 1266 -1890 -1249 -33 571 1445 176 -1858 -783 1371 174 341
1198 341 -297 -1814 -386 2721 1061 -2105 -1038 866 1736 767 -1080 -1220 142 2013 897 -1027
1214 -1027 -915 818 345 1180 797 -1490 -1232 1475 2119 -533 -1238 -403 1000 1998 972 -1990 -644
1231 -644 1910 1212 -26 -417 -890 -223 1340 1125 -862 -1428 0 1657 602 -451 -1586 -1082 1842
1248 1842 1682 -1328 -1833 357 844 283 -214 -1313 -1258 755 1180 -665 -1104 -881 -654 1055 1023 -1697
1266 -1697 -2083 808 1390 -67 -1175 -1257 58 975 842 -1198 -1145 470 935 197 -80 -802 -1238 845
1284 845 2294 -143 -1857 -465 897 1332 576 -1322 -1042 1505 1615 -657 -581 34 78 904 1234 -496
1302 -496 -1200 128 1703 901 -394 -849 -155 1241 1717 -503 -1879 144 1935 851 -409 -753 -738
1319g38J319N92j092j147N74P61L51K02j609j182J979J661j914j635Q62J054N22
1336E60m14j043p79J492J302j131n32k15n36J377J287j515j777J131J690j97o27
1353G3j043j32J743Q66j615j259J072R31J46r3q93p84R65J576l31j602k66N31
1371a15J525J14j477j070J389J711r80j368j21P26K01N82o00j243Q2J680r3q05
1389A38q02k81P98J463p62j964K45K010r4q93n19q61Q93J717q98j353M69J51J84
1408c59R07m90k251J168K378m61j692j60K04J069J043j597r73Q08R24P2l07o29
1426c46j79N11J043j31j001m88M86J150M09j641p76Q55J413j94j585l5N11Q70
1444H72k24l59q61OJ409J99r21q90K14N80R56p6k116k48K179P58j542m97L94l82
$$ plain form
1319 -738 581 1173 81 -1066 -492 269 620 822 -787 -1969 10 1671 -243 -1878 -1016 38 560
1336 560 146 -897 -1676 -184 1118 -13 -545 -760 -1296 81 1368 -147 -1924 -793 897 700 73
1353 73 -970 -1102 641 1507 -108 -1367 -295 636 782 689 -204 -988 -23 1553 1222 -380 -646 -115
1371 -115 1410 1524 47 -1023 366 2077 1097 -271 -392 334 535 1117 517 -726 -644 1036 943 138
1389 138 -664 -945 -147 1316 554 -1410 -1165 845 751 -142 -661 -1522 -629 1088 190 -1163 -694 -543 -359
1408 -359 548 58 -2193 -1025 1353 892 -800 -960 -756 313 1356 -241 -1214 -406 518 590 283 -346
1426 -346 -525 -14 1029 898 -103 -591 -105 1045 1454 -187 -963 -108 1305 1111 -474 -509 2 872
1444 872 648 289 -572 -566 843 1042 121 -769 -555 25 981 905 -1211 -1459 720 1478 -64 -561 -167 -549
1464e49R71M61j567m1P07m0N23m39j172k7J817L83j650l45N01Q85O17j156j358
1483a479N97J654l05p77j01j76N15P47k57j192l89Q74J065l11r94l91O20J404
1501A104m57j485k61J058P27k45o95j30k43R30N35p89r26J76J143K99k29r68m65
1520i21J362J356j485j230O17J021r0J33j282n0O24R02l46n64n34j23J322M21
1538A133j474q67J178O33j46k11j124O1J644m3j091l96M30L63Q5L08r59q63J015
1557c24J273q28r68j82P74P26J15j126m42P67Q15l72o43k68L19L99M13n70o29
1576g51M5J019M72l55j093l01J164Q81r25r02M47P18M74n12n02q4L36O42l85l28
1596F0k13k4P01M81p31j266O70J221Q9q62p35K14R61K59p46p16K49Q21K26l91
$$ plain form
1464 -549 422 883 -684 -725 -18 -58 465 26 -1146 -1173 644 1027 -623 -968 -467 418 1035 -121 -1479
1483 -1479 -882 772 467 -310 -411 -587 -72 675 418 -774 -1163 -289 776 465 -529 -920 -300 1104
1501 1104 647 -838 -1099 -41 686 441 -254 -384 -627 303 838 49 -877 -701 442 741 512 -456 -921
1520 -921 441 1797 312 -918 -301 720 630 763 -519 -569 55 957 611 47 -487 -610 712 1133
1538 1133 -341 -1208 -30 603 457 246 -878 -817 827 784 -307 -703 -273 90 175 483 -476 -1339 -324
1557 -324 949 121 -847 -1029 -255 471 586 -540 -982 -215 600 228 -415 -683 -364 35 448 -122 -751
1576 -751 -706 313 785 430 -663 -964 200 1081 156 -746 -299 419 893 381 -121 -205 131 773 388 60
1596 60 -153 -177 524 1005 274 -992 -322 899 988 126 -609 -395 566 825 79 -637 -388 433 659 268
1616B68j21o79L79J069n36q38l10P60M91J06q44o41P16Q48l59j050K3O10J4K47
1636A53M1r69K86N57O90p74l84l13M76Q90m36j124K54R26J10m35o09J76L30N97
1656D42q0o46n2R1N93M64p65q68O38R04j68o77k53L28N38L3l89l73jQ19k5k32
1678C21m26k30K31O46Q5q44m40P38P87o19m56l02M36N05J46j026k36O63O38k68
1698C49m64k25p6O49M50p69m59o1P06M81n33q07p0J053L97p55m96K05J15M63J64
1719C17m72m09N07L32l7k56m76j4J068R5j004m84P38P04j42m02n37L84N50L94
1739H56o86n75J62M14K58Pk15o41M99R46m23r71K4M85M28Op78k56O22N60p69J88
1761A41m23n7M94K61l12k82k29N96M06l02p77o8Q36M81q07o61M25N86n3m9k50
$$ plain form
1616 268 147 -532 -153 916 380 -458 -768 -8 483 589 -255 -896 -180 668 309 -741 -718 -108 -94 153
1636 153 194 -775 -489 68 758 -16 -400 -713 -237 653 217 -907 -653 273 383 -52 -661 -485 -155 442
1656 442 362 -284 -336 -245 348 812 47 -821 -183 721 553 -124 -377 -49 489 522 133 -240 -241 578 553 321
1678 321 -105 -335 -104 542 627 -217 -657 81 868 249 -207 -509 -73 432 578 -448 -684 -21 617 349
1698 349 -115 -340 -416 233 683 -86 -545 -606 100 581 48 -759 -829 224 621 -134 -630 -425 -310 153 317
1719 317 -155 -564 -57 275 238 -18 -494 -508 560 655 -349 -833 -95 609 467 65 -472 -88 462 856
1739 856 170 -405 -243 171 429 436 221 -420 79 1025 602 -369 -345 140 568 574 -204 -460 162 722 -47 141
1761 141 -282 -339 155 416 104 -178 -407 189 595 293 -484 -552 284 765 -42 -703 -278 308 255 206 -44
1782d4n30L46N33J1n38j48M4N14M46j096r8K36M90J02n05n80N25M90J27m23m09
1803e07K66J40M28j58m77J1L6O46m2o59l42O45O38k85m50l11N34M94l54j34k54
1824a35R9K90J76n3p59K04O05K39l85m03m4J69L98j23p37P9P44R8n85O5l41K66
1846a33M41o6n40n6R7L50L70o54m79J77Q16k2q42k8K18M56K17m03l76M8N12q8
1868A5j21j36k91L55M54j39l28l35N16M33q4n16k11M80L19q7m96k68M51L56K1
1889C88l81Rj46M71K59m96m80J55N34K86l71m50k39Q98K1n48m9N6K74Q4L8n68
1911b55J62j53O57p4j88o93q3J140k94n68j63K22O15q8r3n68K74L28O2l07j68
1932b35j61M16L66l83n15K8O31J16k82l26k24M86N07j79o81P8J30M74j13k88R4
$$ plain form
1782 -44 -574 -228 305 316 -222 -370 -326 188 634 -462 -560 -324 166 268 -237 -817 -292 198 325 -98 -507
1803 -507 -241 -101 327 169 -308 -297 -261 385 343 -316 -658 -13 625 340 -110 -421 113 607 253 119 -135
1824 -135 -36 254 430 377 -382 -178 427 666 281 -122 -166 3 401 278 -459 -380 364 462 -123 -58 -399 -133
1846 -133 308 242 -298 -354 -257 93 463 -191 -670 -493 323 301 -541 -569 -351 105 322 -81 -457 -409 103 15
1868 15 -106 -242 -533 -178 276 137 -191 -526 -10 423 339 -177 -388 92 411 324 -172 -440 11 367 388
1889 388 7 16 -130 341 600 104 -376 -221 313 599 228 -222 -461 437 458 -90 -139 -83 191 275 313 -255
1911 -255 -93 -246 411 337 149 -544 -627 513 219 -349 -512 -290 325 237 144 -424 -150 178 240 -67 -235
1932 -235 -396 20 386 3 -512 -484 147 263 -19 -345 -569 -83 424 245 -436 -358 -228 246 133 -155 -61
1953f1j66K00M68j48o47K14L79J71n61l7j4M70L74n11m62J70M68m6L43o41J65
1974A28p8L50j30j04k43L6L97J21k51n99L40M79l4n10j5J88K9J13j91m09K06J41
1996c6J84r7j05m93O52J33o9l44r7K59K44j49j96k20J59L40j31j99j86L24K72
2017B45l43J84k83j02M76J34l76Om89P88J31j34p98M13L71L15k79m99J00j22N95
2038C33q3k12k23J68K37J0l30l73N28J85L7m99rP1M36R4l31k23j8O2N45K8m42
2061ik68K98M25j18o63k68P57K40n27N8n10N08L58J19m74o5k20N95J11m07k8k10
2083b98M28L38o53m6L22j64N98n89l19L86J37Rk14k05R5q0M94l5l57L7L40j51
2105G3L76n49l98N14L90j33l72J04n6n2K85r0k17o5K65L09k06l29j7M65r5m1l52
$$ plain form
1953 -61 -227 -27 441 293 -354 -140 239 410 -151 -188 -202 268 642 131 -331 -161 307 261 604 -37 128
1974 128 50 400 270 166 -77 -41 356 477 226 -373 -33 446 412 -98 -113 75 104 217 26 -383 -177 -36
1996 -36 148 51 -54 -547 105 238 169 -175 -272 -13 231 82 -114 -334 -175 165 34 -165 -351 -27 245
2017 245 -98 86 -197 -299 177 311 -65 -59 -548 240 371 237 -561 -148 223 538 259 -240 -140 -262 333
2038 333 250 38 -185 -17 220 230 -100 -473 55 240 277 -222 -231 -160 276 370 39 -184 -202 -140 405 433 -9
2061 -9 -277 21 446 328 -335 -603 154 394 -133 -75 -585 -77 281 400 -74 -139 -359 236 347 -60 -88 -298
2083 -298 130 468 -185 -231 91 -73 525 -64 -383 3 140 149 -65 -270 -175 -255 239 204 -153 -116 224 73
2105 73 449 -100 -498 16 406 273 -99 5 -51 -103 182 92 -125 -190 75 384 178 -151 -168 297 202 161 -191
2128a91J52K40K80k39n20J17J45L44J4l96J4m0J42k4N7m23K94L2M80p06k37L04
2150a61K05J87l45j58M7K79J45l45j85q2M06P8j09N9j93J72R4L6l00k6J2K16K03
2173B35l23q4q7L97l4j33k75N46j90K14q6l93J47J87L39m08k14k5K34M00j63p31
2195d47L50K48K59p9o2m32J22K87N4m32L0r7K71M35n13j51P7J71K19j70l61K98
2217G7L26j21l31k00M4K66L22k73l24j48K84Q2J38l56k25P3O37j42k47k28J01
2238b45M19L1k83n3O9J06j62J37l04l8M52K35m63j98J10J98M67o78n5J78J91k7
2260H7j2o4r3J18K17J09m15o6J5L75Q1k33n02J51N27J21n13j49K62L39j46k89
2282h0j19K55J03j35j22J29j59K01R4jk47k93L74P2k74J71o4kL21j71P3l96Q5
$$ plain form
2128 -191 -39 201 481 242 -278 -161 -16 328 342 -54 -40 -80 62 38 95 -328 -34 -2 478 -228 -465 -161
2150 -161 44 231 -114 -272 -225 54 199 -146 -331 -413 -7 71 -38 21 -172 0 94 130 -170 -196 -184 32 235
2173 235 -88 -172 -259 138 104 -29 -304 242 52 266 180 -213 -66 121 460 52 -162 -187 47 447 284 -447
2195 -447 -97 151 410 331 269 -163 -41 246 300 -132 -102 -199 72 507 -6 -157 -80 91 310 140 -221 77
2217 77 403 282 -49 -249 -205 61 383 110 -214 -362 -78 4 142 -214 -439 -366 271 129 -118 -346 -245
2238 -245 174 205 -78 -131 -62 44 -118 19 -285 -323 129 364 -99 -297 -187 11 478 -200 -255 -77 114 87
2260 87 75 11 -82 36 253 362 -53 -119 -104 271 352 119 -383 -232 295 416 -97 -246 16 355 209 -80
2282 -80 -199 56 159 24 -98 31 -128 73 167 166 -81 -374 0 72 -202 -31 -95 -97 224 53 126 -270 -185
2305a85O1L22l71r2p4M41J72k23k58p1j16P71m40pn0K29L85m55k18L3K12j62K74
2328A78j11k2k27M91j62k07l43N17J85L7k97j81p3J93L42l55Q4k4K19l5j84J58
2350A83k17J02K86k87k46o0M73k83J71m55J94K6L2J58l80O3J03L68L8l15L6j11
2372a21Q7K06k62n8o4L1L41k43j24J06L05k44L9l56N9L32M0k4j39l9K03J6m4j70
2396a23j57K17J64K04n21o5M42Q9j80Rl01NL78O7l72R4m5Q5K7K54k76k49L91J81
2420C18q1k78J97K0j67J17n07K41K52L04k76j89j61L08l44M60k73j51J07O5K72
2441B34l44j87L18R7m2j8k32R5J02J03l18p4RO6K21L4j60j21N8K38J6k33m01L06
2465b33M19q8l59P7n9L58J29m23l7M5R4L11j40l06K6J22K80l80l0l2M39l6n2N1
$$ plain form
2305 -185 -124 198 -173 -265 -339 102 274 51 -207 -278 -394 377 -63 -70 -120 109 494 39 -179 -146 66 -96 178
2328 178 67 45 -182 309 147 -60 -403 114 299 336 39 -142 -215 -22 320 -35 49 25 244 209 25 183
2350 183 -34 68 354 67 -179 -239 234 -49 122 -333 -139 -113 -81 77 -303 -240 -137 231 269 -46 -10 -121
2372 -121 -34 172 -90 -148 -212 -181 160 -83 -207 -101 204 -40 -1 -357 -298 34 74 50 -89 -128 75 91 47 -123
2396 -123 -280 -63 101 305 -216 -281 161 250 70 79 -222 -217 161 228 -144 -50 -95 -10 17 271 -5 -254 137 318
2420 318 237 -41 156 176 9 126 -381 -140 112 416 140 -49 -210 98 -246 214 -59 -210 -103 -38 234
2441 234 -110 -297 21 118 76 58 -174 -79 23 126 -192 -266 -257 -191 30 64 -96 -217 -159 79 95 -138 -539 -233
2465 -233 186 98 -261 -184 -243 115 244 -179 -216 -171 -77 234 94 -212 -186 -64 216 -164 -194 -226 213 177 125 176
2489A76l81K22L44j73l27K73j17K61k08J69j42j15K35rL6m19p5M19Q2N6n70K84
2511B1J95k40Q3k94oP9L27j02k21j09J59P1qN4j49N2Q9L33k44m40K10J36J59l15
2535a60K80k46J99m6R0k72j23Q5K43p2k10J68K80k17j50O9j01L42J9j78j56J4
2557a42J04M78l22j91RM6L58j97QK8k88K03K17j29k46J11J00rj12J79l02M21j58
2580A66j04j34m5L00l5K45l82j96J13K20o5k47j26K41J32j09l6k09K25J57q0l3
2602bj73J24P2O9k12j32%K07J07J7l06p8J72L55j54l6J4r8K08L2k23Lrm0L65j99
2628H3l72J22L85o3j01k28O8L83l08J06j43J9J11J90p8L6l38K62R8m7m45J47J67
2651E4J50j19j4k14M0L10j03k80N9J71oJ03R1k51j44J71J90k76N6p7J04L13k33
$$ plain form
2489 176 -205 17 361 188 -139 134 17 278 70 239 97 -18 217 208 244 -175 -250 169 251 307 -263 21
2511 21 216 -24 59 -235 -241 -162 165 63 -158 -267 -108 -37 -45 9 -140 -88 1 334 90 -350 -140 -4 155 -160
2535 -160 120 -126 73 27 117 -155 -278 -193 50 -22 -232 -64 216 -1 -151 -82 -183 159 178 0 -156 -142
2557 -142 -38 440 118 -73 -64 -18 340 143 151 179 -109 94 311 182 -64 47 147 138 26 205 -97 324 166
2580 166 62 -72 -117 183 148 393 11 -185 -72 148 83 -164 -290 -49 83 -26 -62 -271 -46 111 31 -2
2602 -2 -175 -51 21 90 -122 -254 -254 -47 60 77 -229 -307 -135 220 66 30 44 -54 154 186 -37 -34 -43 -83 282 83
2628 83 -289 -167 218 155 54 -174 -106 277 -31 75 -68 -49 62 252 174 210 -128 134 232 185 -260 -113 54
2651 54 204 85 71 -143 -103 207 104 -176 -117 54 48 151 242 -9 -153 18 208 -68 -12 -89 15 328 95
2674I5o4r3R5R7p5l02k2K01J82j83L6l87M47j63Q0p1J78k44L34m6p5k05j7J80
2698b2k0J11j05j91K49K30l84K6N5p8L5J90l99P4J43K60j57oj81PN35k34j93j53
2722b08J79J65o9J23k61K9k9J37o2j06r0K27K09J76m52j70J67K89k91J49k37R0
2744c5n1P4j02O9J04j18K05k49k41J51L33j43j52j2l05N26K82m62k90K34K08M
2766C0k55j4K01M9J97r2Ml86J61K09K0j59k64P4Q1K62j30j32J67N3j6M9l63L89
2790A35J03M2l34o5K56N6J16k05j78O3P8K83l15q2%J20P2m6q3J32q6L7j70j11
2814a82Pk2L19K69k87r5k16J09J25j3k72o0K12L7M1k65N6K99j68j59P3K0J92J29
2838A49p5l42P3j06L05J5K4l48J55K45K62o28J28j1K37L10l05l48M46m7j40J36
$$ plain form
2674 95 31 -62 33 130 55 -247 -269 -68 114 -69 -33 -420 27 -136 -56 -127 51 -193 141 95 20 -185 -202 -22
2698 -22 -42 69 -36 -227 22 252 -132 -106 -51 -129 -94 96 -303 -229 -86 174 17 11 -170 -163 372 138 -55 -208
2722 -208 -29 136 67 190 -71 -42 -71 66 4 -102 -192 35 244 420 -32 -202 -35 254 -37 112 -125 -35
2744 -35 -86 -12 -114 -45 59 -59 146 -103 -344 -193 140 -3 -155 -167 -472 54 336 -126 -416 -182 26 30
2766 30 -225 -239 -38 11 208 116 120 -266 -105 104 124 -35 -299 -225 -144 118 -12 -144 23 76 60 109 -254 135
2790 135 238 280 -54 -119 137 193 309 104 -74 -11 67 350 35 -47 -47 73 145 99 16 148 62 99 -71 -182
2814 -182 -175 -197 122 391 104 9 -207 -98 27 14 -258 -318 -106 -69 -28 -293 -237 62 -106 -265 -192 -172 20 149
2838 149 74 -268 -195 -301 4 19 43 -305 -150 95 357 -271 -143 -154 83 393 88 -260 186 139 -1 135
2860A35q7q3J31J95j81k90K17j32M3K30k13J13L6J12k0k34J14k39L09k37l8r7
2882b16J95L67m03J62k41J51N6m5j31PJ54K22q8j29Q0m00L96k25K04j16k58L11
2904E3M4j1m81M45k53J79K09j71j73R5R3J12j50j46L2O1L44m46p3rJ86p0L54o25
2928d01J26L70o8N2m47K65J73n7k27R7kJ32M5K54l35K6m6K41J73k85k08K55J33
2951B66P6p1n20J20K54N6J3j1m13K19K47j52k8j20O0Jj09J40k21L09k22L38n52
2974c20J45M8N34k71r5k10l5K69j8p7j30J08J39J14m67J08r6K58J41N1k62jk4
2997i1J49j40L4k30K80j43K95k40MqL9J02p9k62K47J49K43m72N7q9N84l3k43l12
3021a59J58J05l0M05l15k48j9L99o1n33K32J10P4J50m45L29m35M61k40l0L1r3
$$ plain form
2860 135 48 -35 96 291 110 -180 37 -95 -52 178 -35 78 114 226 206 -28 86 -153 156 -81 -119 -216
2882 -216 -21 346 -57 105 -136 15 71 26 -105 -98 56 278 190 61 141 -259 137 -88 116 0 -258 53
2904 53 97 86 -395 50 -203 -24 185 14 -159 -64 29 141 -9 -155 -123 -62 282 -164 -237 -246 -60 -130 224 -401
2928 -401 -275 95 27 79 -368 -103 70 13 -214 -117 -119 13 58 312 -23 3 -43 198 371 86 -122 133 266
2951 266 342 271 -249 -129 125 181 194 183 -230 -11 236 84 56 -64 -4 -3 -112 28 -193 116 -106 232 -320
2974 -320 -175 -127 407 136 41 -169 -204 65 47 -30 -160 -52 87 201 -266 -158 -254 4 145 196 -66 -67 -91
2997 -91 58 -82 -48 -278 2 -141 154 -86 -82 -90 -51 51 -28 -290 -43 106 349 -123 -66 -155 429 396 153 -159
3021 -159 -1 104 74 479 164 -84 -103 296 235 -298 -66 44 118 268 -177 152 -283 178 -62 -92 -61 -154
3043a54K76L0n8j12oK55k34J63l14k78L64L19m2k89k57M16N7k72J72j22nJ41n3
3066cJ05k90K28j8n1O3l9l36M12J50j05j63j06K06j6k42q7K80N0K3j27pp0J74
3090C1K47q8l16K83O5j63K03l19p9J94q8k0RL6m3J50K3l0j39OR1p6o7P2Q8j1l8
3117B1J86l09J51J94l60J86k35p9J43J06K3j77M3k24L27J36j03jj48Q2L14l43
3139f7o6J21Q7K76l89K1k10K46j04N8m0j08L10j49n2K19j60RJ90j14j28j02j08
3162b60N4L24k40j40K02k1N26n09L0M6K0J18j3J52m24J31K96q4j57k07L14K54
3184D12m06P2j20j08M27l27R3j25Q2R8J3m1p2j66J75J23l65K5P5K48P8M2l66Q6
3208d7P0J13k92J96k31J44J94j04j79P1o7nK01j15n5K60n5l46O7j0J31j42K62
$$ plain form
3043 -154 122 152 94 -18 -24 231 -3 160 -154 -432 -68 251 209 -80 -337 79 136 -136 36 -86 -91 50 -3
3066 -3 102 -188 40 22 -29 34 -5 -341 71 221 116 -47 -153 53 37 -205 -292 -12 38 61 -66 -73 -143 31
3090 31 278 190 -126 157 222 59 262 -57 -136 58 -30 -50 -41 -5 -48 102 125 95 -44 -38 53 -23 -90 -18 70 59 21
3117 21 207 -102 49 243 -117 69 -166 -245 -102 4 27 -150 -107 -331 -4 132 29 28 -120 -38 276 -67
3139 -67 -133 -12 75 351 -38 -17 -227 19 -85 -27 -67 -175 135 -14 -66 153 -7 2 192 78 -50 -152 -260
3162 -260 -206 118 -122 -262 -60 -81 445 -64 -34 12 32 150 137 289 -135 -4 292 208 51 -156 158 412
3184 412 6 78 -42 -150 277 -50 43 -82 0 98 111 70 -2 -168 7 130 -235 -210 -135 113 191 233 -133 -47
3208 -47 23 136 -156 40 -191 -47 147 43 -136 -65 -132 -137 64 -51 -106 154 99 -247 -180 -190 -59 -201 61
3231F1k35m4J59K60l02p4J45k08J98J08j11p0J24N3n6j38J66j71J82n3L1J82j38
3254F9k5P0K76l16j24%K46M2k08j82k06O48k57O8R8j85o9O1q7JN0Q6O9k59K73
3279A39K31p8K9j76j48P8j54M6l4Kl99L23K38k69O9o8N0nK02j20j02j87L66J09
3303A42r9o3m6O3J35M9j56j78O5Q3l9n2J53j3j16L33j16j69j4K17k2j69j18J5
3327a15M60k23J79m08j0K78n3K6Pj0l3r6P9M1j41LJ65j35j75j05O1N11j85k1k68
3352a68J7Q5L3J76k17J10r3k5J96m04k1M74j04M9k44L7O3r5J79j47l5J15k48N3
3376b14K72n0K09r9k81M56m32M0K27q8p7lj47K89R9k2j35Q9m11K45L19m60K2N4
3400i8J23K1j1l16L48J70j07Jl44L47K9r5k55J02K35k0O6k55K34N5m5k26K09j87
$$ plain form
3231 61 -174 -218 -59 201 -101 -175 -30 -238 -40 68 -43 -113 11 64 8 -130 36 -135 47 -6 25 207 69
3254 69 44 114 390 74 -50 -50 196 238 30 -152 -358 290 33 101 199 14 -55 6 -81 -80 -30 56 125 -134 139
3279 139 370 292 321 145 -3 75 -79 -33 -67 -65 -464 -141 97 -172 -103 -171 -121 -126 76 -44 -146 -333 33 142
3303 142 43 -20 -66 -3 132 181 25 -153 -88 -5 -44 -96 57 44 -72 261 145 -24 -38 179 157 -12 -130 -115
3327 -115 345 122 301 -107 -117 161 108 134 141 131 98 2 81 122 -19 -16 149 14 -161 -266 -205 306 121 100 -168
3352 -168 -151 -66 -33 143 -74 36 -57 -82 114 -290 -311 163 59 108 -136 -99 -36 -131 48 -99 -134 -19 -267 -214
3376 -214 58 8 217 118 -163 293 -139 -99 128 40 -37 -40 -187 102 201 179 44 133 -278 -33 286 -174 -152 -98
3400 -98 25 46 35 -281 67 237 130 131 -213 134 163 68 -187 -85 150 130 196 -59 175 230 185 -41 168 -19
3424a9PJ39K52j87k49o7l4K54j76j32k30K75R4J53j81N1pN9J95o5p1l20L57l8
3448F0K6j57O1j30J99q4k27L47p7j80J80j33k8P3K8K8j7N1j10K42j40r1K01k43
3472a21K68p9j47o1j2K01L5j1j00j43K65J52j39o3j54M6L00K9l19P8K2Q1n0N8
3496A36o2j1N4l33K32P0l4L7m1k1J88k36J60O3j82k7k97L38K16m33K87k34k7R3
3520f4k22J32N0K27k46qP4J56j80N4o4O1j37q0L27j6qj42K08j69J84k62J76K5
3544G6j15J4m4L1J10N6KK1j43l29J79L25m3k89j61L53J00ll62K08m0L9p3L55j57
3569A10l11K57j68K61m37K6L26n5L9k16O4J59Lm5Q2p3j05J94k57K0j48J67J72
3592F5j06K1N2K2j30m5J10q5K19l3l42K25J39J9J97k21r2j28n4K62j45J16j72
$$ plain form
3424 -19 -12 127 379 192 -57 -124 -158 96 -80 -212 -442 -167 -73 80 -101 -50 -57 2 197 132 61 -259 98 60
3448 60 86 -71 -10 -140 59 -25 -252 95 18 -162 18 -115 -143 -70 -42 -14 -31 20 -90 152 12 -79 122 -121
3472 -121 147 68 -79 -140 -152 49 84 73 -27 -170 95 247 108 45 -109 -63 237 266 -53 25 47 128 78 136
3496 136 74 63 117 -216 16 86 52 89 48 27 215 -21 139 202 20 -7 -304 34 250 -183 104 -130 -157 -64
3520 -64 -286 -154 -104 123 -123 -131 -57 99 -81 -27 -91 -30 -167 -247 80 64 56 -86 122 -47 137 -125 51 76
3544 76 -39 -25 -69 -38 72 128 130 151 8 -321 -142 183 140 -149 -310 43 143 140 -222 -14 -54 -15 -88 267 110
3569 110 -201 56 -112 149 -288 -262 64 9 48 -168 -104 55 58 13 95 22 -83 111 -146 -126 -274 -107 65
3592 65 -41 -20 32 54 -76 -121 -11 -96 123 90 -252 -27 112 131 328 107 15 -113 -167 95 -50 66 -106
3615a06L30l37J55r4l4P9j11L79m13K00K2RR6q0k26J1k3L4J34q5J1j08K78N9k22
3640d2L9O8K88j42k06K73k78P5j25n2j70L44k5j96K70j90j3lQ2l7j4k28J96J91
3664A05k44N9r4J72J29J90n53J37J6p3Q4j95K33j19K58j06n7L3j19J2J39O6k76
3687b03Q6J96J9j74L7N7j01M3J25j57l06K54R1P7J65m09J58L8m0J33m1n7J4p0
3711f5K6MJ43j3M7r5j85K4L1L43k80n4q9M63l2o0l10N3P9L9m0J30j73r3K7L8L32
3738B90l70j71K59o8N1j07N9N4O3o4k96O7L02j9P8r6q2J14l2j22K8j49Q8J89N7
3763A23J43l59P6j20J96j39k5Q7J12K6n8j00K58k36R1j72k4K34J07k14M8P0j07
3786A7L4J22Q5k03j49L9K16k00k6o8J03k31K46j14M3l2M7J80k94J48j01Q4K02
$$ plain form
3615 -106 224 -113 42 -52 -86 -7 -118 261 -152 48 70 79 175 95 -131 -120 -143 -109 25 -60 -49 -157 121 180 -42
3640 -42 -3 65 353 211 5 278 0 75 -50 -102 -272 72 47 -149 121 -69 -82 -85 -3 -40 -54 -282 -86 105
3664 105 -139 -80 -174 -2 127 317 -236 -99 -83 -156 -72 -267 -34 -153 105 -1 -58 -25 -144 -132 7 73 -203
3687 -203 -117 79 98 -76 -39 18 -83 -40 85 -72 -378 -124 -33 44 209 -200 -42 -4 -44 89 48 -9 5 -65
3711 -65 -39 -35 108 95 142 47 -138 -114 -83 260 -20 -74 -163 300 268 208 -102 -49 30 69 29 159 -14 -107 -80 -42 290
3738 290 -80 -251 8 -60 -9 -116 -57 -3 60 -4 -300 -233 69 50 128 32 -50 64 32 -90 -62 -211 -123 66 123
3763 123 266 -93 -17 -137 59 -80 -105 -18 94 120 62 -38 220 -16 75 -97 -121 113 220 6 54 124 17
3786 17 51 173 258 55 -94 -55 161 -39 -65 -133 -30 -261 -15 -129 -86 -118 -71 109 -185 -37 -138 -54 148
3809A48k85K17k91K27M7J8m4k11K8K89L9j78q5%R8R3l59J73K4j11J54m8N7%j03
3834a03j09K30j27r7J99R5o4n5j21K53j11Mq7L1K38j46r1j85K54J16k21N3J21
3857G7n3n1j53J06J49M7k03J62k5M2L1J36m48R1K27l42k1N65q0l55J47n4p8L2
3881e1j97J93m5j45mL68l71K7K10r4l1K70l51J11K64k99K81k5ljj88n0M29n44
3905b46J68P0j41J59j13R2L62k58o2j01J34j4Q2J30k97L6p1J24j38J26L3q8l1
3928d4q7K27o8j07K21m1J54l68K90j64j86K36r1J33M3o2q9j38p3K18K74l61J24
3951D1J0l36L86k86j08K25J0Q0o9J95l2oj20r6J87j42p8M3L06l13j31K93k51J48
3975d4J00J0k47K34j29J97q3j34K59j26J59J8j57O1j01N8J5o7J75j92p0K3j43
$$ plain form
3809 148 -137 80 -211 16 63 81 37 -174 -146 143 182 4 -81 -81 17 110 -249 -76 -52 -163 -9 -57 0 0 -103
3834 -103 -212 18 -109 -206 -7 88 24 -31 -152 101 -10 -6 -93 -62 176 30 -61 -246 8 124 -97 -44 77
3857 77 24 -27 -180 -74 75 122 -81 81 56 98 129 265 -183 -92 135 -207 -228 337 257 -98 49 -5 -83 -51
3881 -51 -248 -55 -100 -245 -249 119 -252 -225 -15 -109 -140 130 -221 -110 154 -145 136 111 108 107 -81 -131 298 -246
3905 -246 -78 -8 -149 10 -103 -11 351 93 31 -70 64 50 132 262 -35 1 -70 54 -84 42 75 -13 -44
3928 -44 -131 96 28 -79 142 101 255 -113 177 13 -173 63 -28 105 148 86 -3 -141 -214 4 278 -83 41
3951 41 51 -285 101 -185 -293 -68 -58 22 -47 148 116 110 -10 -106 81 -61 -139 -96 210 -103 -234 59 -192 -44
3975 -44 56 66 -181 53 -76 121 38 -96 163 37 196 214 57 118 17 75 90 23 198 6 -64 -41 -184
3998a84k2M6j1K9L4K30k0o5pM0k30K22K41k10j19j79J75L99l66r3O3l5l3J82M
4023I1l1k45K45J3k78K29m2J68m33K34j24J44J37j30p3j89L85p3J28j6k65m1K82
4046A16k3m3j27j11L45k74N5j04J40P2J57k69K60r5K0j73r2J87n8r0K50k23J57
4069G7j24p1K96l04K43l16J79o8K62j55k03j21L08r7N2qR8O5o0r7j79L22j21J17
4093I5l4K5j54L9M2l6j7j67L22j44j42J21r5K09m1j0R7k67J11J3o0L6o9J8P9J4
4119a5m5K41k88j1L58j58k10L49j30j71K25j20m4K4J7n3j37L79m80M07o5j60L34
4142B47k02J84l88J78j76K9K10K34j60j68K5P5L1L1k88J58p9J85j19R1j36J35
4164I7K0j12r8M32j58j10n7O5k34L89k21l7J77n3R2j91q2K9L14o32O34l27j60
$$ plain form
3998 -184 -206 -160 -171 -142 -108 122 102 37 30 70 -160 62 303 93 -26 -205 -30 369 3 -90 -27 -62 -95 87 91
4023 91 60 -185 60 73 -205 24 -18 150 -283 -49 -173 -29 108 -22 -95 -284 101 28 156 140 -125 -166 116
4046 116 93 50 -77 -188 157 -117 -62 -166 -26 46 203 -66 194 99 119 -54 -146 41 -17 -107 143 -80 77
4069 77 -47 -118 178 -126 117 -199 -20 -88 174 19 -184 -305 3 -94 -42 -50 48 113 53 -44 -223 99 -22 95
4093 95 61 86 -68 -29 13 -23 -40 -207 115 -29 -171 -50 -145 64 23 13 110 -157 -46 -33 -93 -57 -126 -108 -29 -15
4119 -15 -60 181 -107 -118 240 82 -128 221 91 -80 145 25 -19 5 22 -31 -168 211 -269 138 73 -87 247
4142 247 45 229 -159 19 -157 -128 82 316 156 -12 13 88 119 150 -138 20 -59 126 7 98 -38 97
4164 97 117 5 -93 339 181 71 14 79 -155 234 13 -24 153 100 192 1 -81 -52 262 -370 264 -63 -223
4187b23K19Jp3k8j6J32J76j38J66k91k6L2K09Q1k32L4j73L18l87J98M8k4N3k5
4211C1o7J50N5m48K07J7J2j45R4O4J7r0J52j96R1q2L62j20q9j40M2Q9J6j94L18
4236A46m0K6j33j1n2J2J51o5l2N7J8N1j95n4r9J99j73J59P4J25p1j66J58J93j16
4261A62j62J34k06r7J05J7J68q3j00J50k22J36J77j66r6J08J06j13J9j06K0k2
4283g1J67Q9r6j69J35j86J52oQl2J51k02K21k59m3L01k10l5L87o1k79L5L9%mq3
4309e1K43r1p8r9k5J45P2j32R7pj49R5M4o1J5k10K26L7k83L6N8M28k89J46r8J3
4335H2J17k23j63J61N5j99J32J36k07M61l44j1j23K2J10J81j38j06r4K04L3j37
4357e1j27j7K69j38j08J36J22J03k95K11L7l53J75k2K9J43k77J14K02l3J31j97
$$ plain form
4187 -223 -4 -3 -76 -104 -120 12 188 50 216 -75 -101 -69 140 221 -11 23 -150 168 -219 -21 27 3 56 31
4211 31 -36 114 169 -279 -72 -55 -43 -188 -94 -30 -13 -103 49 -147 -56 -138 224 104 15 -125 -83 6 22 -172 146
4236 146 106 132 -1 -12 -64 -52 99 34 2 59 77 128 -67 -121 -220 -21 -194 -35 39 164 93 -73 85 278 162
4261 162 0 134 -72 -169 -64 -47 121 38 -62 88 -134 2 179 13 -83 25 131 18 37 -69 -49 -71
4283 -71 96 185 89 -80 55 -131 21 15 23 -9 142 -60 161 -98 -141 160 -50 -85 302 241 -38 -3 36 36 32 -51
4309 -51 192 101 23 -76 -101 44 116 -16 81 74 -75 20 64 3 18 -192 34 71 -212 -176 -118 310 21 167 69 82
4335 82 199 -24 -187 -26 29 -170 -38 98 -109 352 8 -3 -126 -104 6 187 49 -57 -151 53 86 -51
4357 -51 -178 -195 74 -64 -172 -36 86 189 -106 105 142 -211 -36 -58 -29 114 -163 -49 153 120 251 54
4379E4N7m0j84P4J04N2j02k33J23K48j97O6j33M8K9L2P9J7j09J24N5j57K9j27
4403i1M8r8J35k04K78k2r8r8LQ4J99l39J42J58j1q8j92J61N1J1M2n1J5j09j22
4428a96K59k10M8K9n0L07j33j92K38k77M22k09N6K2l30L86k96J24n1J9q8J11p
4451a8k02J57J02pOj12L7J67k07J77j37M3J17k28J91k95K35k19J30P7M0o9N2K6
4475F3j66P0j67K59k06J86j36L4K40k02j9k3L7J33l05L47m5n9L7l7j01N4j79Q3
4499a02J58l3p4%K1J26K4N4n5k59rJ32K15l0j24k60M38k65p5K40q6n4l32M72j96
4524g4j3J1K0J88j69j9L0J64k27J09q4J78j84Q0J97k71j93L07P5j16K2j64J65
4547C2j29J78Pk47M24j37l21J30r6K23o1K33k20k3J44j23k6j30J56J6l7m5J6K66
$$ plain form
4379 54 111 71 -113 -39 65 117 15 -218 -95 153 -44 22 -111 -63 -34 -2 77 94 -15 109 164 7 36 -91
4403 -91 -43 -141 -6 -210 68 46 -52 -150 -147 -63 136 -203 -61 97 86 -2 -194 -33 18 29 71 20 35 -74 -196
4428 -196 63 -147 -99 -70 -120 187 54 -138 100 -177 245 36 92 114 -216 170 -126 -2 -53 -34 -122 -11 -18
4451 -18 -220 -63 39 32 38 -74 -37 130 -77 100 -37 6 123 -105 86 -209 26 -193 -63 14 54 -15 37 63
4475 63 -103 -33 -200 59 -147 39 -97 -63 177 -25 -44 -67 -30 103 -202 145 100 41 78 41 -60 -6 -185 -102
4499 -102 56 23 -51 -51 -30 96 120 174 119 -140 -149 -17 198 168 44 -216 222 -43 -118 122 36 -18 -350 122 -74
4524 -74 -87 -76 -56 132 -37 -56 -26 138 -89 20 -64 114 -70 10 207 -64 -257 50 125 9 31 -133 32
4547 32 -97 81 88 -159 265 128 -193 -63 -159 64 3 236 16 -7 137 14 -12 -142 14 30 -7 -52 -36 230
4571B30l10k5J54q2Nj09N6L80m00J68j81K01k78J60K9PL25o11M9J20J02L4L14
4594C38l11k63r8M07K5k28L00k41j6J14J8j75K38k9k37L51j42M2Q5k91J34j75
4616a54NK79n7k01J09p8o6O6K39j2j05P6J19N6k95Nm0n8m2J27k39L69j19RJ62
4641A55j57M8M8k99J33l7L77j12k7Lq8j09m7J86P6m6l51K28P4j87K46o8j15L9
4665c0J12l43K30j45L85p9j15k1n6j88K3L80j78J13j52J24k0m2N3r9j14R7m0J75
4689G0r7j59M43k64j25Q7M1QK27n6k46L51k54j60J35k2o7K44k03Mj5J87j47J50
4713A32l41n6K75J7j31J73j99J39j34L23j66nK1k94N72k09k92K15K13j52o9j43
4735a11m1J95j7k80K94J22j37LQ3J4j14P2k11j23P0R5J21j05J00j97J73Qj14L16
$$ plain form
4571 230 -80 -105 49 -33 -28 -137 -81 299 -101 67 -114 87 -191 -31 -2 5 330 -281 -232 -112 -10 24 338
4594 338 27 -236 -334 73 98 -130 170 -71 -87 27 45 -130 108 79 -158 193 51 93 178 -113 21 -154
4616 -154 -149 130 73 -128 -19 -97 -163 -97 142 130 25 101 220 276 -19 -14 -54 -112 -154 -27 -266 103 -16 -7 155
4641 155 -2 46 94 -205 -72 -109 268 156 129 132 44 -65 -112 74 150 104 -247 -19 55 -132 114 46 -69 -30
4665 -30 82 -261 -31 -176 209 130 15 -6 -62 -250 -227 153 -25 88 -64 60 40 -2 51 -48 -162 -65 -105 70
4689 70 -27 -186 257 -7 -132 -45 -4 4 231 175 -71 280 26 -134 1 -21 -88 156 -47 -43 -58 129 -18 132
4713 132 -209 -265 10 27 -104 69 -130 9 -125 198 32 27 48 -246 326 117 -175 40 253 101 32 -111
4735 -111 -152 43 26 -254 40 162 25 28 111 125 11 83 -128 -251 -181 -86 35 -70 30 -167 6 14 -100 216
4759B16l41%j18n9L40J60ll01J3K47k65J73n3p6K28l46K47j59J06L95l24q2n4
4782e6J69j83J94k74J76j38P7J5O7j24k4J17n6J16m6j15L31k78P5K08k01p8k57
4805b85K22o8K12ONr3j07O2M7N3l6k07P4N7j37K10J6j21on1K83Pk07O1J18K9k14
4832g0N2r9k2l1L74p5j85qj53N22o0m16J7Q1J56j15K6J09N3k31K03j14k93L07
4856B8j49J41j15L10l02O5p9R0J0j86P1J40j29L34k84Q4r6n6L30l63N2N7K27j31
4880D9K5k43p2M5L62k43j27L36j83k6l5K8K16n7k79K92l0j56p3M9L39k93P4k2
4904b4J01J45l75J07j1M4j0Kj20l8J78QL6n2j09K00k25J46q7M2J63k15K69j71
4928DJ46k10k7pP6K64k14L0j31L3N2o7p1J09J78l85L05j36L2k9K53j24j89K8n6
$$ plain form
4759 216 -125 -125 -243 -302 38 198 195 -106 -93 154 -111 62 9 -67 161 -185 62 -97 9 404 80 -2 -56
4782 -56 113 -70 124 -150 26 -112 -35 -20 47 -77 -101 16 -40 76 30 -85 246 -32 43 251 50 -28 -285
4805 -285 -63 -131 81 87 92 -1 -108 -46 1 54 18 -189 -115 -58 -195 15 31 -90 -96 -147 136 143 -64 -3 115 144 -70
4832 -70 -18 -117 -139 -170 204 129 -56 -64 -217 305 245 -171 -154 -73 83 -32 -6 103 156 -75 128 14 -279 28
4856 28 -121 20 -95 215 -87 -22 -101 -11 -1 -187 -116 24 -105 229 -55 29 -67 -123 207 -156 -104 -47 180 49
4880 49 74 -169 -241 -196 166 -77 -204 132 -51 -77 -112 -84 132 75 -204 88 58 -98 -171 -122 217 -76 -2 -24
4904 -24 77 222 -153 -46 -57 -13 -23 -21 -141 -179 -1 7 43 -9 -118 82 -143 3 -84 -42 121 -94 175 4
4928 4 150 -60 -87 -94 -18 246 32 62 -69 -36 16 -51 -122 -13 165 -220 85 -51 -19 -48 205 81 -108 -80 -136
4953a36k69K35K25j88R4KP0l80K21J71j79j49L29K30l89o7K17j46J07J58j12r0
4975d6l8m5L35n7k59L07k91P2j10J31L3J2K2k10O1J51j75pQ9l1O3K53l86J58q5
5000e3R8p7Q0j0J55j43L33o57L52Q8j02j98K95o4o8Q3k75J41q8M8K40M0j76j46
5024a04m9Q2o6K15k17Lp8L12M5k86o0M09m15K91R9Kj24J28k68O1K85r6k87KK79
5049A63m06J68J40N4k4L9k51K12p0J58m30K95K1j34j32K18j96j52L36j44K27j5
5071G7N7q3J15l14K82N2k69j33J61mN0P7M2n8k14L72l13j18M12l11J99M2j28J26
5095A19j70J84J30k31j50Q0M1J22j93P8j36J62j00L6k2O0j6J30j36J05k66K23
5117E0j17R8j00K22j2j55K01j98J70j47J53j09J42j21j37K5Q3j29mN8J50l44K67
$$ plain form
4953 -136 -405 -170 55 -133 -39 -37 33 -347 -126 45 -134 -283 46 276 -113 -180 37 -109 -2 156 44 -46
4975 -46 -84 -129 206 149 -110 197 -94 -22 -132 -1 32 44 66 -144 -83 68 -107 -114 -25 -56 7 260 -126 32 -53
5000 -53 45 -32 48 38 193 50 383 -274 78 166 64 -134 161 97 29 112 -163 -22 -110 -62 178 218 42 -104
5024 -104 -153 -71 -137 78 -139 -136 -214 98 143 -143 -203 206 -209 82 181 183 59 187 -81 -20 265 169 -118 -116 163
5049 163 -243 -75 65 119 95 134 -117 95 25 183 -247 48 69 -65 -197 21 -175 -327 9 -135 92 77
5071 77 134 51 166 -148 134 186 -83 -216 -55 -59 -9 68 110 52 -162 210 -103 -221 191 -120 79 121 -7 119
5095 119 -51 133 263 32 -118 -38 3 125 -68 10 -126 36 -64 -28 -50 10 -6 124 -12 93 -173 50
5117 50 -67 31 -69 153 141 -14 187 -11 159 12 165 56 198 77 -60 -35 48 -81 -85 -27 123 -221 46
5140D6j79J3J28j06n9L23j93o5K22o0N1Pl23oj21K84R7l2J0m0mQ5j21j53J62j02
5166a36M1J71k2j3j60p4n6K17l7J50P1k14J25o6R8k56Q5kQ8K1n4J48k04r1j1L25
5192A44k37K06r6R6l6j37Q8J03k50L76k18J99l23K4K20l04J51nJ2K16k53o5M02
5215C13n46J54J76j02n1K50j54M6o5j64j11K35j7K81j91r8L05k73O8j32L2J29
5237H5k25K5J22m8K8j2K1l1J11J07L3l28Q3N5j05RL6pJ34N6k37K32j73J73j24
5262B0j13J1M6j66K30j42n5J55Q2M3k75J68j27j86K50p3M4K99k56m7K04j50P2
5285C4l35L49K10l30q6l7L82k43J01nj13Q1N8j58K68m62L06k4O4q5N0K16m69K56
5309B8Q6r1j08J16L0k30K21j21K20j43M9k16M7J06o7J92j5j75j58K84r3j28N9
$$ plain form
5140 46 -133 -120 8 -98 -157 166 -27 -92 130 70 121 128 -195 -201 -322 -38 59 27 37 -3 -7 78 -43 -196 -34 -136
5166 -136 -95 76 54 41 -119 -193 -249 -32 -69 81 152 -62 63 -3 95 -161 -76 -78 10 31 -23 125 -79 -170 -181 144
5192 144 -93 113 17 113 77 -60 28 131 -119 257 39 238 -85 -61 159 -145 6 1 13 229 -24 -89 313
5215 313 -233 -79 97 -5 -56 194 40 86 21 -143 -254 -19 -36 245 54 -44 261 -12 56 -76 -44 85
5237 85 -140 -115 7 -41 -13 -25 -4 -35 76 183 216 -112 -29 26 -79 -70 -34 -41 93 149 -88 144 -29 144 20
5262 20 -93 -82 -36 -202 28 -114 -169 -14 68 111 -164 4 -123 -309 -59 -132 -88 211 -45 -92 112 -38 34
5285 34 -301 48 258 -72 -158 -195 187 -56 45 40 -73 8 66 -92 176 -286 20 -4 60 -25 25 241 -228 28
5309 28 114 23 -85 31 61 -169 52 -69 151 8 57 -159 -112 -6 -73 119 104 -71 -229 55 -38 -166 -107
5332a07J56P0j68l0Q1J75j71j47oJ37n6O9N4J61l76J64j98J25J2J44N7k68m1j8
5356a81K27Oq0j96K72j63J38p4J07J46m9nj81p7O7N2N9p4l2K16j63O7l03Q2K99
5381A60j19j23J46p4J9o5K07k54j4J09rM2K1j63L30m9j61j72J08K53j53j17L4
5404d4J5L17k92P7j2j79R4k0P2K7J50l55R3rJ60j5j47J22l31M08k58J18o7J42
5428F6lj37K45j99J38j17n0J10r6K71k00P4j23PJ24L5j92N0j52L83k41j46K67
5451A14O0j18r4m2j1o0M05j03m1j36qM6J26j0j58M5q7Q6l5K27k53j70J85J23l2
5476E9j97J18o0J45j25j3p3K76j64m1J85j03N5k52K29k18J43O4J0L5P3p5k16q
5500a53J69J30j69J7k63J19p6L05o5j9K36j49j99L30k37k3l2K14j30j53L04j18
$$ plain form
5332 -107 49 119 -49 -79 2 177 6 -141 -147 -10 -66 3 57 218 -158 6 -192 -67 -55 89 146 -122 -163 -181
5356 -181 46 52 -28 -224 48 -115 23 -51 56 202 153 148 -33 -110 -43 9 68 -6 -38 178 15 82 -221 -139 160
5381 160 41 -82 64 -10 9 -56 151 -103 -117 -8 -17 25 46 -117 213 164 3 -169 -61 192 39 -78 -44
5404 -44 -29 288 -4 73 61 -118 -24 -44 28 55 205 -150 -57 -66 94 79 -68 54 -277 131 -127 -9 -76 66
5428 66 63 -74 171 -28 110 -7 -57 53 -43 228 28 102 -21 -14 110 145 -47 3 -149 234 -7 -153 114
5451 114 174 56 -38 -80 -91 -151 254 151 110 -26 -34 12 138 128 -30 15 -72 14 -21 206 -47 -217 -32 91 59
5476 59 -138 -20 -80 65 -60 -73 -146 130 -34 -75 110 7 62 -190 39 -179 -36 28 38 73 146 71 -145 -153
5500 -153 16 146 -23 -6 -269 -150 -226 79 14 -5 231 82 -117 213 -24 -47 -79 135 5 -148 156 38
5522C8j46r4m7M39j40k22Q0L41m83L56k1l0k30o5M26k67KK0rL8J89l01P8J65j88
5547g1P6M9j31J10j73Q9L8M2k0j18R4k30J36OJ97M4k10n5J66j51J49m3k80K85
5571aJ55Q4m61K33M5j36j79L30J9j22o0j35M21l39R3Q0r6j07L22l70J15K3j12
5594a98K23J44k55J53K92l19K10k48P2k56K98l0k1j40n0N7K69m81K69L5l47O03
5616B80k52j04j14PR4K47K8j19L6j14r4J52l2K2r5J74M6r5j8N2j94l1J23r8J78
5641G9k2j40N6J33k29K75j27J36k98J15n3j60J50J72Q9J24l73J09q9k6Lk6k3k2
5665a47K4J21k6Q8j35l6N2K91j96J5K3l9J07q3J3j52J99k44O6j49L58j81Q7J5
5689G1J11j04J30m07J58K00j62j33K53j04J01q1j47K13j02r5j0R2J8N2R5j85j46
$$ plain form
5522 38 -108 -202 -249 190 50 -172 -92 249 -234 122 101 71 -159 -224 202 -65 -63 -43 -52 -14 175 -126 -48 117 -71
5547 -71 5 54 -77 33 -140 -51 -13 29 9 -109 -15 -245 -109 -103 94 138 -72 -127 39 -112 37 -6 -286 -1
5571 -1 154 238 -223 10 55 -81 -260 70 89 -33 -93 -228 193 -146 -53 27 -69 -176 146 -224 -109 -86 -198
5594 -198 25 169 -86 67 359 40 250 2 74 -182 116 86 65 -75 -125 -68 201 -280 -11 24 -323 280
5616 280 28 -76 -190 -183 -89 158 186 67 103 -11 -105 47 15 37 -58 116 162 67 49 101 -93 -124 -1 -99 79
5641 79 57 -83 -27 106 -123 152 25 161 -137 -22 -75 -235 -85 87 176 300 -73 36 -53 -79 -76 -102 -125 -147
5665 -147 -123 -2 -28 60 -75 -111 -59 232 36 51 74 35 142 59 72 -80 119 -125 -59 -208 150 -31 56 71
5689 71 182 78 208 -199 -41 159 -3 -136 117 13 114 33 -114 99 -3 -98 -108 -16 2 54 149 -36 -182
5712a82J40o5J39o7J24K0q4m6J93j37l5q9N9n4L00l99n0L11j8m4j91K37k52K57
5736F7k58J83K6P9qJ2j97K13j39J92k59M4j7j09L06l49O1J11L5K53l25J7j22J4
5760a70L54k07j97K87qk48J5L05k00j55J68%J26j64L30m06K77j93M9j37J10J20
5782E6j22n9K50O7l63N1M5J22k15Q9J32k00j24K95k8l4J96j26j38J67j37o0R0
5805d6M1j09J94r4p1J54m0L4j66K8L5J43o1j3K53l31k6K36j17j56J74p8J69k86
5829a33M5j4J07QJ55p8j18j55K62N4O1k22J2n0J8K15j72k55J76J39n8r1K21J8
5853A45l7m8j8J98k36J8J78o6k19j8j7O6L8J29k41J9J1L76l94LJ92j08J00j87
5877a16J99J61j19k36J45k20J15L32j56m1J3p0Q7j45j82L70j70K49k80%j4j72
$$ plain form
5712 -182 -42 -107 32 -35 89 109 25 -21 172 35 0 -89 -30 -84 216 -183 -233 78 60 16 -175 62 -190 67
5736 67 -191 -8 18 97 89 101 -96 117 -22 170 -89 -45 -62 -171 135 -214 -153 -42 -7 246 -79 -62 -184 -170
5760 -170 184 -23 -220 67 59 -189 -174 131 -69 -224 -56 -56 70 -94 236 -170 107 -86 -37 -174 -64 56
5782 56 -66 -125 125 192 -171 -120 -75 47 -168 -79 53 -147 -271 24 -4 -38 158 32 -106 61 -76 -136 -46
5805 -46 -5 -114 80 -14 -85 69 29 63 -103 -75 -40 103 42 29 282 -49 -75 161 44 -112 62 -16 153 -133
5829 -133 -88 -102 5 13 168 90 -28 -183 79 133 194 -28 -16 -66 -48 167 -5 -260 -84 55 -3 -94 127 145
5853 145 108 60 42 240 4 22 200 134 -85 -103 -120 -54 -16 113 -128 -109 -98 278 -116 -113 79 -29 71 -116
5877 -116 83 244 125 -111 34 -186 -71 261 105 64 77 7 94 -51 -233 137 -33 216 -64 -64 -78 -250
5899b50K62o6l6j4NN8jJ28Nm3k93p0O3N4J02J92j71J02J01k4l9r6J17k74K08k81
5925b61M86m32J21J50M8j83Q2k8j32k7J48m1K7K21j42j77K80j70j04J77J03j62
5947a6J90P0k42L1j20j22Q2K51j92J65p5J13j56O6q3l8l0L02J5l57K7J11L31n79
5971b56L49j10j94M14l48M31k85mJ62nk05K88l63O6J37j88K35N4K0k69J78j04
5993CJ96r8m39L23m4P2J36k01R3J18j63j9j8l9J34m65L50J3KK24l0j71JM9J27
6018A54j64r8J00l43L58k41K81J6j56J3J33m1J14j08p8r4L69k18J85j21j88K46
6040A19j94j02J45n8kJ37j31K58k44R7N2k3M8qj62J43M9k03J72r6j11J25Q7j03
6064eQ4j39J59K8j83RlnQKJ17j42n8J04P8p1j62M58j44k62J88k25K19j86O0M7
$$ plain form
5899 -250 12 -54 -90 -104 -99 -41 -42 86 91 48 -245 -315 -252 -198 -96 96 -75 27 128 104 65 -31 86 -188 20 -261
5925 -261 225 -207 -86 64 112 -71 11 -17 -149 -176 -28 -69 -42 179 37 -140 140 -30 -134 43 146 -16
5947 -16 174 244 2 33 -87 -209 -127 124 -68 97 22 135 -21 45 -38 -76 -106 196 211 -146 -119 -8 323 -256
5971 -256 93 -17 -211 203 -145 286 1 -3 159 154 -51 237 -126 -60 77 -111 124 178 198 -71 107 3
5993 3 199 101 -338 -15 -59 13 149 -52 41 159 -4 -23 -41 -80 54 -411 -61 -48 -46 178 148 -23 -22 27 154
6018 154 -10 -108 -8 -351 7 -234 47 63 -93 -80 53 12 126 18 -60 -154 215 -3 182 61 -127 119
6040 119 -75 -177 -32 -90 -92 45 -86 172 -72 25 77 54 102 94 -68 75 124 -79 93 -3 -114 11 98 -5
6064 -5 79 -60 99 127 -56 -47 -50 -55 -47 -45 72 -70 -128 -24 54 -17 -179 279 135 -127 61 -164 55 -131 -71 -24
6090b4lL0K23j23p8j65J45K30r6k80J90j06pK5k63J34K43j02k8j55L02j94J34
6113C2j28R8M0j79oK94j3n28L80k0N7N9j03O3Q1N6j15K3n9K35l64K93o0k33J22
6138B5pP9k56J50Nk8J16p1l3p6J79n2K56l21K1QJ9l36Q7J26L9O7j53P2m9K46j94
6165h1L22l79J2P3P2P0R8m6q2j18L17k54r3K12o4J50q9J2j67J98m11L57l35L79
6189A53j14Lk85K63K00l89P9J25o6J2o5K17k43K4J35lJ55k69K83p6j05Q1p2l9
6213Dj57L35k33R5m2j84L07k40L6L4J88k72J22m8J28j10J95m4k25j07J33j0J6
6236g9K45j36p9O9m8J19N7k34Q1j3J27q1N1pj05l7J25k64P6J76K53k81J41m6j99
6261h9K45k84J57o2K39j29J47k60K02j58k25L77k59L1P2J24j45K3O7n1l7n9K2
$$ plain form
6090 -24 -27 3 226 103 25 -140 5 235 139 -141 49 -57 -64 -39 -302 -168 75 -27 -55 -210 92 -102 32
6113 32 -96 2 42 -137 -143 151 138 -390 -10 -30 27 86 -17 46 127 183 68 91 32 267 -97 196 136 -97 25
6138 25 18 97 -159 -9 -4 -32 84 13 -20 -96 83 31 287 -34 -13 -5 14 -322 -235 -109 -70 -3 -156 -84 -133 113 -81
6165 -81 241 -138 -126 -53 19 89 187 141 59 -59 258 4 -89 123 59 209 120 132 -35 163 -248 109 -226 153
6189 153 39 42 -243 20 220 -169 -90 35 -31 -19 -84 133 -110 -86 49 46 201 -68 215 139 34 115 43 4
6213 4 -153 182 -51 44 2 -182 125 -115 -79 -45 143 -129 -7 -55 73 -37 158 114 -111 -218 -85 -95 -79
6236 -79 166 30 -49 20 -28 91 148 -86 -5 -18 109 28 79 72 -33 -70 55 -209 -133 43 296 15 156 110 -89
6261 -89 156 -128 29 -33 206 77 224 -36 166 8 -217 160 -99 -68 4 128 -17 6 73 22 -15 -74 -52
6284e2N8PJ53l06K38p1j09K26j77J4R3J53n5j45N8Mr8J10j04r0L11n7k11J18j2
6309E6k14K77J6k26k65K73K39p9K5j33p7K95l59K91j86m3J34j20K71j24k65J70
6331d4K67j27m0Q5k0k84n3J34%J01R9m09K07J12j53K58j93J19n8k39K28K3m8J47
6355A12M5k51RK98j23K8j90j06J05P1j27R2O7J93J41k58mj64R8O0M4l38K65l8
6379B9L4R1o8j09K37j68K0l98M26m2n2J24k04K02k62K26j93O3P6q0O1J64k94P8
6403c9L2n3J97n1j06j33M01k57k12J36J29j94L1J07J07k87J72J37j05j89j08K47
6425c8q4nK47J08k79nJ0J43k86K86K7k14J66n5l0N6l6J33p1J57k34k59J72J84
6449I3j81l2J91j62j8K63q6q6K00m01J42j13K92j24j90J65R5ML7K2l35L77r5j8
$$ plain form
6284 -52 6 13 166 -140 98 27 -82 144 -33 -19 74 227 172 27 85 89 -9 101 -3 -93 218 161 -50 68 56
6309 56 -158 119 135 -91 -356 -83 156 77 102 -31 -108 187 -172 119 -67 -110 24 -96 175 51 -214 -44
6331 -44 223 96 56 141 121 -163 -216 -82 -82 19 118 -291 -84 28 -125 133 -60 59 1 -238 -10 13 -35 112
6355 112 157 -94 -85 213 90 118 -72 -178 -73 -2 -129 -37 30 223 364 106 102 -62 36 96 140 -198 67 29
6379 29 63 154 86 -23 214 46 66 -332 94 52 0 124 -80 122 -140 86 -107 -44 32 -48 13 177 -117 -39
6403 -39 -7 -60 137 86 -20 -153 248 -9 -221 -85 44 -150 -119 -12 95 -192 -20 117 12 -177 -285 -38
6425 -38 -122 -127 120 228 -51 -56 -46 97 -189 97 124 -90 76 21 -9 47 11 144 73 230 -4 -263 -91 93
6449 93 -88 -120 71 -91 -109 154 68 -18 182 -219 -77 -190 102 -22 -212 -47 48 52 89 111 -224 153 58 40
6473D0j55Q2R4K27k59k73L33l07J29L1L0p9L38m10K26J29j62r7J79k37K02j93
6495a32J31L2P3j27K24j65j4m4L5r2L8k8j10L22j74n1M8j43L39k22r2L23j29j75
6519a33J21Q2j05J77k76L00k11r4J49m5P3j86J69O0r2K50j67k83K27j05j18L00
6541I3j80J22j35J80j48N7p9oR9j69J96j37J82J4j87j0O1m1K73Jk71m7k5O1J29
6566C3l38K15rr3M40j44q5j23J04L4k09J90N1r7L14j27k43P9J81mm7l12K69p7
6590BJ08m6j46K07j34r9K96j51J24k84MJ03J5J24j29j28O6n9K3L70r5l43L11p
6614A32k45J39k2n3NJ39l1n5r7J91l70K18O6j98K56p7J30j01j41K0J49j54K1J38
6638F0k95L53j92mK00R3j60J22j84r0K8o9K48P0m04J07L00j70j31J68J0l98L75
$$ plain form
6473 40 -115 -33 61 288 29 -244 89 -218 -89 -58 -28 -107 231 -179 47 176 14 -83 96 -141 61 -132
6495 -132 -1 31 104 -23 201 36 22 -22 13 -79 -41 -69 -179 143 -31 -82 -34 -177 162 -60 -152 171 42 -133
6519 -133 -12 70 -35 142 -134 166 -45 -139 10 -35 38 -148 21 81 -11 239 72 -211 16 -89 -207 93
6541 93 -87 35 -100 80 -68 -11 -90 -96 3 -166 30 -107 75 89 -98 -108 -47 -88 185 186 -85 -132 -157 -96 33
6566 33 -305 -90 -99 -192 248 104 19 -104 0 34 -175 15 66 -31 283 156 -87 -8 173 169 122 -190 79 2
6590 2 110 64 -82 125 -9 -108 188 37 161 -123 -119 -16 -1 123 -6 -134 -68 -127 -104 266 171 -172 139 132
6614 132 -113 26 4 -49 -44 95 64 9 -88 103 -267 -49 17 -181 75 -2 128 27 -114 -94 55 -99 -78 60
6638 60 -235 118 -74 -78 122 215 55 177 -7 -97 -69 -138 110 180 -224 -117 183 13 -118 50 60 -338 37
6661C7O8L0k85J23MN3K2O1j13j2j77J85j21J9J56N4k43J21j51J14J24j16j07J95
6685D1J04n2N6k62J20J33l11L63k14P5N7Lj7J61k73j36K6L55j16k09J75k22j1
6708a54J11P4k59L68l94J49J6J93j73l3J30j07J48p4J25j47O4k35K24N5j29j42
6730a90L5J63N8k3j62k0K67k4k21K20k00J37J67l30J14p3k4J6k02K27N9j08K4
6753i0K26n6l19J1L02k02M17j88p9r2L4j87J94j72K31Jj53J78j81r4L56l06n1
6776b20R3L78k82R7J36m20K55j67q8r6K40J48k08L19k22O6k20O6J21k63K97k5
6798EJ90k15K7k84M88l46K90k78L24k21J21j5Nj54J29j44J41p8m1J73j74lK6M1
6822GM4J89j83k04K35q6m2K23j72R0j17j38p4K81k64J19K25M4k18J26J81k33J53
$$ plain form
6661 37 105 135 -150 -27 -23 30 52 113 0 -12 -189 -4 -125 -106 50 104 -139 -18 -169 -55 69 -47 -154 41
6685 41 145 93 149 -113 7 140 -171 192 -22 53 110 113 96 257 -16 -152 -126 229 113 -96 79 -143 -154
6708 -154 -43 31 -228 140 -254 -105 -89 104 -69 -102 28 -79 69 -5 120 -27 37 -198 26 81 -48 -190
6730 -190 -155 8 66 43 -119 -139 128 104 -117 103 -97 40 207 -123 -9 -82 -106 -90 -292 -65 -6 -114 -90
6753 -90 136 80 -239 -228 74 -128 289 101 22 -70 -36 -223 -29 -201 30 31 -122 56 -125 -219 137 -169 -220
6776 -220 -127 251 -31 66 202 -218 37 -130 -218 -314 -74 74 -134 185 -37 29 -191 -125 -4 -267 30 5
6798 5 195 -20 7 -277 211 -135 155 -123 201 -20 101 86 91 -63 66 -78 63 -15 -56 117 -57 -60 -34 7
6822 7 51 240 57 -147 88 2 -40 183 11 101 -16 -154 -228 53 -211 -92 133 177 -41 85 266 33 186
6845A86k64j1J71J08j04j06Q1j21Q7l0J24j80J69P7lj44K7j20%L4j6j53J20o9
6869a37N5O6j8R7k30M10j70k04P1K09l9L2k41J44M7L0j60M6M8j23J39r5k5J32
6893H4j78K4r9L31j55P6k70K33J30k73K49q1k40k0L51j19J49k93K43j03j40K28
6915A27j45lq7K2Q6j7J33m6j01J24j17o1J68J28k2l46J69n8K8o1K97m04J8M3K20
6940I5j00J12k48J75J54l12K09o6M3r9P6l6k76K93J2k95M22J09m07J60k85k0K75
6963ij10R3M9j60K09r9k6j50M12o8O7j67M6p1PJ16j23N4j4J26l46J95M8j44j17
6988a82J82j17q8J06K46j69%J45n2j04k4j8J59J57j21j89M2N6j49J80j38j5J39
7011D6p3J87p4j00K3j45QJ39o8J08K0n6k20K95pr5q5J3K32j57K39k69m8K80j89
$$ plain form
6845 186 -78 -89 82 190 86 -20 61 -60 27 -3 121 -59 110 187 184 40 67 -53 -53 -19 -35 -188 -68 -137
6869 -137 -82 -16 -34 63 -167 243 73 -131 -60 149 110 142 -99 45 92 122 -38 8 56 -67 72 -23 -48 84
6893 84 -94 -70 -169 162 7 83 -187 46 176 -97 152 71 -169 -189 162 43 192 -101 142 39 -101 127
6915 127 -18 -21 -108 -86 0 -17 116 70 -31 93 -24 -85 83 211 189 -157 12 -46 -18 -79 218 -186 -168 -125 95
6940 95 -5 107 -141 34 188 -124 85 19 62 -37 39 3 -273 20 32 -263 159 268 -139 21 -264 -284 -9
6963 -9 -119 -26 23 -137 72 -27 -53 -203 209 141 208 41 87 16 23 139 16 70 56 182 -164 31 79 -65 -182
6988 -182 0 -117 -205 -99 147 -22 -22 123 71 -33 -57 -75 84 241 120 -69 -27 29 -120 60 -78 -93 46
7011 46 -27 160 86 -14 9 -136 -128 11 -57 51 71 15 -205 90 83 -12 -97 -84 148 -9 230 -39 -87 193 4
7036DP9m1k36J66l5kpK29k07k35M04l9l0q0J20OJ4q4N5k47L15j16j5j45J73k8
7062A8p2m1N9rP8m5O4JO2o8k7j02K15P3J5M3p3j25Nj58mK9Q1j83lL77l44oR2K33
7092A85j56l9q2R4j80%K32l8j88P3K43k95J5R4q0L22l1j25j20lN2m9J65j36o1
7117a08P2Kp0J18J63j34M5j86Nj06L9L96k37J31Q4k14k53L51k68J68j13OKq4J02
7142h9N4k1N0j3j8kN4l9j81K35j92M5J42l1k5Q3J50j11j67N5Nrj21K20Mr7J22
7169A03l39J77LP7K2j44Q5O4J07k57P6p5q0j7P3J91q3j20J81j72m7J15K22j77
7193a5J37j99J2Q8J73k97O0N6j75K35J49k94K28k2p5K53m00J09m6L5k5O3J7n6
7217A1j05J65j58N0k7p0J41L4j55Q9O9q0N7r3j54M03m43L83k23K0K1lj24R2p5
$$ plain form
7036 4 83 42 -194 -28 -63 -65 -72 157 -50 -285 119 80 50 -30 90 96 110 26 81 -166 149 33 18 -127 46 18
7062 18 -54 -95 -36 -45 33 -12 52 53 115 47 20 -82 133 206 221 264 191 66 71 -87 -91 -62 19 -164 -167 210 -134 -140 -48 185
7092 185 29 -10 -92 2 -178 -178 54 16 -172 -99 144 -151 -136 -42 -122 200 169 44 -76 -79 -27 -76 89 -47 -108
7117 -108 -36 -34 -104 14 177 43 88 -98 -93 -199 -160 236 -1 130 214 0 -253 98 -170 -2 -115 -109 -107 -191 -89
7142 -89 -35 -56 -6 -19 -37 -39 15 -24 -205 30 -162 -117 25 -6 -31 52 202 91 -76 -21 -16 -25 -146 74 78 -19 103
7169 103 -236 -59 -56 21 43 -101 -16 48 155 -102 -26 -101 -181 -198 -125 66 -17 -137 44 -128 -175 -60 162 -15
7193 -15 122 -77 -65 23 196 -101 -41 15 -160 75 224 -70 158 136 61 314 -86 23 -23 12 -13 50 67 11
7217 11 -94 71 -87 -37 -64 -134 7 41 -114 -25 44 -36 21 -72 -226 177 -266 117 -106 -86 -65 -68 -192 -100 -175
7242a75J88k9J51J46m05R3K27l14J30k27K97j49p5q8J02J36j44J38lJ62k12rQ2
7265B2L5k19J3K31K1n2j59J87m3p4j9J69K0j32K20l63J92j67L34j32j17LJ29J6
7289A15j64M3r7J07NJ16j51k65P9J56J7N1J46k43L0o2K15J29j13J98n37J3K57
7312D5J09l44J75m2j92%K33rj24K21k90q1M00k16l8J61J83j70J19m7k63K66l4
7335F2q3K86m31N9J33m5LK83l88j3K00o0L1k05J62l0O9R2k50M2J9M1l0J55J10
7360B12k78J27j70K33j48q1j93K15RJ10p8O5K6J73l82P7Nk0J41R6j68K85l89J68
7384C5j18j19J58m4oL00j07k83n2J51J52p1L9k30J45N0R0j56k0j43NL63k85Q4
7408f2o4R6O9k36J26j0J39k64K38j33q4j16M03k60K30m2N6k66K54L6j19K00k03
$$ plain form
7242 -175 13 -16 135 281 -124 -31 196 -118 12 -215 82 -67 -142 -230 -128 8 -136 2 -1 161 -51 -60 22
7265 22 57 -162 -149 82 103 51 -108 79 36 -38 -57 112 132 0 220 -143 49 -118 216 84 -33 -30 99 115
7289 115 -49 -6 -103 4 9 125 -26 -291 -212 -56 -39 12 158 -85 -55 -117 98 227 114 312 -225 -212 45
7312 45 154 -190 -15 -57 -249 -249 -16 -25 -149 72 -218 -299 101 -115 -153 8 191 21 140 93 -170 96 62
7335 62 -21 265 -166 -107 26 -19 -16 267 -121 -134 66 6 37 -168 -6 -36 33 125 -125 -83 -64 -23 -53 102 212
7360 212 -66 61 -109 124 -24 -105 -298 -83 -74 36 -42 23 49 222 -160 -83 -78 -98 43 139 -29 256 -133 35
7384 35 -83 -202 -44 -88 -94 206 99 -184 -236 -85 67 -4 35 -195 -50 0 90 -66 -86 -229 -224 139 -146 -62
7408 -62 -126 -30 39 -197 -71 -81 58 -206 32 -101 -185 -301 102 -158 72 30 86 -180 74 110 -9 191 -12
7431a2j65L00r0j99L41n1J22j39Kk33K43J88k75j88M8J65k59L07Qj27j52r9K47
7454a8r7L75m29J35j57L76l33K59p7m9J62j15j39J80N5l07L74k61P7J43k27J93
7476A20j36r3J25j36K2P8R8m9J46j8j0j87Q9K56k97o4M9j05P8l4q2J93j27K86
7500B02p5k74M00l45K91k90J29L8J04R2j22j29j39J68j22M8P0j47o9L45j28j48
7522a01J15k10K25P4j56J58Ok34R9P7O9j41k7J30n9LJ30j76R4j56k04K94k8N2
7546C4K65m56J74N2p8k24K33J7J05K9j25r5J06j06J68M3l25N7k2K40j82J14p4
7569e0L3On1j91K37k05K06R7j52J44p9J3J54j80O9J79k15Q6j67N9J46n4j89K28
7593A24j61O6l4j50K38j51O9J20k71M59l46Q1j06R9Jk25J90j3l9MK50l35J87j6
$$ plain form
7431 -12 -177 123 33 -166 175 124 246 107 109 -124 119 307 32 -156 -108 57 -202 105 113 -14 -166 -265 -18
7454 -18 -115 260 -169 -34 -191 185 -148 111 34 -15 147 32 -107 73 128 -179 195 -66 11 154 -73 120
7476 120 -16 -109 16 -120 -98 -20 78 29 175 157 147 -40 49 305 8 -56 -7 -112 -34 -68 -150 43 -84 202
7500 202 127 -147 253 -92 199 -91 38 76 180 272 150 21 -118 50 -72 -24 46 -101 -170 175 47 -101
7522 -101 14 -196 29 103 -53 105 111 -123 -24 53 122 -19 -46 84 25 28 158 -18 76 -80 -284 10 -18 34
7546 34 299 -157 17 69 -9 -233 0 17 122 151 26 -69 37 -69 99 142 -183 -126 -148 92 -90 24 -50
7569 -50 -17 -11 -62 -253 -16 -221 -15 82 -70 74 -5 8 162 -18 51 230 15 101 -66 -7 139 85 -104 124
7593 124 -37 29 -5 -155 83 -68 1 121 -150 309 -37 44 -62 37 38 -187 3 -10 -49 -45 205 -130 57 41
7617D1J58j62p9R7o1P6j62R2k10M60k70JJ2J11q5J4r2j3q0J09J51p9N9k06J90
7642G2R7j60J16j1n5R3k98J2J69m5K23j87k47J57k0L40m93L60k53J37l7K6o4p2
7666a40j26M72k19j9K50j66Q4q7R7m13P1J39MJ05m8J12n8Q7l12K68l17P5J19j8
7690d0J84l78K87J16j90j17K43j55k8K7J09l53L01J13P1l05l1j6L84j89j64J86
7712E5J02k28P5R7k4K00l64K38Q4j73m21L51P5k2J37k45J25j66J58j11j28K2o7
7735b30K66j52J75J0m4j50J02J55o0j1l0P9k42L24l88L36k67K09K4j03J18k27
7757a06L42l13K58j2l9k02m2J54n7n7M5L10j75k31M71m05kJ8k22K20m1K21o4r0
7781a9J8J4k1N1L0k03l4J56K01l8l79J61P6k32L40J03k31N7n9J51j2N6j64p3q9
$$ plain form
7617 41 199 37 -42 55 -6 70 -92 0 -210 250 -20 -19 -7 104 19 33 -59 -72 -152 -43 108 29 88 -118 72
7642 72 169 9 125 114 59 152 -146 -134 35 -10 213 26 -221 -64 -84 256 -237 123 -130 7 -30 -4 -68 -140
7666 -140 -266 206 -13 -32 218 52 136 49 146 -267 -196 -57 -53 52 4 116 58 145 -167 101 -216 -141 -22 -40
7690 -40 144 -234 53 169 -21 -138 105 -50 -78 -51 58 -295 6 119 190 -115 -146 -162 222 33 -131 55
7712 55 157 -71 4 101 77 277 -87 151 235 62 -359 -8 67 45 182 -63 62 -104 54 -57 -185 -163 -230
7735 -230 36 -116 59 69 25 -125 -23 132 72 61 31 110 -132 192 -196 140 -127 82 106 3 121 -106
7757 -106 236 -77 181 169 130 -72 -114 40 -17 -74 -29 281 106 -125 346 -59 -61 -43 -265 -45 -86 135 71 -19
7781 -19 -1 13 -8 43 73 -130 -164 -8 193 155 -224 -63 13 -219 121 224 -7 50 -9 142 130 186 22 -51 -140
7806a40k8L79k65K95m06J98K37j27j88J60j50p3K59j10%o8J35k94K52k13J53J21
7828A27k46K25j47K61m19O1J10J33k89m1K30j43K81k89J84o6j34k39O04l15N9
7849e3j30J64L11l81J67j59K63j92j42R6J60l03J38N5J1j67P4N5P3J69j12p6j36
7872a15J41j5m9J36M3k98L96k54J6k9j50J82j63J10J86k47R8j20K37j05P1j13
7894d2jj54J76J42K6k81K19j79J49k01J69n0J02J52j83O3j26J12J72l60K36j40
7916Aj11J4O4k06K03J45k60K17k45L20j74Kj56n9K74R7n2k06R4L3k73O2k4J31
7940a09j10K71j31mj1K7o2N0J29r3J43M2k3N9l3k21J11j02K5N1l9J45l45J78n0
7965a02lR8N4J18p4N6j09N8oQk5J26k11j58J64N7j10P1K7Qk75J72l2J04k24R1
$$ plain form
7806 -140 -168 211 -54 241 -165 33 270 143 -45 115 -35 -108 151 41 41 -27 108 -186 66 -147 6 127
7828 127 -119 106 -41 220 -199 -138 -28 105 -184 -225 5 -138 143 -146 38 -28 -162 -401 203 -112 -53
7849 -53 -183 -19 292 -89 78 -81 182 -10 -152 -56 104 -199 -61 -6 5 -162 -88 -33 40 209 97 21 -115
7872 -115 26 11 -38 98 141 -157 239 -15 1 -28 -178 4 -159 -49 137 -110 -12 -132 105 0 71 -42
7894 -42 -43 -197 -21 121 147 -134 85 -94 55 -146 23 -27 75 227 44 107 -19 93 265 -95 141 1
7916 1 -110 -96 -32 -238 -35 110 -150 67 -178 142 -32 -30 -186 -245 29 126 74 -132 -38 -5 -278 -216 -240 -109
7940 -109 -219 52 -79 -83 -94 -67 -129 -79 50 -43 100 142 119 178 145 -76 35 -67 -42 9 -30 115 -230 -52 -102
7965 -102 -105 -7 47 165 91 147 38 96 90 98 73 199 -12 -170 -6 51 -59 12 39 47 -228 -56 -88 16 -208 -117
7991a17J75r2K07k74K9J30J00k9j00P8j67J49m5k2O9K4n7l06K30J11p0J2J29k39
8015g5J47k47M45k58k6j27K69o8Qk52K26j26K03o9j23L11j64k37K54j62N1j26
8037a46L02l80J18M77l63J20r8L4k59r7L68J64j79j33P2k6K7Q7J5j16m0K86k65
8060c2J95l86L74l31J42P3p0J53j38K4k12J52j34J76p7j36K91m1j32O1Q0J26j41
8083A7N9j54J34k10J83M0r5j73J11j6m8J70r8Lr9K19m8J92p8k60R4K67q3j36N5
8108D6j38J54N2j65k20K39K42q7k28J56n0j58L37j15j14J50j86J42j03q0L16m56
8130b66M13n8K6j92j5J66oJ25k27J58l4Q0j47j50n1J1J10j10J63M9k50J75j0J04
8154F4k27J57r7oJ4K43Q8r7l64L03r7Q8j54J4K43k15l8M1j51J31J08P9m5j85J00
$$ plain form
7991 -117 58 -34 173 -101 -72 58 158 129 29 107 -60 89 44 22 91 115 58 -248 -18 93 23 35 164 -75
8015 -75 72 -175 270 12 -14 -141 128 60 68 -184 42 -84 119 50 -73 238 74 -163 91 -71 -20 -146
8037 -146 156 -224 -106 371 8 128 30 64 -195 -292 76 240 61 -72 0 -26 1 88 103 -13 -53 233 -32
8060 -32 163 -223 151 -180 -38 35 -35 118 -20 4 -208 -56 -190 -14 -91 -227 64 23 -109 -48 32 158 17
8083 17 76 -78 56 -154 29 69 -26 -199 -88 -104 -152 18 -80 -77 -176 43 -5 187 109 -151 -57 210 127 -9 46
8108 46 -92 62 114 -51 -271 -32 210 123 -105 51 1 -157 180 65 -49 101 -85 57 -46 -126 190 -266
8130 -266 147 89 115 -77 -92 74 68 193 -34 124 90 170 23 -127 -178 -167 -57 -167 -4 45 -205 -30 -40 64
8154 64 -163 -6 -103 -109 -95 148 236 139 -225 78 -19 69 -85 -71 172 -43 -81 -40 -191 -60 48 127 82 -103 -3
8179cp0Q4M0m8o0J48k60K25q6J03j55R5
$$ plain form
8179 -3 -73 11 51 3 -57 91 -169 56 -30 73 -82 13
8191A3
$$ Imaginary data points
##PAGE= N=2
##DATA TABLE= (X++(I..I)), XYDATA
0@%%%%%%%%qJ6j6J6j6K4l2M0n6P1q3J00j20J44j74K05k39K80l28L80m39N06n81
31c10O65p59Q62r76J102j241J394j562J745j945K165k406K669k955L268l611L986
48B091m394M841n334N875o474P138p873Q697r628J0688j1905J3319j4986J6985
62I040j9439K2533k6567L2081m0129N3137p8696K14525m91743J54236O45296n76048
74a01774k7370K41123q6792m2493m6629N2054J81241k83315l7566K85580j11512
85B2547k05437J74052P9277j80446J0239K32927j33698j69669J99936M9565j19692
96d0399K634l6262J10038K8497j75412J23568P5063j92118R0038P4272q9625K9108
108e98o7822M4704J54963j78348m1217J95664r3981o4452J26990o0001o6546Q6975
$$ plain form
0 0 0 0 0 0 0 0 0 0 -8 8 -8 8 -8 16 -16 24 -32 39 -44 56 -64 80 -94 111 -128 152 -176 204 -235 271 -310
31 -310 355 -404 458 -518 584 -657 737 -825 920 -1025 1140 -1266 1403 -1552 1716 -1895 2091
48 2091 -2303 2538 -2796 3079 -3395 3743 -4130 4567 -5061 5627 -6278 7041 -7945 9040
62 9040 -10399 12134 -14433 17648 -22481 30656 -48040 166485 -325258 -171022 474274 -101774
74 -101774 -129144 111979 25187 -17306 -63935 -11881 169360 -113955 -151521 134059 22547
85 22547 -182890 -8838 70439 -110007 -99768 133159 -539 -170208 29728 79293 -40399
96 -40399 -37765 -74027 36011 64508 -110904 12664 87727 -104391 -14353 59919 -29706 -598
108 -598 -68420 -23716 131247 -47101 -88318 107346 13365 -51087 75903 15902 -50644 36331
120C6331J8137m1873J299j4520N621N7753o6884m1833J12405r5331o4594K24378
132A30889j10849j90044K48306j2688j76436J60795m2994j06177J64252m2829
142B2225q8964J00157l0421l1528N0055j5841l386k9963j0602P7673q861p4834
154d4290Q371N9994K519n5971K3832J9207o0135O4633K9464r6489N2047L1650
166C4832o1535N7361q297n4057N0301k4849R192N2504r4909N048Q5272n0683o085
179e905R517m7493N2558K1012n9632K1026J4087k1533J9077Q409j4797r108j005
192a3787J3867K1588j1700m5790K1815O1282m7370k8517N0452l9267q47O6424
204D8150n8481k8392O4643k3950j2129L6478k8493j6594J7668J8462J0380l9609
$$ plain form
120 36331 54468 12595 13894 -626 4995 62748 -4136 -45969 66436 -28895 -93489 130889
132 130889 20040 -170004 78302 65614 -110822 49973 6979 -99198 65054 22225
142 22225 -66739 33418 2997 -28531 21524 5683 2297 -27666 -38268 39405 30544 -44290
154 -44290 -35919 24075 26594 -29377 -5545 13662 -46473 18160 47624 -48865 3182 34832
166 34832 -26703 30658 22361 -31696 18605 -6244 2948 55452 -39457 -34409 50863 180 -5905
179 -5905 3612 -43881 8677 29689 -29943 -8917 5170 -16363 2714 11123 -3674 -12782 -13787
192 -13787 80 21668 9968 -35822 -14007 47275 -95 -28612 21840 -17427 -18274 48150
204 48150 -10331 -38723 25920 1970 -10159 26319 -2174 -18768 -1100 17362 27742 -11867
216a1867q929M5792q531j6466J5677k3080q002M1609n36n0423Q444M6314l2056
229b054j8954M8660k7069m1729M9454J7308k9778j3011n030L6482Q883m1760J2204
242f394R630j8226K6730J646l3649J1894J0073R62N296j7154k640J0581k620R834
256E963K139k7698k109L8923O992m0864l654L2032q379j204J0787k5851N374K4930
270A7381j6912K597Q558k7293R432K4877r028j5554j1376J7842K1033k1779j0170
283a0392J0351q045J5621J2184l1176m005K6194k841j0911J0734m014k1232J6267
296a265K5603k2580j9193J4270L474R234M23k7387N236K2502l681q556n846J410
310f356J0194l684M195K629k1779P611K2143r368p690k882p051J7968J3098k3615
$$ plain form
216 -11867 -20796 24996 16465 -1 15676 -7404 -15406 26203 25667 -24756 -16312 30002 -2054
229 -2054 -21008 27652 583 -41146 8308 25616 -4162 -17173 -22203 14279 23162 -18598 -6394
242 -6394 3236 -14990 11740 13386 -20263 -8369 1704 2666 7962 -9192 -11832 -1251 -3871 5963
256 5963 8102 -19596 -21705 17218 24210 -16654 -20308 11724 3345 2141 12928 -12923 -7549 17381
270 17381 469 3066 11624 -15669 -6237 18640 9612 -5942 -17318 524 21557 -222 -10392
283 -10392 -41 -8086 7535 19719 -11457 -15462 10732 7891 -3020 7714 3700 -17532 -1265
296 -1265 24338 1758 -17435 -3165 309 9543 9966 -17421 -12185 10317 6636 -1920 -7766 -6356
310 -6356 3838 154 4349 6978 -14801 -7190 14953 5585 -2105 -4987 -12038 5930 19028 -4587
324d587j3749J5993J3138q717o258L08n460J0411Q513j2637k117L756o346J2688
338D936R246k0970r188J4603J5782o285k0839K644J3453K33J942p354j2437J4254
352B0Q045j1441M201L51j2902Q842J9398j1619j9489R620J5038m203k356l582
366g7j1749J3899J8031j7105j5728J1885R965n558k498L822o035q127J5597R309
380A5631j6130q132M671J0177R008j4926j5421J6214J1321j0732l958J029m128
393e376M014J0696o815j4300O398Q770m852L441m06j7211O469K0950n328j7957
407a1507j372J2960N744o059m553k064L33J1858K23j2472L310K891l347R406K955
422H306j6254k686J5399P991r577j1969M002J0112N210m935j3090M240J3347p115
$$ plain form
324 -4587 -18336 -2343 10795 2078 -4180 -3872 -9332 1079 9592 -3045 -5162 -1406 -7752 4936
338 4936 14182 -6788 -15976 -1373 14409 8124 -12715 -10071 3382 3615 5557 -1797 -14234 20
352 20 8065 -3376 825 1176 -11726 -2884 16514 4895 -14594 -4974 10064 5861 3505 -77
366 -77 -11826 2073 20104 2999 -12729 -844 9121 3563 1065 4887 -1148 -9275 6322 15631
380 15631 -499 -8631 -3960 6217 15225 299 -15122 1092 12413 1681 -2277 -1248 -5376
393 -5376 -1362 9334 2519 -11781 -5383 3387 -1465 1976 1570 -15641 -9172 11778 6450 -11507
407 -11507 -12879 81 5825 -234 -4787 -6851 -6518 5340 5563 -6909 -3599 -708 -4055 5351 8306
422 8306 -7948 -10634 4765 12756 3179 -8790 -4788 5324 10534 5599 -7491 -3251 10096 2981
436B981k781R361j2866o847K1106L019j9123l205J1928J188j823J997r704p380
450a2149J9358O817k1522k477J0361J469K280m852p064O768J424m399R699j307
464D406j8221L028K4938k737k5905L256K0568l515q777L809k371l743Q530P538
478A0804j0097j1192J0376R126o881k645K271n734O53J2461k6j5931l962J5481
492D704N031q946q220j2J1678Q44j1114L874K486j0975R686J1886j6696r047J3133
507a688O399n489j297k587o044J0853J3296j6773j2011J9002K456r935P936o96
521C422j1114P150J1355m968r013Q44O361K500K121n469j0037R681J0155o924
535F064m864l465Q89J4448m441j5499Q341M250q470N925N132j0690q887J0218
$$ plain form
436 2981 200 9561 -3305 -10152 10954 13973 -5150 -8355 3573 4761 2938 4935 -4769 -12149
450 -12149 7209 14026 -7496 -9973 388 1857 4137 -715 -7779 -1011 413 -3986 5713 4406
464 4406 -13815 -10787 14151 11414 -14491 -11235 9333 5818 -2959 850 -1521 -5264 3266 10804
478 10804 707 -10485 -109 9017 2136 -509 1762 -3972 -3319 9142 9116 -6815 -10777 4704
492 4704 9735 789 -7431 -7443 4235 5079 -6035 -2161 325 -10650 -964 10922 -5774 -14821 -1688
507 -1688 4711 -778 -2075 -4662 -10706 147 13443 -3330 -15341 3661 6117 -3818 4118 3422
521 3422 -7692 -542 10813 5845 -3168 -2324 4037 6537 8658 3189 -6848 2833 12988 6064
535 6064 1200 -2265 -1376 13072 8631 -6868 1473 5723 -2747 3178 8310 -2380 -11267 -1049
549a049J2555j0693j4334P965Q269l559j557k139n019L088J1090l950j3854N741
563g446Q533n891K344L571j1272J491J2140l53n990l994Q18Q338N441p016q237
578g523M516J0832k025o423K224n33j48P242N05r636m49O730Q46J719k825j0851
594e799M962J5735q381j2429P193J273j698O545n404r031O474N059l352n13k960
609b326l946M453P419l599j0800N10R988J777o202k631q86K625O938n48j1255
624h483J257J0584l784l227P374o355p647J3596O094j2053m210M632O655J469
638E902o877m016M813L735J232l132m938J902L147L342o63p087r92O463Q65j253
654B443O88p757j195J3411J613j5667q78J2232j679m231K881m391k398Q488P03
$$ plain form
549 -1049 11506 813 -13521 -5556 2713 -846 -2403 -4542 -9561 -6473 4617 667 -13187 -7446
563 -7446 1087 -4804 -2460 1111 -10161 -8670 3470 3117 -2873 -6867 -6049 2289 7730 714 -7523
578 -7523 -3007 7825 5800 -623 1601 1068 920 8162 8667 -969 -1418 5312 6158 7877 5052 -5799
594 -5799 -837 14898 6517 -5912 1281 2554 856 7401 1997 -7034 -560 4499 1147 634 -2326
609 -2326 -6272 -1819 5600 2001 -8799 -8289 1699 3476 -2726 -5357 -6243 -3618 3320 2772 -8483
624 -8483 -7226 3358 -426 -3653 3721 -2634 -10281 3315 9409 -2644 -6854 -2222 4433 5902
638 5902 -975 -4991 -178 3557 4789 1657 -3281 -1379 1768 5110 4447 -2640 -3632 2831 3696 2443
654 2443 3131 -4626 -5821 7590 9203 -6464 -7342 4890 3211 -1020 1861 -2530 -4928 3560 4263
669D263o158m19k75J591N540r33p858j942P651N633o276o802M048L462N76J893
685C994n724m166P655K981n329Q43n97m235N882O264p426o875N432M919P4k828
701H64n562M12Q290J124p631j466K788J360O43J236k593n221L447O967k656n498
717c496m1O90M320M266p934o488Q871N680o222k544J583j265L205L764m402m012
733d025L550J017J420K567o264m430P628O511n815o701K511N548n34q60j798m127
749c802M638M933m661k788K744j738N28N933k857q365K159Q327r28m959j757j20
765b713M231L761n723m995M482L181j989p9p33l034J010N473J62o246j396L388
781a220K879J203l887n985M706P718l757n803J658K285P0J875q41m419N13M939
$$ plain form
669 4263 -1895 -2314 -2589 -998 4542 3609 -4249 -6191 1460 7093 817 -5985 -1937 1525 2101 3994
685 3994 -1730 -5896 1759 4740 -589 254 -343 -4578 1304 7568 142 -6733 -1301 3618 3692 864
701 864 -4698 -4286 4004 5128 -2503 -3969 -1181 179 822 2058 -535 -5756 -2309 4658 2002 -3496
717 -3496 -3537 -2847 1473 5739 -2195 -8683 188 5868 -354 -2898 -1315 -2580 625 4389 -13 -4025
733 -4025 -475 542 1962 4529 -1735 -6165 1463 7974 2159 -4542 -2031 3517 2983 2123 325 -3802
749 -3802 836 5769 1108 -1680 1064 -674 -146 5787 2930 -5435 -3276 5051 4123 -836 -2593 -2713
765 -2713 1518 5279 -444 -5439 -957 2224 235 156 -577 -3611 -2601 2872 3034 -3212 -4608 -1220
781 -1220 1659 2862 -1025 -7010 -2304 5414 1657 -4146 -2488 -203 -133 1742 901 -3518 -3005 1934
797A934K71j664j237l124K432O916k373q172J691O404L23k662j765j189J739M889
813D413j991n136J859K232j203K013J300o520j101P619K030o051l323L233K608
828A982J835k605n041K303N177j357l465J726j466j173M889J333o480j498N042
843A202R75k91j177m446P09P332k2p419m92M465J042j151r70j647j14K615Q35
860A446j586j303j403J009M815j34p079j446O725K865m571k927J204K351J241
875A207J3k167k294K589K584r72j035j342j371L758L823m603l804K726L214K00
891B526k42l708k570P566K927q066j022O307l152j474O016l480o292N172M340
906D848l169j268k535j05O389l52p021k31M950o39n26M31l101j195N133O23m127
$$ plain form
797 1934 2205 541 -696 -3820 -1388 5528 3155 -5017 -3326 3078 3401 739 -1026 -2215 -476 4413
813 4413 2422 -2714 -855 1377 174 2187 3487 -3033 -4134 3485 5515 -536 -3859 -626 1982
828 1982 3817 1212 -3829 -1526 3651 2294 -1171 555 -911 -2084 2805 4138 -2342 -3840 1202
843 1202 2177 1886 709 -3737 -3028 4304 4282 -3137 -3629 836 1878 727 -243 -1890 -2004 611 1446
860 1446 -140 -1443 -2846 -1837 2978 2844 -4235 -5681 1044 3909 -662 -3589 -2385 -34 1207
875 1207 1220 -947 -3241 -652 1932 960 -75 -1417 -2788 970 4793 190 -3614 -888 2326 2526
891 2526 2284 -1424 -3994 3572 6499 -1567 -2589 3718 566 -908 5108 1628 -4664 508 4848
906 4848 1679 411 -2124 -2229 4160 3808 -3213 -3444 1506 867 341 772 -2329 -3524 1609 2232 -1895
923a895k04J8P97K745n65l139j467K186M106n08o321n5N850R68l301j156P82L63
941g96J840N06j677j085J2J257L527j059p171K295P353k766l371J032j113L38
957h78O010l303o632M676L619m293J836J204o594K903O183m540k286K269k037
972a863J604M816n580m934N770M144l797j780L08k24K556P12k489k99k09l00M274
989B709L78o211L13M466J365k111k490PK443J154m97j346k390J781L681r81l970
1006a699J97K546n84j20J950l174l917O916K702p076j210L590N1J016n36l959
1022c307Q93L915j285j339R90j941j006N094J27n266N76K652l60J799q30m963
1038d251K771N375k716k639M71P21J120J671j872j931P63J859R23q93j402r17
$$ plain form
923 -1895 -2099 -2081 -1284 1461 896 -2243 -3710 -1524 2582 2074 -4247 -4302 1548 2516 -785 -1941 -1159 -796
941 -796 1044 1550 -127 -1212 -1200 57 3584 2525 -4646 -2351 5002 2236 -1135 -103 -1216 -878
957 -878 5132 1829 -4803 -127 3492 -801 1035 2239 -4355 -1452 4731 191 -2095 174 -1863
972 -1863 -259 4557 -1023 -5957 -187 3957 160 -1620 -1312 -1536 1020 1732 -757 -1056 -1265 -1565 2709
989 2709 3087 -3124 -2811 1655 3020 909 -1581 -1574 869 2023 1526 180 -2210 -429 3252 2271 -1699
1006 -1699 -1502 1044 460 340 2290 -884 -4801 2115 4817 -2259 -3469 121 172 1188 652 -3307
1022 -3307 -2414 1501 216 -1123 -133 -2074 -3080 2014 2141 -3125 -2549 103 -257 1542 712 -4251
1038 -4251 -1480 3895 1179 -1460 -989 -268 852 2523 651 -1280 -517 1342 2265 1372 -30 -947
1054i47J176K773L08m385j511M441J907l327j456Q76L00J326Q11k621j796J832
1070b93J451m46k23k112r12L321J844l442k403K059J458O03q14k784l85L780P13
1087A415l047l10J080o52J524J551l065k307L524J694r09n96k507P23M368k14
1103B272m096k73K702L81l41p6j227p61K356J924k070k240J048J206Q29N38k789
1120f17j820L129L236k523l020R90J644K24K47j416j893K121J093l08p16j509
1136a138p17K534J802k712k190J169K311K40j584j549p4K291J501k511j739J758
1152f08N76p9J176j303k354J334L294r96k671K8Q14J712Q04k254k596K723K583
1169B183j538j542M04l05Q81J553q19k439R5K448N91o78j211j573J768K774j129
$$ plain form
1054 -947 229 3002 3310 -1075 -2586 1855 3762 435 -1021 -145 155 1481 2292 -329 -2125 -293
1070 -293 1158 712 489 -1623 -2535 786 2630 -812 -3215 -1156 302 905 91 -2693 -3078 702 1415
1087 1415 -1632 -1942 -862 -1514 10 1561 -1504 -3811 -287 1407 498 -98 -2605 -1882 2486 2272
1103 2272 -1824 -2097 605 986 645 569 -658 -1419 937 2861 791 -1449 -401 805 1634 2172 -617
1120 -617 -2437 692 3928 1405 -1615 -625 1019 1243 1490 74 -1819 302 1395 1087 371 -1138
1136 -1138 -1855 679 2481 -231 -2421 -1252 1059 1299 -285 -1834 -1908 383 1884 -627 -2366 -608
1152 -608 -32 -111 1065 -238 -2592 -1258 2036 1040 -1631 -1603 -789 923 1727 -527 -3123 -400 2183
1169 2183 645 -897 -493 -798 83 1636 817 -1622 -1527 921 1512 834 -377 -1950 -182 2592 1463
1186A463l462R13K099l1j95r08j269J060K346j058j389K09q23J345J896j527k957
1203b288J344K447J15j625j230N70J095J361j116k212O90J902k85l50k74j352
1219a208M2K771n8k592o97J620J199P9j400j954J359K897r68k474N14K15M64J032
1237H41n03j848j31J970R40j097j652K3P62K139j96l293l5K654P10j436m02l06
1255h60j3J809P3j805l90Q57P64P40j49k584k2L263K72k138j018P60J260M51q21
1274D49j155k91J927N81j532j49l16K22J481Q88k508j233J650J773p40r63j159
1291a075J37K401P8k527m10J876n9J67j45j154o36J488J366j367j333K0J194J033
1309A054k74j912j157K405J543j447j395K15L95J330K46j664r28J018J374l39
$$ plain form
1186 1463 -1999 -1086 1013 982 787 -121 -1390 -330 2016 958 -431 -222 -1045 300 2196 669 -2288
1203 -2288 -944 1503 1618 -7 -1237 -667 428 1789 673 -1539 -849 1053 768 418 144 -1208
1219 -1208 -1166 1605 1547 -1045 -1742 -122 1077 1156 -244 -2198 -839 2058 1090 -1384 -870 -655 -191 841
1237 841 338 -1510 -1641 329 1269 172 -1480 -1457 -695 1444 1248 -2045 -2080 574 1284 -152 -554 -860
1255 -860 -873 936 1009 -796 -1186 -329 435 1175 1026 -1558 -1580 1683 1955 -183 -1201 -441 819 1270 449
1274 449 -706 -997 930 1511 -21 -170 -486 -264 1217 2105 -403 -1636 14 1787 1047 84 -1075
1291 -1075 -938 1463 1541 -986 -1396 480 421 588 443 -711 -1347 141 1507 140 -1193 -1173 21 1054
1309 1054 780 -1132 -2289 116 1659 212 -1183 -968 -573 757 1003 -661 -1589 -571 803 464
1325D64k94j254p94K244J655k280j948J761J363q3o92p98l67J155J358j154j084
1342g48N24L16N11J042j646j446J609J718q72j275k16O8J731N07k085r20J446
1359B64J178o02m53n44n63J063J161p45j485K70N72J209m86j458p14J537J423
1376A627j280j425j02J223L14k50m21j194N00J442J65j485k64K83J064N24p22
1393aj690K32K363k84j393n9k24R25J259p33j782P13J050k79N41k86j601O47K478
1412A876o21j890j29J204M94P8q95j110J129J103k72q92m61K82N11R22p66j076
1430e13M8Q34Q11j87j518o23J356J280q16j569J17J197M7j40o23m42K36J003L55
1449H53j335o33N13J108j74o9j342l06K083P95k078q33J167KP62q9j473o0J375
$$ plain form
1325 464 170 -1084 -1878 366 2021 -259 -2207 -446 917 834 142 -656 -1023 132 1490 336 -748
1342 -748 -224 92 603 1645 -1 -1447 162 1880 1008 -267 -483 -415 1316 1823 -262 -1182 264
1359 264 1442 840 387 -157 -720 343 1504 759 -726 -456 116 1325 839 -619 -1333 204 1627
1376 1627 347 -1078 -1180 43 357 107 -314 -1508 -1008 434 599 -886 -1150 -867 197 721 -1
1393 -1 -1691 -1459 904 620 -773 -832 -1056 -131 1128 395 -1387 -674 376 97 638 352 -1249 -602 1876
1412 1876 1255 -635 -764 440 934 1012 117 -993 136 1239 967 75 -386 -104 407 1329 563 -513
1430 -513 -465 369 1180 993 -525 -1148 208 1488 672 -897 -780 417 464 324 -299 -741 -505 498 853
1449 853 -482 -1115 -602 506 332 263 -1079 -1385 698 1493 -585 -1418 -251 -249 513 424 -1049 -1109 266
1468B66N18p60m02l26Q7J461J83j936q9J168O64l42p09j015P81J487l18j211k8
1487e21L09L20M39mj149l47J296Q42r23j048P3P89J160m57j678J47J168P05p67
1506C54o66J47K94M57K24n32j119M66J151r1m99o25n47J425J065j734j072Q49
1524d53J282n50q7q23j40P90P10l70r15J35j26J229R0j342p48J167J046m50q59
1543d14o62L39J427q1j270k62Q63K55L11m81l95n10P90J334j009j298K73J189
1561C99L47l57q49m72J283L74l18p83k2M84L04J18l79l65j97J055N08j152o46
1580f68M97Q90K28n20j199M22J004K9r60p6r6O78O31n60p26R6K62M81M36j005
1600a56q45N15J237j93j213k82P08M20K80o24p62Q55M16p9o41o8p1M13N23j91
$$ plain form
1468 266 784 24 -378 -704 -617 844 1027 -909 -998 170 834 492 -217 -1232 -451 1036 718 -493 -521
1487 -521 -212 108 547 543 -606 -953 343 1185 262 -786 -713 76 1236 779 -899 -752 416 1121 354
1506 354 -312 -165 129 586 810 278 -841 -375 776 685 186 -439 -986 439 1504 -230 -1302 -453
1524 -453 829 279 192 -631 -771 19 729 359 -556 -421 -547 682 772 -570 -1318 -151 895 445 -414
1543 -414 -1076 -737 690 609 -661 -923 -60 195 506 25 -370 -880 -90 1244 235 -1063 -790 399
1561 399 746 389 -460 -932 351 725 407 -376 -398 86 390 508 129 -236 -433 622 1130 -22 -668
1580 -668 -171 719 947 427 -772 -350 654 683 -277 -353 -449 229 860 300 -426 -330 -68 413 849 -156
1600 -156 -1001 -486 751 558 -655 -937 -229 191 471 -153 -915 -60 356 277 -364 -432 -503 -90 433 242
1620B42j284j16J418M77o60q88P6L84J142q50n52Q9N32L08p2n18l18J73P99Q5
1640D67o57n25K84Q22M33n09j228O16J345l28q59j87Q5P26Q9o9r82K62M77J83
1660D45K28q10l61L99P70L20j007o08M86R14k89p73p39R31O19k24n80k53K35K95
1680bK01N5n74p46R01P75j28j315K47P61L24j68q55j91R20J90j82m90j70L2O46
1701B31K43o00n31L11O35J46n96m74l7J116N57j131n32N55M43OJ33q59mN96K91
1722D99m30m37k05K42Q28K99p82q03P32Q00k32m99l84O15K10q1l54l67K47M19
1742C17O0k91k61k83L33P31k16j076%P75M03j21r02MP16M12n90m83K86k07N49
1763A56K52n66n41Q0N78L54k37p12J90O88K00p04n04M67O86k05m10J7L2J60O25
$$ plain form
1620 242 -1042 -1158 260 737 77 -811 -735 -351 791 -59 -611 -522 10 318 246 -272 -590 -417 382 467
1640 467 -190 -715 -431 391 824 315 -913 -297 1048 720 -139 -326 -241 485 574 505 -477 -215 262 445
1660 445 673 -137 -498 -99 671 991 -16 -624 -138 776 487 -286 -1025 -94 525 301 -279 -532 -297 -2
1680 -2 199 254 -320 -1066 -165 610 482 -833 -586 175 499 331 -524 -715 205 395 213 -277 -447 -415 231
1701 231 474 -126 -657 -346 289 435 -161 -635 -672 444 1001 -130 -662 -107 336 342 475 -384 -388 208 499
1722 499 69 -368 -573 -331 497 796 14 -789 -57 743 511 12 -372 243 453 372 18 -349 -102 317
1742 317 377 86 -175 -458 -125 606 390 -686 -686 89 492 371 -531 -527 189 601 11 -472 -186 -393 156
1763 156 408 -158 -699 -619 -41 313 76 -636 -446 242 442 -262 -766 -299 387 182 -228 -211 -179 -19 606
1784F06l32p27M7M95J66L0m86m47P84O53k01p68l38N68M34R9p37j94M13L04j89
1805A80j2l52j7N55Q9l9p69r4R10K05m58n19j07N71M76k54o50k2J70L83K13n23
1827f4k49J26N31K33p08m66L51M92K21m87n56K74N63K51r59J9J89K08M50l66n66
1848e13J25N27M7p0j98l76L07N82l24n61o8M46K41L69p72l7K3Q78k80m91m7j12
1870c04O75K49m02k39J4K04N35k88n35j95O33K46l59m19k00N48K55j59k87k43
1890b71J22L02L40r0j136P34L46j25j76n94K11O81J92q35M9J73J02j37K45o52
1910e19J14L28J61j92o6j75q0N88J15p92K4J51O62k14j79l38L39K66m8p1n36L19
1932a43L42K04l99j21j66M95M69o82k38M3K84J85q3m08m4L23M54k86n47K87N0
$$ plain form
1784 606 274 -453 -406 89 255 285 -201 -648 136 789 588 -180 -518 50 484 583 -154 -348 65 369 180
1805 180 168 -184 -201 354 443 404 -365 -459 451 656 198 -321 -428 143 619 365 -285 -307 -137 246 459 -64
1827 -64 -313 -187 344 577 -131 -597 -246 246 467 -20 -576 -302 261 512 -447 -428 -239 -31 419 53 -513
1848 -513 -388 139 186 116 -82 -458 -151 431 107 -454 -522 -76 165 534 -238 -275 -252 626 346 -145 -192 -304
1870 -304 371 620 218 -21 -7 197 732 444 -91 -286 347 593 234 -185 -385 163 418 259 -28 -271
1890 -271 -149 153 493 403 -733 1 347 222 46 -548 -337 344 536 -299 -250 -77 25 -112 133 -519
1910 -519 -405 -77 84 -108 -174 -349 -429 159 274 -518 -494 -343 319 105 -74 -412 -73 193 145 74 -462 -143
1932 -143 199 403 4 -117 -283 212 681 -1 -239 -196 88 273 190 -218 -262 61 515 229 -318 -31 19
1953A9M4L82j66m12j27O66K63q53j11M29K4K97l66n89K01L68K69k82j18l91N20
1974F7K60j66m49M0k8O65m31m14J21J03L79j20m00K7N7M30j55l12J31j21K83n2
1996h5Q8l12j8J63M39k17m17m8M54J60k59k58K85J64N6j09k50j3M72j20k21L69
2018C23o52L71K54Jl00n5J35L44J08n62l11J30L85nJ9m12n2J03L65J12n40j93
2040d32K29M60J24n30k35L54M71j54o21j83K97N67j20k53l16J87L22m0L1m00p8
2061c20M32K32k56n37P9M84J46M4q35J72O13l12J44l40J33K6J71ml05M9p0M51
2083A97K46p27k8J63K83O7k85n95N22M73j16Kk55Q6j20L97k41k34K7K39M33m01
2105A33k43j30J80N07j57m52p4L16J49j10j81k49K50L97j92k81J4J8J74M5K7m39
$$ plain form
1953 19 63 445 279 -133 -260 406 669 -184 -295 134 158 455 89 -500 -299 69 338 56 -62 -453 67
1974 67 327 161 -288 -248 -276 389 -42 -456 -335 -232 147 27 -373 -346 -289 141 -14 -326 -195 -316 -33 -85
1996 -85 3 -309 -327 -164 275 58 -359 -407 47 207 -52 -310 -25 139 195 86 -164 -177 295 175 -46 323
2018 323 -329 42 296 297 -3 -58 77 421 529 -33 -344 -214 171 166 185 -227 -279 -176 189 301 -239 -432
2040 -432 -203 257 381 -149 -384 -30 441 287 -334 -517 -220 347 227 -26 -342 -155 167 127 158 -242 -320
2061 -320 112 344 88 -449 -370 114 260 304 -531 -359 254 -58 86 -254 -121 -95 76 72 -233 -184 -254 197
2083 197 443 -284 -312 -149 134 201 -84 -679 -157 316 200 202 -53 33 -87 310 69 -165 -138 101 534 133
2105 133 -110 -240 -60 447 290 -162 -236 80 229 119 -62 -311 -61 336 144 -137 -123 -105 69 114 141 -298
2127b98N0N70Kl32k48M7N45j99K25p83K97L7j31R8j41K91J31L8j52m68J73K23
2149b5K80j53m21Q2K42J29J69k42m00K44L47j10k32k03K14K37N6J06n18k04N44
2170A42N3J89l99q8M91kj55k49j09J90L01j2N4n65L56j3P5k21j98j8R7K46L1n88
2194c92J88J28N63m27k36NJ80J24L0l17k8J50J68J09m88l18M13N07m17r8k26K63
2216a19PK44m51m3J65K93k20R7l47K08J43K52m11k2q9M38kj52j96j03L30J50j7
2239A55n24K83J16J54R0j27q4J7J82J38m06K29k08J09J53P5n98J63L72J10n42
2260a43M2J31K6J25l9j57M1j55L57J24k43l35m2O73k10k28k91K46L59r9m04j79
2282d01L29K39J8l58j97K54M47j09j10k67j44L49l1j76k0Q7q7M55l06j85J36K5
$$ plain form
2127 -298 -248 322 324 -8 -256 -209 336 137 362 -421 -124 -87 -218 -120 -261 30 161 199 47 -421 -248 -25
2149 -25 255 102 -319 -237 5 134 303 61 -339 -95 252 142 -90 -293 -79 158 214 320 -198 -402 142
2170 142 195 384 -15 -103 388 386 231 -18 -127 63 364 352 406 -159 197 184 259 38 -160 -178 -81 165 196 -392
2194 -392 -204 -76 487 60 -176 -171 9 133 163 -154 -182 -32 136 245 -243 -561 -148 359 -58 -156 -382 -119
2216 -119 -112 132 -319 -362 -197 96 -124 -27 -374 -166 -23 229 -182 -204 -293 145 143 -9 -205 -308 22 172 155
2239 155 -369 -86 30 184 274 147 63 80 262 400 -6 223 15 124 277 352 -246 -83 289 399 -143
2260 -143 -101 30 56 181 142 -15 26 -129 228 352 109 -226 -268 405 195 -33 -324 -78 281 182 -222 -401
2282 -401 -72 167 185 -173 -370 -116 331 222 112 -155 -299 50 19 -157 -177 -90 -177 278 -28 -213 -77 -52
2304e2N7m9K5j67p3L10L8p7k4PK59j64J46n70L19J8J90n4J02l64L78M0k75M3l04
2329b41K67L20k43k92j39L00L14j49k11j67L69JJ7k15N7j1O9j9j89j88J72J78
2351@M20l62l83O0J26K51j55k59q8L24K25r8m14K47J09J4k83J39J02j1L89m60
2373a07j49mK63k11K84ok46l2L36J91j56l31q4J74P4j2j49J16J22O8k03n1L1K38
2397A56J06j33k52j36L13K68j84k30J08rJ61J27k43j27J3N76m16k77J90J82N2
2418B45j41j2m50K23J51n8J37m77K82J55K25k11nk36O3p9J51J15j85p2K84j41
2440c6k36j05J59M62j68M1l71L4K63P4l83o6K86R7J79k28j9l16M14K78j78j22
2462E9m48L88L75k8n60k00M27K14l1l79r8K92L98k34lm01J53K22j65J62l17J54
$$ plain form
2304 -52 5 -44 -19 -186 -259 51 89 12 -12 -5 254 90 236 -334 -15 3 193 139 241 -123 255 295 20 63 -241
2329 -241 26 346 103 -189 -328 -28 286 137 -74 -241 128 129 146 -69 -12 -23 46 27 -162 -350 -178 0
2351 0 420 58 -325 -265 -139 112 -43 -302 -390 -66 159 61 -353 -106 3 17 -266 -127 -25 -36 353 -107
2373 -107 -256 -260 3 -208 76 70 -176 -208 128 319 163 -168 -252 -78 -4 -16 -165 -49 73 141 -62 -113 -82 156
2397 156 262 129 -123 -259 54 322 138 -92 16 7 168 295 52 -75 -62 514 98 -179 11 193 245
2418 245 104 92 -358 -135 16 -42 95 -382 -100 55 280 69 64 -172 -109 -188 -37 78 -107 -179 105 -36
2440 -36 -272 -377 -218 244 76 117 -254 -220 43 117 -266 -332 -46 51 230 2 -17 -333 81 359 181 59
2462 59 -389 -1 374 346 -214 -414 13 227 196 -183 -281 11 409 175 172 -229 -76 146 -19 143 -174 -20
2484b0L92j05n5k92M6J81K72k73m89L66n8K54j77j24J87k07J39j44o6j54L17K8
2506A8o3%k85J38L92j49l3k83K42J54j38r5j28Q5j8K06j39j34R7p8M96m62kk50
2530d29M18J04j76j15J76j15M84j44l62k1J90O3J46j77j04N3n0L02j88L7j30O9
2552C1J93k47Q2O9r4J22j62l36L10P9j78K30k60nJ16L84L5l07l53M09j2j45k7
2575f6l9ojJ68k74O4j41M25j91n6j19P5J32J07q3N1l66J92n2K04l18K18j50L72
2599A46k50J53k36q5K68ln8P6q2K8K22l42J0J63J74O7Nl90J31J47J37k19l20M38
2623A80q0m0%r5n1l28P39r8j64l80K30L06j14l20N7J52L12l33r2L04k90K47J26
2646B68q1j97o6K05J7j29l7k75K90K46k28N9k07L2K73L4l86J70k31J60K01k2k53
$$ plain form
2484 -20 372 267 212 -80 -34 147 419 146 -343 23 -35 219 42 -82 105 -102 37 -107 -173 -327 -10 18
2506 18 -45 -45 -330 -192 200 51 18 -265 -23 131 -7 -102 -230 -145 -163 43 -96 -230 -133 -211 285 -177 -179 -429
2530 -429 -11 93 -83 -198 -22 -137 347 203 -159 -180 10 73 219 42 -62 -9 -59 243 55 92 -38 31
2552 31 224 -23 59 128 34 156 -6 -342 -32 47 -131 99 -161 -166 -50 334 369 62 -291 118 106 -39 -66
2575 -66 -105 -111 -112 56 -218 -154 -295 130 -61 -117 -236 -161 -29 78 -5 46 -320 -128 -180 24 -294 -76 -226 146
2599 146 -104 49 -187 -272 -4 -7 -65 11 -71 -43 179 -163 -153 10 184 251 256 -134 -3 144 281 62 -258 180
2623 180 100 60 60 -35 -86 -414 325 227 63 -317 -87 219 105 -215 -158 -6 306 -27 -119 185 -105 142 268
2646 268 187 -10 -76 129 146 17 -20 -295 -5 241 13 72 -135 -103 170 204 -182 -12 -243 -83 118 96 -157
2669a57j45K35L37m00k0P8P1K65k71l29K74nL52m64j0J01J42k9J77l01m3k68N16
2692A06O4o9r7kL02m36R5j23R0K45j64j15l0L6L06r2J66k94l3M4J50n2q9k8J41
2717A21k6J94l08o3J85O8j62l32K71j9K60j23M5k19J5j34L76j88k60K26L9K39
2739B05J6m18j21L60K07m55k14L06j8J49k52k06n1L30N0N7k11l4K4N46j8m88J80
2762e6JJ12N1j58j39l6J60L53k91J69j09k28M71q9q8k18K23L3J18j94q6L4L14
2785C47k18j63oJ53k05K44p3m32K93q1J06J33j05pJ33j22L7q3k1K08j09L25n14
2808a60L41j63R1k71Mj63M24k2l7j49J27O4j51L49l47lJ4m9K62k58j10R0J58l60
2832c19K66P2k5N3P5Ql96K51K07j15Q1r7j25L6M66k34k14m0Q0J80j85j09j47R8
$$ plain form
2669 -157 -302 -67 270 -130 -150 -72 -1 264 -7 -336 -62 -67 285 -179 -189 -88 54 25 202 -99 -142 -410 106
2692 106 170 101 4 2 304 -132 -37 -160 -70 175 11 -104 -134 -98 208 116 282 -12 -45 -1 149 97 8 -20 121
2717 121 95 289 -19 -82 103 171 9 -323 -52 -71 189 66 111 -108 -93 -227 149 -39 -299 -73 -34 205
2739 205 221 -197 -318 42 249 -206 -420 -114 -132 17 -235 -441 -492 -162 -112 -55 -266 -300 -276 270 252 -236 -56
2762 -56 -55 57 108 -50 -189 -225 -65 288 -3 166 57 -171 300 211 123 -95 128 161 279 85 -1 33 347
2785 347 129 -34 -40 113 -92 152 79 -353 -60 -141 -35 98 -7 -14 119 -3 34 -49 -70 138 29 354 -160
2808 -160 181 18 109 -162 -158 -321 103 81 44 -105 22 86 -65 284 -63 -66 -52 -101 161 -97 -207 -117 41 -319
2832 -319 -53 19 -6 47 122 130 -266 -15 192 77 158 61 -64 -28 438 204 -10 -50 30 210 25 -84 -231 -133
2856a33K43j33J16n2K5J24N1r0l08Q3L59l68J7O7n5R5J42k21k54K46l8J69N6j59
2880a8m4j34K78j85j52l3R2L84j24j09j21k9K62J38k55m6k07L93l9k71J34k87
2902c73N27j34L8o9j96J18J10J22l14j13K16J37l8j89N2J21J79N3k69q0K2r5M25
2925B50j04j24J18NJ02j46J31k73J55o1J6l34J88K0J61J68o9l01r6L64j57j39
2947a26k3L00k03K86l70j12J84K03j56J63k38J11J99k91j10J22m25O70j68J20
2967A36l63j05L79J50m34L1J22j30L25M1k55l2J61j61L48k42m3O9m9J34k16J3
2989a21l8j36P33m02n3N8L6O1q5j79J46j05M44l07O1k81L70j00J03J8p0rR2q1
3013A55q1n7p2O3k11Q1J62P0l05L55q8m8j04J16j7N5j4k31Q3L32j09k77J57oP0
$$ plain form
2856 -133 110 -23 93 41 66 190 241 151 -157 -74 285 -83 -66 1 -54 41 183 -38 -292 -46 -84 85 141 -18
2880 -18 -62 -196 82 -103 -255 -288 -196 188 64 -45 -166 -195 67 205 -50 -96 -303 90 51 -220 -86 -373
2902 -373 154 20 58 -11 -207 -89 21 143 -171 -284 -68 69 31 -158 -106 15 194 247 -22 -102 -80 -175 250
2925 250 146 22 140 145 247 101 232 -41 114 53 69 -265 -77 -57 104 272 203 -98 -194 170 13 -126
2947 -126 -149 151 -52 234 -136 -248 -64 139 -17 146 -92 19 218 -73 -183 -61 -486 184 16 136
2967 136 -227 -332 47 197 -237 -206 -84 -214 111 152 -103 -135 26 -135 213 -29 -72 -3 -52 82 -134 -121
2989 -121 -159 -295 438 36 -17 41 77 138 53 -126 20 -85 359 52 113 -168 202 102 205 223 153 144 236 155
3013 155 74 17 -55 8 -203 -122 40 110 -195 160 72 24 -80 36 19 74 60 -171 -88 244 135 -142 15 9 79
3038G9Km97J46K89j4M9Q2m50L35N3N3Q5l39n6K59P0L9m13J25L80k81J73l59L32
3062A42l39M06j05j18j78J38j31M03q9n13M06OL53k37r2k14K41K42k89l63L61
3083C0J82Q3j24j21k15L34l5j37J96m99K56P2P2j25j71N37j50j38p4j51J15J38
3105G5j38q3L7L5J20J82l02K40j41R3j04j96j17k2L37j80K17j92P7N0o8M9k86
3128c17K60J60J07m53J35M9P6Q5j57N3Q8J1oOk77K91j49J52P9j48k31K25RK4l34
3153b62Q6J92J01N5k21K01l01K14k01L50k68J9j78L38K16n81K1J46J79LJ40k25
3175B4j27N5L0j23Q0J97k29K96k38k45K56L9J76N7l23k50K92J62j18j13m8J05
3197d5N3J60k08l04L51o7K71j27k70M24l36k6L9K8NK86j67l32p7L22r9q4L31J8
$$ plain form
3038 79 81 -416 -270 19 5 54 136 -314 21 74 127 212 -127 -183 76 146 185 -228 -103 277 -4 169 -190 142
3062 142 -197 209 104 -14 -192 -54 -185 218 129 -384 22 28 381 144 52 -162 79 321 32 -331 30
3083 30 212 295 171 50 -165 169 134 -3 193 -306 -50 22 94 -31 -202 335 185 47 -27 -178 -63 75
3105 75 -63 -146 -109 -74 46 228 -74 166 25 118 14 -182 -299 -321 16 -164 53 -139 -62 -12 -80 -31 -317
3128 -317 -57 103 210 -243 -108 -59 17 102 -55 -2 86 97 91 97 -180 111 -38 114 193 45 -186 39 48 72 -262
3153 -262 -176 16 117 172 -49 152 -149 65 -136 214 -54 -35 -213 125 341 -240 -219 -73 106 109 249 24
3175 24 -103 -48 -18 -141 -61 136 -93 203 -35 -280 -24 15 191 248 -75 -325 -33 129 11 -102 -150 -45
3197 -45 8 168 -40 -344 7 -60 211 84 -186 238 -98 -124 -85 -57 -52 234 67 -265 -342 -20 -119 -203 128 146
3221A46r6m7O9k1k00M8j02L53O4j68l82K73K3J18l66K01K44l46L48mm19J13M05
3244B54j79p2j00j88N25l37O9o3j10R4R8K3J19k95J86J19k29j8M8J04j98M64m33
3267a19j35L00O4j39O7l01K27M6m7k27K53k12K29J05r4j52k9J32J18m5p0j25N4
3290a00J94J17l65K30mq5j87L34p0J23j46l1R1O7k98Q1M26k79l17L65p0Q6L9k61
3314f0l8j63N61m52L27r0j31J33j65K25p3k20r9L53j79K42j90L13k94j29P8m9
3336a00j56M45k09j54O5RJ56J49j96l06M45P3P8l74O6m3M01l12j40O6J82m4k21
$$ plain form
3221 146 50 3 72 51 -149 -101 -203 150 214 46 -336 -63 -40 78 -288 -87 157 -189 159 155 -264 -151 254
3244 254 75 3 -97 -285 240 -97 -28 -91 -201 -107 -9 14 133 -162 24 143 -86 -104 -56 48 -150 314 -119
3267 -119 -254 46 110 -29 38 -263 -36 10 -37 -264 -11 -223 6 111 17 -135 -164 -32 86 41 -29 -154 -100
3290 -100 94 211 -154 76 72 -13 -200 134 64 187 41 10 101 168 -130 -49 377 98 -219 146 76 162 201 -60
3314 -60 -98 -261 300 -152 175 85 -46 87 -78 147 74 -146 -245 108 -71 171 -19 294 0 -129 -51 -100
3336 -100 -256 189 -20 -174 -109 -100 56 205 9 -297 148 221 299 -75 -9 -52 349 37 -103 -37 145 101 -120
$$ [...]
8191A12
##END NTUPLES=NMR FID
##END=
