##TITLE=1H_Pr ABT
 CDCl3,8 sc, 
 5.02.2021
##JCAMPDX= 6.0         $$ Bruker NMR JCAMP-DX V2.0
##DATA TYPE= NMR FID
##DATA CLASS= NTUPLES
##ORIGIN= UXNMR, Bruker Analytische Messtechnik GmbH
##OWNER= root
$$ XWIN-NMR		Version 3.5
$$ Fri Feb  5 13:42:12 2021 Russian Standard Time (UT+4h)  she@DPX200
##.OBSERVE FREQUENCY= 200.1315066352
##.OBSERVE NUCLEUS= ^1H
##.DELAY= (6, 6)
##.ACQUISITION MODE= SIMULTANEOUS
##.ACQUISITION SCHEME= undefined
##.AVERAGES= 8
##.DIGITISER RES= 18
##SPECTROMETER/DATA SYSTEM= spect
##.PULSE SEQUENCE= zg30
##.SOLVENT NAME= CDCl3
##.SHIFT REFERENCE= (INTERNAL, CDCl3, 0, 15.7039)
##AUDIT TRAIL= $$ (NUMBER, WHEN, WHO, WHERE, WHAT)
$$ ##TITLE= Audit trail, XWIN-NMR		Version 3.5
$$ ##JCAMPDX= 5.01
$$ ##ORIGIN= Bruker BioSpin GmbH
$$ ##OWNER= she
$$ F:/spectra/data/she/nmr/H-F/1/audita.txt
$$ ##AUDIT TRAIL=  $$ (NUMBER, WHEN, WHO, WHERE, WHAT)
(   1,<2021-02-05 13:41:13.84 +0400>,<she>,<DPX200>,
      <created by zg, POWCHK disabled, PULCHK disabled
       configuration hash MD5:
       00 E9 B6 7A A2 85 ED C7 34 08 36 98 17 FE 4E 26
       data hash MD5: 16K
       E2 DE BA A6 54 D9 DD 9A 9A 95 0D 2E 06 97 4C 59>)
$$ ##END=
$$ 
$$ hash MD5
$$ 57 FF 8F 7D C1 10 DE B6 85 D5 50 0B BB 81 5F 65
##$RELAX= 
##$RELAX= 
##$RELAX= 
##$RELAX= 
##$RELAX= 
##$RELAX= 
$$ Bruker specific parameters
$$ --------------------------
##$DU= <F:/spectra>
##$EXPNO= 1
##$NAME= <H-F>
##$PROCNO= 1
##$TYPE= <nmr>
##$USER= <she>
##$AMP= (0..31)
100 100 100 100 100 100 100 100 100 100 100 100 100 100 100 100 100 100 
100 100 100 100 100 100 100 100 100 100 100 100 100 100 
##$AQSEQ= 0
##$AQ_mod= 1
##$AUNM= <au_zg>
##$AUTOPOS= <>
##$BF1= 200.13
##$BF2= 200.13
##$BF3= 200.13
##$BF4= 200.13
##$BF5= 200.13
##$BF6= 200.13
##$BF7= 200.13
##$BF8= 200.13
##$BYTORDA= 1
##$CFDGTYP= 0
##$CFRGTYP= 5
##$CHEMSTR= <none>
##$CNST= (0..31)
1 1 145 1 1 1 1 1 1 1 1 1 1 1 1 1 1 1 1 1 1 1 1 1 1 1 1 1 1 1 1 1 
##$CPDPRG= <>
##$CPDPRG1= <>
##$CPDPRG2= <>
##$CPDPRG3= <>
##$CPDPRG4= <mlev>
##$CPDPRG5= <mlev>
##$CPDPRG6= <mlev>
##$CPDPRG7= <mlev>
##$CPDPRG8= <mlev>
##$CPDPRGB= <>
##$CPDPRGT= <>
##$D= (0..31)
0 1.2 0 0 0 0 0 0 0 0.06 0 0.03 0 0 0 0 0.0002 0 0 0 0 0 0 0 0 0 0 0 0 
0 0 0 
##$DATE= 1612518073
##$DBL= (0..7)
120 120 120 120 120 120 120 120 
##$DBP= (0..7)
150 150 150 150 150 150 150 150 
##$DBP07= 0
##$DBPNAM0= <>
##$DBPNAM1= <>
##$DBPNAM2= <>
##$DBPNAM3= <>
##$DBPNAM4= <>
##$DBPNAM5= <>
##$DBPNAM6= <>
##$DBPNAM7= <>
##$DBPOAL= (0..7)
0.5 0.5 0.5 0.5 0.5 0.5 0.5 0.5 
##$DBPOFFS= (0..7)
0 0 0 0 0 0 0 0 
##$DE= 6
##$DECBNUC= <off>
##$DECIM= 32
##$DECNUC= <off>
##$DECSTAT= 4
##$DIGMOD= 1
##$DIGTYP= 9
##$DL= (0..7)
0 120 120 120 120 120 120 120 
##$DP= (0..7)
150 150 150 150 150 150 150 150 
##$DP07= 0
##$DPNAME0= <>
##$DPNAME1= <>
##$DPNAME2= <>
##$DPNAME3= <>
##$DPNAME4= <>
##$DPNAME5= <>
##$DPNAME6= <>
##$DPNAME7= <>
##$DPOAL= (0..7)
0.5 0.5 0.5 0.5 0.5 0.5 0.5 0.5 
##$DPOFFS= (0..7)
0 0 0 0 0 0 0 0 
##$DQDMODE= 0
##$DR= 18
##$DS= 0
##$DSLIST= <SSSSSSSSSSSSSSS>
$$ [...]
##$SUBNAM2= <"">
##$SUBNAM3= <"">
##$SUBNAM4= <"">
##$SUBNAM5= <"">
##$SUBNAM6= <"">
##$SUBNAM7= <"">
##$SUBNAM8= <"">
##$SUBNAM9= <"">
##$SW= 16.9725356469052
##$SWIBOX= (0..15)
0 0 2 0 0 0 0 0 0 0 0 0 0 0 0 0 
##$SW_h= 3396.73913043478
##$TD= 16384
##$TD0= 1
##$TE= 0
##$TE2= 300
##$TE3= 300
##$TEG= 300
##$TL= (0..7)
0 120 120 120 120 120 120 120 
##$TP= (0..7)
150 150 150 150 150 150 150 150 
##$TP07= 0
##$TPNAME0= <>
##$TPNAME1= <>
##$TPNAME2= <>
##$TPNAME3= <>
##$TPNAME4= <>
##$TPNAME5= <>
##$TPNAME6= <>
##$TPNAME7= <>
##$TPOAL= (0..7)
0.5 0.5 0.5 0.5 0.5 0.5 0.5 0.5 
##$TPOFFS= (0..7)
0 0 0 0 0 0 0 0 
##$TUNHIN= 0
##$TUNHOUT= 0
##$TUNXOUT= 0
##$USERA1= <user>
##$USERA2= <user>
##$USERA3= <user>
##$USERA4= <user>
##$USERA5= <user>
##$V9= 5
##$VALIST= <valist>
##$VCLIST= <CCCCCCCCCCCCCCC>
##$VD= 0
##$VDLIST= <DDDDDDDDDDDDDDD>
##$VPLIST= <PPPPPPPPPPPPPPP>
##$VTLIST= <TTTTTTTTTTTTTTT>
##$WBST= 1024
##$WBSW= 4
##$XGAIN= (0..3)
0 0 0 0 
##$XL= 0
##$YL= 0
##$YMAX_a= 197158
##$YMIN_a= -82008
##$ZGOPTNS= <>
##$ZL1= 120
##$ZL2= 120
##$ZL3= 120
##$ZL4= 120
##$ABSF1= 10
##$ABSF2= 0
##$ABSG= 5
##$ABSL= 3
##$ALPHA= 0
##$AQORDER= 0
##$ASSFAC= 0
##$ASSFACI= 0
##$ASSFACX= 0
##$ASSWID= 0
##$AUNMP= <proc_1d>
##$AZFE= 0.1
##$AZFW= 0.1
##$BCFW= 1
##$BC_mod= 2
##$BYTORDP= 1
##$COROFFS= 0
##$CY= 11.3945322036743
##$DATMOD= 1
##$DC= 2
##$DFILT= <>
##$DTYPP= 0
##$F1P= 15.9154993809931
##$F2P= -4.1035820241983
##$FCOR= 0.5
##$FTSIZE= 0
##$FT_mod= 4
##$GAMMA= 1
##$GB= 0.15
##$INTBC= 1
##$INTSCL= 1
##$ISEN= 128
##$LB= 0.24
##$LEV0= 0
##$LPBIN= 0
##$MAXI= 10000
##$MC2= 0
##$MEAN= 0
##$ME_mod= 0
##$MI= 1.114404
##$NCOEF= 0
##$NC_proc= 0
##$NLEV= 6
##$NOISF1= 3.799351
##$NOISF2= 2.8
##$NSP= 1
##$NTH_PI= 0
##$NZP= 0
##$OFFSET= 15.70392
##$PC= 1
##$PHC0= -10757.2
##$PHC1= 6.600941
##$PH_mod= 1
##$PKNL= yes
##$PPARMOD= 0
##$PSCAL= 0
##$PSIGN= 0
##$REVERSE= no
##$SF= 200.130013532006
##$SI= 16384
##$SIGF1= 3
##$SIGF2= 2
##$SINO= 400
##$SIOLD= 16384
##$SREGLST= <1H.CDCl3>
##$SSB= 0
##$STSI= 0
##$STSR= 0
##$SW_p= 3612.71676300578
##$SYMM= 0
##$S_DEV= 0
##$TDeff= 0
##$TDoff= 0
##$TI= <>
##$TILT= no
##$TM1= 0
##$TM2= 0
##$TOPLEV= 0
##$USERP1= <user>
##$USERP2= <user>
##$USERP3= <user>
##$USERP4= <user>
##$USERP5= <user>
##$WDW= 1
##$XDIM= 8192
##$YMAX_p= 0
##$YMIN_p= 0
$$ End of Bruker specific parameters
$$ ---------------------------------
##NTUPLES= NMR FID
##VAR_NAME=  TIME,          FID/REAL,        FID/IMAG
##SYMBOL=    X,             R,               I
##VAR_TYPE=  INDEPENDENT,   DEPENDENT,       DEPENDENT
##VAR_FORM=  AFFN,          ASDF,            ASDF
##VAR_DIM=   8192,          8192,            8192
##UNITS=     SECONDS,       ARBITRARY UNITS, ARBITRARY UNITS
##FACTOR=    0.0002944,     1,               1
##FIRST=     0,             0,               0
##LAST=      2.4114304,     0,               0
##MIN=       0,             -82008,          0
##MAX=       2.4114304,     197158,          0
$$ Real data points
##PAGE= N=1
##DATA TABLE= (X++(R..R)), XYDATA
0@%%%%%%%%%%%%jRj6J6j6J6k4L2l6M4n2O0p2Q5r7J12j29J50j72J96k22K50k82
35a49L19l59M02m51N02n58O20o87P59q39R28j024J130j245J371j512J664j830
53i59K018k227K463k733L042l399L816m315M922n678O654p963R821j2692J7766
68A0536k9460J06932J09150k5486N627o7481o961o9742K4425k0297M8156K5937
80A11336K7383K6960k8566J198o8062j6848m9213p753N778M654M5054o585L7429
93H2765l5742q22m6087k9027j7797k6872K7711q669M7996j954K5209r184j7611
106a0084r683m1189Q876k9928L1574l80L1123J8068J791J4971l1389O681l9932
119d9501O997j6276J0688J7291K881L1797j6329J9894l1187j321k3029j2263M060
$$ y = [0, 0, 0, 0, 0, 0, 0, 0, 0, 0, 0, 0, 0, -1, 8, -8, 8, -8, 8, -16, 16, -20, 24, -28, 32, -40, 45, -52, 60, -69, 81, -91, 105, -117, 133, -149, 170, -189, 213, -238, 264, -294, 326, -361, 398, -441, 487, -537, 593, -652, 719, -793, 871, -959, 1059, -1168, 1295, -1438, 1604, -1795, 2021, -2294, 2628, -3050, 3604, -4359, 5462, -7230, 10536, -18924, 88008, 197158, 171672, 177299, 109818, 102857, 33115, 57540, 37243, 85399, 111336, 138719, 165679, 137113, 138311, 70249, 53401, 4188, -3565, 2213, 6867, 51921, 45336, 82765, 47023, 46201, 114, -28913, -46710, -73582, -45871, -54540, -6544, -8498, 16711, 7527, -10084, -19767, -60956, -52080, -82008, -50434, -50814, -19691, -1623, 168, 15139, -16250, -9569, -49501, -42504, -58780, -48092, -30801, -27920, 3877, -12452, 7442, -23745, -25066, -48095, -60358, -56298]
132e6298j1784K8988r987K9698j2491P371j1457j7452K88k5237J8183j4486K6882
145d7782l55J5734P862q097J0499k5031J3109k0811J5333l77J1315J7842j392
158a2151K2655j6425J5436j9604N162o026k312J4470o396K5188j0718J8750j1825
171A6204J475n708j2708P365j7021J8804j1734J7308m596K771J847j4322O964
184F649k1921J1463j5491J0533r48L041R577j0517J2764j8773J0152j4657L521
197a4607r61k489J3315q335J8157j2475J1575r650p7j42q460J2067j1194J6937
211C661q539J2169l467m38L094j1905J0054j4877J2875r086Q684P32r52P751j1551
226a795J0745j5967R115r330L093K005l782J1506j0684J2847j2196P504p499j096
$$ y = [-56298, -68082, -39094, -49081, -19383, -31874, -24503, -35960, -53412, -53124, -78361, -60178, -74664, -47782, -48137, -32403, -24541, -32638, -22139, -47170, -34061, -54872, -39539, -39916, -28601, -10759, -12151, 10504, -5921, 9515, -10089, -4927, -10953, -13265, 1205, -5191, 19997, 9279, 28029, 16204, 17679, 11971, -737, 6628, -10393, 8411, -3323, 13985, 9389, 12160, 14007, -315, 6649, -15272, -3809, -19300, -8767, -9715, -6674, 2903, -7614, 5150, -13623, -3471, -18128, -14607, -15568, -18057, -4742, -13077, 5080, -7395, 4180, -5470, -5547, -5689, -14149, -2082, -13276, 3661, -4878, 7291, 3824, 3386, 6480, -5425, 4629, -10248, 2627, -6459, 2225, 2957, 2005, 9756, -1795, 8950, -7017, 2098, -7232, -4139, -2134, -5916, 5590, -5094, 7753, -4443, 3061, -4438, -5534]
240e534K746p661J1759j0799J3707q861P320l378l009M616j0863J0813j1686J1019
254A89o253N647J008l613O989j1004R733j1763P632n092K498L519n145R934j0282
269f003J0073j0087N829l949j497M599o544J0052q831J0330p055M425j686l548
283c892N509q898J0146r071Q881m348K963J729n108P041r731Q804q915O550l029
298a369J034M134n991Q906r520Q235p939M029j638k122N735p362R600q541P364
313D555n759J971L6m489O062q125R141q310O455l197M63J868n710O887q930P851
329G69o679M660j675r25L861o118P532q558O708n830L052k32k327N555o813Q059
345A039p632O168m432J065J268m278O657p566P784o734N032k286j029L107n811
$$ y = [-5534, -2788, -10449, 1310, -9489, 4218, -4643, 2677, -701, -3710, 906, -9957, 856, -10830, 189, -6064, -417, 591, -3022, 3967, -7037, 2696, -9067, -1435, -6527, -4029, -510, -5655, 4279, -6003, 4070, -6017, -188, -4137, -5634, -1035, -7579, 2473, -6358, 3972, -3083, 1342, -344, -3892, 1617, -7281, 2865, -6206, 2675, -1673, 1290, 3019, -2089, 4952, -4779, 4025, -4890, 1660, -1369, -335, 3799, -2192, 6714, -2806, 5429, -2510, 1519, -119, -2241, 3494, -3868, 5732, -2809, 4555, -1204, 767, 803, -3686, 2376, -5749, 3392, -4918, 1537, -1660, -1197, 671, -5039, 1848, -7082, 769, -5910, -1250, -2925, -3850, 11, -6107, 1425, -7133, -425, -6255, -3203, -3435, -5762, -207, -7020, 1039, -6593, -425, -4857, -3792, -2524, -6802, -145, -7711, 73, -6661, -1629, -3915, -4944, -1837, -7648]
360g648O378q042O828n814L499p91k114M098o355O426p527N296m295J705N72l055
376a0839N345o741O926o307M683l077K17K179m499O344o175O277n121L650j308
391h446j336L412n002O105o488N716l959K074K09k869M454o238N913o609M802
406h262l381L21J186l807M764o530N836n719L276j854q83K648m468N882n780N802
422a0969m141K585J39j420M389m388O402m574N270j929K407J553j530N255m199
437e150O190l608M792j060J149K601k753N461m713N603l632K729l71j013K783
452I008m026M569n133L852l286Q66j94k631K960m928M452n180L228k772o0J092
468A817l535M067n383M610l991K881j343o62K770l827M822m616M512l190K454
$$ y = [-7648, -1270, -9312, -2484, -8298, -4799, -5590, -7704, -3606, -9961, -3535, -11062, -5766, -10061, -8356, -7784, -10839, -5494, -12235, -5309, -11616, -6933, -10010, -9793, -7614, -12113, -5769, -11944, -5667, -10788, -7138, -8446, -9782, -6370, -11372, -5267, -11755, -6039, -9998, -7924, -7715, -10584, -6130, -12368, -6455, -13064, -8262, -11643, -11322, -10136, -13943, -9179, -15709, -9873, -15592, -12316, -14170, -15053, -12405, -16873, -10991, -16771, -10969, -15110, -12525, -12386, -13806, -9417, -13805, -7403, -11977, -6707, -8636, -6229, -4676, -6206, -951, -5150, 1040, -2568, 2224, 1164, 2313, 4914, 2161, 7622, 2909, 8512, 4880, 7609, 7238, 6225, 9008, 4982, 9551, 4418, 8270, 4984, 5850, 5656, 3025, 5985, 1057, 5509, 329, 3557, 785, 725, 1817, -1718, 2349, -3034, 1576, -2415, 466, -877, -1539, 1231, -2596, 2226, -2390, 2122, -1068, 1386]
483A386j4j294L272l840M703m419L987k674O90J025k574L414m615M048m226K254
499A123j684j072J512l786L184m659L709m017J700p01j992K446l936L911m278
514h540L405k794J412N80j813L230k726M291l364L690j047O64J976j886M321l042
530a643M523k487K723k95K32K019k399M007l526L570k585J513K17j715K486l649
546B991L301l856K673k613jL93k736K489l983L048l769K180j958m46J234l156
562d209K966l416K967k712J355j95q39K238l090L837l531L387j935J410Q29j274
578b212K682k888L745k685K480j196L43J188k044K817l109L142k385J520q22n31
594D5J639k775L151l509K585j969N76J00j282K222l076L182k878K386j433K21
$$ y = [1386, 1372, 78, 3350, -490, 4213, -206, 3781, 1107, 1797, 2822, 248, 3662, -953, 3095, -1131, 1123, -561, -1633, -121, -3907, -723, -5382, -1673, -5690, -3990, -4691, -6683, -4237, -8173, -4262, -8540, -5135, -7929, -6517, -5937, -7750, -4520, -7246, -2955, -6319, -2629, -3676, -3012, -1036, -2922, 1399, -1643, 2880, 393, 3116, 2821, 3053, 5072, 2673, 6680, 3154, 6724, 4139, 5652, 5869, 4154, 6640, 2991, 6292, 2436, 5109, 2496, 2495, 2888, 152, 2641, -1342, 1706, -2063, 117, -1841, -2287, -1053, -4209, -1243, -4659, -1692, -4404, -3049, -3244, -4083, -1845, -4935, -1098, -4629, -1242, -3177, -1767, -938, -2212, 470, -2418, 1327, -1358, 1122, -74, 269, 1457, -587, 2230, -879, 2263, -122, 1398, 576, 45, 1684, -1091, 2060, -1449, 1136, -833, -257, -157, -1439, 783, -2293, 889, -1989, 397, -1036, -815]
610h15J174j658L031l163L230k290K136l32l04J872k050L120k893L165k055J635
626C803n3p12J931k108K807k903K603j528N07L28j178J802k645K581k455J525
642D305j146o6P81k153K495l276K745k320J279o42p76J359k303K488k738K304
658B336j594Q31l05r00J858k622K856k514K175j539N07P77j676K319k577K317
674B249j730J437q14k19J366k163K494k605K158j637Q82N5p21J023j903K460k562
691b30J724j146M74K33j310J885k180K144k087J286q12nJ025j842K077k298K267
708A205j856R24J6p86J173j973K512k541J997j088L54L34j197J623j731K166k149
725a017J560o89m8O19j307J964k012K020j814J079k51k43J257j711K115k148J992
$$ y = [-815, 359, -1299, 1732, -1431, 1799, -491, 1645, 1313, 1009, 2881, 831, 3951, 1058, 4223, 2168, 3803, 3750, 3038, 4969, 2861, 5668, 2765, 5368, 3840, 4347, 4675, 3497, 5299, 2654, 5235, 2780, 4305, 3159, 3093, 3874, 1721, 4216, 940, 3685, 1365, 2644, 2002, 1226, 2585, 282, 2770, 32, 2336, 742, 1573, 1268, 368, 2226, -396, 2460, -54, 2121, 582, 1089, 1866, 190, 2509, -68, 2249, 519, 1956, 1142, 923, 2289, 126, 2620, 15, 2173, 536, 1418, 1473, 752, 1775, -128, 2332, -230, 1494, 348, 822, 1055, -255, 1630, -550, 1594, -493, 793, -19, -24, 1001, -841, 1236, -1062, 1205, -651, 273, 289, -497, 676, -1297, 1215, -1326, 671, -417, -63, 271, -926, 697, -1034, 1132, -1017, 543, -146, -194, 425, -882, 1082, -930, 1090, -724, 355, 104, -139, 1118, -593, 1522, -626, 1366]
742A366j485R09K99q87J281j594K208k128J721j173L79L49p76J500k064K031j470
759D66P78l80m1R18j695K078k024J950j862P82K15r82J103j536J895j742J364
776A287j248N58N2r13J365j613J584j641J165p82N5R60j725J801j796J506j305
793f90Q45l72l90J168j384J542j766J751j117P48l09n29J257j460J562j287J373
810I42r13K63N45j146J657j703J683j341J079m85k9P55j276J385j753J836j397
827A02R00k16o36J122j376J476j683J182p80L19M04r16J448j720J775j705J010
844G06k11j03O50j074J303j455J425j047M90K6j54N71j201J564j475J126o60M19
862I00R4n52J334j579J445j725J356p27j62O65j048R11j637J531j156O60m76m9
$$ y = [1366, -119, 790, 1089, 202, 1483, -111, 2097, -31, 1690, 517, 896, 1245, 469, 1969, -95, 1936, 466, 1244, 864, 823, 1741, 46, 2124, 100, 2050, 188, 970, 1185, 203, 1306, -230, 1665, -77, 1287, 39, 597, 649, -264, 1101, -512, 1072, -569, 596, -186, -131, 829, -896, 905, -891, 615, -690, 155, -217, -607, 561, -823, 719, -1047, 704, -413, 335, 26, -503, 754, -706, 856, -431, 942, 29, 292, 837, -309, 1348, -355, 1328, -13, 1066, 581, 552, 1307, 31, 1416, -337, 1499, 102, 1002, 786, 150, 1272, -104, 1372, -311, 871, 91, 410, 814, -102, 1346, -374, 1401, -304, 706, 495, 392, 1042, -32, 1271, -184, 1241, 194, 684, 710, 556, 1127, -74, 1490, 15, 1141, 481, 900, 994, 442, 1776, 197, 1642, -83, 1273, 546, 384, 1049, 1, 912, -725, 806, -350, 310, -166, -215]
880b15M27j001J405j459J446q85M20j69l77J166j135J261j146J371q73N25M30
897A191q94J436j148J846j515J093k87m8N99q98J570j477J370r34O06l65m38R07
915B614j104J099j068O51q92K90j12o88J028j309R08j184R25o52n3K15q51J107
933I24j501J277j185L68J70o27R26j148J312j304R33q28O26l5m67Q56j120J440
951F17j314Q79o23O4L73n32R02j305J430j187L82l73j14O68r42P85j023R69j109
970a453N76k00m36N77r91J104r08N33k74j02L31o77J084j109J385j128P06j87
988a169J34M18o16J033j086J224p70P91m61M3P08p07R33q39Q16o88M53j2m93O29
1008C41o28Q28j048R18o48j04K29l08O96j195J207j179P42l55k28M56p38J051
$$ y = [-215, 212, -789, 616, -843, 603, -282, 138, -31, -408, 758, -377, 884, -262, 1109, 236, 761, 1191, 297, 1733, 585, 2431, 916, 2009, 1722, 1674, 2273, 1375, 2945, 1468, 2838, 1904, 2510, 2145, 1707, 2614, 1510, 2609, 1541, 2192, 1300, 1590, 1478, 790, 1818, 509, 1417, 233, 1158, 506, 453, 668, -183, 924, -577, 700, -485, -117, 53, -574, 352, -796, 516, -788, 145, -683, -57, -92, -559, 297, -823, 617, -697, 182, -441, -377, -4, -536, 366, -939, 491, -696, -314, -687, -801, -133, -1075, -290, -1313, -344, -1453, -877, -1077, -1513, -936, -1927, -823, -1731, -1198, -1472, -1574, -1243, -1920, -836, -1945, -560, -1688, -982, -1169, -1035, -617, -1233, -200, -1286, -62, -832, -41, -502, -459, 249, -458, 475, -364, 452, -236, 217, 205, -288, 341, -287, 541, -507, 411, -237, -341, -112, -420, 276, -919, 288, -891, -149, -504, -732, -276, -1014, 37]
1026C7j225R26n42L13k23M0N28q23J134j268R77m24R0K78n03P72p33R03o30O82
1046C09m60P9K47m17P39r37Q45n19L15m33J28N03p08O98q70O15m22J69J53l49
1066c15N51q64J123q94O22n04k18P62r49P81o69R04r08M02J42k24L84o57R72j040
1086e99Q72o38L98L95n23O96q50O18o97O91k28RJ50p14Q74p33P41p69N56k54l45
1107c50O43o72R37r59P45n11M29l23k70O30r88J107p79P42m59K13Ql52O28o15
1127a96N30o95M53k77Q9N34o78O95o50M65m24J96j46O4L48o95J009r24P63o79
1147b18M28P4k17N09r36J088j169P14o32M21K13l35M81q76Q47q33M69k95lN53
1167B83p51P82q19R59p41K81L0n89P93p49P95o86L86j89P7L68l94K74n13M35l02
$$ y = [37, -1188, -262, -804, -491, -714, -674, -146, -969, 165, -1103, -126, -550, -460, -182, -685, 87, -646, 257, -373, 309, -151, -72, 175, -242, 497, -440, 405, -114, 201, -232, -104, 399, -309, 389, -481, 134, -288, -119, 34, -315, 236, -628, 495, -399, 223, -281, -499, 263, -686, 95, -574, 330, -578, -176, -34, -258, 126, -531, 441, -599, 273, -365, 33, 428, -95, 601, -249, 369, -328, 363, 135, 144, 294, -420, 454, -279, 462, -307, 249, -5, -350, 293, -379, 558, -401, 344, -167, 262, -61, -331, 299, -689, 418, -361, 381, -78, 135, 143, -209, 419, -196, 334, -361, 92, -185, -96, 438, -240, 455, -195, 270, -154, 42, -104, -40, 308, -387, 622, -302, 461, -218, 210, 284, 67, 576, -360, 728, -441, 273, -359, 62, 275, -60, 421, -455, 392, -441, 28, -267, -270, 283, -468, 314, -505, 454, -287, -6, 24, -565, 228, -521, 274, -412, -26, -215, -138, 230, -164, 110, -403, 32, -270]
1188b70L11j61l53N31o79P88p28O14l50L35k9j45K44l61N84p79P91m01j89K13
1208c4j87L60n81P73n27K99M0k76J31j32M33o48O60n09J37Q4j43J11l49O32p68
1229d94P47o90N09O6l06K34o46Q54n02M24l57J32j98l98O81n59O47o10M07L5j97
1250b21K84l33O76o30M77o57L73j56j51L62l75N23o04M54k37J63m7j41L73n73
1270d40N72l18L47l19j7K02l81P38n20N89q10N28k53j76L51l35M95n27N33k01
1290E8m5J3j04K91o19M11k81N46n96K01J23l12O64o02M10l95J51J87p6K6k00L66
1312B17m34M07m24J0L93l30J70l02M97m74K39P9n9J92k94L18l07M81k95k26L12
1333A70k59K03k36K28l38L03j22L53l75n9N19o60N95o15M53m58P5N35k15J93n78
$$ y = [-270, 41, -120, -473, 58, -621, 167, -561, 53, -297, 38, 9, -136, 108, -253, 331, -448, 343, -58, -247, -34, -221, 139, -442, 331, -196, 103, 143, -133, -2, -134, 299, -349, 311, -198, -61, 23, -120, -9, -358, 274, -494, 253, -437, 72, 138, -168, 66, -580, 274, -228, 196, -161, -29, -227, -625, 56, -503, 144, -466, -59, -24, -221, 63, -270, 406, -224, 253, -404, -31, -187, -338, 24, -351, 172, -432, 22, -215, -52, -99, -240, 133, -440, 132, -186, 161, -158, -175, 27, -354, 384, -136, 453, -357, 171, -82, -258, 93, -242, 253, -274, 259, 58, 13, 26, -78, 213, -406, 5, -276, 270, -326, -125, -2, -314, 350, -252, 158, -237, -86, 101, 25, 51, -149, 217, -217, 190, -234, -224, 169, -161, 9, -293, 204, -270, -31, 48, -11, 181, -113, 205, -102, 379, 84, -142, 170, -89, 114, -122, 106, -232, 71, -51, 302, -73, -132, 387, -273, 322, -293, 160, -298, -223, 312, 97, 290, -288]
1354b88O66n71K58j46L27j09l43N68n75N36l42J84k35j24J05J01J88l67M72m33
1374a28J38J05k65P5k35M10j63N6m1K87k95JL58n92M44m17L96j83k84O24m90N74
1396C75o92L58k83N1K52k32N44m63K25k64K59k46m2M91m45M19k74J66l78J81K89
1417B91n90L89l54N11m32N22l50K20j55MP5P2kk90J57j64K22M6k5jk4J49l97J01
1441b5M5J09J79l07L33m23K46k56J44p5L17k13q7K13k37oM1j33J85k7J87m40L40
1464A10k74K93k12n5J67k44K62j83K05m11M07M2l29J52m9n2j54K91k14L55k71
1485a64p2M04l22K63j24K5rj4J44j58J11l08K96j33M2k9m0m9r0N48n74K09J55
1508A11j55P2n3J79n10M22j65J83O3K2l12N1m0j7K59j46J71q8Q9k13J1K47j80
$$ y = [-288, 378, -193, 65, -81, 246, 137, -206, 362, -213, 323, -19, 165, -70, -194, -89, 12, 200, -167, 305, -128, 10, 115, -150, -75, -310, 100, -63, -7, -48, 239, -56, -55, 303, -289, 155, -262, 134, -49, -333, 291, -199, 375, -317, 41, -242, -191, 61, -171, 373, -90, 135, -129, 130, -116, -158, 333, -112, 307, 33, 199, -179, 2, 291, -299, 90, -264, 247, -185, 337, -13, 207, 52, 56, 131, 203, 201, -89, 68, -96, 126, 172, 147, 146, 122, 271, -126, -25, 20, 129, 308, 1, 334, -89, 157, -99, 45, -30, 287, 74, -13, 200, -37, -43, -2, -135, 50, 23, 210, -230, 110, -164, 129, -83, -138, 29, -215, 47, -136, 69, -342, 65, 107, -222, -70, -119, -171, -325, -34, -248, 107, -164, -236, 168, -154, 109, -15, 10, 1, -13, 131, -27, 84, -224, 72, -61, -19, -48, -88, -137, -227, 321, -253, -44, 111, -44, 28, -25, 154, -356, 66, -99, 84, 147, 169, -143, -92, -132, -149, 110, -36, 135, 47, 136, -77, -66, 181, 1]
1531AJ38j69j74K80j02M22k28K15m62J80k70K08Rj83K62r5N5m60M59j25p2L44
1553B33l92L24l92J59j73K94%Q9j03k51L52j26%m1K9N2M7q3j60J77k73K20J3j28
1577a33K67j67K35j83j55J0M06k61k45M69n69M48q8K29l76J07K47j64O1k93L46
1598A91j49J05j71l9O4J2k6k84N38k92R0k97M23l23R3J15k12M87o92L93J13l84
1620b45M08m30L84j25N9q9R8j9k53J93k0L41m91J73j37J58k10Q4L22l07pJ30J70
1643A87m0j60l3M6n0n6M09l26M8K83m39L06m84M44m25M68l68R2J47l9P3j23M6
1666FJ2L5o5K69k24j50L62k20O3j85R0RQ1O0l53K47J69k14q5N7J52k86J34p5J57
1691D6k12J48n1j38P8K4O8r3K03l60K71P8p6L2j42J81j59K58j08j21j01J34L55
$$ y = [1, 139, -30, -204, 76, -26, 396, 168, 383, -79, 101, -169, 39, 48, -135, 127, 32, 87, -373, 86, -39, -111, 233, -159, 165, -227, -68, -241, 53, 53, 142, 39, -212, 140, 14, 14, -27, 2, 54, 101, 18, -142, 35, -238, -18, -5, -133, 134, -33, 202, 19, -136, -126, 280, 19, -226, 243, -326, 122, 34, 263, -113, -6, 241, 77, 138, -155, 191, 42, 147, -24, -63, 1, 13, -13, -297, 241, -51, 39, -258, 165, -158, -65, 50, -162, 325, -367, 26, 139, -245, 163, -267, 117, -8, 51, -38, 60, 41, -212, -19, -39, 302, -189, -16, -153, 5, -205, -121, 201, -106, -113, 17, 187, 147, -13, -46, 0, -50, -106, 303, -23, 25, 308, -131, 175, -309, 135, -290, 178, -190, -98, 49, 10, 83, -40, 6, 18, 53, -12, 257, 33, -117, 245, 25, 88, -97, -7, 2, 83, 143, -210, 37, 206, -8, -93, -36, 116, -170, -36, -111, 46, -166, -18, -69, -207, -129, -105, -37, -130, 73, -287, -16, 62, -14, 18, -124, 57, -102, 156, 48, -73, -174, -40, 315]
1714C15k52J76k57K4J64q3P3l24N6P8J52NJ7k03m6J36p1j21K20j27j3j58J27j5
1738a27M15m80RK35L54l37j19J67l26K84k30K48m20J89J20n5Q5jM58o63M30m52
1760b16Q4k11M60R4J03j51L3o6j79n4m9K40L85l69j34j26J49K48j04m95l4R80
1782E88no76L31n86K92oJ69p7k97kj28L26N32k01l27m12K04M75l85M7M43j25j26
1805E4p4L12k40J37m4n4j61J14K38j29J29k25K08r6j82K27p2O7N9m02J05K56l23
1828i6M8K94j52j15J2qJ21K63m83L19m93M90k33r5j6r7K81j44q0J34l07L99o5
1851b3Krk08K80r5J07j19J63N7Q1l23J64N0J54j08P7q5j87j02R2k28M27k17N8
1875Hn6J01p4N6J26m04K47j27L10k73J94k24P3qK7P5m2n3K0K16j87K15k16j13
$$ y = [315, 63, 239, -18, 6, 170, 87, 160, -164, -108, -30, 122, 127, 144, -59, -105, 31, -40, -161, 59, -68, -81, -239, -112, -127, 288, -192, -183, 52, 406, 69, -50, 117, -209, 75, -155, 93, -327, -138, -18, -73, 12, 11, 469, -194, 236, -216, -132, -343, 117, 211, 314, 163, 196, 130, -49, -103, -152, 88, 473, 104, -30, -156, -7, 241, 137, -358, -392, 588, 583, -93, 238, -348, -56, -62, 107, 30, -267, -269, -397, -71, 461, 260, -67, -479, -275, 200, -185, -138, 305, 180, 54, -20, 292, 52, 189, 145, 91, -70, 44, 282, 153, 282, 57, 265, 169, -13, 214, 142, 209, 268, -134, -29, 227, -96, -48, 246, 94, -21, -9, -17, 104, 367, -116, 203, -290, 200, -33, -128, -144, -241, 40, -104, -184, -50, -357, 42, -23, -21, -30, -238, 42, -53, 54, -65, 98, 155, 236, -87, 77, 127, 281, 173, 250, 165, -22, -124, -32, -260, 167, -50, 8, -48, 53, -21, 35, 161, -243, 4, -123, 187, -86, 108, -116, -43, -51, -24, 51, 9, -44, -24, 192, 5, 220, 4, -109]
1899a09L2J77O3k38N1J54j40J12N6N5k41R9K77k92M5j40M6j4j19Q0K14k05J08
1922G1j01j34K01k26L71k32O2n1q0K2M6l6k00J3K47j87k2K57k51P7l2r7K03q1
1946a60K77N0k55J79k58J16j1m9j3P1M27n59K67r8J22r0K5J02q1k4J33j87l9M39
1970C84m03J09o0q9j37J6L6K84J1r6j47R9OP3o1J51m6k84K50J21m32J08J50j17
1994g4J95l98K88q0J67k24j88L50L00j25r9Oj05P6k26n2M59k47o7J43k18J57j
2017C7k8j90P3n9K47l75K99M4J1J1l43N14j62j04R7j29J78j12k5Q9J55k08K5K
2041D7J59j11j94J16L5M0j28J39m5p6P0o7J30r2J74j83J87j49l20K36%M1J1R0
2065A10L00m07k59J36J38n5K49rK8l08K27p1k55J25J14j81K26J0l14K51j87Q3
$$ y = [-109, -77, 100, 163, -75, -24, 130, -10, 102, 158, 213, -28, 71, 348, 56, 101, -39, 7, -7, -126, -46, 168, -37, 71, -30, -164, 37, -189, 182, -50, 12, -39, -119, -97, -51, -87, -287, -274, -27, -214, -236, 21, -230, -153, -185, -282, -79, -160, 117, 167, -88, 91, -167, -51, -62, -111, -124, -53, 374, -185, 82, -16, 106, 16, 41, 143, 62, 38, 171, -16, -55, 384, -19, 90, 30, -59, -196, -180, -144, 140, 151, 55, -92, 7, 13, 86, 25, 176, 130, -154, 96, 217, -215, -107, 43, -74, 121, -277, 11, -69, 98, -126, -314, 36, 336, 211, 112, 118, 13, 89, -137, -189, 270, 23, -44, 99, -119, 38, 37, 9, -181, -108, -167, 80, -295, 4, 48, 59, 70, -273, 241, 79, -25, 72, -57, 121, 9, -16, 73, 228, 20, 45, 47, 206, 95, -99, 17, 52, 92, -36, 103, 58, -18, 52, -15, 115, 23, 197, 14, 201, 52, -268, -32, -32, 9, 20, 110, 410, 3, -256, -120, 18, -37, 212, 203, 231, -77, 150, 79, -176, -51, 63, -118, 108, 118, -196, 55, -132, -49]
2087d9n5L11l42J30m9J28n9J54j44K30k05Kj71j68K90j6K53j93k3P3P4k03N4R6
2111A18j07o6K8l41K34J86J22l78O4K92j20k71N14l06k4P2K0N6j30J63J68n51
2133b57J64J11K87k88l4J94j69j00j37L54q5n1J44j20K0J13l57J68k9J42l9Km4
2156a1M1j45O3l25L15P0J76n6j0j08k46L92j31J21m38j9M20j54k0%J32j27o9j01
2180b30J77r2j2L57m21K73J10j32j5J42p9M2jl8j98N9n4K87j18k31K57j25K22
2203A80k16J8l8m2J47OJ30q9k81K48j18J57j80j61J75p0k8J93j95k24L41j98R3
2226a52j04K66r7l4K61j76J25L5j16k2r6n5m3K85j10J21l0J30k14j13M10l64J30
2249C7J85l68K06j2j13j32K72n1o5R7k81J10K18o7k8j3k2qL3K03Lj46j16j03K15
$$ y = [-49, -104, 207, -135, -5, -54, 74, 15, 169, 25, 255, 50, 52, -119, -287, 3, -13, 240, 47, 24, 97, 171, -32, 22, 118, 11, -55, -27, -368, -134, 52, 174, -204, -140, 152, 32, -239, 275, -31, -55, 17, 37, 93, -37, 126, 294, -257, -93, 18, 305, 17, -17, 177, 8, -92, -229, 125, 40, -11, 133, 13, 33, 146, -211, -43, -72, 70, 31, 33, -11, 30, -115, -52, -377, -62, 8, 184, 128, 118, 10, -236, 156, 25, 146, -292, -311, 109, -45, -65, -65, 67, -60, -129, -230, -53, -145, -157, 200, -221, 52, 162, 30, 15, 157, 78, 120, 119, 81, -117, -58, -112, 175, 57, -174, 83, -42, 180, -36, -18, -56, -98, 49, 55, 185, 96, -185, 63, -55, 102, -78, -239, -64, -134, -162, 31, -164, -388, -47, -245, -152, -256, 10, -87, -121, 140, -36, 89, 124, 8, -14, -110, -165, -208, 77, -33, 88, 58, 188, -26, -139, 271, -93, 37, 222, -146, 60, 48, -65, -197, 75, 24, -41, 56, -225, -115, 103, 36, 8, -5, -27, -35, -2, 201, 204, 58, -58, -161, 54]
2274E4J94Ml05J53R3l18J88Jj77J15K96l14j03J35L1J58k82J28K00l19L9l8N6
2297a1k6K19l8r8m1j12N7k48K08or0K7L16r8j67j20K61J54l97K18L2j69J52Q1
2321A04j76J9k66K51J07Q5k33m1L22k93K67K2k43K3j13K8K93k0j78j6L98m24j8
2344a02J91k14L25k63J10K6J0r0m8J79j23l0J4N9p2R6j62K23Qk60N5J62l27K96
2368F3j33N9j99N1K66J76l43J04J6Mo3J19jk24M38l8j68j29m5K55j45Pq0K87l37
2393f0K53l00R2J88k14P0R0j64K47k59J36J8k1N6p6j6q1J26K2j69j3N5O3N2K6
2418A21J59j72k06j73J8J37K67m5j87K5K20j66p1Q8j8J34M4Lk25K09l45J66M9
2441C2qJ39m4l47J63kJ56J41K0J22o94M05j81J26k6l70L95o01J037o49N30r63
$$ y = [54, 248, 252, -53, 100, 193, -125, 63, 64, -113, 2, 298, -16, -119, 16, 47, 205, -77, 51, 251, -68, -29, -67, -11, -37, 182, 144, 46, 5, -107, -50, -298, -90, -96, -186, -159, 157, 59, -108, -228, 33, 187, -210, 8, 40, -129, 23, 104, -72, -53, -319, -68, 39, 124, -109, -150, 172, -121, 146, 168, -75, -52, -165, -137, 156, 136, -42, -58, 340, -84, -102, 89, -125, 200, -63, 47, 73, 83, -7, -55, 124, 1, -29, -15, 44, -28, 68, -94, 129, 137, -123, -68, 94, -233, 63, -70, -11, -210, -159, 107, 283, -60, 44, 60, 64, 1, 120, 119, -105, 333, 295, 127, -2, -47, 208, 63, 70, -10, 277, -60, 193, -107, -15, 173, -41, 29, 119, -45, 202, -57, 79, 97, 76, 132, 56, 40, -41, 85, 107, -62, -75, -20, 43, 95, 121, 280, 108, -98, -271, -253, -116, 151, 106, -81, -56, 164, -2, -73, 15, -3, 131, 175, 178, -47, 162, -183, -17, 32, 24, 163, 119, -228, -65, -67, 89, 230, 250, 372, -322, 83, -98, 28, 2, -368, 27, -574, 463, -186, 344, -619]
2463f19j50M39r2J61l83O00L26M3n84L96N1n7j21K77n23l2N7L75J8m03R7K83k49
2486i0O1k3J90j26o9J3J65j48K5P3K16l23J46j32K77l27O1J59j51l6J25N7Q0l75
2510a52m0K58m3M3r6p7J29J74j77J23k7j61J15n2K96l88j42L61l02K15j75J54
2532C6Q7k54K82r9k7K3o7R1M6P3m3n63K38K82l08J69m7M1j53r1K26J20o4L4n3
2557b1J18nr7P8l98M03N0r8M2j22N9k31K63j04J38j94K28k80k9j25K01K66j15
2580B7P9k4k64O6l6J41J07k21r0L97l36R9o1J62K29j8q6m50L44k37J52R4k6l1
2604A7K16k34J36j95O1j09R4L23m98J03J06q4l8L44k86L04m08J37J07k19J15J23
2626A15k07p5K18j33m0K9J47j30O4p0jl8K18o5p6M05m10JJ3k2lR4j63L54k92j24
$$ y = [-619, -769, -330, -422, -261, -644, -44, 282, 325, -259, 137, 188, 131, 10, 287, -236, -268, -211, 164, 182, -221, -124, 159, -90, -29, -52, 138, 12, -57, -44, 121, -27, -2, 71, 287, -36, 110, -22, 255, -72, -11, 148, -3, -39, 86, 143, 223, -152, -192, 66, 23, 66, -30, -107, 22, 196, 19, 142, 115, -46, 69, 17, 313, -75, -217, 144, -158, 57, -118, 36, 123, -131, 151, 52, 25, 48, -19, 72, 118, 191, 148, -415, -177, 105, -203, -34, -81, -40, -193, -284, -58, 62, -2, 32, -21, 97, 92, -5, 73, -325, 78, 128, 30, 72, -50, 9, -222, 41, -63, 75, -119, 109, -171, -200, -325, -124, 142, 27, 106, 82, -182, -116, -152, -11, 96, -125, -215, 182, -154, -55, -116, 46, 275, 257, 171, -279, 65, -172, -20, 74, 48, 17, 233, -1, 135, -60, 1, -108, -14, 309, -189, -86, 20, -64, -102, 242, -44, 260, -148, -11, 96, -123, -8, 115, -92, -167, 51, -82, -122, -93, 54, -76, -12, -82, -83, -121, 97, 32, -44, 361, -49, -48, -35, -57, -60, 34, -129, 225, -67, -191]
2652a91K69k38J71J8R2j07Jl1J98k65L5J42k93O4K22j49J70l5o4j2Qk00K44M1
2676I0o5j87L52q0j26j3j29Q0j23M65l88O6K83p1r2rJ35j91N7j47J65p9K85o11
2700c33L12J07n6j42J81k6k66J65j02J76l7k5q4M8MJ47J3m3N6j31p8K38p5m6J73
2725A76kk05j16Q8J69l43O9LK94mj59J3J7P8q4J2J93j62j20J15l9P8j94J09Q2
2750F8Q2k81J02j15J50O4j28J65K9j98L8O8j5r4Q3M9j18J40j94N6j70K84j62P
2774i0N6l78M26OM7k35J23j28K09K16q6j9P2k72q0K72o0k90QL92k98J42r9P6P1
2799H1k49J40K20l67K54k31k3K73oj09m0J87r8Q6l24K69j67j47L34n7n5k15K64
2822B0m1J01k97L63l17jK93k09J42P2j77l8K6NL02l83K9J07J89j40j47R1k7K20
$$ y = [-191, 78, -160, 11, 29, 121, 14, 15, -16, 182, -83, -48, 94, -199, -135, 87, -62, 108, 73, 9, -3, 5, -195, 49, 90, 25, -162, 190, 110, -16, -29, -158, -78, -201, 264, -124, -58, 225, 154, 62, 53, 188, -3, 54, -93, 72, -7, 278, -333, -21, 86, 30, -112, 69, 43, -223, -58, -160, 16, -21, -46, -130, -82, -78, 69, 82, 39, 95, -36, -114, 124, 49, 3, 176, 174, -31, -147, -59, 110, -233, -164, -161, 133, 129, -30, -17, 0, 78, -6, 6, 199, 37, -83, 32, -7, 71, -123, -14, 68, 150, -131, -29, -144, 6, 70, -58, 107, 136, -62, -24, 44, 29, -65, 18, 67, -51, 89, -105, -49, -219, 65, -97, -90, -34, -412, 14, 20, 67, -168, -45, -173, 36, 252, 166, 147, 219, -53, -133, 139, 79, -211, -203, 189, -109, 33, -66, 10, 81, -168, -28, 192, -175, 79, -152, -175, 98, 92, -17, -57, 130, 32, 118, -206, 63, -104, -251, 83, 26, -29, -244, 20, -21, 80, -217, 146, -171, -172, 121, -88, 54, 126, -51, -89, -63, -58, 244, -139, -110, -3, 186, 46, -101, -10, -37, 183]
2846A83l1k08K1K75k65J59j91J61j42Q8PP1k3p4M0k48J4L7K88j66N0j87L34o8
2870A25j81J1J08q1k32L52r8Kj35rL7K46j53J74k88j4j05J96L77m07q8J61n3N09
2894D54m11K18k98K5J05j41L26j09k63j8P7j02K47j1Q5k50J27k31J41k27J14J25
2916a7J9m6L80m90M27j16j28l0o6nJ14n0l1L03n80L63k27O0J36l1K9j11L34j09
2940A28q6m1L42l44j92K89j2K28n01J4J04J89Rk47M11k43j23P6q9K54K9P4o1R
2964B17k05m33P43L29p70no3K13k8J3k09K01n0J65mJ35m59L08k63N66j95j15M1
2987A32q4R6j26L0l79J78M70o43K93j89J74q4j93L8M11R3j51m02N43k8O5m8j98
3010bj6J55J24n79P53l81K72l48j10n8M2O42k89j56P2l02M64R0l5n64O7K42k15
$$ y = [183, 152, -56, -35, 240, -25, 134, -57, 104, -38, 50, 57, 128, 105, 31, 71, -177, -163, -126, 162, -4, 46, -141, 193, 125, -56, -45, 63, -18, -250, 102, 4, 6, -129, -138, -101, 145, -8, 166, -122, -136, -241, -45, 332, -75, -163, -2, -55, 454, 43, 261, -37, -12, 93, -48, 278, 169, -94, -112, -35, -137, 110, 99, 184, -66, 61, -170, -29, -256, -142, -17, 2, -44, 336, -154, 273, 157, 29, -1, -67, -72, 42, -8, -39, 264, -316, 47, -180, -120, 16, -15, 14, -97, 237, 128, 42, 1, 343, -1, -193, 96, 84, 312, -189, -175, -71, 118, 127, -120, 291, 48, -75, 1, -88, 166, 195, 269, 208, 217, 12, -421, 322, 651, -119, -124, -187, 26, -2, 11, -198, 3, -47, 118, 114, 249, -210, 98, -165, 401, 206, 91, 132, 48, 144, 18, 48, -331, -153, 317, -326, -33, -222, -48, -132, -325, -287, 124, 217, 66, -336, 207, 179, 244, 196, -2, -18, 137, 261, -318, 435, 54, 326, -22, -132, -190, -148, 494, 205, 49, 121, -181, 283, 373, 338, -226, -159, 83, -132]
3033a32L83m12L60J82q77P73k86J73j45j04K33n18P58m27N19o31N55n7l75J76
3053A48n59L01K14k21J10O8j68N8k1OK77Q5m54M8N84k98K62j48m89M32k57QO8
3076E4K28n22N08n00N10K07q30R6L19p5k39ok37R52l83p5J1n50L41Q0o9MP66o46
3100e6j98K9j03l72O40J23o9j57k07N56p85M06p9K00k92Q1P33j60m73N4J82J3
3122F6J33J44m16J02k83J19J55O8j49L64p42N41m21k57J21J54M73m04Q0k51N22
3143A19l80L3K32O72r67o18J129m1L72l63p02M15K25j51l86L89K34n55Q78m97
3163C8N28n06Q1j42k03L74l38P27m50m18J033q22J6J19L10m18n70O56P0k00L25
3184B10j02M89n75o9j30N31q21K57R14l71k70J164q32M69r49k40N87j27J51j77
$$ y = [-132, 251, -161, 199, 381, -496, 277, -9, 164, 19, -85, 148, -370, 388, -39, 480, -151, 404, 347, -28, 148, -411, -110, 104, -117, -7, 61, -107, -49, -70, -64, 213, 298, -156, -108, 476, 178, 440, 292, -197, 235, -22, -14, 54, 282, -240, 268, -232, 278, 485, -345, -249, 70, -5, -244, -250, -487, 465, 82, 7, 18, -532, -191, -111, -180, -176, 590, -56, -254, -225, -328, -700, -60, 63, -6, -163, -370, 186, -599, -193, -272, -72, -364, -283, 450, 290, -183, -129, 53, 66, 199, 343, -73, 29, -254, -135, 20, 88, -61, 303, -439, 102, -319, -576, -455, -301, 172, -232, -152, -403, 119, -261, -228, 4, 676, -291, -909, 220, 179, 551, 188, -514, -99, 126, -25, -411, -22, 212, -343, 535, 38, 566, 60, 141, -1, -204, 170, -168, 559, 109, -309, 724, -98, -82, 37, 347, -71, -641, 15, 85, -115, 210, 108, 597, 22, -47, -177, 354, -467, -210, 704, 333, 63, 1227, 395, 864, -85, -325, 262, 135, 286, 109]
3204A09O25q23K47J32p18j34L79N12l10o6l09Q22r9M5p20P80k60j87j17N59k29
3225B38j84k97J60K98J63m59N56l40p89J253k26j75k25om18j42N24LK5K60J0P4
3247C03J5l69k15L37n15R57n0m68L04n69N92l71O7L56l02K47l00J64m8l52JK54
3269C8J4m85O49m45L32j85N50j07R4n47l68O53j97m17J253o49m94P1j2L48q12
3290g16P32lN63o74j83L78R2m72M91M31n37J9L5l31K53J25N4m06K16l84J58O45
3312D86N68p38j257J310K32p35J04Kj83P86m58k92k84M64P38o79k76m14L74K03
3332d9k20J60q9Q40m79k82J20m55O33R7q8k2j73k84P52K73j029J21M69m10O05
3353D90p71J52JK91n28L74kJ9L14m18J49Ql53j2N66k36L52m47j52N31l69K3j22
$$ y = [109, 734, -89, 158, 290, -428, -562, -183, 329, 19, -47, -356, 466, 367, 412, -308, 472, 212, 25, -92, 467, 238, 54, -243, -83, 215, 378, -81, 475, 135, -654, 599, 373, 198, -27, -33, -451, -593, -69, -66, -41, 219, 229, 303, 318, -51, -266, 71, -444, 513, 463, -5, 299, -270, 322, -49, 18, 374, 72, 319, 19, 183, 135, -217, -216, 38, 52, -433, 216, -229, 103, -82, 468, 361, 455, -92, -460, 193, -4, -421, 832, 183, -311, -240, -252, 96, -716, 16, 13, 576, -98, -281, 97, 189, -283, 208, 639, 102, 121, 156, -175, 78, 203, 257, -149, 67, -317, -159, 486, 1054, 316, -941, 369, 601, -134, -30, -28, -211, 575, 117, -175, -459, 5, 743, 64, -212, -626, -252, -49, -269, -109, -198, 642, 163, -119, 1, -454, 179, 276, 188, 166, -7, -291, 461, 734, -295, -174, 295, -115, 490, -281, -129, -128, 163, -365, 9, 7, 26, 340, -78, 71, 79, -274, -286, 280, 44, 396, -51, -203, 328, -41, -18, -140]
3376a40L27n37J24j42N60J93n68K20q2J51l64K62j76%J81k44J57K35n5k28jJ95
3398F8K00j92k81N00l69J86l05L02k11q9J56j0J46j56Q3k1J6k41l1K16k41J95
3420g9q2K75k12k18L93P2j12k08L97j48j53J20J33P4m4j44n3p3K3j03K96k40j89
3443b75O26k69K4l30J57j53K53R9l75L29P8k32o4R9J43l18J47J91l25K09n7K04
3465A61o7j2k56K02j29J04L05k94K18k80j96L7J61L33j95J25k09q1k3j17L05p0
3487B2J53j69K0K3l9R7R5j13j49J56j06L3M2j74R3O8k54K00l3j12N3J35j97O8
3511h8Q7M0J06j53J9kk52M54k03j41k5J85J14l26K56j37QJ47J0k86J30L71k58
3534E6J01q3R7n7o6J74j05J56j61n8M9m1o8J34l96N18k85q9K46j60J41k64M11
$$ y = [-140, 187, -350, -226, -368, 192, 385, -183, 37, -45, 106, -258, 4, -172, -172, 9, -235, -78, 157, 102, -126, -127, 68, 268, 76, -205, 295, -74, 112, -193, 109, -102, -191, -35, -45, 101, -55, 28, 7, 23, -218, -249, -33, -274, -79, -161, 114, -98, -316, 77, 149, 37, -171, 226, 78, -75, 45, 178, 252, 208, 64, 11, -62, -39, -142, 154, -86, -275, 351, 82, 106, -224, -67, -220, 33, 132, -243, 86, 164, -68, -132, -33, 110, -208, -61, 130, -195, 14, -43, 161, 94, 82, -174, 28, -101, 3, 308, 14, 232, -48, -244, -207, -46, 287, 92, 217, 8, -73, -96, -213, 92, 22, 175, 6, 26, 49, 10, 107, 202, 89, -60, 96, -10, 23, 65, -109, -16, 52, -202, -2, -35, -147, -94, 41, -156, -88, -1, 39, 145, -8, 11, 9, -243, 211, 8, -133, -158, 27, 141, -185, 71, -66, -58, 89, 99, -187, -57, 314, 56, 157, 74, 171, 114, 48, 222, 117, 273, 112, 54, 103, 62, -6, 128, -268, 250, -35, -124, 122, -38, 103, -161, 250]
3557B50l48J29P2k64J11L2L49l43O4Q7k38j47K34l2lO3p3P6j30L21j58M1L4j04
3581B3r0j9Jn9J7J63q0J31n2L2j60J80j72J60j01J11j7j37J56k33K39k06Q4K6
3605cMJ78j79r9m6J85K27r3k69J46o4j91J89J46q1k7J21J7l01N3n0J9J59p1r6
3630a26M3K22j46j77L0m5M05l1r5k46J31M2n2J85j33K02l03P8qj33o8K80j38Q4
3654AK15j02k14R3O2o8k8P4j17P8n5j60p9M70j32oj7O0J45m13L87k35J48p4K2
3679E5m9oR3k9q4J1j19J88j10L5R3j40J71p7j23K74k65RK88j93p9K24m15M20k74
3704a02K16l7k84K29q2Q2j6j40K13n5m8K2J05k19K44n5J40j04j93J06r8J35k09
3727a50J64L0P8k17J55o6P8%j15M7Q9k04OM4J07R9k4k06J81k0L5l2M6k23J23o4
$$ y = [250, -98, 31, 103, -161, -50, -18, 331, -12, 52, 139, -99, -246, -12, -44, -47, 16, -57, 19, -111, 210, 52, 93, 127, 23, -67, -86, -85, -144, -127, 36, -44, 87, 35, 67, -93, 87, -85, 75, -26, 85, 68, -69, 87, -146, 93, -113, -29, -3, 1, 179, 0, -99, -145, 40, 267, 174, -95, 51, -13, -204, -15, 131, 50, 23, 144, 161, -140, -87, -137, -118, 41, -30, -126, -83, 139, -7, -184, -154, -199, 206, 175, 80, -166, -35, 7, -45, 140, 7, 209, -94, -16, -24, -157, -225, 55, -83, 1, 216, 114, -100, -7, 55, -13, -41, 33, -84, -6, -61, -221, -300, 170, 38, 32, 15, 75, 220, -193, 194, -41, 107, 33, 55, 6, 0, 93, 64, -20, -9, -128, 60, -50, -15, 78, -62, 109, 32, -91, 183, -82, -73, 215, 22, -57, 167, -248, 172, -102, 114, 77, -207, 22, -60, 22, 6, -134, 79, 24, -24, -2, 103, -116, 128, 73, 213, 109, -84, 22, -76, 59, -150, 14, 44, 122, -95, 60, -6, 72, 72, -43, 4, 93, -111, -105, -61, 46, 145, 121, -85, 96, 76, 111, 79, 125, -98, 25, -39]
3753c9J41j03j25J99j91L07k6k22j57J01J00J02l02J01N6j39qN2J91l5m0L6j40
3776a41K2J44N0j42o0J11k7k9Q9Q3j63O8K06n45L74m1j93K00K49j39k53J10k8
3799e5M8L36k83j35P8J69k9j45O5Q0k73J79p1J13q8o3jR4J45j78K11k46R8P4K0
3824A43j89K53K7l55K29l18M5J39J34k01K52r5Q6p3J04j26k90L56k07J71K4k65
3846a56N4q4L17j20nO3R1j94m2L2K66r7j55L9J25j47k1J67j66j34L80j15j99L71
3870B70k13j50M7kp3P4k28L01n8K13j30L4j44K5J24k65K23pJ2j38j77J88K42j84
3894a6J17J35k21k18L62j89J21j15k75K84J21P0p4j28j4J38l48K81N7j68L4J67
3916A21k2j48K4j40K96j94J73k40K76j74J15j12L74j16m32J86P5o8O8J04K81l34
$$ y = [-39, 102, -1, -126, 73, -118, 189, 163, -59, -216, -115, -15, 87, -215, -114, -58, -197, -205, -153, 38, 3, -37, -1, -141, -119, 25, 75, -67, -127, -16, -43, -72, 17, 100, -63, 5, 211, -334, 40, -1, -194, 6, 255, 116, -137, -27, -55, -7, 329, 46, -89, -11, 158, 129, -16, 49, 129, -144, 35, -36, 77, -11, -74, -75, 19, 164, -14, 197, -49, 49, 123, 143, -46, 207, 234, -121, 108, -210, -165, -26, 108, -93, 159, 64, 150, 77, 181, 55, -235, 121, -86, 85, 109, -156, -102, -186, 131, 11, 6, 69, 160, -34, -76, -44, 222, 125, -30, 9, 134, -13, -34, 133, -33, -167, 213, 98, -101, 270, 57, -93, -46, -48, -121, -47, -275, 26, -32, 181, 51, 85, -59, -34, 90, -175, 48, 41, 53, -85, -262, -74, 168, -16, 101, 236, 15, -203, 159, -30, 91, -24, -299, -15, 106, 176, 102, -26, -40, 98, -250, 31, 88, -80, -46, 121, 99, -49, -25, -165, 131, -63, 110, -130, 146, -28, 87, -25, 349, 233, -199, -13, 62, -6, 62, 166, 447, 113]
3938A13m03M73k69J17M8j52k44J90L08k90o6j6L6K36j23J87j99J77k27R2L44m0
3960B92J45o3m47m13O25k19J34L35p28M68k73n8j51J009n28j51N22j63k68n26
3980d58O80n65M99k58J27J8J76k97m06L47K41N6j86j78J48j00K92m43Q09J11p49
4001a36J26K86K33o28K87n90M88P49q81j56N0l68Q24m14j03K69j54K32q4j55M76
4022C51m16K01p25L84N94m94J19j46J11l09MP54m04Jk29MJ88K11M0l03k03k06
4044d73Q10o21L94m56O63p6j26n78K30N38n07k82Q25rJ89k60P4q10Q38n25M32
4065B70j73p9j90j66M75J81l03J10jk0k55m2O67p06P3n1j12M6J63J48n20K17K42
4088b6k38K29N04o77ko2K60J45k69L11N58o42O4J36p2L17n40Q2L02n11N7J5K05
$$ y = [113, -290, 183, -86, 31, 79, -73, -317, -127, 181, -109, -175, -191, -155, 81, -42, 145, -54, 123, -104, -12, 332, 292, 437, 374, -73, -486, 139, -80, 54, 389, -339, 129, -144, -202, -353, 656, 128, -23, 499, 336, 68, -458, 222, -343, 156, -102, 25, 43, 219, -78, -484, -137, 104, 160, -26, -204, -56, -156, 136, -307, 502, 613, -136, -10, 276, 509, -119, 168, -422, 66, 815, -66, -222, -172, -540, 284, -130, -233, 36, -118, 114, 30, -125, 351, -65, 136, -589, -205, 389, -105, 14, -132, -21, -330, -326, 428, 24, 25, -204, -200, -12, 199, 239, -64, -267, -473, 337, -284, 110, -346, 317, 241, 115, -463, -233, 305, -202, -484, 341, 332, 521, 261, 335, -475, 363, -162, 270, 97, 18, -172, -338, 137, 318, 15, 125, 124, 104, -151, -193, 474, -232, -159, -210, -322, -276, -113, 35, -485, -268, -26, -264, -35, 469, -208, -210, -272, -12, 133, -136, 175, 733, 91, 155, 291, 219, 536, -4, 78, 380, -131, -74, -59, 146]
4111A46m68P51l97k67J42q3QO62l36j88J67j25m9m91P98m0j89k08N09l40K42R1
4133C35n75k39R14q38L46N23j30K9L5j18j76K80P7j241J593j413J28J331o44n05
4153b88j26j4L55M38j08J60j02M59n73L93Np06J010j436k4J060n10m82K46l25
4173e68J246p05j44M78q58L79J52L91j379J273N77k64k99l2J61q50K98M8K71K67
4193D42R2l8j252J274j60l52n65M96k33K28K6L96m53p1M38k76K33l36L95k5l61
4214a02l9k94j77O28m7O90m05m6M03n20k16J98K33l17m97O98q6P7k44Q6k94N96
4236C25m54M04J12n97N59k55j08N36j7l94l02N20m37J52j8J78O2J68j5p56L10
4257b7k25L47r6k42J42L27j9l62L9j06M1R5l18O65k82mP2p6O1j3l3j26K5J79j11
$$ y = [146, -322, 429, 32, -235, -93, -176, -168, 494, 158, -30, 137, 12, -37, -528, 270, 230, 41, -167, 342, 2, 244, 335, -240, -479, 435, -403, -57, 466, 336, 365, 400, 282, 106, 386, 463, -778, 815, -598, -470, 861, 217, -288, -414, -428, -73, 365, 257, 417, 315, 774, 201, 594, 599, -107, 903, -533, -557, 503, -7, -489, -243, -568, 678, -27, -171, 307, -551, -172, -20, 371, -1008, 265, 842, 578, 279, 247, 408, -442, -144, -96, 175, 442, 534, 496, -756, 518, 358, 6, -559, -63, -296, -68, -42, 354, -99, -170, 268, -8, 225, -111, 284, 259, -102, -141, -435, -612, 16, -31, 659, 254, 208, 611, 91, -125, 73, 306, -11, -508, 190, 104, 181, -63, 23, -271, 325, -129, 275, 387, -210, 349, 94, -14, 522, 505, 111, -191, 329, -108, 44, 26, 204, 266, 434, 419, -337, -27, -252, 95, -1, -243, -101, 226, 207, -155, -116, -222, -181, -86, -404, 261, -21, -25, 47, -29, 32, 19, -14, -140, -115, 64, -47]
4282d7o3K66k21J32k17J61m1j94L98k95R1j68K46k08L01J20j44oj01j79J57J07
4304I5%nk45Q1J30j76J33j9m7J51O9N6j23P2k90J05k8K29k02J23M1qj20J9K28
4329B69l43j64N49J5j24l21Pk5K99m93M19K27l73J27P2j46L57Rn74K79l05K11
4351b8J8J54l30J30p8kN3j00L70k30K1j01m0L26k58K22n4Ro0m6J34k23L40r2j64
4376b9J4j46L35j06j43R5L2j26L0J23M9j33o0K1J57pk21J77k04J53j94J57j42
4399a68M20l31J02k60J90L9P7p5R3K52m80K65j4N1n2j30j16R8k9J5M1M2j55J04
4423b1p7r1J02J67j36k64J76J05j60J50m3l1K14j07j11r1J87q4K13l9o0j09J39
4446B9j25O4M5N5Q7r6r8K62k52mj37L4M11n32N26j85j00K01K1l02J33j14j06O3
$$ y = [-47, -110, 156, -65, 67, -150, 11, -30, -224, 174, -121, -30, -198, 48, -160, 141, 261, 117, 111, 10, -169, -12, 95, 95, 90, -155, -74, 56, -120, 13, -6, -53, 98, 167, 223, 100, 172, -118, -13, -41, 188, -14, 109, 150, 142, 22, 41, 269, -74, -238, 311, 326, 202, -119, -112, -137, 162, -331, 88, 315, -58, 69, 141, -5, 352, 361, -213, 66, -239, -28, -10, 144, -186, -56, -134, -136, -83, -183, 187, -43, -22, -123, -163, 163, -95, 127, 73, 82, 22, -24, 110, -113, 227, 135, -29, -15, -161, 174, 68, -75, 20, 52, -74, -44, 79, 128, -5, -65, -44, 113, 106, -115, 62, -142, 11, -183, -26, -168, 252, -79, 23, -237, -47, -8, 69, -6, 87, 339, -141, 124, 110, 161, 109, -21, -137, -39, -68, -53, -12, 30, -125, -21, -98, -189, -87, 80, -56, -320, -144, -39, -199, -49, -92, -123, 91, -16, -127, -218, -31, -115, 98, 59, -1, -110, 29, -96, -32, 13, 68, 155, 59, -39, 223, -29, -33, -170, -136, 275, -257, 269, 84, -16, 185, 206, -96, 37, -77, -183, -120]
4470a20L57k43jL27l65k3l1j12J40J54n3J78m82J53P6j7J96j59P6k16L91k96j27
4493a97K03N6k9n9P4J46l29J60k18K14j37mn6J83J97k08J40K8j27j1N8j03j11
4516a30J05M2kR2l7j49P2R0k26K41p3p0J23N2j15j58l3J12L3o5J37NR4k44K09
4541A05j58r6L7l4Q8nO5q9m4O7j52kJ85L3J04j62O4r1J08L6j41J12k9j55K37j53
4567g0J70L1o9k53M81m07J35k68L98k26M6l2J58mj5l6N0j36n7O0k8kj44K53r1
4592e6k7K32k09j08K34K43j31j58Ok9J35l26J9J02J8J18oj90q2L30p3j39K31j76
4616d2K38k66j58J93R2K53l41K00j60l28J65J51M8q0o5L6Q1R9j71K8j36K16j75
4639a22o6K50J6KL05n70K56J37l60K9L72o8l23Q0PJ10P3q5N8j02K10j68j63p2
$$ y = [-120, 237, -6, -7, 320, -45, -68, -99, -211, -71, 83, 30, 208, -274, -121, -45, -62, 134, -25, 51, -165, 226, -70, -197, 6, 62, 33, -26, 48, 194, -135, 25, -193, 21, -116, -120, -176, 7, 204, -4, 136, 164, 37, 26, 84, -19, -130, -25, 17, 15, 107, 70, -79, -7, 83, -143, 98, 25, -45, 78, 130, 15, -143, -176, -64, -31, -96, 41, 46, 140, -104, 105, -53, -149, -112, -146, -58, -63, 2, -87, -131, -64, -216, -218, -33, 0, 104, -58, 6, -85, 23, 59, -82, 30, 1, -154, 83, -70, 100, 131, 62, -191, 290, -117, 18, -250, 148, -78, -32, -64, 94, 90, 75, 39, 89, -47, -104, -44, -72, -74, -218, 35, -56, -83, 149, -60, -168, 66, 309, 178, 20, 26, -3, 132, -194, -175, -73, -55, 63, 57, -133, -215, 115, 42, -97, 134, -42, 196, -70, -228, -35, 57, 310, -31, 169, 9, -319, -154, -3, 45, -35, -100, -64, 17, 116, -55, -27, -163, 53, -122, -188, 62, 78, 80, 385, -185, 71, 208, -152, -123, 249, 181, -142, -62, -55, 55, 128, 43, 101, -1, 209, 41, -122, -194]
4663a94J38j40K62K7n1M9j81J11p2Q5j13J99k3k28J87o9P3k12N1L86m37M33n3
4686B28k16Kk9P5j1N0M9j36O0jk1j41Q7L02k37j11J78p3j56J40j1M2k25L42j30
4711E7L2j05J45k58J00K56k14j09K04j32K45k84R9j89J30J99j00j51K03l70L70
4732A28j26M8L4j35J67k20J00J05l51K18J67l49J84J1r6J71j9L3J3J3k2p4K28
4755B28j33k63K41J5j25m6L02k38M0j74K99J81m40K04Lk10NM2l3n3L40k02q6P4
4779b9Rj60K68k83J00J59J54l48K97j83J7L0l15L11m7K02k49P8j91K8J76q4K3
4802c7Kn1Q3L25k59j86K60k31n3K38P6l92J08J69J4j61K89p2O0P7o5k92j13L72
4826A61j64M4j14K95l16kJ40kR9p7j79P6J48j26J43j68M7J9m4r7L47k55J24R9
$$ y = [-194, -56, -196, 66, 93, 42, 91, -90, 21, -51, 34, -79, 120, 97, -131, 56, -13, 60, -152, -101, 285, -152, 281, 228, 12, 14, -15, 60, 49, 99, 148, 12, 72, 71, 50, -91, -4, 298, 61, -50, 128, 55, -101, 39, 28, 70, -155, 187, 57, 89, -16, 129, -129, -29, 227, 13, -96, 108, -24, 221, -63, 36, -153, -23, 176, 76, -75, 128, -242, 128, 2, 50, 84, -51, 116, -104, -4, 101, -250, -32, 135, -214, -30, -19, -115, 56, 37, 70, 83, 96, 74, 0, 228, 95, -168, 73, 88, -37, -83, 219, -19, 21, -153, 146, 327, -113, 91, 94, -116, -111, -69, -102, -155, 185, -17, -103, -29, -20, -180, 88, -195, -95, 64, 218, -130, 167, -16, 1, 31, -284, 27, -20, 182, -67, 11, -180, -152, 24, -60, -37, -35, -86, -3, 322, 63, -123, 137, -94, -147, 91, 167, -225, -117, 52, 66, -95, 194, 122, 182, 259, 194, -98, -211, 161, -3, 41, -73, 222, -94, -96, 44, 42, 141, 64, -115, -39, 109, -17, 126, -42, 5, 24, -20, -117, 230, -25, 99, 198]
4850A98k28R5n4J35Ok24p8p1J85k69M08J05k42p5J75J13j79k52K14j2R9j95J75
4873B9j05J38o0j9j17J49l6j6Q1l53L36j6K81k46n9o1M2K09m9k62q1L48lk0k42
4898a32j03K95p8o3p8o2M98j80j37p7K72l77K92r6j14K47j2j26rk0J20%j73m6
4922a59L6J05Q5R9j31n3k0K35j76r7j35L09o9J53l46k37P30o0j72j1m0M38m4m96
4946e6K54o69N78k74M34P9k74q5q4M53j30K22q05q0L89J6M7j17M90n55N34O2K17
4969F46m32k71J87k04n1N02q91P99K21m63L10on61L94J90J43o81l3O46J8q23L30
4991c0M14j44M7M27j002O16L90j61k51k5j299K83N09N92J54m92O37o59j27M27
5011C06O7m6L16K7k84N19q00J01L18n6k59oK31r8m22J212j365q1J93O5j97Q63
$$ y = [198, -30, 65, 11, 146, 152, -72, -150, -221, -36, -305, 103, 208, -34, -109, 66, 179, 0, -252, -38, -50, 49, -146, 29, -76, 62, 2, -17, -134, 15, -21, -37, 44, -309, 27, 11, 292, 46, -13, -74, -32, 177, 128, -134, -215, 133, 130, 110, -132, -235, 60, -18, -81, -159, -221, 277, 97, -40, -117, 155, -222, 70, -26, -140, 107, 95, -31, -40, -60, 60, 60, -113, -159, -123, -18, 67, 166, 35, -18, -38, 197, 21, -76, -211, 98, 29, 182, -164, -401, 329, 269, 97, 86, 46, 484, 440, -56, 198, -471, 107, -167, 267, 346, 72, -13, -97, 356, 226, 448, -357, -437, -48, -32, 15, -102, 388, -167, 367, 429, 646, 214, -57, 130, -74, -125, 377, -514, 285, 506, 43, 353, 347, -214, 180, 370, 513, -168, -201, 445, 463, -360, -30, 384, 240, 287, 714, -288, 328, 718, 557, 306, 281, -1018, -735, -226, 366, 520, 28, 665, 6, -121, 306, 373, 327, 643, 670, 386, 905, 105, 206, 524, 468, 209, 203, 434, 336, -86, 1126, -239, -320, -127, -62, -259, 604]
5033F04l22j08P19n10l97lj22M34r4l38l08O54m6q96J267n41pL21N43q95M33k93
5055I5L7l05J81J07J25o73L65k30M62P31j095J116r95Mn3m1M09m90L13J27J2K50
5077D52o54J12Q4k17M45n43Q48m49o0K17R0K63m51k42P63k92k94n9J03J40l80
5098a24j24j1K99J10M05n49P19j164Q71k13N4l20N55k23Km2l46R4L6J05mM87p45
5121a28k18K60l66P19m40J76j90J69K4J42l50L90K33l46J91j66l68n3N46l26Q2
5142a9j36K90p3r2M67o55J4k2J40N14n93k5J95K79l77R0j37K07j08O6J68j39M8
5165A02j19mJ28K2l07L50J2j68m7J97k9l45M41j90j47K59k59O0K2j6m7lQ8j21
5189a21j14L18j24M0l70M95P8r6q7Q8j24K12k81K3M2J21J8n4j4P8r0j21M10k70
$$ y = [604, 282, 174, 893, 383, -14, -17, -139, 295, 201, -137, -445, 209, 163, -733, 534, -7, -14, 307, 850, -45, 388, 95, 132, -173, 8, 115, 240, -433, -68, -298, 164, 895, -200, 916, -79, -75, -128, -169, 240, -250, 63, 190, 202, 452, -202, -90, -6, -223, 222, -321, 527, 78, 18, 235, 325, 588, 137, -105, 658, 366, 72, 13, 116, 256, -124, -248, -259, 40, 150, 555, 6, 725, -439, 432, 219, 273, -47, 508, 285, 287, 245, -101, -7, 29, 134, 130, 617, -128, -346, -86, -452, 267, -173, 3, -187, -18, 6, 148, -202, 188, 421, 75, 266, 100, -268, -321, 225, -101, -19, -155, 135, 62, -30, 437, -218, -204, -226, -86, 428, -165, -190, 5, 284, -93, -3, -140, 67, -41, 25, 193, 54, 102, -17, -21, 107, 129, -178, 172, 184, 16, -31, 166, 137, -208, 233, 43, -104, 155, -104, -44, -22, -38, -85, -88, 0, -121, -235, 83, -41, -1, -371, 124, 202, 106, 19, 107, -17, 195, -86, -63, -21, 100, 118, 64, 50, 128, 38, -83, 327, 57]
5213E7K20l26K42l60J84J03j15l64M52p1K0j58J49M8Lo2j2j59J09K9j09L50m06
5236a76L04L8k88K19R4q9q9p8M6m2R1L2J28r0k06p7j70N16J5k07k41K36K69k37
5260bN1j27k6J05N4j26J16j78k0K74k72K32j64K52m81L04J44p5l34K31K24j81
5282Al5J50l00L58k8k34J26J4o5J09P5p7J79k20M3j43P5n5K35k69J91k03J38N4
5306A19k92L48n8k06L13l81J80j53J57j69Q0J22mq1q7K96m24M01j23k32J21l2
5328a05k1o1P6J27j74L04L1l2j97J71j69Q2j34J4J31j9r1l9J54R0l28P4L24j16
5352I2j74K2K24l17J55j7K48j41m8l8P4k64J68L8J04m9l1N5j49N5J51j81j6L29
5376B90l24L9j09J78J16l29m4J56j0O0Q3j62J30o2j1L8L8k48K8K45J37j03j88
$$ y = [57, 277, -49, 193, -167, 17, 120, 5, -359, 93, 22, 42, -116, 33, 81, 84, 22, 10, -149, -40, -11, -120, 230, -176, 128, 166, -122, 97, 191, 102, 13, -65, -19, -61, 30, 62, 190, 100, -106, -183, -353, 163, 178, -29, -270, -34, 235, -2, 49, -78, -104, 1, 55, -71, 45, -133, -153, 121, -151, 81, -83, 169, -312, -8, 136, 61, -273, -42, 182, 1, -34, 116, -184, 174, 146, -88, 38, 52, -13, 96, 171, 94, 273, 53, 96, -47, 28, -27, 208, -61, 130, -73, 65, 119, -173, 175, 117, -89, 224, -157, 23, -130, 27, -142, -62, 60, 56, -25, -112, 184, -240, 161, 38, -194, -73, -105, -126, -187, -111, 16, -158, 146, 177, 145, -52, 119, -50, 32, -102, -88, 43, 24, -67, -106, 48, 138, -190, -116, 208, 92, -82, -60, 164, -153, 2, -15, 233, 92, 44, 6, 80, -184, -16, 22, 126, 77, 46, 101, -48, 7, 158, -23, -39, 290, -34, 5, -104, 74, 190, -139, -183, -27, -37, 23, 106, -56, 74, 12, 1, 39, 77, -171, -143, 102, 239, 136, -52]
5399e2J67q8k32L76k18P4m4k04K47j02N1K00l40L48l0j81J93j56q3Q0J55n11K44
5422a06P0j66M9J22R9J71k79k43N3K31k29L97K9k54p1J92j95K51j60R2N3j07K76
5445B75m8m92J49J63j07P6Q6j50R1O6l5m5J35j46J03k63Q6j86J60J25j57K23L0
5468A39q4o0M1J9k13J66P9j62k5J53J20k68J15k74K72J70k32K54j27k67J32k5
5490g7o0N4J07M6j53J80j50J02k67J15q2L73j40L5p0n2J05k4J9p0J89j46o6J93
5514A61j68o5O3J84j99m0J52nj73K4K65J29l79J45n2J38l03J7J44%p2p7J89j69
5538i1L2O2m8J70j23J37R0k82j74L60o6j87J86o7q0q0K72j70j12K24r9m9J47K6
5562G8m8l0Q3M7q4j84O8o8L38k97J10J11j74J44k22j0K63k61r4M22k87J5PJ35
$$ y = [-52, 115, 27, -205, 171, -47, 27, -17, -221, 26, -76, -25, 175, -165, 183, 153, -28, 165, 9, -74, 6, 161, -350, -106, -36, -202, -153, -31, 68, 239, -40, -283, -230, 1, -228, 169, 198, -56, -127, 65, -130, 121, -39, 53, 106, -1, 275, 227, -265, -116, 47, -60, 16, 102, -48, 43, 109, 74, 29, 164, 18, 121, -142, -56, -242, -82, 43, -114, 109, 139, 55, -5, 36, 55, -158, 8, 87, -75, -100, 53, 173, -95, 20, -254, 18, 188, -44, 210, 83, -184, -52, -77, -137, -83, 24, 70, -83, 97, -53, 49, -218, -103, -185, 188, 48, 83, 13, -39, 66, 42, 61, -9, 180, 34, -32, 161, -7, -72, -9, 175, -24, -64, 88, 83, -90, -66, 199, 328, -51, 94, 42, 180, -123, -106, 38, 38, -34, -111, 78, -91, -59, 3, -45, 125, 2, 139, 229, -53, -227, 133, 67, -120, 66, -1, -81, -161, 111, -59, -171, 53, -46, -95, 52, 78, 30, 0, 83, 130, 46, -138, -70, -138, 200, -97, 13, 124, -50, 94, -128, -138, 125, -136, -230, 192, -95, -80, -73, 62]
5586F2K7j72M7K57k89R4P8o9p1J26lj05K33j45j00L0n2J49j89J31m7K4R5R9k27
5611a7j22K18N7O5k04qm4J34R9j98K3k2J4l53N55m37P9J70J39l44J62P0J58j65
5635B9k67J30P2KP1rJ01l8k22J5P2K10k25J53K6n1K8k41J56J11l13J37J3o0J84
5660H4j78m5k0Q0Q5m0m7N3PJ37j70J28j49l8L26o1l07K15k35K6K21p6J81l8r7
5685D2m3p5OL04j77k41J67k3J64n3k60K20o4L0O9l0M1l43K25j72NK09Pj22J04
5710a0Q5j43P7pJ52M2k46o9K24j53L2J85K1j53K1l00R7K94N8j94j48J81J47q2
5734A11j76K00j48k54L73k62NJ58k1J44k37J4k02K55q7J47j5k1k0q6Q2j03J09
5757c4k03K10r7J35JJ34m6o4M9K7k70L8J57O2k42J36k74L25R3j75p5M2j8K10r5
$$ y = [62, 89, -83, -36, 221, -68, 26, 104, 35, -36, 90, 87, -18, 215, 70, -30, 0, -52, 97, -92, 39, -8, 16, 111, 210, -17, -139, 79, 136, 201, -3, -11, -55, 79, 178, -20, 3, -19, -5, -358, 197, -240, -161, 9, 148, -196, -34, 36, 194, 29, -238, -108, -36, -34, 37, 28, 129, 91, -131, -116, -44, 166, -59, 94, 120, 69, 97, -144, 12, 123, -190, -53, -40, -100, 84, -94, -139, -159, -79, 6, -34, -81, -28, -21, 116, -54, 74, -75, -113, 213, 152, -155, 60, -175, -149, 72, -4, 177, 139, 42, -1, -76, -70, 234, 57, -184, -17, -40, 124, 71, -189, 31, -33, -3, 66, 36, 77, -266, -41, -213, -208, 1, 8, -114, -10, 75, -68, 9, 2, 154, 196, -50, -119, 105, -48, -16, 169, 190, 37, 58, -242, -145, 149, 207, 13, -135, 46, 193, 111, -65, 135, -13, -267, 106, -156, -151, 7, -14, 130, -107, -93, -295, -40, -127, 20, 5, -16, -36, -122, -40, -143, -34, -237, -27, -124, 11, 12, 146, 100, 36, 85, 112, -158, -120, 37, 99, -143, -7, -281, 44, 137, -38, -113, -71, -89, 121, 26]
5782B6J72l57K49j31J14n0K0m3O3K0j48L8pk7R8k55J23J83m32M58j33Q8J23N3
5806B45m93J53J54j43J0k14K48J6N0o9r4K01k98J56O7r2K8K5L6P7O6k78J09l0
5830g0q7M0K29j24j48m2R6k5K71O8l70M56j05l16L3J41j55p1K92k17J42J1r8K10
5854A61l80K75k22Q1J84j80K5J00l38J85q0M19l82J71j7n6J60k35J95K3j94J38
5876C3j43N0q2L56m27K35Q0l2m4J9j76K00k09P5K53j64Qn9R2j9j17m7K74L5k0
5901A71r6k02N2M7j05L53p7j63n6M3J19m0k21J40J48k05j40J93O0k11K34j07o4
5924a27K65k56P9j22L38k65J07K2q0k5o5J80Q4l96K42N2L2J2k44K46j3K01k6j88
5948E3J5j4j16Q2L8K08l06k11K89J13j88J8o3J96J34l21J67j87m1P9J09o3m1r4
$$ y = [26, 198, -159, 90, -41, 73, 23, 43, 0, 63, 83, -65, -27, -34, -61, 37, -218, -95, 88, -344, 114, -19, 69, 192, 245, -248, -95, 59, -84, -74, -288, -40, -24, 26, -43, -137, 64, -234, -78, -11, -103, -75, -50, -14, 63, 129, -149, -40, -70, -157, -117, 112, -12, -160, -202, -106, -131, 140, 208, -162, 294, 189, -127, -94, 47, -108, -179, 113, -104, 38, 49, -49, 161, -219, 56, -166, -85, 99, -81, -56, 44, -294, -109, -189, 230, -152, 19, 2, -54, 106, -129, 66, 89, -105, 33, -110, -60, -142, 214, -213, 22, 102, 70, 26, 45, -131, 69, -140, -65, 188, 24, 32, -27, 65, 46, -71, -118, 156, 191, 171, 75, -127, -75, -28, -133, 220, 143, -20, -76, -33, 86, 46, -175, -35, 113, -92, -232, -39, 21, -190, 44, -63, -127, 138, -118, -39, -161, 177, -88, 19, 41, -39, -64, -129, 51, 135, -261, -19, 33, 65, 77, -167, 79, 66, 267, 241, 53, 68, 54, -62, 20, 58, 266, -40, -251, 38, 151, -37, -19, -82, 114, 248, -73, 94, -93, -134, -55, 54, -9, -50, -144]
5972a44K35K3o1k60K32J19m29J79O8J26OJ7n2r6J56k55J42K1k13K28m4R6J3k60
5996a53J51o4r7K1J34k09M6K32P2j01N1K9n9k61K43J0o4K2k30L73l46M21j36j26
6020d1n9o9L9OK94l74J22J33Lj70J56K09j69K09m36K22Q0J9j76J67j72r2J36j34
6044i7J90Ok26j45J75K8l5O1k9M8N0j13j4j29J64KQ8P8l4k02L6L62n53M19k99
6069a69M18k82K2Q3q7J29k45J40K4n9J21m0k17L91k98k69L41R0j83J5l5J38jr4
6093f7L72l91m9j21J64N5PJ53o8l54K74J77k03n1LJ40k22K07j55L08k81K24n3
6116F9m5pj90K33n8J86j3k40K74j80j05r4L29p4J30q4m17J69K2K91k78K06n1L
6140G6j39o8N7N4j45J52N3O5k98M22l35K4j9K17k26Lk11K71L21k26q7Q7Qj55O5
$$ y = [-144, 91, 114, 53, -207, 25, 144, -285, -106, -38, 88, 94, 111, 59, -37, 119, -136, 6, 27, -186, 42, -2, 94, 107, -153, -2, -66, -163, -142, -8, -217, -171, 61, 133, 32, 83, 112, 53, -208, 35, 45, -19, 3, -227, 146, -200, 221, 85, -41, -100, -169, -130, -124, 170, -204, -82, 51, 54, -116, 40, 249, 80, 289, -147, 75, 155, 174, -2, 165, -7, -99, 37, -97, 93, 99, -127, -272, -97, -69, -104, -43, -72, -24, 26, -87, -101, -230, -66, -64, 24, 102, 68, -134, -98, 264, -289, 130, -169, 249, -33, -11, 72, -15, 114, -131, 9, 33, -26, 95, 55, -162, 229, -69, -338, 3, 93, -90, -75, -110, 28, 27, -67, 305, -86, -135, -256, -92, -37, -30, 123, 55, -299, -25, 152, -51, -102, -99, 41, -181, 26, -129, 179, -102, 122, 69, 24, 17, -173, 60, 2, 188, 175, -65, 209, 29, -76, -170, 159, 85, 215, 131, -286, -117, -95, 196, -82, 124, 73, 76, -63, -131, -74, -20, -165, -13, 40, 105, -193, 229, -106, -82, -101, 116, -110, -107, -318, -47, 274, 48, -39, 48, 56, -99, -34]
6165c4k4J79j94O1L9k2rL3J34j75O7j96k4M6O3J12n0J47k06M8l5j76J13J39k49
6190b13L32k0j66J48m6K4k33j21J13J96N7j10J37K5l33K23n2K27k97m7K55R9k54
6213e6j38M39k64P5r9j9J14k40J29R3J07j29kN5m8j88K93l8j60J23j91J24Q1j68
6237a07M4L4L52l39J6q5K25n4k42R5J67k23O6J69k35J80j47P4j09q1J40K01j50
6260im3j27K56M4p6O1M7j87N0J31j84Ro2P1k4k1N6nq8j5J8N6j69J5K8K49Q8k48
6288g9l6m7L6K85k31n5J25j00kJ49J05J28l10o2R4M5j24K16j38o1p2J52j47J66
6312C7j89J50J6O2j13R9k8j34k9L6N2n5K85j16M7k28J74n6K6l5J26m3p7J00k98
6337a91L72j05J30m08N5L03l56L99j33o7O2j21R2J6j10J99N2j09j59l5l2J47l2
$$ y = [-34, -58, 121, -73, -12, 27, 5, -4, 29, 163, -12, 55, -141, -165, -119, -56, 56, 6, 153, -53, -5, -40, -216, -103, 36, -213, 119, 99, -67, 81, 35, 59, -174, -295, -182, 14, 71, -39, 98, 123, -210, 13, -39, 188, -109, -156, 99, 198, -56, -194, 245, -19, 56, -43, -62, 52, -188, -59, 34, 141, 12, 10, 65, 17, -171, 122, 84, -76, 47, -144, -20, 61, -107, -63, -29, 323, -16, 0, -85, 140, 86, -156, -61, 106, -117, -51, 118, -117, 63, -84, -10, -119, -200, -60, 141, -9, -52, -179, 77, 121, 45, 106, 153, -34, 16, 147, -37, -28, -90, -19, -43, -64, -8, -13, -101, -116, -98, -42, -211, -196, -168, 81, 169, -79, -115, -162, -126, 159, -72, -127, -2, -102, -104, 45, 150, 278, -32, -94, 0, 45, -79, 137, -1, -62, -134, 18, -129, 37, -152, -2, 14, 76, -37, 62, 34, -100, -129, -93, -41, -96, 189, 73, 120, -108, 66, 10, 36, 1, 127, 84, 7, 107, -191, 181, 76, 206, -202, -147, 156, -200, 199, 66, -1, 61, -60, 32, 48, -62, 137, 189, 80, -79, -114, -146, 1, -31]
6360c1m9J5J69j10l8J61l88J98L4j21J34j62K11J66j25J49k12p7K62l72R5n9L16
6383A66k16J81m4j18j08J97l7K90k55j55L16k00r3k0J56N6J03j01j32k31K72j0
6405A7m1j53K05J05R3o5j35j31p2J98K5j99L74k94J32p6j84K55P2q2j22p3L61
6428B10q6L5l44L42j4j30m8l3L4j52o0L07J8j36R0j6n5n0k22M68o3J17p3l39J16
6453h4K65p6j09mJ28j44J17j61m4Q9J49k04J28K0M0j40j38j09K47J69k39Q3p7
6476i4K66M4k20m2p1K30j65L9J31j29J32k50L0J67q2l0r0J07L63m27j48K51J67
6499A79l66O7L32k33N8j8J2Pj38L4q7K21P2j34J80j6L4j88J08L4R8l1j90N7K3
6524A15M3j61J97j35j0kj13M0j58J85l8J26km2p8J72j43o5J69m6j25n5K4m3R5
$$ y = [-31, -80, -65, 104, -6, -44, 117, -271, -73, -39, -160, -26, -188, 23, 189, 64, 213, 1, -76, 186, -186, -91, -150, 166, -50, 131, 87, -31, -139, 58, 21, 311, 56, -99, 217, 17, -76, -96, 60, 116, 219, 118, -14, -245, 27, 17, -24, -177, 28, 133, 226, 161, 26, -105, -177, 21, 46, -153, 221, -73, 59, -17, -201, 54, 126, 44, -78, -151, 210, 124, 159, -185, 157, 143, 13, -35, -68, -34, -186, -246, 61, 79, -57, 33, 17, -38, -88, -310, 158, 95, 212, 139, -200, -84, 181, 105, -4, -8, 120, -24, 93, -68, -112, -23, 126, -78, 50, 70, 110, -30, -168, -277, -30, 139, -100, -17, -94, 172, 216, -4, -46, -117, 113, -52, -13, 118, -11, 121, -129, -99, 68, -14, -44, -134, -27, 336, -91, -239, 12, 179, -187, -120, 212, -21, 37, 19, 31, 38, -100, -66, -153, 68, 140, 6, 186, 170, 204, 16, 124, 158, 256, 225, 35, 92, 115, 158, -3, 194, 59, 49, 47, -66, -26, -184, 1, -37, 89, 87, 45, -33, 139, -4, -69, 100, 54, -71, -126, -102, -145, -50]
6549e0L39l02R1j63q0J64J7j55P1n2J54J8l5K6j03J43k0P6k54j39N62l37K62R3
6573C26k20r6j49J76M7j00o7L0K9R1k53K72Rk53K4J08l6P3pj38L23l08J63K23
6597B67l79K63Kn5J12j86m5jj86K45j74J49n1k8j55P6R7N4K6k27K59K9K5j59p
6622d9p%L10Rq0l38J36N3J54k40P1j3n8q5l2L07j02J47k38j6K2J26l78L22l8K6
6648In4j60K35J0j95M66k76J68k04j0j09J4O2j3K2L85k19k20n1J54J4N2K6j44
6672c8R6N1j13J33k96J71M4k45L27J3N0l32l0K75J47l26M8M0j90K72j1k1J47l10
6696i8J34p5J61k03j63L40k19Jj66L13M7m7J40k07NKm2o1kP9R6J0j42J30J45k23
6722d5J73R8l31M2J65k76J4N2J36k9q4PJ39j97K09j11K45j4k9k6j51J16q5J38
$$ y = [-50, 289, -13, 78, -85, -165, -1, 16, -139, -68, -120, 34, 52, 17, 43, -60, 83, 63, 139, -115, -254, 308, -29, 233, 326, 106, 10, -139, 37, 84, -16, -83, -53, -24, 67, -186, 86, 95, -158, -134, -26, -62, 11, 4, -134, 189, -119, 44, 267, -112, 151, 153, 98, 210, 24, -21, -22, -208, 37, -137, 12, -39, -67, -222, -146, -49, 5, 31, -196, 63, 92, 117, -42, -49, -56, -56, 254, 263, 183, -155, -19, 34, 188, -52, 19, 6, -52, -137, -169, 138, 36, 183, -55, -71, -49, 77, -301, 21, -17, 9, -45, -205, 30, 40, -155, 311, 35, 203, -1, -11, -120, -106, -44, -57, -35, 350, 131, -89, -140, 14, 28, 80, 106, -38, 58, 109, -4, 129, -167, 4, 48, -197, 130, 143, 193, -139, -169, 106, 253, -73, -25, 15, -175, 97, 86, 65, 212, -98, 36, -39, 122, -81, -244, 96, -123, -122, -288, 25, 72, 25, 165, -42, -37, -35, -77, -138, -140, -61, 35, 45, -97, 33, 178, -45, 128, 226, -105, -63, 102, -174, -160, -108, 28, -1, -85, -78, 61, -136, 73, -38, 207, 193, 164, 138, -13, 103, 18, 156]
6746A56j34J03j33J27M1k05O9q4K62j36j40L03l62JOJ89J25j71r3J24m2j97K56
6769F5q4r4K39k57J62j9r1K08j39J30J0j43n2J90k45J86m0n1n3q6J09J91j09J31
6793A58j42J51L8j66l9j0K89m25J20L42m68J48R6k61L37k36R1j30j32l0J97M5
6815b7l1j18K09j37r0J41p9L70o5k84J84j00M9O4j86M69Ql68j65J34j2j19M5p
6839a15J87j33p7J39L7n9kk9Q1M6J8L7j98J65qj84L3rJ21l9J31k47Q4j6p2J71
6865F2j68J4J46p0n9J8n2R5l4O1L3l11K40j33J78j04J42j23J26l8k46J18K22j55
6889c8J54k0k41J33j24J19l4K5k9m1m1R0L2j4J86k38J37l3J91k01kk8j70L16m
6914A25j3j75k02R9J14J31n4o9j30J41J84J03l07m4m8J52O4p1n9q7J46J96l60
$$ y = [156, 22, 125, -8, 119, 160, -45, 24, -60, 202, 66, -74, 229, -133, -132, -126, 63, 188, 17, -76, 48, 6, -191, 65, -19, -113, 126, -131, 31, 12, -79, 129, -10, 120, 130, -13, -65, 125, -120, 66, 26, -25, -78, -164, -55, 136, 27, 158, 16, 167, 205, 39, 0, -10, 279, -146, -26, 316, -152, -4, 92, -169, 168, -68, 23, -107, -239, -269, -72, -27, -58, -176, 33, -104, -194, -53, -132, 238, 173, -111, 73, -27, 22, 86, -100, 369, 377, 9, -156, -22, -34, -153, -108, -115, 72, -61, -138, 1, 38, -21, -23, -52, 29, 75, 93, 130, -68, 97, 89, -95, -62, -71, 50, 11, 142, -105, -21, -37, -109, 62, -106, -92, 54, -16, -75, -57, -109, -14, -48, 13, 46, -265, -25, -158, 20, -84, 58, -65, 61, 23, -223, -105, 117, -38, 116, 96, -145, -12, -136, -17, -51, -26, -55, -96, -137, -47, -15, -29, 157, -81, 56, 23, 214, 13, 11, -17, -187, 129, 125, 112, -63, -265, -166, -52, 79, 25, -44, -174, -33, 151, 254, -53, -97, -145, 7, 71, 0, -59, -146, 0, 196, -164]
6937a64L49j96j77L09q9j49J91j66j4P2J07n6p8j1L20l29k7j01L03J19r4J47j52
6960A14l34J61N1J37L8k87K36j10k54L42k19J47r5m4L8J47k81q9o1M32j20J90
6982A39n2j19m8J77j4k27J88j08P4K8K00j82O1j67n3NJ50p8J53j25j9R5K19n07
7006b10j40L51k06K36J03P0k08j27R6M7P3o7p4J70j51J40k76J44L7J52k2j19R9
7029A18j29K4Oj2j57L96n38L28m4k07J71J31K12j02j38J41k65J17n1j29K9p3J70
7052bo3N2J48j51m0j48O6j36M75m45L56l20L28p8OJ44k92J52j24J87j57K05j16
7075D7j96n8N1J08P4L0l3Nj8j29J25j69K27k01J09J48j53J38N2J0k01j52J72L8
7099B4l43L96q9N5m8q3J39O2p3J8M9K10l5j57j18j28K00k46J81J7q9j88K22K34
$$ y = [-164, 185, -11, -188, 121, 32, -117, 74, -92, -106, -34, 73, 17, -61, -72, 248, -81, -108, -209, 94, 213, 119, 266, 114, -220, -59, -8, 129, 167, -120, 116, 6, -248, 94, -125, 22, -73, -117, -79, 68, -213, -302, -363, 69, -51, 139, 87, -32, -80, 97, 83, -144, 44, -64, 10, 38, 238, 56, 117, -50, -103, -98, 52, -26, 127, 2, -17, 78, 297, -210, -350, 1, -205, 31, 134, 204, -4, -131, -35, 12, 85, 18, -56, 114, -37, 103, -173, -29, 8, 160, 138, 19, 118, -11, 13, 19, 7, -150, 246, -292, 36, -8, -215, -44, 87, 299, 197, 59, 200, -65, 52, 1, -128, -99, -172, -2, -65, -13, 135, -16, -56, -204, -138, -274, 201, -244, 112, -208, 120, 42, 48, 192, -100, 52, -72, 115, -42, 163, 47, -149, -207, -156, -48, 26, 56, 23, 28, 10, -119, 6, -163, 64, -137, -28, 120, -33, 105, 157, 167, -34, -186, -14, 24, -319, 77, -12, 43, -5, -88, 51, 113, 40, 58, 107, 317, 282, 125, 7, -121, 79, -167, 14, 31, -58, -246, -24, 210]
7123B10l39J63J2j15K38k57J41O5P8n4o1J18k69r1K07k35L07j54J71k15K76k12
7145a6J69r0r9j3k05K41l9K75k95K20j96P8K49l41k29K75O0J7M7j19O7q7q3j07
7169b21M08n50L68K2k66M3K02J85j53J50k28K03j49R5j47o0j38J15N6P9l1M2n
7192B0j29J46L6j44J18k25J04J43Q6j75j44K13J53l58J30j95J20J9OK0K08k62
7214a10K06k52J98Q1l52K57j75J47J40K6o2M3m0j08j25L89k33N4M7k18L6N9k7
7237a9O5j68J25j5L3o3m9J01J59j30j61K96m73K69j94M96m17N9N8O6OP1ok76R7
7262g0K65j58j30p1J34Np3j67L11j54o6O4N2R1j71L50k32R5l63K22O0J56l31J09
7286g2L00k75L00k38J30k07J92j09J26j99O1P1j66J7N5J0J36r6kn7L7j54O7K7
$$ y = [210, -129, 34, 46, -69, 169, -88, 53, 118, 196, 142, 81, 199, -70, -161, 46, -189, 118, -36, 135, -80, 196, -16, 153, 63, -36, -49, -254, -13, -52, 223, -72, 148, -48, 30, 279, -62, -291, -16, 44, 61, 108, -11, 56, -31, -114, -221, 187, -363, 5, 27, -239, -196, 6, 191, 38, 188, -40, 163, 14, 109, -38, -98, -236, -121, -65, 14, -17, 25, 20, -109, 37, 73, -71, 47, -178, -74, 69, 155, -20, -164, 49, 202, -156, -26, -221, -101, -82, -76, -56, 152, -110, 96, -156, 42, 123, -229, 28, -147, 0, 140, 166, 104, 147, 107, -1, -126, 263, 30, 84, 131, -87, -51, 8, -19, 46, -122, 3, -12, 21, -42, -91, 10, 169, 39, -122, 174, -299, -30, -224, 272, -145, -86, -28, 38, 44, 115, 109, -167, -70, 195, 37, -93, -164, -30, -25, -98, -265, 46, -108, -174, -110, -58, 33, -138, 212, -20, 75, -288, -66, -6, 150, -181, -72, 228, -47, 253, 15, 145, -62, 130, 21, 147, -52, 9, 80, -86, -69, -14, -4, 132, 36, 34, -23, 14, -140, -73, -46]
7310d6J33P6n8j93lJ12q6K7L7R1Qn09M97j19l3N4j63J33J75j21oK66j33k41K21
7335A19n4J45n0m67L61o0P3r8k12M21m06K16l6MP3kp0J96l06K01P1j31j23K56
7359A21j41R7l60K57j94Q0J56o5J06Qk64R0K68k77J27j33R3oJ00j06J24oj87K28
7383A16K2j24q7N8Q8k27P5k17K43j63P4l6q5J31J7L33j52n1J4O7j51Q1J3L9j89
7408a11J11o8L04j41o3j00J72k21M70l1n24K45J78l96K07K59l70j6J11J64k35
7429e5R8N3r8n1J77j70K24p2j13o4r8K81N0l17J87k8J93k16r8r7K71j02J43j78
7453h0J57J4k40J53l4N4k11J63K8k48J7L47q2j49K6J63p7J14k35qR3J93K1j26
7477E3J5q7k64J68L40j95k98K76M6qK17j36k70K35l9k35p3K79J02o1j75M3L47
$$ y = [-46, 87, 163, 105, -88, -91, 21, -65, -38, -1, 90, 98, -411, 86, -33, -66, -12, -175, -42, 133, 12, 6, 272, 139, -102, 119, 65, 210, 160, -307, 54, -6, 67, -31, -243, 178, -228, -12, -48, -44, 29, 27, -43, 153, -153, 48, 119, -12, -135, 121, -20, 77, -283, -26, -220, -140, 16, -49, 57, 65, -199, -109, 159, -118, 9, -124, -31, -37, 63, -43, 81, 75, -112, 116, 138, 14, -73, -15, 73, -154, -79, -296, -53, -216, -142, -178, -263, -132, -115, 218, 66, 15, 29, 96, -55, 26, 39, 78, -111, 0, -68, 236, 95, 32, -68, 104, -117, 353, 322, -202, 43, 221, -175, 32, 291, -79, -95, 16, 180, -55, 43, 96, -2, -53, 124, -46, 178, 106, -7, -71, -169, 112, 162, -155, 32, 4, 197, -19, -117, -214, 57, -45, 98, -80, 77, 91, -149, 4, -30, 24, -187, -24, 4, -244, -227, 120, 38, -111, -85, 78, 1, 115, -120, -128, -35, 158, 179, 53, 68, -19, -283, -115, 225, 30, -268, 8, 54, 46, 263, 127, -143, 92, 53, -182, -255, 24, 126, 65, -110, -67, 280]
7500B80m84K48J09L5l04J95j23Oo2q9O4N1K34k15j36Q0K36k06K05l14L0K39j69
7523i0j4J40Q2l81M92k60J9l7Q8J60j66O3l0k1k37K54JJ51k78J31k37J38j2j21
7547a65N2o1K05o2K3j26M05l46j8r1J89mJ6R4j13r9K46r4n8j60J35M9r1K05j23
7572HJ59k09O1l8K15j27j45O3p9M0n3J92q8K4j07R9n1J05O2l42L06k1j08J15j82
7597a01J94j64j86L05R3J1k66J94M4l3O2j50M3J03k85R3J9M1P3k14K05j08n1J09
7621C1J62n0j44o7J71l02N92l57K22l36p9K00j59j04l1J89L7J81k9j60L01j92
7643G6o4k27J48J03k71J49J42r4J07j91R7q0J04K70j61Qr3k7j24L9K29j41r2O1
7667c2m2r6K21k03K07k46J99J1K00k34K8J04JP2k61j35K68j86R4j06Q4K33l54
$$ y = [280, -204, 44, 153, 188, -116, 79, -44, -38, -100, -189, -125, -74, 160, -55, -191, -111, 125, -81, 124, -190, -160, 79, -90, -104, 36, 118, -263, 229, -31, -12, -49, 39, 199, 33, 96, 66, 45, -192, 62, 63, 214, -64, 67, -170, -32, -44, -165, -113, -174, 31, -31, -8, -134, 271, -75, -93, -184, 5, 1, 17, 111, -2, -101, 145, 51, -7, -167, -32, 17, -74, 131, 8, 167, -42, 19, -19, 196, 69, -76, -13, -92, -52, -105, 87, -1, 23, -84, 15, -36, 69, 131, -211, 95, 74, -34, 81, -101, 93, -71, -257, 48, 141, 152, -114, 80, 124, 91, 153, 3, 46, 149, -136, -43, -24, 17, 90, -124, 81, -27, -78, 31, 193, 143, -1, -68, 103, -199, 393, 36, 258, -78, -157, 43, -116, -220, -251, -62, -25, 156, 127, -33, 268, 76, 12, -215, -67, 36, -235, -86, 56, -38, 69, -122, -25, -105, -1, 269, 108, 116, 23, -4, -128, -89, 140, -1, -93, -32, -74, -170, 51, -152, 55, -191, 8, 19, 219, -15, 13, 117, 118, 190, -71, -206, 62, -124, -30, -136, -52, 181, -173]
7690a73%J44L44j81j10n4N0p1K30k69j15J81Q8M5n8Rn3q5J00k77q6L76o4%n2J10
7716B9k60O7R3j7K44q1k25Q4%k6j45M2J5K25L6k01L83n79L98J97l2l95M37l89
7740a00J03K13J30j21l77J5R6j63J98j5J86l36m1K04m25L11M31k32m9k47O68M2
7762D91l52j8lr1o6rJ24k6p7K60j15l31L65n73M27J42k26J80m01L20l60L49O7
7785G7j5j16j87N94j75j71J90Lk28k97L31p6n2O92R5p43j14J66j88J91l51P0M5
7808b59J17N1n9K35k5j33J39L81l39l55M15J19p2O2l96l65K45j31Q11m93J47K48
7830C43p62M14P5k73R2k9k56M39K59J71n15O84o24K64k84Q7k10K64K82l98L39
7851C62m72R1n5j58P35j72j570J044M56q54J97O97l17l09J007q38PP1k46L24L46
$$ y = [-173, -173, -29, 315, 134, 24, -30, 20, -51, 179, -90, -205, -24, 64, 109, 51, 60, 7, -78, 22, -255, -341, 35, -29, -29, -81, 29, -231, -164, -71, -88, 156, 75, -150, -66, -66, -92, -237, -195, -180, 45, 81, -120, 263, -316, 82, 279, 247, -148, 289, -100, 3, 216, 346, 225, -152, -137, -41, -204, -6, -21, 165, -171, -212, -8, -433, -122, 309, 77, 28, -219, 449, 491, 139, 121, 118, 27, -39, -48, 76, 50, -27, 233, 118, -213, 152, -421, 6, 148, -78, 102, -299, 21, -339, 10, 77, 62, -54, -241, 353, 178, 7, 197, 200, -28, -325, 6, -70, -122, 570, 665, -78, -192, -26, -214, -23, -374, -304, -259, -142, -91, -150, 85, 60, -73, 66, 447, 108, -247, 168, 287, 215, 277, -119, -484, -239, -370, 441, -52, 95, 343, -419, -5, 70, -203, -111, -140, -396, 43, 302, 473, -42, 642, 18, 282, -2, 85, -125, 139, 421, 23, 362, -110, -19, -74, -232, 503, 331, -1239, -195, 261, -593, -396, 301, -16, -325, 682, -156, -149, -78, -324, 0, 346]
7872C46q36N17j40j34J97j88O3K42J14k22m96M55K42l03m41L46N11j34j37P47
7892G49l48n80J94J2o5p1k45K22L90o5k18J09j34J79j70K04l9n44Q72m83J12m90
7914d09L8K50L09K53n17M39j84K37m9J63l36J5K58k29m91l2K30Jl22K92L83p23
7936d24P66n14N88l68L54o69N39j95k29L79l62J60l11P66q97O85L23N8o76M53
7956D26k46j39J8j53K92O81p36M20m63K25j76K28p04L28O3J38K53p10M64p67Q43
7977B85r52J151p31N97k8m0L3l5J44n26k47O65k88L34j83m55K65k39N98j06n8
7998A84m60O11M41n95K20n22R7j77n2O6K54N9m71M63n3K58l83qK83l66J4K23N3
8021A39j17m84O85l44M83l05m14O27j01M42n67m52L41M47l44J15j3m52J96p5P7
$$ y = [346, -490, 27, -113, -247, -50, -238, -175, 67, 181, -41, -537, -82, 160, -143, -584, -238, 273, 139, 2, 749, 401, -179, 15, 27, -38, -109, -354, -132, 258, 193, -25, 84, -50, 129, -41, 163, 124, -420, 452, -31, 81, -409, -371, -121, 188, 441, -76, 363, 179, 416, 367, 530, 194, 209, 467, 238, -253, -285, -55, -54, -376, -84, 299, -424, 342, -172, 416, 48, 402, -267, 272, 77, -152, 227, -135, 25, -286, 480, -417, 268, 591, 649, -27, 426, 180, 41, 59, -94, 198, 879, 143, 563, 100, 325, 149, 377, -327, 1, 64, 202, 455, -255, 209, -558, 285, -667, 484, -247, 350, 322, 282, 315, 280, 424, -102, -349, 316, 28, 362, 179, -276, -11, -250, 348, 242, 184, -276, 335, 776, 181, 401, -121, -24, -201, -253, -187, 67, 126, -345, 118, 65, 323, -60, -68, 215, -151, -137, 86, 139, 22, -462, 223, -121, 362, 57, -357, 270, 169, 611, 44, -408, -67, 380, 36, 151, 138, -314, -118, -193, -116]
8042a16P9j31m5L15j69j84L60k12J97O08p79J60k55N17m73J84J17Mj48K67j32
8063A64J8M36p00J31LL7m29K17K27J52l06j00Q7K31k18l66M56p62L01J76N58l89
8085g6J59K17k50K24K3o34M68n75O77l57K70j64m20P62o16L58m25M12J6K46r45
8106f30J081j26m67j43K79k2p4P13n99k93Q15m69J36l1l22J79n23K98J73j32r4
8127b51K54R1J72J26m85j73K97j24J93k19J26k4L08p20O06k01J26M74r37L81j09
8148h9K31M06K14m33j28n43O03m22j44J050m54n23K18n90N4J244k65q10J90M44
8168B53j0L08o36K06k25L16l73K85J91o73K40N73l74m02J57L54j58J11m0L05k7
8189C81l41M38
$$ y = [-116, -37, -168, -213, 102, -67, -251, 109, -103, 94, 702, -77, 83, -172, 345, -128, 56, 173, 177, 29, 296, 164, 182, 618, -82, 49, 52, 89, -340, -123, 104, 256, -50, -150, -63, 168, -50, -416, 40, -722, -421, -245, 313, -76, 83, 300, 50, 274, 297, -337, 131, -444, 233, -124, 146, -18, -438, 324, -292, 66, -359, 53, 69, 315, -630, 451, 325, -142, -285, -6, -28, -102, 611, 12, -281, 534, 65, 201, 170, -152, 27, -496, -198, -25, -157, -251, 3, 94, 266, 392, -93, -266, 31, -93, 100, -119, 7, -17, 291, -429, 177, -24, 102, 576, -361, 20, -89, 142, 548, 762, 329, 201, -342, 261, -161, -305, 745, 291, -232, -14, -604, -550, 694, 429, -381, -191, 253, 243, 551, -85, 121, -104, 212, -161, 124, 315, -358, -118, 455, 81, -321, -164, 190, 32, 143, 103, 408, 381, 40, 478]
8191D78
$$ Imaginary data points
##PAGE= N=2
##DATA TABLE= (X++(I..I)), XYDATA
0@%%%%%%%%%%%%%Oj4J6j6J6k4L2l4M2n4O2p2Q8j04J20j37J55j79K07k33K66l03
35a60L40l83M31m84N41o05O74p48Q30r19J017j124J240j368J507j659J829k015
53a056K221k450K706k996L326l707M149m668N295o067P046q341J0151j2898J7667
68A0378k8513J04899N6740n0372m8814j7238m252J5426M8336N650N0945l7799
80A05386J1150o8324j9990m6688j8931J4037n10N5469J557M3052j6093m344k6008
93B9763l8950l124l4462L5790n953N1022J2886K3773R536k2457J783m6160Q607
106B2054k8761K2892Q153K0677L1128o503K4692l5176M299l8389n983j0929l852
119D302K4100n627L6586j6303J8092k4086j0669j4731k4484J0907j9118L1244
$$ y = [0, 0, 0, 0, 0, 0, 0, 0, 0, 0, 0, 0, 0, 0, 6, -8, 8, -8, 8, -16, 16, -18, 24, -30, 32, -40, 48, -56, 64, -73, 82, -97, 110, -123, 143, -160, 180, -203, 228, -256, 285, -320, 354, -394, 436, -483, 534, -590, 650, -718, 789, -870, 959, -1056, 1165, -1285, 1421, -1575, 1751, -1956, 2193, -2475, 2820, -3247, 3799, -4542, 5609, -7289, 10378, -18135, 86764, 143504, 93132, 44318, 27080, 22828, 38254, 86590, 92240, 143185, 105386, 116536, 48212, 28222, -18466, -37397, -23360, -23870, 31599, 33156, 76208, 60115, 55771, 29763, -9187, -12311, -46773, -10983, -16936, 34086, 46972, 70745, 80281, 57824, 59607, 13447, 22054, -6707, 16185, 24338, 45015, 76143, 69640, 94332, 59156, 63455, 25066, 19083, 8154, 4302, 28402, 22775, 59361, 43058, 61150, 37064, 26395, 11664, -12820, -1913, -21031, 10213]
131A0213o956K7494j417J412J41k4329P352k9558J7477j1804K1346Q833Q149J8269
145D6622j4027J4932k7303Q804j9230M768M056O4K2785r289K3022j7888Q267j7958
159B7625o966l591j4486J5293j4318K2416j0993J1872p608q513n49k2208Q704
172c322k1222J5527r396J1161K630l921R783j9165J0369k1898Q852j0088N129
185b5561O797l103J7675j2010J6329j5709P064q461k262O310p963J8387r756J8805
199F542q655Q163l473n921N580j3982J3931j2333J5183m846P203K679o610Q504
213A1965j5957J0610j4316R054m786K829O745o409J2675j3634J1135j3145M942
226A708m723k182P421q143J4860j1163J2727r071L628j765o602P680j1434J3365
$$ y = [10213, 3257, 30751, 29334, 30746, 30887, 6558, 13910, -15648, 1829, -9975, 11371, 20204, 28353, 46622, 32595, 47527, 20224, 29028, 9798, 14566, 18622, 18686, 41471, 32182, 55204, 37316, 45583, 27625, 20659, 17068, 2582, 17875, 3557, 25973, 14980, 26852, 19244, 10731, 10182, -12026, -3322, -24544, -9017, -18413, -7252, -4622, -8543, 1240, -17925, -7556, -29454, -20602, -30690, -25561, -18764, -21867, -4192, -16202, 127, -15582, -8518, -16979, -19241, -12931, -20894, -2507, -12263, 6542, -2113, 6050, 2577, -3344, 2236, -11746, 2185, -10148, 5035, 189, 7392, 10071, 3461, 11965, -3992, 6618, -7698, 1356, -3430, -601, 6144, -265, 12410, -1224, 9911, -3234, 1708, -3015, -5197, 2224, -5919, 8941, -2222, 10505, 1434, 5062, 3297, -3305, 4375, -7059, 6306]
240F306j0238J1839m540L030K124p778Q357j3263J0826j0401Q294k514O01O472
254I115q070J0227j2362R384r814L912r74k773Q017q341J1716r780Q377o941J197
269B890N95o071Q223r544J1614q194P695l707K15K981p687Q122j0814R876p561
284a367O047p15j613O190q981R388j0786Q089o589K908P47l357P677q579R657
299H716q868O795n150J93K498n898Q179q608R867p446N443k277j424M166p809
314a623Q474r197Q690n628L979M27k787N670p708Q016q174O464m033J680K250
329F500l582P053p491Q191p345N057k436m32L429n501Q146p748P871n571L282
344I423j000k157M448p192P781p637O798m315J910P53l822N375p799P227p484
$$ y = [6306, -3932, 7907, 3367, 6397, 8521, 743, 9100, -4163, 6663, -3738, 4556, 2042, 2643, 9115, 1045, 11272, -1090, 8294, -1520, 2392, 1418, -1355, 6662, -1679, 10037, 257, 8634, 1693, 2890, 3485, -2586, 5637, -3907, 7707, -487, 7208, 3501, 3716, 6697, -990, 7132, -3682, 6194, -1367, 4680, 3965, 2352, 8542, -439, 8949, -1837, 6252, -337, 2571, 3318, -39, 7638, -941, 8716, -152, 6643, 1493, 1686, 4184, -1714, 6465, -2143, 7724, 278, 5721, 3444, 2020, 6186, -1623, 6851, -2346, 6344, 716, 4695, 5122, 2335, 8005, 297, 8313, 139, 6603, 2570, 4250, 6500, 2918, 9971, 2480, 10671, 3326, 8383, 5947, 5515, 8944, 3443, 11589, 3841, 11712, 6141, 9423, 8423, 6266, 10714, 3522, 11303, 3666, 10464, 6149, 8059, 8812, 4990, 10365, 2566, 9793, 2309]
359B309N235k923K33K257m677O167p766O670o195L315j254j566L839n587O605
374F662o918O266m899K157j80k916M546o258O623o322N077l291N54J535m462M700
390B874o558N644n558L213k092q55K454n418N447o825N204n281K152n78k352L735
406d794n528O017o144M676l407J136J170k721M821n420O635m898M717j574M43
421d871K595l549O185n668O276l686L454j76o24L259m327N589n168M807l864J790
437B022L21k466L522n514M932n494L141k931l18M53l619L508n814M348m974K061
453f822j770j073J522m562M652n192M234l739K262K4j839L749m499N450m473M294
469g782j936J240J652k128M575m124N195l693L641j162l23K534k942M561m450
$$ y = [2309, 7544, 4621, 4854, 7111, 2434, 8601, 835, 7505, 1310, 4625, 3371, 1805, 5644, 57, 6662, -256, 6010, 1111, 3268, 3088, 172, 4718, -1540, 5083, -1239, 3838, 547, 1101, 2636, -1826, 2874, -3684, 1960, -3598, -385, -2477, -3332, -878, -6296, -849, -7674, -2470, -7751, -5599, -6177, -8529, -4794, -10322, -4305, -10449, -5773, -9180, -8044, -6874, -9595, -4774, -10194, -3559, -8457, -3740, -5314, -4871, -2276, -5825, 360, -5308, 968, -2718, 736, 560, -64, 3195, -1132, 4457, -711, 4096, 232, 2022, 2343, -123, 3399, -2115, 2817, -2677, 464, -2467, -2785, -2332, -5951, -2443, -8257, -3909, -8883, -6822, -8592, -9665, -8143, -12705, -8053, -13245, -9011, -12750, -10488, -10464, -12303, -8554, -13053, -7603, -12076, -7782, -9718, -8478, -6826, -8954, -4379, -8503, -3308, -7001, -3360, -4522, -4845, -2311, -5253, -692, -5142]
484e142M569l387J874n36j194K433l972M195m349L271k724J029L55k206L097m046
500f733M068l647K910j363O38J357k277M346l723M470k708K705k01K30K869k650
516B91M702l418M201k020K055N85q26K863l130M228l857L205j968N71N00k781
532E201L002m374L458m033J805j850j144Q16l536K681m536K465l458Q85p20j812
548e150J572l522L493m254K821k176M49N03j924K480k654L440k991K511r21K1
564f302J635j922L449l140L730k675J972j13o68J863k462L281l152L097k565J299
580b673J32j384K202l202K937l152K196j453Q4O41j908K486l129K845k609J928
596d059r68m0J493k183K953k853K974j974J815L8o76K097k473L404k536K779j392
$$ y = [-5142, -573, -3960, -2086, -2622, -3816, -1383, -5355, -1160, -5509, -2238, -4962, -3933, -3578, -5784, -2687, -6733, -2665, -6312, -3402, -4765, -4127, -2770, -5047, -701, -4424, 46, -2662, 43, -158, 72, 2941, 291, 4993, 1575, 5776, 3756, 5811, 6396, 5570, 8433, 5303, 9531, 5674, 8879, 6911, 7482, 7982, 5201, 8203, 3829, 7287, 3254, 5059, 3209, 2065, 2881, -655, 2026, -2510, -45, -3503, -2618, -3338, -5150, -3578, -7100, -3607, -7861, -5040, -7216, -6767, -6264, -8188, -5708, -8362, -4922, -7913, -5402, -6323, -6302, -4667, -6589, -3140, -6280, -2550, -5225, -3253, -3366, -4034, -2171, -4633, -1352, -4504, -1407, -3972, -2673, -2541, -3925, -1723, -4925, -1988, -5140, -2944, -4397, -4313, -3672, -5580, -3094, -6223, -3378, -5987, -4059, -5027, -5067, -3574, -5757, -2804, -5657, -2683, -4657, -2842, -2804, -3480, -1383, -3856, -452, -2988, -209, -1601]
613a601R28Q07j342K659k686K941k387J925r39j45J336k309K896k983K739k433
629e94J283o02p18J330k463K507k864K375j983O67L84j406K267k987K783k899
645b920K206j051J21J076j459K290k633K822k365J804m08l62J089j480K752k680
661a198K500j752J250R6q94J947k540K716k570K287j387M57L16j412K211k203
677a76K050k479J717p99j4J013j998K135k507K422k209J463o26m44J341k126K287
694A050k181J957j556N68J12j067J822k142K320k295J773j048L42M99j369K066
710H51k448K359j948J265n25J99R16j678J970k213J969j507Q47J92j015J532k004
727a238K397k047J742j085K91M64j380K226j988J922k006J611o74j58J145j819
$$ y = [-1601, -673, 134, -1208, 1451, -1235, 1706, -681, 1244, 305, 160, 1496, -813, 2083, -900, 1839, -594, 689, 87, -631, 699, -1764, 743, -2121, 254, -1729, -1062, -678, -2084, 183, -2804, -21, -2920, -714, -1765, -1644, -568, -2027, 263, -2370, 452, -1913, -109, -517, -879, 210, -1270, 1482, -1198, 1302, -450, 800, 896, 2, 1949, -591, 2125, -445, 1842, 455, 912, 1228, -184, 2027, -176, 1874, -605, 1112, 313, 299, 1312, -686, 1449, -1058, 1364, -845, 618, -8, -452, 889, -1237, 1050, -1131, 826, -730, -162, -50, -1117, 705, -1437, 883, -1412, 361, -687, -345, 154, -1215, 851, -1597, 762, -1186, 79, -446, -247, 669, -1009, 961, -1252, 717, -790, 57, 249, -766, 766, -1238, 1159, -888, 854, -231, 60, 524, -856, 1370, -618, 1304, -702, 909, 235, 77, 1222, -597]
743e97J852j758J559j358Q67k07m34Q46j475J923j886J637j198N04K17j130J503
760H65k112K302k022J518p22k04O00j161J717j997J885j383O17p9m98R98j639
777a315J971j908J570r13M11O9m85J187j694K078k125J940r89L73M83j341J711
794A023j871J962j500J194m75j3O71j184J693j895J721j137O07J43p90Q41j076
811h6J618j730J377j198K42K98p35J029j676J852j639J166p94L0M39j357J785
828F21j906J845j532P54j11n00Q53j416J493j393J471j009L55J09o08J113j600
845a461J548j102R02n31k33P69j060J624j403J070j218Q54l75l50P87r27J111
862Ej401J209q32L25K9m85R10j309J305j203J248q01K76L23p30J267j183J443
$$ y = [-597, 1255, -503, 1056, -302, 565, 358, -76, 770, -705, 1218, -668, 969, -229, 275, 492, -638, 865, -1247, 1055, -967, 551, -171, -375, 225, -936, 781, -1216, 669, -714, -97, -176, -674, 324, -1315, 656, -1252, 318, -595, -184, -115, -600, 587, -1107, 971, -1154, 786, -203, 170, 653, -688, 1023, -848, 1114, -386, 808, 333, 320, 991, -193, 1500, -395, 1326, 189, 796, 939, 149, 990, -86, 1532, -198, 1179, -19, 223, 521, -214, 815, -861, 991, -648, 518, -276, -246, 193, -1164, 621, -1285, 560, -972, -218, -329, -829, 24, -1392, 101, -1292, 179, -830, -475, -366, -974, 139, -1461, 87, -1015, -113, -644, -877, -108, -1168, 456, -947, 123, -1095, -241, -616, -966, -179, -1106, 5, -1396, -187, -1019, -694, -665, -1150, -240, -1549, -244, -1447, -199, -1000, -724, -401, -1131, 136, -1047, 396]
880C96j288J182j3j67O47p11J322j356J497p56R13l60l5Q40r34J320j531J227
898B193n40L99M6n41P68j289J560j221M42m32q7J80q43J243j604J171j198O50
916H97l83k24P16j260J335j508J323j112N08L0m56R70j278J296r13Q92n95J73
934D11L87p19J322r24R80q30N63k86j9M84n19J084j452J170q95L84L67n70O49
953A587r73J040j295P15k69k09N00o87P47j219J265j129P72m78j26O04r08J154
971A091j206J108o96M62j80nO76r83J397j158Q98n69L06J51m97P07r52J288j114
990G24Q90p22J1O18r69Q63q21M89o28N74j76m96N95j006O65p95O01o52L21l22
1010b36m74P55q71R60r46P20o63m9L55m25N48p78J021q83J122p49J32N05p89P42
$$ y = [396, -892, 290, 277, 110, 757, 46, 1368, 12, 1509, 753, 1666, 1306, 1271, 2111, 1177, 2497, 966, 2193, 1653, 2052, 2098, 1557, 2325, 1036, 2596, 1375, 1817, 1385, 1298, 1478, 635, 1878, 274, 1445, 247, 897, 514, 290, 1006, -254, 1081, -427, 896, -216, 292, 322, -134, 836, -442, 854, -59, 833, 238, 411, 798, 79, 1401, 477, 1457, 627, 1190, 904, 885, 1369, 850, 1934, 482, 1652, 757, 1141, 1508, 938, 1587, 614, 1654, 359, 1074, 805, 596, 1096, 409, 1156, -63, 1202, 73, 845, 367, 241, 845, -63, 1091, -115, 993, 297, 759, 579, 574, 1250, 267, 1664, 506, 1404, 835, 1141, 1292, 795, 1502, 550, 1838, 724, 1614, 892, 903, 1521, 552, 1415, 594, 1083, 455, 1029, 853, 357, 952, -54, 611, -184, 417, -235, 86, -236, -710, 45, -826, 134, -812, -92, -755, -804, -449, -874, -326, -1104, -83, -966, 156, -593, -461, 44, -745, -3]
1030co75R57p17M71j98rN40r27J138j084R34p61J99J55k69P18r28P40q54O54l17
1051b36K10j8m69Q01q56O83o89M03l36lN61q23P58r40Q50m05K02J92k98N85o19
1072d47L99o28O87k52L14J45o81R05p49P74q67O22j52l00M06m84Q57r21R10n99
1092f1O9K07m20O17p22P85o11L93l43r6N37m74N45p23O30o08O22l11l9J98l49
1113a54P53r43P64n29N29m48J4K07m42P53q41O57m26K08J75l58M75n37N97n05
1133e1K10k21K5L92q13N08k43N64m66Q8J89m32M80m91O89o91N63n85K62K2m55
1154d56O51n96Q99j166Q17l28R1J46m85P32q04J012q69M92j27j61N10q29P33m16
1174a54N32q43M84Q7m11N66o13O26l87L95n00L40J6l37O06o48N19m58M45k25J06
$$ y = [-3, -678, 279, -438, 33, -165, -174, 366, -561, 577, -507, 427, -334, -135, 20, -249, 469, -459, 281, -573, 81, -236, -26, -44, -513, 288, -568, 115, -574, -171, -507, -510, 51, -772, -14, -954, -104, -509, -307, -115, -413, 172, -447, -48, -676, 11, -241, 73, 218, -463, 442, -307, 467, -400, 222, 70, -230, 176, -308, 549, -372, 538, -61, 8, 215, -205, 412, -310, 475, -136, 257, -86, -182, 355, -119, 426, -297, 333, -275, 347, 36, -3, 195, -154, 599, -344, 420, -109, 420, -28, -14, 193, -249, 504, -337, 320, -106, 102, 277, -81, 394, -143, 454, -51, 159, -62, -37, 355, -458, 50, -193, 371, -95, -7, 182, -250, 230, -261, 428, -263, 300, -285, -23, -1, -456, 195, -401, 498, -668, 149, -179, -88, 58, -427, 305, -499, 513, -356, 136, 9, -152, 358, -471, 262, -154, 378, -465, 19, 106, -305, 261, -352, 274, -113, 282, -218, 122, 138, -199, 407, -241, 278, -180, 265, 40, 146]
1195A46J42n07O50o74N51n80N78j11q5J16l97N98p27O06l43K22R9o2L41q66P02
1216C99o52M74j41q2j90JN88q25O95n83M26j39k39L23k73M19o21O51k51j27K6
1237a21j0L00p66R87o35J64j02P5K08k97N13o62N89o17J41M42l47K37m08N86n59
1258b82L09j78J49j64J21L75m48L73l93N97n29L6O10q73L92l22N26m47O5j9K59
1279A57k9j88L46p36P85l28p3JK7J52k70M79o53N17m47J56l4j02M89o96N43m19
1301c23J43K83l62K33k56M61m61M85m36K28r0JK08m60O08o75O52j87o2R4k05L42
1323B21l82M27l99L38J8p5j47j75L04l35L4j08M15j57m8J5l31N82j90J40m10K85
1345B2k03K40J35m66M69n82O21l47K29J7k75L38j21kj10J29l17OL04l05M71m22
$$ y = [146, 288, -219, 431, -243, 308, -272, 306, 195, 110, 226, -171, 427, -300, 306, -37, 185, 284, 222, 563, -303, 399, -253, 221, 80, -2, -192, -191, 397, -428, 267, -316, 110, -29, -268, 55, -218, 201, -420, 231, -20, -147, -121, -131, 169, -597, 390, -245, -81, -183, -108, 100, -197, 316, -346, 243, -374, -233, 209, -138, 99, -309, 277, -282, 27, -151, -2, -166, -45, 330, -118, 255, -138, 459, -70, -34, 576, -297, 95, -227, 299, -148, -83, -102, 157, 128, -60, 286, -450, 335, 7, -66, -65, -38, 114, -156, 323, -330, 187, -260, -104, -138, -240, 249, -447, 96, -323, -180, 103, -259, -26, -282, 179, -282, 203, -233, -5, -95, -94, 114, -346, 262, -413, 239, 52, -10, 84, -121, 221, -161, 266, -133, 205, 223, 148, 1, -174, 130, -205, -171, -279, 136, -21, -69, -54, -385, 197, 7, 147, -263, 22, -181, 59, 194, -272, 197, -385, 236, -111, 118, 135, -140, 198, 77, 75, -35, 94, -223, -217, 87, -218, 253, -169]
1367a69N20l45j13J06J03l37N8K11l10N94o26J61j82L39j82p2J60j16L20j70L6
1388a4Q5l36N21p62Q33l95K32j98j39K01q8K16l44M93n26L42l15J64L81m94M12
1409B69l73J67M7j00j1M7L84m53K19o00M82j45J1L28m63K47m18N24k89M03l53
1430g7O8N58p47K32L7N7k04M9l5j76K08m6L23l83J12K9J42j35M6O5l43M82l47
1453h5J17j18J19L2j66J96o9M07n59NJ24qK73k07J85m85L44m91N8M77m23L23n1
1476bJ13m4OrO8j81J36J45m34M68N7l23L03m35L96l81M46m17M51l06N8O4k50Q6
1500A5K2j09j46K34R3m6r1m0K77n59O52m33J43O7l1J55k27J98j52Rj82J69RJ2
1524C9j67K34j95j39L11j33m7J60r0J41m69M58l12L82k56J54N7k35L32l75L14
$$ y = [-169, 351, 6, -107, -1, 102, -235, -177, 34, -276, 318, -308, -147, -329, 10, -172, -244, -84, -200, 120, -50, -14, 71, -265, 256, -506, 327, -68, 164, -34, -173, 28, -60, 156, -188, 305, -221, 121, -194, -30, 351, -143, 269, -104, 63, 110, 10, -1, 46, 430, -23, 196, -404, 78, -67, -56, 272, -191, 56, -362, 162, -127, 276, -77, -9, 549, -198, 34, 71, 128, -76, -27, -62, -238, -30, -76, 247, -136, -24, 5, 147, 12, 58, 123, -220, 262, -85, 32, -86, 33, 65, -101, 95, 26, 433, -126, -121, 3, -5, 268, 61, 246, -239, 105, -386, -328, 149, -274, 49, -2, 111, 67, 73, 64, 132, -49, 87, 232, -202, 266, 323, 0, 303, -132, 264, -117, 329, -88, 363, 57, 115, 179, -71, 15, 37, -72, -218, 16, 109, 63, -28, -68, 209, -350, 302, -131, 12, 79, 48, 203, -24, 174, 22, 31, -151, 18, 27, 39, -128, 106, -89, -228, 83, -50, -97, 63, -27, 114, -355, 103, -209, 173, -83, 71, 128, -107, 225, -150, 164]
1545A64l81J40J85j81q7Q3J88k64p8Q7M17k97k67L94k07L74m12M54k96J27j34
1566IP4L32l76l11L92P1j73oJ35j85K21r6J12k34R9J05j38K97m47M68l41J33k18
1589g7L43k46j70M11o34O83m51K12k47K58K13n14N30n63L46j89K21j42l91M80
1609G3r7jl53M41j75J87m2L5j35m9J63k93K25p7J17L32l90l7n9Q7j7QjO1m8j99
1635b44L58QJ9j73K06p4m2j32M5l4J84J3j47Mj97K08M5k83K64q2K25P4m42L76
1659A79l19J19q1Q6n6k5K22k85J41K5N0k05j07K14O0m1l8K21j49j12K3K28j9k84
1683a53K42j05K48m53L79rj62K3j84J67j49J73j48K20j01Q3k6n7K83l39J19j9
1705C2O7j59m1L71l61K25k4m9o1J8O5j9q9J14j08p9K7l2J58M8k75J02K9O0j18
$$ y = [164, -217, -77, 108, -73, -160, -77, 111, -153, -231, -144, 273, -24, -291, 103, -104, 270, -142, 312, 16, 143, 9, 83, 415, 39, -272, 120, 191, 18, 12, 147, -38, 183, 87, 199, -35, 64, 169, 31, 328, -119, 349, 8, 141, -77, 266, 20, -150, 261, -373, 310, -141, 71, -176, 82, 295, -219, 311, -252, 94, -95, 126, -16, -407, 73, -24, -25, -378, 63, -112, 75, 33, 68, -67, -116, 47, -246, -21, -98, 19, 351, -39, -76, -135, -48, -65, -57, -58, 3, -45, -244, 114, 122, 141, -32, 174, 100, 58, -74, -29, -63, 121, 134, -13, -9, -206, 2, 47, -236, 28, -54, 171, 245, -197, 179, -140, -21, -102, -16, -72, -97, 125, -160, -19, 6, 56, -149, -256, -42, 18, -23, -61, 160, 11, -101, -78, 150, 131, -153, 89, -16, 232, -221, 158, 149, -13, 10, -174, -7, -156, 17, -131, 89, -12, 71, 45, -12, 271, -68, 51, 32, 99, -60, -101, 270, -91, 134, 110, 61, 0, 18, 83, 64, -25, 89, -19, -98, -71, -103, 55, 103, -172, -70, -41, 19, -99]
1730i9J40k79R5K63m12M19l22L24k42J57O7j40j86J80K4k59M67O0m87M4j06N35
1752B43p29N13l65O63n01K75K76m39O49j97m57j19j08PK20Q00q49k60K09J79J68
1773A78l04N05n50K34q87Q36m27m29J029r77R47k99N63m31K31o47Q65n6p19L12
1793b6P1r6k08K09L60k91J40j36l6Q2p4j8Q6k9j37J31rj42p7K12j89M08l53k5
1817a47J23k13K01j16p7L5k03J55J47N1Q2m8J10j46j32Q2l1j36L47m24L06k33
1839b67K15mq8L52l85L94L2l40J45m18M25Q7o1j75J77r3O3p9M4l0j96N05l81O
1863g2L19nn26M44q0k41J58N4p5N7J55l68P3N1J76K07m27L73j45K33l33q3J80
1886A25l49L36k11J82J15l41K30l0J24q2K20k75j30J54j8J51k35L59k78p8J49
$$ y = [-99, 41, -238, -143, 120, -292, 127, -195, 129, -113, 44, 111, -29, -215, -35, -11, -270, 197, 257, -230, -186, -292, 243, -486, 27, -338, 325, -176, 99, 375, -64, 585, 388, -69, -188, -296, -289, -69, 731, -118, -378, -169, 10, 178, -126, 379, -171, 63, -824, 12, -415, -844, 185, -792, 155, -144, 419, -12, 219, -428, 437, 381, -338, -26, 45, -51, -259, -50, 310, 19, 159, 23, -13, 69, -5, -23, 63, 34, -103, 28, 19, -123, -200, 12, -177, 231, -122, -147, -24, -237, -36, -152, -229, -194, -397, -242, -95, -44, 38, -10, 100, -46, -178, -96, -127, -263, 84, -340, -34, -267, -52, -56, -144, 208, -177, 217, 249, -91, 54, -364, 61, 148, 87, -88, 89, -4, 59, -20, 24, -6, -202, 303, -78, -72, 247, 242, -284, 160, 80, -161, -3, 51, -24, 33, 188, -180, -107, -56, 120, 327, -100, 273, 128, 361, 28, -55, 125, -224, 112, -99, 83, 198, -143, 87, 57, 181, 99, 319, 44, -86, 68, 50, 201, -34, 325, 47, -31, 118]
1907A18K39k50l13L30l11J83O0J6j98R3k13J25j5N2J37k40K38j13P7o4J29J20
1929B00k66j88K46O7L8j21o7R2N5k6K05j04k71Q2P4N7j14J37P9j31M5q7R1q6K45
1954B52j53k08j53L74q0J34k16l2L86l46P1j38l5k3J08K02k82K16l1j27N7k60
1976b84N06l85J79j75m8O6K18L9j77L1j09K44k36L34j06j66k2P0K71n8j78J13
1998A27j27J72l38J21RNj23K93j03m1k14K14LKp5k96O37o7k24Q8m1j11L7j23q7
2023b62L69j84j38L21r4L5j08P2R5m1N1j4N2k79q3J00J78n4l6n8o9N3R0K0l03
2048b87K18N5N4O8j09lL5R4l77L0K47l25O2J92Q8J9p8N0p1N0N5Jn1K28m64K17
2074bj70L26j65k1O4j5m6J21J9j16J36p0O4K62m23K18j02MP8k57Ro3K50N9O7k62
$$ y = [118, 357, 107, -206, 124, -187, -4, 56, 72, -126, -33, -246, -121, -136, -84, 53, -187, 51, -62, 15, -49, 80, 200, -66, -254, -8, 59, 97, -24, -91, 1, 56, 30, 235, 131, -140, -58, 16, 73, -41, 96, 175, 44, 89, 2, 93, 7, 252, 99, -109, -262, 112, 32, 166, -50, -82, 304, -42, 29, -109, -144, -167, -59, 143, -139, 77, 46, -81, -24, -284, 222, -163, 16, -159, -207, -141, 77, 116, -61, -30, -139, 105, -131, 203, 97, -69, -91, -21, 250, 192, 14, 127, 0, 172, -166, -45, -36, -31, -154, 139, 36, -5, -219, -5, -2, 0, -75, -371, 266, 199, -25, 63, 22, -89, -52, -175, -262, 107, -77, -215, 106, 12, 47, -61, 11, 106, 65, 116, 102, 154, -125, -208, -108, 70, 16, -20, -78, -147, -94, -4, 16, -287, -69, -14, 40, 108, -1, -4, 31, 125, -252, -222, 25, -300, -238, -46, 42, 61, -17, 33, -38, 12, 67, 68, 17, 245, -219, -2, -172, 154, -11, -32, 32, 17, -29, 92, 111, -5, 131, 61, 125, 387, -36, 182, 80, 84, 162, -95, -86, -149, 101, 160, 227, -35]
2100c5L64l47O0J33J1q5k33K35j26K48p7k14L34q8j18j54M11l89L43k79j05P0
2122d1n1J77q0Mj29J89k12Q7N3M9J15k59K21lk78qQ1J22K8k09Q3K24j73k20L05
2147G5l7J36l40J80p3l2K06k45J29J25j62R0q6K55r6k9JK2j23K8N4r2Q1j84L41
2172B24l10L97k13j97K22j22J74k7m2k15L55l19J39O5J12k34j86K23p7k05J81
2193e5J29k1k17NJ49j29J19R3k24N2P5j08J45QJ86k56p4L04k40P2K22l37j53L90
2217A35k04L1J24j07qnJ08J4j00J34j01J71m05L75k95L85l78L08q7j4R2k37j81
2240b45L3R1L79k47j12K6J24om34K54k5R3rK50j17q7j64M57j70m1J27l77j3J29
2264h4N1j7K2J54n4M7j22J07k12J5J73k01N3J77j5k28R7J50j8j63J74k31K19j30
$$ y = [-35, 329, -18, 42, 175, 186, 101, -132, 103, -23, 225, 148, -66, 268, 180, 62, -92, 319, -70, 273, -6, -111, -41, -92, 85, 5, 9, -120, 69, -143, -56, -3, 46, 161, -98, 123, 120, -158, -166, -85, 37, 65, -144, -61, 163, -10, -230, 75, 38, 174, -166, 14, -59, -91, 115, -130, -1, 124, -38, 52, -34, 221, 125, 96, 97, 119, -4, 24, 78, -14, 67, -117, 224, -86, 311, 98, -99, 123, 1, 175, 148, 106, -109, 246, -73, 66, 131, 243, 9, -177, 46, -31, -236, -55, 74, 53, -164, -159, -10, -139, -20, 73, -151, -99, -24, -132, 13, 21, 207, -49, -123, 181, -59, 13, 235, -102, -255, 135, -69, -38, 86, -21, -29, -34, 74, 88, -12, 122, 21, 192, -213, 162, -133, 252, -126, 182, 95, 81, 173, -64, -245, -212, -121, 258, 11, -101, -75, 49, 43, -391, -137, -162, -69, -78, 172, 55, -32, -196, 261, 91, 50, 177, -200, -213, -84, -33, -50, -28, 126, 72, 119, -3, 104, -108, -93, 80, -121, -68, 109, 94, -134, -37, 113, 95, -68, 106, -125, 94, -36]
2288c6K8qk51L10n7j8k73K27J41j08R8k83J02K45l94K12k4M8l0K03k34q0J62j
2312b1J51k75Q2o4J64Oo1pk02K8J66K69k58J24k4P5j72K21j19k17K71j53N4k39
2336b01K31r0%m6k3L7J19L5j08R3j60J35J26l61J08o0K7K1J8R9J23L8p8j1J35
2361B07k20j1o4L14j43jK6j9m3J10L1j62L02m11m9k4J61M5j62N4J21J48j65O8
2385A13j22j20K22p6J3k53M28r3Pj85n2j54J61K59M7k96j06M39j76K22l26k4J08
2408C6j29L9j15K12j20K55l70K54L43k17j2k11l0K58k23l8R4K62k23o7j46L26
2430A78j77J58k42k59M73j36j04J18k42K30j33K16j07j02R0n1J42J18l75L34r5
2451C4N6N70j155M78n73K52J14M70rn85L35J52j31J53M99q47L25l81l04O99k25
$$ y = [-36, -8, -16, -267, 43, -14, -32, -305, -78, 63, -45, 53, -230, -128, 117, -277, -65, -89, -41, -71, 132, -102, -182, -20, -21, 130, -145, -63, -127, 37, 43, -18, -25, -227, -199, -33, 236, -22, 102, 78, 153, -19, 202, 83, -134, 137, -16, 38, -201, 30, -60, -60, -106, -129, -92, 27, 62, -46, 47, -113, 22, 148, -213, -105, -165, -138, -117, -99, 0, 123, 161, 83, 72, 207, -13, -24, -88, 226, 83, 82, 108, 89, 46, 156, 187, 25, 327, -84, -133, -157, 4, 49, -113, -59, 62, 210, 45, 113, -9, -129, 93, 17, 30, -223, 205, 112, 119, -66, -118, -272, -111, 148, 195, -101, -207, 232, 56, 278, -48, -72, 36, -93, -54, -169, 43, -77, 178, -192, 62, 405, 188, 176, -35, -65, 193, -30, -68, 26, 288, 65, -2, -148, 178, 1, 159, -83, -342, 131, -5, -109, 9, -233, -3, -136, 80, -27, -129, -39, -90, 52, 170, -205, 129, 34, 90, 660, -495, -17, -590, -338, -224, 246, 237, -348, -13, 139, 8, 161, 660, -187, 138, -243, -547, 152, -73]
2472g3l18L82j6lj3l24K69J14j25J05j64L87m64L32j28q0Q0j08K62l1p3j19O6
2495d2j57L35Lk63rK38l7k75K12K9n1J29k42N7N1K34q5l71K88n5J43j62N1J88
2519B09k36j22P6n2J17mj28P4P2j95L69j27j23K4O4J38j34p1J60n7k13K92j32
2542AM3k48J42K87j19j55Rn9K07r6j40j39K52RJ30j83m97P39l45K51j09j34N5
2565i9K42k02j19J35L31j68j75J45O2j57O8j32L1N1k5j44L3M44o0m32K37q4l10
2588c28M03j62K38j1r3j75R5m8K63k81J94j53N6J57k81M1J29L5j0Q3q8k34m7K27
2612A0j48J83j33q6K07K0K39l05J0m7J84m1l62J39J86j13N9K4J21k89L73r3j85
2635d7J97j82J32O9j60Q2N4k13OL9Lk8L1j57Q4R1j59k7J06K10%mk28m8M72m13
$$ y = [-73, -391, -9, -25, -28, -41, -365, -96, 18, -107, -2, -166, 221, -243, 89, -39, -119, -39, -147, 115, 84, 11, -108, -42, -199, 136, 139, -124, -133, 105, 68, -207, 5, 34, -17, 112, -130, -73, -22, 212, 127, -244, 44, -11, 132, -30, 21, 209, -27, -149, -73, -125, -8, -12, -140, -66, 6, -189, 180, 53, -70, -46, 18, 156, 22, -49, 111, 54, -159, 133, 1, 44, -204, -62, 225, 106, -49, -40, -99, 108, 12, -128, -267, -15, -6, 124, -59, -556, 183, -162, 89, -20, -154, -99, 143, -59, -178, -43, 288, 120, -55, 90, 152, -5, 63, -69, -38, 13, -12, -156, -123, 321, 261, -171, 66, -18, -328, 75, -87, 151, 140, 47, -128, -33, -81, 182, -99, 95, -58, -2, 155, -126, -85, 44, 79, 69, 152, 64, -170, -217, 10, -138, 45, -88, -174, 33, 53, 292, -13, -3, -50, 134, 93, -269, -130, 56, -57, 2, 26, 147, -142, 231, 138, -47, 150, -32, 100, 169, 9, 91, 145, -68, -62, -23, -20, -48, -17, -174, -90, 1, -158, -185, -79, 131, 131, 127, -101, -149, 323, -90]
2661i0r0J60J00qo3r2P0p1n2K90j10K15j32l16J96j41M8J85j33p3M2r8J56J74
2685A67j83J05l2j24J18P2j38O4J3n5J24j08j75J33O1k4L1j77O0J93l2j69J65
2708H9k26K93j03l8l6k13k2K56p1r1J06r3O3L7P9j85K85o3k0j02q3J14P7l20J82
2733h5K7j63K35l9l36M06o6K27j75k44J30J18j26K59m8j13L4OP9j84k2m2J74J
2757E3J10k14q0O1j07o8J33M5m2J64L7q0NRJ4J1l6J40k83K16o3j35J49q7M8K33
2783B33l10L01k41L0o1L21j88j69K41l67p8J57K49L4j84J78j64L4O0k21l8L59
2805A76j92j8N8j81q3L85k86J76k62K89j76N4k5k0j40L20j22M8j27N5P4P1l3k01
2829a60J19n2L47k59J8j99L20j68J20J23j54J31k50J49j44O4O1R1p0j31J04q2
$$ y = [-90, -180, -20, 80, 72, 9, -83, -13, -84, -136, 154, 44, 259, 127, -189, 7, -134, -86, 99, -34, -107, -65, -163, -7, 167, -16, 89, 57, -67, 51, 123, -15, 49, 62, 7, 131, 23, -152, -19, 42, 18, 49, -128, -68, 125, 93, -76, 89, -137, 156, 53, 15, -21, -234, -256, 0, -71, -162, -56, -149, -86, -49, 30, -155, 130, 67, 47, -55, -138, -24, 53, -267, -85, -58, -221, 14, -25, -361, 45, -21, 206, 31, -213, -83, 35, -91, 168, 120, 7, 41, 47, 126, -58, -80, -122, 52, 53, 163, -51, -131, -70, -177, -245, -112, -67, -109, 55, 92, 12, 17, 26, 40, 51, 15, 155, -128, 88, 25, -110, 39, -48, 0, 233, -77, 224, -17, 13, -48, 273, 85, -84, 157, -210, -288, -131, 118, 152, -32, 146, -18, 16, 76, -145, -183, 176, -16, -34, 24, -157, -240, 145, -141, 35, -227, 62, -114, -60, -85, -105, -245, 75, -47, 1, -126, -71, 3, 74, 41, -160, -41, -93, 254, -5, 13, -186, 134, -34, 86, 209, 55, 186, -64, 85, -59, 5, 66, 157, 87, -44, 60, -22]
2851b2P5j6J19j70P6k69L87k28L09l26K15k06N2q5Jj5L54j67n0J69k32o5M12l01
2875A7r2rl6J60j39J49k74OJ97j38K24qj30jJ27P4j20N7L7K6jJ54m12K54o7J8
2901G3k11K07k68j11J29J06o1K5J37o1N5q0j86P7M6J87l7L02j61k50j9J4R2J86
2925A91o9j15PQ3K43l62j33K49m0j19J7N7K8j92J74J09k08Q3J32l53L0K74j48
2948f2J21J10j84j56K14J13j05j6J40j65q4j68L56n3n34M90l00J41J4M76j07k21
2970B0K79j32m34k26O68j74l10O26n42Mk74M01m24M50J5J46k27M6K80p08O15M
2992A03l37K5M35m19J80J49K19o67O6K62j49O3j06J29J5N0M5n34L93K90Ol53M01
3015B66m44N0K46l6J19n86N16j23l75L51K1p8k94l9J084r94R43m84j27K78m91
$$ y = [-22, 53, 37, 156, -14, 62, -207, 180, -48, 261, -65, 150, -56, -4, -89, -88, -103, 251, 84, 34, 203, -29, -94, 318, 17, -75, -84, -120, 40, -99, 50, -224, -218, -21, -159, 65, 57, -73, -74, 53, 127, 7, 64, 101, 127, 126, 280, -132, 122, 55, 73, -138, 69, -199, -310, -181, -75, -136, -111, 26, -35, 20, -60, -246, -169, -123, 64, 27, 329, 168, -82, -101, -87, 5, 191, 122, 7, 14, 97, 340, -22, -155, 94, 54, -65, -48, 9, 37, -155, 19, 128, -80, 3, 135, -218, -188, 86, -62, 59, 169, -15, -171, 43, 156, 51, 35, 175, 10, -74, -242, 114, 61, -473, 17, -283, -142, -128, 348, 241, 20, 299, 167, -267, -493, 175, 1, -309, 317, -225, -221, -495, -94, -518, -68, -53, 93, -134, -88, 192, -516, 99, 103, -234, -209, 226, -193, -13, 136, 355, -312, -246, 16, -133, -70, -176, -47, -32, 18, 63, -471, -78, 212, 218, -135, 266, -178, -128, 118, 82, 201, -385, 131, 8, -367, -16, 5, -73, -367, -406, 678, -316, 627, 143, 16, 294, -197]
3036a97m5j40O33n75L87NK26m58K30j44K35m01N14qj36o1l96K89j10L62k6K82
3058D66k18J9L02o25J96l33J25M29q2l71j30N04j78M74n33p6n9k59M95l87j52
3079c93M44k10J84l09L6k43P67l77N16l64o24P43l54J79L29m1p62L02Q1p3L98
3100B29n18M45Mk08j55K68j60l09K39J51p8o8j89j63L93J50m56J67N15l70M54
3121C41n22L3l39O12j93J8K87K5j88m65L61k01l2L54k26L0M05J12j62l68L64J55
3143D01m36l73LL18L78j06n9j55L67o73J83n0P40j154N96k86n9m8J36M63M87p85
3165a12O21k22O29j175o04R50o47J039p43L08r6nL57j22j49n4K98o26L62j67m14
3186e72K68J35k39K76j64k65L39K40K07k10R3l90m2K22k01Q00r72L91k30N76p3
$$ y = [-197, -242, -382, 251, -324, 63, 68, 294, -164, 66, -78, 157, -244, 270, 262, 126, 65, -331, -42, -152, 210, 184, 466, 248, 267, 569, -56, 140, -193, -68, 361, 279, -92, -222, 282, 104, 578, 45, -31, -90, -349, 146, -241, -393, 51, -159, 25, -284, -248, -491, 276, -101, 415, 51, -573, 170, -184, -5, 324, 283, -479, -177, -96, -169, 229, -289, 156, 160, -48, -203, 65, -95, -404, -165, -14, -92, -160, -349, -512, -119, 31, -425, -258, 257, -113, 341, -181, -148, -487, 125, -68, -50, 237, 262, 74, -391, -30, -231, -263, 91, -135, -105, 300, 412, 250, -118, 246, 401, -35, -408, -405, -87, 291, 185, 126, -29, 338, -335, -152, -202, 538, -616, -20, -306, -365, -413, -277, 186, 673, -112, 509, 287, 916, -259, -863, 87, -560, 479, -264, 44, -52, -57, 300, 178, 29, -25, 273, -353, 9, -158, -572, -304, -169, -408, -132, -296, -561, -222, 18, 225, 15, 108, -282, -324, -102, -303, 497, -475, -84, -314, 262, 189]
3207A89m47L3K42o49P83o96P06k56K69%j91J91J25k46p1N75k92n53M04N6L1m27
3229b24J90jL93j80o79K60k17K85R53o71o49O84l09J69N53m88P6J50k68K67n42
3250b48N9K50J90J75N2o82J8N42o5k69p91J025l43l82N99P0o0l59K06j31Ml13
3272d53J038q9q50O8Q48n44M22J07n18Q85o31o30K81k06P88q20N77l17K83m96
3292b57L1j56J02M11n30P98j88j8j77n92L15N00r62P33m17M8O74n0j297R73l46
3313d05j28L9Q69o82K42j4n1M10r3o81O78k71j46P47q27O15l94r5L48l26J19K3
3335b3n3J18l07L06j69n4k72J77k03P17n76L09N6P5K89o38N32l78K1k4R7j57k6
3358a83L20j38M27l52M1q1K45j70k80L41j76j93N4r8M83l31j24K50L03k96K23
$$ y = [189, -258, -225, 17, -632, 151, -545, 161, -95, 174, 174, -17, 174, 299, 53, -18, 557, 265, -288, 116, 172, 203, -224, -34, -35, 358, 178, -501, -241, -458, -173, 780, 109, -540, 144, -165, 4, 557, 69, 145, 295, 27, 294, -248, -189, 61, 251, 426, 478, -204, -186, 356, 291, 22, -769, 256, -87, -469, 130, 200, 140, -219, -13, -144, -140, -453, 585, 496, -354, -286, 562, 18, 440, 547, 29, 914, 283, -347, -66, -272, 516, -304, 273, -44, 239, -257, -226, -382, -280, 131, -399, 399, 211, 193, 16, -576, -261, 239, -723, 10, -407, -359, 315, 265, -1032, -59, -405, -533, -494, 375, -307, -65, -79, -130, 280, 187, -494, 184, -87, -233, 514, -313, 302, -92, -187, 161, -165, -46, -23, -76, 42, -265, 41, -128, -182, -454, -277, -480, 237, -339, -30, 26, 101, 390, -248, 284, -94, -73, -97, 0, -157, -183, 137, -1, 426, 74, 115, 34, 279, 109, -171, 170, -6, -199, -145, -243, 240, -91, -215, 35, 338, 42, 265]
3379B65k68m50M97j10kJ6J20J26k93J79M4j2o1M2j90J43j63L82j16l91M28J6k34
3402c2J12M5Rl17L70J18l13J32j67L25m67K53K81k30k22J23j55M0J50l43J13J19
3424e6Q2N0L6m1j1j6R4l71L83j65q8R4j71L81j43K3N2J6l4l51K46N1J95o1k45
3449e0q2J38p8J42k15J02J66j95O4j3l48M41k9n9K2k50J2M38j29j87Q5L0J9j61
3473a37L99k34j11p5K55p5k51R1O9K14k52K07K0j30QK14k28j14K12j26j21M1K82
3496A58j87l9k1J94j96K24k81K38m23J55J57K03l69L40k09r2J66q2j11o6J43J31
3518C3q6J52j47P4OM1J34j66j7r3P5m4q2RL08l92K95k46J02j20K1L04lk11J1R
3544c3q2J07k6Q1j3o6n9k3p0J57l7J79m0q8n3R0J18l26J98Lj76J20j52J56J61
$$ y = [265, -3, -453, 44, -66, -68, -52, 68, 194, -99, 80, 124, 112, 51, 93, -97, 46, -117, 265, 149, -242, 186, 202, -32, 80, 125, 134, -183, 187, 305, -8, 124, -43, 282, -185, 68, 349, 119, -103, 20, -135, -95, 55, -288, -175, -56, 26, 76, 112, 71, 60, 44, 138, -233, 150, -15, -103, -9, -180, 201, 58, 81, 133, 149, 115, -236, 10, 61, 256, 195, -50, -132, 6, -72, 70, -145, -43, 123, -72, -8, -21, -369, 72, 43, -16, 6, -244, -232, 206, 77, -110, -25, 5, 24, -137, 262, 28, -83, -158, 97, 22, -229, -138, -69, 145, -107, 100, 120, -10, -2, 212, -16, -130, 82, -44, -165, -124, 158, -29, -68, -89, 105, -91, 133, -148, 90, -333, -178, -21, 182, -187, 153, -56, -148, 18, -64, -175, -241, -98, 33, -53, 99, -48, 26, 32, 73, 207, 41, 24, -69, 6, -38, -120, -111, 197, -195, 100, -146, -44, -164, -143, 161, 158, -53, -42, -33, -115, -8, -34, 47, 34, -32, -91, -114, -184, -27, -64, 115, 75, -13, -66, 24, 142, -184, 14, 17, -159, -39, -191, -35, 126]
3569A26j92K18l66M37r6o5j13J03Q0j19j01J14M6n5N5j30j59K22P2l3Q1k93K64
3592I6j61p7r9M57k50Oq3J27Q2l4j18Q0j66J90j08M5L3j41K97k48O6j07J22J21
3616A30J64r3j42MK89n7o04M18r2l23K11j43M8K38l0j65L6L64l08R8N6k58L1J26
3640bl7k00K31Q3j14o1J73m6P6q1l9N1n8K5MPq5J70j47j06L63j12r3j18J34K01
3666B19j72o2p6J20j10j64M3K14J49K9q4J37j79Oj8k97L37j15m1K30k6l15K58
3689H3j06pm2J3M9k52L26lK4l10K95j43L33l42K57M3j82j8K9n7r2J03L8k29R4
3714i6P1M1J05j59J81l75M58k12o7N2mr8J86J19k08j8J72j98K26j02j58K05j41
3737b0j22Q6l1K73q6qn3Lj75K24k63O5J12j57J4J26R0Q3k32J23j3N8j57J62q6
$$ y = [126, -66, 152, -214, 223, 127, 62, -51, 52, 132, 13, -88, 26, 72, 17, 72, -58, -217, 5, 77, 44, 125, -168, 96, -65, -142, -241, 216, -34, -28, -111, 16, 98, 64, -54, 26, -140, 50, -58, -13, 20, -121, 176, -72, -6, -113, 9, 130, 294, 201, 59, 63, 352, 295, -309, 109, 17, -306, -95, -238, -190, 48, 18, -147, -111, 253, -55, 43, 99, -159, -128, -2, -39, -239, -8, 75, -39, -100, 73, 27, 103, 22, -17, 34, -24, 1, 5, 12, -73, 97, -50, -156, 207, 95, 2, -116, 18, 219, 47, -15, -91, 29, -81, -245, -202, 12, 161, 190, 106, 243, 64, 70, 52, -245, 92, -23, -64, 166, 140, -175, 83, -23, -30, -72, -59, -10, -262, 64, 61, 85, -225, 70, -73, 260, -82, 175, 218, 36, 18, 47, -10, -102, 1, 39, -190, -96, -25, 16, 121, -38, 143, -232, 226, 14, -53, -1, -5, -103, 83, 202, -6, -24, 148, -50, 176, 74, -84, 121, -20, -142, -56, -87, 186, 100, 92, 39, 42, -133, 91, -172, -107, 5, -152, -138, -12, 78, 161, -71, 52, 39, 97, -60, 102, 16]
3762A6j09J8J07j53p8J66j62K66K9n3o6j13J52PNJ65r7j6n3n9n2q5J49q6N2Q3
3788C3m1J32j82J1mj27R8j32L41l15K60L3j40l9J04o6NL8j71L1K67k12J91K0k23
3813h8J85j45K09k41M9q4J09o9Q5k07J85J14R0k51p8L24k76K8k8k6J92j74J70
3836G3o1Mj75O6R0l17N1L01q1M9J4J01k40P8n5P0Q0kJ3P1l36L86k83L65l74n0
3862a62J35K69k98j11K74J7q8K4N6k98K48j32l29K34K68j4j21J60l8n7N4j32J52
$$ y = [16, -93, -75, 32, -121, -199, -33, -195, 71, 100, 47, -19, -132, 20, 27, 32, 197, 100, 84, 31, -28, -80, -165, -16, -102, -50, 33, -8, 124, -58, -47, -51, -178, -80, -212, 129, -186, 74, 107, -33, -72, 32, -34, -29, 9, -162, -131, 136, -76, 115, 135, -88, 97, -48, 161, -80, -31, -115, -6, -75, 10, -197, -12, 102, 192, -59, -137, 187, -89, -61, -89, -115, 77, -97, 73, 12, 16, -159, -93, -3, -320, -269, 32, -49, 0, 14, 115, -125, -47, -102, -32, 48, 46, 59, 130, -206, 180, -103, 262, -112, -162, -27, 242, -56, -167, 107, 124, 36, 60, 116, -182, 66, -66, -395, -161, 107, 93, -28, 132, 94, 37, 91, -41, 111]
$$ [...]
8191B06
##END NTUPLES=NMR FID
##END=
