##TITLE=1H_Pr-ABT-3
 DMSO,8 sc, 
 11.02.2021
##JCAMPDX= 6.0         $$ Bruker NMR JCAMP-DX V2.0
##DATA TYPE= NMR FID
##DATA CLASS= NTUPLES
##ORIGIN= UXNMR, Bruker Analytische Messtechnik GmbH
##OWNER= root
$$ XWIN-NMR		Version 3.5
$$ Thu Feb 11 13:00:32 2021 Russian Standard Time (UT+4h)  she@DPX200
##.OBSERVE FREQUENCY= 200.1315066352
##.OBSERVE NUCLEUS= ^1H
##.DELAY= (6, 6)
##.ACQUISITION MODE= SIMULTANEOUS
##.ACQUISITION SCHEME= undefined
##.AVERAGES= 8
##.DIGITISER RES= 18
##SPECTROMETER/DATA SYSTEM= spect
##.PULSE SEQUENCE= zg30
##.SOLVENT NAME= DMSO
##.SHIFT REFERENCE= (INTERNAL, DMSO, 0, 15.7039)
##AUDIT TRAIL= $$ (NUMBER, WHEN, WHO, WHERE, WHAT)
$$ ##TITLE= Audit trail, XWIN-NMR		Version 3.5
$$ ##JCAMPDX= 5.01
$$ ##ORIGIN= Bruker BioSpin GmbH
$$ ##OWNER= she
$$ F:/spectra/data/she/nmr/H-F/1/audita.txt
$$ ##AUDIT TRAIL=  $$ (NUMBER, WHEN, WHO, WHERE, WHAT)
(   1,<2021-02-11 12:59:48.92 +0400>,<she>,<DPX200>,
      <created by zg, POWCHK disabled, PULCHK disabled
       configuration hash MD5:
       00 E9 B6 7A A2 85 ED C7 34 08 36 98 17 FE 4E 26
       data hash MD5: 16K
       DE 50 C2 90 CF 53 78 09 81 B6 74 8A 06 FA 20 2D>)
$$ ##END=
$$ 
$$ hash MD5
$$ D3 97 6B D8 E1 91 E7 24 81 5A E6 41 9F 49 D9 1D
##$RELAX= 
##$RELAX= 
##$RELAX= 
##$RELAX= 
##$RELAX= 
##$RELAX= 
$$ Bruker specific parameters
$$ --------------------------
##$DU= <F:/spectra>
##$EXPNO= 1
##$NAME= <H-F>
##$PROCNO= 1
##$TYPE= <nmr>
##$USER= <she>
##$AMP= (0..31)
100 100 100 100 100 100 100 100 100 100 100 100 100 100 100 100 100 100 
100 100 100 100 100 100 100 100 100 100 100 100 100 100 
##$AQSEQ= 0
##$AQ_mod= 1
##$AUNM= <au_zg>
##$AUTOPOS= <>
##$BF1= 200.13
##$BF2= 200.13
##$BF3= 200.13
##$BF4= 200.13
##$BF5= 200.13
##$BF6= 200.13
##$BF7= 200.13
##$BF8= 200.13
##$BYTORDA= 1
##$CFDGTYP= 0
##$CFRGTYP= 5
##$CHEMSTR= <none>
##$CNST= (0..31)
1 1 145 1 1 1 1 1 1 1 1 1 1 1 1 1 1 1 1 1 1 1 1 1 1 1 1 1 1 1 1 1 
##$CPDPRG= <>
##$CPDPRG1= <>
##$CPDPRG2= <>
##$CPDPRG3= <>
##$CPDPRG4= <mlev>
##$CPDPRG5= <mlev>
##$CPDPRG6= <mlev>
##$CPDPRG7= <mlev>
##$CPDPRG8= <mlev>
##$CPDPRGB= <>
##$CPDPRGT= <>
##$D= (0..31)
0 1.2 0 0 0 0 0 0 0 0.06 0 0.03 0 0 0 0 0.0002 0 0 0 0 0 0 0 0 0 0 0 0 
0 0 0 
##$DATE= 1613033988
##$DBL= (0..7)
120 120 120 120 120 120 120 120 
##$DBP= (0..7)
150 150 150 150 150 150 150 150 
##$DBP07= 0
##$DBPNAM0= <>
##$DBPNAM1= <>
##$DBPNAM2= <>
##$DBPNAM3= <>
##$DBPNAM4= <>
##$DBPNAM5= <>
##$DBPNAM6= <>
##$DBPNAM7= <>
##$DBPOAL= (0..7)
0.5 0.5 0.5 0.5 0.5 0.5 0.5 0.5 
##$DBPOFFS= (0..7)
0 0 0 0 0 0 0 0 
##$DE= 6
##$DECBNUC= <off>
##$DECIM= 32
##$DECNUC= <off>
##$DECSTAT= 4
##$DIGMOD= 1
##$DIGTYP= 9
##$DL= (0..7)
0 120 120 120 120 120 120 120 
##$DP= (0..7)
150 150 150 150 150 150 150 150 
##$DP07= 0
##$DPNAME0= <>
##$DPNAME1= <>
##$DPNAME2= <>
##$DPNAME3= <>
##$DPNAME4= <>
##$DPNAME5= <>
##$DPNAME6= <>
##$DPNAME7= <>
##$DPOAL= (0..7)
0.5 0.5 0.5 0.5 0.5 0.5 0.5 0.5 
##$DPOFFS= (0..7)
0 0 0 0 0 0 0 0 
##$DQDMODE= 0
##$DR= 18
##$DS= 0
##$DSLIST= <SSSSSSSSSSSSSSS>
$$ [...]
##$SUBNAM2= <"">
##$SUBNAM3= <"">
##$SUBNAM4= <"">
##$SUBNAM5= <"">
##$SUBNAM6= <"">
##$SUBNAM7= <"">
##$SUBNAM8= <"">
##$SUBNAM9= <"">
##$SW= 16.9725356469052
##$SWIBOX= (0..15)
0 0 2 0 0 0 0 0 0 0 0 0 0 0 0 0 
##$SW_h= 3396.73913043478
##$TD= 16384
##$TD0= 1
##$TE= 0
##$TE2= 300
##$TE3= 300
##$TEG= 300
##$TL= (0..7)
0 120 120 120 120 120 120 120 
##$TP= (0..7)
150 150 150 150 150 150 150 150 
##$TP07= 0
##$TPNAME0= <>
##$TPNAME1= <>
##$TPNAME2= <>
##$TPNAME3= <>
##$TPNAME4= <>
##$TPNAME5= <>
##$TPNAME6= <>
##$TPNAME7= <>
##$TPOAL= (0..7)
0.5 0.5 0.5 0.5 0.5 0.5 0.5 0.5 
##$TPOFFS= (0..7)
0 0 0 0 0 0 0 0 
##$TUNHIN= 0
##$TUNHOUT= 0
##$TUNXOUT= 0
##$USERA1= <user>
##$USERA2= <user>
##$USERA3= <user>
##$USERA4= <user>
##$USERA5= <user>
##$V9= 5
##$VALIST= <valist>
##$VCLIST= <CCCCCCCCCCCCCCC>
##$VD= 0
##$VDLIST= <DDDDDDDDDDDDDDD>
##$VPLIST= <PPPPPPPPPPPPPPP>
##$VTLIST= <TTTTTTTTTTTTTTT>
##$WBST= 1024
##$WBSW= 4
##$XGAIN= (0..3)
0 0 0 0 
##$XL= 0
##$YL= 0
##$YMAX_a= 26456
##$YMIN_a= -24723
##$ZGOPTNS= <>
##$ZL1= 120
##$ZL2= 120
##$ZL3= 120
##$ZL4= 120
##$ABSF1= 10
##$ABSF2= 0
##$ABSG= 5
##$ABSL= 3
##$ALPHA= 0
##$AQORDER= 0
##$ASSFAC= 0
##$ASSFACI= 0
##$ASSFACX= 0
##$ASSWID= 0
##$AUNMP= <proc_1d>
##$AZFE= 0.1
##$AZFW= 0.1
##$BCFW= 1
##$BC_mod= 2
##$BYTORDP= 1
##$COROFFS= 0
##$CY= 11.3945322036743
##$DATMOD= 1
##$DC= 2
##$DFILT= <>
##$DTYPP= 0
##$F1P= 15.9154993809931
##$F2P= -4.1035820241983
##$FCOR= 0.5
##$FTSIZE= 0
##$FT_mod= 4
##$GAMMA= 1
##$GB= 0.15
##$INTBC= 1
##$INTSCL= 1
##$ISEN= 128
##$LB= 0.24
##$LEV0= 0
##$LPBIN= 0
##$MAXI= 10000
##$MC2= 0
##$MEAN= 0
##$ME_mod= 0
##$MI= 1.114404
##$NCOEF= 0
##$NC_proc= 0
##$NLEV= 6
##$NOISF1= 3.799351
##$NOISF2= 2.8
##$NSP= 1
##$NTH_PI= 0
##$NZP= 0
##$OFFSET= 15.70392
##$PC= 1
##$PHC0= -10757.65
##$PHC1= 9.600948
##$PH_mod= 1
##$PKNL= yes
##$PPARMOD= 0
##$PSCAL= 0
##$PSIGN= 0
##$REVERSE= no
##$SF= 200.130013532006
##$SI= 16384
##$SIGF1= 3
##$SIGF2= 2
##$SINO= 400
##$SIOLD= 16384
##$SREGLST= <1H.CDCl3>
##$SSB= 0
##$STSI= 0
##$STSR= 0
##$SW_p= 3612.71676300578
##$SYMM= 0
##$S_DEV= 0
##$TDeff= 0
##$TDoff= 0
##$TI= <>
##$TILT= no
##$TM1= 0
##$TM2= 0
##$TOPLEV= 0
##$USERP1= <user>
##$USERP2= <user>
##$USERP3= <user>
##$USERP4= <user>
##$USERP5= <user>
##$WDW= 1
##$XDIM= 8192
##$YMAX_p= 0
##$YMIN_p= 0
$$ End of Bruker specific parameters
$$ ---------------------------------
##NTUPLES= NMR FID
##VAR_NAME=  TIME,          FID/REAL,        FID/IMAG
##SYMBOL=    X,             R,               I
##VAR_TYPE=  INDEPENDENT,   DEPENDENT,       DEPENDENT
##VAR_FORM=  AFFN,          ASDF,            ASDF
##VAR_DIM=   8192,          8192,            8192
##UNITS=     SECONDS,       ARBITRARY UNITS, ARBITRARY UNITS
##FACTOR=    0.0002944,     1,               1
##FIRST=     0,             0,               0
##LAST=      2.4114304,     0,               0
##MIN=       0,             -24723,          0
##MAX=       2.4114304,     26456,           0
$$ Real data points
##PAGE= N=1
##DATA TABLE= (X++(R..R)), XYDATA
$$ [...]
$$ plain form
1870 27 -239 2 -160 -495 213 -179 621 172 120 -547 115 49 -394 310 -155 -27 253 -304 -329 -145 -152 155
1892 155 34 -115 -81 -6 137 -558 21 -209 -133 172 278 55 -163 208 -30 -362 378 -187 23 329 -337
1913 -337 -72 205 -181 243 50 420 -41 363 244 -72 89 -191 245 -186 12 105 -188 -20 142 263
1933 263 -204 -171 -151 163 122 94 -102 -35 120 19 147 108 -57 -102 -67 -327 474 -91 -11 -143 -365 131 279
1956 279 256 -12 -70 103 123 -215 103 93 -6 304 45 -124 86 -286 197 1 91 427 106 -153 -81 -209
1978 -209 -240 -128 44 -86 28 283 11 -28 -227 -17 -91 165 -61 -225 37 119 145 -52 2 34 -38 143 296
2001 296 -46 161 62 524 -16 -17 128 -51 -108 309 -331 24 207 287 30 -195 132 262 -117 -49 -375 -144
2023 -144 -35 143 353 -155 -26 -103 -87 156 83 -246 71 199 95 242 -110 70 -70 146 180 -62 -284
$$ packed form
1870B7k66K41j62l35P08l92Q00m49n2o67O62o6m43P04m65J28K80n57k5J84pL07
1892A55j21j49L4P5J43o95N79k30P6L05J06k23k18L71k38l32P40n65K10L06o66
1913c37K65K77l86M24j93L70m61M04j19l16J61k80M36m31J98R3k93J68J62J21
1933B63m67L3K0L14m1k8j96O7J55j01J28l9j65m5L5k60Q01n65Q0j32k22M96J48
1956B79k3k68n8J73K0l38L18j0r9L10k59j69K10l72M83j96R0L36l21k59P2j28
1978b09l1J12J72j30J14K55k72l9j99K10p4K56k26j64K62Q2K6j97N4L2p2J81J53
2001B96l42K07r9M62n40jJ45j79n7M17o40L55J83Q0k57k25L27J30l79O8l26K31
2023a44J09J78K10n08J29p7J6K43p3l29L17J28j04J47l52J80j40K16L4k42k22
$$ plain form
2044 -284 -102 35 223 -122 75 58 249 -29 4 86 -16 98 68 262 125 56 62 197 155 -384 225 -162 -12
2067 -12 93 -64 -30 -170 -21 130 83 -56 -129 23 -202 -56 9 -130 -291 58 234 189 -8 66 85 -13 -25
2090 -25 38 108 -184 359 141 235 -56 -86 -122 81 93 419 128 -132 128 -34 556 137 -170 -120 99 -105 -163
2113 -163 100 -255 63 -109 -306 382 226 -165 -146 40 48 -10 -336 83 -81 44 284 -208 -533 234 775
2134 775 252 -119 128 -95 -276 -18 535 -315 19 266 -10 -212 -274 207 -37 1 132 -302 12 158 379
2155 379 316 320 -89 -433 296 651 -437 40 428 763 163 -65 -253 254 178 -512 -632 -79 -157 -79 -310 15
2177 15 29 421 789 -83 367 -40 -590 98 33 769 -386 17 249 -101 -330 243 -248 -339 -275 -495 366
2198 366 -282 386 -141 -16 156 337 350 -291 668 -327 -559 125 306 259 532 -461 499 44 203 -193 -545
$$ packed form
2044b84J82J37J88l45J97j7J91k78L3Q2j02J14l0J94j37o9OJ35m2n39O09l87J50
2067a2J05j57L4j40J49J51m7j39p3J52k25J46O5j39j61L49J76m5j97P4J9r8j2
2090b5O3P0k92N43k18R4k91l0l6K03J2L26k91k60K60j62N90m19l07N0K19k04n8
2113a63K63l55L18j72j97O88j56l91J9J86Qn8l26M19j64J25K40m92l25P67N41
2134G75n23l71K47k23j81K58N53q50L34K47k76k02o2M81k44L8J31m34L14J46K21
2155C79o3Mm09l44P29L55j088M77L88L35o00k28j88N07p6o90j20N53p8P8k31L25
2177A5J4L92L68q72M50m07n50O88o5P36j155M03K32l50k29N73m91r1O4k20Q61
2198C66o48O68n27J25J72J81J3o41R59r95k32O84J81m7K73r93R60m55J59l96l52
$$ plain form
2219 -545 -88 658 106 -324 -395 -501 335 -194 -107 6 50 -370 -304 -60 262 265 -72 38 88 -699 -346 -696
2241 -696 -50 355 -574 576 193 -237 31 -569 -147 -364 -58 163 767 -235 211 -399 538 421 933
2260 933 -151 -309 -61 -40 -376 661 867 276 922 714 25 -8 -83 187 189 528 628 -253 -179 880 628
2281 628 422 122 -57 600 1076 797 571 336 64 67 110 -239 49 -318 45 -532 -276 314 -265 154 -131
2302 -131 -63 157 -65 -253 -275 104 -271 125 726 293 -46 -361 -236 196 100 83 108 567 426 238 352 -304
2324 -304 -247 -164 -146 -420 61 45 151 -114 203 -174 43 252 -145 430 81 27 -86 30 -108 52 147 -176
2346 -176 150 299 226 115 258 -400 24 -201 172 -67 108 -132 345 28 14 -164 76 127 9 147 349
2367 349 -209 -54 243 -18 31 -48 45 264 -44 -97 -148 -70 231 -21 -168 160 -208 183 -199 202 167 69 191
$$ packed form
2219e45M57P46n52m30p1j06Q36n29Q7J13M4m20O6K44L22Ll37J10N0p87L53l50
2241f96O46M05r29J150l83m30K68o00M22k17L06K21O04j002M46o10R37j17N12
2260I33j084j58K48K1l36J037K06n91O46k08o89l3p5K70KL39J00q81P4J059k52
2281F28k06l00j79O57M76k79k26k35k72LM3l49K88l67L63n77K56N90n79M19k85
2302a31O8K20k22j88k2L79l75L96O01m33l39l15J25M32r6j7K5M59j41j88J14o56
2324c04N7Q3J8k74M81j6J06k65L17l77K17K09l97N75l49n4j13J16j38J60R5l23
2346a76L26J49p3j11J43o58M24k25L73k39J75k40M77l17j4j78K40N1j18J38K02
2367C49n58J55K97k61M9p9R3K19l08n3n1P8L01k52j47L28l68L91l82M01l5r8J22
$$ plain form
2390 191 -274 0 -284 -74 -166 121 50 275 97 -72 -83 70 250 -3 -54 -36 -4 78 -202 80 291 64
2412 64 -65 31 52 205 -279 161 81 -125 31 -325 -35 204 -131 245 23 185 149 -52 -144 -268 228 -149
2434 -149 385 337 -107 -48 -3 317 -269 -124 424 34 -269 45 -344 590 13 -289 10 -143 266 91 -458
2455 -458 332 -241 -336 23 68 206 -36 -187 -236 -524 80 488 475 323 -310 269 -70 156 128 164 -2 -406
2477 -406 -213 -84 146 -138 -266 -88 657 172 117 151 178 67 34 -413 -60 217 -134 313 352 189 375 166
2499 166 -48 -556 -54 -126 420 0 160 -217 -161 -351 591 370 269 -112 129 259 -76 -80 -295 130 -139
2520 -139 392 -176 68 174 -28 -114 171 375 243 -29 164 329 -429 60 377 -209 -521 -243 230 -209
2540 -209 -585 257 31 141 107 -105 169 -453 -109 90 -4 17 -74 144 -48 14 425 -307 -1 -174 144 385
$$ packed form
2390A91m65K74k84K10r2K87p1K25j78j69j1J53J80k53n1J8L2Q2k80K82K11k27
2412F4j29R6K1J53m84M40q0k06J56l56K90K39l35L76k22J62l6k01r2j24M96l77
2434a49N34m8m44N9M5L20n86J45N48l90l03L14l89R34n77l02K99j53M09j75n49
2455d58P90n73r5L59M5J38k42j51m9k88O04M08j3j52o33N79l39K26k8L6j66m04
2477d06J93J29K30k84j28J78P45m85n5L4K7j11l3m47L53K77l51M47L9j63J86k09
2499A66k14n08N02p2N46m20J60l77N6j90R42k21j01l81K41J30l35mk15M25k69
2520a39N31n68K44J06k02q6K85K04j32k72J93J65p58M89L17n86l12K78M73m39
2540b09l76Q42k26J10l4k12K74o22L44J99r4K1r1K18j92O2M11p32L06j73L18K41
$$ plain form
2562 385 -40 -230 -262 -329 -326 167 38 150 -10 132 -355 564 -1 -236 -535 446 -363 -30 -56 330 -525 -377
2584 -377 270 -424 152 -900 329 200 331 305 647 138 -91 -168 -413 -247 415 163 -691 377 406 314
2604 314 328 -141 214 -614 127 -11 252 693 182 -168 325 -240 293 -391 -80 732 442 -2 -10 38 530
2625 530 -105 -146 16 472 258 31 -91 -184 140 170 -122 71 83 167 -660 290 353 251 53 203 71 -86
2647 -86 521 -166 257 -724 -5 -87 -379 429 68 180 327 -98 -189 -265 186 -349 -155 2 -105 67 -239
2668 -239 324 50 -367 -54 289 -355 -75 69 266 -8 84 -502 200 224 -149 82 -47 -300 560 -95 199
2689 199 137 210 -110 260 169 367 163 -292 43 -583 -302 114 121 -245 -150 217 37 9 72 182 -64 -418 73
2712 73 84 62 100 -126 315 -53 -18 70 411 248 198 204 -79 -81 -33 276 -19 -320 -258 -146 -6 158 -194 63
$$ packed form
2562C85m25j90l2o7LM93j29J12j60J42m87R19n65k35k99R81q09L33k6L86q55J48
2584c77O47o94N76j052J229j29J31k6L42n09k29p7k45J66O62k52q54J068K9r2
2604C14J4m69L55q28P41j38K63M41n11l50M93n65N33o84L11Q12k90m44qM8M92
2625E30o35m1J62M56k14k27j22r3L24L0k92J93J2Q4q27R50O3j02j98J50j32j57
2647h6O07o87M23r81P19q2k92Q08l61J12J47m25r1p6M51n35J94J57j07J72l06
2668b39N63k74m17L13L43o44K80J44J97k74R2n86P02K4l73K31j29k53Q60o55K94
2689A99o2P3l20L70r1J98k04m55L35o26K81M16Pl66R5L67j80k8O3J10k46l54M91
2712G3J1k2L8k26M41l68L5Q8L41j63n0Ok83kM8L09k95l01O2J12J40J64l52K57
$$ plain form
2736 63 54 163 45 7 122 71 -319 -31 99 161 146 -25 -7 -24 116 -31 33 44 47 12 -47 272 -199 -12 77
2761 77 88 134 323 -178 -40 159 -43 93 -124 -217 -218 -227 42 -29 37 49 -72 92 18 59 67 121 16 296 -109
2786 -109 -138 -231 -118 99 24 20 -93 -195 -139 8 20 -116 -271 -107 -74 -46 361 175 71 -20 -27 160 94 -70
2810 -70 -6 -159 39 72 27 -21 -126 28 -19 -40 169 -39 10 37 5 -141 -69 69 -245 232 51 4 -7 157
2834 157 110 224 -10 70 22 148 130 2 -97 217 -45 -6 -24 109 107 -44 -87 -50 37 90 146 114 -264 -133 -70
2859 -70 -3 -16 13 11 -123 157 28 4 -37 -90 284 135 172 179 -5 131 -160 -7 -158 -50 -116 166 13 149
2883 149 64 -121 -88 -19 23 -192 -73 -56 -61 4 63 -25 -24 36 64 -123 -187 87 -178 5 -22 57 -22 8 -125 231
2909 231 -83 76 -84 -111 -31 -60 112 -57 180 116 -118 -22 77 -33 -244 49 -41 170 -53 -77 54 -367 -101
$$ packed form
2736F3rJ09j18l8J15n1l90K88J30O2j5j71J8j7J40j47O4J1Ll5n9L19m71J87Q9
2761G7J1M6J89n01J38J99k02J36k17r3jrK69p1O6J2j21J64p4M1QN4j05K80m05
2786a09k9r3J13K17p5mj13j02N6J47J2j36j55J64L3K8M07j86j04r1pJ87o6j64
2810g0O4j53J98L3m5m8j05J54m7k1K09k08M9K7l2j46P2J38l14M77j81m7j1J64
2834A57m7J14k34Q0m8J26j8j28r9L14k62L9j8J33kj51m3L7Q7N3N6l2l78J31O3
2859g0O7j3K9kj34K80j29k4m1n3L74j49L7Pj84J36k91J53j51J08o6K82j53J36
2883A49q5j85L3O9M2k15J19J7nO5N9q8JO0K8j87o4K74k65J83k7P9p9L0j33L56
2909B31l14J59j60k7Q0k9J72j69K37o4k34R6R9j10k11K93r0K11k23k4J31m21K66
$$ plain form
2932 -101 61 -121 -30 264 89 119 155 -191 -148 -109 -88 172 118 137 251 43 28 62 17 38 -70 -108 -100 286 -12
2957 -12 -4 168 255 154 -5 -60 54 17 -160 91 -59 70 163 21 -124 -90 -121 -194 57 -116 250 254 -90 143
2981 143 -128 -100 142 67 -243 68 170 76 110 -98 -109 -64 -113 -14 -32 -4 -59 98 -59 200 -85 -168 -101 6
3005 6 18 -122 -120 -86 -45 19 -43 145 55 -185 157 -41 -108 185 -134 -65 -157 166 -95 69 -37 83 25 268 -10
3030 -10 -60 4 138 87 68 46 107 -345 -169 -17 110 130 -87 -27 -68 84 204 -45 178 52 4 -36 -130 -112 -98
3055 -98 75 100 24 -102 -77 -80 -118 86 7 136 -111 148 45 59 -201 -247 -43 -74 48 49 -158 -72 -61 51 -79
3080 -79 6 -18 -208 -156 -103 -221 128 113 -1 32 120 136 33 -44 -267 44 260 3 -42 -42 0 -155 89 -86 16
3105 16 83 103 -89 71 -89 -18 -52 -36 -76 -80 -65 -332 -38 -140 50 38 143 -24 36 58 -29 106 -182 121 -119
$$ packed form
2932a01J62j82R1K94j75L0L6l46M3L9K1K60n4J9J14k08j5L4m5K1j08l8QL86k98
2957a2QJ72Q7j01j59n5J14l7j77K51j50J29R3j42j45L4l1p3K51j73L66Ml44K33
2981A43k71K8K42p5l10L11J02r4L4k08j1M5m9R9j8K8n5J57j57K59k85q3O7J07
3005FJ2j40KL4M1O4o2J88r0k40L42j98o7K93l19O9r2L23k61J64j06J20n8K43k78
3030a0n0O4J34n1j9k2O1m52J76J52J27K0k17O0m1J52J20k49K23j26m8m0r4J8J4
3055i8J73K5p6j26K5ll8K04p9J29k47K59j03J4k60m6K04l1J22Jk07Q6J1J12j30
3080g9Q5k4j90N2N3j18L49j5j14L3Q8J6j03p7k23L11K16k57m5%M2j55K44j75J02
3105A6O7K0j92J60j60P1l4J6m0mJ5k67K94j02J90j2J05j67O0K2q7J35k88L03k40
$$ plain form
3130 -119 -236 28 -274 49 120 -61 -63 -223 132 -109 84 -67 255 -2 159 -322 56 115 62 47 -317 75
3152 75 40 37 -208 80 -90 204 -37 31 -297 -23 -97 220 94 -87 36 66 58 71 -46 -48 -94 -151 134 -96 -50
3177 -50 -7 203 75 32 -90 48 -119 -133 -17 198 145 88 25 -125 -63 67 -72 271 -196 -163 236 144 121 -8
3201 -8 -12 144 -8 425 -126 -83 163 122 146 28 -64 -8 12 -71 -32 -45 103 -8 -92 273 -167 -129 -19 -60 -80 27
3227 27 106 112 119 13 -68 164 -108 -69 120 -158 59 -79 265 48 38 -223 40 -45 57 114 173 -239 -51 133
3251 133 230 -160 58 -49 -123 117 44 -113 66 163 261 257 75 -67 173 56 32 200 3 -168 -4 116 156
3274 156 19 36 -25 -111 45 -162 28 -34 -3 32 -39 -49 119 7 148 2 105 283 165 238 34 127 -193
3297 -193 70 1 274 9 55 105 -47 150 114 -57 -103 -20 23 -195 106 -74 270 87 -66 148 2 -107
$$ packed form
3130a19j17K64l02L23P1j81kj60L55k41J93j51L22k57J61m81L78N9n3j5l64L92
3152G5l5lk45K88j70K94k41O8l28K74p4L17j26j81J23L0qJ3j17km6n7K85k30M6
3177e0M3K10j28m3j22J38j67j4J16K15n3n7o3j50O2J30j39L43m67L3L99r2k3j29
3201hmJ56j52M33n51M3K46m1K4j18r2N6K0q3L9j3J48j11q4L65m40L8J10m1k0J07
3227B7P9OPj06q1K32k72L9J89k78K17j38L44k17j0k61K63q5J02N7N9m12J88J84
3251A33R7l90K18j07p4K40p3j57J79R7R8mj82j42K40j17k4J68j97j71J64J20M0
3274A56j37J7o1q6J56k07J90o2L1L5p1j0J68j12J41j46J03J78j18P3k04R3l20
3297a93K63o9K73k65M6N0j52J97l6j71m6Q3M3k18L01j80L44j83j53K14j46j09
$$ plain form
3319 -107 -1 11 -222 -96 185 68 85 42 -27 -107 -217 229 -19 27 -247 118 -217 -48 69 270 -48 -41 213
3342 213 116 117 47 -25 -41 62 84 158 126 166 91 108 129 -99 -13 178 64 -82 130 71 -119 6 -46 -15 -36 -37 282
3369 282 169 25 73 -147 42 318 199 125 80 -150 -31 183 47 45 231 139 -155 -80 -99 36 -161 -22 41
3392 41 15 -40 -90 -106 32 44 191 467 88 218 192 -62 98 33 -63 -50 -97 -24 8 80 125 -71 -82 -108 -40 -155
3418 -155 -128 154 110 -48 35 94 85 -60 179 -50 233 -142 73 -31 18 -82 32 80 138 232 134 14 59 11
3442 11 -134 20 -94 16 -135 205 -72 -20 153 -27 -63 -101 -48 -265 -234 175 15 -53 -103 158 0 22 31 156
3466 156 -73 110 134 103 -18 236 -45 -14 -130 -24 154 -56 122 119 141 -89 68 -36 -17 48 207 -55 42
3489 42 -102 -165 -138 164 107 94 -49 -117 3 -176 -141 -45 78 57 45 100 -28 -82 -187 145 58 196 -160 95
$$ packed form
3319a07J06J2k33J26K81j17J7m3o9q0j10M46k48M6k74L65l35J69J17K01l18PK54
3342B13r7Jp0p2j6J03K2P4l2M0p5J7K1k28Q6J91j14j46K12n9j90J25n2L1k1jL19
3369B82j13j44M8k20J89K76j19p4m5k30J19K14j36kJ86r2k94P5j9J35j97J39O3
3392D1k6n5n0j6J38J2J47K76l79J30k6k54J60o5r6J3m7P3L2P2M5j96j1k6O8j15
3418a55K7K82m4j58Q3N9rj45K39k29K83l75K15j04M9j00J14M8N8R4r8j20M5m8
3442A1j45J54j14J10j51L40k77N2J73j80l6l8N3k17L1M09j60o8n0K61j58K2RJ25
3466A56k29J83K4l1j21K54k81L1j16J06J78k10J78lK2k30J57j04J9O5J59k62R7
3489D2j44o3K7L02n7j3j43o8J20j79L5R6J23k1j2N5j28n4j05L32q7J38l56K55
$$ plain form
3513 95 46 46 103 47 -94 65 24 -72 -33 -12 150 138 116 -63 -154 -108 -170 -12 -138 -171 37 178 -22 57 -26 168
3539 168 56 152 180 193 -5 82 -43 -16 -15 -103 115 5 -27 -94 39 -25 115 -100 74 -148 196 381 -164 -86
3563 -86 -65 -37 -274 -257 -43 -163 37 127 -62 -25 -180 2 9 29 0 -298 144 -24 -140 -45 222 -41 -33 47 -113
3588 -113 108 -13 291 118 -47 -60 -126 14 -46 -74 21 -72 -152 254 -217 -11 59 -130 -39 -95 -8 95 144 -118
3612 -118 -180 -93 146 140 -57 68 -159 -49 -152 -87 -104 -274 -58 111 168 -155 -40 -121 17 24 -51 -104 239 57
3636 57 112 -234 22 24 -97 -56 -227 16 -78 108 -165 -164 73 2 281 185 89 -307 -9 -183 15 -123 -100 34
3660 34 71 62 229 125 -122 -27 89 169 -78 17 10 31 -189 -37 72 50 -84 94 -38 351 226 49 -52 -17
3684 -17 -208 -104 288 -181 40 174 68 -150 18 105 69 -51 73 205 -180 -15 106 -140 108 -32 -105
$$ packed form
3513I5m9%N7n6j41J59m1r6L9K1J62j2k2j79r1M6o2J58j26l3K08J41k00P9q3J94
3539A68j12R6K8J3j98Q7j25K7Jq8K18j10l2o7J33o4J40k15J74k22L44J85n45P8
3563h6K1K8k37J7K14j20K00R0j89L7j55J82PK0k9k98M42j68j16R5K67k63QQ0j60
3588a13K21j21L04j73j65j3o6J40o0k8R5r3q0M06m71K06P0j89R1n6Q7J03M9k62
3612a18o2Q7K39oj97J25k27J10j03O5j7j70K16J69N7l23J15q1J38Pp5n3L43j82
3636E7N5l46K56Kj21M1j71K43r4J86k73JK37p1K79r6r6l96K98j74J98j38K3J34
3660C4L7rJ67j04k47R5J16Q0k47R5pK1k20J52J09k2j34J78j32L89j25j77j01L5
3684a7j91J04L92m69K21J34j06k18J68Q7l6j20J24J32l85J65J21k46K48j40p3
$$ plain form
3705 -105 86 117 144 31 -4 -91 -44 143 -18 -86 148 -81 -195 -26 -128 15 -61 -31 -237 61 269 85 84
3728 84 -9 48 -226 92 -37 19 41 21 -71 -66 -209 155 62 6 50 -14 271 73 174 46 -187 -68 152 -139
3752 -139 -54 -68 -128 25 -100 123 62 168 47 -61 -34 -74 156 -104 65 225 2 -375 43 121 4 -61 -101
3775 -101 184 157 51 88 0 51 128 131 14 40 -71 7 -14 49 228 42 128 -56 81 84 62 -19 18 -71 39 10
3801 10 -118 31 42 3 -220 25 110 57 -81 62 -26 186 170 8 -202 -47 115 59 -39 -20 -8 -329 87 11
3825 11 -128 84 -179 56 35 155 -22 46 -64 87 93 -84 136 45 68 -58 0 181 -128 40 204 124 33
3848 33 -103 -168 299 -70 68 -52 182 -42 -255 97 -49 273 60 20 267 -112 220 152 10 47 -143 -93
3870 -93 -116 7 122 400 222 -113 -61 12 124 197 10 209 -75 69 -121 -74 56 8 -216 236 153 -247 27
$$ packed form
3705a05J91L1K7j13l5q7M7J87j61o8K34k29j14J69j02J43p6L0k06K98K08j84j
3728H4r3N7k74L18j29N6K2k0r2Nj43L64r3n6M4o4K85j98J01j28k33J19K20k91
3752a39Q5j4o0J53j25K23o1J06j21j08K7m0K30k60J69J60k23l77M18P8j17o5m0
3775a01K85k7j06L7q8N1P7Lj17K6j11P8k1O3J79j86Q6j84J37Lk2q1L7q9J10k9
3801A0j28J49J1l9k23K45Q5n3j38J43q8K12j6j62k10J55J62n6r8J9J2l21M16p6
3825A1j39K12k63K35k1J20j77O8j10J51Oj77K20r1K3j26N8J81l09J68J64q0r1
3848C3j36o5M67l69J38j20K34k24k13L52j46L22k13m0K47l79L32o8j42L7j90N0
3870i3k3J23J15K78j78l35N2P3J12P3j87J99k84J44j90M7J30m8k24M52q3m00K74
$$ plain form
3893 27 145 -112 61 -163 -25 -144 47 37 92 -70 -74 -282 -156 57 -113 322 17 81 -23 126 -94 53
3915 53 -134 99 -37 9 29 172 -29 347 210 -70 126 -96 -259 84 103 99 37 56 -6 -108 49 -8 48 -46
3939 -46 227 -110 -6 135 141 -14 -133 -75 -60 -31 255 -69 -112 -224 141 94 -81 -143 52 -179 86 131 -93
3962 -93 193 28 59 -23 38 67 49 -178 46 -74 126 113 52 30 10 -165 -25 -35 -96 125 -60 152 148 345 16
3987 16 76 -35 26 -14 -168 -158 141 84 -191 -13 -63 101 -162 109 40 16 65 -22 177 -6 128 -148 26 -40
4011 -40 -81 -18 106 8 102 -7 167 161 -50 83 68 -294 -107 143 128 -47 16 27 -120 68 46 -132 78 7
4035 7 -35 66 -93 7 49 88 127 -145 -61 226 111 98 -73 -144 -56 0 -29 -46 300 139 -80 -14 241 -50 188
4060 188 136 89 -21 30 -193 -145 -47 -96 121 115 70 -78 -10 -276 41 102 -82 -107 31 -53 169 79 64 -22 149
$$ packed form
3893B7J18k57J73k24J38j19J91j0N5j62mk08J26K13j70M35l05O4j04J49k20J47
3915E3j87K33j36M6K0J43k01L76j37k80J96k22j63L43J9mo2J9o2j02J57n7N6r4
3939d6K73l37J04J41Oj55j19N8J5K9K86l24m3j12L65m7j75o2J95k31K65M5k24
3962i3K86j65L1q2O1K9j8k27K24j20K00j3o1k2k0j75J40j0o1K21j85K12mJ97l29
3987A6O0j11O1m0j54J0K99n7k75J78n0J64k63K71o9k4M9q7J99j83J34k76J74o6
4011d0m1O3J24r8R4j09J74ok11J33j5l62J87K50j5j75O3J1j47J88k2j78K10p1
4035Gm2J01j59J00M2L9L9k72Q4K87j15j3j71p1Q8N6k9j7L46j61k19O6K55k91K38
4060A88n2m7j10N1k23M8R8m9K17om5j48O8k66L17O1j84k5J38q4K22r0j5q6J71
$$ plain form
4085 149 56 200 -1 160 112 -30 -24 188 -107 23 -286 -249 115 -51 -70 -131 144 -88 -12 26 -180 -23 145
4108 145 -36 -26 -138 -59 -82 273 -22 -115 75 106 161 -68 -7 222 -48 41 -78 1 34 17 -126 10 111 0
4132 0 -43 -56 125 85 2 -238 30 -52 1 44 -39 -107 -191 -49 116 -283 163 17 10 217 -46 -34 -119 18 60 -112
4158 -112 30 104 95 35 -89 -190 -193 59 -122 -230 120 74 95 -65 -129 -105 217 83 41 60 -60 -191 155 -98
4182 -98 -314 295 -4 68 147 -183 -106 118 174 118 66 -135 53 -32 -68 282 -134 -100 79 145 -77 31 116 -4
4206 -4 -290 72 -80 301 121 93 -129 -60 -3 -144 36 192 139 186 118 21 -57 -50 348 115 134 -54 -75 17 48
4231 48 18 -74 -164 -55 -6 -112 7 138 59 -9 -121 -230 54 -23 78 61 -66 -165 84 -179 -140 274 -134 -10
4255 -10 -93 92 -63 107 -153 -45 227 -324 229 107 41 40 -100 -149 -107 -1 172 40 -102 166 82 -33 201
$$ packed form
4085A49r3J44k01J61m8j42OK12k95J30l09L7L64j66j9o1K75k32P6L8k06J57J68
4108A45j81J0j12P9k3L55k95r3J90L1N5k29O1K29k70Q9j19P9L3j7j43J36J01j11
4132@m3j3J81m0q3k40K68q2N3M3q3o8q4J42J65l99M46j46pK07k63J2q5J37M2j72
4158a12J42P4ro0j24j01lK52j81j08L50m6K1j60o4K4L22j34m2J9j20j31L46k53
4182i8k16O09k99P2P9l30P7K24N6n6n2k01J88q5l6L50m16L4J79O6k22J08Q5j20
4206dk86L62j52L81j80k8k22O9N7j41J80J56n3M7o8r7p8PL98k33J9j88k1R2L1
4231D8l0r2r0J09M9j06J19J31p9o8j12j09K84p7J01j7j27r9K49k63L9M14m08J24
4255a0q3J85j55J70k60J08K72n51N53j22o6jj40m9M2J06J73j32j42K68q4j15K34
$$ plain form
4278 201 -84 -303 138 -43 -115 96 -50 -9 92 -45 -67 -39 -216 90 137 -150 -73 -66 126 159 -108 -42 200
4301 200 -111 122 -50 59 39 337 -181 -355 153 10 72 -243 -80 -89 -161 -50 1 190 -120 -61 -20 -16 141
4324 141 -63 -319 -84 -44 -73 -50 110 153 152 9 -44 -58 -84 110 145 -1 -122 -125 -160 -59 -32 -36 8 -124 -17 76
4350 76 -4 -228 60 80 280 30 99 -142 67 50 -185 -112 60 303 -32 -190 110 -21 -170 170 51 75
4372 75 -217 -36 174 97 172 23 -218 -31 153 6 -204 100 -157 -151 143 -158 377 349 -50 -122 298 445
4394 445 98 138 -206 237 245 58 -67 499 99 -74 151 137 207 -85 204 155 -29 142 -175 -6 -96 -535
4416 -535 365 86 -113 -387 365 568 177 -378 142 207 -171 164 -160 291 -532 277 316 203 23 -69 -5
4437 -5 15 -204 275 466 -10 -303 297 -29 123 259 428 -35 75 -331 -6 -118 -60 -93 19 100 -267 127
$$ packed form
4278B01k85k19M41j81p2K11j46M1J01j37k2K8j77L06M7k87P7PJ92L3k67O6K42
4301B00l11K33j72J09k0K98n18j74N08j43O2l15J63rp2J11N1J89l10N9M1MJ57
4324A41k04k56K35M0k9K3J60M3jj43n3j4k6J94L5j46j21ll5J01K7mM4j32J07R3
4350G6q0k24K88K0K00k50O9k41K09j7k35P3J72K43l35j58L00j31j49L40j19K4
4372G5k92J81K10p7P5j49k41J87J84j47k10L04k57OK94l01N35k8l99p2M20J47
4394D45l47M0l44M43Qj87j25N66m00j73K25j4P0k92K89m9j84J71l17J69r0m39
4416e35R00k79j99k74P52K03l91n55N20O5l78L35l24M51q23Q09L9j13j80r2O4
4437eK0k19M79J91m76k93O00l26J52J36J69m63J10m06L25j12N8l3J12Q1l67L94
$$ plain form
4459 127 186 -79 57 40 296 71 41 -74 125 281 -32 -42 4 23 162 -105 48 191 -30 -124 -68 131 -88
4482 -88 -10 -10 146 -77 -135 -91 -144 233 96 151 42 -78 -29 -24 -156 192 181 -11 239 72 209 143 60 56 -180
4507 -180 -225 -63 26 59 -129 141 -157 -215 -133 29 134 142 137 12 351 292 66 -11 194 36 -117 -10 194 -156
4531 -156 39 33 45 139 -259 -212 122 86 -81 120 -51 80 -161 -26 87 47 254 -37 118 -205 279 58
4553 58 -352 20 46 78 156 -167 9 149 -46 -141 94 -168 320 36 197 243 106 71 -127 -71 77 76 -116
4576 -116 -60 6 -234 -9 115 -58 -39 65 -27 -19 -28 -114 -26 242 51 -6 -66 217 111 -28 145 102 111 180 -23
4601 -23 -167 -25 -70 233 88 -53 -107 34 53 -220 76 -35 79 54 -84 217 49 -68 139 -4 3 44 147
4624 147 115 -274 -54 -209 94 251 -85 -34 -28 156 -94 -193 -137 202 -62 -50 -295 1 13 167 -183 62 124
$$ packed form
4459A27N9k65J36j7K56k25l0j15J99J56l13j0M6J9J39k67J53J43k21r4N6J99k19
4482h8P8%J56k23n8M4n3L77j37N5j09j20M9Nj32L48j1j92K50j67J37o6q3mk36
4507a80m5J62Q9L3j88K70k98n8Q2J62J05Qnj25L39n9k26p7K05j58j53J07K04l50
4531a56J95oJ2R4l98M7L34l6j67K01j71J31k41J35J13m0K07k91J55l23M84k21
4553E8m10L72K6L2P8l23J76J40j95r5K35k62M88k84J61M6j37l5j98N6J48jj92
4576a16N6O6k40K25J24j73J9J04r2Qrq6Q8K68j91n7o0K83j06j39J73m3RO9k03
4601b3j44J42m5L03j45j41n4J41J9k73K96j11J14k5j38L01j68j17K07j43PM1J03
4624A47l2l89K20j55L03J57l36N1OJ84k50r9N6L39k64J2k45K96J2J54l50K45O2
$$ plain form
4647 124 -209 2 7 52 -31 57 -104 10 65 -6 144 110 31 283 -72 70 91 13 -59 9 -142 296 -243 238
4671 238 118 -80 -176 16 -51 -168 25 83 91 -229 -168 -26 -150 -56 36 -310 113 75 -121 54 259 55 241
4694 241 2 -7 147 -7 62 80 165 19 87 -80 -114 -202 -159 -90 -126 38 7 79 -123 165 20 209 149 -51 11
4719 11 3 -17 119 147 -102 -54 48 161 100 255 -33 1 -4 177 -138 19 59 132 194 160 -74 -135 -10 241 107
4744 107 -85 43 128 77 61 12 -64 -16 126 -89 -53 -101 -84 124 0 47 -1 -96 -162 -49 -182 26 147 -68
4768 -68 344 49 -115 -17 182 176 14 -134 146 133 -99 -201 -35 223 -72 -81 133 21 104 -65 15 -1 2 -172
4792 -172 118 -259 39 53 43 77 -94 56 -191 43 219 -19 -103 -110 69 30 -135 51 42 -14 -180 10 -146
4815 -146 -147 -12 -114 86 6 -53 33 -113 145 -174 62 285 4 -78 -167 9 -47 14 -49 105 75 -51 -222 -43
$$ packed form
4647A24l33K11NM5q3Q8j61J14N5p1J50l4p9K52l55J42K1p8p2O8j51M38n39M81
4671B38j20j98r6J92o7j17J93N8Ql20O1J42j24R4R2l46M23l8j96J75K05k04J86
4694B41k39rJ54j54O9J8Q5j46O8j67l4q8M3O9l6J64l1P2k02K88j45J89o0k00O2
4719A1qk0J36K8k49M8J02J13o1J55k88L4nJ81l15J57M0P3O2l4k34o1J25K51j34
4744A07j92J28Q5n1j6m9p6M8J42k15L6m8J7K08j24M7m8r5o6J13j33K08J21k15
4768f8M12k95j64R8J99oj62j48K80j3k32j02J66K58k95rK14j12Q3j69Q0j6Lj74
4792a72K90l77K98J4j0L4j71J50k47K34J76k38q4pJ79l9j65J86rn6j66J90j56
4815a46jJ35j02K00q0n9Q6j46K58l19K36K23k81q2q9J76n6O1o3J54l0j26j71J79
$$ plain form
4839 -43 90 135 -187 120 -142 -292 -43 -33 -77 -97 -71 -16 239 -283 57 -52 -3 315 219 105 66 72 -188 -85
4863 -85 -8 -14 150 82 146 105 -148 -122 -91 -14 120 -61 -93 -1 126 196 -57 -276 253 87 40 -8 -128 -35 -177
4888 -177 58 50 103 -9 53 289 -85 -10 -56 -177 -117 -141 -61 -101 115 -97 -76 193 33 -27 -24 99 -99 -66 -149
4913 -149 -27 -177 -35 113 184 194 176 96 -129 174 -182 -86 33 -3 -22 -11 -187 68 -107 59 97 311 -4
4936 -4 -68 132 -129 28 54 -137 172 23 -9 -44 -136 119 -186 -193 -26 206 172 -6 -25 106 -40 -377 86 83
4960 83 -190 -113 22 2 -155 134 -202 -80 -127 -126 -63 53 -111 117 -304 -173 -115 94 216 -152 232 -18 -220
4983 -220 -20 -155 -111 -81 -154 147 134 140 -16 44 -11 29 35 -82 -180 -32 91 -17 78 -24 -53 119 9 -51 112
5008 112 -74 -86 -170 -169 54 118 -251 67 -69 286 175 -27 -94 193 236 47 82 -234 -16 -46 67 81 19 63
$$ packed form
4839d3J33M5l22L07k62j50K49J0m4k0K6N5K55n22L40j09M9L18r6j14l9Ok60J03
4863h5P7oJ64o8O4m1k53K6L1P7J34j81l2R2J27P0k53k19N29j66m7m8j20R3j42
4888a77K35qN3j12O2K36l74P5m6j21O0k4Q0m0K16k12K1K69j60o0LJ23j98L3q3
4913a49J22j50J42J48P1J0j8q0k25L03l56R6J19l6j9J1j76K55j75J66L8K14l15
4936do4K00k61J57K6j91L09j49l2l5r2K55l05pJ67K32l4j78j9J31j46l37M63l
4960H3k73P7J35k0j57K89l36J22m7JO3J16j64K28m21J31N8K09J22l68L84k50k02
4983b20K00j35M4L0p3L01j3Oj56O0n5M0Oj17r8J48J23j08R5j02k9J72j10o0J63
5008A12j86j2q4JK23O4l69L18j36L55j11k02o7K87M3j89L5l16K18l0J13J4o2M4
$$ plain form
5032 63 -40 -55 -131 56 16 0 118 28 -135 -36 119 189 51 -27 -102 8 -98 -34 323 65 -145 234 -140 -120
5056 -120 19 191 -294 197 109 86 22 106 166 -31 -80 62 153 32 -30 -190 77 21 40 32 58 10 -14 -291 -65
5081 -65 -194 -8 3 -10 8 29 49 -28 -219 -15 220 -97 -91 143 -245 -207 42 3 -25 358 -138 -266 -56 56
5105 56 47 55 -160 143 27 -266 -81 254 -151 42 -175 124 106 137 8 40 56 -135 202 -69 -69 -9 65 74 121
5130 121 48 70 32 36 -113 182 63 35 0 103 -131 47 116 -84 -77 -85 -76 -166 -23 -9 107 63 -292 -256 -58 -115
5156 -115 57 224 133 -74 -67 -176 -65 -114 109 -169 21 -69 1 -125 -9 -190 -167 9 137 -40 97 -77
5178 -77 -90 21 -213 -83 249 -4 -122 220 179 36 -33 -99 170 194 93 58 28 4 -49 1 13 99 10 -261 124
5203 124 51 -184 58 293 -37 -57 197 57 -131 210 -71 49 -66 -193 35 70 79 -132 81 -89 108 -89
$$ packed form
5032F3j03j5p6J87m0j6J18r0j63R9J55P0j38p8p5J10j06O4L57k58k10L79l74K0
5056a20J39J72m85M91q8k3o4Q4O0j97m9J42R1j21o2j60K67n6J9qK6m8k4k77K26
5081f5j29J86J1j3J8K1K0p7j91K04K35l17OK34l88L8K49l9k8L83m96j28K10J12
5105E6rQk15L03j16k93J85L35m05J93k17K99j8L1j29L2J6j91L37k71%O0P4RM7
5130A21p3K2l8Mj49K95j19k8l5J03k34J78O9k00PqRr0J43J4J16m4l55L6J98n7
5156a15J72J67r1k07Pj09J11m9K23k78J90r0P0j26J16j81K3J76J28j77J37j74
5178g7j3J11k34J30L32k53j18L42m1j43o9o6K69K4j01l5l0k4n3N0J2Q6q9k71L85
5203A24p3k35K42K35l30k0K54j40j88L41k81J20j15j27K28L5Rk11K13j70J97j97
$$ plain form
5225 -89 -67 -252 -44 89 -92 284 0 -99 -2 50 78 52 153 27 -21 21 81 2 -144 -49 255 -65 -130 -111 -89
5250 -89 -195 -73 56 56 25 29 28 218 92 164 -43 153 -12 -90 -138 -258 -106 -282 86 170 33 467 130 -174
5274 -174 190 -600 43 251 23 -295 -454 163 -74 -523 523 723 668 70 -740 86 -201 819 -138 40
5294 40 479 779 111 465 -55 -427 359 -268 -116 -416 -430 -438 -146 -299 192 91 -326 90 221 -11 -60 -230
5316 -230 18 85 104 24 110 -31 46 -29 87 -87 -246 54 -17 -8 190 -106 -99 123 3 -288 -58 -71 76 108
5340 108 -59 177 -13 -59 57 -108 143 -210 -63 -145 -25 -84 8 -8 -62 21 -88 -145 -31 139 52 188 6
5363 6 155 -134 0 -45 1 -301 106 -90 -87 107 21 168 45 -218 195 -205 34 79 -18 -174 168 92 -24
5386 -24 -156 -160 82 -49 -34 -113 20 -96 133 17 35 -165 116 -53 9 107 168 24 60 35 149 -186 -61 -31
$$ packed form
5225h9K2j85K08J33j81L76k84r9R7N2K8k6J01j26m8M2O0p9j46R5L04l20o5J9K2
5250h9j06J22J29%l1MjJ90j26P2k07J96j65p8m8j20J52j76L68Q4j37M34l37l04
5274a74L64p90O43K08k28l18j59O17k37m49J046K00n5n98q10Q26k87J020r57J78
5294D0M39L00o68L54n20l72P86o27J52l00j4qK92j53M91j01m17M16J31k32m9j70
5316b30K48O7J9q0Q6j41P7p5J16j74j59L00p1RJ98k96PK22j20k91K30j3J47L2
5340A08j67K36j90m6J16j65K51l53J47q2J20n9R2j6n4Q3j09n7J14J70q7J36j82
5363FJ49k89J34m5M6l02M07j96LJ94q6J47j23k63M13m00K39M5r7j56L42p6j16
5386b4j32mK42j31J5p9J33j16K29j16J8k00K81j69O2R8O1j44L6k5J14l35J25L0
$$ plain form
5410 -31 39 204 -178 179 -70 277 62 114 186 -77 131 132 -66 -268 -94 -182 -83 -115 43 -142 92 -139 -130 107
5434 107 -46 35 49 -33 88 14 -281 66 31 -146 -79 29 48 14 246 129 196 -67 -200 -131 -140 -99 -142 -1 231
5459 231 -33 62 77 21 -22 -199 61 28 -94 -106 250 -305 -141 7 49 23 162 -124 85 -91 7 -31 -294
5482 -294 -24 -76 -202 -134 10 48 -193 -20 -215 -85 -9 215 104 -244 88 -103 58 41 -78 253 225 18
5504 18 1 47 119 179 -138 115 -18 -143 -103 -94 129 48 58 -35 101 208 -86 179 -196 -79 60 -282 -13 115
5528 115 -134 34 367 -56 -94 -45 -104 96 -21 28 -54 -76 52 121 -260 219 -207 0 48 44 141 -112 321 28
5552 28 171 -81 -22 -21 -48 -26 -34 46 -70 54 -6 -107 72 42 87 106 -50 89 -168 -193 -89 -60 90 -153 -125
5577 -125 65 -59 230 175 -11 58 -18 -74 102 2 146 46 191 53 -169 -126 70 -224 -97 65 -80 95
$$ packed form
5410c1P0J65l82L57k49L47k15N2P2k63K08Jj98k02J74q8R9l2J58j85K34k31RK37
5434A07j53Q1J4q2J21p4k95L47l5j77O7J08J9l4K32j17O7k63j33O9rM1m3J41K32
5459B31k64R5J5n6m3j77K60l3j22j2L56n55J64J48M2k6J39k86K09j76R8l8k63
5482b94K70n2j26O8J44L8k41J73j95J30P6K24j11l48L32j91J61j7j19L31k8k07
5504A8j7M6P2O0l17K53j33j25M0RK23q1J0r3J36J07k94K65l75J17J39l42K69J28
5528A15k49J68L33m23l8M9n9K00j17M9q2k2J28O9l81M79m26K07M8mR7k53M33k93
5552B8J43k52N9Jk7K2qQ0j16J24o0j01J79l0M5J9j56J39k57k5J04K9J50k43K8
5577a25J90j24K89n5j86O9p6n6J76j00J44j00J45j38k22M3J96k94J27J62j45J75
$$ plain form
5599 95 231 62 146 32 -229 -58 123 -7 114 149 446 100 10 45 -103 4 105 262 137 -355 247 -401
5621 -401 -252 -230 -147 -123 261 351 531 682 362 65 -215 -58 -70 -320 -344 -148 -237 -80 5 -232 114 -379 7
5644 7 381 263 -276 -144 227 76 242 219 -148 58 587 18 354 -740 140 480 -125 65 15 -22 731
5665 731 -239 27 190 121 -800 -1132 467 -595 301 -841 -268 374 291 458 272 -433 70 175 -44 213
5685 213 -346 681 42 -304 408 443 171 124 -81 365 69 350 9 55 -863 -249 -205 97 -101 -568 -279
5706 -279 24 514 -261 -197 -59 -109 -374 -122 -396 -173 273 571 137 240 243 118 -78 -152 -292 -16 -50 128
5728 128 198 234 -35 -79 68 -114 57 43 228 91 -175 -35 -42 -281 64 3 58 -171 121 -93 313 -332 -64
5751 -64 36 -119 -6 87 -85 -50 132 44 0 -33 124 -10 -71 61 34 103 -150 109 1 142 -37 -11 -143
$$ packed form
5599I5J36j69Q4j14k61J71J81j30J21L5K97l46r0L5j48J07J01J57j25m92O02o48
5621d01J49K2Q3K4L84R0J80J51l20k97k80J57j2k50k4J96q9J57Q5k37L46m93L86
5644GL74j18n39J32L71j51J66k3l67K06N29n69L36j094Q80L40o05J90n0l7P53
5665G31r70K66J63o9r21l32J599j062Q96j142N73O42q3J67j86p05N03J05k19K57
5685B13n59J027o39l46P12L5k72m7k05M46k96K81l41M6r18O14M4L02j98m67K89
5706b79L03M90p75O4J38n0k65K52k74K23M46K98m34J03Lj25j96p4j40K76l4J78
5728A28P0L6k69m4J47j82J71j4J85j37k66J40pk39L45o1N5k29K92k14M06o45K68
5751f4J00j55J13R3j72L5J82q8m4l3J57j34o1J32k7O9k53K59j08J41j79K6j32
$$ plain form
5774 -143 -78 131 12 -13 111 -115 17 60 -83 -86 144 -46 -34 -127 -78 -116 81 -6 -31 109 195 48 -105 2
5798 2 89 15 20 195 89 20 -133 -113 201 1 -259 -42 -8 -71 38 -21 -64 201 -8 -82 41 -79 -28 -341 -208
5823 -208 189 -42 -3 152 -45 -88 2 110 -45 80 -17 10 -58 -199 117 -98 193 -253 36 119 68 80 111
5846 111 -25 -69 85 165 -61 -100 70 -156 -196 53 -100 94 76 -30 -141 106 -30 -6 122 203 110 21 -93
5869 -93 -23 -47 -133 145 -77 -69 -136 250 109 -100 -49 -9 -69 65 -177 42 -106 17 -25 42 -172 -180 -77 -13 280
5894 280 -25 33 -140 115 124 -116 -46 173 -79 75 -89 -153 -190 -111 -245 -81 100 -52 -237 110 105 56 235
5917 235 -70 -132 96 -93 -96 -125 67 53 28 -52 29 -215 -22 113 -125 -101 75 76 -166 -130 46 -10 146 -12
5941 -12 -142 136 -24 134 -88 109 57 -251 36 -60 191 -152 87 -30 248 65 69 -35 33 -8 -44 -183 85
$$ packed form
5774a43O5K09j19k5J24k26J32M3j43lK30j90J2r3M9l8J97q7k5J40Q6j47j53J07
5798BQ7p4NJ75j06o9j53K0L14k00k60K17L4o3J09n9m3K65k09p4J23j20N1l13J33
5823b08L97k31L9J55j97m3R0J08j55J25r7K7o8j41L16k15K91m46K89Q3n1J2L1
5846A11j36m4J54Q0k26l9J70k26m0K49j53J94j8j06j11K47j36K4J28Q1r3q9j14
5869i3P0k4q6K78k22Qo7L86j41k09N1M0o0J34k42K19j48J23m2O7k14qJ03O4K93
5894B80l05N8j73K55Rk40P0K19k52J54j64o4l7P9j34J64J81j52j85L47nm9J79
5917B35l05o2K28j89lk9J92j4k5q0Q1k44J93J35k38K4J76Jk42L6J76n6J56j58
5941a2j30K78j60J58k22J97n2l08K87r6K51l43K39j17K78j83Mj04O8m1l6j39K68
$$ plain form
5964 85 228 -145 -176 -16 151 -58 104 14 39 72 -179 210 -18 312 43 -38 -84 119 156 -66 74 -128 -86
5987 -86 -72 113 103 -82 145 -225 42 198 -173 -208 -79 -167 -39 238 -92 -182 -183 77 -188 264 -118 -62 24
6010 24 45 -13 -86 -123 -57 109 44 -48 -79 41 -86 -76 65 180 -46 -61 33 2 -237 -263 -23 -6 128 -206 38
6035 38 -91 150 -210 -74 -86 -131 -20 84 46 -274 -341 -104 -144 -13 -348 122 -105 -122 284 -346 81 -34
6057 -34 -20 23 34 49 -43 196 -29 91 -84 99 -44 -131 233 6 135 -83 221 97 160 -121 -149 11 -61
6080 -61 -66 36 73 -107 -10 105 84 -254 -19 -22 71 -286 27 -188 96 -13 -112 146 67 -106 148 -255 176 -173
6104 -173 -173 -8 -146 117 272 -293 -22 -61 120 280 185 -94 328 -260 310 81 -37 340 -64 -284 185
6125 185 -162 -143 132 -19 -222 -244 596 521 -9 250 -55 884 -10 -217 -226 -93 -703 -10 -122 310 11 629
$$ packed form
5964H5J43l73l1J60J67k09J62r0K5L3k51L89k28L30k69q1m6K03L7k22J40k02M2
5987h6J4J85j0j85K27l70K67J56l71l5J29q8J28K77l30r0jK60k65M52l82N6Q6
6010B4K1n8p3l7O6J66o5r2l1J20j27J0J41J15k26j5R4l1k39k6K40J7J34l34K44
6035C8j29K41l60J36j2m5J11J04l8l20o7K37m0J31l35M70k27j7M06o30M27j15
6057c4J4M3J1J5r2K39k25J20j75J83j43q7L64k27J29k18L04j24O3k81k8J60p2
6080f1nJ02L7j80R7J15k1l38K35lR3l57L13k15K84j09r9K58p9j73K54m03M31l49
6104a73%J65j38K63J55n65K71l9J81J60r5k79M22n88N70k29j18L77m04k20M69
6125A85l47J9K75j51k03k2Q40p5n30K59l05R39q94k07rJ33o10O93j12M32k99O18
$$ plain form
6147 629 1 -594 307 318 230 -354 654 -237 7 -234 334 -59 121 678 -391 -157 -259 203 330 2
6167 2 47 -288 65 194 -470 -464 -220 -196 211 -53 291 -61 -28 -30 47 5 -26 59 97 251 -558 211 -118 18 -94
6192 -94 136 26 -37 -303 -10 -86 10 -19 -93 5 46 334 -10 -204 184 -283 -112 263 49 428 179 -128 89
6215 89 16 -68 180 4 96 -82 -12 -86 111 -225 -180 -9 41 73 49 -429 64 -25 -38 -128 199 -5 -358 -455 461
6240 461 -245 -103 230 186 21 52 2 149 205 -157 5 -611 141 149 223 -481 -360 224 49 136 295 -13 -242
6263 -242 70 -327 -148 230 -62 283 1 117 130 681 191 -311 -37 -209 182 18 -252 -31 212 -498
6283 -498 114 417 709 96 40 -76 246 -47 -428 -281 -79 130 511 -62 74 -197 -236 -12 94 -538 44
6304 44 44 -269 220 240 -169 -55 -6 244 83 196 -22 25 190 -93 -9 -151 -91 4 -90 209 -306 68 -79
$$ packed form
6147F29o28n95R01J1q8n84J008q91K44k41N68l93J80N57j069K34j02M62J27l28
6167BM5l35L53J29o64OK44K4M07k64L44l52L3kP7m2l1Q5L8J54q09P69l29J36j12
6192i4K30j10o3k66K93p6R6k9p4R8M1K88l44j94L88m67J71L75k14L79k49l07K17
6215H9p3q4K48j76R2j78P0p4J97l36M5J71N0L2k4m78M93q9j3r0L27k04l53r7R16
6240D61p06J42L33m4j65L1n0J47N6l62J62o16P52QP4p04J21N84j75Q7J59l08k29
6263b42L12l97J79L78k92L45k82J16J3N51m90n02K74j72L91j64k70K21K43p10
6283d98O12L03K92o13n6j16L22k93l81J47K02K09L81n73J36k71l9K24J06o32N82
6304D4%l13M89K0m09J14M9K50j61J13k18M7J65k83Q4j42O0R5r4K99n15L74j47
$$ plain form
6327 -79 130 27 148 123 -22 -23 -124 -10 -28 -95 48 43 38 -17 27 188 -17 33 91 -19 68 -233 -65 -95 -176 170
6353 170 32 -36 86 -195 -55 -51 132 55 -16 -32 -63 135 -148 35 19 53 98 13 -151 18 65 207 -94 156
6377 156 -149 -44 -57 51 -90 -37 95 -31 -73 20 -81 -29 53 77 -20 -90 -209 33 1 -121 171 -64 24 209
6401 209 116 -102 99 -50 -128 -161 42 -236 21 -55 -89 -6 131 -14 -289 202 21 54 -225 -179 -96 32 27 -6
6425 -6 -120 209 -111 199 39 -270 -231 38 -205 -115 183 97 -88 -99 -66 228 162 -107 -106 -5 -156 -165 34 18
6449 18 131 -287 33 -67 175 106 137 168 91 22 -207 255 161 -122 -37 27 -57 -209 81 16 1 191 349 299
6473 299 187 -418 -66 110 31 102 -671 70 -170 -82 316 204 -269 93 -625 -353 5 285 290 -109 376 304
6495 304 -44 -474 -120 -138 178 18 -369 -144 -296 200 139 -111 -298 -182 -88 -195 -528 -55 296 54 88
$$ packed form
6327g9K09j03J21k5j45jj01J14j8o7J43nnn5M4J61k05N0N8j10Q7l01J68l0q1L46
6353A70j38o8J22k81J40MJ83p7p1j6l1J98k83J83j6L4M5q5j64J69M7J42l01K50
6377A56l05J05j3J08j41N3J32j26m2R3j01N2Q2K4r7p0j19K42l2j22K92k35Q8J85
6401B09r3k18K01j49p8l3K03k78K57p6l4Q3J37j45k75M91j81L3k79M6Q3J28nl3
6425fj14L29l20L10j60l09L9K69k43R0K98q6j85j1L3K94o6k69JJ01j51rJ99j6
6449A8J13m18L20j00K42o9L1L1p7o9k29M62r4k83Q5O4q4j52K90o5j5J90J58n0
6473B99j12o05L52J76p9P1p73P41k40Q8L98j12m73L62p18K72L58K80Nl99M85p2
6495C04l48m30L54j8L16j60l87K25j52M96o1k50j87J16R4j07l33M73L51k42L4
$$ plain form
6516 88 -447 -203 -179 154 10 422 496 -72 -294 442 -203 -546 -8 -123 100 -49 -215 -251 223 -229 421
6537 421 -209 5 326 8 594 324 198 628 -45 -31 -81 82 -568 -50 -315 190 186 -294 -57 251 52
6558 52 -598 -366 453 556 -496 226 154 -234 628 -200 -189 -78 -51 -368 158 -336 113 133 83 58 572 696
6580 696 -201 -13 672 522 -230 325 -328 -81 -452 427 350 -635 -278 -281 295 -250 -3 393 -734 239 19
6601 19 558 139 -522 313 9 359 358 -48 -424 -174 -111 -316 -221 414 76 -150 78 284 799 547 -545
6622 -545 -105 -665 599 87 225 -138 242 -585 -306 708 312 54 1041 -654 -599 -297 -253 325 86 304
6642 304 205 -334 -520 -36 641 -95 242 -202 323 408 -47 216 -715 -459 268 415 76 -548 19 -617 -387
6663 -387 75 -612 -130 -107 181 -748 494 -24 339 -509 389 -38 -197 -27 204 298 284 -237 143 -233 437
$$ packed form
6516H8n35K44K4L33j44M12P4n68k22P36o45l43N38j15K23j49j66l6M74m52O50
6537D21o30K14L21l18N86k70j26M30o73J4n0J63o50N18k65N05mm80K37L08j99
6558E2o50K32Q19J03j052P22p2l88Q62q28J1J11K7l17N26m94M49K0n0k5N14J24
6580F96q97J88O85j50p52N55o53K47l71Q79p7r85L57lN76n45K47L96j127R73k20
6601A9N39m19o61Q35l04L50jm06l76K50O3k05R5O35l38k26K28K06N15k52j092
6622e45M40n60J264n12J38l63L80q27K79J014l96k58R87j695N5L02M4N78k39K18
6642C04r9n39j86M84O77p36L37m44N25Q5m55K63r31K56P27J47l39o24N67o36K30
6663c87M62o87M82K3K88r29J242n18L63q48Q98m27j59J70K31R4j4n21L80l76O70
$$ plain form
6684 437 179 63 100 -418 -50 -227 -4 -414 -193 -82 197 95 -62 90 -172 -289 120 -84 146 -409
6704 -409 -209 -209 29 -4 107 105 36 28 24 15 -53 5 9 109 85 70 51 -218 78 -206 -145 -323 85 121 -120 -168 345
6731 345 -308 36 -222 -33 4 177 58 -104 188 13 -89 -112 -165 -93 103 49 305 180 -61 -265 -77 79
6753 79 -229 -9 103 -40 -99 257 69 -50 58 -48 -32 -82 189 25 73 63 116 30 -79 -133 -241 -93 91
6776 91 36 125 158 -11 332 -99 -122 20 -84 -230 77 211 35 33 -186 100 -139 -62 -37 -134 -94 117 158 43
6800 43 117 126 108 105 151 -4 -182 24 171 -43 75 307 -175 -130 47 99 -28 46 53 96 -97 82 31 -207 -25
6825 -25 245 82 37 117 4 -172 -80 0 -135 119 -266 83 -63 -290 -38 165 -38 229 95 161 -141 6
6847 6 28 165 220 -72 139 107 13 -166 -60 -101 95 -42 201 -173 -210 24 23 -29 -12 235 107 -35 -33 135 -138
$$ packed form
6684D37k58j16L7n18L68j77K23m10K21J11K79j02j57J52k62j17M09k04K30n55
6704d09K00%K38l3J11ko9qmro8N8MJ00k4j5j9k69K96k84O1j78M08L6k41m8N13
6731C45o53L44k58J89L7J73j19j62K92j75j02k3n3P2J96n4K56j25k41k04J88J56
6753G9l08K20J12j43n9L56j88j19J08j06J6n0K71j64M8j0N3q6j09n4j08J48J84
6776I1n5Q9L3j69L43m31k3J42j04j46L07J34j76kk19K86k39P7K5r7M0K11M1j15
6800D3P4Rj8lM6j55j78K06J47k14J18K32m82M5J77N2j27P4PM3j93J79n1k38J82
6825b5K70j63m5Q0j13j76R2Q0j35K54l85L49j46k27K52K03k03K67j34O6l02J47
6847FK2J37N5k92K11l2r4j79J06m1J96j37K43l74l7K34jn2J7K47j28j42KJ68k73
$$ plain form
6872 -138 119 -138 156 -137 89 -124 56 -146 90 -35 -505 5 22 134 -187 -33 -97 155 33 -56 87
6893 87 192 -112 30 -34 114 142 -122 -113 -318 -315 -86 -98 0 6 -68 -118 22 -1 -225 137 128 54 112 -29 136 98
6919 98 86 52 -174 331 60 -129 -50 -51 83 127 -33 -115 13 258 -164 91 -211 95 56 48 85 -226 43 294
6943 294 -110 -63 91 77 -39 93 -79 63 169 -228 300 23 193 17 43 18 28 -126 -109 7 -18 96
6965 96 -251 116 -185 -59 284 100 15 26 20 25 175 23 58 -77 86 25 -149 -162 12 175 157 -3 -117 133
6989 133 -218 -40 -84 -11 1 -199 -88 -72 -177 98 -67 -59 21 153 -337 0 -95 11 -61 96 -55 -98 340
7012 340 10 -82 -64 109 -75 114 -52 6 -53 -83 10 -66 94 -60 -40 171 224 -138 -208 5 -31 -49 150 -34
7036 -34 254 -112 165 83 -106 -252 -58 -183 127 -50 -150 -146 -108 151 -93 58 28 -22 -54 42 6 -158 85
$$ packed form
6872a38K57k57K94k93K26k13J80k02K36j25m70N10J7J12l21J54o4K52j22q9J43
6893H7J05l04J42o4J48K8k64Rk05LK29j2R8Op4n0J40k3k24L62rp4N8j41J65l8
6919I8j2l4k26N05k71j89P9jJ34M4j60q2J28K45m22K55l02L06l9qL7l11K69K51
6943B94m04M7J54j4j16J32j72J42J06l97N28k77J70j76K6k5J0j54J7J16k5J14
6965I6l47L67l01J26L43j84q5J1oNJ50j52L5j35J63o1j74j3J74J63j8j60j14K50
6989A33l51J78m4P3J2k00J11J6j05K75j65QQ0J32m90L37r5J06p2J57j51m3M38
7012C40l30r2J8J73j84J89j66N8n9l0R3p6J60j54K0K11N3l62p0K13l6j8J99j84
7036c4K88l66K77q2j89j46J94j25L10j77j00ML8K59k44J51l0n0l2R6l6j64K43
$$ plain form
7059 85 113 3 199 -1 -65 106 -2 -170 -111 155 21 30 113 270 116 -41 194 68 21 151 -105 74 87
7082 87 -18 168 148 -80 -275 -24 151 -45 91 -25 9 -61 -233 -145 46 -92 -27 227 26 -49 -176 23
7104 23 42 285 -47 159 -67 214 124 -46 -18 142 -34 -29 4 78 17 46 -177 75 227 -96 -116 256 -144 17
7128 17 129 -55 390 12 -26 -34 -35 45 113 -183 -74 -66 -91 16 -62 6 246 29 -47 21 -8 117 190 -31 9 -80
7154 -80 -61 -128 -159 -42 361 77 -370 -170 119 -36 -245 -123 17 43 -132 -111 -228 -105 -55 -27 -25 -113 -92 -57
7178 -57 -184 164 -73 -61 -58 -123 296 23 -102 -78 96 107 92 0 -93 123 323 630 102 150 -158 -193 -83 8
7202 8 61 111 -238 244 6 142 -2 88 51 -44 137 -49 118 362 35 -41 116 155 61 35 163 32 191 310
7226 310 146 -53 -84 -48 -55 77 108 150 110 15 -147 -66 143 80 120 -14 12 -209 -154 -34 -70 -37 -92 -110 5 -20
$$ packed form
7059H5K8j10J96k00o4J71j08j68N9K66j34RQ3J57j54j57K35j26m7J30k56J79J3
7082H7j05J86k0k28j95K51J75j96J36j16L4p0j72Q8J91j38O5K54k01p5j27J99
7104B3J9K43l32K06k26K81r0j70K8J60j76NL3P4o1K9k23K52J52l23k0L72m00J61
7128A7J12j84M45l78l8qjQ0O8k96J09Qk5J07p8O8K40k17p6O8k9J25P3k21M0q9
7154h0J9o7l1J17M03k84m47K00K89j55k09J22J40K6j75K1j17J23N0K8Kq8K1L5
7178e7j27L48k37J2Lo5M19k73j25K4J74J1j5r2r3K16K00L07n28M8l08l5J10R1
7202HN3N0l49M82k38J36j44R0l7r5J81j86J67K44l27p6J57L9r4k6J28j31J59J19
7226C10j64j99l1L6pJ32L1M2m0r5j62Q1K09o3M0j34K6k21N5J20l6L3n5j8J15k5
$$ plain form
7252 -20 -220 98 21 130 -165 -170 110 -2 -76 132 111 -166 -78 152 -68 -184 50 74 -12 -55 -72 145 -130 -228
7276 -228 64 -141 -68 73 -103 108 44 -13 -123 142 -93 -77 -43 1 -219 -65 -18 89 -96 -53 255 -64 26
7299 26 169 -87 -19 24 150 -148 52 8 57 212 -241 84 -16 -73 192 160 -28 -3 -39 154 -73 182 -78
7322 -78 -229 -34 1 198 103 -159 190 17 147 12 -279 -13 50 162 309 -261 34 -196 84 -63 -61 138
7344 138 34 -241 61 -28 234 201 -63 244 -157 278 46 118 -20 -37 -21 -134 260 -285 27 -202 -2 -311
7366 -311 224 281 16 -62 311 282 155 84 -238 -375 52 -88 -200 -3 -149 33 254 130 42 42 -64 36
7388 36 -49 229 -304 87 -85 16 75 -9 -3 94 -346 12 201 188 564 -94 -3 274 -107 115 177 -320 -298 148
7412 148 104 133 255 267 1 -171 -6 128 -335 -128 37 342 -24 -306 -277 75 -190 -214 296 42 -131 -48
$$ packed form
7252b0k00L18p7J09k95nK80j12p4K08k1k77Q8K30k20j16K34K4q6m3j7K17k75r8
7276b28K92k05P3J41j76K11o4n7j10K65k35J6L4M4k20J54M7J07j85M3L08l19R0
7299B6J43k56O8M3J26k98K00m4M9J55m53L25j00n7K65l2j88K5l6J93k27K55k60
7322g8j51J95L5J97r5k62L49j73J30j35k91K66O3J12J47n70K95k30K80j47KJ99
7344A38j04k75L02q9K62l3k64L07m01M35k32P2j38j7J6j13L94n45L12k29K00l09
7366c11N35N7k65p8L73k9j27p1l22j37M27j40j12J97j46J82K21j24q8%j06J00
7388C6q5K78n33L91j72J01N9q4OR7m40L58J89j3L76o58R1K77l81K22O2m97K2M46
7412A48m4K9J22J2k66j72J65J34m63K07J65L05l66k82K9L52k65k4N10k54j73Q3
$$ plain form
7434 -48 141 151 239 150 310 601 142 14 175 159 386 39 353 -95 379 311 -164 345 986 -271 240 -95
7456 -95 457 -318 -179 104 419 400 -436 -56 -450 365 -121 301 814 -737 -141 240 36 323 198 -37
7476 -37 4 -335 104 593 -618 101 -150 -778 1009 182 535 0 -654 104 -4 137 715 47 81 225
7496 225 219 -225 628 -167 -329 -501 815 704 -86 -269 106 558 880 263 447 -267 183 -146 -128 656 132
7517 132 465 -681 592 -58 586 313 -483 -347 72 -269 203 -129 737 -224 -60 30 -160 310 223 -120
7537 -120 52 -6 315 63 442 22 642 -60 -78 506 -238 182 -132 400 960 -768 135 635 -166 -310
7557 -310 -588 666 -520 686 506 578 220 772 -217 -547 563 32 -44 261 43 -97 -252 171 336
7576 336 89 -134 113 -287 -136 322 110 -105 242 349 197 385 135 -43 214 420 0 -4 -111 -468 -153
$$ packed form
7434d8J89J0Q8q9J60K91m59j28J61j6K27l47L14m48M74o8m75N09O41j257N11l35
7456i5N52p75J39K83L15j9q36L80l94Q15m86M22N13j551N96L81k04K87j25k35
7476c7M1l39M39M89j211P19k51o28J787q27L53n35o54P58j08J41N78o68L4J44
7496B25om44Q53p95j62j72J316j11p90j83L75M52L22o17J84p14M50l29J8P84n24
7517A32L33j146J273o50O44k73p96J36M19l41M72l32Q66r61J64R0j90M70q7l43
7537a20J72n8L21k52L79m20O20p02j8N84p44M20l14N32N60j728R03N00q01j44
7557c10k78J254j186J206j80P2l58N52r89l30J110n31p6L05k18j40j55M23J65
7576C36k47k23K47m00J51M58k12k15L47J07j52J88k50j78K57K06m20mj07l57L15
$$ plain form
7597 -153 176 133 239 255 -211 -78 -106 181 -117 88 -136 17 115 -16 -308 -7 -162 -37 -152 -142 -266 -248
7619 -248 350 -50 -218 -254 261 59 228 -1 -145 -65 250 -255 -95 -410 93 28 -165 196 -69 -134 105
7640 105 -106 112 -47 90 50 -203 -154 -150 -143 -70 -144 -92 187 13 329 -55 -246 -334 -53 32 79 -161 -94 197
7664 197 -227 -226 -32 -79 -207 171 34 183 259 19 46 -256 195 -83 -60 425 -252 37 330 -299 18 -115
7686 -115 239 479 81 -61 212 215 -90 21 -385 112 424 -166 -357 -45 -6 -312 67 -169 -575 -70 -694
7707 -694 80 154 -12 595 296 -335 194 23 -221 100 -40 434 445 -360 -337 46 -636 -522 291 -109 -381
7728 -381 -580 -40 42 -79 284 -92 -475 296 -339 361 32 -375 -362 -722 -122 -258 272 693 -309 429
7748 429 -101 -95 336 -529 -285 467 -782 92 -94 321 231 567 442 -450 -386 355 92 -453 -126 -187 1017
$$ packed form
7597a53L29m3J06J6m66J33k8K87k98K05k24J53R8j31k92L01j55J25j15J0j24J8
7619b48N98m00j68l6N15k02J69k29j44Q0L15n05J60l15N03o5j93L61k65o5K39
7640A05k11K18j59J37m0k53M9MPP3p4N2K79j74L16l84j91q8K81Q5M7k40O7K91
7664A97m24JJ94m7j28L78j37J49P6k40K7l02M51k78K3M85o77K89K93o29L17j33
7686a15L54K40l98j42K73Ll05J11m06M97L12n90j91L12L9l06L79k36m06N05o24
7707f94P74P4j66O07k99o31N29j71k44L21j40M74J1q05K3L83o82J14Q13m00k72
7728c81j99N40Q2j21L63l76l83P71o35P00l29m07J3l60O00j36N30M21j002P38
7748D29n30OM31q65K44P52j249Q74j86M15r0L36j25q92O4P41k63n45L27o1J204
$$ plain form
7769 1017 286 -18 -181 602 -50 -498 15 591 172 132 631 681 -282 334 -263 -469 -192 -549 166 -69
7789 -69 366 238 484 135 153 -324 140 -475 731 -86 292 33 -507 -130 77 482 140 504 -80 265
7809 265 202 302 -672 246 -155 -428 511 502 956 36 98 178 -14 -82 111 -84 -403 -262 -119 -92 -545 -50
7831 -50 -407 -221 148 -24 -745 -212 -131 -119 272 96 76 -75 -57 -102 42 -176 15 -318 -126 304 134 -15
7853 -15 -69 -228 -385 174 365 63 300 -249 -147 -247 61 63 217 421 131 219 245 -209 79 -222 92 -70
7875 -70 81 -151 62 276 31 247 -285 -89 -97 656 249 247 -219 -424 -222 -261 -142 31 252 -14 -59 136
7897 136 -138 6 415 130 161 -65 -284 -72 -64 160 98 110 -171 180 96 -173 -175 -200 -79 -98 -395 -209 -320
7920 -320 -270 2 -119 -22 110 -148 -40 -82 -38 201 37 41 -91 -5 75 452 110 -12 -109 -163 -13 -216 -200 129
$$ packed form
7769A017p31l04j63P83o52m48N13N76m19m0M99N0r63O16n97k06K77l57P15k35
7789f9M35j28K46l49J8m77M64o15J206q17L78k59n40L77K07M05l42L64n84L45
7809B65o3J00r74R18m01k73R39rM54r20O2Q0j92o8J93j95l19J41J43K7m53M95
7831e0l57J86L69j72p21N33Q1J2L91j76k0j51J8m5J44k18J91l33J92M30j70j49
7853a5n4j59j57N59J91l02K37n49J02j00L08KJ54K04k90Q8K6m54K88l01L14j62
7875g0J51k32K13K14k45K16n32J96qP53m07km66k05K02l9J19J73K21k66m5J95
7897A36k74J44M09k85L1k26k19K12QK24o2J2k81L51q4k69kk5J21j9k97J86j11
7920c20N0K72j21R7J32k58J08m2M4K39j64Mj32Q6Q0L77l42j22r7n4J50k03J6L29
$$ plain form
7944 129 -251 3 -98 -135 -7 -140 -56 219 -63 14 51 -45 -133 14 53 -162 123 -135 144 43 58 -47 28
7967 28 -138 -123 -61 168 84 220 -45 -120 -31 -75 -106 -30 -61 116 204 -50 185 90 -87 4 167 -5 186 -244
7991 -244 53 -351 -24 122 -169 41 234 32 -180 190 37 389 118 202 13 -97 99 120 -175 188 -135
8012 -135 85 -165 -32 116 32 -184 145 -78 180 377 28 -210 36 -313 38 161 -251 159 55 134 111
8033 111 8 -43 120 -72 -36 -16 -107 15 -59 150 137 -230 21 -165 -143 133 78 -338 278 0 70 30 45 72
8057 72 15 -122 -96 -164 -269 -93 36 116 -181 -5 17 -143 -54 237 -97 -2 471 -402 232 412 -64 -229 -210
8080 -210 9 167 148 -73 -164 -245 319 -216 -168 250 146 201 -21 156 -8 -242 529 93 -375 -80 137 -11
8102 -11 117 -14 -141 272 -220 488 -14 -26 11 397 104 147 -471 -52 3 47 -370 44 203 -83 262 473
$$ packed form
7944A29l80K54j01l7J28j33Q4K75k82P7L7r6q8J47L9k15K85k58K79j01J5j05P5
7967B8j66J5O2K29q4J36k65p5Q9m4l1P6l1J77Q8k54K35r5j77R1J63j72J91m30
7991b44K97m04L27J46k91K10J93k02k12L70j53L52k71Q4j89j10J96K1k95L63l23
8012a35K20k50J33J48q4k16L29k23K58J97l49k38K46l49L51J23m12M10j04P9k3
8033A11j03n1J63j92L6K0r1J22p4K09j3l67K51j86K2K76n5m16O16k78P0m0J5K7
8057G2n7j37K6o8j05J76J29Q0k97J76K2j60Q9K91l34R5M73q73O34J80m76j65J9
8080b10K19J58j9k21r1q1N64n35M8M18j04N5k22J77j64k34P71m36m68K95K17j48
8102a1J28j31j27M13m92P08n02j2L7L86k93M3o18M19N5M4m17M14J59k86L45K11
$$ plain form
8124 473 -68 204 329 -218 -76 -28 689 172 213 465 -3 -486 189 -121 198 418 81 90 190 115 59 -293
8146 -293 196 754 -182 -301 -442 -581 134 -282 389 72 386 225 835 -175 -57 -18 78 -12 122 41 -275
8167 -275 -51 -29 419 188 -175 34 -50 57 -80 131 -125 -231 171 154 -104 177 -87 -271 197 80 -80
8188 -80 -29 -183 80
$$ packed form
8124D73n41K72J25n47J42M8P17n17M1K52m68m83O75l10L19K20l37RJ00p5n6l52
8146b93M89N58r36j19j41j39P15m16O71l17L14j61O10j010J18L9R6r0J34q1l16
8167b75K24K2M48k31l63K09q4J07j37K11k56j06M02j7k58K81k64j84M68j17j60
8188h0N1j54K63
8191H0
$$ Imaginary data points
##PAGE= N=2
##DATA TABLE= (X++(I..I)), XYDATA
$$ plain form
0 0 0 0 0 0 0 0 0 0 0 0 0 0 0 0 0 0 0 0 0 0 -7 7 -8 8 -8 8 -8 15 -15 16 -20 23 -23 31 -31 37 -40 46 -51 57 -63 70
42 70 -78 86 -97 106 -118 129 -144 158 -174 190 -210 232 -256 282 -314 349 -391 437 -496 564 -651
63 -651 762 -912 1123 -1448 2022 -3334 16397 -16542 -18714 26446 5684 -19965 -3120 20564
77 20564 -2135 -17659 4170 14359 -8456 -10494 5762 7669 -5637 -9392 2700 8983 -5475
90 -5475 -11922 6190 11551 -10666 -12167 13556 8777 -19002 -4898 20538 -1330 -19891 7294
103 7294 17820 -10583 -13596 15345 10065 -15858 -2878 15430 -235 -10748 2003 8992 -718
116 -718 -7151 1175 7183 -25 -7153 -589 9260 68 -12259 2991 13152 -7403 -12277 11312
130 11312 9633 -14196 -6575 15957 1745 -17067 3054 15443 -7869 -12037 10002 7477 -10287
$$ packed form
0@%%%%%%%%%%%%%%%%%%%%pJ4j5J6j6J6j6K3l0L1l6M3m6N4o2O8p7Q6r7J08j20J33
42G0j48J64j83K03k24K47k73L02l32L64m00M42m88N38n96O63p40Q28r33J060j215
63f51J413j674K035k571L470n356J9731l2939k172M5160k0762k5649J6845K3684
77B0564k2699j5524K1829J0189k2815k038J6256J907j3306l755J2092O283j4458
90e475o447J8112N361k2217j501K5723m779k7779J4104K5436k1868j8561K7185
103G294J0526k8403l013K8941n280k5923J2980J8308j5665j0513J2751O989r710
116g18o433Q326O008p208p128O564R849r192j2327J5250J0161k0555m874K3589
130A1312j679k3829P621K2532j4212j8812K0121J2389k3312m168K2039k525j7764
$$ plain form
143 -10287 -4728 9418 2447 -7915 -1348 6469 1200 -5371 -1834 5995 3172 -7445 -2262 9305
157 9305 1166 -10466 1290 11933 -4099 -11741 8008 10003 -11780 -6577 13185 2098 -13265
170 -13265 879 11814 -4260 -9702 5813 6880 -6568 -4674 5584 3022 -4753 -3028 4174
183 4174 3460 -4358 -3405 4942 4025 -5975 -3875 8033 3185 -9949 -82 11165 -3169 -10213 5899
198 5899 8762 -8053 -6565 9805 3309 -10394 -452 9303 -2003 -7814 2988 5704 -3505 -4934
212 -4934 3096 3578 -2856 -3736 2056 4487 -2346 -5380 3844 5489 -5776 -4742 7682 3199 -8750
227 -8750 -1033 9551 -1269 -9460 4250 8240 -6481 -5791 7455 3647 -7495 -1457 7249 304
241 304 -5914 1181 4869 -1245 -4030 820 4180 -659 -4441 1186 5189 -1544 -5394 2468 5579
$$ packed form
143a0287N559J4146o971j0362O567P817n269o571L537P829k823j0617N183J1567
157I305q139j1632J1756J0643j6032p642J9749J995k1783N203J9762j1087j5363
170a3265J4144J0935j6074n442J5515J067j3448J894J0258k562p775J725P202
183D174p14p818R53Q347r17j0000K100J1908m848j3134R867J1247j4334p044J6112
198E899K863j6815J488J6370o496j3703R942R755j1306n811J0802K716r209j429
212d934Q030M82o434q80N792K431o833l034R224J645j1265J034J2424m483j1949
227h750P717J0584j0820q191J3710L990j4721O90J3246l808j1142O038Q706o945
241C04o218P095L688o114k785M850L360m839l782N627M003o733l850P862L111
$$ plain form
256 5579 -4574 -5621 6103 3950 -7746 -1804 8196 -554 -8140 2267 7066 -4099 -5724 5199
270 5199 4126 -5206 -2090 4932 1342 -4366 -877 3990 661 -3768 -714 3779 728 -4430 -622
285 -622 5184 -460 -6052 1996 6038 -3706 -5312 4979 4106 -6279 -2316 6924 611 -6930 1001
300 1001 5903 -2518 -4916 3098 3870 -3308 -2774 3407 2284 -3010 -1930 2945 1801 -2923 -1959 3667
316 3667 1909 -4359 -1445 4873 226 -5335 876 5667 -2370 -5185 3912 4113 -4915 -2750 5651
331 5651 1492 -5330 -140 4833 -1121 -3972 1732 3267 -1751 -2853 1923 2453 -1708 -2797 2266
346 2266 2555 -2526 -2784 2909 2143 -3857 -2080 4825 867 -5060 131 4866 -1717 -4756 2628 3856
362 3856 -3668 -3107 4217 1738 -4174 -713 3792 -176 -3467 -61 2775 -299 -2557 599 2594
$$ packed form
256E579j0153j047J1724k153j1696N942J0000q750p586J0407M799j1165j625J0923
270E199j073r332L116P022l590n708L489M867l329m429L054M493l051n158L808
285f22N806n644n592Q048M042r744j606J0291q73j0385L963R240o313p541P931
300A001M902q421k398Q014P72p178N34O181j123n294J080M875j144m724R64N626
316C667j758o268K914O318m647n561O211M791q037k815R097K01r028K165Q401
331E651m159o822N190M973n954k851N704J535n018j102M776N30m161j089N063
346B266K89n081k58N693p66o000J777O905l958n927N191M735o583l039P384J228
362C856p524N61P324k479n912L461M505l968l291L406K836l074k258L156J995
$$ plain form
377 2594 -566 -2898 952 3307 -1557 -3216 2369 3058 -3264 -2096 3856 1600 -4345 -748 4814
392 4814 -617 -4276 1963 3742 -2549 -3074 3025 1961 -2753 -1708 3191 830 -3339 -638 2378
407 2378 474 -2542 -157 2848 208 -3183 306 3073 -988 -3292 1712 2972 -2307 -2702 3226
422 3226 1805 -3784 -856 3790 135 -3445 844 3449 -1252 -2733 1702 2223 -2038 -1662 1724 1432
438 1432 -2198 -1297 2069 998 -2490 -784 2600 229 -2711 -240 3211 -689 -3339 1121 2624
453 2624 -1971 -2615 2567 1920 -2796 -1432 3191 715 -3072 119 2961 -325 -2606 971 2420 -1348
469 -1348 -1965 1527 1848 -1518 -1768 1677 1341 -1983 -1506 2551 1026 -2921 -299 3044 187 -2952
485 -2952 706 2915 -1090 -2635 2035 2032 -2338 -1642 2305 1095 -2570 -737 2505 -254 -2037 367
$$ packed form
377B594l160k332L850K355m864j659N585O89o322J168N952k256n945L597N562
392D814n431l659O239J779o291n25O099j064m714J045M899k361m169K701L016
407B378j904l016K385L005k640l391L489K767m061k304N004J260n279l95N928
422C226j421n589K928M646l655l580M289K605m701j481M435N21m261L76L386k92
438A432l630R01L366j071l488J706L384k371k940K471L451l900k650M460J503
453B624m595o44N182o47m716J364M623k476l787L191K842l286k281L577J449l768
469a348o17L492L21l366k50L445l36l324M77M057j525l947K622L343k857l139
485b952L658K209m005j545M670lm370O96L947j210l665J833L242k759j783K404
$$ plain form
501 367 2083 -500 -1892 881 2279 -746 -1929 1537 1703 -1460 -1565 1803 1208 -2446 -568 2419
517 2419 266 -2548 204 2635 -662 -2531 1115 1855 -1523 -1593 1913 1095 -2062 -1035 2091 384
533 384 -1738 -538 1805 -44 -2039 492 1714 -585 -1847 664 2046 -1252 -1712 1557 1754 -1772
549 -1772 -998 1996 852 -2226 -554 2320 48 -2339 447 1815 -1069 -1923 1248 1167 -1394 -1211
565 -1211 1339 860 -1837 -742 1710 9 -1749 -466 1676 -104 -1868 648 1471 -744 -1699 822
581 822 1624 -1382 -1152 1423 751 -1537 -289 1703 266 -1850 154 2021 -369 -1595 871 1509
597 1509 -966 -1154 1116 1264 -1613 -713 1512 682 -1658 -673 1662 145 -1916 36 1638 -318
613 -318 -1728 637 1257 -1006 -1406 1207 1283 -1758 -1086 1553 975 -1659 -157 1666 -70 -1594 278
$$ packed form
501C67J716k583j392K773J398l025j183L466J66l163j05L368n95l654J878K987
517B419k153k814K752K431l297j869L646P40l378p0L506q18l157J027L126j707
533C84k122J200K343j849j995K531J222k299j262K511J382l298m60L269J97l526
549a772P74K994j144l078J672K874k272k387K786J368k884q54L171q1k561J83
565a211K550m79k697J095K452j701j758J283K142j780j764K516Q23k215r55K521
581H22Q02l006K30K575o72k288J248J992j437k116K004J867k390j226K466O38
597A509k475j88K270J48k877R00K225q30k340R85K335j517k061J952J602j956
613c18j410K365O20k263m00K613P6l041O72K639n78k634J502J823j736j524J872
$$ plain form
630 278 1537 -502 -1444 577 1397 -949 -819 860 931 -1168 -658 1312 363 -1505 -504 1446 -320
647 -320 -1524 312 1789 -101 -1368 529 815 -1090 -1365 1321 712 -1346 -703 1177 238 -1322 -271
664 -271 1213 -321 -1304 357 1149 -631 -1318 906 812 -831 -638 1057 526 -773 -384 914 376 -1006
682 -1006 -4 1134 -377 -1720 643 1209 -270 -1387 500 1092 -949 -912 1135 585 -1047 -134 1318
699 1318 -101 -1426 109 1526 -498 -663 730 841 -1318 -937 598 692 -1248 -802 1471 -152 -1320
716 -1320 -161 1165 157 -822 -133 1071 -170 -964 153 665 -926 -1616 1002 743 -1243 -645 1550
733 1550 626 -1275 108 1072 24 -1171 695 951 6 -641 776 831 -821 -482 1382 -79 -1157
750 -1157 -355 1519 172 -1193 471 347 98 -881 1154 1215 -741 -1001 570 1107 -1076 -1197 1342
$$ packed form
630B78J259k039r42K021Q20k346J30J679P1k099N10J970r49j868J001J950j766
647c20j204J836J477j890j267J897K86j905k75K686o09k058O43J880r39j560J051
664b71J484j534r83J661P92j780o87K224r4j643J93J695n31j299L89J298n38j382
682a006J002J138j511j343K363N66j479j117J887N92k041L7K047n50j632R13J452
699A318j419j325J535J417k024j65J393J11k159L81J535R4j940M46K273j623j168
716a320J159J326j008r79O89J204j241p94J117N12j591o90K618k59j986N98K195
733A550r24j901J383R64j048j195J866K56r45o47J417N5j652L39J864j461j078
750a157Q02J874j347j365J664j24k49r79K035O1j956k60J571N37k183j21K539
$$ plain form
767 1342 612 -1690 -33 1187 -101 -1081 -290 984 -105 -978 446 1092 -273 -910 251 332 -274
784 -274 -569 516 -19 -443 -11 410 141 -796 -51 731 77 -845 89 867 -785 -1099 1131 199 -497
803 -497 -551 887 218 -1198 105 1566 529 -1389 -279 399 -592 -614 855 244 -1333 -40 391 149
821 149 -1178 -311 916 492 -500 -273 676 43 -1398 254 746 115 -608 902 1253 -581 -437 -13
839 -13 907 -1356 -773 882 -60 -755 -475 417 125 -659 350 819 142 -944 771 787 -261 -17 609
858 609 131 -3 151 301 895 143 -1 833 81 -689 384 1311 -150 64 295 293 -592 -440 893 399
878 399 -200 -786 379 -320 -533 310 224 -464 -465 194 927 -828 -152 468 1397 -428 -164 999 573 -434
898 -434 -233 691 287 111 -791 609 -189 -716 -306 995 -216 -164 490 100 46 -217 442 248 -825 249
$$ packed form
767A342p30k302J657J220j288r80P91J274j089q73J424O46j365o37J161Q1o06
784b74k95J085n35m24M32M21k69r37P45P82o54r22R34P78j652l14K230r32o96
803d97n4J438o69j416J303J461j037j918J110O78r91k2J469o11j577J293M31k42
821A49j327Q67J227m24r92K27R49o33j441J652M92o31p23J510L51j834J44M24
839a3R20k263N83J655r42o95K80Q92k92p84J009M69o77j086J715J6j048K44O26
858F09m78j34J54J50N94p52j44Q34p52p70J073R27j461K14K31kq85J52J333m94
878C99n99n86J165o99k13Q43q6o88jO59P33j755O76O20R29j825K64J163m26j007
898d34K01R24m04j76r02J400p98n27M10J301j211N2O54l90n4k63O59j94j073J074
$$ plain form
918 249 368 -514 -917 -218 696 93 838 697 920 -784 -1137 348 606 -604 -652 -164 320 -739 -500
937 -500 128 -415 -537 154 663 -118 -450 -251 454 -858 671 217 -330 88 915 515 -141 67 -881 571
957 571 -141 260 -585 -355 -79 -303 -45 961 1 -152 763 1073 -186 -143 512 -312 269 311 364 -40 -474
978 -474 -232 -47 -278 -275 45 279 -36 144 380 180 -990 -226 423 80 779 372 547 49 113 -35 909
999 909 81 -244 807 914 -1062 -34 -83 319 -1142 -879 77 94 -607 329 291 547 701 553 934 -1193
1019 -1193 -767 -402 401 175 -368 274 -304 353 -136 720 -148 331 842 503 -222 -279 713 874 -21 -293
1039 -293 -268 -393 -231 -171 915 374 190 -370 794 -463 163 956 106 -89 -196 60 101 230 -483 72
1059 72 219 -491 301 165 -92 -204 687 308 -197 75 -122 118 879 -793 788 551 -446 46 45 102 -689
$$ packed form
918B49J19q82m03O99R14o03P45j41K23j704l53J485K58j210m8M88M84j059K39
937e00O28n43j22O91N09p81l32J99P05j312J529m54n47M18Q27m00o56K08r48J452
957E71p12M01q45K30K76k24K58J006r60j53R15L10j259M3O55q24N81M2N3m04m34
978d74K42J85k31LL20K34l15J80K36k00j170P64O49l43O99m07J75m98O4j48R44
999I09q28l25J051J07j976J028m9M02j461K63R56J7p01R36l8K56J54j48L81k127
1019a193M26L65Q03k26n43O42n78O57m89Q56q68M79N11l39p25n7R92J61q95k72
1039b93K5j25J62O0J086n41j84n60J164j257O26P93q50j95j07K56M1J29p13N55
1059G2J47p10P92j36k57j12Q91l79n05K72j97K40P61j672J581k37r97M92jN7p91
$$ plain form
1080 -689 324 574 154 -263 56 877 -1250 46 618 125 54 65 -157 846 -358 210 -35 -106 -736
1099 -736 -366 823 660 -354 -84 1140 -358 -463 443 565 -511 -437 138 -401 -499 -957 924 -112
1117 -112 87 -307 325 -2 -58 -102 -170 -279 -480 1039 -151 -462 -563 226 603 -78 358 861 -18 -408
1137 -408 270 208 438 -144 -142 239 -661 -698 -295 611 -646 -71 311 -193 -693 -474 651 -23 40 -474 -6
1158 -6 -79 52 -105 964 -815 -1152 35 131 -651 -521 103 79 -117 404 -291 -605 -191 338 530 -1 -153
1179 -153 -26 256 -366 -430 140 209 -520 -293 -90 517 -393 357 354 -647 -169 263 159 -115 -229 548 513
1200 513 -113 -1170 728 426 179 423 55 490 -154 246 171 -263 106 2 362 348 -101 -381 -150 -402
1220 -402 -136 157 -163 -510 2 -153 -304 -53 -93 -470 -294 -379 -38 261 81 -226 238 277 17 -858 -260
$$ packed form
1080f89J013K50m20m17L19Q21k127J296N72m93p1J1k22J003j204N68k45p1o30
1099g36L70J189j63j014K70J224j498j05R06J22j076P4N75n39r8m58J881j036
1117a12J99l94O32l27n6m4o8j09k01J519j190l11j01P89L77o81M36N03q79l90
1137d08O78o2K30n82KL81r00l7M03R06j257N75L82n04n00K19J125o74O3n14M68
1158fp3J31j57J069j779l37J187R6p82J30O24k4j96N21o95l14M14N29J92n31j52
1179a53J27K82o22o4N70O9p29K27K03O07r10P50lj001M78M32j04k74j14P77l5
1200E13o26j057J898l02k47K44l68M35o44M00p5m34L69j04L60j4m49k80K31k52
1220d02K66K93l20l47N12j55j51K51m0l77J76q5L41K99j80l07M64L9k60q75N98
$$ plain form
1241 -260 -245 -290 354 185 268 -413 -50 -116 339 -297 70 90 -813 -156 123 54 -268 379 -289 175 391 -172
1263 -172 673 209 161 -20 578 85 -708 237 11 65 -49 433 -66 -34 103 89 270 -518 -163 -438 -437 -239
1285 -239 -24 621 -651 -142 36 -126 -164 150 120 251 9 5 -27 7 -521 -466 149 74 -330 -274 148 -7 -182
1308 -182 -75 -239 272 -464 -64 237 -199 -757 -158 -158 -78 150 417 -258 63 162 168 -244 -44 69 35 -399
1330 -399 -276 78 -62 138 -218 -57 -316 -233 200 52 -444 -78 -65 -396 46 468 -393 234 -169 481 -208
1351 -208 40 -452 -120 530 -152 -910 -22 -19 105 -604 28 520 -400 -109 168 -25 84 -579 -524 -39 -753
1372 -753 794 -48 -822 489 -496 419 -296 74 121 -22 57 -184 -272 601 396 -233 -242 -694 362 -437 -285
1393 -285 63 -243 -69 84 -74 185 597 -288 793 -233 -10 -141 -390 467 589 120 -583 -298 249
$$ packed form
1241b60J5m5O44j69Q3o81L63o6M55o36L67K0r03O57K79o9l22O47o68M64K16n63
1263a72Q45m64m8j81N98m93p93R45k26N4j14M82m99L2J37j4J81p88L55k75JJ98
1285b39K15O45j272N09J78j62l8L14l0J31k42ml2L4n28N5O15p5m04N6M22j55j75
1308a82J07j64N11p36M00L01m36n58N99%Q0K28K67o75L21R9Om12K00J13l4m34
1330c99J23L54j40K00l56J61k59Q3M33j48m96L66J3l31M42M22q61O27m03O50o89
1351b08K48m92L32O50o82p58Q88LJ24p09O32M92r20K91K77j93J09o63N5M85p14
1372g53J547q42p74J311r85R15p15L70M7j43P9k41q8Q73k05o29rm52J056p99J52
1393b85L48l06J74J53j58K59M12q85J081j026K23j31k49Q57J22m69p03K85N47
$$ plain form
1412 249 549 -438 44 807 -74 -554 193 161 767 192 697 -159 -379 -775 122 -226 -320 -450 -520 717 -84
1433 -84 -69 -257 167 314 215 -509 -307 -639 426 10 524 -670 281 580 -950 -154 186 651 160 492
1453 492 -518 27 768 204 -781 -904 257 -34 391 -456 -1076 196 508 -492 393 -503 356 -507 -207
1472 -207 361 715 238 169 -581 -47 -330 -404 50 -243 -229 -385 215 414 784 -789 523 -6 148 420
1492 420 59 -457 -173 -485 -143 -256 -492 -289 -120 413 109 649 -204 102 263 -104 -179 -569 -274 -249 41
1513 41 -153 -332 822 -86 111 -396 -379 222 595 -90 -330 -637 207 -197 226 339 50 287 -92 205
1533 205 -138 -96 555 -11 385 -152 -67 237 -54 -276 181 58 -34 -110 220 111 257 -248 366 -149 -168 -135
1555 -135 -25 -134 -267 53 30 -137 -62 64 -62 -30 -128 -21 261 -418 390 130 -235 34 460 -197 69
$$ packed form
1412B49L00r87M82P63q81m80P47l2O06n75N05q56k20l96Q97l48r4j30p0J237q01
1433h4J5j88M24J47r9p24K02l32J065m16N14j194R51K99j530P96L40M65m91L32
1453D92j010N45P41n64r85j23J161k91M25q47o20J272L12j000Q85q96Q59q63L00
1472b07N68L54m77o9p50N34k83p4M54k93J4j56O00J99L70j573J312n29J54K72
1492D20l61n16K84l12L42j13k36K03J69N33l04N40q53L06J61l67p5l90K95K5K90
1513D1j94j79J154r08J97n07J7O01L73o85k40l07Q44m04M23J13k89K37l79K97
1533B05l43M2O51n66L96n37Q5L04k91k22M57j23r2p6L30j09J46n05O14n15j9L3
1555a35J10j09j33L20k3j67P5J26j26L2r8J07K82o79Q08k60l65K69M26o57K66
$$ plain form
1576 69 9 -17 315 31 -234 110 -46 -260 -151 -71 136 130 -179 -60 96 -86 209 -72 -38 -140 139 -188
1598 -188 -86 -27 -352 109 92 -56 23 130 -31 -115 36 97 -111 -214 -176 -90 -434 -55 362 -174 -351 73
1620 73 166 -29 345 -106 -33 124 191 -155 223 72 -100 71 370 -13 342 398 -44 62 16 205 -103 -67
1642 -67 241 175 -181 52 170 304 -189 92 164 -25 47 -66 124 -144 131 89 -196 116 42 30 34 -299 -210
1665 -210 -1 199 -101 -49 -146 184 -104 -82 242 34 -341 223 186 -184 37 -252 -454 -513 -35 466 -284 -113
1687 -113 233 -253 -82 175 -117 -189 -155 -357 30 -184 -444 -173 -261 392 -155 164 201 -208 144 -2 318
1708 318 89 -223 -42 -41 -590 -437 432 14 -138 -60 98 -141 -6 331 -122 -374 -48 129 26 228 -157
1729 -157 -562 253 -90 4 63 142 -182 -126 122 188 -350 -405 26 342 33 230 289 -788 140 141 -99 5 495
$$ packed form
1576F9o0k6L32k84k65L44j56k14J09Q0K07ol09J19J56j82K95k81L4j02K79l27
1598a88J02N9l25M61j7j48P9J07j61q4J51O1k08j03L8Q6l44L79M17n36j77M24
1620G3R3j95L74m51P3J57O7l46L78j51j72J71K99l83L55N6m42J06m6J89l08L6
1642f7L08o6l56K33J18J34m93K81P2j89P2j13J90k68K75m2k85L12p4j2Ml33Q9
1665b10K09K00l00N2r7L30k88K2L24k08l75N64l7l70K21k89k02n9M78N01p50J71
1687a13L46m86J71K57k92p2L4k02L87k14k60K71q8O53n47L19L7m09L52j46L20
1708C18k29l12J81Jn49J53Q69m18j52P8J58k39J35L37m53k52L26J77j03K02l85
1729a57m05Q15l43R4N9P9l24N6K48O6n38n5M31L16l09J97N9j077R28Jk40J04M90
$$ plain form
1752 495 100 -264 72 -194 226 -197 74 -62 -68 131 205 91 221 -151 15 -345 -39 85 -163 240 -195
1773 -195 -141 -53 111 27 -180 205 49 -284 41 -43 118 -185 -1 -107 69 -33 116 -146 192 264 -668 -35
1795 -35 70 98 -311 89 -45 -253 -169 145 -203 -48 362 69 67 -41 78 -278 43 189 -280 -529 -7 -153
1817 -153 -185 -7 116 -88 34 -163 -82 -350 130 217 109 84 30 -385 -625 119 162 143 293 64 113 44 649
1840 649 -59 -763 -262 215 230 -84 -92 437 -270 353 136 -733 -629 273 200 -584 -198 -100 -7 -390 678 233
1862 233 -197 208 69 -23 418 -151 133 -76 149 -255 68 -170 323 -555 -413 124 -332 -15 -743 -245
1882 -245 -530 -359 -222 -378 17 -46 175 19 333 -117 -268 225 -180 19 -191 -483 88 -109 314 -57
1902 -57 -177 -170 114 -47 -301 330 97 -110 110 146 -378 34 -155 -79 8 -67 218 310 187 -158 -579 18 -298
$$ packed form
1752D95l95l64L36k66M20m23K71j36oJ99P4j14J30l72J66l60L06J24k48M03m35
1773a95N4Q8J64q4k07L85j56l33L25q4J61l03J84j06J76j02J49k62L38P2r32O33
1795c5J05K8m09M00j34k08Q4L14l48J55M10k93kj08J19l56L21J46m69k49N22j46
1817a53l2J78J23k04J22j97Q1k68M80Q7j08k5n4m15k40P44M3j9J50k29M9o9O05
1840F49p08p04N01M77J5l14qN29p07O23k17q69J04R02p3p84L86R8R3l83J068m45
1862B33m30M05j39r2M41n69K84k09K25m04L23k38M93q78J42N37m56L17p28M98
1882b45k85J71J37j56L95o3K21j56L14m50j51M93m05J99k10k92N71j97M23l71
1902e7j20PK84j61k54O31k33k07K20L6n24M12j89P6Q7p5K85R2j23l45m21N97l16
$$ plain form
1925 -298 -340 -198 406 -1 -13 -130 47 -41 -146 -196 203 111 -42 141 82 -68 24 -92 137 174 34 -227 -220
1948 -220 211 -301 -176 131 5 -186 -71 213 -197 -85 11 126 -450 -221 -102 44 -32 -132 -46 32 318
1969 318 137 -729 -225 191 143 -221 146 -16 -64 10 -1 42 -188 216 498 68 -8 -163 -114 30 -107 -13 -187
1992 -187 210 -59 -34 -23 167 -19 178 211 233 52 177 274 122 -22 22 -255 70 258 -344 -321 389 -139
2014 -139 103 4 115 41 -88 111 0 -146 30 -7 -146 -267 9 -313 -176 -278 44 138 -192 49 -53
2035 -53 -235 -230 -27 -261 393 -9 -115 -76 -52 -157 182 96 267 -116 301 195 -303 -124 147 -103 -185 288
2057 288 -227 115 53 -113 -225 242 -123 -339 -7 -101 -122 234 21 70 -97 108 -19 -149 -180 -332 171 70
2079 70 -5 222 24 -124 498 -80 198 626 117 246 179 -373 46 375 350 325 -112 -542 431 -30 221 -268
$$ packed form
1925b98m2J42O04m07j2j17J77q8j05n0L99r2j53J83n9j50R2j16K29L7j40k61P
1948b20M31n12J25L07j26j91J15K84m10J12R6J15n76K29J19J46p6j00Q6P8K86
1969C18j81q66N04M16m8l64L67j62m8P4j1M3k30M04K82m30p6j55M9J44j37R4j74
1992a87L97k69K5J1J90j86J97L3K2j81J25R7j52j44M4k77L25J88o02K3P10n28
2014a39K42r9J11p4j29J99j11j46J76l7j39j21K76l22J37j02L22R4l30K41j02
2035e3j82NK03k34O54m02j06L9K4j05L39q6J71l83M17j06m98J79K71k50q2M73
2057B88n15L42o2j66j12M67l65k16L32r4k1L56k13M9j67K05j27j30l1j52N03j01
2079G0p5K27j98j48O22n78K78M28n09J29o7n52M19L29k5k5m37m30R73m61K51m89
$$ plain form
2101 -268 100 70 -371 378 91 -230 206 52 78 -40 433 -321 -205 -205 27 315 -318 341 252 774 161 -70
2123 -70 -251 -68 478 119 426 574 -254 0 142 259 111 98 355 -225 -157 -163 -749 431 334 336 -84 -335
2145 -335 -404 -369 -452 -346 -177 -110 294 443 -46 157 142 548 -245 382 -493 -326 704 -997 187 -127 473
2166 473 -644 -442 510 -301 -519 73 783 -199 -197 343 268 -360 -116 620 -39 265 -41 392 223 570 167
2187 167 538 229 56 299 556 -7 41 247 305 579 -661 429 -4 434 -400 -161 -114 69 132 81 213
2208 213 223 292 35 -731 4 42 -9 -51 -12 12 118 262 242 262 -25 373 567 -378 -100 -419 122 -253 -49
2231 -49 174 456 97 603 -69 -117 636 98 -656 526 325 436 1 27 505 369 -78 -321 772 -233
2251 -233 48 582 -139 -406 127 -166 -93 234 382 373 223 -361 100 95 -244 -124 -137 310 93 -978 211
$$ packed form
2101b68L68l0m41P49k87l21M36j54K6j18M73p54J16%K32K88o33O59q9N22o13k31
2123g0j81J83N46l59L07J48q28K54J42J17j48j3K57n80O8on86J180r7Km20k51
2145c35o9L5q3J06J69O7M04J49m89K03j5M06p93O27q75J67J030j701J184l14O00
2166D73j117K02R52q11k18N92P10r82KN40p5o28K44P36o59L04l06M33j69L47m03
2187A67L71l09j73K43K57n63M8K06N8K74j240J090m33M38q34K39M7J83O3n1J32
2208B13J0O9k57p66P35L8n1m2L9K4J06J44k0K0k87L98J94r45K78l19N41l75K04
2231d9K23K82l59N06o72m8P53n38p54J182k01J11m35K6M78j36m47k43J093j005
2251b33K81N34p21k67N33k93P3L27J48rj50n84M61nl39J20j3M47k17j071J189
$$ plain form
2272 211 199 -577 -369 -424 644 259 -30 588 -85 -614 58 663 105 352 289 -204 618 -345 -521 -446 -196
2293 -196 -88 -72 209 -175 308 68 -460 -105 43 -420 -132 335 263 -1 -156 -121 146 332 -119 436 -70
2314 -70 310 -135 -44 3 148 -17 77 -136 -52 451 340 -310 -128 238 198 -11 -218 356 287 193 -291 -82 50
2337 50 209 169 106 -616 277 -404 137 -267 344 137 23 -179 258 -117 -5 76 226 264 -399 354 -106 52
2359 52 58 -117 114 16 29 -208 -53 242 -328 -210 -34 -274 -68 -229 -147 -92 -219 68 -43 -182 93 179 2
2382 2 -118 -18 -260 165 -275 74 -65 113 83 -17 110 -67 -188 0 -27 -101 -21 203 116 102 261 17 3
2405 3 107 309 -83 212 130 78 -24 449 -187 153 -244 -425 -73 -167 -69 137 -154 238 199 143 39 330 -401
2428 -401 -612 63 -337 49 -8 243 -54 -660 -55 196 -142 -201 391 -49 -426 55 -64 -53 -430 56 -288
$$ packed form
2272B11j2p76K08n5J068l85k89O18o73n29O72O05n58K47o3m93Q22r63j76P5K50
2293a96J08J6K81l84M83k40n28L55J48m63K88M67p2k64j55L5K67J86m51N55n06
2314g0L80m45R1M7J45j65R4k13Q4N03j11o50J82L66m0k09k07N74o9r4m84K09J32
2337E0J59m0o3p22Q93o81N41m04O11k07j14k02M37l75J12Q1J50L8o63P53m60J58
2359E2Oj75K31r8J3k37J55K95n70J18J76k40K06j61Q2N5j27K87j11j39K75Q6j77
2382Bj20J00k42M25m40L49j39J78l0j00J27j77j21J88k7p4Q0K24q7j4J59k44j4
2405CJ04K02l92K95q2n2j02M73o36L40l97j81L52r4R8K06k91L92l9n6j04K91p31
2428d01k11O75m00L86n7K51k97o06O05K51l38n9N92m40l77M81j19J1l77M86l44
$$ plain form
2449 -288 158 -277 -409 296 -712 -85 -19 -186 -576 61 -173 -188 56 9 17 50 -155 147 547 -399 63 646
2471 646 -540 -180 -140 -22 -186 -315 672 547 442 574 -182 81 -222 15 310 -43 -155 -113 -33 46 56
2492 56 470 -180 -205 17 -168 398 15 432 403 -359 -229 -42 307 -75 -214 -75 -57 586 -14 -81 271 789
2514 789 200 344 -467 184 -290 -142 -164 63 -164 -269 152 626 670 150 58 458 787 -129 -834 229 780
2535 780 -377 195 -168 -387 -45 -298 23 220 371 593 275 39 -353 138 571 782 -537 -274 -126
2554 -126 504 384 -13 61 -151 129 -154 -416 340 491 339 302 -38 278 131 -532 26 75 -119 -266 -229
2575 -229 -258 358 290 -122 366 246 414 -35 435 -98 -531 -24 -271 -478 -32 -217 42 -502 -385 -439 -209
2596 -209 -228 41 272 -333 260 -385 103 60 -215 165 294 55 -27 -4 99 138 -284 374 -11 -212 -575 -408
$$ packed form
2449b88M46m35j32P05j008O27O6j67l90O37k34j5K44m7QL3k05L02M00r46M62N83
2471F46j186L60M0J18j64j29R87j25j05J32p56K63l03K37K95l53j12M2Q0P9J0
2492E6M14o50k5K22j85N66l83M17k9p62J30J87L49l82j39J39J8O43o00o7L52N18
2514G89n89J44q11O51m74J48k2K27k27j05M21M74M4n20r2M00L29r16p05J063N51
2535G80j157N72l63k19L42k53L21J97J51K22l18k36l92M91M33K11j319K63J48
2554a26O30j20l97P4k12K80k83k62P56J51j52l7l40L16j47o63N58M9j94j47L7
2575b29k9O16o8m12M88j20J68m49M70n33m33N07k47k07M46j85K59n44J17n4K30
2596b09j9K69K31o05N93o45M88m3k75L80J29k39q2K3J03L9m22O58l85k01l63J67
$$ plain form
2618 -408 4 82 344 -346 116 -163 -268 316 83 -247 399 26 -128 128 -411 298 314 97 -161 -393 -249
2639 -249 -582 314 428 337 14 -269 161 318 61 -70 -127 552 22 -93 -247 -324 468 -121 81 -261 -77
2660 -77 -114 20 -51 223 -9 -372 -279 -120 85 329 31 159 -183 202 120 -171 -88 -298 209 99 -438 -326
2682 -326 176 -74 282 529 361 -758 333 -551 -10 206 285 462 -395 -376 -129 364 99 -65 103 -232
2702 -232 -6 37 204 187 -430 -96 -108 -290 -101 65 417 399 -115 148 217 -195 69 -19 156 174 167 270 -243
2725 -243 -42 -45 130 -61 46 -10 89 132 -216 -71 160 -29 -58 68 -25 114 -25 128 -15 -116 -121 -38 55 59
2749 59 80 -81 -14 63 113 89 21 -329 -103 122 -25 160 118 138 29 -34 -57 -92 147 -170 -152 -202 -41 -70 -31
2774 -31 -79 -1 -245 22 77 5 106 215 -52 -84 97 45 -300 -215 76 -18 -167 37 -111 15 182 116 -92
$$ packed form
2618d08M12P8K62o90M62k79j05N84k33l30O46l73j54K56n39P09J6k17k58k32J44
2639b49l33Q96J14r1l23k83M30J57k57j31n7O79n30j15j54p7P92n89K02l42J84
2660g7l7J34p1K74k32l63R3J59K05K44k98J28l42L85q2k91Q3k10N07j10n37J12
2682c26N02k50L56K47j68j119J091q84N41K16P9J77q57J9K47M93k65j64J68l35
2702b32K26M3J67j7o17L34j2j82J89J66L52j8n14K63O9m12K64q8J75J8pJ03n13
2725b43K01lJ75j91J07n6R9M3l48J45K31j89k9J26r3J39j39J53j43j01nQ3R3M
2749E9K1j61O7P7N0k4o8l50K26K25j47J85m2K0j09o3k3l5K39l17J8n0J61k9L9
2774c1m8P8k44K67N5p2J01J09k67l2J81n2l45Q5K91r4j49K04j48J26J67o6k08
$$ plain form
2797 -92 -52 117 90 -55 -18 -216 202 17 -286 -217 -8 21 -177 97 -152 -55 57 -179 -4 -175 -35 -50 -111
2820 -111 65 -68 74 -31 115 1 -84 33 110 -38 228 147 -212 -135 -119 50 154 59 -40 -186 235 47
2842 47 -202 -42 -123 205 -201 -74 -35 12 -224 -87 140 -93 -101 -110 278 18 165 -62 -130 -100 79 -104 -74 -87
2866 -87 -212 77 95 -164 -46 180 -149 50 5 -9 -103 38 -212 114 114 139 -39 -234 -46 -142 75 -4 129
2889 129 209 -52 120 144 -102 -107 -20 78 102 -127 -287 10 15 115 -81 1 84 32 -270 89 153 10 -136 -350
2913 -350 -189 -147 122 -97 128 83 97 -30 101 -39 -215 -209 -95 3 -157 -89 82 -141 18 217 -274 -88
2935 -88 -80 67 119 233 111 -164 261 -10 -99 -47 107 115 -137 -254 54 -102 146 -37 -71 -16 119 -136 -16
2958 -16 82 -66 -126 148 -114 116 218 -124 -161 -89 100 -160 122 122 180 183 -85 -101 36 65 115 47 46 -21 -133 -40
$$ packed form
2797i2M0J69k7j45L7j98M18j85l03O9K09K9j98K74k49R7J12k36J75j71J40j5o1
2820a11J76j33J42j05J46j14q5J17P7j48K66q1l59P7J6J69J04r5r9j46M21j88
2842D7k49J60q1L28m06J27L9M7k36J37K27k33qrL88k60J47k27o8L0J79j83L0j3
2866h7j25K89J8k59J18K26l29J99m5j4r4J41k50L26%K5j78j95J88r6K17p9J33
2889A29Q0k61J72K4k46nQ7R8K4k29j60K97NJ00j96Q2Q3n2l02L59O4j43j46k14
2913c50J61M2K69k19K25m5J4j27J31j40j76OJ14R8j60O8J71k23J59J99m91J86
2935h8QJ47N2J14j22k75M25k71q9N2J54Qk52j17L08j56K48j83l4N5J35k55J20
2958a6R8j48o0K74k62K30J02l42l7P2J89k60K82%N8Lk68j6J37K9N0o8jo7j12R3
$$ plain form
2984 -40 104 -169 -41 48 -34 -42 -88 209 113 131 -87 210 98 -193 -87 -66 112 -74 176 -95 184 30 -55
3007 -55 74 -164 -43 46 -29 -236 -86 -11 58 -64 -181 182 147 -308 76 -296 75 -173 15 139 -68 31
3029 31 -78 23 139 127 -22 78 66 136 35 78 64 -55 30 -99 -29 -104 161 32 118 15 -99 -65 -170 17
3053 17 232 153 -76 -365 -25 48 94 194 -73 209 -60 76 -24 198 -108 51 -143 -178 -186 9 128 45 170
3076 170 -21 -117 -256 -54 77 263 71 -6 1 3 58 39 -254 172 -163 -206 105 -252 -17 48 -14 -80 195 -105
3100 -105 -55 101 -38 -175 69 -112 -24 35 -58 -134 -186 36 142 59 -113 35 114 34 -61 -117 216 256 -5 -39
3124 -39 53 22 39 -107 -53 -94 74 201 -49 -101 103 -187 67 110 229 -161 -93 54 -57 48 -37 -85 39 -21
3148 -21 -162 -130 148 25 30 100 -139 47 -132 -42 -54 22 -63 -11 11 -282 -155 47 29 159 38 -225 -82 -127
$$ packed form
2984d0J44k73J28Q9q2qm6K97r6J8k18K97j12k91J06K1J78j86K50k71K79j54q5
3007e5J29k38J21Q9p5k07J50P5O9j22j17L63l5m55L84l72L71k48J88J24k07R9
3029C1j09J01J16j2j49J00j2P0j01M3j4j19Q5j29P0p5K65j29Q6j03j14L4j05J87
3053A7K15p9k29k89L40P3M6J00k67K82k69J36j00K22l06J59j94l5qJ95J19q3J25
3076A70j91r6j39K02J31J86j92p7PKN5j9k93M26l35m3L11l57K35O5o2o6K75l00
3100a05N0J56j39j37K44j81Q8N9r3p6n2K22J06q3j72J48P9q0r5n6L33M0k61l4
3124c9R2l1J7j46N4m1J68J27k50n2K04k90K54M3J19l90O8J47j11J05q5m8J24o0
3148b1j41L2K78j23NP0k39J86j79R0j2P6q5N2K2k93J27K02j8J30j21k63J43m5
$$ plain form
3172 -127 99 -239 -92 56 -56 103 -242 199 71 -22 -49 149 -93 -73 68 138 -203 163 -61 45 178
3193 178 -6 118 228 -25 -46 -226 163 -19 -9 -161 201 363 -64 -117 136 346 -68 90 203 -106 21
3214 21 35 -118 131 -17 -25 70 -114 -111 42 41 13 62 -264 117 81 -14 141 -14 48 40 -12 -74 72 -235 134 113
3240 113 25 -138 -127 -10 15 -31 211 16 79 -95 -289 -16 -91 90 -118 276 -163 -86 -80 -114 -25 16 285 -236
3264 -236 -128 168 -11 32 -103 9 55 -1 42 125 -59 4 -1 226 -14 175 -38 -76 94 -26 39 -12 140 78
3288 78 -40 -264 -48 -87 37 -93 24 -147 -186 -95 177 24 -45 -175 -191 -73 -216 -177 86 -117 -179 86 136
3311 136 209 -227 227 -238 104 77 -88 275 92 2 -11 32 82 -233 -66 -135 111 -143 302 162 -212 -132 -139
3334 -139 -70 -98 89 60 -41 -29 18 -59 -204 223 122 -32 -124 140 100 95 90 8 285 182 -118 -59 0 -173 69
$$ packed form
3172a27K26l38J47J48j12J59l45M41j28r3k7J98k42K0J41P0l41L66k24J06J33
3193A78j84J24J10k53k1j80L89j82J0j52L62J62m27n3K53K10m14J58J13l09J27
3214B1J4j53K49j48qR5j84LJ53jk8M9l26L81l6r5J55j55O2qn2o2J46l07L69k1
3240A13q8j63J1J17K5m6K42j95O3j74j94K73p5J81k08L94m39P7Ol4Q9M1K69n21
3264b36J08K96j79M3j35J12M6n6M3Q3j84O3nK27k40J89k13l8J70j20O5n1J52o2
3288G8j18k24K16l9J24j30J17j71l9R1K72j53o9j30j6J18j43L9K63k03o2K65N0
3311A36P3m36M54m65L42k7j65L63j83r0j3M3N0l15J67o9K46k54M45j40l74Q0p
3334a39O9k8J87k9j01J2M7p7j45M27j01j54r2K64m0nnq2K77j03l00N9N9j73K42
$$ plain form
3359 69 63 173 93 56 38 -119 -192 26 -66 131 -107 67 191 65 110 23 -203 187 80 -46 66 127 -64 34
3383 34 -57 -2 -71 -26 -4 50 -4 181 -98 -1 -168 13 4 -37 93 22 -140 174 -9 34 -60 140 83 11 15 -207
3409 -207 -209 -150 236 59 196 95 175 205 139 9 91 -57 136 -56 -57 201 -44 -85 167 124 -38 17 247 194
3433 194 122 199 400 -169 120 -108 -166 -72 -68 -170 103 -85 -78 -8 -86 -72 -56 52 -92 32 35 47 -171 123 -111
3458 -111 218 -26 221 -123 -11 95 163 -60 -122 -37 -30 -288 144 -22 -205 141 5 177 -39 -124 -30 -156
3480 -156 -49 -113 -4 -150 253 17 87 -109 -25 -179 -226 -41 -70 -153 -11 -23 -11 64 30 216 -130 164 -264
3503 -264 -120 173 203 91 153 -70 -144 47 6 -110 96 -38 73 169 9 82 40 -36 -16 -90 -125 231 -171 -124
3527 -124 65 -117 98 -44 22 -42 84 142 -81 73 86 117 -34 96 204 187 5 66 377 -108 26 164
$$ packed form
3359F9oJ10q0l7j8j57p3K18r2J97k38J74J24j26M5q7k26L90j07j26J12O1j91R8
3383C4r1N5o9M5K2N4n4J85k79R7j67J81rm1J30p1j62L14j83M3r4K00n7p2Mk22
3409b07kN9L86j77J37j01Q0L0o6j30Q2j48J93j92jK58k45m1K52m3j62N5K30n3
3433A94p2P7K01n69K89k28n8R4Mj02K73j88PP0p8J4J6J08j44J24LJ2k18K94k34
3458a11L29k44K47l44J12J06O8k23o2Q5Pk58M32j66j83L46j36J72k16q5R4j26
3480a56J07o4J09j46M03k36P0j96Q4j54m7J85k9q3J42j2J2P5l4J86l46K94m28
3503b64J44K93L0j12O2k23p4J91m1j16K06j34J11R6j60P3m2p6K0p4l5L56m02M7
3527a24J89j82K15j42O6o4J26N8k23J54J3L1j51J30J08j7j82O1L11m85J34J38
$$ plain form
3549 164 16 8 162 -7 203 53 31 -1 238 -96 -6 -128 -245 -23 -42 -132 -117 -23 -166 11 -147 -35 -83
3572 -83 146 -71 -123 91 23 56 -71 46 -97 -50 -150 116 -37 -83 -53 102 -77 -182 203 177 24 -110 146
3595 146 -14 61 -146 -164 7 158 43 -24 -212 -31 -79 102 42 -14 152 -50 -59 64 -211 81 -49 -73 38
3618 38 -20 50 -51 -18 -121 -1 -151 -73 -8 -132 -80 238 -77 -41 64 -9 -76 -138 -61 -105 -116 88 -234 -29 25
3643 25 -218 210 19 -12 -81 -1 -18 311 328 363 108 -136 -183 41 37 -243 221 -2 84 -71 -12 6 180 -57
3667 -57 -74 -71 -33 210 -276 -210 -291 -10 -4 167 -196 31 -6 -49 119 -122 78 -108 -143 148 -131 -196 -44 -177
3691 -177 -114 30 150 2 -82 13 218 -88 -103 78 277 -51 -192 61 243 -62 113 236 66 -109 -99 -29
3713 -29 -61 -4 -90 31 161 -13 183 100 -67 -72 -251 154 -21 -39 -41 -61 -105 -34 104 -93 69 202 117 -113 -30
$$ packed form
3549A64j48qJ54j69K10j50k2l2K39l34R0j22j17K22j9r0J5R4j43J77j58J12m8
3572h3K29k17n2K14o8L3j27J17j43M7j00K66j53m6L0J55j79j05L85k6j53j34K56
3595A46j60P5k07j8J71J51j15o7j88J81m8J81o0n6J66k02rJ23k75K92j30k4J11
3618C8n8P0j01L3j03J20j50P8O5j24N2L18l15L6J05p3o7o2P7m4j1K04l22K05N4
3643B5k43M28j91l1o9Q0j7L29J7L5k55k44m7K24mk80M64k23Q6j55N9J8J74k37
3667e7j7LL8K43m86O6q1K81OJ71l63K27l7m3J68k41K00j86l5K91k79o5J52j33
3691a77O3J44J20j48q4R5K05l06j5J81J99l28j41K53J82l05J75J23j70j75J0P0
3713b9l2N7q6J21J30j74J96q3j67nj79M05j75j8kk0m4P1J38j97J62J33q5k30Q3
$$ plain form
3738 -30 -159 -17 145 100 -114 248 109 -4 -5 -40 5 -64 -53 280 318 -44 27 -164 -94 -147 -114 -169 -155 -193 32
3763 32 53 -58 113 206 -67 -68 43 -78 -80 -1 11 -336 -244 130 -16 95 181 126 -30 95 110 116 49 -206 97
3788 97 -65 26 221 -245 112 -171 103 13 -97 -64 93 146 45 -56 -45 -68 13 80 23 240 156 -51 -36 24
3812 24 102 -59 -14 4 -80 44 245 -129 -198 45 92 -82 245 114 -160 126 -105 -26 118 -265 65 -228 200
3835 200 -123 87 161 112 8 -174 -168 51 3 10 202 52 187 141 460 101 -5 105 -176 -32 212 78 66
3858 66 107 91 -332 266 177 -94 -147 121 -65 80 66 -131 -73 -154 -62 -129 -11 -135 95 -24 -91 -380 -56 94
3882 94 150 17 -53 -99 24 67 -64 184 167 53 65 -188 -36 -228 58 22 -94 25 42 -198 227 -212 21
3905 21 65 -90 65 -50 11 121 -6 -212 -120 -166 -187 -455 87 -50 5 -173 -205 25 119 -183 61 47 -110
$$ packed form
3738c0j29J42J62m5k14L62j39j13jl5M5o9J1L33L8l62P1j91P0n3L3n5J4l8K25
3763C2K1j11J71R3k73jJ11j21kP9J2l47R2L74j46J11Q6n5j56J25J5Oo7k55L03
3788I7j62R1J95m66L57k83K74r0j10L3J57N3j01j01J1k3Q1O7n7K17q4k07J5O0
3812B4P8j61M5J8q4J24K01l74o9K43M7j74L27j31k74K86k31P9J44l83L30k93M28
3835B00l23K10P4m9j04j82OK19m8PJ92j50J35m6L19l59j06J10k81J44K44j34j2
3858F6M1j6m23N98q9k71n3K68j86J45j4j97N8q1R2o7J18j24K30j19o7k89L24J50
3882I4N6j33p0m6J23M3j31K48j7j14J2k53J52j92K86l6j16J19J7k40M25m39K33
3905B1M4j55J55j15O1J10j27k06R2m6k1k68N42j37N5j78l2K30R4l02K44j4j57
$$ plain form
3928 -110 -87 -193 -85 -33 27 13 -33 -111 -101 -43 25 -34 -35 58 -86 -113 -210 61 66 236 29 93 4 47 108 -161 -31
3955 -31 -313 -111 -178 -70 29 -76 -22 -175 -160 68 82 -187 4 -217 21 39 52 207 -40 227 119 38 127
3978 127 305 162 -57 253 148 -171 169 -23 131 84 52 -16 -219 -137 84 131 48 42 94 -90 -104 112 -33
4001 -33 51 100 129 22 -195 151 43 30 -242 32 31 114 27 -101 177 -33 -118 136 -121 16 70 -191 209 57
4025 57 -284 73 57 -34 158 -104 -169 -224 47 -22 -35 -220 -70 199 -184 -89 -90 -112 52 134 -124 164 -8 -101
4049 -101 -119 -182 59 11 -117 173 17 347 -29 -1 -55 -145 -194 -157 75 -58 91 25 103 -182 -139 -40 -68 328
4073 328 347 -24 -90 -127 -243 -75 -125 210 62 -158 -33 104 105 -102 -57 -164 -8 7 -86 40 -117 338 202
4096 202 2 84 28 3 163 169 -143 205 -120 9 3 222 -190 59 128 223 80 -148 29 24 122 -66 9 -230
$$ packed form
3928a10K3j06J08N2O0j4m6p8J0N8O8n9jR3j44k7r7K71NJ70k07O4q9M3O1k69J30
3955c1k82K02o7J08R9j05N4j53J5K28J4k69J91k21K38J8J3J55k47K67j08q1Q9
3978A27J78j43k19L10j05l19L40j92J54m7l2o8k03Q2K21M7q3oN2j84j4K16j45
4001c3Q4M9K9j07k17L46j08j3k72K74jQ3q7j28K78k10q5K54k57J37N4k61M00j52
4025E7l41L57j6r1J92k62o5n5K71o9j3j85J50K69l83R5jk2J64Q2k58K88j72r3
4049a01j8o3K41m8j28K90j56L30l76K8n4r0m9L7K32j33J49o6P8k85M3R9k8L96
4073C28J9l71o6l7j16J68n0L35j48k20J25J37Jk07M5j07J56J5r3J26j57M55j36
4096B02k00Q2n6k5J60Ol12L48l25J29oK19m12K49O9R5j43k28J77nR8j88P5k39
$$ plain form
4120 -230 137 45 -98 -139 -213 -74 4 103 111 103 -12 -116 29 -144 68 -55 70 300 23 56 13 4 -3 -70 -1 -235
4146 -235 71 120 -35 -103 307 96 -15 138 109 26 166 -2 129 182 -96 204 -16 2 101 -130 -61 24 94
4169 94 -56 19 -125 54 -199 249 489 -38 29 -4 -77 -1 35 -60 163 -160 6 -53 0 -122 32 190 33
4192 33 -135 -227 87 -92 -67 138 96 -12 46 -36 45 164 -175 -191 -150 103 -141 132 24 -17 22 163 -121 160
4216 160 -4 -44 -38 53 55 -66 43 137 -10 60 -42 -65 74 167 274 118 16 163 15 -70 -122 121 -57 -91
4240 -91 -98 -38 -245 -71 30 88 -127 265 117 169 -154 3 -138 -58 54 -18 90 -124 73 -65 -163 -64 66
4263 66 22 -47 66 162 98 -20 85 -284 -99 -140 65 56 -33 -28 -72 95 113 46 132 97 100 -151 193 191 -20 229 120
4290 120 -202 -77 107 -69 37 -183 -74 203 56 54 25 -25 -9 69 -58 -171 -83 186 -253 -139 -57 61 -211
$$ packed form
4120b30L67r2j43m1p4J39P8R9Qqj15j04J45j73K12j23J25K30k77L3m3rpo7O9k34
4146b35L06M9j55o8M10k11j11J53k9q3J40j68J31N3k78L00k20J8R9k31O9Q5P0
4169I4j50P5j44J79k53M48K40n27O7l3p3P6L6r5K23l23J66n9N3j22J54J58j57
4192C3j68r2L14j79K5K05m2j08N8q2Q1J19l39j6M1K53k44K73j08m1L9J41k84K81
4216A60j64m0OR1Kj21J09R4j47P0j02k3J39R3J07j56j02J47j48q5n2K43j78l4
4240i1pO0k07J74J01N8k15L92j48N2l23J57j41Q0J12p2J08k14J97j38r8R9J30
4263F6m4o9J13R6o4j18J05l69J85m1K05rq9Nm4J67J8o7Q6l5Lk51L44kk11K49j09
4290A20l22J25J84j76J06k20J09K77j47kk9n0J6P8j27j13Q8K69m39J14Q2J18k72
$$ plain form
4313 -211 -131 74 -72 49 -153 -53 61 -25 54 -147 -12 24 -6 307 153 -81 49 172 161 118 183 155 -283
4336 -283 132 -144 65 16 38 71 257 40 76 -71 95 53 -10 -166 345 -38 -58 -98 -280 318 68 -33 234
4359 234 76 -163 60 -315 25 7 -96 -163 105 -219 64 141 31 140 79 -216 -5 50 175 145 124 -39
4381 -39 79 -57 -12 89 14 -282 14 -144 124 170 -75 -110 86 52 -30 433 -43 33 -145 -153 -101 -149 88 25
4405 25 -13 -171 -53 173 -139 97 -246 -6 223 16 84 156 8 -153 130 -485 226 -159 36 -155 -61 91
4427 91 -123 245 245 -241 -114 0 -357 296 130 -318 -91 -258 -163 212 -152 -122 158 45 -256 -132 -52 203
4449 203 478 123 -16 15 304 30 225 310 -47 -69 -26 7 -246 -4 -219 126 -108 119 146 -89 13 -8
4471 -8 -40 -35 20 65 -125 -186 69 30 -69 -104 156 -6 28 -51 147 80 67 181 -7 290 -49 179 -95 -83 -84 246
$$ packed form
4313b11Q0K05j46J21k02J00J14q6P9k01J35L6l0L13j54k34J30J23j1m3O5k8m38
4336b83M15k76K09m9K2L3J86k17L6j47J66m2o3j56N11l83k0m0j82N98k50j01K67
4359B34j58k39K23l75L40j8j03o7K68l24K83P7j10J09o1k95K11N5J25l0k1j63
4381c9J18j36M5J01p5k96K96j58K68M6k45l5J96l4q2M63m76P6j78qN2m8K37o3
4405B5l8j58J18K26l12K36l43K40K29k07O8P2j48j61K83o15P11l85J95j91R4J52
4427I1k14L68%m86J27J14l57O53j66m48K27j67R5L75l64L0K80j13l01J24Q0K55
4449B03K75l55j39L1K89k74J95Q5l57k2M3L3k53K42k15L45k34K27K7k35J02k1
4471hl2NN5M5j90o1K55l9r9l5K60j62L4p9J98o7j3J14j88K97l39K28k74J2jL30
$$ plain form
4497 246 30 73 94 38 -178 -1 103 -9 18 -70 -71 -60 -18 5 -15 189 47 -193 -224 61 105 -281 -38 -74 121
4522 121 85 241 -32 -46 181 212 80 11 104 57 115 189 -17 -41 -49 12 -160 253 -81 -38 181 31 36 68 142 165
4548 165 -15 -54 5 -102 -61 43 128 -88 130 7 15 134 -62 78 -113 -14 102 12 37 2 -233 121 -22
4571 -22 3 129 98 167 18 -226 -96 -23 113 -58 62 -222 -227 -47 73 69 140 -33 141 88 -20 -83 356 143
4595 143 -12 -2 -139 -124 -114 120 -11 -47 3 29 77 -74 -131 -16 193 11 -59 -31 117 163 32 -12 -228 23
4619 23 -98 249 125 -92 -40 4 37 -59 -94 -152 9 -64 61 -75 94 -113 -245 -95 -267 99 -23 8 -60
4642 -60 -47 -60 -87 32 -21 -107 -98 -126 83 -198 -191 131 43 182 -73 82 67 -36 -71 14 140 -7 126 -144 73
4667 73 -184 163 -6 -54 -108 229 -11 -60 -61 134 405 3 150 196 -70 155 -113 -43 14 29 49 8 68 -49
$$ packed form
4497B46k16M3K1n6k16J77J04j12K7q8jJ1M2K3k0K04j42k40l1K85M4l86K43l6J95
4522A21l6J56k73j4K27L1j32o9R3m7N8P4k06k4qO1j72M13l34M3K19j50NL2P4K3
4548A65j80l9N9j07M1J04Q5k16K18j23QJ19j96J40j91R9J16r0K5l5k35L54j43
4571b2K5J26l1O9j49k44J30P3J36j71J20k84nJ80J20mP1j73J74n3j08o3M39k13
4595A43j55J0j37J5J0K34j31l6N0K6M8j51n7J15K09j82p0K8J48M6j31m4k16K51
4619B3j21L47j24k17N2M4L3r6l5n8J61p3J25j36J69k07j32J50j72L66j22L1o8
4642f0J3j3k7J19n3q6Rk8K09k81PL22q8J39k55J55j5j03l5Q5J26j47J33k70K17
4667G3k57L47j69m8n4L37k40m9jJ95K71m02J47M6k66K25k68P0N7J5K0m1O0j17
$$ plain form
4691 -49 126 52 -54 281 225 -95 -8 -65 -257 64 113 -80 -44 9 211 94 -147 -10 -133 -6 -251 121 -155
4714 -155 -159 -61 159 -270 -171 -80 -288 -258 288 51 -245 -23 46 4 112 -106 -44 71 58 -13 -64 50 -43 -204
4738 -204 -59 -151 -325 -147 131 193 -149 -199 -113 124 -177 -136 18 -95 21 31 38 24 -79 -66 78 21 -178 240
4762 240 5 -195 -71 -24 78 -23 88 -101 -57 -13 -110 -98 86 155 19 97 -142 -50 -182 246 -124 216 -247
4785 -247 -136 -30 60 -56 -78 154 26 47 10 -121 183 186 -2 83 107 28 62 -45 -97 272 -75 123 16 108
4809 108 -20 66 -71 -85 89 -71 47 46 -60 175 160 150 -199 244 158 315 -95 -35 185 -120 66 39 -60
4832 -60 -30 8 110 -14 50 -35 97 1 3 -16 -100 89 -79 -41 -5 -91 -90 -10 -115 -116 61 303 27 -18 -84 175 -46
4859 -46 318 124 85 257 1 -135 -33 -40 -148 -90 80 -117 108 -76 115 115 106 228 43 -109 -71 -29 141 61
$$ packed form
4691d9J75p4j06L35n6l20Q7n7j92L21M9j93L6N3K02j17k41J37j23J27k45L72k76
4714a55mR8K20m29R9R1k08L0N46k37k96K22O9m2J08k18O2J15j3p1n1J14r3j61
4738b04J45r2j74J78K78O2l42n0Q6K37l01M1J54j13J16J0Pj4j03J3J44n7j99M18
4762B40k35k00J24M7J02j01J11j89M4M4r7J2J84O9j36P8k39R2j32M28l70L40m63
4785b47J11J06R0j16k2K32j28K1l7j31L04Lj88Q5K4p9L4j07n2L69l47J98j07R2
4809A08j28Q6j37j4J74j60J18jj06K35j5j0l49M43q6J57m10O0K20l05J86k7r9
4832f0L0L8J02j24O4q5J32r6Kj9q4J89j68L8L6q6JQ0j05jJ77K42k76m5o6K59k21
4859d6L64j94l9J72k56j36J02pj08N8J70j97K25j84J91%rJ22j85j52L8M2J70q0
$$ plain form
4883 61 197 -46 0 -14 50 -64 -126 8 25 -39 -2 31 161 70 -85 34 -49 154 3 33 70 25 137 -325 -40
4908 -40 -38 100 -113 -53 140 -144 26 37 -13 83 -176 -18 326 -189 -213 83 44 -23 194 95 40 338 13 -59
4932 -59 -1 -87 141 -161 22 37 155 -155 196 -73 225 -35 -16 -50 -16 37 15 -119 195 65 -229 0 179
4955 179 115 -26 -163 114 129 73 -9 -3 219 -84 -9 -71 45 53 -60 -285 -34 182 185 -165 -104 -222 51 2 26
4980 26 -54 -72 -10 57 -234 139 -134 -50 -45 16 -14 -109 -151 -108 -189 -249 61 258 -75 61 190 286 -120 302 90
5005 90 -142 -60 -168 -201 169 5 -104 -76 32 29 51 57 -209 2 146 -2 -109 -73 73 -169 111 -27 -80 108
5029 108 136 88 28 432 174 85 11 -134 -54 -44 47 -41 -48 -45 29 98 80 -158 145 -155 -27 13 -52 -68 86 132 -143
5056 -143 96 140 -187 148 212 -103 -343 -99 133 17 -5 73 19 108 45 48 -36 60 125 -254 127 27 25 10 -30
$$ packed form
4883F1J36k43M6j4O4j14o2J34J7o4L7L3J30r1j55J19q3K03j51L0L7m5J12m62K85
4908d0KJ38k13O0J93k84J70J1n0R6k59J58L44n15k4K96l9o7K17r9n5K98l25p2
4932e9N8q6K28l02J83J5J18l10L51k69K98k60J9l4L4N3k2j34L14j30k94K29J79
4955A79o4j41j37K77J5n6q2OK22l03P5o2J16Qj13k25K51K16Ll50O1j18K73m9K4
4980B6q0j8O2O7k91L73k73Q4NO1l0r5m2M3q1o0L10J97l33J36J29R6m06M22k12
5005I0k32Q2j08l3L70j64j09K8J08lK2Ok66K11J44j48j07L6J46k42K80j38n3J88
5029A08K8m8o0M04k58q9p4j45Q0J0R1q8pLP4O9j8k38L03l00J28M0o5j6J54M6k75
5056a43K39M4l27L35O4l15k40K44K32j16k2P8n4Q9o3Lq4R6O5l79L81j00kj5m0
$$ plain form
5081 -30 -166 -61 13 -59 197 37 -40 225 -119 -135 17 110 34 -177 124 -42 21 -93 -5 96 126 14 258
5104 258 86 3 112 -72 234 176 -33 92 56 36 -68 9 -92 10 78 182 -62 199 -65 91 103 49 -101
5127 -101 56 232 14 -19 127 -102 -202 -145 63 -44 -96 -69 -130 -104 -188 -101 126 208 102 207 75 -165 82
5150 82 -45 10 -28 -55 27 -1 -92 125 66 303 29 -91 -113 98 -49 2 244 84 109 322 240 -59 71 192
5174 192 232 -21 -99 -153 -99 -8 12 -139 73 -106 149 -58 -99 178 -186 70 -89 -181 -62 -96 118 47 -155
5197 -155 34 -87 82 42 -46 80 -136 81 132 45 51 -58 -48 -69 -265 17 -242 -21 -70 -100 -81 68 -200 94
5221 94 259 5 17 -40 30 21 99 20 119 -15 104 -6 -68 -41 -146 37 -65 11 -98 89 -242 -47 -7 100
5245 100 -54 -37 -109 -62 115 -124 -162 -58 -111 -70 -167 114 31 -213 -414 -92 67 363 -45 -57 84 -349 52
$$ packed form
5081c0j36J05P4p2K56j60p7K65l44j6J52R3p6k11L01j66O3j14Q8J01L0j12K44
5104B58j72q3J09j84L06n8k09J25l6k0j04P7j01J02O8J04k44K61k64J56J2n4j50
5127a01J57J76k18l3J46k29j00N7K08j07n2K7o1K6q4Q7K27Q2j06J05j32k40K47
5150H2j27N5l8k7Q2k8r1K17n9K37k74j20k2K11j47N1K42j60K5K13q2k99J30J21
5174A92M0k53p8n4N4R1K0j51K12j79K55k07m1K77l64K56j59r2J19l4K14p1k02
5197a55J89j21J69m0q8J26k16K17N1q7Oj09J0k1j96K82k59K21m9l0J9J49k68K94
5221I4J65k54J2n7P0rP8p9R9j34J19j10o2K7j05J83j02P6j09J87l31J95M0J07
5245A00j54J7p2M7J77k39l8J04n3M1r7K81q3k44k01L22J59K96m08j2J41m33M01
$$ plain form
5268 52 104 -249 -116 -105 -136 339 -234 -162 -206 -60 -55 151 -389 70 -9 69 -543 235 229 -162 -66 534 -196 -556
5292 -556 -255 -35 -107 93 -35 317 177 -358 450 100 -369 -138 40 -236 159 -537 307 -201 72 -63
5312 -63 98 217 -250 130 199 106 -77 10 140 104 3 -30 117 105 6 246 -14 -75 82 -318 -188 172 -92
5335 -92 305 66 -123 -170 5 -163 -160 32 -66 -174 -191 114 45 31 -14 13 76 -106 -51 -128 -122 7 -73 29 17 203
5361 203 -232 82 -220 -14 152 358 8 -193 -42 -89 -17 -254 -63 -10 -251 7 21 62 174 -11 183 -9
5383 -9 84 -111 -148 161 30 105 -5 -57 -57 -133 96 25 -9 -21 456 195 17 -60 85 131 -65 -49 -52 -156 270 -96
5409 -96 -31 -198 238 134 159 100 213 112 54 38 108 -48 -152 -101 -29 5 39 26 -37 44 -5 -125 -86 63 109 -42
5435 -42 15 -4 -134 -15 41 52 34 139 -82 55 -63 -14 -69 -136 -266 -107 -88 168 -61 111 40 -25 25 42 178
$$ packed form
5268E2N2l53J33J1l1M75n73P2m4J46NK06n40M59p9P8o12P78ol91R6O00p30l60
5292e56L01K20p2K00j28L52j40n35Q08l50m69K31J78k76L95o96Q44n08K73j35
5312f3J61J19m67L80O9r3j83Q7J30l6j01l3J47j2r9K40k60o1J57m00J30L60k64
5335i2L97k39j89m7J75j68LJ92r8j08j7L05o9j4m5K7O3j82N5p7OJ29q0J02j2J86
5361B03m35L14l02K06J66K06l50k01J51m7P2k37J91N3k41K58J4M1J12j85J94j92
5383iR3j95l7L09j31P5j10n2%p6K29p1l4j2M77k61j78p7J45M6j96J6lj04M26l66
5409i6O5j67M36j04K5n9J13j01n8j6P0j56j04N1P2L4L4j3o3Q1m9j20L9J49M6j51
5435d2N7j9j30J19N6J1j8J05k21J37j18M9n5o7j30J59J9K56k29J72p1o5N0J7J36
$$ plain form
5460 178 293 -118 -120 -162 34 45 -180 -115 -224 78 166 2 -13 -120 0 -89 28 151 41 -136 16 80 -139
5483 -139 -60 99 145 -77 105 126 69 24 -177 -112 25 -102 29 -14 100 95 45 163 29 102 -105 123 86 -103
5507 -103 -79 -173 -216 -87 155 74 -143 150 2 -19 -12 139 -143 -20 183 -88 -182 -55 137 132 44 39 44 -159 -92
5532 -92 63 64 11 -69 -188 -178 140 38 60 -242 22 84 62 258 -89 -60 169 36 -210 173 -29 20 169 -14
5556 -14 -38 -117 -237 -37 -96 73 -48 -83 45 124 114 41 -146 -51 159 -117 139 139 -48 107 -134 -169 81 306
5580 306 20 -43 -175 26 -14 -263 -98 -53 153 -98 -41 -78 175 -49 -22 80 -140 -63 50 -66 -127 97 -101
5603 -101 120 5 -90 68 -147 -268 -245 -270 131 369 -356 2 270 223 -32 -22 -206 130 -348 -309 178 -13
5625 -13 -100 221 24 -211 871 94 429 -399 -285 -66 1 -50 399 175 -402 -458 71 -342 92 75 -34 -155
$$ packed form
5460A78J15m11km2J96J1k25O5j09L02Q8j64j5j07J20q9J17J23j10j77J52O4k19
5483a39P9J59M6k22J82K1n7m5k01O5J37j27J31m3J14nn0J18j34P3k07K28l7j89
5507a03K4r4m3J29K42q1k17K93j48k1PJ51k82J23K03k71r4J27J92nq8nNk03O7
5532i2J55Jn3q0j19J0L18j02K2l02K64O2k2J96l47K9K29j33k46L83k02M9J49j83
5556a4k4p9j20K00n9J69j21l5J28P9j0p3j87R5K10k76K56%j87J55k41l5K50K25
5580C06k86o3j32K01m0k49J65M5K06k51N7l7K53k24K7J02k20P7J13j16o1K24j98
5603a01K21j15r5J58k15j21K3k5M01K38p25L58K68m7k55J0j84L36m78L9M87j91
5625a3q7L21j97k35J082p77L35q28J14K19O7n1M49k24n77n6N29m13M34j7j09j21
$$ plain form
5647 -155 -304 72 376 -207 -209 0 -521 411 793 6 -223 -401 53 -9 195 36 -229 -553 -112 -99 -753
5668 -753 -164 125 151 -152 -290 -329 -75 -389 215 165 25 -206 822 -189 706 132 -27 647 24 479
5688 479 282 1130 36 14 8 269 -382 -405 22 334 -121 348 347 -566 -244 -182 -531 -4 256 -265 726 -170
5710 -170 395 -113 80 508 290 -339 -267 -145 -315 -212 110 15 507 272 237 38 -210 441 170 -264 -144
5731 -144 -125 -79 -88 103 -142 -237 -21 146 -66 -48 120 -153 89 -215 -73 47 87 6 282 -131 119 -88 19
5754 19 -289 143 107 -226 123 -3 149 55 246 -74 -200 -25 90 -53 -116 18 -112 33 151 -101 175
5775 175 27 337 79 -230 190 -186 95 3 365 56 -12 -14 -4 -4 23 45 176 -64 125 190 -75 67 3 86
5799 86 164 82 64 -15 23 -1 -120 -113 104 -53 147 38 168 40 114 32 -38 194 216 2 83 -83 -13 136 -267
$$ packed form
5647a55j49L76L04n83kK09n21R32L82p87k29j78M54o2K04j59k65l24M41J3o54
5668g53N89K89K6l03j38l9K54l14O04n0j40k31J028j011Q95n74j59O74o23M55
5688D79j97Q48j094k2oK61o51k3M27L12m55M69jr13L22O2l49N27K60n21R91q96
5710a70N65n08J93M28k18o29P2J22j70J03L22r5M92k35l5j99k48O51k71m34J20
5731a44J9M6rJ91k45r5K16J67k12J8J68k73K42l04J42J20M0q1K76m13K50k07J07
5754A9l08M32l6l33L49j26J52r4J91l20j26J75J15j43o3J34j30J45J18k52K76
5775A75j48L10k58l09M20l76K81r2L62l09o8kJ0%K7K2J31k40J89O5k65J42o4Q3
5799H6P8q2j8p9L8k4j19PK17j57K00j09J30j28P4q2p0K32K2k14Q1j66P0J49m03
$$ plain form
5824 -267 -36 23 -44 -190 -178 -106 126 -6 -73 -86 147 243 -93 -239 30 -214 -210 -122 29 -15 -248 -59 -23 -84
5848 -84 -96 102 33 -53 -232 90 15 4 -173 1 -129 -37 110 -16 -52 191 -119 248 285 -58 103 146 191 39
5872 39 -59 -61 21 -175 104 -27 -182 269 -54 144 28 -109 -212 208 -91 -177 -105 134 24 -77 -52 -79 23
5895 23 -28 -110 -187 136 -34 22 -184 19 1 -187 160 252 -46 -65 -93 -13 111 121 -49 -6 -26 180 175 -42 -59
5920 -59 73 -30 77 -248 24 9 74 177 32 -162 -243 -208 -139 -38 212 -85 128 -99 45 128 91 159 -50
5943 -50 -107 2 -13 -132 -85 18 -79 89 15 -6 -180 -87 -39 96 -81 -110 53 -79 -34 58 -70 -117 -24 129 -145
5968 -145 -3 249 -80 223 144 36 116 -202 113 -4 -40 -199 -178 -75 -115 -37 39 45 -194 201 10 -171 -83
5991 -83 -96 -205 -11 -169 103 141 125 214 121 -6 45 20 -49 -260 -188 -130 130 69 167 -183 129 -17 60 -48 -91
$$ packed form
5824b67K31N9o7j46J2P2K32j32o7j3K33R6l36j46K69k44MQ8J51m4k33J89L6o1
5848h4j2J98o9q6j79L22p5j1j77J74j30R2J47j26l6K43l10L67L7l43J61M3M5j52
5872C9r8kQ2j96K79j31j55M51l23J98j16j37j03M20k99q6P2K39j10j01K5k7J02
5895B3n1q2p7L23j70N6k06K03j8j88L47R2k98j9k8Q0J24J0j70M3k0K06nk17j7
5920e9J32j03J07l25K72j5O5J03j45j94q1L5O9J01K50k97K13k27J44Q3l7O8k09
5943e0n7J09j5j19M7J03r7J68p4k1j74R3M8J35j77k9J63j32M5R2j28m7R3J53k74
5968a45J42K52l29L03p9j08Q0l18L15j17l6j59K1J03m0P8P6Ok39L95j91j81Q8
5991h3j3j09J94j58K72L8j6Q9r3j27N1k5o9k11P2N8K60o1R8l50L12j46P7j08m3
$$ plain form
6016 -91 175 104 32 67 39 111 17 -105 8 -154 -131 -61 48 32 -71 -25 -93 -36 -84 133 17 -46 -3 87 147 -65
6042 -65 -17 -58 155 133 3 27 184 47 145 85 -150 234 -90 27 -4 132 76 -169 -112 13 124 -202 12
6065 12 -301 38 124 270 -312 -157 -110 -150 -132 84 30 -42 -204 76 159 -65 -60 51 132 75 -79 -21 31 -181 267
6090 267 -96 -53 21 -18 417 -202 -203 -26 216 -114 -19 125 -90 78 -204 70 -578 171 126 182 -265 -70 160
6113 160 59 530 198 -291 -103 151 -386 174 291 -210 -229 55 609 -28 -161 219 -686 256 -42 -13 -136
6134 -136 -326 -186 -586 687 -174 -447 -752 56 -295 213 49 -602 50 -406 -224 338 105 235 -587 -226
6154 -226 -94 -18 -325 -131 177 189 -101 134 120 73 14 -6 34 -112 34 -7 16 -197 -101 276 -86 33 84 99
$$ packed form
6016i1K66p1p2L5k8P2r4j22J13j62K3P0J09j6j03M6o8N7m8K17j16o3M3R0O0k12
6042f5M8m1K13k2j30K4J57j37R8o0k35L84l24J17l1J36n6k45N7J25J11l26K14
6065A2l13L39Q6J46n82J55M7m0J8K16n4p2j62K80Q3k24NJ11Q1n7j54N8N2k12M48
6090B67l63M3P4l9M35o19jJ77K42l30R5J44k15J68k82K74o48P49m5N6m47J95K30
6113A60j01M71l32m89J88K54n37N60J17n01j9K84N54o37j33L80r05R42k98K9j23
6134a36j90J40m00J273q61k73l05Q08l51N08j64o51O52m56J82N62k33J30q22L61
6154b26J32P6l07J94L08J2k90K35j4m7n9k0M0j46J46m1K3k13R6L77l62J19N1J5
$$ [...]
8191I8
##END NTUPLES=NMR FID
##END=
