##TITLE=1H_Pr ABT-22
 CDCl3,8 sc, 
 11.02.2021
##JCAMPDX= 6.0         $$ Bruker NMR JCAMP-DX V2.0
##DATA TYPE= NMR FID
##DATA CLASS= NTUPLES
##ORIGIN= UXNMR, Bruker Analytische Messtechnik GmbH
##OWNER= root
$$ XWIN-NMR		Version 3.5
$$ Thu Feb 11 13:57:50 2021 Russian Standard Time (UT+4h)  she@DPX200
##.OBSERVE FREQUENCY= 200.1315066352
##.OBSERVE NUCLEUS= ^1H
##.DELAY= (6, 6)
##.ACQUISITION MODE= SIMULTANEOUS
##.ACQUISITION SCHEME= undefined
##.AVERAGES= 8
##.DIGITISER RES= 18
##SPECTROMETER/DATA SYSTEM= spect
##.PULSE SEQUENCE= zg30
##.SOLVENT NAME= CDCl3
##.SHIFT REFERENCE= (INTERNAL, CDCl3, 0, 15.7039)
##AUDIT TRAIL= $$ (NUMBER, WHEN, WHO, WHERE, WHAT)
$$ ##TITLE= Audit trail, XWIN-NMR		Version 3.5
$$ ##JCAMPDX= 5.01
$$ ##ORIGIN= Bruker BioSpin GmbH
$$ ##OWNER= she
$$ F:/spectra/data/she/nmr/H-F/1/audita.txt
$$ ##AUDIT TRAIL=  $$ (NUMBER, WHEN, WHO, WHERE, WHAT)
(   1,<2021-02-11 13:56:47.82 +0400>,<she>,<DPX200>,
      <created by zg, POWCHK disabled, PULCHK disabled
       configuration hash MD5:
       00 E9 B6 7A A2 85 ED C7 34 08 36 98 17 FE 4E 26
       data hash MD5: 16K
       75 26 F8 91 6B BA 68 18 AA 4C 8E A1 6E 95 E7 A2>)
$$ ##END=
$$ 
$$ hash MD5
$$ A2 9B F4 F4 31 CC EE 28 0E 13 7C 3C D4 67 A2 DD
##$RELAX= 
##$RELAX= 
##$RELAX= 
##$RELAX= 
##$RELAX= 
##$RELAX= 
$$ Bruker specific parameters
$$ --------------------------
##$DU= <F:/spectra>
##$EXPNO= 1
##$NAME= <H-F>
##$PROCNO= 1
##$TYPE= <nmr>
##$USER= <she>
##$AMP= (0..31)
100 100 100 100 100 100 100 100 100 100 100 100 100 100 100 100 100 100 
100 100 100 100 100 100 100 100 100 100 100 100 100 100 
##$AQSEQ= 0
##$AQ_mod= 1
##$AUNM= <au_zg>
##$AUTOPOS= <>
##$BF1= 200.13
##$BF2= 200.13
##$BF3= 200.13
##$BF4= 200.13
##$BF5= 200.13
##$BF6= 200.13
##$BF7= 200.13
##$BF8= 200.13
##$BYTORDA= 1
##$CFDGTYP= 0
##$CFRGTYP= 5
##$CHEMSTR= <none>
##$CNST= (0..31)
1 1 145 1 1 1 1 1 1 1 1 1 1 1 1 1 1 1 1 1 1 1 1 1 1 1 1 1 1 1 1 1 
##$CPDPRG= <>
##$CPDPRG1= <>
##$CPDPRG2= <>
##$CPDPRG3= <>
##$CPDPRG4= <mlev>
##$CPDPRG5= <mlev>
##$CPDPRG6= <mlev>
##$CPDPRG7= <mlev>
##$CPDPRG8= <mlev>
##$CPDPRGB= <>
##$CPDPRGT= <>
##$D= (0..31)
0 1.2 0 0 0 0 0 0 0 0.06 0 0.03 0 0 0 0 0.0002 0 0 0 0 0 0 0 0 0 0 0 0 
0 0 0 
##$DATE= 1613037407
##$DBL= (0..7)
120 120 120 120 120 120 120 120 
##$DBP= (0..7)
150 150 150 150 150 150 150 150 
##$DBP07= 0
##$DBPNAM0= <>
##$DBPNAM1= <>
##$DBPNAM2= <>
##$DBPNAM3= <>
##$DBPNAM4= <>
##$DBPNAM5= <>
##$DBPNAM6= <>
##$DBPNAM7= <>
##$DBPOAL= (0..7)
0.5 0.5 0.5 0.5 0.5 0.5 0.5 0.5 
##$DBPOFFS= (0..7)
0 0 0 0 0 0 0 0 
##$DE= 6
##$DECBNUC= <off>
##$DECIM= 32
##$DECNUC= <off>
##$DECSTAT= 4
##$DIGMOD= 1
##$DIGTYP= 9
##$DL= (0..7)
0 120 120 120 120 120 120 120 
##$DP= (0..7)
150 150 150 150 150 150 150 150 
##$DP07= 0
##$DPNAME0= <>
##$DPNAME1= <>
##$DPNAME2= <>
##$DPNAME3= <>
##$DPNAME4= <>
##$DPNAME5= <>
##$DPNAME6= <>
##$DPNAME7= <>
##$DPOAL= (0..7)
0.5 0.5 0.5 0.5 0.5 0.5 0.5 0.5 
##$DPOFFS= (0..7)
0 0 0 0 0 0 0 0 
##$DQDMODE= 0
##$DR= 18
##$DS= 0
##$DSLIST= <SSSSSSSSSSSSSSS>
$$ [...]
##$SUBNAM2= <"">
##$SUBNAM3= <"">
##$SUBNAM4= <"">
##$SUBNAM5= <"">
##$SUBNAM6= <"">
##$SUBNAM7= <"">
##$SUBNAM8= <"">
##$SUBNAM9= <"">
##$SW= 16.9725356469052
##$SWIBOX= (0..15)
0 0 2 0 0 0 0 0 0 0 0 0 0 0 0 0 
##$SW_h= 3396.73913043478
##$TD= 16384
##$TD0= 1
##$TE= 0
##$TE2= 300
##$TE3= 300
##$TEG= 300
##$TL= (0..7)
0 120 120 120 120 120 120 120 
##$TP= (0..7)
150 150 150 150 150 150 150 150 
##$TP07= 0
##$TPNAME0= <>
##$TPNAME1= <>
##$TPNAME2= <>
##$TPNAME3= <>
##$TPNAME4= <>
##$TPNAME5= <>
##$TPNAME6= <>
##$TPNAME7= <>
##$TPOAL= (0..7)
0.5 0.5 0.5 0.5 0.5 0.5 0.5 0.5 
##$TPOFFS= (0..7)
0 0 0 0 0 0 0 0 
##$TUNHIN= 0
##$TUNHOUT= 0
##$TUNXOUT= 0
##$USERA1= <user>
##$USERA2= <user>
##$USERA3= <user>
##$USERA4= <user>
##$USERA5= <user>
##$V9= 5
##$VALIST= <valist>
##$VCLIST= <CCCCCCCCCCCCCCC>
##$VD= 0
##$VDLIST= <DDDDDDDDDDDDDDD>
##$VPLIST= <PPPPPPPPPPPPPPP>
##$VTLIST= <TTTTTTTTTTTTTTT>
##$WBST= 1024
##$WBSW= 4
##$XGAIN= (0..3)
0 0 0 0 
##$XL= 0
##$YL= 0
##$YMAX_a= 195146
##$YMIN_a= -350051
##$ZGOPTNS= <>
##$ZL1= 120
##$ZL2= 120
##$ZL3= 120
##$ZL4= 120
##$ABSF1= 10
##$ABSF2= 0
##$ABSG= 5
##$ABSL= 3
##$ALPHA= 0
##$AQORDER= 0
##$ASSFAC= 0
##$ASSFACI= 0
##$ASSFACX= 0
##$ASSWID= 0
##$AUNMP= <proc_1d>
##$AZFE= 0.1
##$AZFW= 0.1
##$BCFW= 1
##$BC_mod= 2
##$BYTORDP= 1
##$COROFFS= 0
##$CY= 11.3945322036743
##$DATMOD= 1
##$DC= 2
##$DFILT= <>
##$DTYPP= 0
##$F1P= 15.9154993809931
##$F2P= -4.1035820241983
##$FCOR= 0.5
##$FTSIZE= 0
##$FT_mod= 4
##$GAMMA= 1
##$GB= 0.15
##$INTBC= 1
##$INTSCL= 1
##$ISEN= 128
##$LB= 0.24
##$LEV0= 0
##$LPBIN= 0
##$MAXI= 10000
##$MC2= 0
##$MEAN= 0
##$ME_mod= 0
##$MI= 1.114404
##$NCOEF= 0
##$NC_proc= 0
##$NLEV= 6
##$NOISF1= 3.799351
##$NOISF2= 2.8
##$NSP= 1
##$NTH_PI= 0
##$NZP= 0
##$OFFSET= 15.70392
##$PC= 1
##$PHC0= -10912.78
##$PHC1= 9.600943
##$PH_mod= 1
##$PKNL= yes
##$PPARMOD= 0
##$PSCAL= 0
##$PSIGN= 0
##$REVERSE= no
##$SF= 200.130013532006
##$SI= 16384
##$SIGF1= 3
##$SIGF2= 2
##$SINO= 400
##$SIOLD= 16384
##$SREGLST= <1H.CDCl3>
##$SSB= 0
##$STSI= 0
##$STSR= 0
##$SW_p= 3612.71676300578
##$SYMM= 0
##$S_DEV= 0
##$TDeff= 0
##$TDoff= 0
##$TI= <>
##$TILT= no
##$TM1= 0
##$TM2= 0
##$TOPLEV= 0
##$USERP1= <user>
##$USERP2= <user>
##$USERP3= <user>
##$USERP4= <user>
##$USERP5= <user>
##$WDW= 1
##$XDIM= 8192
##$YMAX_p= 0
##$YMIN_p= 0
$$ End of Bruker specific parameters
$$ ---------------------------------
##NTUPLES= NMR FID
##VAR_NAME=  TIME,          FID/REAL,        FID/IMAG
##SYMBOL=    X,             R,               I
##VAR_TYPE=  INDEPENDENT,   DEPENDENT,       DEPENDENT
##VAR_FORM=  AFFN,          ASDF,            ASDF
##VAR_DIM=   8192,          8192,            8192
##UNITS=     SECONDS,       ARBITRARY UNITS, ARBITRARY UNITS
##FACTOR=    0.0002944,     1,               1
##FIRST=     0,             0,               0
##LAST=      2.4114304,     0,               0
##MIN=       0,             -350051,         0
##MAX=       2.4114304,     195146,          0
$$ Real data points
##PAGE= N=1
##DATA TABLE= (X++(R..R)), XYDATA
$$ plain form
0 0 0 0 0 0 0 0 0 0 0 0 0 0 8 -8 8 -8 8 -8 16 -16 17 -24 24 -32 37 -40 48 -56 64 -72 83 -92 105 -116 132
35 132 -148 165 -186 205 -229 254 -280 309 -341 377 -414 457 -502 552 -608 670 -737 815 -902
54 -902 1000 -1110 1241 -1393 1574 -1792 2062 -2408 2863 -3483 4378 -5771 8166 -13026 26353
69 26353 -129689 -350051 195146 42781 -182023 50853 -32576 -109590 6580 3011 22318
80 22318 -38097 -101504 18838 91854 -44625 -132145 44639 42212 -122293 28579 44049
91 44049 -122228 16126 66082 -42465 11916 -15278 726 62650 -34110 -21514 25394 -14391
103 -14391 -9493 -24564 -3241 8949 -58843 11279 29058 -60543 14338 29917 -25246 -2777
115 -2777 -2755 15551 7983 -33686 -878 4267 -7898 4077 -18976 3307 -6043 -7931 48526 -21865
$$ packed form
0@%%%%%%%%%%%%Qj6J6j6J6j6K4l2L3m1M8n6O9p7Q8j04J20j36J55j75J97k21K48
35A32k80L13l51L91m34M83n34N89o50P18p91Q71r59J054j160J278j407J552j717
54i02J902k110K351k634K967l366L854m470N271o346P861j0149J3937k1192L9379
69B6353j56042k20362N45197j52365k24804K32876q3429p7014J16170l569J9307
80B2318o0415o3407J20342P3016j36479q7520J76784k427j64505J50872J5470
91D4049j66277J38354M9956j08547N4381k7194J6004O1924r6760J2596M6908l9785
103a4391M898j5071K1323J2190o7792P0122J7779q9601P4881J5579n5163K2469
115b777K2J8306p568m1669L2808N145j2165J1975k3053K2283r350j888N6457p0391
$$ plain form
129 -21865 -34429 48836 -1853 -10961 23839 -37845 -5787 30967 -22150 -8896 -8187 -17701 14895
142 14895 8744 -13040 -11732 4294 14325 1610 3783 -8837 -18114 31078 3369 -29637 18261
155 18261 -8307 -12604 33860 -9457 -18703 20964 -550 4436 11494 -13690 -1510 8339 -959
168 -959 -9478 -4105 -1797 -15194 1868 6248 -22762 -387 10129 -19868 5045 5839 -18857 4580
182 4580 572 -14005 3246 -782 -11994 -2315 514 -2838 -3150 3153 -2599 -7055 12054 1112
196 1112 -9026 8248 -3155 -6089 12009 -5177 -10924 6792 -1798 -2219 4132 -3945 -4234 5057
210 5057 5142 -4223 -264 2850 -4648 3817 6744 -11347 -1397 8528 -6389 1796 4650 -7866 2177
225 2177 7911 -2655 831 2815 -3411 3064 5500 -3828 -3613 4979 -1571 -2929 6492 -2851 -5516
$$ packed form
129b1865j2564Q3265n0689r108L4800o1684L2058L6754n3117J3254P09r514L2596
142A4895o151k1784J308J6026J0031j2715K173j2620r277M9192k7709l3006M7898
155A8261k6568m297M6464m3317r246L9667k1514M986P058k5184J2180R849r298
168i59q519N373K308j3397J7062M380k9010K2375J0516k9997K4913P94k4696K3437
182D580m008j4577J7251m028j1212R679K829l352l12O303n752m456J9109j0942
196A112j0138J7274j1403k934J8098j7186n747J7716q590m21O351q077k89R291
210E057Q5r365L959L114p498Q465K927j8091R950R925j4917Q185K854j2516J0043
225B177N734j0566L486J984o226O475K436r328K15Q592o550j358R421r343k665
$$ plain form
240 -5516 6941 1197 -3718 4910 -1681 -2859 6056 -1050 -3347 2906 -1440 -3014 4638 86 -5370
255 -5370 2488 2717 -2946 2048 2549 -4578 1748 3752 -3082 551 954 -3699 1814 2787 -4219 62
271 62 2213 -2581 1332 3087 -3057 -1143 3669 -1117 -928 2148 -2275 -1593 3269 -864 -2523 2201
287 2201 -1055 -1318 3346 -491 -2620 2281 666 -1557 2232 -369 -2449 1801 972 -1947 928 367
303 367 -2248 2029 1592 -2453 629 1729 -1783 1031 1765 -2629 78 1909 -1503 -202 1210 -1944
319 -1944 -47 2051 -1404 -609 1483 -1095 -521 2018 -1313 -1599 1680 -801 -1168 1316 -1050 -1591
335 -1591 1612 -350 -1397 1075 -485 -1278 1353 215 -1885 744 353 -1493 722 234 -1732 390
351 390 768 -1359 526 393 -1430 593 778 -1334 -27 853 -889 -37 890 -994 -471 971 -328
$$ packed form
240e516J2457n744m915Q628o591j178Q915p106k297O253m346j574P652m552n456
255e370P858K29n663M994N01p127O326K004o834L633M03m653N513R73p006M281
271F2K151m794L913J755o144J914M812m786J89L076m423O82M862m133j659M724
287B201l256k63M664l837k129M901j615k223L789k601k080M250q29k919K875n61
303C67k615M277m37m045L082J100l512K814P34m394K707J831l412J301J412l154
319a944J897K098l455P95K092k578N74K539l331k86L279k481l67K484k366n41
335a591L203j962j047K472j560p93K631j138k100K629l91j846K215m88j966K122
351C90L78k127J885j33j823K023J85k112J307Q80j742Q52R27j884N23J442j299
$$ plain form
368 -328 -488 1136 -754 -432 1198 -719 -533 996 -505 -475 1358 -274 -665 540 88 -347 674
385 674 211 -710 672 344 -656 621 280 -950 1023 373 -1031 363 381 -358 540 561 -522 -211
403 -211 414 153 -10 104 -543 157 928 -126 -294 759 -424 -95 1123 -472 -179 939 -61 -160
421 -160 257 68 -26 300 -53 -523 -182 753 -571 -60 -5 -719 209 81 -672 488 62 -154 357 -392
441 -392 -492 559 -9 -152 92 -16 -55 35 274 65 -314 588 63 162 345 -395 217 768 -381 6 345
462 345 -233 -16 36 -331 -163 81 -69 -110 73 24 16 659 -31 -426 741 302 -598 551 79 -195 638
483 638 65 -133 30 -201 300 126 -115 -92 407 375 -1 -55 469 -143 128 484 -417 -119 80 -255 201
504 201 233 -258 441 209 -319 348 -158 126 152 -179 -256 -401 194 126 -472 240 -4 -154 175 111 0 113
$$ packed form
368c28j60J624j890L22J630j917J86J529j501L0J833j632l91J205m52m35J021
385F74m63r21J382l28j000J277l41j230J973o50j404J394J8p39Q98K1j083L11
403b11O25k61j63J14o47P00P71j054j68J053j183L29J218j595K93J118j000r9
421a60M17j89r4L26l53m70L41R35j324N11N5p14R28j28p53J160m26k16N11p49
441c92j00J051n68j43K44j08l9R0K39k09l79R02n25R9J83p40O12N51j149L87L39
462C45n78K17N2l67J68K44j50m1J83m9qO43o90l95J167m39r00J149m72k74Q33
483F38n73j98J63k31N01j74k41K3M99l2l76n4N24o12K71L56r01K98J99l35M56
504B01L2m91O99k32n28O67n06K84K6l31p7j45N95o8n98P12k44j50L29o4j11J13
$$ plain form
526 113 -89 17 208 -85 53 -263 -77 -259 -524 280 -171 -285 -364 -280 -26 243 5 -66 187 -349 242
547 242 412 -149 20 -147 -175 -282 -323 -55 -315 -36 276 -64 -115 -23 -331 -70 -414 15 114 68 -203 -27
569 -27 -181 336 119 -514 -97 168 137 198 2 -532 79 338 213 -285 -37 -170 -227 112 -28 276 185 251
591 251 113 120 -84 -130 -231 -27 371 83 276 71 162 295 -149 31 152 128 -26 183 161 103 -96 -26 -125
614 -125 44 64 43 15 -57 -290 421 59 109 244 -137 168 -21 3 -26 80 -182 92 -46 -257 -20 13 199
637 199 -594 -3 -15 143 -185 167 -7 -17 114 -102 25 -302 -52 -397 50 272 9 74 122 61 -3 -40 277
660 277 108 6 -38 -1 98 -80 -45 11 55 -63 -54 -17 -3 -86 -25 40 75 88 -1 26 -68 50 100 88 64 161 30 41
688 41 163 84 -90 108 -7 44 98 195 92 204 140 -130 -109 157 -12 -33 -88 265 23 161 -8 163 -125
$$ packed form
526A13k02J06J91k93J38l16J86j82k65Q04m51j14p9Q4K54K69k38p1K53n36N91
547B42J70n61J69j67k8j07m1K68k60K79L12l40n1R2l08K61l44M29R9m6k71J76
569b7j54N17k17o33M17K65l1O1j96n34O11K59j25m98K48j33n7L39j40L04r1O6
591B51j38Pk04m6j01K04L98k88J93k05R1J33m44J80J21k4j54K09k2n8j99P0r9
614a25J69K0k1k8p2k33P11l62N0J35l81L05j89K4k9J06k62K74j38k11K37L3J86
637A99p93N91j2J58l28L52j74j0J31k16J27l27K50l45M47K22k63O5M8o1o4l7L17
660B77j69j02m4L7R9j78L5N6M4j18RL7J4q3O1O5L5J3q9K7r4J18N0j2k4R7j31J1
688D1J22p9j74J98j15N1N4R7j03J12o4k70K1K66j69k1n5L53k42J38j69J71k88
$$ plain form
711 -125 -27 -111 -91 -106 124 61 13 99 15 79 76 -70 -82 152 -21 -4 -15 107 -44 -34 16 -19 -34 -48 60 -142 62
738 62 54 -93 41 33 5 16 61 -16 26 -15 39 30 -13 -9 -7 -41 -52 77 48 54 39 -12 7 16 14 -33 42 -36 8 0 9 -60 -52 61
772 61 2 -18 -33 -7 -24 -37 -27 -43 -32 -2 -74 -46 14 -5 5 2 -52 39 -9 -26 6 37 4 -11 19 -88 27 17 -55 -15
802 -15 -2 -33 -36 -2 -47 -8 -44 19 -84 48 -7 -22 9 -6 -6 -9 -18 12 8 -30 -16 21 -35 -35 19 -17 32 26 -14 -27 14 -3 7
835 7 57 25 16 21 13 -6 -12 -39 -41 29 11 -35 31 25 -36 7 -25 33 -2 -29 -22 47 -42 -10 29 48 -11 -13 13 7 -54 16 -27 -72 57
870 57 -29 -11 55 -7 -37 16 -33 -17 -6 28 -50 -9 -53 5 -18 34 -30 -19 -12 -30 39 13 -31 -18 33 -69 -7 -33 -33 -10 -12 -20
902 -20 -4 26 8 -8 47 -21 -21 -46 -7 12 29 26 22 -30 -41 -14 22 30 -26 -21 -17 -30 3 -49 -24 -64 35 -45 -14 -7 -50 3 32 11
936 11 43 -36 -50 -1 -6 17 21 -38 -38 -2 5 7 3 -1 -2 30 3 27 -7 15 7 -20 -20 -18 -17 38 -7 -3 -26 -93 6 -50 12 7 -8 38 -57 53
$$ packed form
711a25R8q4K0j5K30o3m8Q6q4O4lj46j2K34j73J7j1J22j51J0N0l5j5j4J08k02K04
738F2qj47J34qk8J1M5p7M2m1N4rm3MKl4j1J29k9Oj5n1J9Rkm7P5p8M4qRo9QJ13
772F1n9k0j5K6j7j3J0j6J1L0p2K8O0j9J0ln4R1m8j7L2L1l3j5L0j07J15j0p2M0
802a5J3l1lL4m5L9l6O3j03J32n5j5L1j5%lrL0ml8J4L7n6%N4l6M9om0j3M1j7J0
835GN0l2rNqj9ok7kP0j8m6O6oo1M3l2N8l5k7PO9q9L2L9J9n9kK6oo1P0m3m5J29
870E7q6J8O6o2l0N3m9J6J1L4p8M1m4N8k3N2o4J1Pj8O9k6m4J3N1j02O2k6%K3kq
902b0J6L0j8j6N5o8%k5L9J9J7lmn2j1K7L6Qn6NMj3L3n2K5m0R9q0L1Pm3N3K9k1
936A1L2p9j4M9nK3Mn9%L6PKmmjL2k7K4l4K2qk7%KJN5m5Mk3o7R9n6O2nj5M6r5J10
$$ plain form
974 53 -37 -12 -10 36 -11 48 25 40 5 -22 39 3 -2 -34 -16 21 -7 35 38 -50 75 12 3 21 56 26 20 18 -11 13 -24 -4 -34
1007 -34 -11 -29 24 -20 -38 -81 20 -131 -76 61 -20 23 -62 -103 54 248 43 74 -245 -52 -100 -319 14 116 -81
1032 -81 115 -131 123 167 -124 -77 64 157 -174 -42 70 99 -56 241 -238 -165 134 -190 0 -179 108 283
1054 283 -71 -243 34 -131 104 33 -6 -121 223 -11 -6 -34 -164 18 109 19 61 38 96 -45 -30 28 45 -64
1078 -64 23 -27 11 36 14 -51 -41 -13 22 -50 48 -47 -68 -31 -10 1 33 -14 23 -3 -19 -2 -3 -13 47 -39 -33 87 -54 -8
1108 -8 3 -2 -1 -31 -8 44 34 -6 18 27 -15 8 2 49 -9 21 -19 0 38 -34 -16 -11 -1 -3 71 -11 -1 -17 13 18 38 34 33 28 -19 -2
1144 -2 40 45 -27 7 51 -22 11 -25 10 44 13 -8 -43 44 -63 -18 -29 -30 -37 18 1 -22 -5 9 -26 -4 51 -17 -32 -17 -66 -10
1176 -10 64 335 64 224 -120 80 112 21 364 27 -113 237 49 -83 -29 42 114 24 19 -61 -12 -15 34 -12 -11 -17 -44
$$ packed form
974E3r0K5KM6m7N9k3J5l5k7O1l6nl2J8L7k8M2Lq8J25o3rJ8L5l0okk9K4l7K0l0
1007c4K3j8N3m4j8m3J01j51N5J37q1M3q5m1J57J94k05L1l19J93m8k19L33J02j97
1032h1J96k46K54M4k91M7J41R3l31J32J12K9j55K97m79P3K99l24J90j79K87J75
1054B83l54j72K77j65K35p1l9j15L44k34Nk8j30J82R1r0M2k3N8j41J5N8J7j09
1078f4Q7n0L8K5k2o5J0K8L5p2R8r5k1L7K1J1L2m7L7k6j6J7jj0O0q6OJ20j41M6
1108hJ1nJl0K3N2j0m0K4Rm2K3oM7n8L0m0J9L8p2J8NJ0kP4q2J0j6L0NK0mjnm7J7
1144bM2Np2L4M4p3L3l6L5L4l1k1l5Q7j07M5j1jpN5j7k3J7J4l5K2N5o8j5J5m9N6
1176a0P4K71k71J60l44K00L2r1L43l37j40L50j88j32N4P1P2r0nq0M9lM9m6Jok7
$$ plain form
1203 -44 1 -24 11 4 -45 -31 -31 -46 -58 -24 -13 -21 -21 -16 -24 2 -13 -9 11 1 14 2 32 -32 29 16 -17 64 -21 -7 8 25 -27 -15
1237 -15 -4 46 -28 10 -27 -68 12 -96 75 23 -161 15 -99 -111 -11 -39 19 96 126 -52 108 -67 -164 -102 11
1262 11 33 116 -25 -34 -31 36 -71 267 -117 26 15 55 -24 49 50 -234 -198 -99 245 -34 122 -181 -113 45 188 41
1288 41 -122 72 46 13 -67 -346 90 95 -87 -225 49 -33 170 -113 -78 -212 84 -70 73 -146 -11 119 112
1311 112 -64 1 150 88 -1 -42 129 172 132 -43 -188 6 31 -135 -108 -135 -13 -31 213 69 -39 24 9 73
1335 73 71 -44 38 35 -14 12 37 -57 119 12 -58 -51 -28 5 -5 -13 40 -18 -84 24 -7 84 -101 -26 1 1 -6 -63 -24 54 66
1366 66 5 -6 5 -2 -38 -61 -119 -42 -72 44 -14 -77 62 76 -3 28 9 -54 30 18 75 -3 -40 16 -7 25 40 -25 28 11
1396 11 -16 -3 -30 18 -56 -1 24 -21 12 -4 -43 -35 16 14 2 -86 4 -11 -2 11 7 34 -18 -15 1 -21 7 40 -8 15 0 64 42
$$ packed form
1203d4M5k5L5pm9J4%j5j2L4J1q%NqK6j5MK0j0J3j2L0o4O1j3l3Q1q5J4J5J7n2J2
1237a5J1N0p4L8l7m1Q0j08J71n2j84J76j14j2J00k8N8P7L0j78J60j75r7O2J13
1262A1K2Q3j41rLO7j07L38l84J43j1M0p9P3Jk84L6R9L44k79J56l03O8J58J43j47
1288D1j63J94k6l3q0k79M36Nj82j38K74q2K03k83L5j34K96j54J43k19J35J30p
1311A12j76O5J49o2q9m1J71M3m0j75j45J94K5j66K7k7J22j8K44j44j08O3j5O4
1335G3kj15Q2lm9K6K5r4J76j07p0PK3L3j0qN3n8o6J08l1R1j85P5K7%pn7L9P8J2
1366F6o1j1J1pl6k3n8P7l0J16n8o3J39J4p9L1j9o3Q4j2N7p8l7N6k3L2J5o5N3j7
1396A1k7J3k7M8p4N5K5m5L3j6l9QN1kj2q8R0j5RJ3mK7n2LJ6k2K8L3m8K3j5O4k2
$$ plain form
1429 42 27 -6 27 -23 2 -5 -18 -30 9 1 3 21 37 0 -91 -4 -49 6 8 -6 -39 -21 19 -30 -7 -3 -48 -30 -36 -15 14 27 0
1462 0 -37 -26 -15 -15 13 21 -30 -19 25 -10 -28 -50 10 -31 -12 -7 28 19 20 -18 -38 13 25 10 6 -30 2 17 -7 74 -17 -38 10 -42
1496 -42 5 -35 35 -16 -64 -35 -21 45 21 50 13 -23 -12 9 28 25 7 -22 -24 -63 -44 -43 22 2 -48 9 -24 31 15 20 -32 -49
1528 -49 4 7 -3 -9 10 12 -5 44 23 38 33 2 -12 24 34 4 -10 20 14 -9 33 -20 0 9 4 25 14 -49 -13 14 -21 -6 -32 7
1562 7 -13 -18 31 -13 -6 2 -21 -12 -4 -45 -70 34 -31 -95 10 -26 102 -74 -59 88 -85 -22 17 -143 141 95 126 9 -65
1591 -65 200 -143 157 134 17 -371 162 -320 -144 58 38 6 15 14 60 -12 20 51 22 -18 23 -22 -13 12 16 -10 -21 -21
1619 -21 11 -2 33 -89 -13 -38 14 59 55 -7 -32 33 -4 -34 -48 -4 4 -17 -14 -55 25 26 6 -16 -45 -54 -22 -53 22 -20 40 -36
1651 -36 28 -8 44 -35 71 8 80 45 464 396 66 171 -102 22 34 42 -44 6 5 30 28 1 6 46 52 -4 48 -3 26 6
$$ packed form
1429D2j5l3L3n0K5pj3j2L9qKJ8J6l7r1Q7m5N5Kj4l3J8M0m9K3Mm5J8oK1K9J3k7
1462@l7J1J1%K8Qn1J1M4l5j8k2O0m1J9NL5rJl8k0N1J2j5ml6L2J5k4Q1r1k1M8n2
1496d2M7m0P0n1m8K9J4O6k4K9l7l6J1K1J9lj8k9kl9J9JO5k0n0N7l3N5j6Nn2j7
1528d9N3Lj0oJ9Kj7M9k1J5nl1j4L6J0l0j4L0ok3M2n3K0RnK1j1o3L6K7l5J5k6L9
1562Gk0nM9m4PQk3RQm1k5J04o5o4J05l6J28j76J5J47j73O3L9j60K84m6L1j17p4
1591f5K65l43L00k3j17l88N33m82J76K02k0l2RjM6p2L2L1k9m0M1m5RK5Mk6j1%
1619b1L2j3L5j22P6k5N2M5mo2k5O5l7l0j4M4Qk1Lm1Q0Jk0k2k9rL2l1P5m2O0p6
1651c6O4l6N2p9J06o3P2l5M19o8l30J05k73J24J2Qq6N0jK5kk7NM0On6N2n1K9k0
$$ plain form
1681 6 -1 57 -52 -52 -9 8 16 64 -46 -22 -6 36 50 22 6 24 -9 -8 15 28 -12 13 15 53 36 -53 45 17 22 31 60 -28 -37 -14
1715 -14 -8 0 17 -22 -41 16 -6 -34 -3 -17 -11 9 3 -25 28 -52 -36 -3 35 -8 12 19 18 56 26 -20 -13 -1 35 -7 37 -2 10 -1
1749 -1 9 14 13 -14 50 -30 17 17 -59 -20 2 -19 31 -9 11 -15 7 -35 6 31 -3 2 17 -1 -19 27 4 60 5 -43 31 44 28
1782 28 -51 -45 -8 30 45 -48 3 -22 -11 -34 -8 32 -21 -26 31 -6 -28 -7 -31 -13 21 -4 -30 -35 2 -81 -19 -17 8 -13 -22 1 7
1815 7 -1 -20 11 -36 -54 -7 -29 9 14 26 -12 -26 18 31 46 36 4 -13 -36 -1 -39 0 43 -14 12 -43 -22 -13 -11 -28 -37 16 -22
1848 -22 -38 34 6 -12 -4 36 -2 -20 3 2 46 -49 -18 54 -12 -46 37 52 7 -5 2 30 -18 -39 2 28 -42 3 4 29 3 1 -22
1881 -22 3 -46 4 10 11 -19 -14 -43 -28 -19 27 0 -27 -10 11 -10 40 13 -27 -26 42 -12 7 19 6 10 -22 3 15 53 5 -64 -13
1914 -13 -30 6 4 -39 0 4 9 25 -21 -38 -35 -7 -18 9 -26 -34 -23 -33 -36 -32 -24 -28 -21 0 6 15 -11 34 69 -13 30 -25 -5 -15 17 -20
$$ packed form
1681FpN8j09%M3J7QM8j10K4J6M2J4k8j6J8l3JK3J3m0K5KL8j7q9R8k8NRK9q8rK3
1715a4OQJ7l9j9N7k2k8L1j4OK0ok8N3q0J6L3L8m3K0PjL8l0m6PJ2L6m2M4l9J2j1
1749aJ0Njk7O4q0M7%p6L9K2k1N0m0K0k6K2m2M1K5l4NJ5j8j8M6k3N6n5m8P4J3j6
1782B8p9OL7L8J5r3N1k5J1k3K6M0n3nN7l7k2K1k4J8L4k5k6nL7q3O2KK5k1rK3O
1815Gqj9L1m7j8M7k2L8NJ2l8j4M4J3J5j0l2j7k3L5l8L9M3n7K6n5K1RKj7rN3l8
1848b2j6P2k8j8QM0l8j8K3jM4r5L1P2o6l4Q3J5m5j2PK8m8k1M1K6p0M5JK5k6kk3
1881b2K5m9N0OJl0Nk9J5RM6k7k7J7K1k1N0k7m0JO8n4J9J2j3Ml2K5J2L8m8o9N1
1914a3j7L6km3L9MNJ6m6j7LK8j1K7l5qJ1j0lMQmPK1ORk6M5L5q2M3n5K0j0L2l7
$$ plain form
1950 -20 -22 -11 -26 -40 -24 -58 -29 -22 -34 -28 -18 -73 15 -14 -15 -43 -50 7 11 -8 -2 35 -35 -13 30 -22 -44 47 -15 33 47 -26 15 -41
1984 -41 -1 2 15 -34 -18 17 40 -18 -60 20 25 25 -15 -29 10 -13 11 4 -19 -17 -29 -31 -47 -10 -2 28 -2 -5 82 -24 -31 -42 63 -18
2018 -18 10 13 23 9 11 -13 -78 -1 -1 6 -15 6 12 -16 -8 30 16 -4 17 42 42 11 9 -8 -30 -5 36 53 -10 -22 -14 24 -9 -21 -3
2053 -3 -2 0 0 -25 27 -18 16 40 13 14 35 -58 30 31 -30 11 -46 -13 -32 -22 -30 -24 26 -9 14 -6 -2 -24 -6 -26 13 13 -14 -16 13 -4
2089 -4 -5 10 18 48 -34 15 36 -24 35 27 0 -15 -49 45 8 21 42 10 -4 -28 21 -56 -21 -33 -19 7 5 5 -29 -53 24 -2 -10 -2
2123 -2 -31 -12 -54 76 -36 -9 2 -45 -10 -23 6 -6 30 -12 -26 2 -5 11 27 46 0 61 -25 -17 30 -2 -12 -41 55 4 29
2154 29 -12 22 -2 14 -19 -12 -46 4 -15 30 64 3 -56 -19 -2 22 -3 -9 -66 -39 -46 -29 -3 55 92 -66 -133 -118 -17 -89 -121
2185 -121 105 51 -17 35 -128 -198 -171 -165 164 -15 132 -9 145 -57 -85 22 -121 -49 -6 -112 -154 11 -172 -10
$$ packed form
1950b0kJ1j5j4J6l4K9Pj2OJ0n5Q8k9jk8pN7Mj9OL7p0K2M3n2k2R1o2M8J4p3M1n6
1984d1M0LJ3m9J6L5K3n8m2Q0N%m0j4L9k3K4pk3Kj2kj6L7QL0l0lQ7j06pj1J05q1
2018a8K8LJ0j4Kk4o5P7%Pk1K1Ok8QL8j4k0K1K5%l1kj7k2K5M1J7o3j2QL8l3j2J8
2053cJK%k5N2m5L4K4k7JK1r3Q8Jo1M1n7L3j9J0qON0l5K3k0Mk2J8k0L9%k7kK9j7
2089djJ5QL0q2M9K1o0N9qk7j5l4R4l7J3K1l2j4k4M9p7L5j2J4K6k%l4k4P7k6qQ
2123bk9J9m2J30j12K7J1m7L5j3K9j2L6m2j4K8pJ6J6J9m6O1q6QM7l2j0k9R6n1K5
2154B9m1L4k4J6l3Pl4N0j9M5L4o1n9L7J7K4k5on7K7pJ7K6N8L7j58o7J5J01p2l2
2185a21K26n4o8N2j63p0K7OL29j79J47j41J54k02k8J07j43P2M3j06m2J65j83J62
$$ plain form
2209 -10 -258 8 -232 133 -48 61 163 416 -150 16 -16 -32 32 85 -269 -31 29 -218 -149 -74 -91 -131 18
2232 18 -208 142 -19 -140 42 71 -97 -132 16 -20 -18 0 -54 43 -64 37 -55 -12 6 -7 30 62 45 28 10 -3
2258 -3 25 25 40 -1 -25 46 -34 43 28 24 7 23 -10 2 13 6 -13 -15 -1 -20 -2 35 -33 -63 -78 3 21 8 19 43 -18 -51 0
2291 0 20 40 20 16 8 51 -3 7 26 -6 10 -11 55 42 12 7 -18 -16 9 -6 5 6 -29 11 -51 11 -31 -84 -47 -6 52 -15 50
2324 50 -50 11 -63 29 -98 43 15 -24 -2 -77 14 -15 157 1 -35 51 27 -87 157 51 -94 -50 108 95 -108
2349 -108 -96 -78 -14 -68 135 120 -76 37 -106 -131 -242 -157 60 -141 -157 189 -30 -98 12 31 105 63 -62 -73
2373 -73 -5 -1 45 13 99 68 106 259 -90 111 -6 6 12 80 -43 2 -25 11 -29 93 17 -28 -11 -30 63 -23 -14 -30 20
2402 20 -27 -10 -36 -36 47 -30 8 -3 21 -7 -13 -26 24 -42 5 -12 18 26 32 -19 -39 50 -34 1 -26 6 -29 18 20 -69 44 36 8
$$ packed form
2209a0k48K66k40L65j81J09J02K53n66J66l2j6O4N3l54K38O0k47O9P5j7m0J49
2232A8k26L50j61j21J82K9j68l5J48l6KJ8n4R7j07J01r2M3J8j3L7L2j7j7j8j3
2258cK8%J5m1k4P1q0P7j5mj7J6l3J2J1pj9kJ4j9J8L7o8l0j5Q1J8j3J1K4o1l3N1
2291@K0K0k0mqM3n4J0J9l2J6k1O6j3l0nk5KK5j5J1Jl5M0o2O2m2n3L7M1N8o7O5
2324E0j00O1p4R2j27J41k8l9K2p5R1k9J72j56l6Q6k4j14K44j06j45M4J58j3k03
2349a08J2J8O4n4K03j5j96J13j43k5j11Q5K17k01j6L46k19o8J10J9P4m2j25j1
2373g3O8MM6l2Q6l1L8J53l49K01j17J2OO8j23M5k7L6m0J22p6m5J7j9R3q6Rj6N0
2402B0m7J7k6%Q3p7L8j1K4k8oj3N0o6M7j7L0QOn1k0Q9q4L5k7L2l5M7Kq9J13qk8
$$ plain form
2435 8 -41 -24 -52 7 -44 2 -17 -45 -27 -29 9 -20 5 12 31 8 -37 29 29 -3 8 -15 25 31 -40 -31 12 -49 14 37 21 8 -2
2468 -2 31 -22 -31 -33 -13 -1 -13 -3 -10 -21 -16 8 -15 -13 -5 -37 21 -42 34 26 -6 -67 -39 7 -35 -16 24 31 -16 -27 -52 -19 19 -11 86
2503 86 -109 -51 14 8 36 33 -58 -97 67 5 122 100 -54 219 -53 -170 51 -123 62 28 -127 -36 -82 -129 -220 213
2529 213 109 -144 232 -173 -117 -10 -95 77 -375 -27 74 -112 -40 175 14 -39 -5 -87 -109 -113 -50 -92 -14 20
2553 20 94 20 12 -55 -15 -45 -28 -17 41 -21 3 -20 -2 -2 17 26 45 -9 16 7 -4 23 3 17 -26 -16 18 -4 9 -24 17 -37
2585 -37 36 7 39 -29 2 -5 -18 -38 -16 -28 -28 7 -43 22 -42 -11 18 18 -15 -15 12 21 -16 9 3 41 6 17 33 27 -32 15 11 14 30
2620 30 -21 -25 -3 13 -24 -9 6 11 -11 16 1 23 -35 32 4 -33 34 -3 -19 -29 -8 16 7 -35 23 -2 2 -46 -33 38 -12 26
2652 26 22 -11 -7 1 -16 21 -24 -58 -4 -40 18 -43 13 -10 -2 -28 17 -17 37 -25 2 -5 -46 -78 -19 20 32 -34 -38 -177 -146 128
$$ packed form
2435Hm9J7k8N9n1M6j9k8J8kL8k9K5PJ9k3m5O6%l2J1k3M0Op1RM3o1O3K3j6j3j0
2468bL3n3rkK0J2j2J0pj1NK4k3KQl2N8o3P6ql2o1K8M6m2J9M0Pm7j1k5L3L8l0R7
2503H6j95N8O5oK8lr1l9J64o2J17k2j54K73k72j17K21j74J85l4j55R1m6m7r1M33
2529B13j04k53L76m05N6J07q5J72m52L48J01j86P2K15j61n3L4q2k2mO3m2P8L4
2553B0P4p4qo7M0l0J7J1N8o2K4k3J8%J9RJ9n4K5rj1K7k0J4m3J0L4k2J3l3M1n4
2585c7P3k9L2o8L1pj3k0K2j2%L5n0O5o4L1K9%l3%K7Rl7K5oL8l5J1J6on9M7mLJ6
2620C0n1mK2J6l7J5J5Nk2K7j5K2n8O7k8l7O7l7j6j0K1K4rm2N8k5Mm8J3P1n0L8
2652B6ml3MQj7L7m5l4N4l6N8o1N6k3Qk6M5l4N4o2K7pm1l2N9L9J2o6mj39L1K74
$$ plain form
2684 128 4 -130 -125 117 83 -22 -388 -215 49 161 -7 28 44 -40 5 19 43 63 52 -46 -9 77 -23 -45 -51 62
2710 62 -39 29 -48 69 147 -8 -8 -76 48 -11 -78 -12 -42 155 -15 -43 25 32 2 145 -31 -98 -89 140 -30 72
2736 72 48 10 118 -90 87 -91 228 -25 235 -29 -194 137 -172 -6 -160 -25 93 -135 28 12 -65 -94
2758 -94 -73 -74 154 45 -13 -58 -384 114 -121 -130 -256 -159 137 -111 5 182 14 66 23 -133 273 -83 -106 61
2782 61 167 -135 -94 -129 4 -210 229 246 17 -207 -158 495 -78 -164 224 133 -301 -262 479 -114 -200 58 -183
2805 -183 188 -103 -89 275 178 -228 0 -60 -129 -207 15 -252 247 -8 -127 140 395 29 89 261 8 -306
2827 -306 -276 159 -36 88 11 34 -126 28 -208 -81 282 -46 -35 37 -240 -25 -2 28 -10 -29 44 -16 -16 7 3
2852 3 16 -4 42 -39 29 -27 43 -2 26 39 -8 -38 -31 -53 -7 -7 -54 -280 47 47 -32 13 -25 13 -98 -34 44 -27 -34 10 -61
$$ packed form
2684A28j24j34NK42l4j05l66J73K64J12j68L5J6q4M5J4K4K0j1r8L7Q6j00k2oJ13
2710F2j01O8p7J17P8j55%o8J24n9o7O6l0J97j70k8O8Pl0J43j76o7RK29j70J02
2736G2k4l8J08k08J77j78L19k53K60k64j65L31l09J66j54J35J18k28J63j6p7k9
2758i4K1jK28j09n8m5l26M98k35rj26R7K96k48J16J77j68N2m3j56M06l56k3J67
2782F1J06l02M1l5J33k14M39J7k29k24M9O53n73q6L88r1m34L9P41n93q6K58k41
2805a83L71k91J4L64r7m06K28o0o9p8K22k67M99k55j19K67K55l66O0J72k53l14
2827c06L0M35j95J24p7K3j60J54k36J27L63l28J1P2k77K15K3L0l8j9P3o0%K3m
2852CJ3k0M6q1O8n6P0m5K8J3m7l0Pk2M6%m7k26L27%p9M5l8L8j11O4P8p1pM4p1
$$ plain form
2883 -61 -6 52 101 -25 51 95 32 46 -49 45 15 19 -148 140 4 -15 40 148 101 -61 -60 -63 -34 93 -56 -24 -58 -6
2911 -6 -96 -58 152 -248 -153 149 88 -31 10 31 -274 -63 2 91 -110 64 202 -96 -137 26 22 -250 201 132 92
2936 92 -38 -51 -16 -60 43 -138 10 -31 99 -103 139 9 59 10 126 -222 526 326 267 -195 -23 58 663
2959 663 -135 160 214 133 -98 -198 104 -369 519 141 332 -16 28 138 -343 -157 99 -49 181 -13 275
2980 275 149 -160 -202 103 216 3 -447 -240 335 -268 -82 282 -145 -430 -392 180 -314 33 -19 4 168
3001 168 -155 78 229 -89 -93 130 -232 308 -142 -72 -76 -57 251 -12 8 59 97 -142 -219 69 -121 -103 -64 -115
3025 -115 28 -23 186 -177 15 126 -194 -96 -93 247 77 31 100 86 -52 -218 274 58 -133 36 30 -105 -73
3048 -73 -96 -211 -131 -19 -31 -69 24 1 26 -47 -55 75 -22 101 -69 108 -18 -156 -89 -15 24 -34 84 181 -87 130
$$ packed form
2883f1N5N8M9j26P6M4o3J4r5R4l0Mj67K88j36j9N5J08m7j62JlK9J27j49L2l4N2
2911fr0L8K10m00R5L02o1j19M1K1l05K11O5Q9k01J74J38k98m1J63mk72M51o9m0
2936I2j30j3L5m4J03j81J48m1J30k02K42j30N0m9J16l48P48k00n9m62J72Q1O05
2959F63p98K95N4q1k31j00L02m73Q88l78J91l48M4J10m81J86K56j48K30j94K88
2980B75j26l09m2L05J13k13m50K07N75o03J86L64m27k85L8N72m94L47n2K3J64
3001A68l23K33J51l18mK23l62N40m50P0mJ9L08k63K0N1L8k39p7K88j90J8L9n1
3025a15J43n1K09l63J92J11l20R8LL40j70m6O9j4j38j66M92k16j91J69oj35L2
3048g3k3j15Q0J12j2l8R3k3K5p3qJ30r7J23j70J77j26j38O7P4L9n8J18R7k68K17
$$ plain form
3074 130 85 -118 74 -18 -168 -45 129 -47 35 -84 18 143 107 66 106 -48 16 40 126 55 -60 57 -47
3097 -47 22 121 71 77 38 25 -12 11 47 -82 -295 -36 56 -52 63 16 -107 -42 50 36 -10 -67 30 60 88 -10 -49 -46
3125 -46 39 68 -59 -130 -83 57 29 43 14 19 -75 16 -29 -87 42 -71 1 -123 24 -22 19 -77 40 4 -113 -9
3151 -9 85 -97 30 -8 -9 -25 -91 -51 -35 -16 1 141 -22 38 102 -124 146 72 56 17 -60 59 -71 44 124 -62
3177 -62 -160 -5 81 -37 -11 52 -33 15 71 66 -194 16 88 -51 48 -127 53 52 -3 -32 71 1 -26 28 -50 9 6 28
3205 28 13 -35 -87 -10 35 -48 -60 23 111 -57 11 -16 55 35 -27 117 2 -40 137 -11 -83 82 -56 -33 17 34 51
3232 51 -39 24 -42 77 21 -38 0 -63 64 52 22 -85 41 -149 65 94 127 -118 -45 -263 -176 42 -186 -85 162
3257 162 -76 365 -55 -104 120 114 -4 -112 146 -46 -26 73 64 -190 38 -12 -13 -240 -16 32 113 50 11 -102 -101
$$ packed form
3074A30m5k03J92r2j50J23J74j76Q2j19J02J25l6m1M0j54O4K4Q6p1j15J17j04
3097d7O9R9n0Ol9j3l7K3L6j29k13K59R2j08J15m7j23O5R2j4m6n7R7L0K8r8l9L
3125d6Q5K9j27p1M7J40k8J4k9Nr4R1m5n8J29j13P2j24J47m6M1r6J17l6j17J04
3151iR4j82J27l8jj6o6M0J6J9J7J40j63O0O4k26K70p4j6l9p7J19j30J15Q0j86
3177f2r8J55Q6j18K6O3q5M8N6nk60K10P2j39R9j75J80jn5k9J03p0k7N4p8N9lK2
3205B8j5m8n2P7M5q3j2Q3Q8j68O8k7P1k0o2J44j15m2J77j48p2J65j38K3N0J7J7
3232E1r0O3o6J19n6n9L8o3J27j2l0j07J26j90K14K9L3k45P3k18Q7K18k28J01K47
3257A62k38M41m20m9K24oj18j08K58j92K0R9rk54K28n0jk27K24M8Q1o3l9j13J
$$ plain form
3282 -101 -120 3 29 54 87 -43 59 -155 -98 17 47 -104 -26 -172 178 -88 -10 50 23 -16 -191 -10 116 -88
3306 -88 -25 91 50 35 64 -60 -199 -149 -104 -143 -92 -24 119 31 250 52 76 107 -129 118 38 11 60 10 -161 25
3332 25 -201 -79 80 34 62 -161 170 33 -38 -55 39 -47 100 -47 138 127 -5 203 200 -182 34 -199 28
3355 28 249 111 202 -119 -100 14 138 25 199 188 -115 150 -33 -224 -76 -98 91 138 -80 72 2 -345
3377 -345 220 -88 -280 167 160 173 242 41 -365 -101 -289 -13 -125 228 -73 195 -133 177 -96 312 -383
3398 -383 70 -156 66 -402 -168 62 76 146 -295 -326 41 58 -186 -20 250 -171 -236 61 9 154 -284 -89
3420 -89 -260 11 -3 -131 -109 67 -84 3 -159 -70 -3 -59 -103 -124 -3 24 8 -70 -149 -41 30 121 -85 -51 49
3445 49 25 -6 25 47 20 -14 52 33 -18 -34 17 -3 -22 29 17 -46 -44 -9 -36 -9 18 36 -16 -17 -24 10 -40 -6 -6 31 -50 43
$$ packed form
3282a01j9J23K6K5L3j30J02k14N7J15L0j51P8j46L50k66P8O0k7l9j75J81J26k04
3306h8O3J16m1j5K9j24j39N0M5l9N1O8J43q8K19j98K4L1k36K47q0k7M9n0j71J86
3332B5k26J22J59m6K8k23L31j37p1j7R4q6J47j47J85j1j32K08ll82K16k33K27
3355B8K21j38R1l21J9J14J24j13J74j1l03K65j83j91J48k2J89M7k18J52p0l47
3377c45N65l08j92M47pJ3O9k01m06K64j88K76j12L53l01K68l28L10k73M08o95
3398c83M53k26K22m68K34K30J4P0m41l1L67J7k44J66K70m21o5K97n2J45m38J95
3420h9j71K71j4j28K2J76j51Q7j62Q9O7n6m4k1J21K7j6p8p9J08P1R1k06L4J00
3445D9k4l1L1K2k7l4O6j9n1j6N1k0j9N1j2o3KL5k7K7K7J8n2jpL4n0L4%L7q1R3
$$ plain form
3477 43 -39 -2 -24 -14 20 77 -1 44 -28 64 -8 99 101 -25 112 1 15 124 96 -154 -39 7 24 -73 5 -35 131
3504 131 75 3 110 -286 189 -60 -87 234 -24 -215 199 -13 143 -145 -102 -105 168 55 -260 133 162 152 -81
3527 -81 -212 185 110 5 -16 417 185 155 242 134 14 146 -225 -279 -226 -139 42 -193 -49 -42 28 85 326 -221
3551 -221 26 214 -495 86 308 252 -259 -159 -5 -170 153 -123 108 232 -124 115 -20 169 235 -199 -86
3572 -86 97 162 54 116 -166 249 408 126 -74 403 205 59 -192 102 139 -48 87 -130 79 53 56 96 331
3595 331 -285 196 -82 -352 -90 41 253 -26 -20 298 284 240 -40 -28 -146 -46 3 109 76 37 1 -320 64
3618 64 122 112 -144 -262 23 19 -103 -124 226 -82 -120 175 -166 190 280 -36 -121 -119 34 265 -63 -56 58 1 -97
3643 -97 445 119 212 242 326 30 -125 132 55 -293 -113 -176 -256 -105 59 35 119 151 12 117 -64 283 91
$$ packed form
3477D3q2L7k2J0L4N7p8M5p2R2p2J07Kj26J37j11J4J09k8k50J15M6J7r7P8m0J66
3504A31n6p2J07l96M75k49k7L21k58j91M14k12J56k88M3lK73j13l15L93K9j0k33
3527h1j31L97p5j05k1M33k32l0Q7j08j20J32l71n4N3Q7J81k35J44PP0N7K41n47
3551b21K47J88p09N81K22n6n11J00J54j65L23k76K31J24l56K39j35J89O6m34J13
3572h6J83O5j08O2k82M15J59k82k00M77j98j46k51K94L7j87J35k17K09k6LM0K35
3595C31o16M81k78k70K62J31K12k79OL18j4m4k80J2j18J00M9J06l3l9l6l21L84
3618F4N8j0k56j18K85mj22k1L50l08l8K95l41L56R0l16q5KJ53K31l28PJ14n7r8
3643i7N42l26R3L0Q4k96j55K57p7l48J80o3q0J51J64k4Q4L2j39J05j81L47j92
$$ plain form
3666 91 97 -53 228 -462 5 185 -289 79 -91 18 154 -152 448 -244 -312 -412 -334 184 340 298 41 291
3688 291 8 305 -128 -127 323 0 -238 15 48 237 -142 -3 53 -203 31 358 -121 -93 -68 25 430 -231
3710 -231 110 148 -338 283 -150 -48 28 -310 -10 -30 60 286 -32 -94 171 -257 -36 399 -235 -55 87 -183
3732 -183 -40 -245 -47 -100 12 -255 177 -147 184 -120 -255 14 69 -128 292 -401 -335 88 -68 486 119
3753 119 -185 -90 168 -421 248 -406 448 -174 -205 10 -192 -147 -49 26 299 83 -90 504 -228 55 -166 154
3775 154 182 257 -168 -405 -181 133 96 -134 -354 329 -75 -26 -126 73 122 -33 -39 91 36 189 -104 -74 128
3798 128 -43 -85 11 59 -8 -88 256 286 -147 -55 26 -163 -23 0 -317 46 -131 77 -268 -179 168 157 -238 -9
3822 -9 -161 -243 206 -166 -143 7 -24 -5 -15 56 -100 -59 63 16 45 18 96 -80 11 -6 -8 -20 64 -9 -25 10 -12 -14
$$ packed form
3666I1Oj50K81o90M67J80m74L68j70J09J36l06O00o92o8j00P8N18J56m2k57K50
3688B91k83K97m33JM50l23k38K53L3J89l79J39N6k56K34L27m79K8K5R3M05o61
3710b31L41L8m86O21m33J02P6l38L00k0R0K26l18o2K65m28K21M35o34J80J42k70
3732a83J43k05J98n3J12k67M32l24L31l04j35K69N5j97M20o93O6M23j56N54l67
3753A19l04R5K58n89O69o54Q54o22l1K15k02M5R8P5K73k16j73N94p32K83k21L20
3775A54K8P5m25k37K24L14l7k30k20O83m04M9j00J99M9j55oJ30n5J53k93L0K02
3798A28j71m2R6M8o7q0L44L0m33R2Q1j89J40K3l17L63j77K08l45Q9L47j1l95K29
3822ij52q2M49l72K3J50l1J9j0P1j56M1J22m7K9k7P8j76R1j7kj2Q4p3j6L5k2k
$$ plain form
3850 -14 26 -7 32 -60 -20 14 -16 -54 -23 28 -26 -56 -11 -34 -11 52 44 19 38 -21 -15 8 -76 46 26 23 -2 -33 31 -106 31
3881 31 -16 -19 -3 71 -32 -82 4 48 33 20 105 -181 85 -7 -42 29 -40 30 -173 -220 -6 5 -28 -36 -66 -80 -18 24 -16
3910 -16 34 36 25 26 21 -1 26 11 13 -21 5 -14 16 25 1 37 21 46 -12 19 -38 9 1 14 -37 -82 -14 25 -4 29 -2 -35 -30 -18
3944 -18 9 60 -38 17 -3 46 -16 -65 -18 38 -71 -6 -38 -33 10 -11 -21 -9 38 21 -48 33 -5 23 34 49 82 -47 4 -33
3974 -33 47 -33 -37 23 -115 -37 50 -2 -64 14 -5 91 -111 -44 4 -90 8 -56 -1 32 2 -155 50 28 -86 6 89 96 35
4003 35 -21 53 23 -75 25 -59 50 11 -120 132 287 -1 -50 136 20 19 -25 -67 75 11 115 45 162 39 -113
4028 -113 -82 16 -188 -46 88 43 -122 47 83 -147 -28 -176 125 149 72 111 77 16 -26 -133 15 148 80 198
4052 198 -44 -44 140 -40 -112 -16 49 -79 17 -51 88 272 105 -16 119 11 3 187 166 120 92 -264 161 -80
$$ packed form
3850a4M0l3L9r2M0L4l0l8L1N1n4l0M5k3K3O3qk5J9n9OK3q4J22k0lk5l1O4j37J37
3881C1m7lJ6P4j03n0Q6M4j5j3Q5k86K66r2l5P1o9P0k03m7K14J1l3ql0j4O2M2m0
3910a6N0Kj1Jnk2K7j5Kl4K6j9L0Rk4L6j6K5n8L1n7M7qJ3n1m5O8L9k9L3l1l3NJ2
3944a8K7N1r8N5k0M9o2m9M7N6j09O5l2NM3k1j0J2M7j7o9Q1l8K8J1J5L3j29N1l7
3974c3Q0q0mO0j38P8Q7n2o2P8j9R6k02O7M8r4R8o4N5L3l0j57K05k2j14R2Q3Po1
4003C5n6P4l0r8J00q4J09l9j31K52J55k88m9J86j16jm4m2J42o4J04p0J17j23j52
4028a13L1R8k04J42J34m5j65J69L6k30J19j48L01K4p7L9l4o1m2j07J48J33o8J18
4052A98k42%J84j80p2R6O5j28R6o8J39J84j67j21J35j08qJ84k1m6k8l56M25k41
$$ plain form
4076 -80 247 89 -251 212 -306 113 142 -238 -119 -4 265 108 37 150 223 -20 -202 -197 181 104 -220 -355
4098 -355 -109 1 87 154 -154 147 212 145 -56 -24 42 94 50 218 -79 32 122 -49 14 -103 -90 -26 -51 -30 24
4123 24 21 53 0 4 4 -21 28 -19 -21 21 -26 -7 -15 -1 -47 -11 -28 -9 -31 4 -8 3 -37 -37 -12 39 28 -34 -41 -14 52 -34 -8 43
4157 43 -62 22 25 -1 18 7 9 -19 -23 40 -74 17 14 38 2 3 -51 -26 -9 -42 -4 -11 -44 -15 -34 -8 -28 -47 -15 -11 -2 -17 9
4190 9 -8 11 6 14 47 25 -41 -4 30 -3 15 -2 32 33 11 11 -4 -29 24 -42 -17 57 43 -15 48 -3 12 47 24 12 -18 6 -6
4223 -6 -15 22 11 26 3 34 16 18 -7 37 25 45 27 29 -9 36 31 -3 11 -12 -25 -7 -46 29 -36 -9 27 -50 -33 -8 104 -31
4255 -31 -18 38 -33 -35 18 -3 -4 30 115 32 -36 -68 -102 230 219 316 154 15 -251 118 27 -120 54 171 -72 -181
4281 -181 39 354 217 33 39 -3 2 47 -63 -48 -98 17 -111 -7 6 -51 -47 -12 -16 -9 19 -18 -26 -51 -75 -16 -21 -67 12
$$ packed form
4076h0L27j58l40M63n18M19K9l80J19J15K69j57p1J13P3k43j82NL78p7l24j35
4098c55K46J10Q6O7l08L01O5o7k01L2O6N2m4J68k97J11R0j71O3j17J3O4k5K1N4
4123B4lL2n3M%k5M9m7kM2m7J9qJ4m6L6j7J9k2L5j2J1m0%K5N1j1o2pK7O6q6K6N1
4157D3j05Q4Lk6J9j1Kk8mO3j14R1lK4l6Jn4K5J7l3L8pl3K9j9K6k0j9L2MRj5K6
4190Ij7J9nQL3k2o6L7L4l3J8j7L4Jk2%j5k5N3o6K5P4j4n8O3n1J5L5k3j2l0K4j2
4223frL7j1J5k3L1j8Kk5M4j2K0j8Kl8M5nl4J4k3j3J8l9P5o5K7L6p7J7K5J12j35
4255c1J3N6p1kN3k1jL4Q5q3o8l2l4L32j1R7j62j39k66L69r1j47J74J17k43j09
4281a81K20L15j37j84Om2NM5j10J5n0J15j28J04J3n7ML5mPK8l7qk5k4N9nm6P9
$$ plain form
4310 12 5 116 66 69 32 -4 23 -35 -5 -52 35 -29 -11 1 -45 -32 13 -22 3 -7 -17 -58 -21 -22 46 46 12 -17 -82 18 6
4341 6 19 -7 -62 14 -17 40 -40 -17 1 54 -3 21 -81 -36 -75 13 -59 -34 -6 19 -95 9 -4 78 -24 125 14 18
4369 18 -127 -22 -120 -63 -90 -16 -236 21 149 -39 -38 -93 190 -166 -31 59 -187 -148 82 -122 -49 -45 -15 100 19
4394 19 -32 -103 60 157 -93 -57 -110 -38 -83 60 151 11 111 86 -76 67 70 81 -42 -31 -5 11 -1 -31 -148 -64
4420 -64 153 -53 -13 -27 -124 53 -100 -346 -4 -133 109 60 -28 -55 21 18 113 -76 21 161 28 167 1 -168
4444 -168 -132 -55 61 24 -121 99 17 105 49 -93 -51 122 -269 28 7 -37 127 60 63 -4 7 -135 181 -275 -166
4469 -166 -99 1 -5 -170 37 39 -80 108 -5 64 111 87 -107 -20 70 -17 71 -140 76 94 -65 -31 5 -60 -44 299
4495 299 42 15 -80 -27 35 36 45 -22 69 -71 38 109 30 33 126 47 55 115 18 -98 51 -102 66 241 -12 32 -254
$$ packed form
4310A2pJ11n0Ll7l6K7n8L0m7Q7o4J8J2m6J3M5l5K5j0j0m1L7jO8%l4k9o5J00j2
4341FJ3k6n5P6l1N7q0K3J8N3n7K4j02M5l9Q8p2K5K8K5j14J04j3Q2j02J49j11M
4369A8j45J05r8N7k7P4k20K57J28j88Jn5K83l56J35R0k46L9K30k04P3ML0J15q1
4394A9n1p1J63R7k50L6n3P2m5J43R1j40J00k5j62J43LJ1j23J1K6J6j2l0j17Q4
4420f4K17k06M0j4r7J77j53k46L42j29K42m9q8k7P6lR5j89R7J40j33J39j66j69
4444a68L6P7J16l7j45K20q2Q8n6j42M2J73l91K97k1m4J64o7Lo7J1j42L16m56J09
4469a66O7J00oj65K07Kj19J88j13O9M7k4j94Q7R0q7Q8k11K16J8j59L4L6o5J6L43
4495B99k57k7r5N3O2JRo7R1j40J09P1p9LR3p9QO0r7j16J49j53J68J75k53M4k86
$$ plain form
4522 -254 -38 87 -116 139 -95 54 10 -84 139 11 -82 -40 72 68 43 114 -64 -30 -84 -42 46 -30 14 40 12
4547 12 1 18 7 -34 72 -34 0 27 36 36 23 -15 15 12 -7 31 -14 48 12 -18 -4 -8 38 3 -1 34 1 28 56 0 5 -24
4579 -24 13 -63 19 -14 1 -47 45 5 9 27 -9 36 1 7 10 17 25 -6 -6 30 14 -18 1 61 22 10 -6 23 8 -32 10 -50 -29
4612 -29 -55 -43 -29 15 14 19 20 -23 -31 -18 -20 -1 -16 -30 -35 -15 46 -20 13 28 0 16 60 -19 27 -18 33 -11 15 -6 20 25 -47 14
4646 14 16 11 49 -5 -25 -26 -50 -39 -24 4 -4 26 9 -94 -33 -136 66 7 57 91 269 158 -56 81 -2 -25 84 -225
4674 -225 -24 -45 134 142 -183 -90 106 -147 -95 -102 265 -24 100 102 121 109 -6 -106 -363 86 -130 -32 12 156
4698 156 -9 -294 -54 371 -64 -273 -80 95 -30 1 84 100 112 181 373 -160 290 -300 -132 -54 -182 -249
4720 -249 -170 -222 89 102 197 118 -302 -46 168 73 -332 232 343 56 55 -113 157 -43 -129 62 -40 -29 48 105
$$ packed form
4522b54K16J25k03K55k34J49m4r4K23j28r3M2J12mk5P1j78L4n4M2Q8p6M4K6k8
4547A2j1J7j1m1J06j06L4K7R%j3l8L0lj9L8m5O2l6l0J4mM6l5mL5l3K7K8n6Nk9
4579b4L7p6Q2l3J5m8R2m0MJ8l6M5l5OLPQl1%L6j6l2J9O0l9j2j6K9j5m0M2o0K1
4612b9k6J2J4M4jNJm3qJ3kJ9j5j4nK0O1o6L3J5k8J6M4p9M6m5N1m4K6k1K6Np2O1
4646A4KnL8n4k0jk4J1J5K8qL0j7j03O1j03K02n9N0L4J78j11k14J37q3k3J09l09
4674b25K01k1J79Ql25R3J96k53N2pL67k89J24KJ9j2j15j00k57M49k16R8M4J44
4698A56j65k85K40M25m35k09J93J75j25L1Q3J6J2O9J92n33M50n90J68P8j28o7
4720b49P9n2L11J3R5p9m20K56K14r5m05N64J11k87jj68K70k00q6J91j02J1P7N7
$$ plain form
4744 105 21 15 32 34 -62 59 149 24 -39 92 69 -91 33 -67 83 167 -35 -81 -148 -86 -58 277 -43 76 69 51
4770 51 -146 -92 -153 -48 46 -45 60 101 -73 2 -101 159 -108 -77 -98 154 121 63 -5 -108 26 147 -30 -200
4794 -200 -253 -179 52 1 32 93 169 -22 -111 -96 64 81 20 -224 -50 39 -140 -7 -1 23 -15 6 -11 37 -104 -177
4820 -177 29 -134 -55 -101 7 -112 -207 -26 81 117 -256 18 45 -100 270 -197 -227 -176 -19 155 31 44 -141
4843 -141 -77 -65 -164 233 28 -91 -272 49 -300 339 69 66 105 95 262 142 268 -430 -409 -223 182 -136 -156
4866 -156 51 159 -76 -178 25 -396 -355 52 209 -31 317 114 -208 110 169 21 -10 38 -99 -302 -51
4887 -51 -31 -14 -53 62 207 83 118 46 82 141 113 201 -1 -97 131 247 3 -84 134 -280 8 286 36 -12
4911 -12 50 45 26 -2 57 -29 -5 -73 44 -90 10 -54 -14 -74 110 29 36 -116 109 -80 -84 -73 172 -30 8 210 -1
$$ packed form
4744A05q4oJ7Kr6J21R0j25o3J31k3j60J24j00J50Q4k02m6o7O2K8L35l20J19pj8
4770E1j97N4o1J05R4r1J05M1j74P5j03K60k67L1k1K52l3n8o8j03J34J21j77j70
4794b00n3P4K31n1L1O1P6j91q9J5J60J7o1k44J74Q9j79J33OK4l8K1j7M8j41p3
4820a77K06j63P9m6J08j19r5J81J07L6l73K74K7j45L70m67l0N1J57J74j24J3j85
4843a41O4J2r9L97k05j19j81L21l49O39k70lL9j0J67j20J26o98K1J86M05l18k0
4866a56K07J08k35j02K03m21M1M07J57k40L48k03l22L18N9j48l1M8j37k03K51
4887e1K0J7l9J15J45j24L5p2L6N9k8Q8k02r6K28J16k44q7K18m14K88K78k50m8
4911a2O2nj9k8N9q6K4o8J17j34J00o4M0o0J84q1Pj52K25j89mJ1K45k02L8K02k11
$$ plain form
4938 -1 55 107 -68 57 217 -69 222 213 -136 -62 41 -148 130 -26 -2 -59 -50 -113 21 44 -6 -148 6 3 392
4963 392 -34 236 -221 -272 -73 -98 -140 -167 -96 152 -132 241 -30 -12 141 -103 8 149 174 -113 49 -29 50
4986 50 7 -165 -90 -32 66 35 52 31 111 6 -58 79 169 -43 45 -28 -50 -21 31 -6 2 88 -51 -123 -58 19 255 -133
5014 -133 135 -162 200 36 199 56 82 -66 -67 305 -17 -279 191 164 106 -240 -1 39 40 347 -542 -24 168
5037 168 -83 67 -51 102 180 -145 266 102 -166 -97 108 302 -64 144 189 73 -49 -127 257 8 -148
5058 -148 -214 23 119 68 67 -43 53 -221 -133 -80 7 -60 -89 95 139 9 -65 80 -153 74 99 36 162 -126 224
5083 224 27 140 -3 117 29 97 -17 37 177 143 -163 67 8 -149 41 -151 -97 14 -130 -142 219 -23
5105 -23 80 323 -145 -163 148 73 -32 206 -252 -82 -53 -122 -122 97 -266 -155 36 -45 226 -18 -97 -8 60 -56
$$ packed form
4938aN6N2j75J25J60k86K91rl49P4J03j89K78j56K4n7Ro3J34K3n0j42J54lL89
4963C92m26K70m57n1J99k5m2k7P1K48k84L73k71J8J53k44J11J41K5k87J62p8P9
4986E0m3j72P5N8R8l1J7k1Q0j05o4J37R0k12Q8p3k2K9N2l7QQ6j39p2O5P7K36l88
5014a33K68k97L62j64J63j43K6j48jL72l22k62M70k7n8l46K39M0JL07q89N18J92
5037A68k51J50j18J53P8l25M11j64k68O9K05J94l66K08M5j16j22p8L84k49j56
5058a48o6K37R6n1jj10R6k74Q8N3Q7o7k9J84M4j30p4J45k33K27K5o3J26k88L50
5083B24j97J13j43J20q8O8j14N4J40l4l06K30n9j57J90j92N4J11j44j2L61k42
5105b3J03K43m68j8L11p5j05K38m58J70K9o9%K19l63J11J91q1K71k44p9Q9O8j16
$$ plain form
5129 -56 54 56 -46 -157 -118 -23 -144 -151 -224 17 -73 -75 -250 143 -77 -22 258 207 -45 53 343 -247 -27 -131 108
5154 108 -249 -6 129 -137 62 132 -100 28 93 -43 -117 -179 62 147 -39 25 107 -302 -21 -75 -118 73 88
5177 88 -42 49 -169 232 42 -87 -130 245 17 -18 117 137 128 16 78 72 -51 64 0 -93 258 74 4 91 41
5202 41 -180 -87 -2 -107 -1 65 -93 43 147 348 186 -117 -72 150 -94 30 -59 307 26 -270 7 3 -164
5225 -164 68 -105 260 216 -24 -141 -162 -71 -33 -86 -487 215 1 66 66 -197 -121 234 -5 287 103 67 -125
5248 -125 -210 244 99 133 394 145 98 -332 165 70 -84 167 230 107 31 71 -66 -505 106 38 70 -18 -178
5271 -178 161 34 29 -377 -3 -25 91 116 -222 -162 -251 -27 95 136 290 55 -83 -594 -266 -235 269 124 -248
5294 -248 192 -527 -219 236 -283 291 382 295 -28 -469 -49 62 -111 9 145 141 -134 -334 73 142 494 -122
$$ packed form
5129e6J10Kj02j11L9R5j21pp3K41r0kj75L93k20N5K80n1k52R8K90n90K20j04K39
5154A08l57K43J35k66J99P0k32J28O5j36p4o2K41Q5j86O4Q2m09K81n4m3J91J5
5177H8j30R1k18M01j90j29m3L75k28l5J35K0rj12O2oj23J15o4r3L51j84p0Q7n0
5202D1k21R3Q5j05J06O6j58J36J04K01j62l03M5K22k44J24q9L66k81k96K77mj67
5225a64K32j73L65m4k40j17k1R1L8n3m01P02k14O5%k63P6L55k39K92j84l6j92
5248a25q5M54j45L4K61k49m7m30M97r5j54K51O3j23p6M0j37m39O11o8L2q8j60
5271a78L39j27nm06L74k2J16K5l38O0q9K24J22M1J54k35j38n11L28L1N04j45l72
5294b48M40p19L08M55n19N74R1q7l23m41M20J11j73J20J36mk75k00M07O9L52o16
$$ plain form
5316 -122 49 -49 -322 117 -331 56 -126 181 208 98 162 -4 437 -129 -162 6 -64 -512 83 31 206 -223
5338 -223 95 -97 -63 -102 263 45 -240 319 118 72 87 -45 -2 -261 42 -11 -78 231 -178 -9 -51 -116 54
5361 54 -446 253 -223 -164 -239 -52 55 -458 -86 92 92 -138 -231 218 216 -72 -327 -30 40 -274 133 -394 -265
5384 -265 161 54 -30 -290 2 34 166 -307 119 117 -136 -24 349 -97 -329 -431 196 -82 -136 -42 -133 -151 -141
5407 -141 -18 225 19 -151 66 -13 327 -44 -111 44 -74 -74 -240 -10 -159 132 181 89 267 53 18 -28 22
5430 22 16 -113 102 -147 -172 241 -67 -229 -46 249 -52 -7 -294 -3 125 144 142 -402 -26 308 -85 -133 202
5453 202 122 119 49 -64 122 124 -114 282 -266 -222 -331 -547 41 144 -395 -206 -476 -3 -277 -35 -122 24 -80
5476 -80 -130 103 -153 68 260 147 167 -103 -422 -476 -180 32 -29 -93 -283 -200 49 -16 125 -124 -111 -211 -68
$$ packed form
5316a22J71r8k73M39m48L87j82L07K7j10O4j66M41n66l3J68p0m48N95n2J75m29
5338b23L18j92L4l9L65k18k85N59k01m6J5j32M3k59L03n3o7L09m09J69m2o5J70
5361E4n00O99m76N9p5J87J07n13L72J78%k30r3M49kk88k55K97P0l14M07n27J29
5384b65M26j07q4k60K92L2J32m73M26kk53J12L73m46k32j02O27k78n4R4r1j8J0
5407a41J23K43k06j70K17p9L40l71o7J55j18%j66K30j49K91M9r2J78k14l5m6N0
5430B2oj29K15k49k5M13l08j62J83K95l01M5k87K91J28J9kn44L76L34l93m8L35
5453B02q0lp0j13J86Kk38L96n48M4j09k16N88J03n39J89k70M73k74K42q7J46j04
5476h0n0K33k56K21J92j13K0k70l19n4K96K12o1o4j90Q3K49o5J41k49J3j00J43
$$ plain form
5499 -68 26 261 -7 -112 67 -133 144 -88 75 -236 2 -34 -156 85 -294 -155 -17 170 -277 -37 -19
5520 -19 97 16 -29 75 210 -31 -52 -10 208 -105 79 21 39 -36 34 -47 -102 40 -74 -56 75 63 -64 18 60
5545 60 116 -7 -62 -85 16 -39 13 -60 -27 12 33 -19 29 13 -61 -18 -56 -55 20 33 -12 -40 -13 -37 -7 -11 -12 -29 25 17 39
5576 39 26 -59 21 30 43 55 19 16 24 13 -22 -9 31 11 -10 18 72 23 -9 -27 -6 -4 29 -47 8 -1 -55 -47 -59 -31 -51 -19 -27 -24
5610 -24 39 19 7 -79 51 -7 -5 -1 37 -40 -17 18 5 -21 -4 10 -13 -50 -18 34 -3 8 20 36 18 9 10 -34 -9 55 25 -20
5642 -20 -23 -20 19 17 11 22 8 -54 0 -2 -54 -45 -5 25 11 7 28 24 17 17 -18 38 9 6 -14 19 32 39 -8 18 -22 17 -38 -19 15 32
5678 32 11 16 -55 -47 33 7 71 0 -27 -17 -20 6 8 -40 60 -40 2 -120 -1 -108 -45 21 77 -52 68 -38 23 148
5706 148 33 -114 151 3 -12 -7 -9 34 -97 -30 78 195 -119 -6 -235 85 -250 -141 -203 142 194 -505 -14
$$ packed form
5499f8R4K35k68j05J79k00K77k32J63l11K38l6j22K41l79J39J38J87m47K40J8
5520a9J16q1m5J04J35k41k1M2K18l13J84n8J8p5P0q1n5J42j14J8J31j2j27Q2M2
5545F0N6j23n5k3J01n5N2p3L3L9K1n2M8j6p4M3l8JP5J3m5k8K7k4L0mjj7N4qK2
5576C9j3q5Q0RJ3J2l6lQj1l5J3M0k0k1K8N4m9l2j8K1KL3p6N5rn4Qj2K8k0L2qL
5610b4O3k0j2q6J30n8KML8p7K3L5j3k6J7J4k3l7L2N2l7J1J2J6j8rJm4K5O4l0m5
5642b0lLL9koJ1j4o2N4kn2RM0L0j4mK1mp%l5N6k9lk0L3J3Pm7K6m0L9n5J9L4J7
5678C2k1Np1QQ0k6O4p1k7J0lK6Km8J00j00M2j22J19j07O3O6N6j29J20j06O1J25
5706A48j15j47K65j48j5NkM3j31O7J08J17l14J13k29L20l35J09o2L45N2o99M91
$$ plain form
5729 -14 -103 6 -186 -154 130 -107 -196 -215 -207 -217 373 -48 -261 175 -141 30 -150 116 -169 -132 -46 36 113 84
5753 84 -186 -136 -138 -170 -149 -1 -173 -19 -141 -144 41 39 -40 97 134 -56 -24 255 -70 -23 -230 -229 132 -35 -24 44
5779 44 137 -334 -42 134 -81 -42 152 81 -302 -374 221 -2 9 30 162 -228 -154 -91 -6 -193 -29 -196 106
5802 106 8 -18 39 48 -17 221 106 -105 42 48 -167 -165 -94 -60 -206 -72 -248 -38 -18 19 -86 87 12 149 -289
5827 -289 18 87 202 -329 140 -114 -195 136 38 -48 219 17 31 177 -20 -283 65 -370 -53 109 16 -129
5849 -129 -73 -397 -194 416 202 -247 38 1 13 121 40 -245 -150 -48 -341 59 53 -58 46 17 84 -122 40
5872 40 89 -130 19 -123 -129 -165 -49 -53 245 -101 368 340 66 63 -228 -130 -75 187 -43 -241 187 87 -5 -204
5896 -204 75 -139 4 183 11 101 -37 9 82 -50 -37 18 -16 31 -98 40 -80 -48 7 3 39 6 -39 -13 -2
$$ packed form
5729a4q9J09j92L2K84k37q9j9Qj0N90m21k13M36l16J71j80K66k85L7Q6Q2P7k9
5753H4k70N0kl2K1J48j72J54j22lJ85kp9J37L7j90L2K79l25M7k07JL61j67J1O8
5779D4R3m71K92J76k15L9J94p1l83p2N95k23J1K1J32l90P4O3Q5j87J64j67L02
5802A06r8k6N7Ro5K38j15k11J47Ok15KP1L4j46J34j76K10K0L7j05J73p5J37m38
5827b89L07O9J15n31M69k54q1L31r8q6K67k02J4J46j97k63L48m35L17J62r3j45
5849a29N6l24K03O10k14m49K85l7J2J08q1k85R5J02k93M00oj11J04k9O7k06J62
5872D0M9k19J49j42ol6J16mK98l46M69k8k74lk91R8N5K62k30j98M28j00r2j99
5896b04K79k14J43J79j72R0j38M6P3j32J3N5l4M7j29J38j20L2N5mL6l3m5K6J1
$$ plain form
5921 -2 -38 -41 17 -86 14 36 -30 -69 -39 0 -7 32 38 21 9 4 -31 47 -7 28 -9 -21 24 21 4 28 -18 -6 10 -15 13 5 29
5954 29 -53 21 8 13 30 13 -18 39 63 -29 -131 50 -40 32 -69 -66 -50 44 -111 76 141 12 -86 -43 -141 -21 -38 -10
5982 -10 -112 -2 -132 -195 5 -30 -105 165 189 -226 93 115 -10 99 -85 -251 -13 -36 230 21 -11 35 -74
6005 -74 256 -140 -4 15 -12 -75 -78 -21 -11 -65 157 100 -240 4 -122 352 45 -54 10 209 -303 91 213 -23
6029 -23 -82 131 68 -197 78 -467 -30 -232 145 254 -203 -451 -505 -78 -118 187 -56 -155 -407 -208 147 114
6051 114 -403 193 -214 17 -236 -352 -346 105 56 310 2 17 -67 -101 383 80 177 -221 17 166 -145 161
6073 161 -112 28 -120 -182 13 99 -123 18 106 209 -53 46 62 213 236 -76 100 -47 28 81 -9 102 -99
6096 -99 59 -237 -139 -326 -170 -1 -72 139 -49 -63 -9 -164 202 223 181 410 -85 -247 -177 -121 -89 -153 -153 238
$$ packed form
5921bl6lN8j03J00K2o6l9L0L9pL9Oj7j2nl5P8n4L5l7j2M5lj7K4m6J2J6k5K8qK4
5954B9q2P4j3NJ7j7l1N7K4r2j02J81r0P2j01LJ6R4j55J87O5j29r8M3r8J20j7K8
5982a0j02J10j30o3K00l5p5K70K4m15L19K2j25J09j84j66K38k3K66k09l2M6j09
6005g4L30l96J36J9k7o3lN7J0n4K22n7l40K44j26M74l07r9O4J99n12L94J22k36
6029b3n9K13o3k65K75n45M37k02L77J09m57k48n4M27m0L05k43r9k52J99L55l3
6051A14n17N96m07K31k53j16OM51m9K54l08J5q4l4M84l03R7l98K38J49l11L06
6073A61k73J40j48o2J95Q6k22J41Q8J03k62R9J6J51K3l12J76j47P5N3r0J11k01
6096i9J58k96R8j87J56J69p1K11j88j4N4j55L66K1m2K29m95j62P0N6L2o4%L91
$$ plain form
6120 238 -34 131 -45 140 46 203 -145 164 0 -94 -151 92 86 495 -161 -356 15 140 -156 -135 -185 200
6142 200 -168 -8 278 -271 300 -334 -16 -139 -105 42 134 -85 88 86 -114 32 174 -230 -45 -192 -182 -172
6164 -172 126 88 270 82 -132 147 -132 -97 -96 -167 226 -220 176 -34 -158 14 -119 28 -339 -190 -96 103
6186 103 191 277 -136 -353 -348 507 -134 -129 33 -20 -460 -141 26 -149 -13 -6 -78 181 185 -76 29 -63 140 234 -75
6211 -75 -15 260 -117 -79 -44 -102 33 10 12 15 -12 28 -13 18 -52 -4 51 -16 -60 7 -13 12 -19 2 4 -12 -12 -39 -49 -3 -1
6242 -1 -29 -16 -26 5 -27 11 -9 2 24 25 -35 -12 3 5 18 60 14 -47 -50 -5 -15 -1 -21 -27 70 33 -2 32 -193 164 184 122
6274 122 53 -219 55 226 117 -128 173 75 -95 45 -41 19 -43 -12 10 -21 -20 -45 -14 -2 38 -6 -14 7 13 34 15
6301 15 5 10 12 31 21 22 21 -28 -41 35 -6 -7 -9 30 -11 9 -37 -59 14 26 -53 5 -57 -30 32 0 4 -8 -2 10 -4 -29 -12 -28
$$ packed form
6120B38k72J65j76J85r4J57l48L09j64r4n7K43oM09o56j95L71J25k96K1n0L85
6142B00l68J60K86n49N71o34L18j23L4J47R2k19J73kk00J46J42m04J85j47J0J0
6164a72K98l8J82j88k14K79k79L5Jp1L93m46L96k10j24J72j33J47l67J49R4J99
6186A03Q8Q6m13k17NQ55o41NJ62n3m40L19J67j75J36Pp2K59Mk61J05r2K03R4l09
6211g5O0K75l77L8L5n8J35k3KLk7M0m1L1p0M8N5o7m4O7k0K5l1K1Kj6%k7j0M6K
6242ak8J3j0L1l2L8k0J1K2Jo0K3J5KJ3M2m6o1lM5j0J4k0oR7l7l5L4k25L57K0o2
6274A22o9k72K74J71j09k45L01r8j70J40q6O0o2L1K2l1Jk5L1J2M0m4qK1OK1j9
6301A5j0NKJ9j0Jjm9j3P6m1jkL9m1K0m6k2P3J2p9N8o2K7O2l2Mj2OJ2j4k5J7j6
$$ plain form
6335 -28 -29 -54 -17 11 26 -5 8 46 -8 9 60 29 6 7 -34 -8 -29 5 19 -7 -44 -14 10 15 -19 20 20 -67 38 -24 46 -31
6367 -31 37 -6 -40 44 9 12 14 30 25 -18 13 6 8 1 17 -18 24 18 17 18 42 36 -17 -16 7 20 58 -2 -6 1 -10 3 -30 5 -41 -27 -5
6404 -5 17 -8 -4 -33 -22 38 2 4 -41 -14 -38 -6 -21 -52 23 33 42 -31 20 10 -22 7 0 29 -14 -36 -1 -41 31 4 -7 -3 -57
6437 -57 -45 -37 -26 -1 -12 20 6 0 -27 -3 -24 -7 -1 -1 -17 21 -26 -45 -3 -47 31 31 43 -23 -2 8 26 11 12 -21 -1 16 -41
6470 -41 11 -13 -30 -45 -5 -33 -28 -24 26 -27 -44 -42 -42 13 -10 -16 -5 -14 -49 -5 -5 -67 45 -28 49 -4 7 36 11 -23 5 10 10 39
6504 39 -20 -6 44 -19 -16 48 24 -28 12 -7 -61 10 -38 -53 17 30 -9 13 -2 -38 15 -19 10 62 4 19 7 -10 26 -28 3
6535 3 -13 -25 12 16 8 -31 15 6 22 -39 33 33 -15 -12 -19 -23 11 -48 -9 -20 -11 29 -38 -34 -34 -27 -9 10 -24 15 -45 12 8 34 11 14 17 5
6573 5 0 8 -13 52 21 53 -1 -14 14 29 24 -4 10 -7 -11 -14 -9 -48 -25 -16 4 -56 -23 -31 23 -5 7 55 -60 -47 18 -108 -63 42
$$ packed form
6335b8jk5L7K8J5l1J3L8n4J7N1l1k3Jm1K6k1L4J4k6l7L0K4Nl4L9%q7J05o2P0p7
6367c1O8m3l4Q4l5LKJ6nm3L1pKpJ6l5M2ojJK4on3JK3J3L8o0mPj1J3l3L5m6J4K2
6404eK2k5Mk9J1O0l6Km5K7k4L2j5l1P5J0Rp3N1j0l2K9pK9m3k2L5m0P2k7j1Mn4
6437e7J2QJ1K5j1L2j4ok7K4k1J7O%j6L8m7j9M2m4P8%J2o6K1J0J8j5Jl3K0J7n7
6470d1N2k4j7j5M0k8NMN0n3j7K%N5k3oJ1rl5M4%o2J12p3P7n3J1K9k5l4K8N%K9
6504C9n9J4N0o3LO4k4n2M0j9n4P1m8j5P0J3l9K2j5l6N3l4K9N2n8J5j2j7L6n4L1
6535Cj6j2L7Mql9M6rJ6o1P2%m8LpmL4n9L9j1RM0o7M%PJ8J9l4L9o0N7mK6k3LLj2
6573EnQk1O5l1L2n4j3K8J5nk8J4j7mlNl9K3RK0o0L3qN4k8J2M8j15J3O5j26M5J05
$$ plain form
6607 42 -33 87 187 -213 -122 5 27 -2 -8 93 83 71 -10 64 -54 -65 -257 33 164 69 -64 -21 -27 -126 21 179
6633 179 -38 -55 -64 -18 -41 -42 57 -47 -18 17 78 -102 28 31 -16 92 -45 -30 56 41 39 -31 60 -11 2 -26 -11 6 -46
6662 -46 30 -2 17 -17 3 -57 22 -29 -58 -12 39 -13 -39 0 -15 21 -42 -44 14 15 37 -41 -57 -36 -22 7 -15 -4 -40 -8 -9 26
6694 26 32 0 35 9 0 11 16 -41 -5 9 101 41 -7 -99 -68 41 98 -63 -86 -12 54 81 23 -23 -98 27 17 -13 -41 -21
6724 -21 223 -142 13 75 52 -90 135 4 374 130 -220 -70 59 41 83 40 -9 3 -4 -159 -29 6 -43 24
6748 24 -33 31 -48 46 -77 133 -100 62 -39 -71 18 -37 92 -189 41 -2 -55 -20 -38 -40 11 -35 14 -19 69 -101
6774 -101 -68 2 -53 267 -246 47 -150 -11 -135 149 21 84 19 -126 -253 208 -305 -505 11 -34 2 3 -91
6797 -91 -141 -50 94 -93 325 223 72 -59 59 -61 15 -105 101 110 -552 136 19 -85 -85 -150 -4 128 226
$$ packed form
6607D2p5J20J00m00R1J27K2k9oJ01j0j2q1P4j18j1j92K90J31r5j33M3or9J47J58
6633A79k17j7rM6k3jR9j04K9L5O1j80J30Lm7J08j37J5Q6j5kp0R1p1J3k8J5J7n2
6662d6P6l2J9l4K0o0P9n1k9M6N1n2k6L9j5L6o3kN8JK2p8j6K1J4K9k2J1l6L2jL5
6694B6Ol2L5k6rJ1Nn7L6J4R2o0m8r2L1J09N7j61k3P4O6K7n8m6p5J25j0l0k8K0
6724b1K44l65J55O2k3j42K25j31L70k44l50J50J29j8M2m3m9J2pj55J30L5m9O7
6748B4n7O4p9R4j23K10k33J62j01l2Q9n5J29k81K30m3n3L5j8kN1m6M9l3Q8j70
6774a01L3P0n5L20n13K93j97J39j24K84j28O3o5j45j27M61n13k00N16m5L6Jr4
6797i1n0R1J44j87M18j02j51j31J18j20P6j20K06Ro62O88j17j04%o5J46J32R8
$$ plain form
6820 226 134 94 77 -108 -24 -109 280 44 -53 -59 78 48 32 -25 68 -42 29 79 -38 15 -80 -154 -99 -38 164 -84
6846 -84 -103 36 -66 230 -81 202 243 -253 153 6 117 24 140 -96 77 -89 -186 -60 -61 0 -182 30 40
6869 40 -94 -163 -15 -42 -36 -139 -53 -82 40 38 -47 71 52 134 143 50 24 17 -75 -83 -184 -21 113 7 -141 -17 -79
6896 -79 84 18 -365 -217 41 23 218 132 -146 146 -97 52 -92 -247 92 -124 -6 -55 -68 -250 -123 75
6918 75 -128 182 -49 -114 -169 -98 -101 -15 352 64 89 -162 -98 -43 62 83 82 94 51 55 -81 -53 -55 -64 58 -11 -88 181
6946 181 155 60 139 52 149 -253 -158 -69 -49 -36 -167 32 -13 -59 -113 72 -71 -219 -73 -13 -116 -65 5 -68 -90 -13
6972 -13 118 -17 -28 40 -77 23 90 114 34 -18 -100 -144 -39 -19 4 -95 -54 -46 28 70 -32 42 -86 -4 39 -47 -93
6999 -93 -9 -3 -27 -3 -33 5 53 36 -56 -33 14 13 -17 71 -17 -6 -22 -10 12 34 0 -65 -23 -18 27 -13 -54 -13 -26 52 53 -2
$$ packed form
6820B26r2m0j7j85Q4q5L89k36r7oJ37l0j6n7R3j10P1N0j17N3r5p4N5O1K02k48
6846h4j9J39j02K96l11K83M1m96M06j47J11r3J16k36J73j66r7J26jO1j82K12J0
6869D0j34o9J48k7Oj03Q6k9J22kq5J18j9Q2Rr3k6pr2qj01J63J34j06j48J24o2
6896g9J63o6l83J48K58j8J95q6k78K92k43J49j44j55L39k16J18m9j3j82J27J98
6918G5k03L10k31o5n5P1lQ6L67k88K5k51O4N5J05K1jJ2m3Mj36K8krJ22o9p7K69
6946A81k6r5P9q7R7m02R5Q9K0J3j31J99m5m6n4J85j43j48J46O0j03N1P0p3k2P7
6972a3J31j35j1O8j17J00O7K4q0n2q2m4J05K0K3r9M1QP4M2j02P4j28Q2M3q6m6
6999i3Q4Ok4K4l0L8M8j7r2K3M7jl0Q8q8J1j6J2K2K2l4o5M2NM5m0m1M1j3P8Jn5
$$ plain form
7031 -2 167 52 -24 -125 -81 4 10 107 156 -101 42 146 173 19 -17 -248 100 14 -9 -139 10 -187 -80 3 -13
7056 -13 -75 -80 50 -39 204 93 210 43 213 72 34 -144 61 53 -178 76 -78 81 -62 93 -48 -84 -53
7079 -53 -87 60 312 -58 59 78 41 81 10 -154 -3 -118 -307 37 229 -28 56 -4 -96 2 -5 -272 -39 -36 173
7104 173 -96 178 -34 -312 122 236 -103 -191 67 26 271 152 -265 -160 51 -22 109 -119 -100 282 100
7125 100 3 0 -42 -195 -82 44 5 3 -81 12 143 -96 -70 -12 -52 94 42 -13 -62 25 140 66 0 -84 -236 41
7151 41 -83 114 35 17 28 46 -78 -76 -18 -32 -17 62 130 -101 23 -24 84 65 95 -66 -86 -106 48 8 2 -3 -60 -1
7179 -1 67 16 74 -27 0 105 34 -84 68 -86 42 -74 -69 65 39 102 -58 -13 -10 -88 -94 -15 65 197 -52 -77 -13
7206 -13 57 17 11 -23 9 70 -11 -23 74 -81 -178 -334 -180 -1 -86 -135 -20 284 212 -343 -160 -192 103 -269 -28
$$ packed form
7031bJ69j15p6j01M4Q5OR7M9k57J43J04K7j54l6k31L48q6k3j30J49j97J07Q3j6
7056a3o2nJ30q9K43j11J17j67J70j41l8j78K05qk31K54j54J59j43J55j41l6L1
7079e3l4J47K52l70J17J9l7M0p1j64J51j15j89L44J92k57Q4o0r2R8pk67K33LK09
7104A73k69K74k12k78M34J14l39q8K58m1K45j19m17J05K11p3J31k28J9L82j82
7125A00r7lm2j53J13J26l9kq4R3J31k39K6N8m0J46n2n5m9Q7J15p4o6q4j52K77
7151D1j24J97p9j8J1J8j24KN8j4J5P9O8k31J24m7J08j9L0j61k0k0J54m0onn7N9
7179aO8n1N8j01K7J05p1j18J52j54J28j16NJ34k6O3j60M5Lp8oP9Q0J32k49k5O4
7206a3P0m0ol4L2O1q1j2R7j55r7j56J54J79q5m9J15L04p2n55J83l2K95l72K41
$$ plain form
7231 -28 -273 -255 304 -66 -24 24 22 58 -170 191 -135 -189 -4 15 -153 5 -7 -119 28 29 212 81 25 -103
7255 -103 346 65 -8 131 123 -164 78 -9 152 -69 260 10 -223 103 -178 -176 32 -213 -96 -16 52 -85 62
7278 62 -91 -87 105 -215 311 272 24 24 -13 106 -23 30 -187 14 -251 12 77 73 19 -68 -70 111 -39 87 1
7303 1 -183 -36 41 23 -75 -123 192 86 195 -125 125 -33 184 275 188 78 -52 -32 -54 352 -16 104 -135
7326 -135 161 233 252 -300 -124 -15 -284 -202 -259 -131 179 189 -267 139 -148 -206 -307 -106 64 186 266 111
7348 111 -200 -48 -452 -141 301 -169 98 -321 -551 -48 -131 34 182 130 -4 22 -18 84 44 -70 225 -183
7370 -183 -84 -354 4 -180 193 -66 -89 37 123 67 116 -136 -22 -150 51 38 22 -58 83 -167 -200 82 -105
7393 -105 -21 61 41 -94 -14 54 13 -32 -21 81 150 -46 59 64 156 122 -52 25 86 -30 -86 -59 -11 -30 15 -11 42
$$ packed form
7231b8k45J8N59l70M2M8kL6k28L61l26n4J85J9j68J58j2j12J47JJ83j31n6j28
7255a03M49k81p3J39qk87K42q7J61k21L29k50k33L26k81KK08k45J17Q0O8j37J47
7278F2j53MJ92l20N26l9k48%l7J19j29N3k17K01k65K63O5mn4q7kJ81j50J26q6
7303Aj84J47P7j8r8m8L15j06J09l20K50j58K17R1q7j10j30K0k2M06l68J20k39
7326a35K96P2J9n52J76J09k69Q2n7J28L10J0m56M06k87n8j01K01J70J22Q0j55
7348A11l11J52m04L11M42m70K67m19k30N03q3J65J48n2j34K6m0J02m0j14K95m08
7370a83R9k70L58j84L73k59k3J26Q6n6M9k52J14j28K01j3j6q0J41k50l3K82j87
7393a05Q4Q2k0j35Q0O8m1m5J1J02O9j96J05NR2l4j74P7O1j16n6K7M8j9M5k6N3
$$ plain form
7420 42 -49 78 30 25 -13 3 -15 -20 26 31 2 -6 27 -2 -27 -30 -7 -24 4 -3 67 -16 17 -6 2 -7 24 -39 8 29 71 -18 39 -2
7454 -2 20 25 -9 23 28 -44 9 21 -30 8 -8 28 33 71 44 99 6 -52 99 82 -96 -139 120 -87 -109 98 109 -98 -196
7483 -196 -58 -1 -142 -111 9 43 10 8 -18 -10 28 22 19 -1 29 -2 -17 -3 6 6 -32 -29 -62 -12 -39 -52 -52 -55 -13 -1 -49 -51 -5
7516 -5 -28 6 3 -14 51 34 6 3 9 2 38 -7 5 -4 -12 10 -4 49 -4 -56 49 18 -21 -22 -12 -36 12 -52 37 17 -9 -36 -24 -4
7550 -4 -40 -22 58 5 22 -12 -7 -17 -51 20 39 26 10 26 -31 -24 11 -17 5 14 -37 9 10 -13 13 30 -9 -26 -7 11 0 1 -1 -29
7584 -29 -12 -25 12 -16 1 -7 65 59 -37 -53 -77 -31 -8 42 22 31 51 11 36 27 -23 -73 119 108 103 50 -112 86 63 35 96
7615 96 -138 -136 -141 -150 111 11 23 125 -33 -32 162 289 -147 231 -148 -181 152 55 158 18 110 11 142 -84 -163
7640 -163 147 -32 -181 74 -151 -217 201 187 119 31 -71 -42 -40 111 -167 -104 -79 -30 -299 53 20 63 19 -136
$$ packed form
7420D2r1J27m8nl8J6j8nM6Nk9qL3k9k5lK3j7K8pP0q3L3k3QrL1o3M7K1M2q9N7m1
7454bK2Nl4L2Np2N3J2n1L8j6L6NL8k7N5r3n8J51j7j78m3K59k07k2K07J1k07r8
7483a96J38N7j41L1J20L4l3kk6QL8olk0L0l1j5J4R%l8Ll3N0k7j3%lM2J2m8kM6
7516ek3L4lj7O5j7k8lOpL6m5J2rqK2j4N3n3n2J05l1l9jJ0k4M8o4Q9k0k6k7J2K0
7550dl6J8Q0n3J7l4Nj0l4P1J9j3j6J6n7PL5k8K2Rn1M6Jk3K6J7l9j7J9J8j1Jkk8
7584b9J7j3L7k8J7qP2or6j6k4M6K3N0k0RK0m0K5rn0n0J92j1nn3j62J98k3k8O1
7615I6k34KnrK61j00J2J02j58JJ94J27m36L78l79l3L33r7J03j40R2r9J31k26p9
7640a63L10j79j49K55k25o6M18j4o8q8j02K9KJ51k78O3K5M9k69L52l3M3m4j55
$$ plain form
7664 -136 -269 189 -115 -107 -101 -311 160 -409 41 -235 -343 260 116 20 -53 -272 59 133 -39 -93 -69 -19 346
7687 346 -56 -76 -112 65 -186 8 263 259 -192 132 229 154 -145 -154 -195 -290 -166 -81 49 -18 50 -159 126 -166
7711 -166 73 285 -163 -22 -254 -205 -99 78 135 -83 -7 88 -125 119 126 21 -50 82 -352 -182 90 -52
7733 -52 169 -142 -55 -91 17 67 83 -37 -40 -65 -14 106 -78 -100 236 -158 -6 32 48 97 -19 -84 -65 -180 66
7758 66 31 -157 9 2 -151 143 135 109 -74 -87 -84 65 -94 5 35 110 70 32 59 -28 -59 85 -46 -150 -22 -59
7784 -59 -83 11 -30 -12 8 -73 -41 -1 -2 63 27 -19 30 -74 -49 31 -3 -72 -7 1 -23 0 23 24 12 0 -17 -30 14 -3 -9 -12
7816 -12 13 -16 -36 -36 10 -58 1 -21 15 -48 -20 -49 11 -42 -24 36 -13 -35 1 51 10 -35 -30 56 -7 9 10 84 -9 -35 -1 -32
7848 -32 12 -23 14 -22 -19 37 -55 17 14 6 -52 -56 -10 -17 39 -6 -8 -8 -14 3 -45 -25 -11 -27 -6 70 2 -3 15 -15 -9 -10 5 58 -25 59
$$ packed form
7664a36j33M58l04QOk10M71n69M50k76j08O03j44r6p3k19L31P4j72n4K4N0L65
7687C46m02k0l6J77k51J94K55mm51L24R7p5k99rm1r5J24Q5J30o7O8k09K85k92
7711a66K39K12m48J41k32M9J06J77N7k18P6R5k13K44Pj05p1J32m34J70K72j42
7733e2K21l11Q7l6J08N0J6j20lk5N1J20j84k2L36l94J52L8J6M9j16o5J9j15K46
7758F6l5j88J66pj53K94qk6j83j3LJ49j59R9L0P5m0l8K7q7l1J44j31j04J28l7
7784e9k4R4m1J8K0q1L2M0jO5l6m6M9j04K5Q0l4o9O5Qk4K3K3Jj2j2j7j3M4j7ol
7816a2K5k9k0%M6o8N9k2L6o3K8k9O0n3J8O0m9k2L6N0m1m5NQ6o3J6JP4r3k6L4l1
7848c2M4l5L7l6LN6r2P2lqn8mM6pN6m5k%oJ7m8K0J4j6K1P6o8nJ8l0OjJ5N3q3Q4
$$ plain form
7884 59 14 -3 -23 41 5 -3 -3 -32 25 6 32 25 -26 -15 -12 2 -5 9 28 -56 -28 -44 -42 -51 45 -28 -35 -52 3 -6 2 -8 23 -4 30
7919 30 4 12 19 -12 -15 23 27 37 15 15 -14 25 13 -51 -5 -6 7 81 -18 -26 -49 -17 -58 -54 12 13 -23 -55 -29 -28 11 -6 0 10 -1 17
7955 17 1 4 43 30 14 4 25 -14 13 -10 24 34 7 27 -5 9 13 -34 49 18 -31 -5 -13 20 -52 4 2 5 -55 -13 -14 -18 -31 1
7989 1 7 -9 11 7 -40 -41 55 37 45 46 -24 -21 0 21 0 -17 -2 34 37 -57 12 45 -3 7 3 -58 -12 -60 23 18 -28 -18 -40 -53 -65
8024 -65 -3 -54 -7 -15 -27 30 83 -15 31 60 -21 64 -35 43 7 -11 -6 0 -17 57 42 15 13 31 55 -31 44 25 -22 -8 -20 2
8056 2 -23 7 -61 -21 -21 12 -8 -39 89 21 -32 1 -43 10 44 -2 -18 -13 -47 12 32 -33 40 19 53 27 11 37 25 -18 34
8087 34 19 -39 -11 17 35 -42 3 -5 20 7 6 26 -40 -45 5 40 -10 1 -77 0 -70 -75 73 -4 55 -7 63 -15 -14 -1 61 20
8119 20 21 -9 88 52 28 30 0 45 49 3 -56 67 94 -1 -78 -101 49 38 -179 -85 -81 135 88 -14 -172 -16 -34 99
$$ packed form
7884E9m5j7k0O4l6q%k9N7j9K6pn1J1LJ4pJ4J9q4K8j6KrR6p3pj7N5rQj0L1k7L4
7919C0k6QPl1lL8MJ0k2%k9L9j2o4M6jJ3P4r9qk3L2m1MO6Jl6l2K6JL9j7OJ0j1J8
7955A7j6LL9j3j6j0K1l9K7k3L4J0k7K0l2J4Mm7Q3l1m9K6qL3p2N6kLo0M2jmj3L2
7989AOj6K0mm7jR6j8QJp0LK1K1k1j7J5L6Lr4O9L3m8J0mo1M6m8Q3nm6J0k2j3j2
8024f5O2n1M7qj2N7N3r8M6K9q1Q5r9P8l6j8NOj7P4j5k7kJ8K4q6P5j9m7J4j2K2
8056Bk5L0o8M0%L3k0l1J28o8n3L3m4N3L4m6j6Nl4N9K0o5P3k1L4k6j6K6j2m3N2
8087C4j5n8K8K8J8p7M5qK5j3jK0o6nN0L5n0J1p8P7p0nJ48p7N9o2P0p8JJ3O2m1
8119B0Jl0R7l6k4Kl0M5Mm6n9J23K7r5p7k3J50j1k17R4MK16m7j02j58J56j8J33
$$ plain form
8147 99 150 -122 14 101 9 -79 -83 -90 48 6 -78 -106 26 -124 -130 -125 188 59 -24 -128 81 16 -183 -138 -96 -68 -92
8174 -92 83 98 -85 12 -148 -133 19 -5 104 156 -180 -148 -14 68 -87 -24 -32
$$ packed form
8147I9N1k72J36Q7r2q8mpJ38m2q4k8J32j50oNL13j29q3j04K09o5j99M5M2K8k4
8174i2J75J5j83R7j60J5J52k4J09N2l36L2J34Q2j55O3q
8191c2
$$ Imaginary data points
##PAGE= N=2
##DATA TABLE= (X++(I..I)), XYDATA
$$ plain form
0 0 0 0 0 0 0 0 0 0 0 -8 8 -8 8 -16 16 -24 24 -32 40 -48 57 -72 81 -96 113 -136 158 -182 209 -241 274 -313
32 -313 356 -405 455 -513 577 -648 723 -807 900 -1000 1110 -1228 1358 -1502 1658 -1828 2015
49 2015 -2219 2444 -2692 2967 -3273 3613 -3999 4434 -4935 5516 -6196 7009 -7998 9235
63 9235 -10831 12978 -16038 20772 -29127 48260 -183722 65139 194966 -269402 19410
74 19410 35442 -97392 20771 55544 -8936 -13783 -81019 30009 86156 -33077 -126540 35072
86 35072 90084 -89593 -10161 99371 -83501 -2607 113968 -31665 -16271 24820 -16621
97 -16621 49360 -24663 -52731 28160 -10899 -24109 -7506 -8498 20666 -29507 -1261 57055 -37547
110 -37547 -2216 55130 -25112 -9631 12080 4854 8106 -29569 -6033 22292 -6771 5360
$$ packed form
0@%%%%%%%%%qJ6j6J6k4L2m0M8n6P2q8J05j29J53j77K09k49K94l40L91m50N15n87
32c13O69p61Q60r68J090j225J371j530J707j900K110k338K586k860L160l486L843
49B015m234M663n136N659o240O886p612Q433r369J0451j1712J3205j5007J7233
63I235k0066K3809k9016L6810m9899P7387k31982K48861J29827m64368K88812
74A9410J6032j32834J18163L4773o4480m847o7236J11028N6147j19233r3463J61612
86C5072N5012j79677P9432J09532j82872Q0894J16575j45633J5394M1091m1441
97a6621O5981p4023k8068Q0891l9059j3210J6603r92K9164n0173K8246N8316r4602
110c7547L5331N7346q0242J5481K1711p226L252l7675K3536K8325k9063J2131
$$ plain form
122 5360 -4244 581 17197 -6672 33391 -1803 -47548 41366 15607 -38520 15001 -20099 -21991
135 -21991 38727 -14829 -21354 10323 -6360 17219 16867 -12606 -6592 10470 16110 36 -7277
148 -7277 -3454 -13797 19752 14519 -35840 9791 13113 -18638 26367 2172 -30078 18615 7174
161 7174 -11987 6327 -15737 -10601 7715 -5017 -12146 -6517 1487 -7705 -578 11712 -13758
174 -13758 -5069 19538 -11309 -2653 15761 -15070 325 11241 -10704 3313 8095 -7143 2357
187 2357 8969 2536 1649 5195 4170 -3379 9897 7109 -11008 5632 4515 -7754 9585 1545
201 1545 -12197 8736 5869 -3618 5631 49 -2414 6299 6215 -3600 -2295 4811 -1561 627 7176
216 7176 -7249 -4166 12588 -2078 -2448 7892 -4650 43 9842 -2188 -3174 3698 -2520 393
$$ packed form
122E360r604M825J6616k3869M0063l5194m5745Q8914k5759n4127N3521l5100j892
135b1991O0718n3556o525L1677j6683K3579l52k9473O014J7062N640j6074p313
148g277L823j0343L3549n233n0359M5631L322l1751M5005k4195l2250M8693j1441
161G174j9161J8314k2064N136J8316j2732p129N629Q004r192P127J2290k5470
174a3758Q689K4607l0847Q656J8414l0831J5395J0916k1945J4017M782j5238R500
187B357O612o433q87L546j025p549J3276k788j8117J6640j117j2269J7339q040
201A545j3742K0933k867r487R249n582k463Q713q4r815J305P106o372K188O549
216G176j4425L083J6754j4666l70J0340j2542M693R799j2030r86O872o218K913
$$ plain form
230 393 4816 -3808 -4875 4588 1621 -4402 4877 450 -6402 5840 3953 -5890 2383 1232 -4761
245 -4761 4579 659 -5398 2204 958 -3235 3352 1954 -5241 1661 4539 -2712 -258 3169 -3718
260 -3718 -581 4727 -3107 -1805 2195 -2571 363 3726 -3340 -1487 3877 -1507 -303 3069 -2292
275 -2292 -2300 3694 -105 -2741 1804 -863 -2054 3037 515 -3185 1879 995 -1860 2669 473 -3180
291 -3180 1620 1840 -2219 881 615 -2672 1273 1875 -2043 -107 1434 -1780 942 2190 -2443 -588
307 -588 2187 -1376 -573 1956 -2248 -1043 2385 -1098 -1279 1419 -1088 -906 2203 -890 -1520 1530
323 1530 -370 -1228 1558 -517 -2167 1615 237 -1680 1099 -3 -1663 1442 727 -1764 911 511
339 511 -1310 1025 874 -1723 268 1385 -1215 254 1026 -1242 315 1664 -1004 -56 1318 -1011
$$ packed form
230C93M423q624j067R463k967o023R279m427o852J2242j887r843Q273j151n993
245d761R340l920o057P602j246m193O587j398p195O902K878p251K454L427o887
260c718L137N308p834J302M000m766K934L363p066J853N364n384J204L372n361
275b292qN994l799k636M545k667j191N091k522l700N064q84k855M529k196l653
291c180M800K20m059L100k66l287L945O02l918J936J541l214K722J248m633J855
307e88K775l563Q03K529m204J205L428l483j81K698k507J82L109l093o30L050
323A530j900q58K786k075j650L782j378j917K779j102j660L105p15k491K675m00
339E11j821K335j51k597J991J117k600J469P72k268J557J349k668R48J374k329
$$ plain form
355 -1011 365 1314 -946 -354 1191 -382 -420 1145 -324 -774 1331 36 -720 1105 -112 -879 1392
372 1392 -288 -770 1131 89 -627 1260 328 -724 564 504 -300 637 460 -702 353 721 -645
389 -645 204 522 -954 357 1113 -1281 -3 815 -594 444 388 -593 -260 342 103 -300 96 -300 -221
408 -221 564 -312 -647 749 98 -731 992 -246 -442 983 228 -347 139 -371 -204 628 166 -96 -63
427 -63 302 -427 -135 611 -513 336 571 -790 -19 595 -489 618 655 -552 384 371 -139 241 269 58
447 58 -129 143 -40 89 699 73 -268 468 -289 -102 674 -567 -591 480 -24 -243 124 -649 -182 -111 -18
468 -18 16 -186 57 25 438 317 -319 41 256 2 -64 365 -431 342 340 -753 546 -248 -21 172 -421 -71
490 -71 -163 453 -309 -238 219 -93 -246 474 -373 -510 384 130 -162 125 -487 -183 411 -152 -121 221 188 45
$$ packed form
355a011J376R49k260N92J545j573l8J565j469m50K105j295p56J825j217p67K271
372A392j680m82J901j042p16J887r32j052J288o0q04R37j77j162J055L68j366
389f45Q49L18j476J311P56k394J278Q18j409J038n6r81L33O02k39m03L96l96P9
408b21P85q76l35J396o51q29J723j238j96J425p55n75M86n10J67Q32m62k62L3
427f3L65p29K92P46j124Q49K35j361P71O14j084J107L7j207R36j3n10L80K8k11
447E8j87K72j83J29O10o26l41P36p57J87P76j241k4J071n04k19L67p73M67P1R3
468a8L4k02K43l2M13j21o36L60K15k54o6M29p96P73kj093J299p94K27J93n93L50
490g1r2O16p62P1M57l12j53P20q47j37Q94k54k92K87o12L04N94n63L1L42l3j43
$$ plain form
512 45 239 -266 -86 343 128 -286 32 248 -430 -104 55 -633 287 -27 -259 97 -370 -51 271 208 11
533 11 -439 504 140 169 211 -15 88 -94 -223 -463 -1 -47 148 433 -327 272 157 172 63 -225 3 91
555 91 38 -285 -457 393 -115 -20 340 -116 -33 330 -228 262 78 259 -91 -163 -180 -75 -205 105 257 69
577 69 -277 -216 -66 274 36 -209 16 79 -46 104 25 337 -175 -129 192 102 38 -120 -13 -119 400 -22 150
600 150 -93 -401 22 -19 67 48 -31 141 146 183 415 -17 126 109 303 -65 240 -21 -383 -300 172 207 -195 30
624 30 -275 275 -19 17 -124 107 -183 551 -95 -165 70 34 137 -178 97 211 -73 -27 53 -279 72 270
646 270 -266 85 -63 212 105 289 132 433 175 -241 -40 -57 1 -113 -30 -31 225 -3 -102 46 -92 88
668 88 -24 25 34 -39 -46 -171 72 -72 -16 54 -25 177 84 -17 26 3 -7 -106 104 94 119 -192 23 81 111 171 166 35
$$ packed form
512D5J94n05J80M29k15m14L18K16o78L26J59o88R20l14k32L56m67L19L22o3j97
533A1m50R43l64K9M2k26J03j82j29k40M62m6J95K85p60N99j15J5j09k88K28Q8
555I1n3l23j72Q50n08R5L60m56Q3L63n58M90j84J81l50p2j7J05j30L10J52j88
577F9l46O1J50L40k38k45K25O3j25J50p9L12n12M6L21r0o4j58J07j06N19m22J72
600A50k43l08M23m1Q6j9p9J72NL7K32m32J43j7J94l68L05k61l62Q3M72L5m02K25
624C0l05N50k94L6j41K31k90P34o46p0K35l6J03l15K75J14k84M6Q0l32L51J98
646B70n36L51j48K75j07J84j57L01k58m16K01j7N8j14Q3jK56k28r9J48j38J80
668H8j12M9Rp3pj25K43j44N6P0p9K02r3j01M3k3j0r9K10j0K5l11K15N8L0O0nj31
$$ plain form
696 35 -26 246 -134 98 107 -21 78 -95 -27 79 113 26 -85 182 179 -90 43 -113 -156 24 -85 6 29 21 104 -7
722 -7 46 -7 36 93 -51 -9 17 139 27 21 61 -42 -60 6 71 27 -58 -43 6 30 -3 6 84 26 -14 14 30 19 -8 13
752 13 -22 -100 -40 54 -21 -6 79 1 0 55 -34 31 8 61 19 34 -30 -13 -13 33 45 36 -1 18 21 -45 -25 -56 8 -29 -61 -16 -11
785 -11 -23 -22 -11 -17 -27 -1 -19 13 0 -64 61 -64 -16 68 -15 -51 20 -69 -22 18 -34 -26 60 -18 -8 -26 -3 38 -10 2 3 20
817 20 4 -29 56 -2 9 36 -1 -29 9 30 -3 32 11 13 -64 -35 -2 -9 -15 23 18 -31 26 -21 -5 11 14 -14 73 7 36 20 7
850 7 54 -1 18 14 -26 -12 -1 28 -23 -21 -12 -4 3 -1 -6 23 -30 -39 -2 -16 40 65 40 -57 -26 11 -29 -51 -3 -4 -77 58 21 -13 46
885 46 20 53 51 31 -4 19 1 29 -26 32 59 2 -14 0 -44 5 -11 0 14 -35 -14 22 20 -14 -28 1 8 9 5 53 25 -32 66
918 66 3 23 -19 -18 -12 -25 -18 -4 43 1 -16 22 1 -8 15 0 -46 19 28 13 -28 16 -69 -7 14 -49 4 35 3 29 17 24 14 22
$$ packed form
696C5o1K72l80K32Rj28R9j73O8J06L4q7j11K67lk69J33j56m3J80j09R1K3qQ3j11
722gN3n3M3N7j44M2K6J22j12oM0j03j8O6O5m4q5J5M9K4l3RP8n8m0K8J6j1k7K1
752A3l5p8O0R4p5J5Q5p8jN5q9O5k3N3m2J5o4J7%M6J2rl7J9Lo6K0l1O4l7l2M5N
785a1j2JJ1oj0K6j8L2j3o4J25j25M8Q4q3l6P1q9M7M0n2QQ6p8J0j8K3M1m8J2JJ7
817B0j6l3Q5n8J1K7l7k8L8K1l3L5k1Kp7K9L3poL8nm9N7m7J6J6Lk8Q7o6K9j6j3
850GM7n5J9mm0J4J1K9n1KRQPmnK9n3rL7j4N6K5k5r7L1L7m0k2M8jp3J35l7l4N9
885D6k6L3kk0l5K3j8K8n5N8K7n7j6J4m4M9j6J1J4m9K1L6kl4j4K9PJmM8k8n7R8
918F6o3K0m2JOj3PJ4M7m2j7L8k1rK3j5m6O5Rj5m1M4q5O2K1o3N3L1l2K6j2Pj0Q
$$ plain form
952 22 7 -11 14 -19 -5 -13 -10 -39 -16 -61 -11 4 -26 -13 -44 -9 -29 -32 43 4 45 -10 -41 20 31 -11 63 6 39 -20 -29 -6 -38
985 -38 2 9 25 75 -5 -3 -32 4 7 32 19 -6 50 -9 55 6 -44 -13 8 18 -37 -11 8 -1 -5 35 -30 31 79 -3 8 55 -61
1018 -61 -83 -270 22 10 -56 24 -295 182 -57 -69 -120 5 -169 -77 -6 9 -114 38 7 75 129 82 -40 -69 -47
1043 -47 159 154 -90 77 -213 -51 60 99 -32 -209 -93 199 -132 -111 -272 -290 -70 378 -197 -150 43 16 28
1066 28 41 17 -51 -63 -33 1 34 0 -52 -48 6 50 19 2 -13 10 34 35 -2 -50 -8 -71 3 -24 45 -24 10 0 -4 24 -28 6
1098 6 -7 14 -71 45 32 -15 12 -15 -10 -25 -43 11 -7 -24 11 23 -21 7 6 4 -14 59 59 -12 -20 1 -26 -14 7 11 -30 5 14 -16
1132 -16 4 6 8 15 35 2 33 10 -78 -46 7 -38 38 17 3 11 -20 -2 23 -3 -34 9 -16 -61 -146 11 -13 43 16 19 -37 51
1164 51 -16 -15 -43 -13 -30 16 48 52 -10 -23 61 21 -46 -70 114 -4 -176 206 203 125 -43 -52 0 102 -100 -75 -232 -121
$$ packed form
952B2j5j8K5l3J4qLk9K3m5N0J5l0J3l1L5k0lP5l9M1n5l1O1J1m2P4n7L3n9rK3l2
985c8M0PJ6N0q0Kk9L6LK5j3k5N6n9O4m9n0L1K1J0n5K6J9rmM0o5O1M8q2J1M7j16
1018f1k2j87K92j2o6Q0l19M77k39j2n1J25j74R2P1J5j23J52l1O8N4m7j22k9K2
1043d7K06nk44J67k90J62J11L9j31j77J16K92l31K1j61j8K20M48n75M7J93k7J2
1066B8J3k4o8j2L0L4L3l4n2MN4M4l1j7j5K3K4Jl7m8M2o3P4k7O9o9L4j0mK8n2L4
1098Fj3K1q5J16j3m7K7k7Nj5j8N4j8j7L5J2m4K8jkj8P3%p1qK1k7J2K1Mm1L5Rl0
1132a6K0KKPK0l3L1k3q8L2N3m5P6k1j4Ql1J8K5k6l1M3k5m5q5J57k4N6k7Ln6Q8
1164E1o7Jk8L0j7M6L2Mo2j3Q4m0o7k4J84j18j72L82lp8j68rN2J02k02K5j57J11
$$ plain form
1192 -121 8 -96 48 -50 20 -29 -11 -23 18 -27 -47 45 -24 43 2 -33 2 49 -3 -8 11 -49 27 -7 37 -57 70 -2
1220 -2 4 51 31 47 40 -15 -18 4 -57 -40 -31 34 -29 49 -1 6 38 -23 -95 64 -42 -35 -9 25 -16 30 -13 -78 -27 -41 -25 104
1252 104 16 35 103 -144 -22 -100 103 46 -54 44 -68 139 -91 -41 -125 42 26 -119 100 -64 -42 64 230
1275 230 211 -124 -66 -48 17 91 -276 184 283 27 160 156 -89 -145 -218 2 56 53 42 119 206 -221 2 135 -108
1300 -108 47 -214 -27 108 -117 135 -29 -40 -104 -192 -41 -140 -131 0 -146 -14 -38 47 -73 -99 248 -212 -39
1323 -39 39 -5 -66 183 -131 47 94 21 -65 -107 84 -13 83 -183 -141 20 46 119 -103 -74 -14 -52 -4 -19 -21 -10 -52
1350 -52 -9 41 37 -24 1 16 1 14 -22 47 -8 14 33 26 -14 37 10 -47 57 85 31 -99 -22 12 36 -47 -27 -103 -22 33
1380 33 22 5 46 11 -11 23 -28 -38 -27 21 34 -4 12 15 -13 -91 16 -20 -8 -4 -27 -30 6 43 -16 -1 2 -5 -15 -10 32 28 0
$$ packed form
1192a21J29j04J44r8P0m9J8j2M1m5k0R2o9O7m1l5L5M7n2nJ9o0P6l4M4r4J27p2
1220bOM7k0J6pn5lK2o1J7RO5o3P8n0PL2o1p2J59j06PK6L4m1M6m3o5N1j4J6J29
1252A04q8J9O8k47J22p8K03n7j00R8j12K07k30N0q4J67j6j45K19j64K2J06J66
1275B30j9l35N8J8O5P4l67M60R9k56J33mk45n6p3K20N4lj1P7Q7m27K23J33k43
1300a08J55k61J87J35k25K52j64j1o4q8J51r9RJ31j46J32k4Q5j20k6L47m60J73
1323c9P8m4o1K49l14J78M7p3q6m2J91r7R6k66M2J61K6P3k22K9O0l8M8j5kJ1m2
1350e2M3N0mo1K5J5j5J3l6O9n5K2J9pm0N1k7n7J04K8n4j30P7L4K4q3K0p6Q1N5
1380C3j1j7M1l5k2L4n1j0J1M8J3l8J6Lk8p8J07l6J2Mk3lL6L7n9J5Lpj0NM2mk8
$$ plain form
1413 0 15 -11 -8 -25 0 11 -6 61 16 47 9 25 -22 18 -1 7 -16 11 38 -47 23 33 -42 -7 22 20 -8 -12 -27 3 -9 -42 13
1446 13 18 38 -11 -46 -33 -5 -4 42 5 26 -3 4 31 42 -12 12 3 32 20 -31 22 -3 -15 -33 17 7 -20 -22 -32 57 13 20 -5
1479 -5 -35 41 52 -18 17 18 12 18 43 49 -63 52 29 -28 -6 3 6 11 0 -2 4 -11 13 12 39 -54 4 27 6 -46 0 -31 44 -50 59
1514 59 2 6 -34 -35 14 -1 34 50 0 18 7 -6 0 9 -20 -2 1 -23 28 19 18 -45 14 -8 0 5 -1 -50 58 21 -11 16 2 -33 -32
1549 -32 24 14 64 8 -7 -13 -32 16 19 -27 57 -26 -8 10 -19 -35 47 34 -8 -10 3 61 -31 38 113 -89 -42 110 -15 81
1579 81 -25 62 33 -122 162 85 29 50 -74 -183 313 -7 -57 -25 273 315 -90 -49 -12 23 -35 134 18 43 118
1604 118 40 -19 1 5 -15 8 -5 25 -19 17 18 8 17 67 -21 -12 -8 -12 -10 22 -15 -40 -21 9 7 20 -18 -34 -22 -12 68 41 50 -6
1638 -6 10 15 -40 -22 21 37 -7 21 25 10 25 47 -11 8 -49 52 -19 86 19 126 -273 17 162 121 -37 -101 17 -52
$$ packed form
1413@J5k6Lj7K5J1j7O7m5L1l8J6m7M0j9Qk3K7K7q5P0J0p5L5K9kk8mj5L0j2l3N5
1446A3NK0m9l5J3K8JM6l7K1k9PK7J1n4K4rK9j2n1N3k5j2j8N0j0k7kj0Q9m4Pk5
1479el0P6J1p0L5JoOK5Oj12J15k3n7K2RLNj1kOj5K4jK7r3N8K3k1n2M6l1P5r4J09
1514E9n7Mm0jM9j5L5J6n0J8j1j3ORk9J8Lk4N1rjo3N9k2QNom9J08l7l2K7j4l5J
1549c2N6j0N0n6j5oj9M8Lm6Q4q3J8J8k9j6Q2j3m2kJ3N8r2O9P5k02M7J52j25R6
1579H1j06Q7k9j55K84p7n6K1j24j09M96l20n0L2K98M2m05M1L7L5n8J69j16K5P5
1604A18p8n9K0Mk0K3j3L0m4L6Jj0RN0q8RMmKL2l7k5J9L0kJ3l8j6J2J0Q0k7Rn6
1638fJ6Nn5J8M3J6m4K8Mj5J5K2n8J9n7J01p1J05o7J07l99K90J45m1j58o4J18o9
$$ plain form
1666 -52 30 0 -2 3 45 -30 18 -34 49 -29 -6 -4 21 -2 36 10 -23 32 -17 5 5 -4 33 15 -5 38 4 -25 -6 8 71 32 44
1699 44 -10 -1 18 31 42 -32 10 20 3 -14 54 -10 7 -28 18 30 -8 40 30 11 -7 42 -6 21 -6 6 -16 10 0 -6 -69
1730 -69 -8 15 -28 -58 -14 -18 -2 12 -40 11 -27 5 -31 21 -8 -20 -5 -13 -23 31 -27 -26 -26 12 -5 -6 -10 17 4 16 -18 -11 17 18
1764 18 40 19 -25 14 -21 6 12 1 16 -34 -24 0 45 57 -12 24 -32 -10 19 -1 -23 41 7 32 13 -29 -18 -23 -15 -26 -25 23
1796 23 18 -1 36 -56 -31 27 -4 -17 -14 -13 -3 -11 26 -2 -20 23 -29 -1 13 19 17 4 41 3 -6 -36 11 14 -18 35 -28 31 -9 -15 20
1831 20 -9 20 -32 7 0 -68 -28 24 51 10 -55 6 -18 -30 -2 57 -38 65 25 24 37 -2 41 37 57 40 11 27 68 -5 29
1862 29 32 -28 -11 -17 -13 31 11 -32 -3 0 30 -7 6 30 -18 16 -13 -40 -40 32 -27 31 -14 34 40 12 17 19 -18 12 -8 33 -13 -18 22
1897 22 35 -17 -12 2 5 -42 17 32 3 -6 -9 14 -52 32 -18 28 9 23 -3 24 -17 51 43 10 5 11 46 -24 2 -24 -12 11 4 -46
$$ packed form
1666e2Q2l0kNM2p5M8n2Q3p8K3KK5k3L8k6l3N5m9K2%rL7j8k0M3l4k9J9J4O3l9J2
1699D4n4RJ9J3J1p4M2J0j7j7O8o4J7l5M6J2l8M8j0j9j8M9m8K7k7J2k2K6j0oo3
1730f9O1K3m3l0M4mJ6J4n2N1l8L2l6N2k9j2J5qj0N4n8J%L8j7jmK7j3J2l4PK8J
1764A8K2k1m4L9l5K7Oj1J5n0J0K4M5J2o9L6n6K2K9k0k2O4l4K5j9m2J1nQj1JM8
1796B3nj9L7r2K5N8l1j3LJJ0qL7k8j8M3n2K8J4Okj3L7l8rl0M7Ll2N3o3N9m0oL5
1831B0k9K9n2L9po8M0N2K7m1o5O1k4j2K8N9r5J03m0jJ3l9M3mK0j7k9J6M1p3L4
1862B9Lo0J7oMM4k0m3K9LL0l7J3K4m8L4k9k7%P2n9N8m5M8Ok8NKl7L0k0M1m6nM0
1897B2J3n2NJ4Lm7N9J5k9rlK3o6Q4n0M6j9J4k6K7m1O8ql3nOL5p0K6k6J2K3pn0
$$ plain form
1931 -46 18 18 -23 35 2 31 -32 -3 0 -16 -21 2 14 -40 -1 -1 -18 1 55 12 -4 -11 28 13 11 7 4 -16 -12 -3 41 37 -6 2 31 -5
1967 -5 9 -11 6 4 -34 8 -25 9 4 -45 22 -17 39 -46 -21 -12 30 -9 27 29 -2 -4 4 15 4 3 -38 50 -15 2 -4 -59 -22 15 -1
2002 -1 -18 11 26 -31 25 -19 -17 46 -49 20 36 -52 -23 -64 -37 21 -14 25 -14 -51 -28 -5 -31 -11 -38 -15 6 31 -11 -9 7 -14
2034 -14 -72 41 -1 -15 7 -16 28 0 26 -11 54 6 -6 23 -1 43 -43 34 5 -15 20 41 -30 13 39 21 -4 -24 -11 -21
2064 -21 -7 7 -34 -36 33 -28 -26 -15 -58 -23 -68 10 13 -3 37 -6 -47 -31 55 27 10 -18 -13 22 -12 -30 -8 18 -7 19 81 47
2096 47 37 16 17 -14 19 -7 10 -10 -62 -35 -55 -32 23 55 35 1 -16 -40 4 -13 -51 -10 -44 -32 16 -37 7 -18 36 4 3
2127 3 -32 -12 12 33 19 -16 0 19 8 -16 -29 5 41 -50 21 -3 -16 -36 7 14 -53 15 19 -19 55 13 -4 33 4 13 13 -28 42
2160 42 -39 -25 -67 -81 -35 -11 -20 -2 13 15 67 62 -29 -21 -67 -26 -23 -39 -14 -5 -26 -15 -82 -15 -20 -319 6 77 -161 13 -167
$$ packed form
1931d6O4%m1N8l3K9o3K9Lj6nK3J2n4L9%j7J9N4m3j6pL9j5kmlk0MRM4mm3QK9l6
1967eJ4k0J7kl8M2l3L4nm9O7l9N6q5K5RM2l9L6Kl1kQJ1j1jm1Q8o5J7on5L7L7j6
2002aj7K9J5n7N6m4KO3r5O9J6q8K9m1K7N8l5L9l9l7K3K3k6K0k7K3K1K5m2KJ6k1
2034a4n8J13m2j4K2k3M4k8K6l7O5m8j2K9k4M4q6P7k9k0L5K1p1M3K6j8k5k0J3j0
2064b1J4J4m1kO9o1KJ1m3L5m5P8Lj6M0m3m1J6Q6k8j7k8NL5l4j8K2K6k5K6O2l4
2096D7j0k1Jl1L3k6J7k0n2K7k0K3N5L2k0l4j7k4M4j7l8M1l4J2M8n3M4k5N4l2j
2127Cl5K0K4K1j4l5J6J9j1k4j3L4L6r1P1k4j3k0M3Po7O8Ml8P4m2j7L7k9R%m1P0
2160D2q1J4m2j4M6K4rJ8J5KN2nr1Qm6M1Lj6K5Rk1J1o7O7nk99L25P1k38J74j80
$$ plain form
2191 -167 -89 13 44 8 -99 -48 -162 19 -9 -69 -41 135 165 -138 57 80 71 8 -398 2 65 -172 -15 -83 -279
2216 -279 -58 -210 -115 469 -74 138 48 -132 26 46 -64 21 141 22 -63 122 -181 39 103 -182 189 80
2238 80 217 -87 183 38 -131 -33 87 28 65 -10 98 9 10 -57 17 -12 9 -35 6 -23 -12 76 -3 21 -5 0 29 -6
2266 -6 -18 29 -1 16 -50 23 -6 29 -39 53 -3 -52 -23 19 15 -17 60 14 4 7 29 2 -34 17 12 -7 8 -2 -21 -2 7 -7 6
2299 6 3 -57 -18 0 9 24 -9 28 -9 -32 -16 -6 20 17 -31 -10 -31 -14 33 34 52 24 -28 -25 -24 75 22 35 65 18 18 215 18
2332 18 3 -72 106 29 57 -62 -18 -163 29 82 79 99 -67 216 -26 -109 -268 109 -39 -123 -114 -56 10 -1 269 -237
2358 -237 -277 163 -291 226 156 -150 167 101 85 -18 56 -90 4 29 56 12 125 58 -1 22 57 246 180 -166 141
2383 141 79 14 -21 41 105 63 -6 25 -55 34 -101 -11 52 -14 6 8 10 22 66 31 11 4 16 -4 20 50 -24 -27 0 -29 -6
$$ packed form
2191a67P8J02L1l6j07N1j14J81k8o0K8J76L0l03J95K3ro3m06M00O3k37J57o8j96
2216b79K21j52R5N84n43K12r0j80J58K0j10Q5J20j19q5J85l03K20O4k85L71j09
2238H0J37l04K70j45j69R8J20n9L7p5J08q9Jo7P4k9K1m4M1k9J1Q8p9K4k6NK9l5
2266fj2M7l0J7o6P3k9L5o8R2n6m9K9M2ml2P7m6j0LK2k7l6N1nj9J5j0j9J9Rj4J3
2299Flo0L9J8RJ5l3L7l7k3J6J0K6lm8K1k1J7M7JJ8k8n2LJR9n3J3L0m7%J97j97
2332A8j5p5J78p7K8j19M4j45J92N3lK0j66K83k42q3j59L77j48q4RN8O6j1K70n06
2358b37m0M40m54N17p0l06L17o6j6j03P4j46R4K5K7m4J13o7n9K3L5J89o6l46L07
2383A41o2o5l5O2O4m2o9L1q0Q9j35R0O3o6K0KKJ2M4l5k0pJ2k0K4L0p4lK7k9K3
$$ plain form
2414 -6 -20 -23 6 -27 -18 0 -14 -30 13 -22 32 -20 -56 -54 19 26 -24 48 2 55 -15 -3 33 33 -32 45 -14 56 26 20 -8 8 -9 -10
2448 -10 16 4 -33 -23 30 18 3 -29 -5 66 59 -58 26 7 -6 9 20 -11 -6 31 0 -14 44 34 -12 38 27 -52 28 29 -3
2479 -3 51 -3 36 9 -15 2 -6 -6 4 77 35 12 -7 -22 -14 -18 41 28 95 -19 11 -16 51 10 36 -53 145 -46 81 -27
2509 -27 -104 -8 -194 69 54 82 66 34 134 106 -38 -2 37 181 -55 2 -68 117 31 -41 15 294 331 -130 101
2534 101 217 -176 424 -23 39 362 -55 87 97 -127 -133 -68 -2 171 -40 -116 -90 73 69 -64 -24 -112 -51 15 92
2559 92 1 50 -14 -10 37 15 -42 -33 41 -3 -66 -15 -9 19 -1 60 28 23 24 -11 -44 -29 -5 -18 23 -9 -13 -77 -1 -31 -28 2 -37 -10
2593 -10 0 19 1 -35 40 12 22 6 19 -28 -12 38 23 -20 28 -23 20 -64 -15 -4 -5 13 -7 -21 56 14 30 11 0 59 2
2624 2 14 -4 28 -8 16 32 65 25 43 42 35 21 32 8 54 -31 9 11 -18 -41 -9 8 -22 2 0 4 2 10 -9 65 8 42 18 -31
$$ packed form
2414fj4lK9l3RJ8j4j6M3l5N4n2l6KP3Pn0P2m6N3p0J2L6%o5P7n9P0l0ok8J6j7j
2448a0K6j2l7J0N3j2j5l2K4P1pj17Q4j9j3J5J1l1NL7l1j4N8j0m6N0j1p9Q0Jl2
2479cN4n4L9k7k4J7q%J0P3m2k3j9j5QmN9j3O7j14L0k7O7m1K6q9J98j91J27j08
2509b7p7R6j86K63j5K8j6l2J00k8j44L6L9J44k36N7p0J85q6p2N6K79L7m61K31
2534A01J16l93O00m47O2L23m17J42J0k24oO5O6J73k11p6K6J63mj33M0q8O1O6P7
2559I2r1M9o4MM7k2n7RP4m4o3N1OK8k0O1l2nJl5l3J5K4j3M1l2mo4P6l0LL0l9K7
2593a0J0J9j8l6P5k8J0j6J3m7J6N0j5m3M8n1M3q4M9J1jJ8k0j4P7m2J6j9j1N9n7
2624BJ2j8L2l6K4J6L3m0J8jpj4J1k4M6q5M0Kk9k3L2J7l0K4kMkQj9P4n7L4k4m9
$$ plain form
2658 -31 -47 -9 -34 34 -10 0 42 -19 0 4 28 -24 -28 -13 21 17 0 -32 34 7 19 2 15 -81 -65 -19 51 -17 -83 97 -205
2689 -205 48 295 55 154 -120 7 -56 38 27 -19 -4 27 -23 8 -22 -20 -39 -50 8 78 -4 -104 34 136 19 -19
2715 -19 28 46 106 40 -21 -108 62 56 -51 -6 56 -24 9 -32 -9 -173 96 113 -138 -71 -117 -222 -27 49 89 -57 137
2742 137 -122 -30 141 -9 125 90 65 92 -239 -76 -161 -88 235 -360 -106 -296 -199 28 -132 -71 -30 507 -115
2765 -115 2 221 178 42 43 -21 170 116 123 -204 -383 -283 114 52 -70 87 145 -90 -60 46 -131 -31 31 -9
2789 -9 1 94 223 -166 -200 -8 147 -95 -20 270 -14 -418 1 -135 -231 -95 259 -31 130 151 -281 316 -108
2812 -108 -146 -217 150 -100 -11 120 -154 -51 401 135 167 27 193 -136 177 319 89 -37 -7 53 140 82 186
2835 186 93 55 142 55 -17 -148 -64 63 -99 33 149 1 73 -5 -12 -14 -10 -26 71 -52 -28 21 18 14 -21 -5 -51 -48 59
$$ packed form
2658c1j6L8k5O8m4J0M2o1J9MK4n2mJ5L4mj7l2O6k7J2j7J3r6J6M6P0o8o6J80l02
2689b05K53K47k40R9k74J27o3R4j1m6J5L1n0L1l0Kj9j1N8P0q2j00J38J02j17l8
2715a9M7J8O0o6o1q7J70oj07M5O2q0L3m1K3j64K69J7k51O7m6j05J95P6M0j46J94
2742A37k59R2J71j50J34l5k5K7l31J63q5P3L23n95K54j90R7K27j60O1M1N37o22
2765a15J17K19m3j36Jo4J91n4Pl27j79J00L97o2j22J57N8k35L0J06j77J00O2m0
2789iJ0R3J29l89l4J92J55k42P5K90k84m04M19j36r6J36L54k90J61K1m32N97m24
2812a08l8p1L67k50Q9J31k74J03M52k66L2j40J66l29L13J42k30j26L0O0Q7n8J04
2835A86r3l8Q7q7p2j31Q4J27j62J32J16j48P2p8pkMj6R7j23K4M9lml5J6m6LJ07
$$ plain form
2864 59 -15 34 10 1 53 -41 55 -4 133 -17 11 -6 -99 -35 164 26 11 22 19 -10 -13 20 -46 -18 -44 -39 -17 -96 33 105
2894 105 -34 -47 -54 -55 47 -123 79 -76 46 -60 -108 44 -35 -174 -165 40 -106 -10 -66 -12 211 15 -106 114
2918 114 -56 4 -89 17 -101 35 173 71 55 -159 48 12 65 -174 -53 3 83 -137 -38 18 149 -295 118
2941 118 -80 109 23 -137 186 -27 233 326 37 -62 -51 101 84 -23 -101 139 576 -327 183 363 -299 -38
2963 -38 114 64 368 -143 -141 122 -242 44 -197 64 180 132 156 -313 -363 265 -543 -212 -272 78 364 219 2
2986 2 -286 -15 250 167 2 469 -375 505 87 76 125 -551 188 -214 168 -32 -184 -304 268 28 -132 92
3008 92 -181 13 -173 -92 -87 -150 -31 50 261 -70 -21 -24 -148 18 -113 -143 -161 111 -60 -195 128 142 -272 -249
3032 -249 -76 -49 29 131 186 -116 -62 -58 -144 16 65 2 -88 7 -21 -88 -42 -55 -78 8 42 -75 -74 175 16 246 -95
$$ packed form
2864E9p4M9k4rN2r4R6n9J37j50K8j7r3O4J99j38j5J1lk9lL3o6K8k6NK2p9J29P2
2894A05j39j3pjJ02j70K02j55J22j06m8J52p9j39RK05j46R6n6N4K23j96j21K20
2918A14j70O0r3J06j18J36J38j02j6k14K07l6N3k39J21N6Q0k20R9N6J31m44M13
2941A18j98J89q6j60L23k13K60R3k89r9J1J52j7j07p8K40M37r03N10J80o62K61
2963c8J52n0L04n11KK63l64K86k41K61J16m8K4m69n0O28q08L31o0L50K86j45k17
2986Bk88K71K65q3j65M67q44Q80m18j1M9o76P39m02L82k00j52j20N72k40j60K24
3008I2k73J94j86Q1No3J19Q1K11l31M9lj24J66j31l0j8K72j71j35L23J4m14K3
3032b49J73K7P8J02N5l02N4Mq6J60M9o3r0R5k8o7M6j3k3Q6L4j17JK49j59K30l41
$$ plain form
3059 -95 44 88 57 -115 77 -18 7 44 -15 -89 82 -160 -28 91 63 131 10 -29 69 -233 3 -7 -47 -150 -149
3084 -149 169 -50 -183 -45 130 -89 21 -28 -106 60 -46 -16 -4 4 -79 -102 65 -47 -30 44 -1 -160 -90 -12
3108 -12 -33 -124 -60 8 58 -5 26 37 -48 -10 63 57 32 -52 117 78 87 39 -67 46 107 95 -8 41 -31 -114 -42 77 -27
3137 -27 118 105 0 56 -44 -29 -9 -10 42 -84 -39 24 36 -15 44 -19 130 58 91 -14 -75 70 20 87 -68 53
3163 53 -101 -25 -16 -15 -82 146 59 35 88 57 42 -60 -6 -112 55 45 12 -62 72 -27 -35 87 0 162 -1 -101 45
3190 45 15 25 -123 -19 -24 64 35 -47 16 50 -79 -28 -55 -31 -60 77 18 49 78 -67 3 50 19 37 38 -7 68 50 26
3219 26 -107 -31 -31 46 -108 -9 95 -55 -3 87 50 20 33 -46 52 -15 68 48 -20 8 60 -125 54 232 55 116 -61
3246 -61 11 207 76 92 219 -129 -257 -76 -51 -79 15 -52 -12 45 214 96 -368 135 7 34 59 -147 103 -102
$$ packed form
3059i5J39M4l1j72J92r5K5L7n9p4J71k42J32J19k8O8j21l9R8l02K36j0m0j03J
3084a49L18k19j33J38J75k19J10m9p8J66j06L0J2Qq3k3J67j12J7P4m5j59P0P8
3108a2k1r1O4O8N0o3L1J1q5L8P3ok5q4J69l9Rm8j06J13O1j2j03M9p2q3P2J19j04
3137b7J45j3j05N6j00J5K0jN2j26M5O3J2n1N9o3J49p2L3j05o1J45n0O7j55J21
3163E3j54P6RJo7K28q7k4N3l1j5j02N4j06J67j0l3p4J34r9qJ22q7J62j63j00J46
3190D5l0J0j48J04nQ8k9q2O3L4j29N1k7K4k9J37n9L1K9j45P0M7l1J8Jm5P5j8k4
3219B6j33P6%P7j54R9J04j50N2R0l7l0J3p9R8o7Q3k0o8K8N2j85J79J78j77O1j77
3246f1P2J96j31J6J27l48j28J81K5k8R4o7M0N7J69j18m64N03j28K7K5k06K50k05
$$ plain form
3270 -102 -97 164 241 -154 18 97 86 204 75 -188 -199 48 17 -144 -123 103 -165 0 -68 13 -75 48 -91 107
3294 107 -4 -10 -60 40 10 -19 -23 -25 -135 -123 -5 -65 55 55 20 -68 -43 91 194 -79 52 40 -264 38 87 65
3320 65 -252 63 47 -19 55 -82 161 1 -140 -87 -6 -19 136 -14 -192 13 -296 -138 -99 -19 150 62 -148
3343 -148 -29 -14 -146 -218 238 92 10 -165 153 -5 -26 53 -74 59 -331 -80 -234 -116 137 -13 -217 -1
3365 -1 102 -188 -91 -5 76 89 -373 -171 230 302 -126 180 382 188 -82 -235 -80 -192 -74 86 -204 258
3387 258 -90 -88 186 254 -62 -41 -61 319 -205 53 81 -34 272 113 -165 -232 171 386 -319 -170 107 383
3409 383 -48 266 315 -38 -251 -202 60 -312 -121 -347 28 -75 -96 -41 119 186 67 -109 92 -193 -49 95
3431 95 -87 -70 47 85 90 144 204 -28 -53 -38 84 27 49 29 1 -93 54 -72 30 45 -28 1 18 30 51 -19 -5
$$ packed form
3270a02NK61P7l95J72P9j1J18j29k63j1K47l1j61K1K26k68J65o8Q1q8J23j39J98
3294A07j11on0J00l0k9mkj10J2J18o0J20%l5q8K5J34J03k73J31j2l04L02M9k2
3320F5l17L15j6o6P4j37K43j60j41N3Q1j3J55j50j78K05l09J58L9Q0J69q8k10
3343a48J19J5j32p2M56j46q2j75L18j58k1P9j27J33l90K51j54J18K53j50k04K16
3365aJ03k90R7Q6Q1J3m62K02M01P2m28L06K02j94k70j53J55j12J18J60k90M62
3387B58l48KK74O8l16K1k0L80n24K58K8j15L06j59k78o7M03K15p05J49K77K76
3409C83m31L14M9l53k13M9K62l72J91k26L75j03k1N5J60O7j19j76K01k85J44J44
3431I5j82J7J17L8NN4O0k32k5J5J22n7K2k0k8r4J47j26J02J5p3K9J7J2K1p0J4
$$ plain form
3458 -5 37 -29 -16 -17 -27 -37 2 -22 36 44 -17 -8 -12 -24 -1 -20 -45 -20 -26 -22 14 -14 -19 58 -12 7 7 -38 20 -50 34 50 -13 -6 -149
3493 -149 48 -45 -17 -58 -30 -101 5 81 -146 -163 52 42 -61 34 75 75 -42 175 46 -64 1 -105 116 -103
3517 -103 -42 199 304 233 -116 280 166 264 -14 208 41 21 27 93 20 273 -4 108 -103 -205 49 -161 -119
3540 -119 -98 137 215 -25 -32 163 187 -51 42 -170 -104 -434 1 348 13 -147 179 537 98 185 74 146 -501
3563 -501 43 -368 -385 -302 130 -322 34 -77 217 75 91 36 -45 394 -401 202 -29 63 -88 90 91 -19 65
3586 65 260 -78 4 264 -23 -3 321 5 74 -73 103 -114 58 -129 -390 -72 239 48 -32 -136 -10 166
3608 166 -145 -35 -6 59 125 145 -26 88 38 367 55 -58 -217 1 115 30 115 197 -233 -19 -92 -26 129
3631 129 111 166 36 25 -71 32 -134 -326 48 -290 -112 -40 -28 -79 131 45 -50 -132 -233 -355 -74 -66 -231 -24
$$ packed form
3458eM2o6J3jj0j0L9k4N8Qo1Rmj2K3j9k5K5oML6k8nP7p0J9%m5N8p0Q4J6o3Pj43
3493a49J97r3K8m1K8p1J06P6k27j7K15j0j03R5M1%j17K17j29j10O5j06K21k19
3517a03O1K41J05p1l49L96j14R8k78K22j67k0OO6p3K53k77J12k11j02K54k10M2
3540a19K1K35P8k40pJ95K4k38R3k12O6l30M35L47l35j60L26L58m39Q7j11P2o47
3563e01N44m11j7Q3M32m52L56j11K94j42J6n5q1M39p95O03k31R2j51J78Jj10Q4
3586F5J95l38Q2K60k87K0L24l16O9j47J76k17J72j87k61L18L11j91q0j04J26J76
3608A66l11J10K9O5O6K0j71J14n0L29l12j13j59K18J14q5Q5Q2m30K14p3O6J55
3631A29j8N5j30j1r6J03j66j92L74l38J78P2J2n1K10q6r5q2j01j22K81Qj65K07
$$ plain form
3655 -24 -29 57 9 -308 36 -50 -156 -88 89 -68 -280 -59 -5 -68 73 156 -203 147 18 63 83 32 -100 -227
3679 -227 -150 100 382 532 -215 -157 138 199 155 -167 131 21 7 -56 64 -29 -88 22 171 -30 -174 79 159
3702 159 -2 192 187 45 -5 172 -266 397 120 -32 13 373 175 232 222 46 249 -109 142 207 -447 69
3724 69 -10 162 8 -74 119 33 242 125 107 163 -217 -117 -75 88 153 109 268 -130 266 446 -18 6 302
3747 302 -179 223 465 -213 -240 -239 -86 -96 -209 108 -105 -337 -169 295 -125 -102 -352 -133 -36 150 -15 21
3769 21 3 105 -129 -266 -159 -404 439 -158 -68 -113 11 -1 -312 185 -126 209 197 -166 35 55 -69 354
3791 354 -26 21 96 67 52 134 -20 31 192 22 58 1 61 16 31 17 -167 9 70 164 238 -198 -75 -55 63
3816 63 44 123 6 57 22 41 22 -76 -108 134 -172 83 237 24 15 -69 -101 -59 31 -146 72 40 -28 -45 5 -6 26
$$ packed form
3655b4nQ6m8l17L44q6j06O8J77j57k12K21N4o3J41Q3l59L50j29M5K0n1j32j27
3679b27P7K50K82J50p47N8K95O1m4l22K98j10j4o3J20r3n9J10J49k01j44K53Q0
3702A59j61J94nj42n0J77m38O63k77j52M5L60j98N7j0j76K03l58K51O5o54N16
3724F9p9J72j54q2J93q6K09j17j8N6l80J00M2J63O5m4J59l98L96J80m64K4K96
3747C02m81M02K42o78k7JJ53j0j13L17k13k32J68M64m20K3k50K19R7J86j65L6
3769B1j8J02k34j37J07k45Q43n97R0m5J24j2l11M97l11L35j2l63K01K0j24M23
3791C54l80M7P5k9j5Q2j54N1J61j70L6n7O0m5J5j4j84J76O1R4P4m36J23K0J18
3816F3j9P9j17N1l5J9j9r8l2K42l06K55J54k13rq4l2M2R0j77K18l2o8j7N0j1L2
$$ plain form
3843 26 45 32 56 24 -23 -32 21 48 15 -7 40 13 38 -2 -17 60 -8 34 7 -32 20 -44 -6 -11 -31 0 -9 17 0 -46 50 10
3875 10 -50 -27 -29 14 -1 18 24 -34 -20 14 -21 -97 57 36 1 -9 206 16 135 27 15 114 8 122 0 -62 132
3902 132 33 -57 -59 -161 -110 111 41 -3 72 -65 95 21 -9 41 19 -59 -4 2 -12 -15 7 -66 0 12 26 15 12 -33 -29 -29 37
3933 37 20 9 40 1 -43 -18 82 49 0 37 3 55 26 -51 -80 8 32 88 39 39 -54 1 -23 -2 7 2 11 -20 34 -23 -2 -33
3965 -33 -27 -16 -15 34 -18 -8 2 63 -62 36 15 79 27 -7 -63 103 77 -21 164 10 -14 42 39 -22 30 -79 -4 -50 -43 136
3995 136 63 -52 -22 -36 -82 -36 -16 -43 -27 10 10 100 133 -19 -41 -55 -25 292 -151 64 -64 -9 -50 -54 90 263 -69
4022 -69 -116 115 -42 86 -200 -119 -15 -7 57 60 20 121 -77 100 156 -51 -40 -38 -90 -40 45 -157 -187 -2 -145 -173
4048 -173 11 -12 -142 183 93 -209 -102 0 -59 -152 61 -137 -165 -50 -111 266 47 143 13 142 -29 -202
$$ packed form
3843B6J9j3K4l2m7rN3K7l3k2M7k7K5m0j5P7o8M2k7l9N2o4L8nk0L1rK6j7m6R6m0
3875A0o0K3kM3j5J9On8J4L4l5p6J54k1l5j0K15j90J19j08j2R9j06J14j22o2J94
3902A32r9r0kj02N1K21p0m4P5j37J60p4l0N0k2p8N5Oj4lK2p3O6J2J4j1lm5M%O6
3933C7j7j1L1l9m4K5J00l3m9L7l4N2k9p7k9Q8K4N6m9%r3N5k4K1RnRl1N4n7K1l1
3965c3OJ1JM9n2J0J0O1j25R8k1O4n2l4n6J66k6r8J85j54k4N6lo1N2j09P5m6PJ79
3995A36p3j15L0j4m6M6K0k7J6L7%R0L3j52k2j4L0L17m43K15j28N5m1mJ44J73l32
4022f9m7K31j57J28k86Q1J04QO4Lm0J01j98J77N6k07J1Kn2N0Q5k02l0J85j43k8
4048a73J84k3j30L25r0l02J07J02n9r3K13j98k8J15o1L77k19R6j30J29j71j73
$$ plain form
4070 -202 137 39 -36 158 54 116 18 33 -4 153 68 52 18 -127 36 -186 153 -102 -42 -278 190 353 66
4093 66 -63 -64 164 -191 -159 -150 73 147 -72 -81 -119 57 287 -90 -170 -9 157 29 22 -100 67 9 12 23 -66 -37
4119 -37 -74 -35 -1 26 25 9 -19 30 -46 -36 -26 5 -33 -19 -3 42 19 15 52 -50 46 30 -11 50 29 -13 2 -5 -52 -33 -24 6
4151 6 -4 -18 12 5 -8 9 30 -15 14 -39 18 1 27 -7 -41 12 -19 39 -1 8 19 21 16 46 24 -26 4 3 39 -15 -1 -30 -36 -39
4185 -39 -25 -18 6 -39 -32 40 16 59 17 26 1 6 -23 -8 6 15 15 12 -20 -1 0 -1 -26 16 -9 29 5 42 -40 -25 60 -6 -26 46 19
4220 19 -61 23 3 -33 -4 6 -50 -2 -59 -10 26 35 -5 -8 -8 5 -40 23 -21 8 4 -26 47 0 2 2 24 36 -30 18 68 28 1
4253 1 48 -12 -93 58 -55 2 -49 90 -70 67 -36 39 -209 60 -206 -40 -127 -252 25 214 14 -50 -1 -22
4277 -22 123 20 60 111 -233 -23 -19 -158 24 -29 184 -122 -103 -217 40 176 -26 -213 196 34 35 108 -176
$$ packed form
4070b02L39r8p5J94j04O2r8J5l7J57q5j6l4j45J63k22L39k55O0k36M68J63k87
4093F6j29jK28l55L2RK23P4k19rl8J76K30l77q0J61J66j28pj22J67n8LJ1q9K9
4119c7l7L9L4K7jj6k8M9p6J0J0L1l8J4J6M5k3mL7j02R6j6m1O1k1m2J5pm7J9RL0
4151Fj0j4L0pj3J7K1m5K9n3N7j7K6l4l4N3l1N8m0RJ1KnL0k2n0L0jL6n4J4k9ol
4185c9J4PK4m5PP2k4M3m2Rk5Nk9J5J4R%ll2J9Jjk5M2k5L8k4L7q2J5Q5o6k0P2k7
4220A9q0Q4k0l6K9J0n6M8n7M9L6Rm0l%J3m5O3m4K9ml0P3m7K%K2J2o6M8N0m0k7
4253AM7o0q1J51j13N7n1J39j60J37j03P5k48K69k66J66q7j25K77J89k00o4M9k1
4277b2J45j03M0N1l44K10Mj39J82n3K13l06J9j14K57J36k02j87M09j62JP3k84
$$ plain form
4300 -176 -230 117 -13 -94 -54 -32 -57 -79 -144 12 52 -18 -16 -64 133 80 50 19 -44 49 -1 35 77 -46 -16 67 -45
4327 -45 -9 -73 35 -44 2 -61 31 42 24 51 11 11 17 2 -18 62 9 34 -15 29 61 10 26 17 41 -30 -23 66 -56 -65 13 -9
4359 -9 -22 1 10 93 -26 1 120 37 -100 25 149 74 88 -20 66 31 -87 262 29 -46 -6 100 340 -56 95
4384 95 126 -148 -203 -209 100 -180 -13 47 3 164 -90 -73 -108 198 -92 149 167 -56 68 180 -222 45 85 -2
4408 -2 57 50 -40 30 -145 135 33 -154 46 108 -100 -166 148 108 -110 -122 12 162 -25 -69 152 28 -42 6 50
4433 50 59 86 72 -27 62 -144 57 35 -20 -194 93 98 11 -73 -52 0 -67 -17 242 146 247 32 98 -126 16 -43 -130
4460 -130 31 -77 51 -20 -110 58 -143 155 140 11 187 17 53 56 73 -8 89 12 -174 101 21 -46 -1 128
4484 128 19 61 10 -30 22 212 -156 79 -12 -77 -205 62 -81 70 81 186 -177 -217 -21 -11 -6 76 28 -53 -39
$$ packed form
4300a76n4L47j30q1M0K2k5k2o5J56M0p0Km8J97n3l0l1o3R3n0L6M2j23L0Q3j12
4327d5L6o4J08p9M6o3R2J1j8K7m0%Oj5k0Q0n3K5m9M4L2n1J6rK4p1PQ9j22rP8k2
4359ij3K3RQ3j19K7J19q3j37J25J24p5J4j08Q6l5j18L49k33p5M0J06K40l96J51
4384I5L1k74n5oL09k80J67O0m4J61k54J7l5L06k90K41J8k23J24J12m02K67M0q7
4408bN9pr0P0j75K80j02j87K00O2k08o6L14m0k18j2J34J50j87m4K21j24p0M8M4
4433E0RK7j4r9Q9k06K01k2n5j74K87Nq7q4K1N2o7N0K59r6J01k15O6k24J42n9q7
4460a30J61j08J28p1r0J68k01K98j5j29J76j70L6LJ7q1R7p7j86K75q0o7M5J29
4484A28j09M2n1m0N2J90l68K35r1o5j28K67j43J51J1J05l63m0J96J0NQ2m8q1J4
$$ plain form
4509 -39 -56 149 262 154 -35 166 190 -52 -81 255 26 215 -58 -53 99 34 30 58 72 -50 19 -17 -169 -33
4533 -33 -45 -20 40 79 6 44 57 -20 -36 -10 -53 -12 12 3 -17 8 -5 20 36 1 29 29 -24 4 12 44 11 -13 -38 -51 63
4564 63 61 3 2 -17 -41 26 -7 31 -34 36 -15 -19 -34 -5 4 22 52 12 -5 -25 17 21 8 86 44 -8 8 -3 -9 37 -10 15 8 9
4598 9 -27 21 -34 -28 -2 11 -10 -28 -55 -29 19 14 14 23 -7 -19 2 -8 -4 -35 -20 4 58 8 -42 6 25 0 29 -10 -9 39 40 39 -48
4633 -48 12 27 3 6 -10 71 -18 36 14 -13 35 22 5 -12 35 -61 -5 -16 31 -4 -20 42 -11 -9 34 34 -53 -120 -11 -6 -162
4664 -162 102 25 -151 -102 -56 -69 -134 137 9 82 -159 45 -142 -275 -151 -70 -59 -71 -220 -275 -74 0 -227 -240
4688 -240 -136 25 59 98 260 -187 -242 -3 129 -473 -75 -251 74 -115 329 553 85 196 -221 312 96
4709 96 147 170 111 -257 -75 -173 62 43 -163 -68 74 135 -178 -136 -2 -85 99 -72 61 235 420 -142 -246
$$ packed form
4509c9j7K05J13j08j89K01K4k42k9L36k29J89k73NJ52o5mK8J4j22O9l6j52J36
4533c3j2K5O0L9p3L8J3p7j6K6m3M1K4rk0K5j3K5J6l5K8%n3K8QL2l3k4k5j3J14
4564F3kn8jj9k4O7l3L8o5P0n1mj5K9RJ8L0m0j7k0M2Mj3P8m2n2J6j1oM6m7K5pJ
4598Il6M8n5OK6J3k1j8k7K6M8n%Rl0j2K1j0Ml1J5K4N4n0n0M8J9k5K9l9JM8Jjq7
4633d8O0J5k4Lj6Q1q9N4k2k7M8j3j7j7M7r6N6j1M7l5j6O2n3KM3%q7o7J09Nj56
4664a62K64p7j76M9M6j3o5K71j28P3k41K04j87j33J24Q1J1j2j49n5K01P4k27j3
4688b40J04J61L4L9J62m47n5K39J32o02L98j76L25j89M44K24m68J11m17N33k16
4709I6N1K3n9l68J82r8K35j9k06R5J42O1l13M2J34q3J84j71J33J74J85n62j04
$$ plain form
4732 -246 -294 7 311 93 -20 -140 -208 -207 -2 44 -86 -123 -53 -143 -10 79 211 54 -1 21 -122 -149 39 15
4756 15 -4 112 186 -51 108 128 -36 -61 -94 -28 171 180 111 69 -55 -120 16 42 -62 -257 -63 -218 -5 47 163
4781 163 318 -136 276 -98 147 112 -139 -48 -65 68 -56 42 99 239 -123 -184 -40 50 -131 -79 -32 51 -16 -134
4805 -134 -65 -2 -94 -8 -57 95 -12 132 -155 51 -140 147 -55 150 37 -47 -211 159 -3 2 60 -18 -316
4828 -316 -172 -107 -215 178 243 -17 222 -125 -187 146 129 39 -17 -7 97 248 -151 56 144 -179 -70 274 123
4851 123 -53 21 28 -222 73 -205 270 48 -187 88 47 129 -216 -12 -178 200 227 -212 -142 149 -53 -74 -93
4874 -93 95 166 -45 -105 51 114 -34 31 -209 59 30 -158 125 -83 -170 167 98 -26 215 -24 -101 -63 74
4897 74 337 153 -75 163 -76 -167 49 86 -296 27 149 -26 -13 56 -85 -63 18 -44 -16 14 -11 -26 6 54 65
$$ packed form
4732b46m8L01L04k18j13j20o8JK05M6j30l7P0r0J33Q9J32j57n5K2j43k7J88k4
4756A5j9J16P4k37J59K0j64k5l3O6J99Ro9m2j24o5J36K6j04j95J94j55K13N2J16
4781A63J55m54M12l74K45l5k51R1j7J33j24R8N7J40l62o1J44R0j81N2M7Q3o7j18
4805a34O9O3r2Q6m9J52j07J44k87K06j91K87k02K05j13q4j64L70j62NN8p8k98
4828c16J44O5j08L93O5k60K39l47o2L33j7r0n6J0J04J51l99K07Q8l23J09L44j51
4851A23j76P4Pk50K95k78M75k22k35K75m1Q2l45K04j66L78K7m39P0K91k02k1j9
4874i3J88P1k11o0J56O3j48O5k40K68k9j88K83k08q7L37o9j24K41k39p7L8J37
4897G4K63j84k28K38k39r1K16L7l82L23J22j75J3O9j41K2Q1o2K8L0k5j5L2M8J1
$$ plain form
4922 65 -36 37 -14 -100 114 2 60 9 134 18 358 -27 -80 -20 101 -21 -359 -50 -122 185 -113 404 -161
4945 -161 94 -83 -53 352 334 82 -7 -220 -148 7 -30 -30 -206 154 -471 -112 469 210 -135 -124 -266 281 82
4968 82 -460 63 -286 -1 239 117 279 -98 168 -34 309 -50 -68 56 -131 151 106 -62 -28 -40 -48 29 -62
4991 -62 -114 90 -10 -31 -42 -115 -73 -7 -43 11 78 93 25 -29 -30 -89 32 71 63 -5 -79 122 6 109 2 15 119
5018 119 -16 136 -30 28 -82 110 46 -70 -412 -46 -45 -315 -419 -225 176 67 -155 497 119 33 -170 71
5040 71 77 2 325 157 -393 -280 -42 35 -335 -44 -363 161 106 12 270 8 186 -154 -44 -175 45 -56
5062 -56 98 57 35 -10 17 79 -48 46 137 125 13 203 -71 -154 -27 4 -158 -44 -102 64 -175 -58 104 -52
5086 -52 -27 17 -55 200 77 -181 65 49 77 -103 67 64 110 -110 10 22 -31 163 -136 240 163 -52 71 40
$$ packed form
4922F5j01P3n1q6K14j12N8n1J25j16L40l85n3O0J21j22l38L09p2L07k98N17n65
4945a61K55j77L0M05j8k52q9k13P2J55l7%j76L60o25L59N81k59l45J1j42N47j99
4968H2n42N23l49K85K40j22J62l77K66k02L43l59j8J24j87K82m5j68L4j2qP7r1
4991f2n2K04j00k1j1p3M2O6l6N4O7J5o8n4jn9J21L9qo8p4K01j16J03j07J3J04
5018A19j35J52j66N8j10J92o4j16l42L66Jk70j04J94M01j09k22O52l78q6k03K41
5040G1Op5L23j68n50J13K38P7l70K91l19N24n5r4K58k62J78l40J10j31K20j01
5062e6J54m1k2m5K7O2j27R4R1j2j12J90k74q3J27L1j62J14n8J66k39J17J62j56
5086e2K5M4p2K55j23k58K46j6K8j80J70lM6k20J20J2n3J94k99L76p7k15J23l1
$$ plain form
5110 40 35 -216 -90 -230 6 64 -74 -79 -144 -42 -81 -196 -82 -11 4 39 108 -40 -281 -99 -62 173 -61 -154 64
5135 64 -39 -270 1 -56 228 158 297 94 -126 360 -252 2 128 77 84 -97 224 -169 -130 -27 -60 271 -18
5158 -18 -292 -81 -63 57 140 -174 56 27 -52 98 -97 39 39 184 -158 58 -123 26 13 142 12 124 149
5181 149 -139 -16 108 203 -42 73 34 144 -76 131 105 -48 -69 178 98 -46 -127 -203 -116 34 89 -167 -26
5204 -26 -92 -130 139 116 10 -61 108 -294 -75 -60 18 -328 255 -27 -71 -72 -472 -283 99 -273 283 -389 83
5227 83 -163 -119 -151 1 -28 -88 -9 -28 247 -110 -50 309 364 -154 85 68 54 139 -337 -197 -132 -155 131 166 255
5252 255 124 -388 155 -165 -288 175 -182 -32 -177 -34 208 -24 277 20 347 27 245 22 -142 176
5272 176 -488 -234 -250 -59 -39 125 -56 -20 -61 170 41 -106 -4 192 -121 -299 0 -451 -154 -178 220 207
$$ packed form
5110D0nk51J26j40K36N8j38no5J02l9j15J14P1J5L5O9j48k41J82L7K35k34r3K18
5135F4j03k31K71n7K84p0J39k03k20M86o12K54J26n1Pj81L21l93L9J03l3L31k89
5158a8k74K11J8J20Q3l14K30k9p9J50j95J36%J45l42K16j81J49j3J29j30J12K5
5181A49k88J23J24R5k45J15l9J10k20K07k6j53k1K47q0j44q1p6Q7J50N5k56J41
5204b6o6l8K69k3j06p1J69m02K19J5P8l46N83k82m4jm00J89L82l72N56o72M72
5227H3k46M4l2J52k9o0P9j9K75l57O0L59N5n18K39j7j4Q5m76J40O5k3K86L5Q9
5252B55j31n12N43l20j23M63l57J50j45J43K42k32L01k57L27l20K18k23j64L18
5272A76o64K54j6J91K0J64j81L6m1K31j29j47J02J96l13j78K99m51K97k4L98j3
$$ plain form
5294 207 -71 -289 -90 291 197 -388 -4 6 -209 -29 -186 322 238 -177 403 211 -45 254 -123 -224 -7
5315 -7 99 -37 78 315 -25 427 4 283 253 -164 -320 115 -202 -112 -83 212 -44 -166 222 317 -15 114
5337 114 159 301 -9 202 226 -20 13 7 159 -83 71 202 -275 -83 -136 -179 136 -193 232 126 -158 80
5359 80 -116 -39 -66 -240 -89 -139 -263 170 -131 80 -35 90 202 -193 -150 81 97 -117 376 -137 42 39 -49
5382 -49 -88 221 -20 206 152 -107 -285 257 94 -475 190 -18 220 138 -204 117 104 44 -74 -87 169 -122
5404 -122 -228 -127 -272 -6 -82 18 191 149 5 146 249 -17 101 138 164 454 267 268 38 -75 -17 -154
5426 -154 -235 374 -79 -5 230 120 232 235 -80 -53 -8 -184 -178 -185 110 -123 -95 -134 -89 38 -234 -77 184 -178
5450 -178 -262 -104 32 -147 -430 -275 310 -327 -421 -259 81 64 -124 188 -58 -153 -41 397 110 -78 81
$$ packed form
5294B07k78k18J99L81r4n85L84J0k15J80j57N08q4m15N80j92k56K99l77j01K17
5315gJ06j36J15K37l40M52m23K79l0m17j56M35l17R0K9K95k56j22L88R5l32J29
5337A14M5J42l10K11K4k46L3oJ52k42J54J31m77J92n3m3L15l29M25j06k84K38
5359H0j96P7k7j74J51n0j24M33l01K11j15J25J12l95M3K31J6k14M93n13J79lq8
5382d9l9L09k41K26n4k59j78N42j63n69O65k08K38q2l42L21j3o0j18j3K56k91
5404a22j06J01j45K66p6J00J73m2j44J41J03k66J18L7K6K90j87Jk30j13N8j37
5426a54q1O09m53P4K35j10J12Ll15K7M5j76OpK95k33K8l9M5J27k72J57K61l62
5450a78q4J58J36j79k83J55N85o37r4J62L40j7j88L12k46r5J12M38k87j88J59
$$ plain form
5471 81 2 112 -255 -50 147 -222 -165 59 114 133 186 -21 106 48 -83 77 121 35 18 59 -92 -15 5 -378
5495 -378 181 -275 134 155 38 -90 -36 401 -356 170 -357 33 -477 -77 -215 -87 202 43 -64 -113 110
5516 110 93 100 -15 -82 47 -163 42 113 78 -12 95 -12 -196 116 209 -63 -134 11 82 -101 -152 -19 -55 -3
5540 -3 95 9 128 52 7 59 3 107 189 44 -86 93 -14 25 57 -46 161 -21 -80 25 27 -29 -49 26 -9 22
5566 22 8 11 -21 58 14 11 5 33 25 -26 44 31 40 18 10 -11 -46 34 19 -14 -4 40 16 -22 22 2 36 -44 -32 9 29 -25 -25 -19
5600 -19 -1 -6 37 51 14 -42 -8 4 14 27 26 -67 -13 15 -27 59 -11 -8 4 1 -2 29 2 -9 44 9 34 21 -35 -36 2 41 -21
5633 -21 19 -16 -48 4 1 -26 4 13 -7 -15 5 -5 12 20 -24 -23 7 12 54 -22 30 24 5 35 44 8 49 31 -9 -12 -40 14 -29 2 0
5668 0 17 2 -15 17 53 8 1 17 -1 -9 -38 -7 -49 73 -41 -48 -51 -68 67 -26 64 108 -143 63 -47 59 46 88 10
$$ packed form
5471H1p9J10l67K05J97l69N7K24N5J9N3k07J27n8j31J60M4q6j7M1j51P7K0l83
5495c78N59m56M09K1j17j28N4M37p57N26n27L90n10M00j38J28K89j59j07m9K23
5516A10j7Pj15o7J29k10K05P1l5r0J07j07j84L12R3k72p1J45P1j83n1J33l6N2
5540cR8q6J19p6m5N2n6J04Q2j45j30J79j07L9L2j03K07j82n9J05Kn6k0P5l5L1
5566B2j4Ll2P9m4loK8qn1P0j3Rk2qk1l5Q0j5l3J0M4k4l8M4k0L4q0J2M1K0n4%O
5600a9J8nM3J4l7n6L4J2J0J3jr3N4K8m2Q6p0LJ2llL1k7j1N3l5K5j3n6jL8L9o2
5633b1M0l5l2N2lk7L0Rk0qK0j0J7Qm4JL0NM2p6N2oj9L0Rl6M1j8m0lk8N4m3L1k
5668@J7j5j7L2L6m5pJ6j8qk9L1m2J22j14plj7J35r3R0M4k51K06j10J06j3M2p8
$$ plain form
5697 10 129 -48 -61 -28 -20 -21 84 58 -82 -23 -223 17 72 7 15 31 -26 56 -67 0 29 118 -1 244 42 -43 -202
5724 -202 137 0 57 58 129 134 169 -1 -97 -131 -31 -20 8 -214 268 -98 -279 101 -376 -56 -256 142 -39 347
5748 347 -358 28 -88 -8 43 198 -273 -165 -76 61 -81 -215 213 187 397 -32 234 -27 -25 -246 333 145
5770 145 -68 99 -150 -171 278 -150 99 65 209 -69 22 -190 -70 -307 -101 -123 -257 -229 -107 -379 -213 68
5792 68 129 -89 -165 -137 31 28 -1 -215 117 57 28 74 -59 50 143 177 -69 -147 108 191 127 -66 179 -303 64
5817 64 259 127 71 265 144 -122 101 50 -301 91 -58 25 -94 59 46 14 27 202 83 1 -130 -83 164
5840 164 127 194 322 -227 -46 86 2 -29 -74 -3 -101 348 -138 5 279 65 92 -62 -54 24 -162 47 23 163
5864 163 87 120 -90 75 -418 -112 25 133 63 66 -189 -428 174 116 -212 -158 164 142 84 3 38 -163 220 129
$$ packed form
5697A0J19j77j3L3QjJ05k6j40N9k00K40N5o5QJ6n7Q2j23O7K9Q9j19K45k02q5j59
5724b02L39j37N7JP1NL5j70r6l4J00J1K8k22M82l66j81L80m77L20k00L98j81L86
5748C47p05L86j16Q0N1J55m71J08Q9J37j42j34M28k6K10m29K66k61Kk21N79j88
5770A45k13J67k49k1M49m28K49l4J44k78R1k12J20k37K06k2j34K8J22k72J66K81
5792F8O1k18p6K8J68lk9k14L32o0k9M6j33J09R3L4k46p8K55Q3o4j93K45m82L67
5817F4J95j32n6J94j21k66K23n1l51L92j49Q3j19J53j3l2J3J75j19q2j31M7K47
5840A64l7O7J28n49J81J32q4l1m5P1r8M49m86J43K74k14K7j54QP8j86K09k4J40
5864A63p6L3k10J65m93L06J37J08p0Lk55k39O02n8l28N4L22k2n8q1L5k01L83r1
$$ [...]
8191E9
##END NTUPLES=NMR FID
##END=
