##TITLE=1H_Pr ABT-2
 CDCl3,8 sc, 
 11.02.2021
##JCAMPDX= 6.0         $$ Bruker NMR JCAMP-DX V2.0
##DATA TYPE= NMR FID
##DATA CLASS= NTUPLES
##ORIGIN= UXNMR, Bruker Analytische Messtechnik GmbH
##OWNER= root
$$ XWIN-NMR		Version 3.5
$$ Thu Feb 11 12:17:20 2021 Russian Standard Time (UT+4h)  she@DPX200
##.OBSERVE FREQUENCY= 200.1315066352
##.OBSERVE NUCLEUS= ^1H
##.DELAY= (6, 6)
##.ACQUISITION MODE= SIMULTANEOUS
##.ACQUISITION SCHEME= undefined
##.AVERAGES= 8
##.DIGITISER RES= 18
##SPECTROMETER/DATA SYSTEM= spect
##.PULSE SEQUENCE= zg30
##.SOLVENT NAME= CDCl3
##.SHIFT REFERENCE= (INTERNAL, CDCl3, 0, 15.7039)
##AUDIT TRAIL= $$ (NUMBER, WHEN, WHO, WHERE, WHAT)
$$ ##TITLE= Audit trail, XWIN-NMR		Version 3.5
$$ ##JCAMPDX= 5.01
$$ ##ORIGIN= Bruker BioSpin GmbH
$$ ##OWNER= she
$$ F:/spectra/data/she/nmr/H-F/1/audita.txt
$$ ##AUDIT TRAIL=  $$ (NUMBER, WHEN, WHO, WHERE, WHAT)
(   1,<2021-02-11 12:15:43.04 +0400>,<she>,<DPX200>,
      <created by zg, POWCHK disabled, PULCHK disabled
       configuration hash MD5:
       00 E9 B6 7A A2 85 ED C7 34 08 36 98 17 FE 4E 26
       data hash MD5: 16K
       95 F3 54 B2 70 77 46 C7 92 0F 2E C3 DC 9B A2 F3>)
$$ ##END=
$$ 
$$ hash MD5
$$ 00 F9 8F 52 2F 57 93 9B 8C 26 07 91 2B AF 20 A2
##$RELAX= 
##$RELAX= 
##$RELAX= 
##$RELAX= 
##$RELAX= 
##$RELAX= 
$$ Bruker specific parameters
$$ --------------------------
##$DU= <F:/spectra>
##$EXPNO= 1
##$NAME= <H-F>
##$PROCNO= 1
##$TYPE= <nmr>
##$USER= <she>
##$AMP= (0..31)
100 100 100 100 100 100 100 100 100 100 100 100 100 100 100 100 100 100 
100 100 100 100 100 100 100 100 100 100 100 100 100 100 
##$AQSEQ= 0
##$AQ_mod= 1
##$AUNM= <au_zg>
##$AUTOPOS= <>
##$BF1= 200.13
##$BF2= 200.13
##$BF3= 200.13
##$BF4= 200.13
##$BF5= 200.13
##$BF6= 200.13
##$BF7= 200.13
##$BF8= 200.13
##$BYTORDA= 1
##$CFDGTYP= 0
##$CFRGTYP= 5
##$CHEMSTR= <none>
##$CNST= (0..31)
1 1 145 1 1 1 1 1 1 1 1 1 1 1 1 1 1 1 1 1 1 1 1 1 1 1 1 1 1 1 1 1 
##$CPDPRG= <>
##$CPDPRG1= <>
##$CPDPRG2= <>
##$CPDPRG3= <>
##$CPDPRG4= <mlev>
##$CPDPRG5= <mlev>
##$CPDPRG6= <mlev>
##$CPDPRG7= <mlev>
##$CPDPRG8= <mlev>
##$CPDPRGB= <>
##$CPDPRGT= <>
##$D= (0..31)
0 1.2 0 0 0 0 0 0 0 0.06 0 0.03 0 0 0 0 0.0002 0 0 0 0 0 0 0 0 0 0 0 0 
0 0 0 
##$DATE= 1613031342
##$DBL= (0..7)
120 120 120 120 120 120 120 120 
##$DBP= (0..7)
150 150 150 150 150 150 150 150 
##$DBP07= 0
##$DBPNAM0= <>
##$DBPNAM1= <>
##$DBPNAM2= <>
##$DBPNAM3= <>
##$DBPNAM4= <>
##$DBPNAM5= <>
##$DBPNAM6= <>
##$DBPNAM7= <>
##$DBPOAL= (0..7)
0.5 0.5 0.5 0.5 0.5 0.5 0.5 0.5 
##$DBPOFFS= (0..7)
0 0 0 0 0 0 0 0 
##$DE= 6
##$DECBNUC= <off>
##$DECIM= 32
##$DECNUC= <off>
##$DECSTAT= 4
##$DIGMOD= 1
##$DIGTYP= 9
##$DL= (0..7)
0 120 120 120 120 120 120 120 
##$DP= (0..7)
150 150 150 150 150 150 150 150 
##$DP07= 0
##$DPNAME0= <>
##$DPNAME1= <>
##$DPNAME2= <>
##$DPNAME3= <>
##$DPNAME4= <>
##$DPNAME5= <>
##$DPNAME6= <>
##$DPNAME7= <>
##$DPOAL= (0..7)
0.5 0.5 0.5 0.5 0.5 0.5 0.5 0.5 
##$DPOFFS= (0..7)
0 0 0 0 0 0 0 0 
##$DQDMODE= 0
##$DR= 18
##$DS= 0
##$DSLIST= <SSSSSSSSSSSSSSS>
$$ [...]
##$SUBNAM2= <"">
##$SUBNAM3= <"">
##$SUBNAM4= <"">
##$SUBNAM5= <"">
##$SUBNAM6= <"">
##$SUBNAM7= <"">
##$SUBNAM8= <"">
##$SUBNAM9= <"">
##$SW= 16.9725356469052
##$SWIBOX= (0..15)
0 0 2 0 0 0 0 0 0 0 0 0 0 0 0 0 
##$SW_h= 3396.73913043478
##$TD= 16384
##$TD0= 1
##$TE= 0
##$TE2= 300
##$TE3= 300
##$TEG= 300
##$TL= (0..7)
0 120 120 120 120 120 120 120 
##$TP= (0..7)
150 150 150 150 150 150 150 150 
##$TP07= 0
##$TPNAME0= <>
##$TPNAME1= <>
##$TPNAME2= <>
##$TPNAME3= <>
##$TPNAME4= <>
##$TPNAME5= <>
##$TPNAME6= <>
##$TPNAME7= <>
##$TPOAL= (0..7)
0.5 0.5 0.5 0.5 0.5 0.5 0.5 0.5 
##$TPOFFS= (0..7)
0 0 0 0 0 0 0 0 
##$TUNHIN= 0
##$TUNHOUT= 0
##$TUNXOUT= 0
##$USERA1= <user>
##$USERA2= <user>
##$USERA3= <user>
##$USERA4= <user>
##$USERA5= <user>
##$V9= 5
##$VALIST= <valist>
##$VCLIST= <CCCCCCCCCCCCCCC>
##$VD= 0
##$VDLIST= <DDDDDDDDDDDDDDD>
##$VPLIST= <PPPPPPPPPPPPPPP>
##$VTLIST= <TTTTTTTTTTTTTTT>
##$WBST= 1024
##$WBSW= 4
##$XGAIN= (0..3)
0 0 0 0 
##$XL= 0
##$YL= 0
##$YMAX_a= 97074
##$YMIN_a= -73953
##$ZGOPTNS= <>
##$ZL1= 120
##$ZL2= 120
##$ZL3= 120
##$ZL4= 120
##$ABSF1= 10
##$ABSF2= 0
##$ABSG= 5
##$ABSL= 3
##$ALPHA= 0
##$AQORDER= 0
##$ASSFAC= 0
##$ASSFACI= 0
##$ASSFACX= 0
##$ASSWID= 0
##$AUNMP= <proc_1d>
##$AZFE= 0.1
##$AZFW= 0.1
##$BCFW= 1
##$BC_mod= 2
##$BYTORDP= 1
##$COROFFS= 0
##$CY= 11.3945322036743
##$DATMOD= 1
##$DC= 2
##$DFILT= <>
##$DTYPP= 0
##$F1P= 15.9154993809931
##$F2P= -4.1035820241983
##$FCOR= 0.5
##$FTSIZE= 0
##$FT_mod= 4
##$GAMMA= 1
##$GB= 0.15
##$INTBC= 1
##$INTSCL= 1
##$ISEN= 128
##$LB= 0.24
##$LEV0= 0
##$LPBIN= 0
##$MAXI= 10000
##$MC2= 0
##$MEAN= 0
##$ME_mod= 0
##$MI= 1.114404
##$NCOEF= 0
##$NC_proc= 0
##$NLEV= 6
##$NOISF1= 3.799351
##$NOISF2= 2.8
##$NSP= 1
##$NTH_PI= 0
##$NZP= 0
##$OFFSET= 15.70392
##$PC= 1
##$PHC0= -10759.09
##$PHC1= 13.00095
##$PH_mod= 1
##$PKNL= yes
##$PPARMOD= 0
##$PSCAL= 0
##$PSIGN= 0
##$REVERSE= no
##$SF= 200.130013532006
##$SI= 16384
##$SIGF1= 3
##$SIGF2= 2
##$SINO= 400
##$SIOLD= 16384
##$SREGLST= <1H.CDCl3>
##$SSB= 0
##$STSI= 0
##$STSR= 0
##$SW_p= 3612.71676300578
##$SYMM= 0
##$S_DEV= 0
##$TDeff= 0
##$TDoff= 0
##$TI= <>
##$TILT= no
##$TM1= 0
##$TM2= 0
##$TOPLEV= 0
##$USERP1= <user>
##$USERP2= <user>
##$USERP3= <user>
##$USERP4= <user>
##$USERP5= <user>
##$WDW= 1
##$XDIM= 8192
##$YMAX_p= 0
##$YMIN_p= 0
$$ End of Bruker specific parameters
$$ ---------------------------------
##NTUPLES= NMR FID
##VAR_NAME=  TIME,          FID/REAL,        FID/IMAG
##SYMBOL=    X,             R,               I
##VAR_TYPE=  INDEPENDENT,   DEPENDENT,       DEPENDENT
##VAR_FORM=  AFFN,          ASDF,            ASDF
##VAR_DIM=   8192,          8192,            8192
##UNITS=     SECONDS,       ARBITRARY UNITS, ARBITRARY UNITS
##FACTOR=    0.0002944,     1,               1
##FIRST=     0,             0,               0
##LAST=      2.4114304,     0,               0
##MIN=       0,             -73953,          0
##MAX=       2.4114304,     97074,           0
$$ Real data points
##PAGE= N=1
##DATA TABLE= (X++(R..R)), XYDATA
0 0 0 0 0 0 0 0 0 0 0 0 0 0 0 8 -8 8 -8 8 -12 16 -16 21 -24 29 -32 40 -45 48 -56 66 -77 88 -96 112 -125 140
36 140 -157 176 -196 219 -243 268 -298 328 -364 400 -441 486 -534 588 -648 714 -787 867 -958
55 -958 1062 -1179 1318 -1478 1666 -1898 2182 -2542 3021 -3676 4644 -6200 9104 -16311 68730
70 68730 97074 -73953 12178 50840 -982 -29510 62291 -129 13961 6229 2887 56443
82 56443 -9039 -27001 12366 64936 -30286 6823 45224 -27965 -5408 11110 27653 -22379
94 -22379 11151 -7636 16453 11535 -37388 9016 -4816 4905 -12280 21365 -14561 -19658 48
107 48 -10252 22654 -30411 -2998 2620 9896 -24280 -7508 12948 -36730 11807 4539 3684 -27306
121 -27306 214 -4841 -9178 10751 -25501 12442 -12864 1740 -6683 -1579 -14312 -13920 20318
134 20318 -16908 9469 -16468 -4046 -8686 2547 2380 -17245 9075 -14551 12815 -13489 281
147 281 -5189 -9022 8006 1015 12029 -27321 12699 -3008 -1245 6161 -361 759 -7732 20771
161 20771 -14632 10233 -7378 -2273 13685 3300 4259 -12169 15666 -15283 13110 5667 -6344
174 -6344 1684 18 10065 -12897 13594 -17034 2781 6766 -1483 935 -10424 4228 -15991
187 -15991 15161 -9844 -3488 -1955 -6810 3829 -9197 4881 -20193 8314 -3611 -38 -1358
200 -1358 -11081 1479 -9732 12581 -13063 5523 -7219 -3068 7509 -4946 1613 -14011 14276
213 14276 -5760 6871 -1570 -3936 2005 -4760 14960 -8183 8244 -8576 7754 5944 -2995
226 -2995 3194 -5413 12673 -8342 15484 -3399 -2658 508 2241 11261 -8318 9479 -9181 10574
240 10574 -805 900 1309 -5537 7033 -5755 15973 -11953 -641 -581 1931 2905 -5897 6616
254 6616 -13871 9566 -5405 2580 -4723 -6466 2948 -4193 8848 -15452 3958 -6993 -65
267 -65 795 -2704 -906 -12012 10627 -10219 4204 -6256 -3566 416 -961 5389 -12381 7175
281 7175 -9893 5390 -65 -898 -1458 -5165 9487 -8404 9666 -8005 2024 1643 2425 3671
295 3671 -5365 8096 -10400 12565 -1062 1428 -16 807 6363 -5045 11719 -8981 6777
308 6777 124 4554 1834 -1879 4801 -7522 13204 -5817 4408 -1581 298 2144 -1157 6488
322 6488 -10870 8570 -5475 3982 -560 -2149 -1156 -5724 9054 -10158 5776 -6618 -212 -1588
336 -1588 -37 1067 -9489 6691 -9628 5425 -4876 -2892 -3648 -2672 3805 -9122 6917 -10115
350 -10115 1972 -2761 770 -1604 -5476 4340 -8799 8696 -7090 686 -3025 128 768 -3486
364 -3486 7093 -11025 6136 -2948 3111 -2239 -1047 2332 -4778 8876 -7753 5054 -3816 1548
378 1548 44 882 3065 -8912 9085 -5002 3768 -2481 1123 -1134 -1374 6544 -7941 6082
392 6082 -6712 3056 -1523 1344 -1049 -6009 6137 -7715 5306 -5846 509 -3859 149 1025
406 1025 -7430 4740 -10769 2649 -3810 710 -5850 -4179 1759 -8479 3900 -9558 1275
419 1275 -6746 -650 -1979 -4397 131 -10646 5841 -6224 160 -5668 114 -1338 -5141 5022
433 5022 -7255 4346 -6808 3741 380 51 -423 -2555 9044 -6846 6257 -292 3261 -1854
447 -1854 3072 6867 -4455 7582 -3263 8451 200 2683 1153 3255 5140 -5526 11668 -2639
461 -2639 1526 -285 6789 -423 -3386 8040 -5476 5425 -3101 3481 -2545 2053 -253 -3328
475 -3328 7839 -8560 2711 -1554 2450 -5195 1001 2871 -7666 5360 -4852 2379 -4699 2344
489 2344 -3006 -1516 4090 -8018 4075 -4196 2180 -5297 2538 -1104 -4566 4121 -6059 3645
503 3645 -5523 2508 -3625 968 -106 -5442 4373 -5233 3391 -5533 3696 -2625 -1546 1884 -3336
518 -3336 4547 -6523 5003 -2116 2227 -1804 829 3874 -5307 6159 -3128 5198 -2863 3327
532 3327 2167 86 4598 -3563 8257 -3109 3581 312 4573 176 -1624 8173 -4233 4962
546 4962 -1652 4348 -1992 1882 1862 -3753 5780 -5165 3277 -2386 2332 -4441 -28 3182 -7199
561 -7199 3500 -4158 968 -5374 2408 -3308 -4084 2825 -6911 2551 -4490 1370 -5940 1955 -356
576 -356 -5297 3776 -4757 1921 -3921 3916 -4342 793 2044 -4855 4781 -2563 2633 -4160 5474
591 5474 -1880 -880 4408 -2675 3910 -2654 5407 -3056 3682 -271 -259 5197 -3610 3935 -1336 5181
607 5181 -4005 3720 2282 -2461 4232 -1922 5110 -3337 4397 -1928 2213 1693 -2568 5571 -3002
622 -3002 3164 -2653 5093 -2302 300 3305 -3329 4118 -3146 3813 -3160 3201 -2035 -423 4000
637 4000 -4832 3368 -2580 3309 -4681 3126 -221 -3152 3049 -3643 3379 -3966 3203 -3710 1681
652 1681 313 -3600 3973 -3665 2381 -3155 4229 -3685 237 2961 -3198 3531 -2887 3991 -3725
667 -3725 4318 -758 -365 3814 -2506 3809 -1545 4573 -3236 3849 851 -671 4022 -2061 4166
682 4166 -2322 5004 -2273 3018 1664 -1914 4648 -1810 3592 -3113 5168 -2370 538 2945 -2515
697 -2515 2791 -2491 4064 -4186 3224 -1730 -749 2325 -3480 2584 -2962 3185 -4502 2671 -1110
712 -1110 -3202 2132 -3200 1232 -4413 3516 -4357 1100 -174 -3481 1553 -3336 1813 -3878 3450
727 3450 -3384 190 1804 -3408 2105 -2555 2821 -4326 3462 -1679 -228 2318 -2438 2876 -2399
742 -2399 4110 -3371 3643 -162 -673 3269 -1800 3107 -2291 5456 -2631 3037 889 -1116 3203
757 3203 -1243 3561 -2478 4666 -1584 1683 2598 -1345 2889 -1943 3622 -3076 3864 -1342 -346 2564
773 2564 -1491 1563 -2697 3489 -3950 2950 -1450 -1275 1072 -2559 2003 -3801 3202 -4871 1354
788 1354 -368 -2362 938 -2858 1457 -4429 3102 -3683 357 -87 -2425 1225 -2774 2746 -4702
803 -4702 3469 -2353 -400 790 -2165 1677 -2999 3865 -3920 3078 -1036 -468 1900 -999 2695
818 2695 -2783 4717 -3106 2653 730 -70 2065 -993 3800 -2610 4867 -2241 2106 1726 -603 2246
834 2246 -639 3848 -3255 4730 -1245 595 1337 -727 2103 -2088 3622 -3559 3376 -995 -292 1494
850 1494 -980 1581 -2926 3996 -3955 1708 -171 -990 1000 -1955 1955 -3901 3345 -3490 885
865 885 -118 -1602 430 -1815 2458 -4714 3138 -2278 16 159 -1184 788 -2326 2987 -4366 2743
881 2743 -1720 -483 632 -563 1465 -3240 4207 -3380 1979 -268 -108 827 -539 3151 -2704 4233
897 4233 -2393 1673 1145 758 1440 -816 4085 -2543 4474 -588 1566 1159 756 2758 -984 4031
913 4031 -2653 4001 -268 906 896 -149 2280 -2183 4182 -2600 2276 -850 444 918 -1229 1619
929 1619 -3245 3537 -3360 1298 -794 -1024 18 -2038 2190 -4287 2178 -3314 578 -577 -1733
944 -1733 -43 -2573 2041 -4308 2539 -2418 -1067 -375 -647 339 -3209 3009 -3797 2147 -1051 -386
960 -386 -167 -705 1644 -3016 4061 -3377 1064 -102 309 74 -1045 2607 -3527 3654 -1555 1258
976 1258 -505 296 680 -1230 3680 -3723 2803 -768 540 -239 181 1175 -2792 3864 -2805 2174
992 2174 -957 533 -380 -352 2069 -3276 3260 -2441 1197 -960 612 -560 -1471 2539 -3408 2602
1008 2602 -2580 739 -856 67 -148 -2385 2204 -3831 2118 -2225 345 -1545 -719 298 -2860 2220
1024 2220 -3691 1458 -2017 162 -981 -1021 595 -3197 2971 -3047 1266 -1545 551 -190 -616 1838
1040 1838 -2867 3293 -2147 1725 -410 692 125 -721 3422 -2918 2880 -1054 1629 33 941 1294
1056 1294 -1784 3503 -2005 2958 -957 945 -469 756 1692 -2508 3313 -2214 1866 -656 1331
1071 1331 -723 -1112 2034 -2677 2844 -2233 912 -1522 867 -173 -1626 2038 -3563 1839 -1800
1086 -1800 978 -1906 -73 177 -2450 2281 -3095 1134 -1948 975 -1017 -473 394 -3359 2619 -2330
1102 -2330 1308 -1762 728 -657 -365 2039 -3037 2131 -1972 1790 -884 1005 -389 -1131 2801
1117 2801 -2183 2563 -1566 1608 -713 1852 836 -1582 2666 -1909 2808 -676 1777 -1002 753
1132 753 1680 -1321 3141 -1906 1767 -989 1794 -443 -322 1618 -2191 2618 -1605 1815 -1728 1174
1148 1174 -138 -484 2012 -2578 1717 -1722 1585 -1942 273 -339 -1745 2063 -2458 1331 -2111
1163 -2111 1038 -1459 -35 384 -2534 1635 -2456 1218 -1954 879 -1621 -499 1144 -2682 1580
1178 1580 -2405 1233 -1517 1194 -1022 -1095 1759 -2039 2298 -1764 1322 -1551 1290 528 -874 2394
1194 2394 -1812 2008 -1047 2205 -1010 682 1353 -1255 2458 -1420 1652 -1234 2321 -573 341
1209 341 1523 -1858 2384 -808 2081 -1676 1626 -486 -314 2127 -1981 1768 -1515 1280 -1610
1224 -1610 1424 -257 -1564 1937 -1734 1393 -1582 832 -2006 429 280 -2082 1321 -2383 987
1239 987 -1837 1175 -1930 -479 583 -1924 1364 -1926 695 -2160 1339 -912 -1045 925 -2539
1254 -2539 1403 -1627 1612 -2001 941 -126 -822 1889 -1952 1473 -1316 2116 -1129 809 394
1269 394 -1108 1985 -1127 1882 -1490 2006 -992 803 1371 -1312 1756 -735 2117 -1020 1797
1284 1797 -848 -229 1684 -837 1723 -1222 1739 -1406 1791 6 -920 1557 -1329 1255 -1446
1299 -1446 1558 -1933 629 447 -1332 1422 -1622 796 -1678 1689 -1636 -204 120 -1560 1147
1314 1147 -1591 1073 -2296 1026 -1064 -547 898 -1939 860 -1325 1420 -2139 1119 -956 -799
1329 -799 1173 -1071 941 -1574 1746 -1555 1084 172 -953 1414 -865 1521 -1145 1755 -1191
1344 -1191 523 1005 -805 1482 -1059 1769 -1099 2176 -818 -6 993 -796 1548 -809 1575 -1439
1360 -1439 1742 -29 -300 1303 -737 1012 -874 2203 -1575 1021 264 -835 1200 -923 865
1375 865 -1804 1849 -1677 36 205 -1302 469 -1263 991 -2252 1107 -1216 -485 419 -1195 375
1391 375 -1665 1306 -2053 1131 -980 -592 404 -767 623 -1893 1576 -1984 642 -170 -768 441
1407 441 -851 1032 -1288 1817 -1342 607 446 -45 1170 -617 1390 -1414 2042 -606 403 581
1423 581 -239 1407 -554 2010 -1450 1563 -73 497 1171 -585 1146 -915 1994 -1263 1443 -81
1439 -81 -351 1017 -556 1257 -1438 1886 -1243 852 226 -560 442 -832 1291 -1806 1471 -1531
1455 -1531 -29 190 -776 251 -1126 1209 -2040 1516 -1109 -819 78 -858 206 -1464 1071 -2272
1471 -2272 860 -424 -412 -93 -825 615 -1697 1568 -1472 366 -176 -36 485 -533 1300 -1615 1700
1488 1700 -860 657 314 -283 719 -640 1627 -1285 1590 -574 515 708 170 924 -722 1889
1504 1889 -1596 1356 -186 193 568 113 787 -990 1834 -1227 1065 107 -144 263 -557 1244 -1448
1521 -1448 1546 -965 160 -56 -255 169 -857 1092 -1762 1058 -1003 -230 -228 -621 121 -1325 1278
1538 1278 -1840 639 -791 -192 -147 -372 490 -1675 1279 -1432 602 -135 -381 -193 -657 685 -1581
1555 -1581 1528 -1240 409 -237 -156 90 -686 1434 -1429 1483 -580 395 -31 26 593 -792 1745
1572 1745 -1040 1278 -67 473 305 402 857 -879 1715 -1086 828 -336 319 152 43 1069 -1158
1589 -1158 1593 -893 530 -248 206 -145 -648 1030 -1588 1092 -853 233 -419 -220 99 -1075 1146
1606 1146 -1360 670 -740 125 -400 -438 404 -1436 1029 -1615 627 -510 -158 -441 -654 545 -1370
1623 -1370 1139 -1194 424 -498 149 -93 -567 1064 -1437 1141 -770 346 -161 246 336 -653 1359
1640 1359 -1203 1246 -491 583 7 328 687 -858 1543 -803 864 -213 539 58 107 834 -1030
1657 -1030 1511 -770 904 -268 594 -126 -334 1072 -1273 1255 -361 639 -344 385 -121 -774 1188
1674 1188 -1470 732 -844 180 -778 -58 208 -1246 1133 -1410 647 -737 205 -533 -431 450 -1281
1691 -1281 1167 -980 265 -673 -11 -654 -701 609 -1700 768 -814 292 -640 478 -66 -655 1104
1708 1104 -1077 1053 -689 724 -357 534 543 -559 1006 -1002 962 -210 835 -232 261 968
1724 968 -629 1297 -748 681 -167 709 -141 92 890 -816 1203 -395 543 -549 230 -170 -421
1741 -421 929 -1075 879 -883 500 -490 376 296 -1047 913 -1328 695 -626 527 -661 -347
1757 -347 274 -1140 671 -1150 392 -952 261 -738 -347 482 -1046 752 -746 281 -882 368
1773 368 -275 -584 788 -1312 811 -740 551 -910 334 224 -666 894 -770 677 -500 1077
1789 1077 -260 246 488 -831 1273 -576 629 -256 826 -167 362 828 -896 912 -368 1092
1805 1092 -527 841 176 -387 925 -723 889 -272 885 -463 463 171 -702 745 -703 743
1821 743 -464 456 -797 236 227 -865 429 -897 559 -964 600 -804 -242 285 -865 334 -940
1838 -940 295 -994 499 -489 -386 311 -979 309 -903 689 -818 508 -155 -533 865 -639
1854 -639 524 -577 737 -658 466 399 -787 753 -555 1054 -658 1048 -333 245 636 -266
1870 -266 1256 -109 1067 -355 980 -20 -139 853 -268 1049 -268 874 -592 662 -51 -116
1886 -116 757 -738 800 -588 909 -720 306 193 -305 768 -610 724 -793 920 -621 6
1902 6 276 -620 280 -523 271 -1252 554 -572 -245 294 -758 787 -850 512 -948 386 -303 -429
1920 -429 554 -819 363 -921 946 -799 336 -104 -486 610 -565 361 -615 892 -567 194 422
1937 422 -498 599 -577 848 -743 984 -305 87 448 -195 509 -325 985 -790 629 103 184
1954 184 803 -153 683 -604 965 -814 409 -91 -193 645 -596 588 -601 766 -677 404 47
1971 47 -472 288 -536 602 -1025 721 -422 -288 166 -552 203 -759 705 -838 475 -456 -83 284
1989 284 -651 260 -840 820 -1387 -29 -26 -246 224 -478 393 -947 759 -893 470 328 -377 297
2007 297 -302 878 -724 671 -271 192 385 -287 626 -328 763 -798 870 -293 296 618 -339 564
2025 564 -865 1236 -933 756 -18 -231 498 -161 569 -542 1165 -992 470 -188 -119 331 -477 426
2043 426 -580 943 -957 -40 164 -372 135 -744 512 -1031 763 -497 -203 -181 -598 358 -953 496
2061 496 -1021 303 -238 -267 -17 -550 179 -869 899 -1065 270 -53 -212 326 -187 615 -525 623
2079 623 -746 592 330 159 244 -258 725 -794 977 -492 361 154 -172 418 196 772 -272 994
2097 994 -38 461 42 -80 397 -326 1154 -600 207 345 -31 112 -256 418 -774 875 -791 220
2115 220 107 -241 371 -557 498 -813 727 -154 -57 -170 -52 62 -966 937 -574 690 -569 -229
2133 -229 -298 -367 275 -832 572 -1104 336 -144 -337 17 -619 261 -1250 1048 -778 346 147 -173
2151 -173 -158 81 915 -989 1008 -477 718 -378 378 331 -766 947 -1090 764 -69 -24 -28 -212 199
2170 199 -869 1002 -826 674 -465 311 -56 -137 375 -581 948 -323 -155 -312 785 -22 -519 294
2188 294 -538 600 -819 194 -44 -536 155 -682 421 -900 669 -532 -196 -267 -341 -465 -1018 579
2206 579 -953 24 -688 177 -72 -667 363 -843 186 -852 165 -463 104 -303 62 565 -779 747
2224 747 -502 49 -106 83 362 -500 965 -282 630 -570 -189 -197 195 306 -500 945 -673 415
2242 415 -51 345 240 119 309 -585 1022 -565 588 -235 91 100 175 535 -778 403 -74 374 -391
2261 -391 272 173 -226 1034 -901 416 -474 -73 -601 -28 -96 -463 51 -580 473 -57 273 -61 -56 39
2281 39 -933 759 -488 457 -302 72 -532 -361 344 -1154 526 -436 -78 -535 -156 -147 -432 585 -381
2300 -381 152 -443 338 -480 186 104 -440 423 -292 395 3 445 -256 72 426 -387 780 -247 355 -61
2320 -61 843 -42 -26 649 -296 731 -59 337 -413 388 2 -515 584 -550 253 -297 261 -234 336 157
2340 157 -452 594 -373 -310 -306 263 -621 254 -54 -174 524 -311 186 -464 333 -565 -754 564 -728 344
2360 344 -1069 384 -716 174 -47 -39 354 -463 327 -791 686 -752 20 308 -163 567 -367 187 -249
2379 -249 547 -504 217 180 -267 711 -142 745 -254 536 -155 104 381 -374 724 -195 382 -148 57 -52
2399 -52 87 507 -352 379 -523 271 -554 392 60 -163 482 -352 418 -326 681 -294 74 284 -193 210
2419 210 -465 340 -444 334 -747 60 197 -540 248 -429 365 -546 290 -253 -167 203 -629 46 -548 335
2439 335 -221 347 -329 -323 184 -664 501 -344 426 -440 187 91 -403 475 -314 291 -366 355 -535 71 276
2460 276 -402 251 -302 549 -285 316 -122 166 358 -290 247 -148 362 -167 677 280 -8 461 -262 484
2480 484 -279 606 -414 203 -25 -62 393 -386 582 -246 345 -304 68 121 -489 277 -290 226 -517 428
2500 428 -584 11 180 -286 264 -666 321 -633 217 -422 -328 313 -437 199 -597 395 -786 95 -241 -321
2520 -321 326 -405 298 -577 479 -489 313 197 121 215 -217 289 -490 705 -228 118 194 -40 474 -103
2540 -103 466 -298 648 205 2 494 -184 358 -180 617 -517 516 166 -28 509 -235 227 -526 419
2559 419 -112 301 -10 -333 211 -118 253 -592 736 -315 -112 -33 -75 377 -588 136 -437 596 -343 -130
2579 -130 9 -240 348 -602 495 -507 268 -237 -11 199 -199 165 -353 415 -434 96 -67 -195 269
2598 269 -214 361 -583 504 -233 -73 -83 46 359 -127 543 -235 857 -177 -57 61 233 419 -168
2617 -168 622 -44 522 68 -6 318 -41 270 -394 295 -657 285 -113 -170 428 -304 600 -686 601 -225
2637 -225 170 -25 36 399 -482 -11 -419 486 -75 296 333 -326 68 -191 205 -609 84 -381 -146 -125 -127 222
2659 222 -348 195 -618 -87 -249 34 175 -160 278 -458 494 -603 122 -185 -112 18 -181 586 -564 601
2679 601 -123 93 224 -166 346 -217 542 -426 745 -406 85 180 -379 353 -544 493 -348 270 108
2698 108 195 -38 66 551 -435 823 -386 406 129 -2 69 -232 520 -768 436 -427 98 4 -75 98
2718 98 -223 266 -536 263 -285 -333 -97 -157 -21 -411 311 -654 246 -245 -54 -320 -51 90 -703 520 -605
2739 -605 249 -409 -36 -57 48 170 -355 691 -144 249 63 189 102 -21 350 -355 469 -348 415 -233
2759 -233 215 173 -235 411 -147 254 -73 211 -186 114 421 -325 526 -151 364 -115 119 -56 -148 294 -317
2780 -317 470 -558 174 -25 -27 -17 -56 471 -533 298 -272 105 -136 241 -47 -358 530 -524 366 -460
2800 -460 139 -228 -41 -53 -687 479 -352 191 -423 55 -304 -85 196 -532 218 -255 90 -141 54 121
2820 121 -554 294 -677 404 -794 324 87 272 99 -416 344 237 454 41 398 -40 442 155 -472
2839 -472 556 -220 540 -230 437 -51 -13 400 -113 390 -290 213 122 282 -119 7 278 -462 420 -242
2859 -242 158 -330 -76 17 -209 397 -390 260 -284 20 -110 -5 89 -333 127 -489 87 -230 381 -407 -179
2880 -179 279 -547 166 -302 189 -447 44 70 -31 327 -449 208 -437 323 -133 -121 36 -84 256 -412 298
2901 298 -337 251 68 89 430 -476 530 -135 208 -246 449 -150 -37 200 -42 504 -358 412 -265 370
2921 370 -185 -12 281 -295 493 -106 305 -246 208 -54 4 377 -346 428 -57 409 -140 -142 -59 -210 376
2942 376 -451 -39 -216 397 -265 35 467 -417 132 -312 129 -400 139 -46 -170 215 -446 442 -268 -101
2962 -101 -464 112 -266 -291 222 -358 161 -310 390 -277 -23 -52 166 225 -156 573 -61 371 -305 378 132
2983 132 -218 244 -97 497 -189 616 -166 -201 350 -328 192 -239 429 -201 333 -64 156 327 -21 418
3003 418 -226 440 -196 380 47 -215 274 -311 272 -455 114 -331 140 143 -443 178 -289 242 -475 58 -311
3024 -311 -44 252 -445 230 95 396 -364 198 -108 -405 267 -407 463 -265 100 -378 65 -311 64 443
3044 443 -27 82 -122 818 -426 531 90 190 -403 -74 -162 -172 -143 179 245 431 -10 584 -412 380 -354
3065 -354 677 -348 337 24 -691 474 -533 111 -181 471 -4 -170 12 -406 113 -662 323 699 749
3084 749 189 -492 -242 -959 -180 -552 576 -1119 -548 798 -384 -230 -96 601 -186 258 -146 -228 395
3103 395 -843 438 -528 494 -972 328 286 -333 -68 -378 177 -579 162 -379 -265 -33 805 122 332
3122 332 -91 -640 -845 -776 893 346 -654 -48 -729 780 -170 644 951 -543 657 -67 375 -247 -51
3141 -51 -325 -231 -34 359 103 -499 -830 -803 238 107 -322 126 410 425 85 231 -380 847 682 202 -251
3162 -251 -595 -295 435 49 -704 408 -651 567 447 -1093 -195 186 270 -113 89 -917 844 92
3180 92 -864 -247 -512 218 -377 38 -322 -564 -48 -457 157 -378 -7 602 280 170 -344 384 -664 -329
3200 -329 -1210 762 -160 141 -555 446 169 -335 455 -674 697 -334 -1146 -621 -154 -235 -590 480
3218 480 -154 -419 25 689 -1179 -801 454 92 95 -391 239 -368 261 -48 -328 1592 -53 907 164
3237 164 94 409 -121 -99 -799 555 -769 272 467 522 16 530 300 314 204 -734 243 308 -419 -577 318
3258 318 215 37 57 -189 86 -116 51 -222 396 419 -384 673 -374 -325 380 657 535 -546 -38 -218
3278 -218 352 106 507 -119 22 479 -193 1417 -280 -171 58 636 -17 -265 534 100 253 -310 337
3297 337 -74 243 -25 220 248 -617 -77 -318 487 303 23 36 -229 -74 -90 490 -99 126 66 -72 314
3318 314 -367 160 -444 293 -391 164 -294 -32 -63 -325 300 -486 347 -220 246 -41 -195 395 -369 101
3338 101 -404 95 5 13 9 -219 153 -338 167 -93 127 -99 10 3 -150 225 -190 385 49 142 -116 295 219
3361 219 -115 452 148 258 -206 372 34 -236 78 -452 169 -276 107 -204 37 57 -159 339 -271 321
3381 321 -110 55 -187 -47 -218 -99 358 -348 320 -123 272 -397 13 -11 -180 235 -279 82 -309 -66
3401 -66 -237 -238 98 -394 214 -269 29 -58 72 -6 -52 298 -518 191 -414 71 112 267 49 -263 125 -292
3423 -292 213 -51 199 6 259 -155 -311 406 -181 218 -265 154 35 243 -186 -308 476 -133 304 -113
3443 -113 -41 -184 82 79 -455 268 -138 186 -108 221 163 -294 343 -253 95 -148 212 82 -21 -139 -333
3464 -333 420 -262 233 -207 -145 -304 -1 -7 -140 331 -257 119 -236 63 -34 -145 6 -291 89 -277 182
3485 182 -308 92 44 -285 269 -109 16 -168 207 -151 125 -9 -25 138 -211 277 -225 222 -148 378 258
3506 258 -307 199 340 462 -144 352 -293 194 -215 -303 552 238 229 -41 184 -410 -239 135 -303 -16 -102
3527 -102 -30 -173 -131 556 157 857 30 473 -613 -720 -278 173 -61 -291 106 -389 -289 264 501 -234
3547 -234 24 -78 -565 -322 -96 406 -356 103 261 -217 127 12 125 -127 448 -217 218 48 -102 315
3567 315 144 145 -458 229 -252 122 204 32 283 -69 592 -242 265 -346 49 165 -152 244 -307 274 -289
3588 -289 65 -29 -65 370 20 264 -597 -46 105 466 -115 -82 240 -440 204 432 -65 -506 427 74 -31
3609 -31 458 -302 360 -10 -611 205 324 388 -176 -187 -267 673 270 382 -517 242 110 523 57 -691 439
3630 439 -176 505 276 -953 220 -146 -283 -507 1334 -316 -24 247 472 55 -302 331 -461 -639 -246
3649 -246 261 -314 187 409 1153 252 -642 521 -525 -33 -257 680 -324 -30 -6 -221 537 684 18
3668 18 456 -56 383 -136 491 -271 -162 71 -387 56 -637 544 -152 123 -779 -149 -468 -282 352 -290
3688 -290 419 -65 230 -215 122 233 -284 342 -505 456 -386 74 -592 -581 14 -319 -298 -442 180 -106 218
3709 218 468 70 -276 -122 182 557 -106 -18 340 183 59 339 -231 225 -131 35 -322 302 166 234 217
3730 217 -247 79 -101 21 109 160 38 -298 -204 -607 353 148 413 566 104 -82 193 -125 -319 106 16
3751 16 -227 -76 -268 -169 148 364 -5 66 -261 -11 346 -422 370 -685 318 -172 454 -205 266 -6
3771 -6 236 -156 17 373 -414 402 -46 291 -345 111 469 -404 382 22 198 -30 19 63 -275 443 -216
3792 -216 97 -113 180 9 186 206 -246 278 -161 276 -34 55 -61 -130 3 -74 356 -542 173 -40 5 311
3814 311 116 -89 69 308 -195 8 -206 -177 137 -115 467 -58 115 -364 -266 -55 48 135 -190 271 -60
3835 -60 290 -9 56 -28 -16 117 -372 2 -304 -114 -41 -54 248 -17 149 -384 410 -325 95 3 16 188 -324
3858 -324 288 -197 247 -152 142 -214 102 24 -9 248 -218 273 -210 -87 -108 -210 193 -276 227 -131 206
3879 206 112 -59 26 216 172 32 276 69 319 -165 169 -32 9 70 -488 352 -29 119 -155 -79 146 -303
3901 -303 358 -307 179 -212 -159 -135 -194 120 -268 425 -250 119 -332 -27 -128 4 17 -321 340 -228 -164 -8
3923 -8 150 -218 -11 197 -523 221 -25 31 -71 36 85 -285 88 -308 113 -82 142 -186 313 125 -73
3944 -73 195 -367 284 -25 292 4 175 -69 -121 434 -100 38 -82 147 -141 -103 225 -72 117 -201 4
3965 4 89 -76 -18 -100 198 -75 224 -339 48 -63 98 79 -190 33 42 28 -41 -57 36 206 -86 -465 151 -229
3989 -229 111 -64 131 -157 74 155 -354 107 47 80 83 -32 -59 -328 308 -137 72 8 -168 -90 96 26 -150
4012 -150 151 -103 159 -83 33 -106 -80 -36 -26 429 197 182 40 84 24 -36 174 -86 270 74 287 -208
4034 -208 187 -216 45 303 -248 253 64 200 -70 208 299 -155 309 -376 121 -238 -36 -149 243 -12
4054 -12 -274 146 -326 -59 41 159 -248 -136 101 -210 207 -307 17 104 116 -56 -176 230 -208 -109 63
4075 63 221 -22 261 -228 -251 169 -39 29 -281 152 -175 -126 38 -183 226 -87 49 46 292 -122 137 -49
4097 -49 -101 -197 86 354 35 254 136 -62 9 -48 342 -147 162 -67 74 -80 -223 305 -252 180 -78 28
4119 28 -126 -26 97 -8 231 -126 116 -230 29 -74 -79 268 -127 127 30 55 -313 92 -228 -92 166 -19
4141 -19 167 21 -99 -324 119 -195 -272 -1 -313 -35 -78 -65 -19 -79 42 36 368 -241 -36 -104 63 -274 96
4164 96 -90 -86 106 -55 5 -308 142 39 -155 128 -30 165 -41 64 -34 189 342 -70 54 -129 196 -140
4186 -140 40 -6 145 234 -296 216 399 340 -216 -14 -200 8 218 187 -84 -334 517 -111 447 -157 -289
4207 -289 21 -50 424 -552 554 -230 142 -316 31 -134 -176 -72 -320 -406 -82 708 746 -62 1128 -553
4227 -553 192 216 368 -251 666 -93 -207 669 -423 208 57 -112 -325 432 139 598 180 -580 232 -346
4247 -346 26 -113 -184 181 -128 617 -173 -119 -63 451 91 -106 245 197 509 -184 257 22 235 91 -394
4268 -394 444 242 240 -93 271 282 191 43 -143 -218 244 -65 -122 -257 66 -150 -180 2 13 -493 -272 -324 455
4291 455 60 -242 111 -50 260 -403 -134 -194 -77 -188 -231 -135 -86 179 -217 244 23 -73 19 7 -94 -285
4313 -285 294 -262 171 -181 -77 -15 -178 79 -111 94 -23 73 -110 80 -4 -159 -88 103 242 109 -96
4334 -96 -60 124 140 129 525 -207 233 -76 25 -146 -179 127 -220 156 -125 194 -206 57 64 -16 -137 -127 188
4357 188 -298 -56 -9 -188 29 116 -39 -84 101 -463 -185 106 -178 97 95 147 -377 292 -59 -12 -54 -106 -94
4380 -94 32 143 -107 -118 -48 -38 -78 67 -140 -10 209 -317 -124 -54 82 -92 -69 182 -149 202 -109 -22 182
4403 182 225 39 -123 386 -63 368 -53 193 -192 -47 -50 -241 119 -90 225 -78 -70 -94 72 28 160 -8
4425 -8 -48 311 -78 -52 -101 -250 119 -212 188 -223 -15 -106 107 -25 -80 98 -217 44 -107 205 -119 54
4447 54 -13 129 -126 -215 108 109 -42 10 160 143 29 266 -45 89 15 -107 58 57 36 -212 193 -166 70 41
4471 41 129 -68 -199 110 -175 173 -25 192 -158 -21 233 -79 319 -233 290 -44 -3 21 45 106 -165 -70
4493 -70 71 7 76 182 -245 104 -29 -96 80 -135 38 -113 -287 -136 -125 57 -170 -196 -154 115 -114 223
4515 223 -68 91 62 -13 50 -41 79 -57 -83 -34 -98 104 98 145 -93 -93 -180 9 78 -182 346 2 137 64 71 -3
4541 -3 178 -192 -367 171 -23 -79 54 -14 221 164 75 178 88 -179 -48 129 -58 40 -18 194 20 72 -73
4564 -73 42 -132 154 98 -88 -142 -103 -36 -96 239 78 14 177 -210 1 -90 -169 -129 63 88 -139 -99 102 241
4588 241 -117 -352 -25 93 -47 39 146 -307 41 28 -131 -91 11 12 -92 22 -112 -4 -73 138 9 115
4610 115 86 108 54 -116 222 -110 183 88 -47 233 -61 129 57 -9 131 70 -94 63 188 -210 -134 -92 51
4633 51 244 -25 -12 -59 91 -105 178 -87 26 -73 -192 10 -16 57 -105 -31 -22 -14 231 -251 -12 -197 115 41
4657 41 184 -70 -128 270 13 209 -356 -24 -40 -41 86 -254 16 187 206 -158 19 -75 30 -306 -155 2
4679 2 51 38 -132 384 180 -67 -192 126 -40 -139 211 22 106 71 -82 -51 66 219 -48 -33 -300 121 -90
4702 -90 -130 216 -152 35 -108 217 -325 -61 -4 158 -59 -161 114 -23 90 -2 -128 -67 101 123 -76 -273
4724 -273 -348 -53 -196 -104 -129 -116 19 127 242 -72 -145 -238 3 -115 -123 -33 -1 56 67 0 -204 263 56 -241
4748 -241 142 -212 31 -205 102 46 60 156 54 -232 -116 -180 -105 298 200 222 212 9 70 39 97 -119 31 -10
4772 -10 -70 84 92 189 13 82 -386 -10 95 122 161 -172 -39 -175 147 21 143 -169 -75 -163 -96 -75 -112 181
4796 181 187 117 -255 -3 -113 -98 -136 -174 70 -85 -21 114 -94 203 169 78 -22 23 -14 72 10 11 82 -91 42
4821 42 -155 -157 135 -24 -55 -95 2 -332 84 16 -186 -1 65 200 -168 31 -12 18 115 144 94 34 -229 79 -98
4846 -98 32 -248 -85 126 264 2 -66 3 38 216 -78 109 112 -174 -209 89 57 162 -221 64 -170 14 138
4869 138 -267 -76 -152 -3 36 -206 -202 -28 74 -296 -100 67 289 -45 71 -34 116 60 -39 174 14 -50
4891 -50 79 154 -14 95 32 -83 100 172 -89 -90 87 101 -41 -112 189 281 120 -22 121 5 66 -152 181
4914 181 -131 -118 87 -231 -249 277 158 120 176 74 124 -16 -76 -152 -114 114 -24 135 5 123 -100 -66 44
4937 44 -180 5 -230 67 -23 119 27 9 2 -114 -54 -1 285 41 16 -150 -101 66 -19 -125 170 -54 -68 82
4961 82 37 -225 -155 -11 40 -274 65 31 -177 -115 61 69 111 143 -170 -179 -25 148 -127 -98 -110 -75 137 -36 -57
4986 -57 9 -58 61 -171 147 -128 -84 -95 57 -69 3 -19 -140 226 -84 130 30 40 139 -262 -67 -133 71
5009 71 -124 17 176 -33 130 53 113 -253 -28 -29 14 128 -70 118 -67 -6 -149 -4 -148 -53 104 -146 -63
5032 -63 -105 -248 -58 22 -95 17 -59 28 112 -225 56 -346 -250 -204 139 -125 -50 33 -137 -146 -86 186 39 156
5056 156 -73 22 106 -31 128 -104 196 -123 16 -51 -227 14 -37 71 154 8 165 35 -200 -48 -53 79
5078 79 -80 42 -52 24 -151 53 -39 187 39 -148 103 -64 -45 -183 -123 -3 208 -87 286 -32 -146 168
5100 168 232 160 18 -138 -115 184 -208 -11 -5 30 -32 -18 -22 10 26 -48 76 94 68 -6 -152 -96 187 -360 -187 132
5126 132 354 137 -76 -108 8 -179 -75 -127 -9 53 -82 201 0 131 -159 6 -17 -70 155 -52 49 -5
5148 -5 65 -127 141 244 145 181 -235 67 -94 -8 189 -16 -59 168 93 -188 62 -12 76 -31 -164 86 112 190
5172 190 -244 -63 99 119 126 -55 -68 -136 138 -144 -290 22 -107 98 -31 -153 4 142 -34 -64 59 46
5194 46 131 276 157 137 90 -117 0 65 3 92 105 -70 -90 183 -131 116 -40 -189 180 -27 110 -157 80
5217 80 100 -115 64 54 -38 -36 30 1 -92 235 140 -5 -68 -52 -285 -143 -50 72 -140 113 233 -17 14 -263 258
5242 258 -32 207 -102 41 -34 -186 139 -160 45 -242 -95 147 9 208 -173 -68 71 6 -116 -36 -115
5263 -115 219 -43 -147 -220 -57 -46 -191 -40 63 -117 58 -59 -83 -32 -189 21 -7 94 208 173 -33 184
5285 184 86 -251 -138 -16 63 -252 -170 47 -48 -13 -99 18 126 -69 -336 208 145 315 276 98 -304 89 24
5308 24 418 -60 23 125 106 313 174 73 253 -193 4 518 374 -351 -340 -248 -134 -101 371 -59 -146 -181 399
5331 399 -16 246 175 -448 227 -192 304 -138 -53 -7 369 -290 131 -394 -333 272 67 -300 235 -65 -289
5352 -289 61 -14 -401 465 115 444 225 263 -554 -538 271 -136 -380 -367 -32 102 -108 -223 265 -356 -286 -1199
5374 -1199 14 -22 -648 461 172 -100 -277 -499 541 -333 377 -184 153 206 446 -323 -385 19 179 41
5394 41 -226 569 444 361 600 -77 344 -309 389 179 -397 -930 -626 -555 51 48 222 90 -729 -1 53 40
5416 40 -391 145 -150 -5 -820 6 -223 357 243 -383 -106 -109 -96 -325 20 442 201 -299 15 -565 161
5437 161 -183 -93 -167 -798 -137 731 435 22 282 192 394 -187 99 -722 -192 -380 -473 361 346 -240 169 37
5459 37 -250 -184 44 -421 -980 -41 -144 498 -91 -440 225 -411 -67 531 -89 112 -476 201 41 183 402
5480 402 102 -163 -32 -239 169 45 162 -71 60 -75 -131 -154 -62 -39 -143 285 -113 88 104 -131 -290 49
5502 49 68 -369 57 12 -83 -12 -23 182 36 68 -96 87 -288 279 159 46 -208 -31 132 -12 152 -18
5524 -18 101 -90 -68 -124 37 -45 35 -26 38 -89 -164 -16 14 -9 -82 -57 -100 -114 1 81 71 40 47 -65 -175 7
5550 7 -136 -64 -87 103 -10 116 15 239 -6 -69 13 -32 125 -147 -69 -7 101 129 28 -111 -9 -201 17
5573 17 -40 -141 -184 18 36 -41 -22 -4 215 -238 -233 189 40 1 88 -111 -72 178 -124 -312 -53 -97 7 -53 -102
5598 -102 92 -9 138 3 -216 147 129 124 103 -193 -9 77 74 79 178 132 -51 250 118 33 340 -266 83 189
5622 189 73 -42 175 -305 -105 20 103 -200 -203 -50 -188 -181 199 187 98 280 -32 -461 -533 425 57 374 437
5645 437 571 -184 -386 -466 -216 113 -154 -43 106 -61 20 720 -196 -245 -121 33 738 -189 -39 262 -425
5666 -425 75 -403 33 109 355 -86 200 443 220 -2 -149 -276 80 -162 -96 -204 134 445 51 -137 41
5687 41 104 80 108 150 114 -39 89 112 -99 171 -324 -147 -134 128 43 59 -104 17 314 58 -168 168 -49
5710 -49 74 -28 177 -132 -30 -34 48 -6 -99 -76 32 151 128 -286 -72 -46 116 -41 -67 54 177 71 4 -40
5734 -40 49 -13 -131 105 100 140 -105 -225 -27 197 -19 39 76 -243 -5 -26 -47 -105 16 -18 121 -58 92 217
5758 217 71 -183 306 106 -415 -39 -269 -537 306 -175 -324 293 -357 197 188 345 83 -182 -172 -475 -282
5779 -282 835 -738 77 633 -541 132 -150 170 466 292 -220 1088 161 -251 120 326 -75 231 169
5798 169 -81 -355 186 -329 10 -244 119 -344 -91 150 -473 -1 -221 -92 -37 -99 -178 129 -162 95 0
5819 0 -26 -183 -23 12 129 127 -82 -78 -129 7 -199 37 144 87 152 188 73 -222 -209 -78 59 40 155 -141 26
5844 26 -160 -277 -15 62 60 196 275 -122 215 -43 68 119 184 -111 -18 112 -175 -22 108 -125 230 -11 -51
5867 -51 133 243 -88 -37 -174 42 199 -71 -38 -15 131 -38 72 -100 -57 14 87 34 -81 -47 -49 -8 -119 25
5891 25 -55 -27 -6 104 222 77 81 -2 -85 -16 -135 193 166 118 -113 -87 -191 -80 47 -219 -56 85 32 128 -117
5916 -117 -135 -11 -248 -3 68 -178 -39 -59 -64 147 -127 -160 108 5 62 -33 -391 -151 -74 57 -211 114 -193
5939 -193 -24 169 103 157 -58 36 150 -30 201 164 -173 -51 10 234 66 -77 46 -256 105 -29 5 -123
5961 -123 12 -31 -213 10 -371 27 60 104 -188 -192 -63 153 -267 -97 -226 -117 57 52 28 -140 159 213 92
5984 92 -312 166 10 554 187 436 -18 -240 299 491 197 107 -381 61 -196 -56 11 182 -442 43 394
6005 394 -319 65 -203 -52 -285 -274 390 507 -151 -551 15 -69 -485 77 209 -220 378 105 295 69 128
6026 128 -315 226 -559 81 606 -346 739 901 -632 262 610 -656 -130 -763 -95 -165 239 -287 -493
6045 -493 -164 -63 222 -628 658 -229 -236 -804 385 -273 81 638 -424 153 394 -139 -136 149 -763 -404
6065 -404 -118 238 1035 734 -271 -311 82 284 390 427 572 -669 -50 -40 978 -602 -401 364 635 -174
6085 -174 430 369 -116 -386 197 827 -452 -643 -414 458 -16 -115 269 135 511 324 93 591 75 335
6105 335 123 32 -30 439 646 872 219 -361 258 -325 408 98 -242 28 -9 124 9 681 -456 -626 257
6126 257 1066 479 78 -66 -596 331 -281 -103 -255 25 -267 379 141 395 -56 -235 53 -57 362 268
6146 268 -229 234 -75 -60 181 516 629 187 -234 310 -769 553 427 -662 72 246 -193 210 216 342
6166 342 410 269 291 -86 681 21 -194 -97 319 180 -200 -646 -71 252 30 -489 -67 181 266 213 272 -306
6188 -306 -116 569 736 523 44 301 -623 -22 538 -477 -122 99 102 -238 -615 238 60 -732 252 826
6208 826 481 -133 193 525 161 463 84 -53 119 151 -275 -242 92 107 15 -355 295 49 -26 22 -62 -55 148
6231 148 252 184 97 -358 216 -44 278 72 -119 35 40 201 -4 89 -226 308 148 -13 42 -150 -9 -19
6253 -19 116 249 -42 -13 41 163 -15 -49 -120 144 -149 -290 -77 75 61 -152 -217 -83 -222 -131 60 56 -200
6276 -200 83 97 342 72 -45 10 0 -153 -190 -30 -41 154 87 259 131 -163 74 44 314 -150 -156 161 183
6299 183 82 255 140 175 23 53 140 -35 121 -142 -20 130 -56 55 -106 -82 18 -127 -9 -95 -122 72
6321 72 -36 -160 15 -84 -95 -112 -228 212 164 -102 144 147 68 39 18 40 -20 46 79 -100 37 98 -58 -39 76
6346 76 235 99 -72 33 24 -102 -1 -114 -74 93 -87 120 191 20 -212 -16 60 12 41 66 107 -18 -14 132
6370 132 154 272 -143 181 61 59 101 -97 -3 65 62 1 78 -185 -111 137 -138 -8 102 -28 100 234 -195 110
6394 110 -77 236 -256 -348 -52 347 -252 -146 -298 244 -166 237 -97 387 -107 -220 244 -40 58 671 -202
6415 -202 157 172 121 -274 165 -157 -83 308 21 -132 258 179 -47 -38 -211 42 -214 -13 -189 4 -244 174
6437 174 139 -79 28 -310 -100 153 171 -163 88 -155 78 -74 -106 190 -12 226 -127 84 126 134 19 -89
6459 -89 142 -51 110 -40 129 -78 18 194 0 -4 50 -328 -122 120 -65 -19 191 -295 -165 34 54 -293
6481 -293 103 -303 169 13 -44 77 -147 163 101 74 -47 248 -17 -44 -100 258 -217 -40 165 227 354 109
6503 109 7 83 196 -45 0 -2 -5 70 87 39 -6 208 -69 -304 72 139 6 -365 59 -71 164 -128 186 93
6527 93 -94 -49 -14 264 -59 162 -45 -172 316 -141 -50 160 -23 146 -32 -79 -81 -33 -51 -78 -189 125 -112
6550 -112 76 -152 -110 160 -7 -135 -96 216 94 189 -192 -127 -54 -346 157 561 609 -472 16 146 -51 -266
6572 -266 -79 177 44 -887 -451 -636 -310 -224 -48 144 -214 -180 -341 166 -186 239 1 147 66 -175 -260
6593 -260 110 -215 7 191 -71 -159 -24 -112 -31 108 32 28 -347 -144 19 145 -130 76 -157 158 -34 -4
6615 -4 -273 58 94 -142 145 83 -97 -37 5 34 -27 -323 91 -134 -36 -118 -22 101 -27 113 31 -56 -59 129 -28
6640 -28 59 -106 -56 21 167 92 8 -133 143 -8 -5 44 83 37 -18 -67 -11 -134 307 167 73 11 -206 119 -15
6665 -15 180 -292 114 223 -202 -55 26 -126 157 -110 -180 -215 69 -105 106 43 -49 39 -58 133 -72 -162 17
6688 17 95 174 11 8 -13 48 32 128 4 -18 -207 324 70 -22 -100 55 159 141 -166 -48 189 -36 -52 -130 -38
6713 -38 23 86 -111 62 -216 -241 -35 15 72 223 -129 -171 -38 24 -174 81 -167 54 -144 42 193 -4 -26
6736 -26 307 185 22 90 -83 147 165 -126 65 74 -434 -173 -26 78 31 186 110 -87 -115 221 7 -186 170
6759 170 -171 31 15 -86 26 151 -126 -58 145 -67 35 73 -28 18 119 -9 82 -5 105 197 -251 -177 -27
6782 -27 -25 76 78 -105 -38 -40 48 -116 -59 9 -103 186 38 44 105 151 141 -171 -177 175 -329 -91 171 39 13 -130
6808 -130 -107 51 44 171 80 259 123 -7 184 24 -172 -217 -45 -65 -130 -157 31 -86 -61 40 55 136 -150 28
6832 28 -179 -217 -252 -160 115 -63 28 159 -222 5 155 127 -176 -46 87 55 36 17 -56 231 137 116 178 310
6856 310 36 22 -122 -116 -127 54 -131 45 -108 73 5 65 -95 -212 61 -173 33 -105 69 106 -72 -76 -80 130
6880 130 -80 95 -127 -75 90 163 -333 -69 107 -43 122 -1 -78 -219 -12 -109 65 125 -105 5 59 37
6902 37 14 -67 -98 11 -186 278 61 36 112 -123 355 32 -150 152 66 14 118 177 196 -24 199 -17 119
6925 119 -8 125 -179 -89 -28 52 -102 114 16 54 122 41 -322 -102 -81 -344 32 20 -67 -41 34 -155 -32 -240
6949 -240 -54 -192 -78 -103 -82 26 135 -203 6 27 38 184 -29 -138 -10 7 -59 136 206 -52 75 8 120
6972 120 66 -89 -120 186 -304 -8 67 -61 -123 -158 72 314 -67 -4 123 24 -89 -21 28 15 130 -37 49 199
6996 199 -160 13 -76 112 303 79 -101 198 12 -198 71 143 151 -38 -339 -86 60 83 -398 -104 130 206
7018 206 145 -106 -380 111 -140 127 -249 50 141 278 -89 134 -91 82 143 28 77 533 -245 94 109 345
7040 345 -410 -520 -651 -380 17 334 234 -22 102 747 -94 135 863 386 825 619 120 171 333 242 443
7061 443 -318 267 143 -465 234 -59 371 -106 -86 -217 -180 -42 502 -8 -227 -8 502 -179 -15 5 271
7082 271 91 23 44 126 251 33 -120 -489 -121 24 -128 128 22 -464 66 -352 -226 -17 -73 135 -178
7103 -178 -157 66 -73 -26 143 12 9 63 -40 23 92 171 -72 -64 28 -168 -55 105 33 -58 285 83 -22 -42 -104
7128 -104 2 141 -102 168 126 54 -86 -16 35 -43 -38 -25 28 -1 -191 59 -35 60 -191 -253 2 -129 52 -58
7152 -58 -84 -60 115 -184 114 -229 122 20 -16 -156 -155 2 -101 -311 35 -112 -170 -409 -169 -367 464 -18
7174 -18 -443 -129 -79 375 -136 95 -228 149 -318 53 -672 -75 215 423 -273 -423 196 126 27 -354 -149
7195 -149 402 419 -166 147 344 265 412 77 51 -140 -113 -18 454 174 447 -238 -112 389 306 173 -531 267
7217 267 332 44 -262 87 182 -307 20 -15 12 -93 247 -253 32 76 -8 77 136 -112 156 -93 210 254 24
7240 24 113 -103 251 -187 109 200 98 -21 -165 1 -10 59 -206 21 13 11 -160 26 39 89 -171 -128 -121 -40 91
7265 91 519 336 -152 43 -162 -188 -282 405 194 -577 167 -196 -416 -238 267 196 70 52 158 102 -23 -159
7287 -159 -30 -13 -16 111 -58 136 -68 60 260 182 -292 -135 -148 -31 -91 -123 38 -63 -14 57 -24 145 -42
7310 -42 -4 -116 -52 304 -80 56 -113 218 143 -57 40 36 -140 170 72 31 -21 -84 -53 3 -58 -155 -61 -59 -11 -270
7336 -270 106 172 -108 -184 7 -201 -95 70 -77 -48 -183 247 -59 70 -84 -33 210 27 -115 -31 137 11
7358 11 -449 -337 18 228 296 -191 -86 -23 -149 -188 161 88 4 100 70 -113 118 -13 -60 -82 196 -139 157
7381 157 213 -26 62 -88 52 27 -113 141 93 -131 91 -32 -45 -64 7 -152 128 127 -27 245 -7 2 -104 -191
7405 -191 -5 97 -311 -156 -80 33 292 -40 51 44 -251 -293 191 71 -201 126 144 -91 -121 -32 25 -149 92
7428 92 76 94 -121 -102 -5 -137 47 -134 261 -10 -61 372 -17 -109 -85 291 203 210 -87 -44 -142 116 -400 79
7452 79 84 -202 64 -171 -44 21 -13 10 141 85 -23 297 10 -121 118 82 -18 -50 -18 -43 13 -57 75 -308
7476 -308 102 -108 -9 -69 28 36 -79 -179 -52 157 -6 8 -281 183 158 -63 128 52 7 -189 15 141 -46
7499 -46 -10 240 -65 -216 72 15 -42 7 193 108 -37 54 23 152 -15 31 39 77 -148 163 2 50 51 -149 -25
7524 -25 -83 -104 190 170 -201 77 50 -17 -297 171 -154 -173 -59 163 -60 -48 78 -86 93 41 2 -43 62 3
7548 3 -89 46 -3 -1 76 -34 -8 -121 155 -44 -346 79 -41 167 -44 -128 -40 201 -180 -30 -125 -5 -107 105
7572 105 -32 -47 -81 -137 215 -146 -49 -48 -150 74 172 253 -195 12 -29 -85 -324 -77 -106 240 -46 -71 173 153
7596 153 -302 153 -99 25 199 57 179 -199 24 217 155 172 84 -174 39 13 33 87 -17 -93 245 -138
7618 -138 -31 -55 201 20 250 65 36 -65 -37 -108 -106 -3 77 -16 105 103 72 -32 -242 176 109 57 -137 54
7642 54 264 -9 -218 -66 -241 125 -3 -189 322 68 96 49 101 43 112 -151 -106 -167 -181 260 207 457 344
7665 344 66 413 88 228 -506 226 119 -197 398 -49 -56 -247 276 -218 -422 -79 -480 -136 586 219 -163
7686 -163 -253 473 -305 163 65 85 392 -227 -44 787 -105 1073 -133 208 -405 99 949 -271 479 52
7706 52 65 -522 -340 -94 223 -144 93 -11 -45 -165 -15 -139 56 24 331 191 119 -159 485 158 -670 372
7728 372 62 -199 -339 234 -235 -257 -33 -136 -256 164 266 151 -25 241 -368 -112 -84 38 -106 -109 70
7749 70 86 -329 32 -407 156 184 -403 -154 -124 207 -102 -134 -635 187 -49 -225 -199 -28 233 367 216 -412
7771 -412 -230 -499 -158 -391 79 66 508 -273 99 439 -85 307 -37 39 -317 -435 307 78 408 -256 343
7792 343 61 -17 481 143 668 485 -541 -337 656 -234 64 931 83 83 364 927 -837 -399 250 13
7812 13 418 73 689 -667 -632 170 210 -715 249 77 -423 -998 -293 -1004 294 506 -51 -738 285 733
7832 733 -240 800 9 44 1249 -158 3 -130 -175 -961 -428 607 -168 -137 -79 478 -36 -141 80 500
7852 500 390 -1049 -552 145 672 157 -539 172 285 -791 552 -150 52 183 149 214 -43 -435 -999 -744
7872 -744 134 -339 -75 639 858 -540 366 -144 185 -88 -802 82 -807 -323 167 129 418 398 515 -674
7892 -674 13 592 529 112 -88 -51 616 257 343 101 -423 51 269 725 101 158 -477 -280 -359 0 441 -94
7914 -94 -387 -100 28 80 46 -255 547 -121 637 623 -368 508 -138 250 -284 66 -71 350 82 -150 -115 -328
7936 -328 157 -137 4 -275 -303 233 7 -63 -240 -301 155 222 -193 -113 195 -383 -182 -101 139 122 92 -218 157
7959 157 -310 -53 73 -55 -281 -142 7 233 -69 362 126 35 131 -120 -49 246 124 -87 205 -366 -78
7980 -78 1 62 21 227 130 27 -74 54 258 132 -273 -46 167 39 264 178 -145 41 70 297 45 219
8002 219 107 -14 -387 -116 -261 -134 16 -24 178 -162 216 -73 -148 13 64 -70 -15 213 -239 358 -151
8023 -151 3 -230 12 199 -69 -101 -38 182 -127 -64 -79 13 23 309 29 -28 57 -145 54 242 -60 -70 -105
8046 -105 85 33 -156 -78 -23 -154 48 -100 -51 -135 260 166 -30 150 -99 315 -69 -65 35 85 -6 -119 8
8069 8 -2 -48 -103 -41 -179 31 44 125 48 53 44 62 -190 138 157 112 23 89 87 -19 182 -29 21 -8 -9 96 2 85 64
8098 64 45 94 4 116 -140 -46 -48 25 -44 25 -68 -158 -81 35 225 -175 -55 24 -74 203 22 -131 -90 -21 96 -37
8124 -37 47 -26 -216 -24 -49 98 254 -76 22 -39 155 -86 176 -40 44 41 -100 235 121 137 -16 299 118
8147 118 154 -2 -154 -38 -208 207 -70 -126 62 167 -128 -54 -140 -26 131 62 -113 101 -6 64 -128 -92
8169 -92 -13 50 -76 -103 -75 42 25 -21 60 -294 -13 -50 89 -95 165 337 -40 -34 -143 118 -84 356
8191C56
$$ Imaginary data points
##PAGE= N=2
##DATA TABLE= (X++(I..I)), XYDATA
0 0 0 0 0 0 0 0 0 0 0 0 0 0 0 1 -8 8 -8 8 -14 16 -16 24 -24 32 -38 42 -49 57 -67 80 -89 104 -117 133 -151 171
36 171 -193 215 -242 270 -300 336 -372 414 -457 507 -558 617 -679 749 -825 910 -1001 1102
54 1102 -1217 1344 -1488 1651 -1837 2057 -2313 2622 -3001 3478 -4105 4972 -6260 8428 -13097
69 -13097 48976 -59765 -28536 76224 773 -27206 41775 29489 -28188 26988 -16988 41106
81 41106 -10989 -35069 10398 51185 -14239 -37190 49983 -30667 -18370 16330 18346 -16330
93 -16330 -11878 14070 -9812 21021 -40298 5338 12677 -413 -345 3881 5008 -31380 18789 -3344
107 -3344 19963 -10154 -12720 22514 2253 -3250 -16852 31290 -19586 8385 24110 -4351 -9944
120 -9944 -6630 22537 -11640 20933 -12441 6357 10297 -6914 11321 -6972 7582 -11475 29759
133 29759 -3053 -919 4288 -9567 14405 -660 18268 -14300 12939 1019 5332 6693 -9628
146 -9628 14504 -8748 18283 1551 9756 -14707 1160 19795 -11082 14956 -4380 5671
158 5671 -7795 15455 -3710 -7755 9282 -13265 18672 -4578 -150 -14235 6374 -2780 -6850
171 -6850 14255 -19939 2124 -6121 6661 -13505 -776 -3781 -13665 15685 -12263 -48 -13421
184 -13421 2911 -8065 3618 3572 -17530 8959 -10770 7389 -7982 2683 -7334 -214 12657
197 12657 -10199 7938 -12298 7967 -2630 9397 70 -4847 9983 -8781 15745 -5194
209 -5194 3873 -6026 10290 8063 -5235 9242 -10290 10029 -3819 12974 -2317 -2163 3836
222 3836 -3264 14587 -10876 5388 -5393 9822 -1895 619 5895 -14896 7973 -3408 10762
235 10762 -10074 896 -1185 -2466 7786 -11243 5585 -10310 6968 -4496 4618 -3780 -13338
248 -13338 9344 -5367 6389 -10770 4460 -8036 810 4781 -8759 4483 -11142 8768
260 8768 -4477 5202 -7946 -3717 6789 -6623 9455 -6570 4610 -8763 9034 1093 -4378
273 -4378 6819 -7941 10152 -2373 8583 -8062 4107 3641 -1470 11147 -6319 6417 -5693
286 -5693 11622 -2540 2289 3667 -5540 11617 -2865 7640 -6774 7435 -2796 3537 8733
299 8733 -8282 6179 -4709 9041 -6160 6324 -2725 -3598 8000 -5111 5614 -8512 5535
312 5535 -6698 5865 426 -7065 5023 -7531 5454 -6108 5099 -8710 1326 2814 -5950
325 -5950 5542 -8720 3596 -6872 7919 -4833 -2132 2854 -6732 5940 -4635 5205 -8939
338 -8939 6331 -844 -394 5517 -7621 5097 -3713 9226 -5268 4923 163 -2371 8166 -3017
352 -3017 6985 -5819 9013 -2533 5378 3542 -4651 7544 -2011 8210 -3999 8746 -4237
365 -4237 1764 7258 -2911 5576 -4759 8224 -4413 7108 -1778 -1446 4775 -4003 6620 -4010
379 -4010 5669 -8192 5141 1188 -3843 3352 -5293 4173 -5903 6688 -7099 44 -217 -4775
393 -4775 4129 -6106 2442 -9421 5257 -5086 -1679 174 -6758 2163 -5801 4381 -9858 2821
407 2821 -5116 -2900 3226 -5683 777 -8195 6440 -6772 1899 -2690 -2981 2464 -4875 5638 -6223
422 -6223 4511 -6256 4479 2661 -3742 3107 -2536 6788 -5623 7861 -2124 1763 2089 -959
436 -959 7452 -4288 4346 -3806 9020 -2683 -484 5185 -2870 2783 -3226 8353 -7069 2498
450 2498 -886 -510 2590 -6331 2759 -4479 4209 -8992 3384 -627 -8315 998 -2496 1270 -11290
465 -11290 5297 -5940 -2597 -766 -4943 223 -6255 2793 -8435 4983 -6391 -4193 2869 -3809
479 -3809 -998 -5711 6221 -8839 2275 -606 -2803 257 -3057 3286 -6297 6377 -6422 1392
493 1392 1419 -2005 871 -2588 5139 -6969 6076 -2990 1296 584 -1187 3411 -3139 5998 -5618
508 -5618 5730 -685 1105 1506 -94 5378 -4376 6905 -2642 5080 -1396 1718 4975 -2285 4507
523 4507 -2362 7597 -4231 4463 1613 538 2823 -2410 6581 -4146 5008 -3764 3804 329 -3219
538 -3219 3285 -2526 2247 -7030 6053 -4452 -2348 484 -3397 458 -5558 3438 -7781 2140
552 2140 -4103 -3133 207 -4209 -378 -6317 5072 -8343 284 -922 -2944 -1134 -2731 2514 -7421
567 -7421 5223 -4816 328 131 -1445 284 -2703 5661 -6596 4956 -1487 4 660 500 2026
582 2026 -3789 7200 -5394 4126 127 110 -58 502 3809 -5788 6360 -3296 1787 -808 969
597 969 720 -2582 4240 -5338 5180 -4327 443 307 -130 -238 -3421 5308 -6791 3223 -2095 481
613 481 -1595 -1699 1929 -4182 3993 -6205 3411 -2411 -1050 -257 -983 1258 -6092 5127 -5125
628 -5125 1765 -1653 -638 198 -2452 2490 -5400 5271 -5191 688 67 -632 -163 -2334 4546 -6414
644 -6414 4015 -2400 1462 -557 -408 2127 -2671 4921 -4921 4957 -982 627 1233 847 2389 -3639
660 -3639 6847 -3440 3313 -164 1509 906 -338 4463 -3893 5731 -2682 2820 101 1377 848
675 848 -1557 5036 -4651 4633 -2261 1333 -469 402 1339 -3274 4177 -5148 3460 -2041 17 -1642
691 -1642 -405 1404 -5250 4812 -4849 1316 -2295 297 -1652 -2001 2049 -5385 3970 -4725 492
706 492 -1419 11 -579 -2104 2803 -5764 3242 -2543 1152 -1338 155 584 -3256 4311 -3848 2992
722 2992 -2193 1375 -574 1310 1932 -3125 5286 -4163 3269 -327 1922 229 122 3981 -3607 5406
738 5406 -2367 3182 -321 1739 629 -655 4096 -3661 4685 -2083 2207 -467 1141 976 -2482
753 -2482 4048 -4045 3306 -2038 1413 -1156 160 1423 -3476 3693 -4134 2238 -2382 822 -1328
768 -1328 -816 794 -4590 3400 -4133 1226 -3511 441 -1214 -2016 2702 -5008 3083 -3492 1633 -1990
784 -1990 619 -144 -2727 3260 -3990 2166 -1659 1514 -1533 1068 1349 -3135 4237 -3155 2905 -1312
800 -1312 2052 -547 482 3165 -2929 4694 -2280 3064 -1169 2788 235 -504 3994 -3142 4384
815 4384 -1833 2900 -1261 2174 1003 -1713 4245 -3291 3130 -1746 2177 -1543 1003 979 -2887 3852
831 3852 -3609 2003 -2083 1429 -1985 -504 1835 -4167 2783 -3593 1682 -2868 677 -1492 -1550 2066
847 2066 -4413 2656 -2867 1038 -3118 1082 -972 -2854 2495 -3974 1990 -3029 1435 -2695 515
862 515 560 -3043 3257 -3572 2143 -1995 2302 -2145 209 2376 -3262 3725 -2131 2554 -1624 2802
878 2802 -877 -409 3360 -2736 3736 -1277 2677 -1923 3096 1069 -948 3830 -2165 3417 -1008
893 -1008 3681 -1176 1893 1642 -1589 4164 -1657 2696 -1636 3274 -1063 679 2446 -2144 2978
908 2978 -2074 2833 -2117 1842 -1178 -242 2163 -3142 2269 -2788 2296 -2928 1299 -775 -2257
923 -2257 1712 -3246 2520 -3208 1351 -2650 912 -383 -2611 2443 -3551 2051 -2509 2326 -2121
938 -2121 320 853 -2095 3246 -2480 2570 -1470 2564 -1213 685 2434 -2533 3596 -1026 2921
953 2921 -2026 2927 469 -163 3478 -1860 2861 -901 3365 -1247 2834 690 -1492 3743 -1227
968 -1227 2427 -1633 3217 -1761 1402 2019 -2104 2532 -1673 2495 -2265 2969 -1791 -319 2447
983 2447 -2219 1894 -2016 2417 -3206 2355 -383 -1630 1523 -2197 1770 -2511 2480 -3111 1209
998 1209 -69 -2005 1312 -2307 1555 -3186 2474 -2427 -130 43 -2076 1853 -2282 1867 -3246
1013 -3246 2035 -1709 -362 1069 -2517 1674 -2242 2415 -2479 2081 -999 -543 1964 -1699 1834
1028 1834 -2145 2757 -2051 2425 -3 -1082 2222 -1247 2807 -1335 2797 -2189 1699 1323 -986
1043 -986 2482 -1462 2146 -2096 3378 -1678 163 1217 -1292 1714 -1835 1897 -3203 2015 -999
1058 -999 -660 1270 -2396 1004 -2106 2212 -3346 1171 -599 -1458 1439 -1993 1096 -3352 2290 -2608
1074 -2608 427 -79 -1870 1072 -1823 1813 -3352 2132 -2194 -18 1060 -1604 1141 -2148 2443
1089 2443 -2643 2323 -1026 -694 1104 -669 1947 -1970 2710 -2410 2421 212 -436 1225 -958
1104 -958 2136 -1711 3409 -2295 1324 841 -366 1878 -1075 2061 -2263 3411 -1065 805 792 -855
1120 -855 1856 -696 2605 -2670 2202 -1108 706 1303 -1345 1125 -1941 2792 -2588 1317 -946
1135 -946 -811 848 -1328 1250 -3015 2194 -2528 1147 -372 -1571 316 -1593 1783 -2881 2228
1150 2228 -2613 97 164 -1228 303 -2051 1706 -2971 2232 -1356 -241 33 -999 1075 -1778 2531
1166 2531 -2811 1787 -321 20 978 -939 1414 -1921 3017 -1765 1325 149 -82 1162 -474 2180
1182 2180 -2243 2998 -1068 1200 777 -257 1183 -670 2768 -2150 2422 -789 601 911 83 1182
1198 1182 -1553 2699 -2135 2124 -725 -294 500 -318 1636 -2232 2284 -2557 1062 -299 -259 64
1214 64 -1339 1098 -2661 2484 -2240 -56 -249 -762 305 -1752 1192 -3113 1806 -1472 134 -505
1230 -505 -1021 171 -1500 2319 -2929 1566 -670 -124 118 -390 512 -1951 2753 -2041 1542 -674
1246 -674 -114 443 -188 1988 -2122 2511 -1190 1505 528 206 91 -678 2243 -1879 2879 -1059 643
1263 643 408 640 1102 -1355 2412 -2008 2359 -437 556 -190 205 1202 -1601 2238 -2267 995 -530
1280 -530 310 -107 -872 891 -2356 2238 -1824 450 -928 -54 54 -1305 1561 -2934 1200 -1674
1296 -1674 298 -679 -532 -108 -1773 1764 -2543 779 -1481 -249 -420 -220 497 -2062 1933 -2221
1312 -2221 1099 -764 236 -552 -123 1530 -1909 2109 -1569 1029 -251 680 268 -693 1844 -1747
1328 -1747 2398 -865 981 -93 549 902 -684 2227 -2049 2052 -356 987 -188 543 750 -1272
1344 -1272 2493 -1664 1353 -539 646 17 290 1225 -1839 2163 -1715 995 -650 182 -630 -562 1466
1361 1466 -2292 1580 -1772 353 -834 -140 -328 -1424 1693 -2536 1330 -1214 56 -1232 -93
1376 -93 536 -1690 1506 -2293 891 -927 597 -991 -278 977 -1906 1828 -1367 547 -835 925
1392 925 -407 -565 1231 -1595 1656 -943 708 -746 789 123 -550 1977 -1733 1609 -682 1204
1408 1204 -117 760 651 -1059 1843 -1053 1409 -579 839 47 403 1215 -1377 1742 -1232 1020
1424 1020 -704 781 -450 -298 976 -1431 1369 -1418 1038 -926 412 -155 -951 1104 -2013 1140
1440 1140 -1053 345 -1244 68 -197 -1234 1126 -2212 819 -1094 690 -1023 -334 283 -1925 1434
1456 1434 -1540 640 -1134 809 -499 -197 876 -1737 1208 -1013 899 -794 854 -47 -405 1809
1472 1809 -1147 1320 -715 1398 -355 885 556 -977 1778 -930 1387 -312 1050 -493 758
1487 758 1194 -888 1583 -867 1358 -455 1307 -409 -57 1156 -1232 1485 -777 955 -1077 771
1503 771 -411 -375 1122 -1424 986 -999 808 -1014 480 -228 -1087 1017 -1480 600 -1266 638
1519 638 -1192 120 448 -1330 822 -1521 463 -1363 965 -949 -381 678 -1343 989 -1132 793
1535 793 -866 770 -583 -357 1000 -1243 882 -778 952 -1052 884 374 -534 1312 -1104 1242
1551 1242 -679 1243 -944 774 610 -743 1348 -710 1164 -846 1443 -400 170 800 -931 1087
1567 1087 -685 1156 -1271 1307 -510 -172 1208 -748 979 -885 927 -1083 750 -22 -675 1042
1583 1042 -989 720 -1184 1013 -1171 349 101 -1005 783 -1058 518 -1264 827 -1197 -199
1598 -199 286 -1219 774 -1125 573 -1203 851 -684 -482 595 -1223 706 -739 674 -1214 993
1614 993 -464 -261 831 -740 799 -712 1323 -812 425 273 -532 1063 -521 1122 -796 1470
1630 1470 -604 453 770 -227 809 -591 1148 -912 1303 -362 38 745 -565 679 -585 1000
1646 1000 -1057 938 -32 -363 632 -804 844 -1088 1009 -1315 326 -365 -881 377 -935 621
1662 621 -1331 801 -1029 121 59 -941 320 -920 494 -1616 809 -764 -413 470 -631 271
1678 271 -1153 761 -1512 660 -463 -405 464 -851 664 -999 1163 -1225 431 74 -453 709
1694 709 -382 791 -912 1570 -576 577 564 -263 865 -309 1002 -668 1469 -364 358 531
1710 531 -205 760 -326 1449 -1109 937 -78 -193 697 -183 678 -1011 1279 -974 829 -159 -371
1727 -371 353 -479 585 -1231 1172 -986 31 -49 -472 135 -646 654 -1227 788 -710 -249 71
1744 71 -681 276 -750 972 -1532 540 -414 -324 60 -649 474 -884 1216 -1029 653 -55 -217 386
1762 386 -391 721 -968 1515 -761 552 199 -98 456 -210 952 -978 1441 -442 275 284 19 591
1780 591 -458 1380 -874 1054 -271 20 360 -233 335 -525 1268 -966 659 -133 52 316 -279
1797 -279 643 -879 1048 -809 504 -181 -170 204 -611 774 -1191 1005 -698 22 -261 -488 101 -808
1815 -808 701 -1564 793 -687 -58 -106 -359 -91 -1093 722 -1286 313 -523 -149 -190 -323 270 -999
1833 -999 814 -1139 533 -114 9 38 -280 840 -910 1045 -497 420 259 63 322 -182 1165 -798
1851 -798 1116 -465 426 141 234 809 -532 1314 -869 1033 18 292 516 92 758 -802 1198
1868 1198 -737 790 -31 266 -112 -50 635 -1061 1010 -808 565 -380 -225 -155 -393 655 -845 770
1886 770 -665 206 -176 69 -123 -1019 715 -1058 631 -635 -179 -384 -209 453 -973 839 -852
1903 -852 705 -336 397 -125 -401 599 -1067 935 -611 308 -331 47 114 -273 1053 -986 876
1920 876 -486 512 -11 331 191 -351 935 -753 815 -291 452 -205 187 194 -556 1357 -710 796
1938 796 -4 635 203 -40 694 -604 970 -534 532 -228 186 -43 -381 915 -1067 723 -634
1955 -634 218 -384 126 27 -669 699 -1131 619 -859 446 -368 -67 -11 -1024 629 -968 221 -531
1973 -531 103 -567 -277 278 -906 788 -875 526 -730 274 -350 -126 683 -1051 729 -586 605
1990 605 -474 299 203 -245 873 -724 938 -121 475 -300 458 302 -268 885 -563 722 -416
2007 -416 796 -275 -135 731 -676 1107 -632 685 -597 448 -312 -444 702 -735 811 -510
2023 -510 582 -637 464 -205 -584 619 -724 679 -715 135 -565 107 -22 -448 737 -761 640
2040 640 -670 776 -895 199 214 -1008 709 -985 509 -860 272 -527 -342 449 -628 522
2056 522 -604 472 -556 487 18 -346 583 -575 732 -379 646 -390 580 282 -350 677 -865
2073 -865 745 -241 163 -349 73 554 -364 1137 -484 759 -271 348 -143 288 567 -756 646 -402
2091 -402 667 -481 522 -354 -451 564 -541 684 -549 104 -129 176 -141 -772 678 -739 431
2108 431 -641 527 -571 88 134 -837 530 -903 13 -1010 410 -601 224 187 -518 99 -633 555
2126 555 -1087 219 -404 -93 512 -857 283 -308 979 -259 161 14 -330 605 -239 69 -309 750
2144 750 -535 957 393 -375 931 140 762 -208 454 -277 -87 237 -100 869 -267 970 -183 724
2162 724 -205 262 551 -797 106 -651 318 -458 952 176 -183 379 -564 886 -1283 538 -621 79
2180 79 37 -658 525 -641 711 -650 695 -604 6 87 -699 31 -704 21 -589 498 -133 -423 -35
2199 -35 -453 292 -419 781 -496 457 -329 -139 116 -215 545 -56 610 -641 267 437 -38 886 -148
2218 -148 728 -457 997 -214 314 244 169 786 -341 657 -562 939 -483 215 212 -147 594 -256 896
2237 896 -563 573 -326 -266 300 10 278 -464 959 -749 384 -159 -413 210 -524 450 -505 760
2255 760 -740 -148 -51 -711 497 -845 1121 -552 321 -139 -576 -102 -434 482 -508 458 -1085 663
2273 663 -255 -71 -8 -525 308 -292 532 -744 345 185 168 11 -110 366 -414 682 -584 277 192 -240
2293 -240 948 -179 574 -672 663 -460 120 278 -95 306 -176 585 -298 902 12 278 361 -203
2311 -203 141 -224 546 -634 776 153 30 269 -169 267 -583 736 -426 271 -3 -198 144 -514 333
2330 333 -737 180 -473 74 -365 -528 80 -235 317 -857 621 -36 -158 -224 -279 -146 -845 438 -786
2349 -786 509 -607 -88 289 -400 63 -665 838 -253 177 72 -87 246 -85 735 -320 880 -224
2367 -224 216 195 408 358 -551 962 -568 455 139 11 93 516 80 -470 604 -115 885 -382 108
2386 108 55 344 473 -276 773 -545 322 -64 200 132 -400 544 -516 598 -517 146 -170 -117 123
2405 123 -465 751 -583 460 -428 -6 34 -201 236 -545 408 -717 310 -413 13 -234 -144 228 -727
2424 -727 661 -597 470 -135 23 -125 -207 625 -352 396 -353 288 19 -5 123 -119 612 -743 901
2443 901 77 144 -25 445 274 -16 737 -453 636 -106 433 -37 26 382 -424 723 -214 625 -165 208
2463 208 -27 -184 33 -580 257 -305 221 -292 107 -226 -595 245 -697 488 -415 119 201 -55 -148 -288
2483 -288 503 -691 578 -267 -27 -147 -160 23 -519 423 -648 259 -218 303 -120 -90 209 -580 458
2502 458 -440 200 -391 -151 -92 66 653 -555 367 62 153 94 218 44 -356 675 -270 431 -9 311
2522 311 196 216 308 -376 731 -219 616 -30 193 -103 32 276 -401 503 -314 439 -268 111 -94 -232
2542 -232 319 -668 344 -493 220 -279 205 -88 -312 347 -569 384 -165 224 -405 166 -149 -444 519 -416
2562 -416 115 -513 -135 -345 -116 109 -538 380 -430 165 -408 123 -553 -37 405 -665 407 -124 81
2581 81 -504 331 301 -257 674 -308 536 -198 487 -308 273 215 -71 646 -106 312 -295 307 -181 95 275
2602 275 -6 -55 -279 74 -303 338 -23 -31 350 -364 547 -155 372 -369 720 -121 -106 562 -619 452
2622 452 -400 220 -403 347 346 -95 236 -860 641 -696 359 -1066 -37 49 -268 550 -696 588
2640 588 -237 1 -18 -214 270 -637 330 -197 389 -33 111 214 -88 466 -539 569 -132 481 57 333
2660 333 135 -529 395 -290 508 -127 423 -245 425 370 -509 334 -235 462 -264 417 80 64 443 -350 462
2681 462 -92 379 -234 697 -68 373 186 -491 47 -503 223 -561 149 33 -159 454 -165 151 -275 108
2701 108 -588 191 -206 -688 119 -290 81 -726 413 -259 -166 -16 -440 245 -559 252 -425 292 -200 -78
2721 -78 234 -407 253 -539 507 -435 185 -182 143 358 -265 386 -255 241 -438 211 165 -203 367 201
2741 201 504 -124 510 -204 177 121 -351 548 -144 527 -248 616 -163 -94 261 -36 288 11 356 -368 598
2762 598 -191 -159 253 -303 531 -343 297 -322 90 81 -50 198 8 304 -348 434 -438 64 -132 -233 14
2783 14 -215 256 -520 334 -579 -4 177 -484 201 -510 266 -414 69 -187 14 377 -123 320 -239 488
2803 488 -596 348 -118 -66 76 -181 -90 -307 460 -245 333 54 -342 389 29 84 -350 256 -107 -67 403
2824 403 91 166 -724 1247 -375 713 -598 -538 1015 -146 554 -182 183 -719 553 -254 -165 428 -113
2843 -113 249 -312 523 -431 -72 -6 -156 5 -341 254 -491 235 -478 -8 -1 -366 117 -517 106 -549 398
2864 398 -404 -78 236 -157 -23 -298 209 -659 303 -237 -169 126 -301 107 -209 646 -370 271 276 -18 591
2885 591 -38 667 -143 404 -337 -128 150 73 138 10 530 -563 712 -78 25 -2 131 444 -127 478
2905 478 -443 426 81 29 249 -208 164 -443 730 -341 141 -11 -61 -36 -36 266 -634 686 -255 98 -290
2926 -290 -204 38 -326 263 -629 260 -338 -54 60 -114 22 -492 315 -465 177 -192 -44 -76 -293 113 -664
2947 -664 154 -284 80 -222 142 -10 -220 136 -400 478 -396 221 -440 -80 165 -128 475 -271 730 -156
2967 -156 233 304 82 229 -348 500 -435 257 -219 256 151 -4 256 -265 515 -579 214 -147 34 76
2987 76 -52 188 -429 461 -245 448 -203 35 -28 -65 308 -540 461 -387 68 -296 -47 21 -437 333 -524
3008 -524 276 -163 157 -125 -269 73 -374 251 -509 -6 -436 -64 -29 -111 398 -359 428 -228 100 9 366
3029 366 -148 72 670 -333 114 -313 356 104 59 25 -161 760 -282 711 -271 470 -174 -45 -7 -548
3049 -548 1236 -669 387 -23 283 -300 -102 228 -286 811 -330 152 -113 -54 -573 73 207 -192 523
3068 523 -277 -301 -218 -120 183 26 -287 -222 417 -553 93 51 143 963 -497 -276 -427 33 -92 341 349 -617
3090 -617 451 233 616 241 106 375 -368 -591 -252 708 -567 993 234 286 -587 485 84 52 111 484
3110 484 180 -183 450 503 545 299 99 1517 30 1270 99 730 -203 467 790 884 1171 -484 644
3129 644 -247 1169 -646 -73 973 -169 276 -256 -275 -1207 468 953 -532 -262 -278 546 -886 421
3147 421 401 -291 -573 202 490 -387 -68 -5 866 643 723 -169 -9 746 749 361 353 478 92 -645 267 -389
3169 -389 62 -200 -563 -763 250 531 -416 235 -356 -126 136 627 195 -813 531 128 944 -1013 -137
3188 -137 784 -429 -349 488 768 115 150 856 613 -611 -86 389 778 -292 -457 709 -56 1375 -868
3207 -868 -661 392 555 171 -127 21 18 353 -135 365 -326 -769 137 -550 -389 -73 83 26 -55 118 -1342
3228 -1342 732 -482 570 -186 91 -676 257 -755 -651 578 268 628 -47 202 41 -518 520 -530
3246 -530 -141 185 411 290 -123 681 -350 291 -138 159 -168 507 -313 474 -161 517 42 93 267 -26
3266 -26 241 292 -18 159 349 200 -949 60 -690 216 -378 -295 694 -3 263 -354 463 -400 456 184
3286 184 -23 479 -261 833 -87 167 -372 -287 31 -193 386 -360 201 -185 -261 -322 106 137 -202 -200 -327 235
3308 235 -211 212 -69 -28 119 -141 238 -519 409 -493 129 -266 -533 94 -139 394 -356 190 -171 113
3328 113 -2 -169 237 -6 389 -448 511 -218 155 99 -236 472 -158 285 -172 175 -152 -167 26 -15 123
3349 123 -24 382 -261 396 4 49 243 -271 156 -291 269 -418 171 -144 9 139 -428 236 -22 195
3369 195 -280 -40 39 -176 -151 -164 88 -371 284 -143 -69 -40 -368 248 21 95 -380 78 -184 -149 122 -60
3391 -60 139 -146 274 -587 203 8 -179 125 -118 156 -281 433 -226 158 30 -117 252 95 -7 0 317
3412 317 -122 -66 -55 -15 13 -5 494 -274 521 -79 100 120 118 137 -231 191 -198 325 63 -181 121 -8 -114
3435 -114 -264 126 -282 279 -3 -108 76 -32 302 -220 194 -206 -105 191 -116 -132 -56 -17 -406 210 -159
3456 -159 141 -144 -464 -37 -136 390 -615 211 -115 -58 29 -129 104 -179 354 -164 -19 -42 -125 -77 -34 250
3478 250 -183 395 -172 401 25 -107 -38 -165 528 -307 251 -270 124 224 -65 254 -22 72 -258 236 -103
3499 -103 35 239 -290 -116 -177 386 -287 36 16 -99 -144 164 413 -248 354 70 328 480 -145 -465 -475
3520 -475 -142 -448 -90 -433 -35 94 -540 -400 339 553 -188 300 234 -131 418 -208 -284 -936 1014 230
3540 230 51 56 -71 -511 -13 121 -44 511 77 43 -288 -119 -51 76 614 -493 110 30 216 -43 -104 -80
3562 -80 -79 562 -284 208 20 -150 -75 231 296 -515 509 -139 370 -186 374 307 -195 -36 -633 544 -83
3583 -83 263 -590 -358 199 -339 464 57 -141 -245 -512 148 89 328 -330 214 -537 -280 -347 -18 -400 -172
3604 -172 20 -26 64 158 -124 -243 -177 134 -132 -72 -558 275 -473 311 -279 -160 -165 -128 113 -445 766 -308
3626 -308 -226 -185 -235 63 -67 285 -6 -151 -50 375 -460 391 241 622 1034 -72 883 503 100 -58 227
3647 227 1024 374 496 -352 389 -231 -80 -226 -102 615 -145 76 60 368 -396 285 64 392 68 -339
3667 -339 -51 -36 -68 -905 27 46 -216 -299 -436 683 184 593 52 281 716 -145 448 89 12 -518 -205
3688 -205 89 192 156 -690 310 735 506 37 469 248 186 510 -490 842 -323 -353 60 -172 310 -235
3708 -235 428 333 -298 36 -62 -23 389 267 -352 164 -252 -88 605 -160 150 -90 -81 142 580 -166 7 -200
3730 -200 347 158 -333 93 -668 127 -67 -126 183 145 240 -284 -322 -434 268 -41 187 -262 284 -104 -360
3751 -360 247 -165 203 -55 -100 19 91 382 -175 216 51 -385 -361 -248 -238 -105 96 -202 167 -340 448
3772 448 35 -47 -47 -43 176 -628 70 -148 244 40 279 382 -112 363 50 311 81 282 -82 40 282 -189
3794 -189 149 -22 -27 -342 221 52 -166 -75 -195 384 141 150 -173 62 -163 -210 384 -76 292 -186 180 -128
3816 -128 175 31 -206 168 -295 -33 -68 228 -263 15 69 -372 218 -44 392 -172 -172 -167 117 129 -360 55
3838 55 -247 138 -451 4 75 -22 197 -465 195 -113 331 -149 58 249 -77 183 -190 110 -97 303 -132
3859 -132 331 -153 -79 290 -154 78 -210 -182 -191 128 256 -106 40 -87 242 -258 197 -89 24 175 158 241
3881 241 10 137 -89 146 16 -111 86 -157 66 -297 112 -258 49 -14 -173 200 -262 26 -220 165
3901 165 -161 -22 265 -163 297 -131 295 -100 88 -89 30 48 29 234 -222 167 -110 345 162 -38 113
3922 113 -88 204 -342 97 78 34 48 -100 145 87 175 -291 246 -5 68 92 -59 0 91 79 -164 176 -189
3945 -189 -33 93 -28 285 -173 304 -254 232 346 -157 131 179 36 -247 194 -40 12 210 -314 64 -182
3966 -182 241 -100 62 -292 -80 -126 -267 28 -157 321 -323 310 42 -69 140 -275 -175 -205 127 -157 102
3987 102 -263 -85 90 -39 42 -51 151 -217 311 103 -155 100 -109 90 -43 396 97 -114 235 -160 206
4008 206 -35 200 -43 287 -219 104 54 -158 117 -240 460 -176 -141 -312 -44 -6 -434 118 19 17 18 288 -38
4031 -38 -106 21 -225 153 201 154 -196 78 -186 -18 138 -129 73 -52 -33 -177 -160 417 -229 59 -176 98
4053 98 -190 90 -25 -66 -245 -295 165 -244 -22 -252 -93 -17 113 38 95 169 -370 306 -7 -13 71 376 60
4076 60 -117 371 -347 131 -223 -71 -61 72 27 -5 124 -85 509 -97 12 -46 -23 425 -290 137 -357 187
4098 187 -166 0 206 -297 158 -43 164 -146 85 -38 -240 132 -260 135 -103 -20 -273 -25 237 171 88
4119 88 -290 50 -354 -58 105 171 6 37 173 -361 284 -293 59 40 -147 143 -167 206 -344 244 -108
4140 -108 -59 59 10 74 -158 211 -370 217 -48 100 -24 92 180 -77 300 -16 50 -46 -111 175 -53 -106 -209
4163 -209 283 -42 -20 -41 165 -97 64 83 -113 137 -46 358 -122 72 -27 -51 -2 -154 95 -37 84 148
4185 148 -107 -191 -11 123 -298 -244 -498 267 24 -275 -371 -210 -70 -223 -85 -40 172 -112 97 -284 215
4206 215 -641 -350 35 -526 -4 146 -1163 40 -944 -168 -376 -315 48 -75 -161 -535 46 -348 196 114
4226 114 -25 -569 -87 -304 -301 163 -862 -77 79 -61 82 354 -59 28 694 274 331 180 267 -33 -173
4247 -173 -121 -319 295 37 182 -32 -35 -494 -72 -443 119 369 -581 771 -307 453 37 -911 300 262
4267 262 80 -22 90 186 -55 475 -464 219 301 335 -281 -288 180 344 145 195 -6 -669 148 -162 -489 300
4289 300 22 205 18 23 -275 514 -220 -208 110 -257 66 -258 91 -78 78 197 -44 -55 -211 -203 -131 500
4311 500 -35 -14 33 11 175 20 291 -163 254 -98 228 -167 -204 168 -278 34 -135 -46 -80 -62 -30 -246 109
4334 109 -50 64 7 266 -103 -343 -74 -101 299 -113 128 -28 108 -253 64 57 -283 201 -347 -23 -24 64
4356 64 -124 7 113 -19 295 -26 -81 -242 55 -130 -75 368 -234 94 -84 271 -255 -121 143 53 309
4377 309 -161 421 -68 204 70 -43 136 -21 35 140 273 -106 7 189 -92 -26 145 196 -120 253 -258
4398 -258 3 -190 -102 107 -151 97 -186 66 -118 238 -101 -214 258 -104 175 -174 178 -146 -173 191 -108
4419 -108 116 -226 31 -207 73 -225 -21 138 -123 -136 -48 -44 -119 182 -107 -173 144 -115 -71 -72 -90 -90 -81 235 -203
4444 -203 227 -6 132 -69 -1 121 -108 172 -5 9 -46 -39 -144 -121 87 231 139 73 -83 -69 -16 -167 -86 334
4468 334 149 -25 -185 134 -120 132 27 -109 58 -209 165 -15 194 -83 1 -404 -77 117 -216 286
4488 286 22 -100 -41 -1 -142 -15 48 5 148 -132 -35 -32 18 -89 57 -55 -48 28 283 135 -236 -46 -64 139
4512 139 107 -153 134 -45 86 1 2 -74 -262 -5 52 -118 -115 264 -104 190 205 -246 104 -26 19 -23 -8 -151
4536 -151 -25 239 -59 43 -10 28 0 292 -98 32 23 74 306 -284 57 142 -18 -130 -310 163 -75 -20 -206
4559 -206 116 -291 -15 -30 -101 -2 -170 250 -266 -58 -301 65 151 141 -92 -140 62 -290 283 -106 129 -46
4581 -46 -115 -87 -130 72 -43 -94 46 -251 -47 -39 26 -104 143 -173 262 -136 65 210 128 158 -78 147 63 -34
4605 -34 62 55 22 -7 123 -177 4 50 17 216 -227 -69 -47 -191 119 -205 64 -165 -26 33 105 -145 -63 30
4629 30 -168 -17 -196 63 -209 0 -145 -53 -108 -37 -249 122 -3 -151 120 -135 33 170 41 -164 106
4650 106 310 -32 4 -207 80 -16 -215 173 59 -208 -90 251 -187 290 -61 -24 225 -149 219 -70 77
4671 77 -172 -61 156 -58 135 47 15 277 -105 149 181 -60 74 -50 416 237 -88 237 48 -37 -59 -92
4693 -92 28 -288 216 -42 262 -86 -47 7 -6 -18 -78 121 -392 -28 -84 -169 29 -1 243 -144 -67 -221 -86
4716 -86 169 -5 2 -39 -138 -194 -20 -79 9 -24 68 -2 -63 51 186 185 -286 -11 38 -58 52 39 -226 -136 71 -24
4742 -24 -48 15 -44 214 79 -13 64 278 147 227 39 -120 38 -120 -70 -99 14 -8 54 27 15 30 -60 26 -114
4767 -114 9 160 6 47 -202 25 -55 161 107 23 97 -102 107 -94 55 -18 85 -72 54 1 18 -56 -159
4790 -159 197 -117 61 -45 -51 12 -47 115 -81 100 6 -104 69 -191 -239 -103 35 106 -101 -71 -7 105 -3
4813 -3 185 -65 195 107 -151 -102 124 162 81 -24 -250 77 -115 216 65 38 -3 -89 164 -112 -187 -82 34
4836 34 60 2 92 -110 27 100 6 -135 55 -67 -145 163 -41 48 89 107 -31 46 23 -273 -53 -180 -147 64
4860 64 -89 -57 90 -20 -206 7 50 288 -63 193 -73 148 317 -121 105 -107 50 177 30 -194 87
4881 87 180 -131 109 103 -80 185 -38 -64 -84 102 -113 -14 -6 87 364 256 238 -33 -147 -26 -326 -160 116 -114
4905 -114 202 -5 -363 -75 -72 31 -156 -121 88 66 151 -103 18 -41 -100 -71 -138 -12 -94 69 90 98 98 -29 83
4930 83 -59 -29 -20 332 -296 -134 -163 44 -3 -193 -24 -191 -128 181 130 -122 -144 -19 -155 110 166 128 -222 -306
4954 -306 -49 184 27 -12 71 -120 114 -59 -61 181 181 -94 248 -72 -112 -40 136 119 -179 168 199 2 70 21
4978 21 -3 -216 -52 -27 12 131 -173 80 -93 -68 -158 -38 44 191 177 -55 -32 83 74 112 -100 -113 -11 109
5002 109 110 153 -135 80 -26 49 155 101 -110 -286 99 -1 122 23 -181 -75 -124 -55 -145 224 -122 102 158
5025 158 -76 67 -3 245 -104 103 -77 -80 -56 -97 57 -54 138 -121 219 69 5 84 204 -101 120 117 -154
5048 -154 51 105 112 -30 -41 79 -220 -73 -91 48 41 21 -63 -138 247 -29 83 168 26 26 -80 -129 -102 90 -323
5073 -323 43 33 119 184 -28 174 -16 240 18 63 11 103 -137 -45 119 151 143 -159 112 29 -49 -41 -12 -137 -38
5098 -38 50 -4 -8 -117 -187 -102 -27 22 -82 31 -83 128 39 -34 228 102 -13 -131 -12 34 169 -132 -44 -185
5122 -185 -175 54 120 16 -203 -31 -67 -235 38 -70 134 63 -173 -35 -237 -6 40 -47 55 57 77 -83 136
5145 136 -196 83 -24 1 -4 60 -174 -117 38 135 -281 -22 -75 -171 -22 -65 -120 187 116 19 -68 154 -115 100
5169 100 190 -59 -46 -141 63 -45 254 145 58 -182 -32 -104 -136 -154 -78 322 18 79 -72 76 118 -4 230
5192 230 -251 73 394 56 -21 -12 20 -195 198 90 7 53 41 228 134 9 -124 -36 -132 -21 80 -100 118
5215 118 90 1 209 103 4 -61 63 188 -48 -19 -82 98 268 -85 -42 -72 -220 167 -199 -4 -103 -272 -111
5238 -111 -103 -155 -15 -53 55 -211 -136 -171 79 8 -58 -81 44 8 -56 -15 151 -279 -11 -253 3 -130 17 -38
5262 -38 -210 -124 10 188 223 -66 62 -47 -233 24 21 -148 -97 -22 126 95 -42 127 -46 202 -127 79 115
5285 115 83 -218 172 8 -38 53 44 58 169 -201 25 -50 -403 19 205 5 160 118 -17 222 245 -42 -226
5308 -226 -174 -4 -2 264 -283 412 -44 -223 -98 215 -43 -225 274 257 -91 221 -73 230 -33 -159 651
5329 651 213 -171 276 -240 58 17 2 366 230 -67 18 426 439 260 234 -228 -89 -78 117 -245 -281 144
5351 144 -123 -19 -511 348 181 -187 -221 -54 -52 88 157 33 11 448 191 229 509 126 456 44 -231 45
5373 45 -839 27 1093 16 447 208 553 -62 199 -22 -580 41 191 -32 -838 452 -586 -202 122
5392 122 -403 52 59 -409 -237 237 76 -509 -375 395 -225 -251 393 174 528 312 -565 -524 414 280 470
5413 470 175 -33 -189 -231 -591 -174 431 -206 -105 129 548 42 287 252 -57 -32 400 -231 -130 -318 412
5434 412 293 365 -437 -260 -273 -215 -149 -117 -202 422 272 153 458 283 -12 -200 -496 526 87 383 -52 416
5456 416 307 204 199 347 24 -13 -194 108 -71 -341 110 -106 55 96 162 89 -224 -114 -266 49 10 -246
5478 -246 76 454 -9 -52 -106 42 67 -188 41 -326 173 172 205 -54 94 168 -279 -29 -4 127 -315 -10 65
5501 65 -86 101 -67 -12 253 41 -262 138 115 -63 107 -69 86 141 -52 -112 -35 -59 -43 -8 -216 -71 -76 71
5525 71 -60 -69 -233 -43 53 13 152 139 140 -34 212 91 -119 -87 -84 -262 -91 189 54 -100 -135 17 11 -4 -15
5550 -15 -58 144 173 -72 -65 -88 -161 -37 184 -113 -40 -35 203 152 103 107 -99 280 -67 -104 197 128 -71 -328 203
5575 203 24 20 157 45 136 -7 111 61 158 29 119 195 -179 -374 -167 -61 -148 -107 -137 -90 -242 -75 -104 -76
5599 -76 -21 -50 -83 -156 154 -15 -86 -250 -193 164 -81 -72 -107 41 -77 -223 447 388 -277 99 83 259 -445 -696
5623 -696 269 -258 -247 36 0 263 -306 295 380 -164 26 -101 -123 -215 -346 108 -582 -607 225 499 10 -225
5645 -225 -495 -494 -236 -473 -336 492 290 63 -124 826 -112 496 -291 -180 -97 -561 992 -229 253 -73
5665 -73 -133 -96 -621 79 -256 -99 349 191 61 106 -23 200 -72 201 108 410 -183 137 156 55 39 -114
5687 -114 57 -269 39 33 59 -174 108 -87 55 -28 -100 237 254 -11 260 63 148 14 -6 -114 -231 153 -99
5710 -99 83 -173 -148 142 -109 -92 133 -29 -201 -213 56 -77 97 309 -222 99 -18 263 21 221 24
5731 24 -20 71 -83 -87 210 -105 -271 -98 -142 -76 -68 -97 104 79 -81 125 -58 96 115 3 20 -120 256 155
5755 155 -123 -228 -163 -155 39 -177 506 -635 -52 -159 -41 678 284 -208 385 78 -308 508 484 243 212
5776 212 -92 -174 -184 -73 -147 -238 -644 -385 784 -842 -401 225 -285 200 82 -294 142 163 39 236 495
5797 495 42 -628 244 -99 479 178 263 -177 -183 -185 420 -208 218 16 190 136 178 -98 -140 44 -17 -13 17 190
5821 190 -31 -434 -59 21 -220 -105 205 -50 15 200 16 108 221 -118 -61 -21 -47 -148 -146 72 -177 100 -211
5844 -211 46 20 91 23 -51 137 -147 -290 -101 -40 -11 15 94 -106 178 -184 -69 44 -23 -80 125 -25 -240
5867 -240 133 203 74 113 -141 137 326 -251 81 125 -55 112 -99 30 -15 204 8 155 -76 58 66 -159
5889 -159 176 -309 210 57 310 76 68 -105 -289 10 361 7 10 98 -164 146 -133 -116 -115 272 181 273 199 90
5913 90 -41 -69 97 -125 -75 -98 89 149 -28 -82 86 189 -58 -11 -13 -75 97 20 15 -20 140 -218 -114 -317 -97
5938 -97 186 38 -114 201 -87 -118 -248 -90 -303 66 251 99 102 -138 -67 116 -5 -103 -465 -140 27 -84
5960 -84 -161 336 -97 -111 51 -40 -356 -52 -264 81 -299 -83 -161 -158 -81 393 -101 -164 -211 202 -93 -378 -153
5983 -153 9 -220 141 13 279 -374 -153 -64 160 428 -19 -107 -78 156 -428 138 209 -323 -385 -188 -262 530
6005 530 -711 -299 -131 -451 -385 -516 486 -82 -39 -54 71 -3 276 142 496 70 -83 -112 535 520 301
6026 301 -125 -1057 372 444 -253 -452 1007 52 -210 417 -435 -418 523 -129 529 -346 420 -1082 394
6045 394 470 -188 617 -685 -786 106 -268 339 -41 205 51 84 -158 137 12 -1421 -159 -54 -10 -1114
6065 -1114 74 -744 46 1182 408 -136 119 -526 -525 582 333 -1217 197 -302 -259 -25 -135 638 -310
6084 -310 -235 289 547 -139 -9 848 34 430 41 -181 -938 582 -353 606 134 -216 -222 -875 526 178
6104 178 873 516 -902 -557 -120 -51 -426 -585 -202 -263 -385 -893 288 1318 776 -43 339 -157 -788 -873
6124 -873 563 1086 -42 236 438 201 -223 -278 -401 -392 -39 -625 -445 26 -157 -69 -285 -272 -116 331 -675
6145 -675 118 -44 321 -620 746 250 -183 530 -410 617 -324 201 -405 441 -596 217 -356 -425 390
6164 390 96 -574 65 -209 -73 -360 -236 -649 445 254 4 262 -526 -473 -115 -209 558 436 -1135 -104
6184 -104 -1023 578 22 -287 -443 39 -237 -153 281 -651 -120 550 21 -212 -267 -640 -338 80 -229 -315 531
6205 531 -224 -144 270 706 497 -583 199 -57 -116 211 -322 308 9 459 -287 -168 -75 293 -268 -173 309
6226 309 -414 222 -142 -405 -32 206 274 75 -22 -56 118 -208 29 229 -118 -190 70 173 -174 176 29
6247 29 135 -96 107 -79 -167 236 -288 -211 -57 -25 -28 38 231 -273 -88 -86 -99 19 106 209 -156 -262 -202 367
6271 367 -38 -183 123 -420 13 132 -154 -46 86 39 -130 -47 12 -106 72 169 55 -14 135 125 -22 99
6293 99 -63 -216 -194 -62 -25 -57 0 5 -56 147 -82 10 -25 -146 -106 218 -119 -17 -314 -273 10 167 -52 92
6317 92 7 -78 -70 -100 189 75 265 216 -16 84 148 156 136 232 121 7 68 -39 155 201 50 4 121 54 47 -156
6343 -156 -23 160 -95 -104 -109 -150 -9 70 -244 8 157 -74 -10 -128 -126 -263 -16 -96 -113 32 -97 -68 -135 185
6367 185 -32 65 94 106 11 131 23 -214 -29 44 43 -83 70 -144 -153 -34 -79 240 -41 105 -80 -187 132
6390 132 68 -65 -120 97 -87 -56 -133 407 72 8 225 299 88 -216 67 -235 365 18 328 226 775 215
6412 215 82 144 419 -39 542 428 -107 -317 -1 -472 -34 -503 -269 261 115 -207 178 368 46 22 -47
6433 -47 6 -30 100 4 87 21 231 68 154 159 344 -50 -184 92 -15 106 -41 -73 -13 204 -52 260 -36 6
6457 6 -181 14 -16 42 -75 0 14 226 219 96 -40 -151 -204 56 45 -167 111 -117 -157 158 174 -79 -162 -276
6481 -276 -15 -142 -130 -37 -22 -311 -114 -49 235 48 -127 17 -54 -81 -21 -368 -86 148 -325 -37 -12 -71 86
6504 86 57 -57 -50 -150 -168 -108 43 -70 108 -5 152 104 -52 50 37 -114 -53 26 126 -164 -191 53 93 29
6528 29 -62 -78 31 97 -44 43 30 224 -137 -46 -155 74 154 -19 -93 250 124 -141 -83 211 103 132 -149 -42
6552 -42 310 184 -97 119 138 341 37 138 -83 121 28 170 238 -95 -118 709 267 187 648 73 19 -321
6574 -321 -90 -307 -322 236 -27 -161 -126 -259 671 -197 115 140 342 -30 -252 28 163 -136 143 46 12 -280
6596 -280 -113 -186 70 88 63 -140 38 55 -4 7 109 7 76 -104 313 102 128 35 -157 251 48 12 158
6619 158 489 -90 -236 53 -435 75 -12 28 84 -133 149 -227 106 -57 -75 -154 127 -40 92 -55 19 49
6641 49 -212 -184 -300 31 11 21 200 -83 -53 -24 -46 -236 -44 24 84 -51 -137 11 34 -93 -74 81 6 -119
6665 -119 -42 160 -218 93 -41 41 176 -61 42 -112 178 67 212 133 -291 -47 62 -35 -80 -25 88 51
6687 51 -140 82 -28 145 -148 110 -263 -36 -68 -129 -41 -17 232 -149 -16 53 -75 -41 -129 -44 116 89 84 -74
6711 -74 -5 -221 -78 87 -88 -24 48 -260 -138 -1 53 22 140 157 -179 96 22 236 -76 181 -41 229 94
6734 94 8 32 -96 28 13 245 195 -84 -70 17 80 95 -31 0 158 -18 25 -71 -63 -189 277 78 -39 -141 1
6759 1 -3 -78 136 2 114 190 -347 284 -19 -233 21 -19 -44 -116 228 -24 20 128 217 15 -248 204 32 -138
6783 -138 -86 27 186 -112 -69 -177 -35 34 -10 -88 -108 -63 -187 92 87 -60 43 -207 -145 -99 -13 -51 107 -3
6807 -3 -306 -247 -74 -184 -88 -162 -156 109 179 -51 -53 70 -6 -139 261 -151 397 -169 31 12 46 -41 33 118 30 222
6833 222 -130 64 -93 -120 -128 50 -49 180 37 126 -48 -215 -96 49 38 202 -196 59 -119 35 -239 -84
6855 -84 238 -234 77 7 57 -45 -151 73 -188 215 90 160 -73 -91 -130 -141 -33 112 -45 62 48 26 281
6878 281 150 -53 126 -345 99 -21 151 34 -127 56 -110 -166 -87 69 14 28 124 -175 45 -52 78 159
6900 159 59 -69 -12 -30 33 -133 76 8 -19 28 -66 71 -81 -58 -3 -16 -22 -24 183 -121 -3 -143 22 70 -99
6925 -99 -22 -77 117 -173 -185 58 165 -120 -16 84 -268 -194 188 293 414 539 -257 -143 -130 -321 -19 193
6947 193 -53 16 52 203 -73 -53 -112 128 -148 85 -145 13 200 64 205 -173 169 -19 -230 -74 4 -77
6969 -77 73 10 -165 -252 -22 -48 52 -107 -25 -6 -51 -183 -85 109 69 76 -198 -6 24 0 -158 42 -33 -147 -25
6994 -25 -96 14 1 -1 105 180 -137 15 -76 -147 -36 -68 64 71 -121 155 11 235 -214 136 -76 205 -70 -166
7018 -166 118 147 -51 -111 -338 371 -37 -67 -177 -156 117 -457 -272 -221 -300 49 -59 46 38 -149 4 -130 140
7041 140 -106 -350 232 -145 -486 107 -499 -196 402 135 325 299 -423 -88 761 -423 -101 239 -318 -773
7061 -773 72 -169 -95 -160 -32 -209 -25 -172 436 440 -119 92 25 532 -96 -36 92 -190 -219 -88 -161 -184 -23
7084 -23 -74 -266 346 -47 -4 321 343 173 -104 51 40 -249 25 -112 30 -50 49 180 -23 -29 -72 -32 34 102
7108 102 19 -61 -136 -156 -196 -114 -96 -9 -102 -73 47 -276 -148 251 -102 247 61 -344 -251 103 -178 68 72 71 -169
7133 -169 114 -56 34 -62 -170 187 -37 63 119 151 -105 -12 112 -75 -45 59 186 1 -34 -58 115 -98 -228
7156 -228 -87 93 -12 112 270 -440 52 270 34 -78 453 -67 -12 -151 627 143 -135 22 -39 219 -212
7177 -212 76 -19 260 454 148 -102 118 174 381 -74 299 577 317 -300 75 -391 365 -440 -154 -165 0
7198 0 1 -507 165 -17 311 119 -328 -255 24 341 27 -258 -114 62 288 35 -156 -382 103 197 291 14
7220 14 209 -165 -129 79 -159 -99 110 -40 -117 137 -218 53 227 126 148 -10 54 47 -267 -108 4 -115 120
7243 120 -162 167 53 154 177 125 147 -156 110 36 104 90 -58 222 -76 -8 236 38 51 -181 29 204 -6
7266 -6 -517 -332 44 -49 651 -117 -12 119 532 130 -507 295 216 56 -46 -223 221 58 -16 23 -53 93
7288 93 -55 -117 -130 -28 225 -258 2 25 23 -298 -76 -10 173 -26 -188 250 6 90 -17 -269 -131 -198 -53
7311 -53 -87 70 -78 -207 -7 96 42 -79 -12 147 163 -34 310 42 -240 72 114 106 -65 -135 -140 266 129 -74
7335 -74 33 112 43 -6 -116 -130 -303 25 -132 -129 213 37 -125 264 142 53 134 139 -5 -154 38 155 135 71
7359 71 94 -91 152 60 -128 50 -327 81 42 130 281 -247 -77 -90 -107 10 55 2 34 72 180 -29 -221 63
7383 63 -408 169 52 -159 93 -288 -71 40 -25 -5 -30 -215 41 109 -67 32 -251 213 34 -334 -54 11
7405 11 -235 -273 112 -240 -170 9 -147 145 53 -43 -287 107 -453 -195 -108 152 -18 54 1 19 -168 0 -80
7428 -80 -99 170 189 164 5 -73 -255 214 -267 -21 -124 44 -25 -131 -240 -1 204 -6 -138 -105 -2 -57 161
7451 161 -262 -158 3 63 86 -171 -22 276 155 -98 6 -194 -46 151 -186 -3 -141 -170 46 103 53 -74
7473 -74 -158 -29 5 -59 20 133 19 90 274 -212 306 156 67 82 -40 -117 -166 37 64 -101 -114 -109 -43 -42 -172 -203
7499 -203 -259 -35 -162 -134 -96 -96 156 -4 -151 -14 -220 -58 245 -175 48 -307 -91 203 -12 -60 85 140
7521 140 -108 -24 305 -24 206 221 -35 158 26 136 -86 -1 -128 -23 -153 -51 -130 -73 -20 219 205 -35
7543 -35 -98 -4 -127 -155 13 64 -34 140 95 65 -138 99 -183 -188 -38 -1 229 -85 148 -83 106 1 222 -250
7567 -250 -73 -27 122 -142 -124 -65 -99 177 -137 107 118 279 176 -79 -88 40 -1 25 26 -139 -29 -166 28 -17
7591 -17 -59 149 -158 -299 49 109 -45 -200 166 -92 -157 -12 -55 -69 144 -81 349 39 -71 154 92 -197
7613 -197 -18 -2 -167 66 198 -81 -282 -57 -291 85 -432 24 33 -88 -235 61 -71 -35 17 119 -23 98
7635 98 21 120 -80 -84 301 100 27 -145 -63 13 -45 -39 20 -216 -158 27 178 28 19 -58 51 348 76 -75 -163 404
7661 404 49 -148 132 13 272 -14 -219 189 197 29 -34 -136 135 588 -215 -451 -338 -211 116 -284 133
7682 133 -423 208 -34 -162 -396 -159 -29 -65 566 -39 401 103 -560 414 -174 545 -132 633 431 187
7702 187 -127 -975 -266 -439 174 -1021 -147 -178 158 240 -61 153 -54 -266 -387 339 -540 -264 -386 231
7722 231 -294 -52 -110 227 -234 -292 -154 100 -155 130 -347 -199 91 -115 73 -95 87 184 -250 -362 -109
7743 -109 -233 210 -184 39 -98 111 11 230 -88 166 -6 254 -91 -129 -156 2 227 -271 -17 -84 -464
7764 -464 -443 270 -616 448 212 465 -121 -113 230 -403 -436 -41 -435 -43 413 686 -432 -241 -162 -35 435
7785 435 -62 103 -242 -265 199 10 575 135 -418 -514 -213 294 -353 -188 118 97 -497 -355 -36 -675 -622
7806 -622 431 -145 510 -605 -123 1026 -371 -740 119 271 -90 560 -599 329 416 171 345 -1002
7824 -1002 0 -937 665 632 -344 219 -699 -349 681 -561 31 -544 -36 -1506 -742 -235 -243 229 72
7843 72 520 -418 -236 -383 -688 -338 286 -486 164 95 -775 -295 0 -153 1370 -422 -211 871 109 595
7863 595 205 986 425 -189 -78 415 -1070 726 297 -215 255 -628 -288 74 -59 -468 -457 183 394 -236
7883 -236 90 96 -81 646 -6 363 483 -594 -277 -207 -121 -52 -140 306 -544 -185 45 309 347 86 236 -346
7905 -346 -265 689 14 322 11 -218 221 -65 248 -329 -270 -173 577 -309 -136 3 -58 282 -368 -98 -97 -248
7927 -248 451 39 8 153 286 146 112 186 29 -352 145 -337 -104 -31 -697 -183 363 -205 -238 240 114 189
7949 189 -66 168 46 -55 3 -558 149 -280 -238 -277 164 417 -194 -163 45 -1 -149 263 232 61 -267 -239
7971 -239 370 217 63 -336 103 84 78 34 -166 25 218 458 -337 -145 -22 -20 -184 -273 -41 164 87 -270 299
7994 299 -36 -226 13 244 2 102 96 163 184 218 70 41 80 159 106 112 155 143 -3 -29 3 -175 -92 -47 -44 -281
8020 -281 100 177 64 -186 23 -105 234 140 -186 68 61 -27 63 198 212 39 -97 -81 137 -45 75 20 45
8043 45 322 -85 153 186 -132 29 -22 69 80 198 115 156 120 -17 150 25 192 137 -41 -141 149 288 98
8066 98 66 65 -256 92 54 -2 -7 216 -127 -48 -40 -87 116 -48 -27 -29 9 18 130 -180 319 -61 -25 55 -257 -6 -74
8093 -74 53 -71 55 119 -2 143 -45 32 197 177 -80 150 47 -84 -132 -55 -215 -31 97 59 -60 -60 159
8116 159 52 60 -6 96 46 -50 36 110 118 -192 125 113 -56 38 -246 97 151 -32 -124 -5 -151 -26 -159 -46
8140 -46 -78 62 -89 -178 -88 -28 -172 -99 -146 34 -178 -139 -227 92 217 100 152 -205 223 -212 -42 -107 230 61
8164 61 183 67 -88 -14 -122 97 -132 -315 17 46 -37 46 241 39 -119 -130 165 71 -34 0 93 156 72 -11
8188 -11 -30 85 142
8191A42
##END NTUPLES=NMR FID
##END=
