##TITLE=1H_Pr AADA
 CDCl3
 8 sc, 
 28.06.2022
##JCAMPDX= 6.0         $$ Bruker NMR JCAMP-DX V2.0
##DATA TYPE= NMR FID
##DATA CLASS= NTUPLES
##ORIGIN= UXNMR, Bruker Analytische Messtechnik GmbH
##OWNER= root
$$ XWIN-NMR		Version 3.5
$$ Tue Jun 28 14:37:27 2022 Russian Standard Time (UT+4h)  she@DPX200
##.OBSERVE FREQUENCY= 200.1313499994
##.OBSERVE NUCLEUS= ^1H
##.DELAY= (6, 6)
##.ACQUISITION MODE= SIMULTANEOUS
##.ACQUISITION SCHEME= undefined
##.AVERAGES= 8
##.DIGITISER RES= 18
##SPECTROMETER/DATA SYSTEM= spect
##.PULSE SEQUENCE= zg30
##.SOLVENT NAME= CDCl3
##.SHIFT REFERENCE= (INTERNAL, CDCl3, 0, 15.7039)
##AUDIT TRAIL= $$ (NUMBER, WHEN, WHO, WHERE, WHAT)
$$ ##TITLE= Audit trail, XWIN-NMR		Version 3.5
$$ ##JCAMPDX= 5.01
$$ ##ORIGIN= Bruker BioSpin GmbH
$$ ##OWNER= she
$$ F:/spectra/data/she/nmr/H-F/1/audita.txt
$$ ##AUDIT TRAIL=  $$ (NUMBER, WHEN, WHO, WHERE, WHAT)
(   1,<2022-06-28 14:35:59.00 +0400>,<she>,<DPX200>,
      <created by zg, POWCHK disabled, PULCHK disabled
       configuration hash MD5:
       00 E9 B6 7A A2 85 ED C7 34 08 36 98 17 FE 4E 26
       data hash MD5: 16K
       C7 E4 24 BA 0D 73 AF A3 0B E9 D5 3E BB 67 BF F6>)
$$ ##END=
$$ 
$$ hash MD5
$$ 0A E0 FB DC 50 A7 D7 82 8B 64 B0 9B DC 3B F6 D7
##$RELAX= 
##$RELAX= 
##$RELAX= 
##$RELAX= 
##$RELAX= 
##$RELAX= 
$$ Bruker specific parameters
$$ --------------------------
##$DU= <F:/spectra>
##$EXPNO= 1
##$NAME= <H-F>
##$PROCNO= 1
##$TYPE= <nmr>
##$USER= <she>
##$AMP= (0..31)
100 100 100 100 100 100 100 100 100 100 100 100 100 100 100 100 100 100 
100 100 100 100 100 100 100 100 100 100 100 100 100 100 
##$AQSEQ= 0
##$AQ_mod= 1
##$AUNM= <au_zg>
##$AUTOPOS= <>
##$BF1= 200.13
##$BF2= 200.13
##$BF3= 200.13
##$BF4= 200.13
##$BF5= 200.13
##$BF6= 200.13
##$BF7= 200.13
##$BF8= 200.13
##$BYTORDA= 1
##$CFDGTYP= 0
##$CFRGTYP= 5
##$CHEMSTR= <none>
##$CNST= (0..31)
1 1 145 1 1 1 1 1 1 1 1 1 1 1 1 1 1 1 1 1 1 1 1 1 1 1 1 1 1 1 1 1 
##$CPDPRG= <>
##$CPDPRG1= <>
##$CPDPRG2= <>
##$CPDPRG3= <>
##$CPDPRG4= <mlev>
##$CPDPRG5= <mlev>
##$CPDPRG6= <mlev>
##$CPDPRG7= <mlev>
##$CPDPRG8= <mlev>
##$CPDPRGB= <>
##$CPDPRGT= <>
##$D= (0..31)
0 1.2 0 0 0 0 0 0 0 0.06 0 0.03 0 0 0 0 0.0002 0 0 0 0 0 0 0 0 0 0 0 0 
0 0 0 
##$DATE= 1656412558
##$DBL= (0..7)
120 120 120 120 120 120 120 120 
##$DBP= (0..7)
150 150 150 150 150 150 150 150 
##$DBP07= 0
##$DBPNAM0= <>
##$DBPNAM1= <>
##$DBPNAM2= <>
##$DBPNAM3= <>
##$DBPNAM4= <>
##$DBPNAM5= <>
##$DBPNAM6= <>
##$DBPNAM7= <>
##$DBPOAL= (0..7)
0.5 0.5 0.5 0.5 0.5 0.5 0.5 0.5 
##$DBPOFFS= (0..7)
0 0 0 0 0 0 0 0 
##$DE= 6
##$DECBNUC= <off>
##$DECIM= 32
##$DECNUC= <off>
##$DECSTAT= 4
##$DIGMOD= 1
##$DIGTYP= 9
##$DL= (0..7)
0 120 120 120 120 120 120 120 
##$DP= (0..7)
150 150 150 150 150 150 150 150 
##$DP07= 0
##$DPNAME0= <>
##$DPNAME1= <>
##$DPNAME2= <>
##$DPNAME3= <>
##$DPNAME4= <>
##$DPNAME5= <>
##$DPNAME6= <>
##$DPNAME7= <>
##$DPOAL= (0..7)
0.5 0.5 0.5 0.5 0.5 0.5 0.5 0.5 
##$DPOFFS= (0..7)
0 0 0 0 0 0 0 0 
##$DQDMODE= 0
##$DR= 18
##$DS= 0
##$DSLIST= <SSSSSSSSSSSSSSS>
$$ [...]
##$SUBNAM2= <"">
##$SUBNAM3= <"">
##$SUBNAM4= <"">
##$SUBNAM5= <"">
##$SUBNAM6= <"">
##$SUBNAM7= <"">
##$SUBNAM8= <"">
##$SUBNAM9= <"">
##$SW= 18.0517283424941
##$SWIBOX= (0..15)
0 0 2 0 0 0 0 0 0 0 0 0 0 0 0 0 
##$SW_h= 3612.71676300578
##$TD= 16384
##$TD0= 1
##$TE= 0
##$TE2= 300
##$TE3= 300
##$TEG= 300
##$TL= (0..7)
0 120 120 120 120 120 120 120 
##$TP= (0..7)
150 150 150 150 150 150 150 150 
##$TP07= 0
##$TPNAME0= <>
##$TPNAME1= <>
##$TPNAME2= <>
##$TPNAME3= <>
##$TPNAME4= <>
##$TPNAME5= <>
##$TPNAME6= <>
##$TPNAME7= <>
##$TPOAL= (0..7)
0.5 0.5 0.5 0.5 0.5 0.5 0.5 0.5 
##$TPOFFS= (0..7)
0 0 0 0 0 0 0 0 
##$TUNHIN= 0
##$TUNHOUT= 0
##$TUNXOUT= 0
##$USERA1= <user>
##$USERA2= <user>
##$USERA3= <user>
##$USERA4= <user>
##$USERA5= <user>
##$V9= 5
##$VALIST= <valist>
##$VCLIST= <CCCCCCCCCCCCCCC>
##$VD= 0
##$VDLIST= <DDDDDDDDDDDDDDD>
##$VPLIST= <PPPPPPPPPPPPPPP>
##$VTLIST= <TTTTTTTTTTTTTTT>
##$WBST= 1024
##$WBSW= 4
##$XGAIN= (0..3)
0 0 0 0 
##$XL= 0
##$YL= 0
##$YMAX_a= 299582
##$YMIN_a= -370417
##$ZGOPTNS= <>
##$ZL1= 120
##$ZL2= 120
##$ZL3= 120
##$ZL4= 120
##$ABSF1= 10
##$ABSF2= 0
##$ABSG= 5
##$ABSL= 3
##$ALPHA= 0
##$AQORDER= 0
##$ASSFAC= 0
##$ASSFACI= 0
##$ASSFACX= 0
##$ASSWID= 0
##$AUNMP= <proc_1d>
##$AZFE= 0.1
##$AZFW= 0.1
##$BCFW= 1
##$BC_mod= 2
##$BYTORDP= 1
##$COROFFS= 0
##$CY= 11.3945322036743
##$DATMOD= 1
##$DC= 2
##$DFILT= <>
##$DTYPP= 0
##$F1P= 2.36226072786647
##$F2P= -0.459571619588291
##$FCOR= 0.5
##$FTSIZE= 0
##$FT_mod= 4
##$GAMMA= 1
##$GB= 0.15
##$INTBC= 1
##$INTSCL= 1
##$ISEN= 128
##$LB= 0.24
##$LEV0= 0
##$LPBIN= 0
##$MAXI= 10000
##$MC2= 0
##$MEAN= 0
##$ME_mod= 0
##$MI= 1.114404
##$NCOEF= 0
##$NC_proc= 0
##$NLEV= 6
##$NOISF1= 3.799351
##$NOISF2= 2.8
##$NSP= 1
##$NTH_PI= 0
##$NZP= 0
##$OFFSET= 15.70392
##$PC= 1
##$PHC0= -18068.04
##$PHC1= 26.60069
##$PH_mod= 1
##$PKNL= yes
##$PPARMOD= 0
##$PSCAL= 0
##$PSIGN= 0
##$REVERSE= no
##$SF= 200.130013532006
##$SI= 16384
##$SIGF1= 3
##$SIGF2= 2
##$SINO= 400
##$SIOLD= 16384
##$SREGLST= <1H.CDCl3>
##$SSB= 0
##$STSI= 0
##$STSR= 0
##$SW_p= 3612.71676300578
##$SYMM= 0
##$S_DEV= 0
##$TDeff= 0
##$TDoff= 0
##$TI= <>
##$TILT= no
##$TM1= 0
##$TM2= 0
##$TOPLEV= 0
##$USERP1= <user>
##$USERP2= <user>
##$USERP3= <user>
##$USERP4= <user>
##$USERP5= <user>
##$WDW= 1
##$XDIM= 8192
##$YMAX_p= 0
##$YMIN_p= 0
$$ End of Bruker specific parameters
$$ ---------------------------------
##NTUPLES= NMR FID
##VAR_NAME=  TIME,          FID/REAL,        FID/IMAG
##SYMBOL=    X,             R,               I
##VAR_TYPE=  INDEPENDENT,   DEPENDENT,       DEPENDENT
##VAR_FORM=  AFFN,          ASDF,            ASDF
##VAR_DIM=   8192,          8192,            8192
##UNITS=     SECONDS,       ARBITRARY UNITS, ARBITRARY UNITS
##FACTOR=    0.0002768,     1,               1
##FIRST=     0,             0,               0
##LAST=      2.2672688,     0,               0
##MIN=       0,             -370417,         0
##MAX=       2.2672688,     299582,          0
$$ Real data points
##PAGE= N=1
##DATA TABLE= (X++(R..R)), XYDATA
0 0 0 0 0 0 0 0 0 0 0 0 0 0 -8 8 -8 8 -16 16 -22 24 -32 32 -40 48 -56 70 -80 93 -108 125 -141 161 -184 209
34 209 -236 268 -300 333 -376 419 -466 519 -577 637 -706 780 -860 948 -1047 1151 -1270 1399
52 1399 -1540 1699 -1878 2077 -2303 2562 -2862 3212 -3631 4139 -4772 5588 -6684 8234 -10616
67 -10616 14781 -24095 91501 -165849 -345913 -16559 152782 198246 55340 -196641 -180933
78 -180933 157842 179753 -57378 -105236 -45227 -42721 111880 182079 -55737 -216896 -83097
89 -83097 47547 148168 182434 -73924 -316056 -74796 246380 161414 -72788 -162394 -111710
100 -111710 117766 251910 -26823 -290978 -85934 189679 169712 33353 -113048 -201551
110 -201551 -25109 203396 119243 -57862 -74535 -84205 -44195 133147 129865 -106761 -158891
121 -158891 11550 118237 113922 -14412 -222730 -155109 194738 265682 -35418 -222253 -138799
132 -138799 45168 201749 128803 -140346 -181661 51717 138946 30613 -36313 -74509 -68221
143 -68221 76820 145379 -2698 -115878 -88430 -28455 96263 181057 -341 -221108 -123904
154 -123904 107636 158336 48783 -112962 -172322 23613 213207 62331 -173527 -132687
164 -132687 49332 141962 109235 -54117 -184448 -62738 130747 116914 8258 -49252 -97041
175 -97041 -54245 98119 117716 -31182 -106304 -52877 38693 121246 60433 -142864 -166777
186 -166777 66819 194110 62639 -111972 -164758 -47066 152772 157432 -61539 -160605 -31064
197 -31064 81692 78516 19638 -73321 -89831 36884 113108 34336 -49742 -77989 -62552 52719
209 52719 152470 43494 -133284 -125405 17310 122646 106189 -49916 -170854 -46551 146975
220 146975 107936 -68468 -129326 -47519 84175 135451 7101 -144227 -92205 60790 102596
231 102596 51134 -24720 -98307 -62666 68252 103368 12303 -65392 -75158 -9148 102355 93728
243 93728 -71263 -143947 -12460 120461 103196 -23750 -142597 -99576 87908 153699 6268
254 6268 -120227 -82287 22674 92096 64552 -53250 -104478 -7538 82294 61336 -2877 -66451
266 -66451 -81340 17881 121427 66798 -67989 -109139 -35007 80731 123392 4574 -137917
277 -137917 -85499 78611 117127 12390 -94812 -98593 20274 126166 58456 -88667 -105164
288 -105164 -3516 75438 79495 4458 -91618 -76678 37568 90755 40371 -36917 -82741 -38750
300 -38750 77345 103991 -17271 -110330 -56410 57567 108753 38209 -97486 -117629 25614
311 25614 126982 56319 -65770 -101443 -31509 76355 94451 -15725 -101117 -50354 44297
322 44297 75410 36014 -50236 -93511 -14266 90181 77670 -20819 -87444 -63215 40745 115246
334 115246 41538 -92420 -95911 20447 98636 63492 -44494 -108420 -33591 90701 88138
345 88138 -25924 -92650 -53909 34446 89769 39260 -69782 -89034 688 74676 62627 -11313
357 -11313 -83300 -60997 49429 100278 20427 -75782 -76507 7932 92336 73342 -46946 -108771
369 -108771 -24002 83310 82298 -7275 -87577 -70257 38128 100845 29263 -72971 -78459 -2266
381 -2266 70676 68633 -22138 -94628 -45940 56500 81596 15253 -65520 -77849 6018 93656
393 93656 61336 -48470 -87792 -21681 64800 82496 2715 -87922 -64795 43240 90011 27842
405 27842 -58528 -79685 -9847 79349 70178 -32813 -90110 -37643 49315 78643 17815 -73983
417 -73983 -78769 18898 88260 44800 -44959 -80304 -26247 65540 82746 -6887 -84088 -51760
429 -51760 37772 81088 36456 -53644 -83707 -5266 81673 63206 -27676 -80757 -43704 46630
441 46630 86414 14048 -79968 -69893 21420 78872 44114 -43281 -84902 -22002 69879 69449
453 69449 -14788 -72267 -47277 29849 77967 33826 -55054 -72416 576 69084 59279 -16501
465 -16501 -78782 -46562 51777 86686 11289 -73724 -69032 14914 83644 51026 -50965 -89348
477 -89348 -13999 69999 62420 -15966 -74518 -47663 38044 76794 18238 -57134 -60847 727
489 727 62393 58672 -16320 -75698 -40076 45567 75766 19660 -59727 -70839 9449 84565 49410
502 49410 -49707 -81890 -13891 67951 67568 -17752 -84538 -45743 46962 73913 12145 -56175
514 -56175 -61104 430 62001 48831 -22825 -63289 -29689 36636 65054 19410 -56812 -66014
526 -66014 13898 80863 49246 -41349 -83993 -24520 71138 79788 -14230 -86018 -46517 43490
538 43490 72802 14008 -59998 -59827 13536 64169 32137 -33286 -57575 -22364 38754 60849
550 60849 11801 -54649 -58309 5840 65848 53683 -24450 -77288 -30163 60818 72812 -8115
562 -8115 -75678 -46058 44181 81778 13570 -73489 -65242 21850 74295 36951 -37212 -66774
574 -66774 -22492 43173 53064 2874 -44808 -43530 3797 50485 39365 -25983 -65229 -20425
586 -20425 55413 67858 -3100 -77418 -57904 40943 91900 26669 -67124 -71275 10326 72347
598 72347 42825 -36713 -63972 -8568 50007 40518 -13676 -49489 -32746 19866 52520 27069
610 27069 -31831 -59716 -24738 41643 67106 11822 -64532 -59993 23046 75665 30916 -52581
622 -52581 -66630 10339 78450 43263 -49238 -76097 -6183 66884 58092 -14400 -65493 -39566
634 -39566 24743 52144 21764 -24783 -44129 -18613 28556 43583 2461 -47609 -40782 20844
646 20844 64901 28485 -54519 -75855 3440 83473 59846 -35614 -82873 -25947 58431 65386
658 65386 -7716 -60385 -29067 33106 46211 4534 -38975 -36608 6441 43090 33199 -12524
670 -12524 -50797 -40450 16581 63607 37565 -39549 -71876 -15577 59254 57751 -19350 -71134
682 -71134 -24995 57466 61836 -17240 -72398 -33250 47968 70037 10400 -56209 -52314 7375
694 7375 48241 35623 -6814 -37783 -30516 8453 37870 21600 -24296 -45057 -8505 47185
706 47185 46023 -23718 -74690 -30601 58044 77138 110 -77194 -57914 31377 75145 23233
718 23233 -47543 -47409 10817 46645 22597 -25496 -38510 -5205 32654 35797 3130 -36656 -43425
731 -43425 -3724 48747 50015 -10196 -64702 -43401 30172 66432 15615 -56453 -51265 22927
743 22927 64627 16209 -55218 -53914 18452 68209 33927 -37868 -58680 -12761 39778 44516
755 44516 7852 -29655 -34297 -5104 28817 31465 -3113 -36825 -26465 23706 49473 4786
767 4786 -56648 -50909 23789 74540 31852 -55046 -75182 -2738 67103 49467 -25238 -57363
779 -57363 -16135 38027 37344 -7404 -36875 -18022 20394 35754 14598 -22025 -40044 -16705
791 -16705 32105 52285 13205 -46155 -56310 1340 59625 42038 -30549 -62635 -10925 51981
803 51981 41886 -27693 -60662 -13393 52173 50312 -13739 -56898 -31623 24475 48649 21905
815 21905 -21218 -37227 -15191 20270 34904 12636 -25406 -34847 3555 43815 27637 -31301
827 -31301 -55994 -7338 57963 52571 -23003 -73849 -33255 45674 63249 2806 -53709 -40028
839 -40028 18442 45037 12805 -29060 -29706 4171 30894 23776 -8537 -33486 -24624 14772 44930
852 44930 27915 -24341 -54426 -20036 42768 54724 -2938 -56179 -35321 30556 53655 3094
864 3094 -52459 -38037 26723 55415 11944 -44638 -46143 3957 44752 33197 -10161 -37702
876 -37702 -24674 10984 34292 22183 -14544 -35265 -11891 30963 37762 -5885 -47097 -28736
888 -28736 32781 57857 7845 -55509 -50715 16950 60918 28277 -36490 -52155 -5332 40567
900 40567 30417 -14310 -36085 -14113 21226 29715 5076 -25838 -29965 -104 34318 34250 -5524
913 -5524 -44533 -32385 22748 53863 19262 -39487 -47351 6062 51177 28483 -31816 -49177
925 -49177 -1524 46923 33175 -21720 -49165 -18090 30887 40545 4407 -33120 -33085 47 31106
938 31106 28288 -5519 -33815 -22687 17703 39259 12335 -32745 -38386 8304 49742 29577
950 29577 -29845 -52627 -8879 46311 43661 -12164 -50043 -25060 26779 40558 4779 -32670
962 -32670 -29340 6698 31683 18403 -15937 -33051 -13778 22384 35410 7670 -32875 -37390
974 -37390 4941 44487 31518 -20937 -47474 -13493 38796 42176 -8073 -46366 -23817 28742
986 28742 43558 4139 -39264 -34009 11300 40062 20853 -20780 -37418 -13327 23848 32527
998 32527 4329 -29643 -30343 4740 35219 23641 -18496 -39970 -10604 34913 38560 -6271 -44093
1011 -44093 -25805 25721 46501 10138 -37111 -36843 8491 40524 22598 -20500 -37027 -9684
1023 -9684 27177 29973 -2507 -32693 -25260 10599 34647 17916 -22118 -38244 -8430 32162
1035 32162 35328 -5109 -40567 -25827 21974 42620 11097 -34013 -34945 8439 40554 23809
1047 23809 -21076 -38543 -8134 31327 32256 -3138 -34046 -23640 12841 33709 15486 -21509
1059 -21509 -33441 -6880 28276 29443 -5207 -36179 -21777 19016 37474 9704 -30672 -33323
1071 -33323 5038 38867 24989 -18535 -37062 -9709 30026 32948 -1839 -33786 -23369 14880
1083 14880 35583 13310 -24357 -32939 -2789 30329 27480 -9871 -36302 -19785 19724 35307
1095 35307 7464 -30347 -31874 4701 35527 22749 -17675 -36318 -10465 28296 33431 -1184
1107 -1184 -33631 -24330 14606 36741 14871 -24024 -33343 -2106 32178 27539 -10593 -35650 -18106
1120 -18106 20942 34051 4853 -30614 -29741 6298 33749 19556 -18414 -34870 -9906 26764
1132 26764 30832 -2240 -32589 -23546 13747 35706 15419 -23283 -33098 -1980 32642 28276 -10382
1145 -10382 -35908 -16766 23084 34821 3508 -31188 -27775 8030 33929 17696 -19133 -31614
1157 -31614 -7810 25237 27840 -3249 -29806 -21764 12080 31609 13573 -21320 -31173 -3141
1169 -3141 30361 27963 -8666 -35345 -17693 22931 36501 5391 -31481 -28734 9585 35757
1181 35757 17304 -21270 -32605 -4586 27339 25159 -7085 -30139 -18449 13912 29418 10236
1193 10236 -21489 -29371 -3535 27514 26559 -6890 -32957 -18992 19311 35238 6914 -29384
1205 -29384 -28743 9338 36643 18098 -22222 -33756 -3419 30392 26837 -8330 -31516 -17239
1217 -17239 15157 27688 7996 -20055 -24791 -1996 23213 20321 -6776 -28360 -15804 16940
1229 16940 31737 6903 -29221 -29095 7612 37477 21361 -21040 -35846 -5093 31662 28402
1241 28402 -8361 -31782 -14174 19297 27558 2856 -23528 -21469 4197 24439 17106 -10025
1253 -10025 -27605 -15574 15005 29602 9040 -24464 -29651 1654 32049 22238 -16292 -34411
1265 -34411 -7050 30146 28704 -9520 -34850 -14988 23741 32877 2994 -27907 -23987 6248
1277 6248 26654 16239 -10104 -23486 -11037 12883 21653 5067 -19804 -22860 2907 27759
1289 27759 18448 -17176 -35247 -9099 30398 32939 -6096 -37124 -21710 20682 34808 5989
1301 5989 -26027 -22872 9178 27249 11197 -15642 -21369 -2992 18706 19503 -1224 -21167 -20387
1314 -20387 3863 25127 19582 -11533 -32003 -13759 20225 29936 272 -30849 -21284 16765
1326 16765 32194 3970 -30047 -25968 12622 34712 14200 -21042 -29198 -2972 23124 22075
1338 22075 -1472 -19746 -15795 3766 18465 13473 -8254 -21205 -8566 17795 23981 -2656
1350 -2656 -30716 -22154 16711 37216 10462 -31048 -34165 4588 35227 20560 -17182 -29329
1362 -29329 -3891 22786 18559 -7043 -20732 -8048 13568 19858 5443 -14654 -20616 -4716
1374 -4716 19205 24603 1698 -26624 -25365 7155 31742 15842 -21209 -30574 425 30480 18053
1387 18053 -19633 -32254 -1942 30980 24167 -11994 -31662 -13572 17688 25983 7166 -15256
1399 -15256 -18799 -3793 13632 16984 1935 -16060 -15425 6274 23082 10238 -19925 -28067 1307
1412 1307 32780 23857 -17744 -38748 -12161 28091 31290 -3890 -30634 -17526 14490 23440 2413
1425 2413 -18109 -13848 6805 18367 9755 -8878 -18743 -9248 11906 24303 11209 -17283 -28261
1438 -28261 -5648 25983 26541 -6616 -31196 -14500 20856 26968 -4696 -31063 -16026 20501
1450 20501 29939 724 -28636 -23025 7980 26331 14305 -9769 -20437 -10013 8403 17375
1462 17375 8929 -9298 -16748 -3457 16964 17767 -6799 -25826 -11191 22205 30292 -1412 -34128
1475 -34128 -24832 15091 35294 10917 -24897 -27041 2757 23881 12288 -12622 -19033 -1595
1487 -1595 15155 13563 -3190 -16285 -12656 4926 20310 16020 -7580 -25782 -14893 16004 29712
1500 29712 7343 -24347 -24341 7720 29209 10816 -22130 -24545 6137 28824 13568 -19229 -27428
1513 -27428 -3456 22336 20372 -2745 -20018 -15323 2930 16217 12749 -3913 -16117 -9985 9929
1526 9929 19523 3735 -19491 -18346 9601 29356 12233 -23145 -30320 1105 31538 22555 -13661
1539 -13661 -30333 -9292 19775 20596 -3579 -19852 -10570 9719 15643 3100 -12634 -15201 -1844
1552 -1844 14826 17456 721 -20290 -19440 5462 26895 16916 -14044 -27676 -5423 24234 21371
1565 21371 -9347 -26460 -7779 21634 22407 -5904 -26255 -13829 13908 23289 5660 -16316
1577 -16316 -19164 -2961 13896 15155 569 -14586 -14179 3064 17775 10797 -11613 -20878 -2145
1590 -2145 22707 20202 -9467 -28716 -11562 22050 28441 147 -26454 -19142 10830 24502 7483
1603 7483 -15825 -17496 1374 15964 10464 -6544 -15863 -8357 8879 16889 6519 -13665 -20842
1616 -20842 -3727 19698 20919 -4071 -24962 -14752 14612 25296 3366 -22325 -17819 10379
1628 10379 25145 7404 -18880 -20597 3245 22034 14016 -8968 -20143 -8886 10588 17308
1640 17308 5096 -12484 -16541 -2492 14984 14568 -4495 -19930 -10846 13307 22347 2035 -22273
1653 -22273 -19030 9237 26953 11492 -17639 -23609 -330 21962 16463 -7668 -19864 -7642
1665 -7642 12333 16198 1451 -14290 -13456 2216 15662 11331 -7180 -19484 -10071 12192 20665
1678 20665 3912 -19227 -19643 4629 23317 12134 -14144 -22277 -1383 21208 16678 -8341 -21770
1691 -21770 -7500 15884 19388 666 -17671 -14629 4766 17783 10727 -8194 -17526 -7497 11479
1704 11479 16830 1860 -16896 -16138 4797 20177 10230 -13777 -21886 -2400 20323 17791 -6893
1717 -6893 -22583 -10131 14123 20743 2576 -17166 -14879 5236 18315 9888 -9127 -16657 -4432
1730 -4432 13204 15611 -102 -16714 -13997 5538 18962 9309 -12566 -20235 -3270 17766 16631
1743 16631 -5375 -21383 -10330 13031 20086 2266 -17886 -15635 5591 19619 10177 -10810
1755 -10810 -18133 -3704 15153 16156 -1194 -16772 -12200 6897 18169 7874 -12035 -18134 -2574
1768 -2574 16261 15153 -5424 -20007 -10465 11472 19128 2928 -17048 -16218 4343 19141 10679
1781 10679 -10524 -18395 -3854 15317 16097 -1896 -16984 -11204 8401 18295 6629 -12821 -16669
1794 -16669 -276 16854 13640 -6127 -18638 -8792 11725 17725 2090 -16437 -15193 3887 18056
1807 18056 10013 -10468 -18338 -4307 14637 15941 -1671 -17573 -11769 8519 18713 6501 -13298
1820 -13298 -16608 452 17488 13396 -6187 -17939 -7509 11976 17041 1480 -15668 -13965 4042
1833 4042 16839 9383 -9793 -17487 -4468 13517 15177 -1930 -17238 -11862 7976 18150 6482
1846 6482 -13540 -16621 751 17704 13241 -7364 -18341 -6370 13310 17158 410 -16019 -12614
1859 -12614 5797 16917 8012 -10018 -15946 -3271 12685 13844 -1899 -15929 -11457 6645 17084
1872 17084 6598 -12827 -17117 -795 17254 13715 -6976 -18839 -7421 13456 17661 339
1884 339 -16356 -12226 6832 16975 6641 -10936 -14582 -824 13584 12236 -3071 -14948 -9843
1897 -9843 6798 15701 6004 -11802 -16360 -1313 15526 13359 -5823 -18734 -8101 12853 17677
1910 17677 -120 -17221 -13015 7942 18461 6392 -12542 -15575 -418 14919 12341 -3684
1922 -3684 -13807 -8175 6554 13557 5221 -10037 -13700 -1229 13886 12176 -5370 -17968 -9080
1935 -9080 11643 18422 1393 -17904 -15243 6244 19284 7956 -12545 -16039 154 15333 11248
1948 11248 -5861 -14258 -5241 9768 13192 1970 -11063 -11829 434 13292 11744 -3946 -16228
1961 -16228 -9594 8981 17140 3307 -15061 -15061 4117 18165 8125 -13211 -17532 483 17763
1974 17763 12493 -7672 -17346 -6077 11271 14526 2003 -11068 -10591 1243 11154 8866 -3197
1987 -3197 -12054 -6696 7795 14061 2652 -13991 -14305 4213 18635 9500 -12775 -20153 -2523
2000 -2523 17441 15034 -6254 -18039 -7011 11445 13751 -780 -12741 -8601 5418 12219 5507
2013 5507 -6796 -11557 -3793 9282 13632 3021 -11792 -14154 889 15874 11834 -7701 -17770
2026 -17770 -4919 14566 14358 -5323 -18361 -7681 13185 16709 -1411 -17209 -11467 6504 15361
2039 15361 6431 -8057 -11976 -3450 7787 10426 1972 -8012 -8956 1449 11797 8250 -6916 -15306
2053 -15306 -3450 14799 15568 -4193 -20082 -11335 11695 19482 2619 -16434 -13853 4945 15094
2066 15094 5097 -9888 -11203 702 10565 7719 -3514 -10323 -6646 4805 12211 7604 -6340
2079 -6340 -14627 -5929 11324 16107 805 -15639 -12028 7769 17141 3265 -15243 -13412 6508
2092 6508 17562 5475 -13501 -15764 724 14444 10582 -4522 -12642 -7076 4312 9916 5278
2105 5278 -4446 -9397 -3537 7732 10662 -185 -12541 -9194 8105 17585 4478 -15709 -16788
2118 -16788 3443 19642 11011 -10640 -17801 -2781 13515 10944 -4487 -12289 -4432 7605 9016
2131 9016 -43 -8824 -7944 683 9691 9334 -1617 -12180 -10141 5295 16269 8265 -10281 -15809
2145 -15809 -693 15592 11004 -8249 -16080 -1736 15116 12052 -7056 -16856 -5468 11430 13460
2158 13460 533 -11773 -10047 747 8927 7291 -1370 -8698 -6930 2772 10179 4850 -7787 -11406
2172 -11406 484 14483 10720 -8113 -18289 -4721 15476 16780 -2576 -17792 -9860 8881
2184 8881 14568 1810 -11129 -8664 3415 9676 3614 -6130 -8884 -2026 6637 9182 1799 -9397
2198 -9397 -11738 -372 12937 12057 -4026 -15799 -7541 10731 15081 -400 -14844 -8567 9346
2211 9346 15203 1072 -14470 -10979 5831 14709 5939 -8398 -12009 -3086 7427 9242 1882 -7152
2225 -7152 -8620 -923 8055 7780 -3027 -11539 -5283 9188 13380 -530 -15421 -10906 8596 17779
2239 17779 5043 -13713 -14412 2648 15196 8228 -7160 -11610 -1499 8770 7509 -2436 -9095
2252 -9095 -5060 3721 9043 4811 -5735 -11251 -4689 8137 12868 1574 -12978 -12120 4175 15207
2266 15207 6732 -10400 -13271 1769 14481 8114 -8887 -13432 -1136 12624 10722 -3254 -11848
2279 -11848 -6804 4848 10079 4731 -5332 -9339 -3714 6045 9237 1003 -9463 -8841 3614 12566
2293 12566 5350 -10716 -13650 644 15034 10569 -7158 -15861 -4197 11753 12502 -1547 -11672
2306 -11672 -6498 5903 10139 2681 -6910 -7771 354 7903 7168 -1902 -9790 -7570 4111 11957 5750
2321 5750 -8369 -13515 -1924 12110 10787 -4655 -13976 -5207 10160 11975 -1368 -13001 -7810
2334 -7810 7114 12768 2687 -9645 -9658 789 10095 7706 -1922 -9257 -6094 3870 9685 4463
2348 4463 -6638 -10144 -849 10030 8596 -4612 -13263 -5616 9958 12822 -578 -13627 -9726
2361 -9726 6030 13507 4281 -9206 -10534 899 10410 7315 -3778 -9138 -3806 6166 9403 2066
2375 2066 -7318 -8836 212 10226 8517 -3585 -12383 -6245 7704 12219 1384 -11783 -10121 4451
2389 4451 12579 4643 -9173 -11462 619 11433 7894 -4536 -11215 -4098 7339 10041 1482 -7941
2403 -7941 -8166 1337 9518 7051 -3606 -10265 -4481 7084 10811 676 -10866 -9117 3901 12297
2417 12297 4773 -8952 -11843 -625 11204 8733 -4315 -11629 -5000 7255 10296 1154 -8672
2430 -8672 -7987 2185 9627 6010 -4500 -9903 -3381 7579 9868 485 -10059 -8413 3493 11389
2444 11389 5306 -7735 -11310 -1088 10173 8673 -3961 -11638 -5192 7251 10368 652 -9629
2457 -9629 -8322 2543 10085 5562 -5508 -9852 -2478 7814 9341 -233 -9223 -7042 3975 10555
2471 10555 4509 -7073 -10253 -753 9826 8559 -3273 -10996 -5280 6436 10415 1074 -9504
2484 -9504 -8945 2139 10386 5776 -5539 -10383 -2663 8144 9042 -733 -9692 -6699 4361 10459
2498 10459 4051 -7329 -9290 -157 9620 7853 -3056 -10198 -4899 6390 9938 1408 -8692 -8627
2512 -8627 1978 9917 5506 -5721 -10440 -2853 7913 9257 -1019 -10277 -7027 4665 10513 3626
2526 3626 -7641 -9420 247 9464 7329 -3425 -9787 -4048 6559 9520 1507 -8508 -8016 1891
2540 1891 9601 5627 -5130 -10108 -2920 7592 9034 -877 -10276 -7050 4210 10382 3387 -8055
2554 -8055 -9715 793 9974 7074 -4348 -10430 -3446 7193 9052 686 -8068 -6915 2577 9068
2568 9068 5118 -4802 -8941 -2325 7147 8568 -570 -9508 -7221 3945 10567 3816 -7896 -10238
2582 -10238 -128 10053 7479 -4314 -10643 -3804 7501 9232 -53 -8622 -6172 3557 9079 4174
2596 4174 -5147 -8024 -1627 6988 8016 -259 -8662 -6791 3510 9771 4496 -6930 -9957 -535
2610 -535 9686 7592 -4571 -10951 -3722 7960 9399 -1083 -10020 -6655 4049 9643 3497 -5807
2624 -5807 -7930 -1091 6916 7041 -536 -7389 -5130 3023 8827 4103 -6191 -9249 -928 9428 8213
2639 8213 -3655 -11391 -5238 7652 10678 268 -10250 -7720 3669 9769 3074 -6638 -7755 243
2653 243 7503 5712 -2449 -7455 -4187 4119 8168 3340 -5318 -8273 -1228 7958 8382 -1794 -9995
2668 -9995 -5356 6131 10377 846 -9930 -7850 4393 10777 3185 -8451 -9469 589 9104 6378
2682 6378 -3257 -8425 -4056 4145 6880 2223 -4746 -6435 -528 6392 6560 -1780 -8705 -4514 6169
2697 6169 10397 1557 -9770 -9069 3201 11752 5298 -7520 -10468 -370 8917 6336 -3509 -8390
2711 -8390 -2627 5662 6483 -230 -6389 -5379 1384 6606 5137 -2478 -8005 -4988 4473 9406 3137
2726 3137 -7217 -8786 1272 10482 5942 -6323 -10086 -90 9971 7373 -4917 -10893 -3383 7545
2740 7545 8547 -370 -7822 -6336 1398 6453 4376 -2219 -6095 -3731 3226 6669 2071 -6035 -7172
2755 -7172 1622 9545 5883 -5830 -11048 -1963 10059 9707 -2747 -11019 -5231 6723 8980 208
2769 208 -7709 -5551 3178 6668 2052 -4628 -5838 -977 4852 5897 437 -6514 -6898 449 8668
2784 8668 6852 -3325 -10157 -4158 7727 9348 -987 -9971 -5328 6911 9924 -71 -9720 -6801
2798 -6801 4197 9724 3281 -6267 -7841 -1350 5436 5446 205 -5008 -4723 399 5417 4051 -2744
2813 -2744 -7425 -2571 6387 8015 -1348 -10267 -6146 6146 11663 2400 -9576 -9039 2578 10144
2827 10144 4741 -5167 -7428 99 6298 4401 -2418 -5970 -2808 3174 5707 2218 -4102 -7210 -2771
2842 -2771 5726 8133 748 -8583 -7595 3276 10053 3974 -7282 -8370 1896 9848 4511 -6719
2856 -6719 -9149 406 9072 6543 -3276 -8157 -3804 4178 6433 2440 -3571 -5324 -1943 3788 5289
2871 5289 106 -6014 -5422 2702 8185 2889 -7224 -9101 1003 10777 6845 -5525 -10872 -2218
2885 -2218 8604 8439 -1743 -8186 -3719 4488 6376 496 -5068 -4074 1197 5617 3736 -1988 -6589
2900 -6589 -4398 2777 7892 3929 -5689 -9115 -1075 8175 7494 -3511 -9430 -2796 7718 7811 -2487
2915 -2487 -9023 -3739 6583 8608 154 -7390 -6035 1892 6883 4419 -1921 -5696 -3143 2098 5337
2930 5337 2507 -3916 -6163 -1039 6242 5832 -3451 -9284 -3377 7319 9054 -1037 -10222 -6628 4995
2945 4995 9624 2321 -6847 -6837 1530 6724 3691 -3316 -5228 -1119 4442 5125 217 -4971 -5221 315
2961 315 6621 5493 -2602 -8655 -4487 5418 8574 738 -8209 -6605 3541 9015 2170 -7177 -6982
2976 -6982 2136 8588 4286 -4686 -7422 -1356 5739 6159 255 -5186 -4518 485 5159 4457 -1834 -6115
2992 -6115 -3158 4503 6862 532 -7485 -6370 3335 9009 3248 -7482 -9082 418 8752 5880 -4070
3007 -4070 -8041 -2452 5417 5896 -722 -5638 -3401 2294 5545 2515 -3189 -5640 -1659 4836 6532
3022 6532 363 -6670 -6042 1998 7989 4090 -5530 -8253 -581 7669 5711 -3568 -8335 -2428 6383
3037 6383 6899 -1131 -7486 -4410 2978 6728 2661 -3696 -5827 -1288 4622 5358 321 -5611 -4728 2124
3053 2124 6713 3319 -4795 -7235 -349 7158 6067 -3265 -8512 -3348 5740 7426 -403 -7544 -5289
3068 -5289 2853 6932 2342 -4396 -5548 -295 5087 4561 -915 -5344 -3755 2676 6346 2842 -4315
3083 -4315 -6648 -506 6737 5984 -2199 -7769 -3685 4979 7512 315 -7221 -5397 2846 7429 2562
3098 2562 -5229 -6669 -183 5802 4855 -1462 -6308 -3661 3137 6026 2171 -4361 -5820 -463 6013
3113 6013 5082 -1775 -6787 -3029 4792 6827 741 -6647 -5670 2463 7419 3241 -4966 -6912 -604
3128 -604 5977 4806 -1756 -6379 -3359 3488 6017 1365 -4887 -5218 436 5828 4547 -2042 -6440
3143 -6440 -2875 4440 7074 975 -6018 -5396 2016 7103 3581 -4311 -6658 -964 5789 5299 -1889
3158 -1889 -6586 -3404 3628 6248 1053 -5393 -5337 682 5992 4065 -2846 -6197 -2406 4299 6053
3173 6053 539 -5641 -4798 2117 6684 3262 -4344 -6296 -772 5773 5440 -1738 -6537 -3599 3815
3188 3815 6450 1548 -5265 -5560 725 6073 4159 -3072 -6444 -2328 4569 5865 -14 -5974 -4793
3203 -4793 2304 6450 2818 -3901 -6070 -812 5470 5156 -1025 -6036 -3582 3452 6078 1834 -4853
3218 -4853 -5420 773 5979 3996 -2572 -6338 -2248 4756 5707 -276 -6306 -4354 2436 6237 2396
3233 2396 -4616 -5892 -155 5547 4726 -1601 -5683 -3235 3346 6123 1553 -4630 -5400 671 6221
3248 6221 4238 -2515 -6698 -2576 4584 6013 -31 -6198 -4881 2435 6533 2268 -4837 -6060 -231
3263 -231 5626 4445 -1963 -5855 -2570 3526 5439 1253 -4299 -4742 207 5530 3876 -2155 -5789
3278 -5789 -2270 4361 5946 316 -6111 -5113 2289 6814 2854 -4594 -6069 -251 5677 4175 -2218
3293 -2218 -6063 -2346 3647 5224 591 -4678 -4306 813 5191 3610 -2360 -5505 -2357 3884 6008
3308 6008 640 -5080 -4954 1680 6238 3407 -4466 -6092 -156 5836 4753 -2610 -6709 -2504 4361
3323 4361 5378 192 -5180 -4127 1086 4654 2908 -2368 -4897 -1877 3129 4780 460 -4482 -4328
3338 -4328 1613 6168 3408 -4012 -6589 -738 5944 5680 -1957 -6987 -3242 4324 6019 41 -5313
3353 -5313 -4098 1901 5023 1928 -3435 -4567 -882 3708 4050 82 -4418 -4420 1285 5495 3330 -2645
3369 -2645 -5844 -1569 5252 5556 -1111 -6324 -3121 4488 6226 83 -5865 -4340 2418 6204 2317
3384 2317 -3712 -5282 -612 3928 3944 -502 -3933 -3199 1249 4333 2493 -2328 -4897 -1264 4646 5434
3400 5434 -874 -6435 -3971 3987 7101 1398 -6044 -5606 1780 6618 3047 -3710 -5291 -304 4476
3415 4476 3271 -1618 -4407 -2219 2239 3900 1341 -2939 -4570 -1251 3963 4955 -57 -5478 -4118
3430 -4118 2549 6354 1889 -4764 -5217 1508 6648 3146 -4110 -5897 32 5897 4209 -1974 -5392
3445 -5392 -2504 2627 4124 1182 -2810 -3572 -793 2898 3425 -97 -4207 -3549 1966 5402 1716 -4833
3461 -4833 -5782 791 6884 4223 -3597 -6981 -1158 5635 5014 -1439 -5703 -2181 3359 4434 318
3476 318 -3578 -2747 835 3449 2343 -1403 -4316 -2741 2017 4752 2323 -3899 -5570 -456 5591
3491 5591 4521 -2375 -6002 -1954 5270 5212 -1507 -6287 -2685 4139 5557 192 -4940 -3780 1358
3506 1358 4487 2629 -1408 -3630 -1776 1367 3389 1378 -2603 -3993 -435 4225 3637 -2108 -6141
3521 -6141 -2058 4899 5723 -787 -6528 -3957 3441 6297 1222 -4537 -4117 1537 4412 2040 -2560
3536 -2560 -3433 -604 2975 3198 178 -3024 -3447 197 4216 3527 -1381 -5389 -2983 3441 5633 596
3552 596 -5381 -4635 2811 5908 1160 -5055 -4771 1817 5958 2544 -3671 -5020 -697 3742 3734 2
3568 2 -3215 -2464 581 3102 2622 -1000 -3410 -2181 2388 4224 401 -4892 -4261 1995 6069 2382
3584 2382 -4813 -5771 435 5911 3899 -2812 -5261 -1042 3925 3711 -874 -3848 -1718 1844 3547
3599 3547 1486 -1990 -3409 -1154 2983 4215 413 -4148 -4364 1108 5427 3082 -3341 -5573 -477
3614 -477 5046 3817 -2513 -5626 -1125 4506 4397 -1609 -5359 -2637 2480 4300 1151 -2318 -3173 -653
3630 -653 2495 3184 486 -2953 -2866 809 4040 2070 -2688 -4835 -309 5225 4309 -2259 -5941 -2209
3646 -2209 4141 5104 -409 -5414 -3368 2185 4475 1021 -2943 -3075 302 3215 2303 -888 -3402 -1848
3662 -1848 1593 3745 2344 -2762 -4583 -910 4418 4247 -1045 -5106 -2694 3046 4768 -98 -4921
3677 -4921 -3381 2332 4855 1201 -3915 -4072 648 3915 2612 -1546 -3384 -1652 1543 3276 1291
3692 1291 -1851 -3383 -529 3307 3323 -970 -4533 -2458 3144 4962 566 -4902 -4244 2080 5290 2178
3708 2178 -3688 -4512 -150 3921 2785 -1767 -3702 -1499 2277 2996 341 -2915 -2739 121 3219 2922
3724 2922 -1215 -4069 -2295 2446 4539 1197 -3954 -3759 1230 5092 2349 -3147 -4551 -129 4377
3739 4377 3180 -1838 -4491 -1678 2811 3656 218 -3447 -2924 553 3174 2479 -1133 -3452 -1695 2332
3755 2332 4147 835 -3186 -3338 1265 4419 2476 -2892 -4586 -431 4397 3612 -1411 -4902 -2321
3770 -2321 2795 4214 295 -3503 -2801 862 3464 1714 -1654 -3407 -1284 2363 3518 410 -3155
3785 -3155 -3139 964 4255 2463 -2201 -4279 -900 3845 3731 -1014 -4310 -2159 2770 4086 419 -3731
3801 -3731 -3196 881 3927 2029 -2202 -3696 -1007 2698 3122 258 -3213 -2872 938 3658 1943 -2019
3817 -2019 -3946 -649 3539 3616 -897 -4097 -2300 2733 4440 835 -3507 -3424 729 4055 2213 -1921
3833 -1921 -3682 -860 2918 3051 -245 -3370 -2606 1371 3570 1516 -2428 -3469 -721 3440 3260 -791
3849 -791 -3747 -2225 2077 4265 798 -3399 -3403 813 4180 2345 -2042 -3732 -1011 2870 3453 -87
3865 -87 -3833 -2603 1344 3366 1484 -2552 -3601 -154 3146 2708 -839 -3850 -1922 2219 3608 652
3881 652 -3041 -3263 522 3486 2380 -2017 -3820 -795 2769 3279 -61 -3333 -2398 1463 3615 1533
3897 1533 -2563 -3439 -117 3082 2638 -974 -3709 -1699 2325 3077 455 -3162 -2963 736 3523 1996
3913 1996 -1959 -3599 -952 2897 3238 9 -3244 -2168 1530 3700 1631 -2397 -3372 -233 3428
3928 3428 2797 -1299 -3498 -1735 2406 3453 120 -3277 -2963 776 3430 1673 -1933 -3328 -788
3943 -788 2483 2902 -194 -2919 -2335 1236 3682 1691 -2010 -3224 -437 3241 2865 -893 -3570 -1682
3959 -1682 2519 3907 260 -3124 -3022 1105 3363 1642 -2134 -3438 -695 2742 2647 -417 -3077 -2176
3975 -2176 1315 3251 1680 -2090 -3040 -347 3177 2906 -1094 -3523 -1873 2285 3676 953 -3294
3990 -3294 -3067 1059 3624 1913 -2508 -3363 -409 2847 2620 -713 -2884 -1758 1381 2639 1054 -2177
4006 -2177 -3032 -410 2603 2812 -729 -3471 -2233 2014 3633 823 -3203 -3079 749 3770 2081 -2417
4022 -2417 -3432 -174 3294 2714 -963 -3298 -1652 1750 2875 931 -2064 -2573 -38 2353 2161 -506
4038 -506 -2902 -1788 1563 3215 927 -2856 -3050 529 3606 2270 -2073 -3784 -576 3278 3010 -937
4054 -937 -3396 -1677 2021 2877 285 -2328 -2213 656 2558 1802 -995 -2856 -1445 1444 2981 1037
4070 1037 -2458 -2975 140 3206 2334 -1510 -3635 -934 3060 3060 -781 -3932 -1797 2322 3577 344
4086 344 -2613 -2457 893 2829 1543 -1054 -2391 -1090 1198 2343 764 -1928 -2427 -26 2712 2254
4102 2254 -1515 -3530 -1156 2934 3717 -613 -3860 -2221 2235 3832 822 -2988 -2624 1061 3213
4117 3213 1452 -1757 -2568 -399 1798 2060 50 -2100 -2145 93 2693 1956 -942 -3131 -1688 2016
4133 2016 3131 -106 -3293 -2540 1447 3732 758 -3120 -3077 1154 3627 1676 -1936 -3065 -453 2557
4149 2557 2544 -97 -2249 -1716 614 2180 1460 -929 -2314 -1202 1634 2639 15 -3250 -2594 1165
4165 1165 3672 1288 -2993 -3455 145 3810 2363 -1893 -3405 -704 2679 2083 -644 -2378 -1059
4180 -1059 1275 2291 557 -1438 -1896 -548 1767 2407 317 -2510 -2660 916 3284 1796 -2220 -3553
4196 -3553 -334 3338 2307 -1881 -3752 -672 2883 2631 -989 -3285 -1634 1749 2851 789 -1665
4211 -1665 -2045 -327 1393 1955 40 -1857 -1609 402 2496 1523 -1746 -3250 -349 3243 2933 -1334
4227 -1334 -3930 -1332 2818 3424 -184 -3428 -1943 1546 2707 432 -2117 -1775 553 1994 1239 -655
4243 -655 -1702 -1062 850 2464 1227 -1495 -2667 -771 2567 2872 -443 -3195 -1881 2141 3313 -233
4259 -233 -3105 -2033 1752 3251 560 -2909 -2718 564 2883 1692 -1102 -2154 -1067 1210 1987 871
4275 871 -1056 -1950 -426 1865 2190 -286 -2816 -1611 1932 3315 131 -3352 -2871 1277 3619 1403
4291 1403 -2418 -3163 506 2451 1665 -1346 -2274 -574 1479 1434 2 -1674 -1737 19 2001 1635 -452
4308 -452 -2331 -1506 1603 3157 1070 -2627 -2688 573 3590 1425 -2316 -3044 57 3208 2007 -1608
4324 -1608 -3017 -733 2171 2405 -338 -2281 -1678 452 1968 1372 -540 -2024 -933 1167 1971 751
4340 751 -1926 -2215 623 2876 1628 -1880 -3087 -393 2962 2457 -1382 -3075 -1358 2051 2331 37
4356 37 -2439 -1631 838 1951 709 -1426 -1797 -653 1511 1780 230 -1914 -1996 134 2926 1727 -1292
4373 -1292 -2939 -782 2715 2594 -549 -3127 -1316 2074 2640 -236 -2567 -2022 1058 2534 1116 -1688
4389 -1688 -2028 -365 1491 1923 198 -1662 -1610 362 2026 1629 -1079 -2421 -735 2405 2417 -659 -3214
4406 -3214 -1229 2032 3002 585 -2730 -2368 1146 2734 1183 -1558 -2253 -188 1701 1629 -451 -1603
4422 -1603 -939 647 2002 916 -1451 -2417 -598 1889 2189 -478 -2525 -1686 1429 2906 894 -2296
4438 -2296 -2509 772 2760 1217 -1534 -2381 -9 2384 1610 -733 -2447 -1412 1133 1632 973 -1409
4454 -1409 -1862 -465 1618 1801 -353 -2211 -1468 1367 2709 618 -2273 -2351 409 2943 1566 -1775
4470 -1775 -2818 -484 2220 2103 -462 -2405 -1284 1352 2198 751 -1543 -1752 -86 1953 1442 -614
4486 -614 -2253 -1263 1133 2274 692 -2033 -2278 69 2442 1676 -1540 -2400 -448 2309 2160 -395
4502 -395 -2306 -1050 1262 2239 411 -1880 -2110 202 1982 1406 -925 -2255 -1100 983 1991 412
4518 412 -1796 -2065 337 2388 1304 -1103 -2348 -680 2111 2436 -405 -2482 -1401 1254 2618 675
4534 675 -1840 -2040 376 2154 1765 -764 -2300 -563 1504 2228 262 -1791 -1550 494 2220 1268
4550 1268 -1234 -2391 -510 1757 2303 -378 -2094 -1615 1008 2138 689 -1855 -2143 168 2166 1678
4566 1678 -1070 -2103 -654 1594 2042 333 -1858 -1550 752 2228 1116 -1246 -2174 -542 1647 1936
4582 1936 -300 -2302 -1357 1171 2086 569 -1406 -1915 52 2176 1579 -919 -2284 -667 1490 2046
4598 2046 293 -1945 -1724 578 2368 1096 -1299 -1957 -436 1685 1684 -441 -2224 -1361 1204 1939 494
4615 494 -1785 -1953 203 2005 1552 -989 -2194 -937 1463 2166 113 -1982 -1762 440 2328 1319
4631 1319 -1372 -2164 -128 1884 1888 -681 -2194 -1277 1171 2138 464 -1543 -1693 90 1587 1341 -780
4648 -780 -2113 -953 1368 1881 204 -1744 -1729 445 2051 1246 -1212 -2272 -210 1771 1874 -654
4664 -654 -1964 -974 1328 2169 454 -1594 -1464 364 2067 1181 -1034 -1826 -443 1170 1883 159 -1640
4681 -1640 -1549 280 1921 922 -1035 -2068 -392 1858 1973 -609 -2280 -1075 1573 2107 386 -1956
4697 -1956 -1584 292 1926 1058 -1134 -1883 -522 1475 1723 -141 -1406 -1287 383 1728 859 -1036
4713 -1036 -1845 -781 1612 1813 -290 -2062 -1484 1234 2020 374 -2111 -1982 535 2028 1096 -1230
4729 -1230 -1991 -199 1551 1418 -492 -1615 -1240 617 1537 676 -1027 -1656 -384 1390 1582 -279 -1935
4746 -1935 -1301 1059 2332 463 -1891 -2031 259 2339 1118 -1566 -2029 -269 1753 1655 -226 -1889
4762 -1889 -716 942 1736 426 -1215 -1386 -252 1533 1421 54 -1745 -1243 775 2308 732 -1707
4778 -1707 -2233 107 2324 1437 -1203 -2251 -456 1953 1834 -520 -1833 -891 1262 1901 561 -1224
4794 -1224 -1270 203 1186 1257 -53 -1482 -1008 644 1706 635 -1225 -1763 -76 2302 1593 -933 -2324
4811 -2324 -688 1906 1854 -540 -2091 -1238 1304 1825 212 -1304 -1132 571 1488 739 -515 -1238 -462
4828 -462 653 1441 479 -1119 -1748 -24 1467 1562 -611 -2073 -964 1628 2069 -479 -2265 -1304 1346
4845 1346 2067 176 -2076 -1537 336 2143 1035 -815 -1404 -486 1207 1237 465 -971 -1289 -48 1418
4862 1418 1390 -408 -1806 -927 1300 2108 9 -2181 -1752 857 2358 684 -1809 -1828 331 1856 858
4879 858 -1192 -1464 -242 1023 1026 -166 -1119 -871 252 1298 1041 -327 -1427 -812 1122 1678 285
4896 285 -1775 -1815 736 2210 837 -1847 -1869 324 1979 1124 -1513 -1999 -228 1540 1422 -492 -1405
4913 -1405 -905 535 1090 811 -513 -1224 -576 711 1443 395 -1249 -1544 488 2123 1049 -1527 -2190
4930 -2190 -19 2103 1639 -913 -2390 -736 1893 1552 -309 -1745 -865 692 1419 236 -1029 -1051
4946 -1051 -264 1115 1129 -3 -1293 -1121 512 1804 1164 -1050 -1933 -385 1991 1814 -876 -2035 -793
4963 -793 1698 1914 -573 -2097 -1192 1159 1622 236 -1219 -1534 -164 1167 872 -17 -1052 -1033 223
4980 223 1133 821 -633 -1728 -238 1484 1541 -534 -2086 -1018 1593 2154 70 -2016 -1340 907 2033
4997 2033 585 -1333 -1506 -49 1239 598 -665 -1113 -464 525 1257 460 -893 -1297 -592 1000 1417
5014 1417 -259 -1852 -1091 1194 1786 388 -1738 -1545 682 2193 601 -1658 -1530 161 1709 894
5030 894 -726 -1509 -450 902 1208 67 -882 -973 -124 1138 1029 -224 -1465 -836 826 1801 430
5047 430 -1755 -1603 821 2092 1059 -1283 -2106 21 1865 1165 -745 -1680 -355 949 1248 -174
5063 -174 -1207 -890 231 923 816 -528 -1359 -645 610 1419 335 -1350 -1515 335 1955 1030 -1030
5080 -1030 -1617 -274 1802 1127 -852 -1448 -778 1265 1356 -213 -1275 -847 426 1446 612 -633 -1173
5097 -1173 -623 516 1035 225 -1135 -1470 253 1493 917 -924 -1696 -334 1769 1449 -694 -1558 -855
5114 -855 1355 1648 106 -1369 -1166 701 1330 665 -739 -1176 -225 984 847 128 -1163 -1131 106 1442
5132 1442 980 -862 -1511 -431 1274 1266 -233 -1744 -908 898 1714 36 -1796 -1313 857 1457 703
5149 703 -854 -1522 -100 1050 1039 -40 -1017 -794 283 1361 847 -677 -1359 -381 1212 1345 -280
5166 -280 -1580 -872 1062 1727 412 -1396 -1347 458 1468 730 -973 -1466 33 1028 1302 -325 -1214
5183 -1214 -543 599 1447 395 -796 -1232 5 949 1245 -427 -1614 -983 645 1502 348 -1363 -1508
5200 -1508 298 1694 856 -803 -1358 -479 1233 1172 -291 -1419 -821 624 1177 385 -856 -1091 67
5217 67 1034 1074 -268 -1406 -866 826 1492 103 -1219 -1360 288 1430 797 -975 -1594 -309 1085
5234 1085 1201 -288 -1531 -730 779 1404 566 -1035 -1059 179 1243 812 -288 -1247 -510 791 1385
5251 1385 197 -1007 -1207 248 1306 931 -610 -1499 -277 1011 1277 -195 -1375 -941 600 1343
5267 1343 425 -1043 -1339 38 1104 751 -448 -1185 -267 884 1207 169 -1154 -927 436 1220 905
5284 905 -627 -1361 -316 1027 1075 -333 -1439 -1055 681 1247 504 -943 -1049 63 1156 965 -478
5301 -478 -1357 -653 970 1254 239 -1212 -1141 432 1364 575 -821 -1362 -64 975 1141 -126 -1209
5318 -1209 -918 594 1110 303 -855 -1291 -64 1178 1022 -567 -1238 -565 950 1311 298 -1302 -1208
5335 -1208 230 1396 574 -862 -1155 29 1446 1166 -203 -1146 -572 717 1345 369 -1013 -1099 222
5352 222 920 920 -214 -1383 -597 816 1347 -13 -1145 -1147 334 1319 625 -854 -1272 -249 1338 1258 -311
5371 -311 -1300 -480 821 1165 290 -992 -881 252 1138 631 -311 -1132 -596 872 1280 219 -1100 -781
5389 -781 140 1399 624 -797 -1428 -52 1374 1144 -392 -1302 -466 701 1198 68 -1156 -937 197
5406 197 1147 655 -653 -1148 -306 875 1157 306 -945 -925 325 1434 710 -556 -1384 -318 1186 1172
5424 1172 -414 -1520 -781 1015 1246 156 -1202 -1044 531 1286 528 -728 -1133 -417 982 778 171
5441 171 -1033 -605 265 1025 615 -594 -1220 -248 1244 1179 7 -1403 -645 532 1422 240 -1074 -1130
5459 -1130 343 1299 465 -907 -933 -53 897 783 -210 -997 -600 354 862 424 -726 -936 -192 1010 1266
5478 1266 -167 -1156 -853 465 1268 362 -1415 -1229 201 1365 669 -928 -1231 -188 991 870 -313
5495 -313 -1304 -402 308 1058 439 -387 -776 -298 806 798 138 -1081 -816 644 1218 612 -1127 -1315 352
5514 352 1382 973 -803 -1511 -203 1204 1014 -442 -1174 -488 700 850 85 -860 -825 -238 778 716
5532 716 -250 -808 -700 550 1212 414 -978 -1187 176 1329 905 -617 -1563 -573 1184 1194 -261 -1449
5550 -1449 -648 858 981 -18 -905 -800 212 860 464 -473 -835 -631 564 795 308 -828 -973 82
5568 82 1181 896 -460 -1437 -576 1085 1085 -126 -1344 -871 646 1043 277 -950 -769 223 990 481 -608
5587 -608 -797 -396 638 694 -22 -689 -937 -166 763 997 -405 -1407 -499 627 1280 385 -1097 -971 801
5606 801 1325 77 -1326 -1078 39 1339 721 -691 -1118 -346 715 550 123 -394 -649 36 803 664
5624 664 -93 -882 -659 817 1038 269 -1092 -1086 872 1270 449 -945 -1199 288 1341 857 -793 -1071
5642 -1071 -238 798 776 -100 -661 -442 484 999 547 -407 -825 -502 695 830 91 -989 -991 276 945
5661 945 714 -584 -1226 -17 1364 769 -531 -1216 -198 1182 1058 -272 -781 -462 327 759 402 -474
5679 -474 -875 -278 669 834 309 -580 -769 69 1119 550 -596 -1176 -212 1139 1021 -591 -1314 -408 998
5698 998 932 -128 -1178 -826 596 1035 186 -746 -673 138 677 581 -196 -752 -628 169 957 667 -478 -1214
5718 -1214 -331 959 1005 -162 -1317 -848 725 1181 -33 -1154 -771 475 952 334 -792 -761 105 948
5736 948 568 -421 -635 -411 272 576 283 -383 -832 -269 694 897 -282 -1211 -483 755 1387 185 -1226
5755 -1226 -825 416 1298 483 -663 -1189 -52 1029 391 -374 -561 -236 489 941 313 -656 -827 -236
5773 -236 797 615 -119 -1102 -745 673 814 99 -1092 -1040 260 1064 682 -1079 -1293 67 1082 624
5791 624 -277 -962 -407 643 829 -66 -716 -487 104 708 793 -166 -922 -269 442 906 183 -921 -785 -5
5811 -5 1151 690 -849 -1240 -43 1038 1011 -241 -1157 -396 483 579 -198 -758 -575 324 812 511 -378 -762
5831 -762 -450 537 693 203 -585 -834 195 980 798 -510 -1108 -155 1080 916 -454 -1278 -534 827
5849 827 791 -132 -960 -770 183 810 606 -480 -855 -201 450 981 109 -983 -674 244 886 556 -536
5868 -536 -995 -248 884 785 -373 -1279 -359 528 1131 30 -921 -959 422 933 281 -639 -1028 -8 712
5887 712 563 89 -763 -591 393 961 576 -478 -1011 -61 558 787 -153 -1106 -634 634 947 -5 -825
5906 -825 -742 134 842 459 -647 -926 5 810 792 -222 -917 -471 322 1004 241 -617 -824 66 530 877
5926 877 -29 -971 -162 496 900 190 -676 -734 240 844 505 -585 -980 -157 790 760 -94 -1261 -608 436
5946 436 1006 393 -707 -884 -59 760 488 -159 -1006 -559 559 772 443 -646 -729 223 826 566 -208
5965 -208 -732 -115 678 859 -137 -1109 -542 264 864 145 -503 -1151 86 1057 426 -391 -931 -515 725
5984 725 726 -39 -920 -573 236 989 640 -455 -813 -293 693 617 206 -934 -462 240 871 564 -401 -899
6004 -899 -85 779 605 -253 -1005 -599 396 1058 72 -654 -552 262 822 523 -351 -504 -276 578 897 50
6024 50 -855 -496 316 726 510 -416 -847 -217 668 581 -287 -1002 -398 660 795 97 -711 -712 223 829 342
6045 342 -526 -650 -279 707 780 -163 -581 -565 233 826 342 -410 -716 -23 687 650 -263 -657 -524 318 958
6066 958 119 -855 -727 221 1026 431 -353 -732 -228 661 839 -301 -693 -575 516 819 231 -443 -652
6085 -652 -121 579 463 -103 -594 -343 405 921 404 -759 -898 238 981 599 -488 -778 -21 716 813
6104 813 -442 -732 -532 612 826 223 -320 -729 38 680 508 -105 -776 -507 292 999 392 -683 -796
6123 -796 155 918 637 -448 -887 -418 814 720 83 -813 -484 413 847 93 -879 -690 215 593 163 -293
6143 -293 -562 -381 313 534 148 -560 -530 -206 694 536 -401 -1029 -278 804 896 -142 -823 -545 211 777
6163 777 231 -678 -916 509 590 625 -235 -738 -339 390 722 24 -485 -452 49 750 714 -254 -703 -516 555
6184 555 820 -114 -1000 -359 585 1001 180 -847 -473 157 800 215 -531 -686 -118 570 450 -121 -363 -562
6204 -562 88 625 185 -312 -644 -273 178 619 -4 -728 -549 385 1102 293 -621 -840 -74 1060 656 -512
6224 -512 -717 -232 347 658 -209 -579 -363 222 420 454 -249 -480 -418 380 686 75 -848 -529 165 760 595
6245 595 -629 -1005 39 967 608 -556 -1074 -126 768 658 -229 -644 -222 261 529 289 -333 -490 -134
6264 -134 534 737 124 -502 -491 257 793 331 -578 -782 -255 975 1022 -165 -966 -269 816 772 -115 -648
6284 -648 -430 553 764 31 -403 -569 55 499 354 -192 -629 -338 259 665 292 -350 -813 -150 713 923
6304 923 -161 -967 -425 880 1056 -37 -945 -650 437 921 188 -663 -638 143 662 629 -268 -545 -94
6323 -94 108 678 218 -370 -526 -264 671 705 -379 -640 -389 566 851 139 -1052 -602 457 835 342 -677
6343 -677 -601 -48 676 514 -252 -515 -263 279 365 386 -345 -226 116 473 766 -132 -616 -475 463 999 296
6364 296 -783 -707 51 1023 355 -680 -759 32 991 434 -463 -713 -417 395 770 91 -581 -372 69 277
6384 277 477 -16 -595 -352 534 470 462 -849 -838 226 634 482 -459 -1007 9 907 883 -469 -465 -138 667
6405 667 673 39 -602 -296 330 642 2 -151 -300 -117 361 385 172 -465 -783 336 755 416 -434 -1004 -186
6426 -186 607 841 -528 -726 -507 565 677 -130 -823 -390 221 750 121 -486 -627 -74 502 503 -118 -489
6446 -489 -462 158 523 345 -257 -828 -11 918 671 -337 -765 -329 650 766 -155 -692 -607 337 807 407
6466 407 -557 -631 -57 354 681 2 -545 -347 75 705 369 -390 -774 -372 565 568 -177 -945 -582 650 814
6487 814 -97 -760 -609 457 776 378 -492 -807 -29 575 352 -147 -378 -354 286 292 50 -367 -605 -76 521
6508 521 775 -107 -640 -450 442 578 144 -613 -620 87 748 384 -516 -731 -95 498 465 -100 -605 -107 258
6529 258 442 112 -360 -450 27 403 380 -191 -672 -288 365 782 231 -407 -563 169 683 928 -465 -790
6549 -790 -101 619 775 -261 -495 -378 618 706 127 -489 -730 233 432 290 3 -664 -229 167 570 94
6569 94 -240 -398 -20 695 480 -344 -691 -91 540 512 -208 -721 -428 366 661 279 -535 -631 42 598 399
6590 399 -310 -674 7 434 417 10 -451 -478 71 556 336 -200 -794 -345 541 598 -59 -553 -465 366 718
6611 718 256 -320 -410 323 580 322 -216 -722 -269 366 431 98 -506 -695 -8 650 364 -324 -662 -56 424
6632 424 692 -41 -617 -336 327 886 397 -528 -582 115 654 310 -238 -514 -308 318 486 -112 -498 -497 -33
6653 -33 525 131 -303 -570 -133 467 414 -284 -621 -470 183 594 212 -557 -496 287 460 459 -135 -785 -219 394
6675 394 641 41 -607 -496 253 624 401 -625 -605 -91 326 564 -56 -648 -363 406 738 162 -465 -439
6695 -439 13 566 163 62 -466 -172 282 582 -90 -533 -447 371 327 213 -279 -655 -328 831 570 -266
6715 -266 -722 -263 134 622 173 -607 -514 30 517 261 -328 -564 -40 401 513 152 -463 -329 215 702
6735 702 300 -32 -628 65 366 595 -54 -666 -311 391 536 72 -584 -559 -19 427 487 -117 -413 -168 242
6756 242 512 69 -351 -394 17 559 476 -301 -450 -418 673 470 97 -606 -306 508 644 350 -591 -725 -28
6777 -28 1038 428 -236 -690 -195 311 422 167 -550 -356 56 395 219 -528 -573 26 561 612 -33 -462 -545
6798 -545 272 561 262 -702 -484 184 772 309 -191 -455 -230 610 445 -258 -641 -316 5 195 273 -236
6818 -236 -683 -112 380 508 69 -301 -463 41 936 373 -420 -727 239 695 187 -365 -764 -102 553 448
6838 448 -209 -385 -239 255 710 183 -544 -382 -133 312 180 -174 -642 -420 143 609 273 -86 -550 -337
6858 -337 570 565 -153 -907 100 577 537 -78 -618 -417 418 626 7 -308 -410 79 515 263 -138 -462 -217
6879 -217 54 616 308 -340 -641 -62 607 336 5 -730 -421 631 632 -32 -671 -265 325 457 240 -495
6899 -495 -451 203 426 235 -307 -596 -71 134 631 138 -70 -383 -200 461 278 8 -632 -270 431 768
6919 768 97 -831 -620 479 737 235 -600 -470 133 523 268 -308 -343 171 295 541 180 -362 -358 -50 391
6940 391 338 -13 -228 -419 530 636 48 -680 -553 383 525 412 -305 -480 147 794 646 -334 -642 7
6960 7 558 304 -65 -263 -189 130 545 304 -243 -364 -267 184 502 37 -587 -770 44 530 291 -300 -805
6981 -805 -24 857 676 -379 -455 -5 321 325 -120 -795 -251 239 422 -39 -200 -297 -195 103 242 109 -489
7002 -489 -557 178 792 396 -205 -560 -326 671 349 -204 -667 -154 495 628 -134 -372 -470 335 347 139 -172
7023 -172 -285 -30 393 504 53 -222 -338 126 223 432 -173 -512 158 609 856 -169 -710 -224 369 527
7043 527 87 -402 -224 279 616 -17 -618 -507 144 238 -170 -226 -690 -160 204 351 168 -106 -429 -449 216
7064 216 618 -178 -608 -320 346 665 90 -569 -820 156 557 141 -580 -486 -64 562 438 -73 -301 -125
7084 -125 503 499 79 -280 -247 -187 271 517 -129 -603 -396 259 671 225 -361 -675 -100 751 250 -330 -664
7105 -664 -125 536 354 -206 -496 -45 144 359 -39 14 -162 43 474 493 69 -359 -252 46 544 180 -152
7126 -152 -509 -22 640 348 -385 -581 -127 385 510 -44 -572 25 25 479 203 -447 -336 138 334 257 -233
7147 -233 -146 -282 -77 342 324 -184 -348 -5 575 133 -282 -585 37 586 504 82 -568 -126 478 463 92
7168 92 -458 -518 54 535 205 -257 -413 -62 143 595 184 -330 -373 -82 547 183 -204 -582 -384 533 613
7189 613 40 -291 -292 597 382 202 -320 -427 -28 454 318 -418 -315 -114 347 130 78 -343 -360 115 439
7210 439 281 -312 -780 -88 172 509 -46 -296 -425 85 403 19 -438 -572 184 487 315 -223 -323 30
7230 30 422 265 -32 -423 -117 81 268 126 -202 -370 -142 352 455 54 -340 -229 251 473 182 -516
7250 -516 -538 -69 343 497 -482 -371 -52 229 577 -56 -284 -354 9 326 150 -343 -455 -113 257 363 -42
7271 -42 -332 -325 124 632 89 -404 -520 88 524 408 -255 -533 -79 330 467 -48 -435 -363 313 497 181
7292 181 106 -415 -301 287 312 -41 -309 -331 112 361 421 -408 -301 -281 370 169 -140 -713 -234 194 474 -32
7314 -32 -630 -361 211 493 225 -358 -434 -68 451 700 -109 -441 -201 230 489 163 -290 -506 -89 385 283
7335 283 -166 -474 -267 465 293 -75 -457 -260 101 349 186 -316 -347 157 640 286 -287 -396 -91 294
7355 294 200 -183 -201 -620 -68 478 342 -415 -379 -101 240 412 23 -345 -198 92 513 251 -84 -569 -258
7376 -258 354 205 17 -312 -134 -8 509 215 -162 -358 -80 105 211 -162 -264 -52 420 71 31 -399
7396 -399 -379 210 484 -105 -431 -376 -91 550 310 -322 -342 -364 133 329 107 -273 -204 51 326 470 -288 -341
7418 -341 -186 266 357 178 -553 -109 128 298 272 -269 -461 43 243 80 -212 -178 -390 22 479 -7 -302
7439 -302 -478 -92 351 299 -332 -458 -322 553 291 -128 -530 -188 127 684 213 -204 -542 -228 322 186
7459 186 -101 -296 -121 206 501 117 -284 -339 19 423 252 -273 -633 -207 434 528 -136 -464 -260 242 412
7480 412 -82 -254 -199 -98 323 305 -54 -351 -402 38 370 228 -288 -446 -47 477 285 -118 -685 93 93 393
7502 393 343 -427 -270 538 435 195 -250 -398 -104 353 430 -128 -483 -175 281 240 67 -230 -432 -270 398
7523 398 77 -267 -324 -125 162 426 -143 -456 -238 54 647 111 -408 -587 21 511 487 -235 -472 170 516
7544 516 431 -52 -280 -139 51 384 273 -247 -274 -54 203 407 242 -390 -371 -9 571 243 -250 -558 151
7565 151 246 171 -325 -274 -186 481 316 -5 -208 -132 316 364 195 -315 -327 -126 269 263 30 -267 -168 191 467
7588 467 201 -215 -665 -152 411 275 -110 -273 -235 310 348 6 -561 -363 383 364 306 -34 -307 -70 272
7609 272 179 200 -49 -432 -39 273 100 -191 -559 -177 422 462 -301 -385 -286 234 314 184 -403 -270 289 290 51
7632 51 -174 -168 62 260 255 -44 -450 -230 282 467 123 -191 -211 -244 339 340 -74 -261 -204 201 326 101 -441
7655 -441 -621 75 351 104 -353 -253 -3 550 276 -68 -297 -212 305 144 190 -73 -390 -209 220 347 2
7676 2 -205 -99 50 469 150 -327 -371 210 443 310 -291 -474 125 252 201 -389 -331 -216 222 15 -180 -268
7698 -268 -52 -124 249 316 -29 -139 -209 278 385 149 -299 -452 37 500 417 -371 -400 -90 591 247 -166 -456
7720 -456 -325 324 214 -137 -435 -262 -163 432 -41 -104 -118 -34 -42 338 277 -100 -259 -17 546 189 -99 -528
7742 -528 -87 247 519 -84 -345 -205 379 634 -26 -255 -212 38 396 79 -24 -286 -365 133 264 116 -176
7763 -176 -147 264 262 323 -210 -214 -144 378 557 244 -593 -181 267 354 0 -373 -206 106 338 122 -45 -192 -102
7786 -102 102 464 12 -198 -102 115 261 159 -264 -346 -115 206 439 69 -467 -150 286 401 133 -367 -316
7807 -316 100 378 186 -203 -546 46 212 201 19 -312 -172 31 407 15 -39 -354 -36 197 225 7 -22
7828 -22 -228 141 615 271 -322 -331 218 546 209 -109 -363 -365 204 358 -52 -275 -70 332 299 39 -158 -280
7850 -280 13 407 160 183 36 -164 173 395 193 -363 -560 -194 303 220 -113 -412 -157 78 399 -255 -322
7871 -322 -88 207 252 -93 -245 -330 -124 163 247 -124 -179 -266 2 330 260 -307 -362 21 342 516 -214 -492
7893 -492 -358 297 465 -24 -316 -293 271 353 -33 -301 -207 -105 227 108 85 -364 -129 153 52 315 -239
7914 -239 -274 5 247 396 41 -260 -98 275 298 240 -277 -201 124 469 -89 -289 -331 30 292 498 65 -303
7936 -303 75 97 353 81 -299 -316 107 15 367 144 -217 -35 138 271 -103 -402 -263 29 288 145 -348
7957 -348 -127 -119 545 307 -2 -292 -169 221 353 77 -74 -139 140 246 262 80 -115 -105 458 270 -234 -529
7979 -529 -71 179 392 72 -376 -340 -152 485 102 -271 -373 -109 227 373 31 -330 -435 -15 354 357 3
8000 3 -103 -286 182 279 28 -389 -162 -98 286 140 -259 -268 -33 197 260 -172 -511 -161 207 374 -144 -328
8022 -328 -271 -27 240 212 -200 -312 -178 276 464 16 -248 -129 285 386 65 -27 -201 56 194 416 -114
8043 -114 -294 -257 61 586 159 -314 -352 43 344 385 -237 -383 28 390 234 121 -511 -321 384 355 204
8064 204 -231 -295 -218 310 274 -103 -229 -159 205 394 353 -160 -232 162 131 241 -127 -274 89 89 367 -275 -462
8087 -462 -127 351 311 202 -213 -460 202 472 495 -238 -232 -54 246 337 211 -191 -305 4 358 -83 -332 -255
8109 -255 -151 285 319 57 -225 -148 60 232 123 -223 -424 213 273 305 17 -283 -85 191 290 236 -268 -579
8131 -579 -12 260 347 -57 -225 -128 181 281 -97 -354 -440 130 359 7 -353 -566 140 623 334 -153 -588
8152 -588 -214 86 283 162 -199 -301 318 310 126 -241 -373 210 58 169 -36 -297 -247 175 443 172 -248
8173 -248 -173 100 250 149 -8 -198 -111 341 429 -54 -97 63 142 504 85 -67 -86 -50
8191e0
$$ Imaginary data points
##PAGE= N=2
##DATA TABLE= (X++(I..I)), XYDATA
0 0 0 0 0 0 0 0 0 0 0 0 0 -8 8 -8 8 -16 16 -18 24 -32 32 -40 48 -56 67 -80 92 -105 122 -141 159 -182 206
33 206 -233 264 -296 333 -374 417 -463 517 -574 636 -703 779 -859 947 -1045 1151 -1268 1398
51 1398 -1541 1698 -1874 2072 -2295 2551 -2846 3189 -3597 4090 -4697 5473 -6500 7918 -10026
66 -10026 13482 -20124 37521 -182465 -370417 98869 250865 134610 -50742 -203057 -138142
77 -138142 190775 192434 -103853 -151251 12663 39069 96475 119869 -95401 -222636 -8244
88 -8244 152575 133515 69142 -127793 -275763 -3226 299582 126745 -170743 -174155 -26825
99 -26825 141650 185940 -80993 -289566 -29675 258655 139917 -84230 -157849 -132941 49864
110 49864 229278 90522 -136104 -109158 -18249 20610 123856 97602 -125883 -150349 66856
121 66856 147711 48459 -77035 -179769 -70352 226147 222359 -129788 -269503 -63390 139274
132 139274 185133 49181 -183567 -173182 94725 169252 -7379 -90338 -55315 -14363 86431
143 86431 117857 -44375 -143473 -43518 57242 110391 115115 -56460 -219488 -66022 178760
154 178760 154139 -29468 -144883 -120689 67608 200119 17419 -207287 -104512 117597
164 117597 145452 30163 -110567 -164514 -7933 172839 103915 -62379 -93534 -61957 -1800
175 -1800 111278 97726 -66438 -117431 -7924 80559 93006 9741 -140002 -116410 117134
186 117134 194429 -4766 -168120 -126088 32584 171167 111632 -115018 -175477 8476 125022
197 125022 58978 -32041 -82758 -60766 59185 109804 -2333 -90588 -61328 -1728 78255
208 78255 119393 -6507 -155561 -89714 85361 137987 51036 -90474 -147622 1007 168705
219 168705 82072 -114474 -126673 10335 112909 96419 -44086 -154900 -58309 109317 107284
230 107284 -3710 -72817 -87093 -23138 91793 92749 -29286 -90830 -45776 32848 96708 55244
242 55244 -91621 -123261 36486 144807 62367 -78081 -132190 -40049 125555 138307 -42770
253 -42770 -148726 -52263 72920 93081 23236 -79571 -94477 21507 99161 35850 -49203
264 -49203 -72228 -42456 48536 111481 25076 -104559 -94931 20531 106437 87849 -39630 -138989
276 -138989 -46779 117835 110549 -33087 -111801 -58787 62178 121119 20299 -116904 -90576
287 -90576 44156 97664 45317 -40908 -97283 -47602 68689 90722 951 -71283 -68353 -898
299 -898 86738 76149 -51433 -114139 -18494 92898 90416 -9464 -110003 -81865 68848 134339
311 134339 19397 -102501 -85570 18029 96350 69158 -49513 -107307 -21341 76912 67130
322 67130 -5900 -71127 -72561 18808 99010 48192 -62990 -91627 -23031 70713 96990 173
334 173 -111816 -73368 61982 106836 25388 -74857 -90849 7626 109234 67276 -61277
345 -61277 -97076 -15386 69610 79138 2555 -88421 -71721 36820 87953 32515 -49013 -81861
357 -81861 -28472 70766 85882 -17576 -96510 -52803 45518 91335 35109 -74906 -97374 13824
369 13824 105851 59713 -47093 -90660 -32804 69934 94638 -2880 -93233 -58330 38647 81635
381 81635 38393 -51323 -89819 -14185 81053 67747 -24360 -82278 -52537 37830 91911 28394
393 28394 -78753 -81669 13993 82795 56987 -33269 -91846 -35206 72845 85595 -6434 -78891
405 -78891 -57052 28201 88075 45050 -60058 -86557 -2152 75985 63220 -17712 -84001 -53571
417 -53571 49202 89349 12660 -73975 -69885 8220 77746 57920 -40297 -91884 -25133 65752
429 65752 72625 126 -72871 -64230 27756 91424 38991 -58077 -76908 -7416 71173 72207 -16739
442 -16739 -89314 -45086 55217 80814 12017 -67187 -70841 10310 82964 48646 -47337 -79092
454 -79092 -19694 54099 66978 1044 -73625 -58466 30002 77483 32260 -46407 -74079 -14789
466 -14789 72282 73842 -20413 -85276 -41781 49592 84323 21102 -71782 -75473 19983 86204
478 86204 41682 -46734 -75402 -18986 59675 66604 -11953 -74677 -45185 30047 66563 30628
490 30628 -44429 -74147 -13133 66585 63285 -14150 -73039 -47794 39088 85145 22848 -70840
502 -70840 -68917 20642 82255 45154 -45464 -81819 -15176 71726 65606 -18765 -71412 -42001
514 -42001 29183 66469 25695 -47787 -63178 -5414 53120 50081 -11149 -67389 -46040 39252
526 39252 79824 18455 -66230 -70875 10655 85710 57878 -44234 -88176 -16906 70852 66488
538 66488 -13790 -70530 -40248 39045 67359 10177 -53812 -50304 5099 52574 44471 -16845
550 -16845 -65961 -39968 32516 67294 24914 -50288 -71697 -3690 74608 55684 -36537 -78660
562 -78660 -18758 65499 69509 -15617 -82176 -41412 52915 77583 9971 -60006 -57547 7073
574 7073 60560 42657 -21525 -54579 -27225 25437 49926 17182 -43310 -57233 2845 64485
586 64485 45635 -34253 -79729 -29052 64953 81325 -7212 -85246 -53197 41548 78906 20770
598 20770 -56003 -56422 15012 61867 28026 -33275 -48296 -9936 38878 47381 2793 -48680 -49115
611 -49115 4086 56052 48919 -18790 -73375 -40110 45752 71590 3801 -68602 -52168 33255
623 33255 77022 16805 -68061 -62902 24629 79013 36903 -42648 -67397 -14292 50228 53286
635 53286 1109 -41492 -37004 2839 39532 33661 -14769 -49433 -22831 37136 54640 348
647 348 -66514 -55931 31859 85339 29363 -65562 -78345 3622 75518 51113 -33208 -66822
659 -66822 -12264 49662 41613 -13745 -44452 -20844 26785 45623 15198 -31654 -47176 -14111
671 -14111 39341 57760 10067 -58069 -60612 11745 69607 38698 -42366 -69440 -4289 66492
683 66492 43952 -40834 -71967 -8148 65168 56560 -19730 -69218 -35552 34748 58076 19208
695 19208 -28724 -40848 -13248 26283 38972 8146 -32738 -34705 9758 48623 26581 -40101
707 -40101 -64945 -2380 71937 56288 -33459 -85215 -33384 57273 71925 -2963 -65792 -39883
719 -39883 29307 50078 7555 -36988 -31492 11764 40511 23525 -16963 -40181 -23596 21296
731 21296 53325 30376 -33766 -63956 -18048 51829 60193 -7578 -66706 -37392 40839 59226
743 59226 -5742 -64100 -37154 39567 64210 6703 -58905 -51858 13149 54667 33659 -15472
755 -15472 -41548 -24687 13915 36614 21880 -15525 -35044 -10862 33202 39985 -10902 -55400
767 -55400 -28507 44433 67706 2055 -70551 -58389 26897 76824 29072 -49962 -59247 1604
779 1604 48847 28840 -23377 -40438 -6025 31269 29335 -4087 -33022 -29702 5976 42758 38825
792 38825 -11045 -54225 -37234 27257 64523 23484 -47410 -55518 10136 60270 27216 -42765
804 -42765 -54346 7475 59425 33549 -37226 -60627 -11675 43514 45168 -861 -39158 -34592
816 -34592 1984 32166 29169 -3342 -32155 -24508 16453 42374 12694 -39441 -42029 15825 62486
829 62486 32023 -44417 -68672 -5331 65244 53419 -22255 -64047 -25580 36150 45085 -2261
841 -2261 -39889 -24089 16652 31975 9779 -22994 -32319 -7880 28633 39107 6522 -39214
853 -39214 -44400 3885 54565 41621 -23414 -58477 -17346 46154 48190 -13558 -55529 -21198
865 -21198 42266 49207 -8510 -54503 -32458 25407 49076 16636 -31228 -41475 -9998 26204
877 26204 32846 5692 -27165 -31534 1510 35704 26663 -20145 -44052 -9916 44388 46346 -13851
890 -13851 -60455 -30688 40203 61542 7273 -51888 -44057 15298 49706 20195 -28641 -36609
902 -36609 -1294 29747 23006 -9887 -31839 -19499 14537 35214 17711 -23684 -43919 -14201
914 -14201 37367 47351 -1559 -49758 -35686 24798 53714 13225 -42853 -40372 17082 52015
926 52015 19002 -36631 -44432 2091 43868 32495 -14695 -41516 -22288 17250 35167 15075
938 15075 -20774 -34957 -10273 27190 32729 -3775 -39257 -26943 22874 47346 10831 -43010
950 -43010 -43648 12486 54549 29391 -30500 -50111 -7468 41845 36851 -10162 -39023 -19026 20825
963 20825 32929 6352 -26543 -28758 1072 30122 25703 -9955 -39003 -25192 20742 44272
975 44272 13482 -36047 -43180 3746 46572 30096 -24462 -46626 -7894 40982 36958 -12397
987 -12397 -43973 -19843 28078 41485 6120 -32812 -31979 4178 33951 25048 -10991 -35074 -19642
1000 -19642 18295 35066 9181 -30216 -34945 3955 39931 25453 -23181 -44850 -10514 38080
1012 38080 39612 -8116 -44867 -25415 24916 42909 9071 -31954 -31759 6229 35714 22383
1024 22383 -15697 -33804 -12308 23733 32645 3408 -31741 -31075 7029 37991 23186 -21504
1036 -21504 -42187 -12051 32926 36391 -6313 -41595 -25145 22235 40795 8870 -33072 -33820
1048 -33820 7371 38422 23204 -17981 -35548 -10787 26953 32404 2374 -30128 -26547 9029
1060 9029 33498 18604 -19095 -35742 -8260 28765 31200 -6027 -38658 -23893 18085 37890
1072 37890 9885 -31121 -34044 5530 36302 24548 -17847 -36759 -10951 27331 32674 684
1084 684 -31790 -25005 12962 35733 17285 -22045 -34389 -5121 30636 29941 -6740 -36306 -22076
1097 -22076 17983 36049 9097 -29189 -32363 3179 34031 23640 -16157 -36595 -12960 25908
1109 25908 33485 163 -32534 -26191 12655 36409 16570 -22424 -34015 -3220 31518 28769
1121 28769 -8135 -35104 -18971 20101 34231 6851 -28607 -30304 4316 32858 21569 -16593
1133 -16593 -35427 -12281 24585 31799 206 -32557 -26384 11812 35790 16589 -23232 -34498
1145 -34498 -3356 32515 28607 -9893 -35162 -16855 22150 34461 5410 -28732 -27043 6441
1157 6441 31651 19006 -15643 -31714 -10519 22617 28711 85 -29891 -24986 9619 32869
1169 32869 16249 -21688 -34517 -4778 31622 29548 -9363 -36494 -18085 22646 35582 5106
1181 5106 -30145 -26569 9256 32743 17023 -18069 -30134 -6019 24160 26372 -2406 -28583
1193 -28583 -22291 9667 30751 15460 -19707 -33192 -7125 27783 28586 -6962 -35120 -19329
1205 -19329 21028 34914 4989 -31254 -27525 10838 35334 17153 -20224 -31226 -4729 25977
1217 25977 25391 -3159 -25844 -18322 10126 25757 11819 -16975 -26764 -4701 24305 25273 -7280
1230 -7280 -33319 -19969 19722 36019 7105 -32423 -31276 8056 36870 18722 -20822 -32096
1242 -32096 -3270 27964 23555 -7814 -27002 -12580 15931 25902 7423 -19181 -24614 -2527
1254 -2527 23770 24724 -4210 -30208 -21665 13464 32750 10278 -26474 -30587 4573 33758 18269
1267 18269 -22048 -34313 -2920 32094 26638 -10971 -32928 -15007 18857 28670 6675 -19248
1279 -19248 -21693 -509 20317 18682 -3978 -22250 -14725 12697 27184 7636 -25194 -29023 4780
1292 4780 34790 21513 -20911 -39043 -9419 30888 30443 -7716 -33531 -16284 18317 26844 1883
1305 1883 -22562 -17579 7237 23046 12656 -10498 -22561 -9721 15178 25799 9811 -20201
1317 -20201 -27914 -2580 29289 24541 -11529 -32960 -11764 24705 28602 -7651 -34069 -16455
1329 -16455 21869 31833 783 -30425 -24412 9660 29055 14392 -12733 -22597 -8777 13365
1341 13365 19483 5974 -13918 -17719 672 21885 17149 -11415 -29274 -9599 26460 31899 -4194
1354 -4194 -37606 -24839 18685 37525 8708 -28523 -27794 5697 27230 12131 -15807 -21360 -909
1367 -909 18601 15357 -4302 -18959 -13937 6896 23144 16421 -10014 -28186 -14180 19337 31491
1380 31491 5164 -27902 -24846 10999 32013 8991 -26721 -26644 9340 33204 13434 -24164 -31465
1393 -31465 -1881 26840 22036 -5223 -23144 -15530 5588 18264 12019 -5897 -17549 -8635 12716
1406 12716 20488 1862 -22647 -19068 12871 33074 11553 -27742 -33964 3040 36343 24148
1418 24148 -16914 -34045 -8589 22880 21529 -6015 -22255 -9646 12868 16784 1099 -15527
1430 -15527 -15971 424 18070 18893 -916 -23365 -21037 7442 30446 18105 -16868 -30399 -4013
1443 -4013 27741 22534 -12914 -30340 -5671 27621 24096 -10945 -32157 -13621 19518 26931 3797
1456 3797 -20333 -20717 -1156 15208 15561 523 -14576 -14212 2957 18342 11038 -12846 -22641 -902
1470 -902 26709 22154 -13034 -34434 -11986 27345 33409 -1624 -32358 -21134 13890 27181 5768
1483 5768 -19084 -16977 5144 17537 7587 -10637 -16863 -5383 11901 18206 5165 -16555 -23439
1496 -23439 -3600 23468 25005 -4387 -29203 -16982 17407 28967 2444 -26120 -18249 15710
1508 15710 28972 3956 -25821 -22260 8807 27359 13409 -13826 -23215 -8019 12006 17544
1520 17544 5643 -11387 -16608 -4222 13659 15202 -3726 -20767 -11334 16122 25256 845 -28290
1533 -28290 -22082 13881 34292 12483 -23762 -28625 1970 27056 16990 -11271 -21382 -3989
1545 -3989 15361 13971 -3508 -15667 -10394 5854 16527 9870 -9253 -21697 -11113 14148 25224
1558 25224 5923 -22748 -24564 4839 27721 14762 -17302 -24984 1065 26049 16216 -14535
1570 -14535 -25290 -3810 22144 20973 -3693 -21877 -14295 7059 18329 10458 -7378 -17064 -8719
1583 -8719 9323 16767 3376 -16467 -16877 5103 23008 11146 -18176 -26235 -676 27724 21695
1596 21695 -11556 -29689 -10349 20350 24275 -569 -20795 -13500 9007 18407 5607 -11925
1608 -11925 -14415 -851 13838 13815 -1737 -17700 -15291 5545 21935 12919 -13645 -25573 -6573
1621 -6573 20917 21324 -6345 -25426 -11533 17297 22926 -1787 -23363 -14805 12397 23536 6459
1634 6459 -16459 -18564 191 17373 15258 -2585 -16275 -12148 5281 17085 9082 -10719 -18725
1647 -18725 -3523 17759 16817 -7093 -24441 -11814 16989 24717 1036 -24491 -19109 9306 24911
1660 24911 9675 -15374 -19466 -356 17722 13674 -5351 -16183 -7699 9507 16502 5178 -12689
1673 -12689 -16992 -1300 17479 16482 -5020 -22211 -12682 12654 22669 3583 -20410 -18853 6504
1686 6504 22898 9394 -16016 -20816 603 20081 14750 -7992 -19864 -8150 12467 18255 4134
1699 4134 -13740 -15259 523 16246 13572 -5230 -18125 -9431 11822 19545 2564 -18792 -17569
1712 -17569 5782 22046 10564 -15002 -22353 -2422 19562 16586 -6455 -20880 -9757 11784
1724 11784 18244 2791 -14567 -14431 2859 16714 11615 -6974 -17464 -6844 12748 18349 2135
1737 2135 -17094 -16138 5354 20602 10726 -12832 -20959 -2969 18265 16008 -6145 -20907 -10133
1750 -10133 12525 18699 2123 -16503 -15597 3881 18203 10948 -8557 -17555 -5686 13224 16804
1763 16804 1057 -15892 -13585 5710 18797 9491 -11643 -18753 -2671 17021 15915 -4843 -20008
1776 -20008 -10574 11233 18852 3192 -16401 -16469 2901 17987 10693 -9315 -18170 -5125 13689
1789 13689 16195 -585 -16879 -12413 7381 18714 8033 -12040 -17620 -1043 16735 14654 -4799
1802 -4799 -18559 -9229 11047 18235 2981 -15524 -15409 2770 17563 10367 -9281 -18812 -5697
1815 -5697 13817 16332 -1179 -17441 -12636 7452 18419 7114 -12426 -16843 -470 16643 13640
1828 13640 -5479 -17361 -7949 11147 16851 3132 -14594 -14360 3218 16651 10680 -8637 -17631
1841 -17631 -5794 13059 16033 -1159 -17733 -13009 7531 18488 6566 -13698 -17191 240
1853 240 17397 12848 -6751 -17481 -6959 12003 16509 1847 -14137 -12769 3947 16079 9850
1866 9850 -7867 -16112 -4938 12314 15185 -406 -16563 -12960 6333 18366 7491 -13422 -18361
1879 -18361 -709 17427 13239 -7014 -18616 -6835 12506 15894 237 -14975 -11347 5720
1891 5720 15754 7729 -8655 -14811 -3197 12341 14350 -522 -14919 -12066 5510 17343 7824
1904 7824 -11983 -17643 -1329 16484 13415 -7303 -19281 -7195 13487 16726 -457 -17130 -12459
1917 -12459 6451 16571 6937 -9424 -14062 -2368 11543 12616 -565 -12406 -9801 4976 15180
1930 15180 7460 -10091 -16243 -1863 16117 14652 -5868 -19872 -9256 12749 18372 726 -17404
1943 -17404 -13457 6355 16492 5781 -11440 -13703 513 13059 10297 -4140 -13262 -7473 6974
1956 6974 14214 6309 -9267 -14793 -2582 14013 14562 -2823 -17264 -10123 10324 17786 1789
1969 1789 -17166 -13886 6977 18511 6267 -14253 -16662 506 15385 11275 -5060 -14250 -7019
1982 -7019 6436 12330 4847 -7704 -10964 -1482 11074 11183 -3037 -14658 -8387 10427 18175 2855
1996 2855 -17204 -15891 5495 20230 9365 -12858 -18063 -1084 15141 11088 -6058 -14433 -4695
2009 -4695 9167 11357 -205 -10813 -9280 1987 11864 9500 -3460 -13901 -9047 7530 16675
2022 16675 6110 -12382 -15409 1689 17284 10415 -10401 -17182 -911 17074 12532 -7925 -18713
2035 -18713 -5826 12683 14702 -16 -13218 -10862 1926 10700 7668 -3433 -10138 -6154 5647
2048 5647 11488 3514 -10177 -11977 2932 16558 10075 -10533 -19215 -3320 17806 16921 -4646
2061 -4646 -19226 -9108 11139 15518 421 -12947 -9310 5030 11034 3461 -7846 -10065 -1766
2074 -1766 8302 10329 877 -10899 -12271 751 14547 12073 -5435 -17030 -6738 12885 15701
2087 15701 -1628 -16448 -8527 11892 16662 -508 -16854 -11443 7725 16417 5280 -10633 -13501
2100 -13501 -2130 9155 9523 539 -8323 -8398 88 9092 6911 -4578 -12184 -4387 11450 13822
2114 13822 -2028 -17700 -10938 10877 20030 4400 -15839 -15498 4091 16977 7801 -8800 -12306
2127 -12306 -370 10348 7323 -4245 -9818 -4491 5339 9455 4411 -6955 -12414 -4676 9769
2140 9769 14263 1397 -14613 -13165 5353 16692 6665 -12544 -14161 3791 17077 7404 -11758
2153 -11758 -15168 1110 15625 11044 -5585 -14127 -6418 6621 10698 3994 -5822 -9276 -3489 5844
2167 5844 8636 603 -9911 -8583 4731 13756 4852 -12659 -15259 2172 18329 11673 -9539
2180 -9539 -18539 -4044 14167 13916 -3056 -13271 -5656 7693 10169 371 -8398 -6689 2258 8753
2194 8753 6046 -3378 -10664 -7667 4889 13598 6221 -9734 -15404 -1977 14032 12066 -5624 -15979
2208 -15979 -4136 13003 12756 -4483 -15758 -6227 11219 14224 531 -12301 -9907 2822 11112
2221 11112 7497 -2779 -9220 -5694 3257 9113 4509 -6166 -10538 -981 10941 9172 -6179 -15620
2235 -15620 -5506 12908 15501 -1722 -17252 -10693 8803 16257 3737 -11645 -10703 2823 10999
2248 10999 5428 -5909 -8790 -1081 7205 8104 289 -8246 -8651 870 11070 9176 -4418 -14568
2262 -14568 -7876 8892 14376 1011 -13813 -10821 6238 14431 3181 -12338 -11522 3980 14279
2275 14279 6630 -8419 -12277 -2104 9545 9921 656 -8247 -7667 739 8655 7187 -2685 -9994
2289 -9994 -5371 7132 11188 416 -12471 -10260 5724 15195 4975 -12403 -14666 1232 14758
2302 14758 9144 -7130 -13335 -3291 9299 9376 -1578 -8996 -5242 4188 8977 3974 -5594 -9214
2316 -9214 -2396 8001 10622 615 -11068 -10332 3510 13724 6994 -9261 -13517 -630 12792
2329 12792 9319 -6528 -13756 -3205 10396 11041 -2264 -12260 -7238 5506 10981 4184 -6359
2342 -6359 -9536 -1972 7514 9056 362 -8547 -7539 3387 11152 5419 -7914 -11586 -347 12568
2356 12568 9846 -6092 -14604 -5163 10192 12367 -1190 -12697 -8393 5107 11206 3643 -7569
2369 -7569 -9000 -191 8431 7124 -2249 -8819 -5696 4569 10714 4523 -7454 -11224 -949 11125
2383 11125 10337 -3597 -12887 -5883 8524 12040 -78 -11838 -8794 5160 11810 3750 -8865
2396 -8865 -10429 240 9862 7482 -3459 -9794 -5577 5078 9748 3295 -7035 -9299 -361 9865
2410 9865 8241 -3531 -11095 -4950 8186 11586 712 -11387 -9266 4280 12516 5107 -8619
2423 -8619 -11227 -735 9987 7856 -3268 -10411 -5518 5699 9532 1638 -7715 -8672 701 9452
2437 9452 7327 -3838 -10832 -4577 7465 11139 1270 -10026 -8761 3508 11674 5459 -7495 -10843
2451 -10843 -740 10057 8310 -3697 -11109 -5236 6499 9993 1548 -8744 -8725 1113 9732 6325
2465 6325 -4464 -10269 -3691 7519 9879 469 -9621 -7854 3635 11219 5143 -6862 -10313 -933
2479 -933 9917 9001 -2977 -10887 -5663 6288 10375 1933 -8597 -9019 1589 9872 6147 -5218
2493 -5218 -10676 -3191 7495 9197 -628 -9720 -7139 3989 10467 4453 -6699 -9580 -818 9357
2507 9357 8155 -2542 -9792 -5066 6129 10211 2074 -8484 -8789 1544 10042 6323 -5331 -10729
2521 -10729 -3445 7798 9115 -930 -9981 -7420 4274 10130 3793 -7208 -9443 -207 8994 7436
2535 7436 -2745 -9566 -4932 5730 9697 2286 -7741 -8346 1271 9963 6476 -4646 -10724 -3408
2549 -3408 7672 9567 -589 -10214 -7458 4324 10382 3230 -7786 -9369 409 9136 6880 -3706
2563 -3706 -9375 -4111 5982 8887 1637 -7281 -7446 1396 8863 6229 -3950 -9674 -3442 7488
2577 7488 9612 -11 -9828 -7884 4277 11028 3865 -8053 -10106 181 9504 6957 -4347 -9879
2591 -9879 -3680 6492 8326 379 -7777 -6892 1870 8572 5457 -3997 -8739 -3079 6889 9185 810
2606 810 -9017 -7628 3753 10515 4370 -7645 -9923 428 10068 7059 -4962 -10845 -3458 7377
2620 7377 8662 -279 -8707 -6812 2583 7966 4191 -3956 -7688 -2706 5805 7820 589 -7918 -6948
2635 -6948 3321 10253 5094 -6902 -10429 -662 10408 8724 -3748 -11277 -4427 7430 9249 -490
2649 -490 -8755 -6191 3678 8343 2545 -5660 -7475 -1223 6429 6457 -678 -7441 -6474 2467 9292 5169
2665 5169 -5159 -9622 -1954 9000 8885 -2816 -10662 -4264 7927 10090 -472 -10178 -6785 4568
2679 4568 10066 3071 -6812 -8338 -728 6347 6029 -1083 -6812 -4925 1906 7217 3764 -4546 -8255
2694 -8255 -1535 8038 8128 -2664 -10686 -5634 7317 11630 1460 -10305 -8613 3522 10716 3973
2708 3973 -6685 -8117 701 7547 5030 -3437 -7023 -2768 4247 6650 1657 -5418 -7650 -1409 6968
2723 6968 7966 -906 -9514 -6483 5134 10088 2616 -8323 -8294 3269 10721 4308 -7883 -9509 896
2738 896 10051 6627 -4009 -9107 -3609 4959 7210 1757 -4993 -6113 -1243 4864 5417 -1031 -7004
2753 -7004 -4768 4105 8835 1837 -8484 -8957 2476 11531 6451 -6972 -11274 -1405 9619 8343
2767 8343 -2923 -8811 -3082 5897 6752 -166 -6199 -4315 2291 6177 3655 -3274 -7267 -4047 3970
2782 3970 8276 3088 -6737 -9267 -313 9259 6945 -4543 -10289 -2260 9192 8100 -3607 -10462
2796 -10462 -3356 7924 9398 -486 -8455 -6037 2518 7581 4006 -2653 -5922 -3066 2976 5778
2810 5778 1904 -4544 -6453 -107 7297 5371 -4611 -10177 -2537 9082 9730 -2314 -11504 -6268 6327
2825 6327 10437 1392 -8185 -6505 2846 7704 2681 -4352 -5622 -144 5158 4952 -581 -5707 -5558
2840 -5558 1022 7181 5794 -3172 -9614 -4385 6241 9329 315 -9558 -6754 4687 9645 1173
2854 1173 -9108 -7296 3971 10027 3631 -6537 -8106 -225 7040 5932 -521 -5560 -4365 931
2868 931 5122 3736 -1791 -5885 -2967 4455 6779 -265 -8476 -6504 4787 10596 2753 -9048 -9730
2883 -9730 1716 10504 6009 -5444 -8830 -1349 6854 5534 -1921 -6228 -2354 3720 5738 1706
2897 1706 -4077 -5515 -1297 5460 6995 -1 -7673 -7044 2342 9358 4307 -6178 -9054 124 8786
2912 8786 5352 -5490 -9164 -1071 8301 6466 -3456 -8803 -3710 5088 7463 1536 -4957 -5467 -968
2927 -968 4711 4912 418 -5082 -4683 1792 6991 3417 -5508 -7874 121 9057 6680 -4898 -10766
2942 -10766 -3223 7932 8612 -1438 -8986 -5072 3960 7277 1111 -5324 -5026 1132 5307 3316 -2005
2957 -2005 -5211 -2876 3267 6654 3217 -5148 -7443 -757 7684 6928 -2300 -9148 -4005 6174 8230
2972 8230 -806 -8765 -5325 4762 8257 1005 -7296 -6779 1770 7432 4193 -2835 -6306 -2692 3482
2987 3482 5570 2377 -3798 -5502 -508 5874 5540 -2022 -7634 -3273 6079 8363 -81 -8744 -6781
3002 -6781 4112 9471 2911 -6853 -7825 614 7036 4305 -3598 -6298 -1701 4082 4940 60 -4837
3017 -4837 -4280 962 5815 4178 -2473 -7088 -3354 5028 8021 1207 -7189 -6446 2967 8528 3311
3032 3311 -5912 -7343 644 7691 4806 -3944 -7894 -2036 5387 6095 -222 -6051 -4831 1283 5619
3047 5619 3820 -2417 -6053 -2492 4016 6388 753 -6073 -5570 2326 8028 3662 -5609 -7755 89
3062 89 8172 5982 -3141 -8324 -2797 5436 6390 -193 -6310 -4701 2150 5741 2465 -3712 -5762 -1672
3078 -1672 4406 5508 -195 -6092 -5063 2048 7346 3914 -4478 -7369 -724 7031 6224 -2463 -7775
3093 -7775 -3387 5536 7193 111 -6676 -5092 2457 6934 2626 -4262 -6036 -1214 4725 5019 -519
3108 -519 -5686 -4415 2139 6315 2655 -4341 -6500 -638 6540 5681 -2346 -7234 -3218 4976 7276
3123 7276 667 -6418 -5286 2249 7095 3282 -4330 -6151 -905 5251 5182 -1188 -6041 -3992 2860
3138 2860 5991 2131 -4524 -6240 -357 5862 4927 -2263 -6807 -3589 4492 7003 937 -5953 -5730
3153 -5730 2165 7015 3387 -3963 -6318 -944 5691 5398 -1322 -6232 -3727 2903 6156 1974 -4827
3168 -4827 -5839 -132 5565 4358 -2387 -6488 -3091 4333 6038 527 -5665 -5252 1999 6566 3608
3183 3608 -3851 -6398 -1163 5662 5630 -1157 -6355 -3815 3209 6369 1953 -5009 -5885 290 6046 4472
3199 4472 -2785 -6619 -2708 4198 6018 74 -5783 -4950 1600 6308 3077 -3527 -6204 -1294 5243
3214 5243 5349 -771 -5747 -3652 3030 6447 1977 -4716 -5613 137 6230 4555 -2747 -6367 -2420
3229 -2420 4574 5606 28 -5762 -4769 1698 5982 2714 -4024 -5983 -1041 5018 4730 -1012 -5750
3244 -5750 -3924 2663 6183 2245 -4510 -5632 160 5965 4855 -2358 -6497 -2580 4915 6014 -85
3259 -85 -6071 -4649 2167 6187 2548 -4034 -5801 -674 5065 4189 -1000 -5415 -3369 2472 5253 1813
3275 1813 -4047 -5107 119 5533 4550 -2071 -6357 -2518 4771 6390 249 -6084 -4645 2403 6508
3290 6508 2599 -4475 -5816 -227 5209 4011 -1708 -5503 -2372 2942 4967 1234 -4027 -5054 -188
3305 -188 5157 4494 -1855 -6115 -3019 3799 6238 792 -5725 -4839 2154 6696 2852 -4702 -5848 39
3321 39 6042 4449 -2359 -5741 -2414 3255 4815 807 -3986 -4342 199 4033 3503 -1815 -5170 -2759
3337 -2759 3345 5813 762 -5570 -5268 1863 6959 3713 -4451 -6478 -568 5906 5246 -1917 -5883
3352 -5883 -2181 3952 4953 305 -4500 -3565 1351 4382 2850 -2179 -4731 -2522 2974 5155 1136
3367 1136 -4842 -5287 781 6013 3817 -3327 -6333 -850 5709 5133 -2218 -6534 -2221 4628 6074
3382 6074 -86 -5270 -4211 1560 4970 2750 -2316 -4437 -1555 2691 4074 694 -4037 -4415 453
3397 453 5081 3319 -3158 -6337 -1400 5542 5894 -1505 -6991 -3761 4139 6547 981 -5371 -4215
3412 -4215 1692 5359 2122 -3171 -4163 -169 3684 3473 -587 -3989 -3365 757 4650 3263 -2599 -5582
3428 -5582 -2267 4159 5588 -399 -6249 -3766 3224 6052 877 -5881 -4828 2353 6486 2440 -4023
3443 -4023 -5050 -376 4749 3886 -394 -3842 -2715 1047 3853 2386 -1624 -4197 -1680 3393 4427
3458 4427 -496 -5720 -4169 2880 6924 1434 -5653 -6224 1321 6808 3602 -3677 -5613 -513 4779
3473 4779 3599 -1618 -4197 -1632 2510 3695 1088 -2545 -3412 -665 3517 4166 27 -4601 -4365 1856
3489 1856 5816 2541 -4392 -6170 127 5980 3782 -3614 -6045 -667 5584 4665 -2061 -5648 -2280
3504 -2280 3537 4574 853 -3207 -3500 -132 3028 3234 -148 -3131 -2982 1328 4512 2161 -3498 -4953
3520 -4953 328 5867 4204 -3375 -6764 -2063 5316 5532 -1345 -5675 -3087 2839 4740 637 -3851
3535 -3851 -2949 991 3673 1902 -1619 -3443 -1552 2019 4299 1911 -3092 -5020 -808 4865 4823 -1536
3551 -1536 -5843 -2823 4079 5503 -739 -5689 -3354 3416 5690 361 -5029 -4242 1543 4854 2397
3566 2397 -2004 -3753 -1558 2047 3429 1186 -2115 -3306 -308 3448 3212 -1158 -4703 -2201 4042
3581 4042 5513 26 -5971 -4457 2918 6424 1918 -4787 -4977 604 4898 2394 -2566 -4041 -632
3596 -632 3024 2619 -260 -3034 -2728 638 3798 3066 -1450 -4535 -2324 2907 5510 1096 -4723 -4532
3612 -4532 1671 5881 2375 -4280 -5002 708 5234 2795 -3213 -5300 -792 4113 3719 -640 -3805
3627 -3805 -2609 904 3303 2268 -1193 -3130 -1587 2079 3755 736 -3652 -3488 1717 5256 2392
3642 2392 -3780 -5475 107 5682 4008 -2566 -5521 -1705 3732 4313 -361 -4168 -2759 1816 3510
3657 3510 1248 -2356 -3170 -817 2819 3219 197 -3358 -3471 1104 4925 3131 -2646 -5012 -727 4716
3673 4716 4451 -1642 -5185 -1874 3883 4761 -527 -4870 -3027 2806 4113 1071 -3099 -3553 -240 2761
3689 2761 2672 -243 -3272 -2459 547 3573 2210 -2114 -4086 -603 4225 3948 -1372 -5307 -2448 3866
3705 3866 5196 68 -4690 -3536 2032 4764 1834 -3145 -3803 -66 3355 2558 -1005 -3244 -1759
3720 -1759 1623 3251 1360 -2525 -3940 -815 3681 3788 -695 -4657 -2632 2667 4966 810 -4184
3735 -4184 -3654 1814 5007 1703 -3184 -4040 357 3863 2951 -1459 -3897 -1950 1872 3509 1025 -2628
3751 -2628 -3322 -535 3066 2836 -849 -3918 -2509 2521 4199 566 -3919 -3801 1137 5002 2380 -3025
3767 -3025 -4414 -358 4126 3419 -1139 -3940 -1711 2338 3381 579 -2809 -3130 303 3052 2271 -1237
3783 -1237 -3705 -1867 2021 3771 581 -3583 -3671 783 4463 2469 -2494 -4214 -769 3958 3428 -1197
3799 -1197 -4229 -1904 2763 3855 565 -3018 -3029 554 3684 2223 -1430 -3705 -1561 2135 3394
3814 3394 560 -3382 -3242 620 3838 2125 -2526 -4154 -679 3544 3356 -900 -4104 -2099 2488
3829 2488 4086 873 -3165 -3034 775 3807 2469 -1773 -3396 -1222 2551 3414 197 -3172 -2907 871
3845 871 3814 2151 -2491 -3885 -840 3345 3279 -936 -4256 -2433 2103 4119 941 -3058 -3346 591
3861 591 3814 2460 -1808 -3580 -1197 2621 3306 66 -3350 -2406 1286 3591 2017 -2335 -3324 -727
3877 -727 3046 3100 -955 -3734 -2505 1910 3652 794 -3016 -3055 517 3744 2223 -1533 -3725 -1038
3893 -1038 2910 3401 66 -3320 -2670 1201 3784 1749 -2317 -3213 -254 3419 2974 -887 -3539 -1892
3909 -1892 2088 3503 619 -3072 -3185 560 3320 2195 -1671 -3541 -1337 2518 3281 -142 -3380
3924 -3380 -2696 1386 3747 1566 -2391 -3739 -363 3239 2914 -839 -3426 -1462 2044 3486 468
3939 468 -2881 -2943 549 2983 1987 -1529 -3505 -1319 2311 3068 96 -3197 -2825 917 3717 1766
3955 1766 -2076 -3592 -304 3387 3099 -1058 -3535 -1778 2256 3582 422 -3014 -2877 881 3391
3970 3391 1756 -1596 -3141 -983 2298 3016 248 -2778 -2671 625 3284 1862 -2305 -3544 -545
3985 -545 2914 2950 -961 -3976 -2102 2670 3799 534 -3208 -2908 816 3308 1729 -1948 -2950 -536
4001 -536 2329 2879 -219 -2823 -2176 834 3166 1640 -1976 -3526 -889 2886 3131 -834 -3655 -2194
4017 -2194 2337 3867 458 -3235 -2911 1227 3710 1541 -2148 -3307 -322 2815 2552 -341 -2679
4032 -2679 -1817 1102 2609 899 -1634 -2745 -667 2411 2572 -695 -3459 -2047 1832 3697 890
4047 890 -3075 -3496 882 4011 1963 -2208 -3387 -437 2810 2614 -855 -2855 -1560 1701 2769 782
4063 782 -2022 -2572 -246 2367 2421 -454 -2931 -2268 1239 3394 1083 -2778 -3342 289 3625 1830
4079 1830 -2435 -3748 -658 3015 2805 -901 -3436 -1599 1833 2988 438 -2218 -2273 122 2282 1946
4095 1946 -395 -2219 -1571 1086 2910 1097 -2471 -3185 402 3613 2397 -1974 -4074 -1351 3248
4110 3248 3268 -657 -3900 -1751 2032 3007 444 -2735 -2173 678 2274 1270 -1198 -2205 -1100 1604
4126 1604 2776 902 -2023 -2839 -461 2880 2497 -1365 -3439 -1170 2596 3340 -501 -3613 -2151 2181
4142 2181 3358 458 -3044 -2426 973 2834 1799 -1379 -2385 -738 1507 2162 576 -1784 -1994 -148
4158 -148 2354 2257 -836 -3136 -1234 2532 3634 -47 -3760 -2617 1664 4029 1042 -3159 -3203 384
4174 384 3011 1431 -1812 -2469 -522 2083 1813 -324 -1727 -1311 629 2243 1799 -608 -2578 -1411
4190 -1411 1743 3425 574 -2773 -2926 951 3615 1202 -2785 -2913 502 3603 1838 -2302 -3120 -511
4206 -511 2654 2377 -663 -2323 -1549 804 1931 1258 -788 -2202 -849 1212 2480 526 -2489 -2560
4222 -2560 824 3383 1481 -2431 -3505 88 3648 2605 -1668 -3616 -1004 2323 2451 -668 -2609
4237 -2609 -1388 1142 1985 402 -1403 -1727 -309 1690 1978 166 -2129 -1988 773 2952 2038 -1657
4253 -1657 -3288 -673 2895 2856 -984 -3192 -1003 2563 3177 -659 -3499 -1749 1661 2913 619 -2072
4269 -2072 -2113 30 1866 1652 -233 -1747 -1623 342 1946 1429 -1144 -2466 -255 2708 2643 -769 -3204
4286 -3204 -1472 2463 3566 129 -3098 -2275 1410 3065 943 -1949 -2059 75 2022 1375 -894 -2021
4302 -2021 -1077 820 1827 707 -1428 -2214 -560 2150 2723 -200 -3121 -2103 1793 3000 487 -2776
4318 -2776 -2302 1386 3364 1169 -2458 -2653 282 2858 1782 -1089 -2372 -977 1531 1752 552 -1460
4334 -1460 -1703 -327 1482 1770 -369 -2318 -1588 1360 2860 773 -2621 -2622 1101 3252 1598 -2195
4350 -2195 -3330 -16 2980 2379 -1133 -2637 -806 1594 2153 -6 -1481 -1422 325 1687 1221 -756
4366 -756 -2208 -1347 1136 2611 511 -2123 -2688 493 2854 1905 -1748 -3084 -417 2686 2304 -933
4382 -933 -2892 -753 2203 2419 126 -2305 -1773 645 2043 1413 -981 -1932 -794 1241 2016 345
4398 345 -1798 -2044 244 2417 1832 -1558 -2916 -663 2607 2701 -825 -3089 -1312 2143 2944 237
4414 237 -2197 -1847 645 2414 1202 -1135 -1779 -467 1330 1790 17 -1943 -1695 321 2364 1567
4430 1567 -1220 -2555 -847 1997 2344 -327 -2683 -1527 1767 2499 252 -2410 -2086 910 2773 1082
4446 1082 -1359 -2063 -122 1971 1827 -54 -1790 -1430 638 1879 1160 -1322 -2409 -512 1860 1977
4462 1977 -593 -2622 -1743 1625 2837 587 -2395 -2426 603 2733 1513 -1453 -2276 -317 2042 1787
4478 1787 -517 -1775 -977 881 1895 896 -1403 -2013 -363 1712 1797 -380 -2388 -1645 1227 2376
4494 2376 709 -2049 -2185 367 2307 1488 -1339 -2461 -489 1934 2107 -277 -2092 -1069 950 2119
4510 2119 981 -1237 -1964 48 1978 1815 -455 -2021 -1189 1125 2434 693 -1890 -2012 272 2234
4526 2234 1252 -1416 -2605 -626 1979 2111 -238 -2277 -1664 1108 2217 680 -1649 -2035 1 1956
4542 1956 1628 -618 -2068 -949 1091 2132 506 -2080 -1908 427 2101 1400 -1222 -2260 -510 1718
4558 1718 2137 -311 -2250 -1466 1095 2182 586 -1820 -1948 11 2029 1679 -837 -2303 -1153 1668
4574 1668 2107 52 -1912 -1643 557 2234 1224 -1065 -2023 -798 1811 1772 -372 -2072 -1471 969
4590 969 2561 688 -1880 -2035 -37 1824 1490 -710 -2201 -1107 1500 1922 231 -1835 -1594 588
4606 588 2288 1097 -1439 -1911 -342 1777 1829 -377 -1975 -1303 981 2115 687 -1361 -2007 55
4622 55 1968 1504 -701 -2461 -1144 1397 2121 319 -2021 -1841 585 2334 953 -1328 -2080 -383
4638 -383 1742 1951 -299 -1707 -780 1070 1851 648 -1567 -1658 -111 1813 1473 -546 -1976 -1089 1170
4655 1170 1891 336 -1742 -1653 262 2228 1132 -1615 -2377 -473 1797 1869 -567 -2369 -1070 1229
4671 1229 1804 533 -1563 -1418 345 1851 1365 -399 -1787 -1052 1210 1931 375 -1637 -1927 200
4687 200 2188 1299 -1411 -2316 -505 1915 1893 -415 -2246 -967 1246 1844 469 -1412 -1498 526 1679
4704 1679 960 -849 -1927 -583 1228 1422 427 -1663 -1530 285 2011 1392 -1070 -2324 -485 1882
4720 1882 1702 -193 -2486 -1222 1317 2080 77 -1885 -1526 561 1732 1013 -1156 -1779 -287 1401
4736 1401 1351 220 -1347 -1288 389 1881 1113 -788 -1672 -546 1746 1955 -153 -2214 -1187 1119 2328
4753 2328 341 -2020 -1834 420 2190 996 -1069 -1853 -325 1283 1452 -213 -1470 -882 496 1645
4769 1645 852 -764 -1667 -421 1483 2109 231 -1957 -1447 831 2368 760 -2040 -2000 313 2311
4785 2311 1155 -1490 -2203 -258 1773 1492 -655 -1601 -911 612 1578 651 -847 -1146 -402 1003 1537
4802 1537 289 -1746 -1378 753 2148 685 -1873 -2107 239 2443 1428 -1357 -2254 -539 1729 1492
4818 1492 -652 -1835 -1031 1100 1502 273 -1300 -1559 16 1027 1403 -231 -1461 -1230 703 1993
4834 1993 874 -1286 -1908 -187 1994 1774 -811 -2124 -497 2105 1647 -549 -2332 -1053 1136 1752
4850 1752 203 -1437 -1096 189 1309 984 -493 -1177 -1138 564 1348 738 -946 -1422 -184 1598 1699
4867 1699 -758 -2054 -665 1864 2185 53 -2363 -1263 1038 2169 451 -1601 -1480 399 1470
4882 1470 672 -900 -1271 -594 925 1298 521 -828 -1460 -56 1655 1501 -249 -1855 -1221 1411 1992
4899 1992 89 -1989 -1542 975 2207 472 -1703 -1668 484 1952 881 -1097 -1633 -283 1119 1013
4915 1013 11 -969 -1133 -110 1129 1102 -460 -1646 -946 1262 2042 208 -1828 -1638 1037 2488 701
4932 701 -1817 -1941 93 2282 1240 -966 -1641 -322 1290 1334 -440 -987 -761 383 1136 847 -599
4949 -599 -1438 -859 854 1291 535 -1476 -1607 366 2180 1209 -1427 -1934 -10 1903 1252 -881 -2000
4966 -2000 -550 1626 1551 -206 -1801 -884 694 1200 541 -783 -1040 -548 701 1263 -17 -968 -1274
4983 -1274 393 1717 945 -1215 -1962 -51 1780 1818 -705 -2191 -764 1933 1875 -79 -1653 -1063 691
5000 691 1410 308 -784 -1310 148 1105 919 -59 -1068 -1045 505 1283 1022 -743 -1862 -193 1528
5017 1528 1673 -629 -2104 -994 1372 1942 70 -1915 -1139 924 1739 442 -1099 -1352 250 1355
5033 1355 1054 -196 -1096 -741 473 1459 748 -919 -1414 -509 1257 1451 -232 -1703 -1001 1101 1836
5050 1836 7 -2020 -1383 704 1915 585 -1368 -1559 179 1478 1184 -562 -1229 -405 704 1186
5066 1186 443 -967 -983 -196 1099 1282 -337 -1609 -1165 1014 1843 421 -1673 -1507 549 1979 773
5083 773 -1226 -1757 107 1742 1422 -852 -1529 -709 847 1358 191 -924 -987 52 1156 1101 -277
5100 -277 -1115 -822 772 1474 413 -1445 -1559 374 1894 732 -1019 -1764 -66 1693 1281 -813 -1862
5117 -1862 -654 977 1397 307 -1179 -927 353 1364 713 -472 -1280 -681 798 1389 382 -1153
5133 -1153 -1383 357 1728 828 -845 -1480 -258 1483 1275 -624 -1661 -836 1194 1507 -86 -1341
5149 -1341 -982 472 1283 808 -498 -1117 -503 842 1108 275 -1203 -1099 236 1158 910 -780 -1669 -317
5167 -317 1475 1308 -190 -1526 -983 881 1700 183 -1390 -1020 304 1541 544 -689 -1077 -320 831
5184 831 1192 113 -1102 -971 285 1455 648 -775 -1394 -66 1321 1343 -233 -1608 -852 834 1471
5201 1471 362 -1167 -1313 261 1500 648 -729 -1495 -393 1038 976 -202 -1293 -738 703 1051 520
5218 520 -631 -1354 -184 985 1143 -239 -1296 -695 720 1416 285 -1160 -1370 285 1596 710 -1082
5235 -1082 -1563 -421 1119 1425 -249 -1295 -873 436 1225 463 -1115 -1016 -52 1171 1216 -203 -991 -550
5253 -550 867 1407 497 -1097 -1050 299 1478 886 -776 -1380 -182 935 1291 -34 -1575 -815 731
5270 731 1444 388 -1163 -1161 33 1206 1001 -435 -1267 -554 787 1394 166 -1303 -1100 285 1395
5287 1395 750 -780 -1381 -61 1102 1099 -31 -1198 -706 595 1390 609 -1136 -1385 130 1155 1066 -358
5305 -358 -1395 -704 792 1312 83 -996 -1046 319 1181 695 -630 -1218 -293 958 922 -204 -940 -965
5323 -965 695 1241 396 -876 -1254 98 1202 955 -434 -1444 -816 850 1458 -83 -1214 -1083 425
5340 425 1255 643 -730 -1169 -25 997 716 -291 -1239 -612 569 1397 460 -727 -997 43 1104
5357 1104 1128 -350 -1317 -619 795 1317 90 -1360 -1270 478 1373 717 -914 -1268 29 1214 950 -420
5375 -420 -1323 -782 715 1061 196 -714 -1003 -69 1205 941 -319 -1203 -631 757 1423 315 -1080 -1133
5393 -1133 469 1372 812 -842 -1316 -247 1484 982 -543 -1278 -567 445 1050 -95 -966 -1149 115
5410 115 1018 716 -295 -997 -483 624 1285 549 -953 -1066 139 1469 930 -831 -1295 -118 1359
5427 1359 1147 -264 -1231 -619 756 1180 -36 -1163 -1000 248 888 570 -563 -979 -273 904 1025
5444 1025 321 -849 -1023 -55 1377 838 -694 -1137 -108 1137 1151 -139 -1521 -730 678 1275 217
5461 217 -1062 -906 332 859 502 -557 -1089 -428 823 1001 -10 -929 -883 71 1029 916 -626 -1298
5479 -1298 -465 1061 1093 35 -1402 -871 807 1495 332 -1426 -1087 612 1319 522 -817 -1198 -193
5496 -193 798 713 -179 -814 -784 191 753 651 -152 -1175 -291 845 1131 -85 -1186 -1002 909 1402 456
5515 456 -1123 -1025 298 1247 649 -626 -1177 -160 825 841 -231 -997 -621 388 966 467 -545 -1011
5533 -1011 -274 744 891 143 -1051 -921 527 1297 397 -1128 -1332 248 1374 971 -877 -1478 -32
5550 -32 1356 703 -385 -1075 -584 613 638 181 -442 -638 -336 596 854 36 -772 -747 344 1363 539
5569 539 -715 -1247 60 1214 1091 -566 -1712 -358 1265 1325 -223 -1123 -831 627 1118 100 -413
5586 -413 -596 189 611 427 -179 -749 -458 435 1067 421 -681 -1437 -21 1127 1133 -449 -1491 -560 843
5605 843 1179 -257 -1360 -774 881 1500 350 -1012 -778 396 767 695 -386 -818 -181 541 781 432
5623 432 -743 -907 -174 979 982 -462 -1251 -575 925 1283 44 -1286 -1040 639 1424 476 -1089 -745
5641 -745 482 833 344 -734 -1007 -318 595 744 103 -738 -705 142 726 653 -238 -998 -761 574 1496 337
5661 337 -1074 -909 446 1294 361 -900 -898 201 1200 1072 -342 -1036 -167 766 664 -95 -582 -697 306
5680 306 682 426 -67 -773 -581 621 1016 433 -1033 -1141 409 1306 613 -921 -1318 -143 1203 900
5698 900 -322 -1300 -197 878 987 -425 -910 -603 483 762 418 -175 -437 -331 589 825 220 -894
5716 -894 -938 114 1116 683 -514 -1228 -50 1168 930 -249 -1367 -78 833 957 -148 -1072 -639
5733 -639 510 917 245 -544 -845 -192 613 607 -42 -815 -685 277 910 756 -663 -991 -206 1151 1120 -367
5753 -367 -1226 -462 833 1251 -5 -1021 -914 328 918 253 -634 -842 166 683 651 -66 -658 -552 312
5772 312 788 393 -393 -1057 -333 763 1126 -79 -1267 -631 877 1314 172 -1028 -906 467 1048 550
5790 550 -928 -972 -43 761 615 -189 -892 -508 436 785 222 -366 -673 103 656 706 -285 -1091 -866 500
5810 500 1027 252 -1014 -929 414 1057 573 -767 -1047 -113 1061 829 -29 -972 -251 692 970 166 -738
5829 -738 -688 34 790 574 -462 -1024 -571 674 949 362 -586 -991 315 1123 851 -844 -1216 -22 886
5848 886 579 -334 -1171 -640 618 657 151 -959 -629 98 615 510 -388 -760 -590 463 591 167 -671
5867 -671 -807 178 961 816 -576 -1218 -262 733 835 -420 -1154 -447 678 929 13 -890 -792 354 755
5886 755 469 -576 -678 -489 609 734 -110 -732 -867 55 822 592 -423 -828 -346 1006 860 -206
5904 -206 -956 -343 515 1022 27 -801 -643 -2 928 529 -445 -892 -415 568 729 -144 -846 -694 13 617
5924 617 606 -417 -685 -279 740 706 110 -893 -472 554 830 228 -653 -821 -1 764 715 -516 -874
5943 -874 -116 375 780 77 -716 -637 282 824 314 -627 -863 -130 887 762 -253 -933 -663 430 835
5962 835 175 -792 -816 -102 1003 576 -351 -696 -191 712 1027 111 -888 -724 272 912 565 -443 -1095 -8
5982 -8 767 480 -220 -1108 -363 405 891 132 -754 -675 132 998 414 -752 -886 -563 690 669 6 -630 -468
6003 -468 240 819 359 -625 -1063 -231 554 654 -311 -783 -526 775 895 -63 -670 -589 152 686 533 -609
6023 -609 -978 -449 392 783 184 -829 -786 191 949 321 -547 -739 -108 785 682 -79 -1039 -544 469 1139
6043 1139 208 -884 -768 288 772 412 -695 -762 -124 419 750 89 -619 -545 323 733 350 -770 -805
6062 -805 -163 833 577 -55 -951 -511 467 1108 228 -663 -713 174 890 500 -474 -734 -360 602 676 -59 -836
6083 -836 -571 355 787 406 -560 -692 -234 698 762 55 -715 -512 535 1060 321 -911 -861 -69 930 455
6103 455 -524 -1037 -115 616 804 -192 -663 -437 375 829 337 -468 -820 -13 502 509 -162 -762 -488 300 989
6124 989 257 -816 -756 234 1201 669 -209 -807 90 986 600 -199 -957 -575 418 811 86 -529 -520 -36 347
6145 347 614 -166 -801 -659 535 703 227 -509 -740 -68 917 624 -540 -1046 -226 1026 633 -61 -922
6164 -922 -111 380 705 440 -686 -495 120 764 225 -207 -620 -520 208 715 339 -593 -774 -94 968
6183 968 521 -611 -877 -414 634 871 -99 -541 -362 564 994 219 -695 -494 172 626 337 -365 -553
6202 -553 -282 360 423 148 -559 -597 -180 670 794 -481 -913 -383 733 994 -19 -922 -820 430 1059
6221 1059 331 -766 -583 247 900 831 -564 -580 5 427 454 -2 -617 -516 -55 377 456 -316 -690 -430
6241 -430 570 787 88 -945 -810 347 960 317 -936 -1021 167 1111 463 -520 -892 -155 362 593 -43
6260 -43 -579 -333 158 433 473 45 -594 -239 373 698 -144 -584 -736 175 815 351 -460 -1037 -4 1057
6280 1057 478 -391 -917 -265 674 920 -9 -527 -367 258 413 370 -368 -479 -96 682 578 162 -447 -759
6300 -759 232 673 433 -335 -968 -194 986 609 -533 -1066 -62 596 779 -72 -860 -279 213 696 45
6319 45 -421 -550 -52 302 600 179 -328 -358 265 615 572 -242 -923 -118 625 790 -287 -853 -312 869
6339 869 950 89 -1037 -589 401 697 317 -635 -370 -30 491 681 -89 -437 -179 294 658 407 -391 -819
6359 -819 -280 596 624 -159 -830 -372 809 963 118 -830 -548 256 892 278 -479 -681 21 716 256 -295
6379 -295 -873 -18 176 410 274 -239 -509 -175 404 505 -1 -697 -461 434 905 205 -647 -733 99 1141
6399 1141 305 -554 -805 -133 879 410 -342 -732 -83 145 550 30 -596 -767 -106 595 304 52 -496
6418 -496 -337 267 564 100 -713 -804 251 999 472 -529 -757 105 756 670 -371 -821 -189 523 435 -158
6438 -158 -531 -411 332 534 597 -23 -361 -256 187 516 182 -707 -449 146 758 496 -390 -837 -159 515
6458 515 697 -194 -901 -100 508 749 -139 -307 -595 28 602 148 -312 -431 -127 406 542 315 -514 -461
6478 -461 92 330 494 -453 -724 -386 720 856 -237 -726 -503 378 763 197 -590 -722 46 862 273
6497 273 -444 -423 96 324 354 125 -550 -462 135 202 341 -142 -654 -170 418 989 -95 -973 -605 479 729
6518 729 226 -624 -481 104 759 421 -502 -753 81 546 612 -195 -432 -397 -22 413 60 -315 -796 -208 655
6539 655 671 -47 -545 -433 430 879 363 -387 -634 347 857 363 -447 -861 62 570 598 -40 -648 -339 124
6560 124 719 168 -392 -577 -2 415 441 176 -744 -397 375 699 107 -397 -647 105 923 485 -376 -805
6580 -805 -108 631 564 8 -655 -522 465 639 305 -382 -445 221 469 379 -211 -790 -492 407 578 265 -641
6601 -641 -589 169 767 459 -86 -546 -196 509 403 -115 -765 -461 390 651 339 -451 -492 154 675 304 -257
6622 -257 -431 -375 289 331 291 -398 -588 -169 614 636 -255 -698 -288 648 507 -252 -533 -478 151 654 46 -398
6644 -398 -430 293 712 336 -163 -531 -126 146 584 86 -449 -768 23 490 322 -281 -618 -114 491 402 234
6665 234 -575 -452 373 472 280 -530 -724 6 535 380 -231 -634 -166 358 667 209 -421 -373 379 669 363
6686 363 -264 -493 -83 642 664 58 -575 -342 172 600 313 -311 -444 38 408 561 -396 -555 -346 386
6706 386 528 156 -345 -444 139 861 582 -372 -582 -205 624 521 39 -505 -314 114 585 243 -465 -484 -213
6727 -213 433 463 -122 -621 -460 414 467 106 -557 -606 63 634 299 -130 -547 -94 673 668 146 -620 -226 88
6749 88 668 155 -400 -660 -27 656 268 -239 -689 -418 210 561 74 -564 -710 -43 717 445 -198 -304
6769 -304 -420 499 418 -139 -593 -371 346 632 -69 -413 -336 115 593 393 -258 -413 -92 357 791 122 -559
6790 -559 -496 251 413 417 -378 -511 -469 329 659 -11 -623 -573 305 763 83 -544 -465 296 775 119 -408 -401 -170
6813 -170 452 478 278 -549 -367 103 407 365 -106 -621 -562 564 801 1 -539 -377 255 537 387 -420 -596
6834 -596 120 744 314 -42 -567 -139 355 357 62 -533 -375 59 334 310 -116 -648 -322 259 359 243 -500
6855 -500 -578 338 713 282 -261 -601 -135 679 235 -328 -701 -135 558 457 -177 -408 -88 40 572 225
6875 225 -257 -461 165 448 741 -52 -459 -337 220 330 253 -405 -702 120 748 372 -232 -592 21 310
6895 310 546 19 -686 -273 193 444 91 -288 -154 198 510 481 -94 -225 -277 -4 530 297 -403 -601 -61
6916 -61 465 368 -163 -817 -339 344 767 23 -590 -630 118 559 14 -374 -356 167 575 376 -104 -578 -313
6937 -313 259 448 363 -181 -646 -277 578 572 -114 -573 -165 373 807 -116 -654 -533 169 567 152 -511 -432
6958 -432 14 476 454 -340 -388 -113 152 510 86 -296 -289 240 520 368 174 -348 -65 309 696 30 -340
6979 -340 -454 82 645 272 -373 -574 56 546 322 -350 -741 134 281 90 92 -67 -288 -113 485 227 -98
7000 -98 -451 -296 249 749 263 -484 -494 -40 484 322 -308 -510 85 517 515 -400 -633 -251 416 584 -84
7021 -84 -272 -102 104 447 91 -347 -391 -241 241 329 291 -355 -497 -116 552 609 -285 -603 -207 502 699 -381
7043 -381 -586 -153 483 502 -88 -399 -310 117 415 83 -12 -384 -196 378 192 14 -338 -443 89 616 250
7064 250 -253 -217 -200 641 854 -38 -855 -400 470 429 22 -430 -400 324 487 -51 -452 -404 -37 433 319 -7
7086 -7 -360 -323 32 501 422 -281 -439 -132 453 325 -129 -339 -154 470 788 -44 -527 -318 301 552 273
7107 273 -402 -456 41 378 328 -212 -250 -220 59 226 236 -238 -421 -346 233 567 104 -564 -361 256 908 389
7129 389 -524 -417 260 603 227 -446 -560 31 542 300 -41 -455 -146 220 682 220 -318 -404 -145 227
7149 227 340 1 -580 -297 201 652 153 -218 -542 -80 713 544 -293 -742 -261 597 352 -311 -608 -309
7169 -309 180 313 129 -81 -490 16 326 368 -203 -399 -421 423 230 172 -272 -407 -80 466 472 -283 -629 -154
7191 -154 660 303 -198 -470 -118 238 468 35 -320 -348 94 457 517 -208 -246 -26 32 345 -56 -263 -317 29
7213 29 606 197 -82 -465 -350 440 447 -232 -377 -504 90 592 76 -371 -251 294 353 197 -112 -350 -178
7234 -178 292 453 107 -352 -281 -47 490 279 -122 -584 -291 404 447 101 -399 -497 227 561 126 -460 -590
7255 -590 79 541 180 -392 -663 -130 303 345 58 -309 -144 166 525 214 -204 -621 -325 266 298 -15 -761
7276 -761 -627 150 458 11 -340 -268 99 244 472 -249 -499 -81 234 503 67 -404 -366 127 523 192 -59
7297 -59 -163 28 210 286 -19 -657 -519 124 294 297 -596 -420 -220 448 401 -325 -292 -182 333 446 -95 -544
7319 -544 -302 513 420 197 -316 -331 -111 395 240 176 -329 -257 298 576 96 -371 -361 -214 389 315 -170 -509
7341 -509 -411 375 401 135 -397 -362 25 337 150 -219 -366 -27 272 377 -82 -494 -251 158 478 265 -215
7362 -215 -412 -26 235 413 -211 -519 -422 226 273 36 -366 -365 105 325 315 -268 -488 -29 282 227 26 -341
7384 -341 -319 167 266 157 -537 -377 117 407 128 -366 -389 -124 271 456 -53 -588 -273 178 475 130 -306
7405 -306 -433 -302 255 598 144 -315 -466 298 221 167 -372 -636 50 189 248 -3 -400 -29 410 248 192
7426 192 -321 -156 65 433 315 -270 -293 8 338 271 -326 -653 -264 182 214 223 -499 -501 -81 414 148 23
7448 23 -624 -51 281 477 -78 -324 -315 146 535 195 -151 -367 -132 182 439 -255 -412 -320 290 417 181
7469 181 -366 -192 -26 361 215 -13 -635 -147 576 516 171 -558 -311 364 359 445 -341 -430 43 446 311 -62
7491 -62 -387 -415 217 517 276 -262 -463 -86 321 423 -315 -744 -330 602 504 -71 -665 -459 232 544 78
7512 78 -425 -306 -78 144 48 77 -328 -118 161 349 104 41 -432 -4 519 199 -113 -528 -352 0 446
7533 446 166 -607 -300 190 511 105 -190 -117 -22 611 403 -115 -243 -352 285 379 54 -212 -302 -8 315
7554 315 314 -7 -409 -423 127 290 52 -557 -427 119 457 164 -406 -687 -47 335 452 -297 -522 -26 444
7575 444 149 4 -62 -138 42 156 231 -207 -544 -209 142 84 65 -440 -636 293 514 239 -94 -389 92 267
7597 267 201 -124 -364 -47 322 358 -86 -284 -168 187 490 242 -34 -4 -91 126 354 -38 -96 -198 227 566
$$ [...]
8191B73
##END NTUPLES=NMR FID
##END=
