##TITLE=1H_Pr AADA-NCS
 CDCl3
 8 sc, 
 28.06.2022
##JCAMPDX= 6.0         $$ Bruker NMR JCAMP-DX V2.0
##DATA TYPE= NMR FID
##DATA CLASS= NTUPLES
##ORIGIN= UXNMR, Bruker Analytische Messtechnik GmbH
##OWNER= root
$$ XWIN-NMR		Version 3.5
$$ Tue Jun 28 16:27:40 2022 Russian Standard Time (UT+4h)  she@DPX200
##.OBSERVE FREQUENCY= 200.1313499994
##.OBSERVE NUCLEUS= ^1H
##.DELAY= (6, 6)
##.ACQUISITION MODE= SIMULTANEOUS
##.ACQUISITION SCHEME= undefined
##.AVERAGES= 8
##.DIGITISER RES= 18
##SPECTROMETER/DATA SYSTEM= spect
##.PULSE SEQUENCE= zg30
##.SOLVENT NAME= CDCl3
##.SHIFT REFERENCE= (INTERNAL, CDCl3, 0, 15.7039)
##AUDIT TRAIL= $$ (NUMBER, WHEN, WHO, WHERE, WHAT)
$$ ##TITLE= Audit trail, XWIN-NMR		Version 3.5
$$ ##JCAMPDX= 5.01
$$ ##ORIGIN= Bruker BioSpin GmbH
$$ ##OWNER= she
$$ F:/spectra/data/she/nmr/H-F/1/audita.txt
$$ ##AUDIT TRAIL=  $$ (NUMBER, WHEN, WHO, WHERE, WHAT)
(   1,<2022-06-28 16:26:39.35 +0400>,<she>,<DPX200>,
      <created by zg, POWCHK disabled, PULCHK disabled
       configuration hash MD5:
       00 E9 B6 7A A2 85 ED C7 34 08 36 98 17 FE 4E 26
       data hash MD5: 16K
       EC 3C 6E F5 B3 D7 D4 5A F6 C6 15 E4 9D 5F 5B C1>)
$$ ##END=
$$ 
$$ hash MD5
$$ 33 01 80 91 26 0D A6 4B 7E BE 76 8A 64 AD 6C E3
##$RELAX= 
##$RELAX= 
##$RELAX= 
##$RELAX= 
##$RELAX= 
##$RELAX= 
$$ Bruker specific parameters
$$ --------------------------
##$DU= <F:/spectra>
##$EXPNO= 1
##$NAME= <H-F>
##$PROCNO= 1
##$TYPE= <nmr>
##$USER= <she>
##$AMP= (0..31)
100 100 100 100 100 100 100 100 100 100 100 100 100 100 100 100 100 100 
100 100 100 100 100 100 100 100 100 100 100 100 100 100 
##$AQSEQ= 0
##$AQ_mod= 1
##$AUNM= <au_zg>
##$AUTOPOS= <>
##$BF1= 200.13
##$BF2= 200.13
##$BF3= 200.13
##$BF4= 200.13
##$BF5= 200.13
##$BF6= 200.13
##$BF7= 200.13
##$BF8= 200.13
##$BYTORDA= 1
##$CFDGTYP= 0
##$CFRGTYP= 5
##$CHEMSTR= <none>
##$CNST= (0..31)
1 1 145 1 1 1 1 1 1 1 1 1 1 1 1 1 1 1 1 1 1 1 1 1 1 1 1 1 1 1 1 1 
##$CPDPRG= <>
##$CPDPRG1= <>
##$CPDPRG2= <>
##$CPDPRG3= <>
##$CPDPRG4= <mlev>
##$CPDPRG5= <mlev>
##$CPDPRG6= <mlev>
##$CPDPRG7= <mlev>
##$CPDPRG8= <mlev>
##$CPDPRGB= <>
##$CPDPRGT= <>
##$D= (0..31)
0 1.2 0 0 0 0 0 0 0 0.06 0 0.03 0 0 0 0 0.0002 0 0 0 0 0 0 0 0 0 0 0 0 
0 0 0 
##$DATE= 1656419198
##$DBL= (0..7)
120 120 120 120 120 120 120 120 
##$DBP= (0..7)
150 150 150 150 150 150 150 150 
##$DBP07= 0
##$DBPNAM0= <>
##$DBPNAM1= <>
##$DBPNAM2= <>
##$DBPNAM3= <>
##$DBPNAM4= <>
##$DBPNAM5= <>
##$DBPNAM6= <>
##$DBPNAM7= <>
##$DBPOAL= (0..7)
0.5 0.5 0.5 0.5 0.5 0.5 0.5 0.5 
##$DBPOFFS= (0..7)
0 0 0 0 0 0 0 0 
##$DE= 6
##$DECBNUC= <off>
##$DECIM= 32
##$DECNUC= <off>
##$DECSTAT= 4
##$DIGMOD= 1
##$DIGTYP= 9
##$DL= (0..7)
0 120 120 120 120 120 120 120 
##$DP= (0..7)
150 150 150 150 150 150 150 150 
##$DP07= 0
##$DPNAME0= <>
##$DPNAME1= <>
##$DPNAME2= <>
##$DPNAME3= <>
##$DPNAME4= <>
##$DPNAME5= <>
##$DPNAME6= <>
##$DPNAME7= <>
##$DPOAL= (0..7)
0.5 0.5 0.5 0.5 0.5 0.5 0.5 0.5 
##$DPOFFS= (0..7)
0 0 0 0 0 0 0 0 
##$DQDMODE= 0
##$DR= 18
##$DS= 0
##$DSLIST= <SSSSSSSSSSSSSSS>
$$ [...]
##$SUBNAM2= <"">
##$SUBNAM3= <"">
##$SUBNAM4= <"">
##$SUBNAM5= <"">
##$SUBNAM6= <"">
##$SUBNAM7= <"">
##$SUBNAM8= <"">
##$SUBNAM9= <"">
##$SW= 18.0517283424941
##$SWIBOX= (0..15)
0 0 2 0 0 0 0 0 0 0 0 0 0 0 0 0 
##$SW_h= 3612.71676300578
##$TD= 16384
##$TD0= 1
##$TE= 0
##$TE2= 300
##$TE3= 300
##$TEG= 300
##$TL= (0..7)
0 120 120 120 120 120 120 120 
##$TP= (0..7)
150 150 150 150 150 150 150 150 
##$TP07= 0
##$TPNAME0= <>
##$TPNAME1= <>
##$TPNAME2= <>
##$TPNAME3= <>
##$TPNAME4= <>
##$TPNAME5= <>
##$TPNAME6= <>
##$TPNAME7= <>
##$TPOAL= (0..7)
0.5 0.5 0.5 0.5 0.5 0.5 0.5 0.5 
##$TPOFFS= (0..7)
0 0 0 0 0 0 0 0 
##$TUNHIN= 0
##$TUNHOUT= 0
##$TUNXOUT= 0
##$USERA1= <user>
##$USERA2= <user>
##$USERA3= <user>
##$USERA4= <user>
##$USERA5= <user>
##$V9= 5
##$VALIST= <valist>
##$VCLIST= <CCCCCCCCCCCCCCC>
##$VD= 0
##$VDLIST= <DDDDDDDDDDDDDDD>
##$VPLIST= <PPPPPPPPPPPPPPP>
##$VTLIST= <TTTTTTTTTTTTTTT>
##$WBST= 1024
##$WBSW= 4
##$XGAIN= (0..3)
0 0 0 0 
##$XL= 0
##$YL= 0
##$YMAX_a= 588277
##$YMIN_a= -713986
##$ZGOPTNS= <>
##$ZL1= 120
##$ZL2= 120
##$ZL3= 120
##$ZL4= 120
##$ABSF1= 10
##$ABSF2= 0
##$ABSG= 5
##$ABSL= 3
##$ALPHA= 0
##$AQORDER= 0
##$ASSFAC= 0
##$ASSFACI= 0
##$ASSFACX= 0
##$ASSWID= 0
##$AUNMP= <proc_1d>
##$AZFE= 0.1
##$AZFW= 0.1
##$BCFW= 1
##$BC_mod= 2
##$BYTORDP= 1
##$COROFFS= 0
##$CY= 11.3945322036743
##$DATMOD= 1
##$DC= 2
##$DFILT= <>
##$DTYPP= 0
##$F1P= 2.36226072786647
##$F2P= -0.459571619588291
##$FCOR= 0.5
##$FTSIZE= 0
##$FT_mod= 4
##$GAMMA= 1
##$GB= 0.15
##$INTBC= 1
##$INTSCL= 1
##$ISEN= 128
##$LB= 0.24
##$LEV0= 0
##$LPBIN= 0
##$MAXI= 10000
##$MC2= 0
##$MEAN= 0
##$ME_mod= 0
##$MI= 1.114404
##$NCOEF= 0
##$NC_proc= 0
##$NLEV= 6
##$NOISF1= 3.799351
##$NOISF2= 2.8
##$NSP= 1
##$NTH_PI= 0
##$NZP= 0
##$OFFSET= 15.70392
##$PC= 1
##$PHC0= -18067.74
##$PHC1= 26.00069
##$PH_mod= 1
##$PKNL= yes
##$PPARMOD= 0
##$PSCAL= 0
##$PSIGN= 0
##$REVERSE= no
##$SF= 200.130013532006
##$SI= 16384
##$SIGF1= 3
##$SIGF2= 2
##$SINO= 400
##$SIOLD= 16384
##$SREGLST= <1H.CDCl3>
##$SSB= 0
##$STSI= 0
##$STSR= 0
##$SW_p= 3612.71676300578
##$SYMM= 0
##$S_DEV= 0
##$TDeff= 0
##$TDoff= 0
##$TI= <>
##$TILT= no
##$TM1= 0
##$TM2= 0
##$TOPLEV= 0
##$USERP1= <user>
##$USERP2= <user>
##$USERP3= <user>
##$USERP4= <user>
##$USERP5= <user>
##$WDW= 1
##$XDIM= 8192
##$YMAX_p= 0
##$YMIN_p= 0
$$ End of Bruker specific parameters
$$ ---------------------------------
##NTUPLES= NMR FID
##VAR_NAME=  TIME,          FID/REAL,        FID/IMAG
##SYMBOL=    X,             R,               I
##VAR_TYPE=  INDEPENDENT,   DEPENDENT,       DEPENDENT
##VAR_FORM=  AFFN,          ASDF,            ASDF
##VAR_DIM=   8192,          8192,            8192
##UNITS=     SECONDS,       ARBITRARY UNITS, ARBITRARY UNITS
##FACTOR=    0.0002768,     1,               1
##FIRST=     0,             0,               0
##LAST=      2.2672688,     0,               0
##MIN=       0,             -713986,         0
##MAX=       2.2672688,     588277,          0
$$ Real data points
##PAGE= N=1
##DATA TABLE= (X++(R..R)), XYDATA
0@%%%%%%%%%%qJ6j6K1k9L2m0M8n6P2q8J04j21J45j69J95k32K69l09L57m09M66
$$ 0 0 0 0 0 0 0 0 0 0 0 -8 8 -8 13 -16 16 -24 24 -32 40 -48 56 -65 80 -89 106 -126 143 -166 191 -218 248
32B48n31O04o83P71q68R72j090J218j356J511j679J860k059K278k514K773l060
$$ 248 -283 321 -362 409 -459 513 -577 641 -715 796 -883 977 -1082 1196 -1318 1455 -1605
49a605L371l713M092m510M973n489O068o723P474q338R343j0537J1982j3768J6048
$$ -1605 1766 -1947 2145 -2365 2608 -2881 3187 -3536 3938 -4400 4943 -5594 6388 -7380 8668
64H668j9075K3305k9686M0537o3740K01640l40167n24653L68225O28878K94345
$$ 8668 -10407 12898 -16788 23749 -39991 161649 -178518 -703171 -334946 293932 588277
75E88277m12485n57323q9222N26362M52145j59214o11377l12596L29256O22636
$$ 588277 175792 -381531 -470753 55609 507754 348540 -262837 -575433 -246177 376459
85C76459K01383m21573n79157q5794M61988M67431o9308m68689k87896K30550
$$ 376459 577842 156269 -422888 -508682 -46694 420737 351429 -117260 -405156 -174606
95a74606M37083J16238l47557m05463O776M35960L66735j23332m53225k47976
$$ -174606 262477 378715 31158 -374305 -367529 68431 435166 311834 -141391 -389367
105c89367K01006L73559J16160k41345k93780K2744L14413J97923j83709l39905
$$ -389367 -188361 185198 301358 60013 -233767 -211023 103390 301313 117604 -222301
115b22301r1127K59197L14656K1650k84686k57463N9164K79344J42398j59567
$$ -222301 -313428 -54231 260425 282075 -2611 -260074 -200910 78434 220832 61265
125F1265k38038j379K42366J82851j08318k85956j38529J80270L04684P3678k39159
$$ 61265 -176773 -178152 64214 247065 138747 -147209 -285738 -105468 199216 272894 33735
136C3735k51017L4375K53678J49402j32252k54763o4582K32861K71316l3416l22795
$$ 33735 -217282 -182907 70771 220173 87921 -166842 -231424 1437 272753 239337 -83458
147h3458k37593J20597L35167J69979j74834l15559q8556K47938K78521m1305
$$ -83458 -321051 -200454 134713 304692 129858 -185701 -274257 -26319 252202 210897
157B10897l18743k07992J63847L59244J42932k48887l70618p8274L08624L45443
$$ 210897 -107846 -315838 -151991 207253 350185 101298 -269320 -347594 -38970 306473
167C06473j3984l44079k59741J25756L44671J50842k19567l44597n9036L18360
$$ 306473 292489 -51590 -311331 -185575 159096 309938 90371 -254226 -313262 5098
177E098L34097m5405l79155k76927J26769L72090J98731j85915l46611j00797
$$ 5098 339195 293790 -85365 -362292 -235523 136567 335298 149383 -197228 -298025
187b98025K59829K99478k6614l17829k27521J30167L41825J69094j98572l44143
$$ -298025 -38196 261282 234668 -83161 -310682 -180515 161310 330404 131832 -212311
197b12311j00465K50557L04414R245k74410k20082Q5754K70451J32934j62411
$$ -212311 -312776 -62219 242195 251440 -22970 -243052 -157298 113153 246087 83676
207H3676k74316n7815K38970K59811k7126k74353k00930Q4073K56413J35739j32549
$$ 83676 -190640 -248455 -9485 250326 223200 -51153 -252083 -168010 88403 224142 91593
218I1593k32774m7001J89828J81158n2713k16997j18376J18552K20571P0769j60656
$$ 91593 -141181 -188182 1646 182804 130091 -86906 -205282 -86730 133841 204610 43954
229D3954k04040j0144J85307J49898o0338j77530p1125J16174J57088L058j63444
$$ 43954 -160086 -170230 15077 164975 104637 -72893 -144018 -27844 129244 132302 -31142
240c1142j38279N9192J96286R8125j17584j85850l8196J42552J48003j9680j63424
$$ -31142 -169421 -110229 86057 184182 66598 -119252 -157448 -14896 133107 113427 -49997
251d9997j08161R1649J84498M4968j56825j71540J3523J86661J50268n8886k04115
$$ -49997 -158158 -66509 117989 162957 6132 -165408 -151885 34776 185044 126158 -77957
262g7957j10307J16226K01631L8215j65405j68602L1764J99139J33071r3008k20116
$$ -77957 -188264 -72038 129593 167808 2403 -166199 -134435 64704 197775 104767 -115349
273a15349r5137J48753K22425L5981j91052j89024K7729K03488J44167q5226k17928
$$ -115349 -210486 -61733 160692 196673 5621 -183403 -155674 47814 191981 106755 -111173
284a11173r1546J50956K16282K1845j97091j84333L5198K13500J51776q3247k22816
$$ -111173 -202719 -51763 164519 186364 -10727 -195060 -159862 53638 205414 122167 -100649
295a00649j00262J40123K08644L0015j78199j74388L0474K01822J40754q6451
$$ -100649 -200911 -60788 147856 177871 -328 -174716 -144242 57580 198334 111883
305A11883k16966r5327J38436K05159L4271j70339j72426K2947J85085J31311
$$ 111883 -105083 -200410 -61974 143185 177456 7117 -165309 -142362 42723 174034
315A74034p6568j96817q2010J33904J86876J8854j63785j54859K9422J77460J21626
$$ 174034 97466 -99351 -181361 -47457 139419 158273 -5512 -160371 -130949 46511 168137
326A68137p5555j83606o8493J25394J61841P345j49338j28565M0901J62601R4377
$$ 168137 92582 -91024 -159517 -34123 127718 135063 -14275 -142840 -101939 60662 155039
337A55039q7596j67307m5267J26832J43199p865j44645j08853N1769J50698P1595
$$ 155039 67443 -99864 -145131 -18299 124900 117035 -27610 -136463 -84694 66004 137599
348A37599r6291j50194k0927J34239J25858l0826j47368r0580P0250J51065N5244
$$ 137599 41308 -108886 -129813 4426 130284 99458 -47910 -138490 -68240 82825 138069
359A38069j10608j44887n97J43103J13073m9984j51728p6473Q8610J53852L7353
$$ 138069 27461 -117426 -118023 25080 138153 88169 -63559 -140032 -51422 102430 139783
370A39783j29563j42007J6196J52993J06571o3782j58031o7428J00775J53991
$$ 139783 10220 -131787 -115591 37402 143973 80191 -77840 -145268 -44493 109498
380A09498K4610j37219j36466K8240J58296R9766p3956j57607n8967J07411J52253
$$ 109498 134108 -3111 -139577 -111337 46959 146725 72769 -84838 -143805 -36394 115859
391A15859J7425j40954j30825L6364J57208R1394p8598j54286n2957J11217J47876
$$ 115859 133284 -7670 -138495 -102131 55077 146471 67873 -86413 -139370 -28153 119723
402A19723P783j43982j22766M3914J55014Q1943q4215j51511m3195J17231J41002
$$ 119723 127506 -16476 -139242 -95328 59686 141629 57414 -94097 -137292 -20061 120941
413A20941l911j45008j12795N4248J54019P1094r2605j45766k9116J22826J31866
$$ 120941 117030 -27978 -140773 -86525 67494 138588 45983 -99783 -128899 -6073 125793
424A25793j6740j47339r9495O7638J50241N4824j01187j38573j5693J28851J21794
$$ 125793 109053 -38286 -137781 -70143 80098 134922 33735 -104838 -120531 8320 130114
435A30114l3239j48956q5005P9272J45380L9949j10359j32965J118J37280J11095
$$ 130114 96875 -52081 -137086 -57814 87566 127515 17156 -115809 -114691 22589 133684
446A33684m9704j52407p2681R3882J47525K8018j22985j30305J6108J46576J05183
$$ 133684 83980 -68427 -141108 -47226 100299 128317 5332 -124973 -108865 37711 142894
457A42894o4665j59814o2097J10761J51040J4692j38539j33013K8735J60823J04105
$$ 142894 78229 -81585 -143682 -32921 118119 132811 -5728 -138741 -110006 50817 154922
468A54922p9485j69026n6237J20431J53492P629j48205j33077L9498J69768J00045
$$ 154922 75437 -93589 -149826 -29395 124097 131726 -16479 -149556 -110058 59710 159755
479A59755q9027j72745n3264J25598J55734O937j47201j29711M0879J63611R2986
$$ 159755 70728 -102017 -155281 -29683 126051 132988 -14213 -143924 -103045 60566 153552
490A53552q9512j65111m3893J26722J47906K22j46702j25124M0833J58594Q8619
$$ 153552 64040 -101071 -144964 -18242 129664 129886 -16816 -141940 -101107 57487 146106
501A46106q5811j53168l7312J15768J30313p392j37575j07499N1483J52018P1167
$$ 146106 60295 -92873 -130185 -14417 115896 108504 -29071 -136570 -85087 66931 138098
512A38098r1851j43094k7078J13929J19582j3861j26611q6317N7488J31887M4968
$$ 138098 46247 -96847 -123925 -9996 109586 95725 -30886 -117203 -59715 72172 117140
523A17140r7536j21233M82J20150R8409l5994j26794p0133O7576J22347K7083
$$ 117140 19604 -101629 -101147 19003 117412 81418 -45376 -115509 -47933 74414 101497
534A01497r8336r8042K1427J12360O6769o0991j20482l7762R5653J18404r93j17638
$$ 101497 3161 -94881 -73454 38906 105675 44684 -75798 -113560 -17907 100497 99504 -18134
546a8134r2154L8980J20113N6866p3541j15357j4707J10672J04326l3191j37006
$$ -18134 -110288 -71308 48805 105671 32130 -83227 -97934 12738 117064 83873 -53133
557e3133p9591P4168J44636M8133j03780j36476j0217J29230J13494m2025j48049
$$ -53133 -132724 -58556 86080 134213 30433 -106043 -116260 12970 126464 84439 -63610
568f3610p3666R1611J51584L3069j30199j49459N648J61368J29856n1785j70187
$$ -63610 -137276 -45665 105919 138988 8789 -140670 -135022 26346 156202 104417 -65770
579f5770q9053R2035J62296M1551j28669j48174J2087J64730J24137o4787j81757
$$ -65770 -154823 -62788 99508 141059 12390 -135784 -123697 41033 165170 100383 -81374
590h1374r0757J04170J79111N1960j31106j61441l945J53848J25192n3140j66899
$$ -81374 -172131 -67961 111150 163110 32004 -129437 -133382 20466 145658 92518 -74381
601g4381q0291J02674J67657L9257j39010j61800J278J62792J33526m5155j62195
$$ -74381 -154672 -51998 115659 154916 15906 -145894 -144616 18176 151702 106547 -55648
612e5648q7488Q3335J50064L7877j19997j33975J6110J50002J07541o0037j57576
$$ -55648 -143136 -59801 90263 128140 8143 -125832 -109722 40280 147821 87784 -69792
623f9792p4306Q8899J43842L5802j06300j16659J1808J18423P4638o0888j20518
$$ -69792 -144098 -55199 88643 124445 18145 -98514 -86706 31717 106355 45467 -75051
634g5051l2709R4898J12944L69j14256r6773L0670J15185O0388n9052r5054j3056
$$ -75051 -107760 -12862 100082 100451 -13805 -110578 -79908 35277 95665 36613 -58441 -71497
646g1497Q0391P0954l0852j01244m6996P2518J10334J8069r5030r6894J1080R9701
$$ -71497 8894 79848 48996 -52248 -99244 -26726 83608 101677 6647 -90247 -79167 20534
658B0534O7479m4160r8421k5389Q4344R0019k2568j18525p5645O1048J33269N6113
$$ 20534 88013 43853 -54568 -79957 4387 94406 71838 -46687 -122332 -61284 71985 128098
670A28098q6924j31236k4893J07722J08479k2587j23025o8945P2987J32269L3249
$$ 128098 41174 -90062 -114955 -7233 101246 78659 -44366 -113311 -40324 91945 125194
681A25194j16304j38929J852J47936J28400l6021j55606r6358O7205J46092N2771
$$ 125194 8890 -130039 -128187 19749 148149 112128 -43478 -139836 -72631 73461 126232
692A26232j02948j32883J447J39784J13032n3215j65332r0148Q8776J71953O3577
$$ 126232 23284 -109599 -108152 31632 144664 91449 -73883 -164031 -75255 96698 160275
703A60275j13711j59554k4388J32063J27413k6668j43311q5201P6526J51937M8429
$$ 160275 46564 -112990 -137378 -5315 122098 95430 -47881 -133082 -56556 95381 143810
714A43810j18513j55186j2893J46294J39296k0722j48682j05863N1292J39457
$$ 143810 25297 -129889 -142782 3512 142808 122086 -26596 -132459 -81167 58290
724E8290O1169q7107j26242r897J20634J06431l4366j38020q6804O1255J39206
$$ 58290 119459 32352 -93890 -103787 16847 123278 88912 -49108 -135912 -74657 64549
735F4549O0898p9720j21600k3072R1834Q8433j9773r8083n3307N7848J02942K5350
$$ 64549 125447 45727 -75873 -98945 -7111 81322 61549 -36534 -89841 -31993 70949 96299
747I6299q6126r9277J879R7203P8637k4932q9067m6045M5813P4865P451p1023
$$ 96299 10173 -89104 -87225 9978 88615 63683 -25384 -71429 -25616 49249 56700 -14323
759a4323n8059L2818Q7931L6898o0376r0320j6971P3561P6425q805p8768m7252
$$ -14323 -72382 -39564 48367 85265 24889 -65431 -82402 -8841 67584 58779 -19989 -67241
771f7241M3769P6459Q427p5851p0293K6014R9986O1319n1786j09314m1033P3684
$$ -67241 -23472 52987 61414 -14437 -84730 -58716 41270 102589 50803 -58511 -99544 -25860
783b5860R8013P225q8454p2572L3703J00774M4652p4446j13920j5998J07944J12137
$$ -25860 72153 79378 -9076 -81648 -47945 52829 97481 23035 -90885 -106883 1061 113198
795A13198j2259j23067r4760L7976J23107O4313o9538j17206k0157J03724J03955
$$ 113198 100939 -22128 -116888 -78912 44195 108508 38970 -78236 -98393 5331 109286
806A09286k4320j30324q7861N9864J44855O8649q5751j42555l7164J05994J20262
$$ 109286 84966 -45358 -133219 -73355 71500 140149 54398 -88157 -125321 -19327 100935
817A00935m048j18424q8745M7786J28385N7103q8659j34596k4428J15856J25096
$$ 100935 96887 -21537 -110282 -62496 65889 122992 34333 -100263 -124691 -8835 116261
828A16261n096j25215j02121L1774J22472O7640o3388j12949k4015R2557R7793
$$ 116261 111165 -14050 -116171 -84397 38075 105715 42327 -70622 -94637 -2080 95713
839I5713j3987j11411q2196M1508J19745O2889o1587j10628l3714P4287Q8219
$$ 95713 81726 -29685 -111881 -70373 49372 112261 50674 -59954 -93668 -19381 68838
850F8838m33q1367o1803L3732Q8322L5451o3040q8581j1697P8325P7184r076p9386
$$ 68838 68405 -12962 -74765 -41033 47289 82740 19700 -68881 -80578 -2253 74931 65855 -13531
863a3531n6626K7864P3109K6952m9614o0910O421O7085M5152l2330p3880l0232
$$ -13531 -70157 -42293 30816 57768 8154 -52756 -46335 20750 65902 33572 -40308 -70540
875g0540M9748P2257J0579n9884n5539J4449O2480L0212l9245o0494n729O1784
$$ -70540 -20792 51465 62044 2160 -53379 -38930 23550 53762 14517 -45977 -51706 10078
887A0078N6782j8332p6564m6512L8104P7628K6443n2622o7941k670O5965N3322
$$ 10078 66860 48528 -28036 -74548 -36444 41184 67627 15005 -52936 -55606 10359 63681
899F3681k7075p8032l3643N5934Q2439J2665p4263p8239P363Q5903O5726l1609
$$ 63681 36606 -41426 -75069 -19135 63304 75969 1706 -76533 -69170 16733 82459 50850
911E0850q9638m0548N7441Q5744J1141p9348p8291J6590R6827O5670m3046j04619
$$ 50850 -38788 -79336 -21895 63849 74990 -4358 -82649 -66059 30768 96438 53392 -51227
923e1227m5462O5155R8238J7991q0860q4476J1299R4218O4910m2623j02034m0499
$$ -51227 -96689 -31534 66704 84695 3835 -80641 -69342 24876 89786 47163 -54871 -95370
935i5370O9253R9420J6307q4981q9069Q500R4832O9850l4909r5906m1900N9014
$$ -95370 -26117 73303 89610 4629 -84440 -75940 18892 88742 53833 -42073 -83973 -24959
947b4959Q9333J4319p8341p9742J2381R0938O3873l6967r3598m1538N5522Q4730
$$ -24959 64374 78693 352 -79390 -67009 23929 87802 50835 -42763 -84301 -28779 55951
959E5951J5983o9489p0472J1162P9134N1608l8466q1499k8075N7703P5646N968
$$ 55951 71934 2445 -68027 -56865 22269 73877 35411 -46088 -74163 -16460 59186 65154
971F5154o8912o2409J6532P4250M2542l8833p0535j6669N5462O0556o771o6689
$$ 65154 -3758 -66167 -49635 24615 67157 28324 -42211 -58880 -3418 57138 50367 -16322
983a6322m7757K8178P1025K9734m6993o5770p633N7379N2645j3900o3616l6711
$$ -16322 -64079 -35901 35124 64858 17865 -47905 -55538 1841 54486 40586 -23030 -59741
995e9741L5288O5440J6063n3114n9315N241O3529M7666k4132o7165l1240M2602
$$ -59741 -24453 40987 57050 3936 -55379 -50138 13391 61057 36925 -30240 -61480 -18878
1007a8878O5776R470n7812n5732J3141O6954M1979l3959p0906k4975N2391O8219
$$ -18878 46898 56368 -1444 -57176 -44035 22919 64898 30939 -39967 -64942 -12551 55668
1019E5668K791o5980n7058J9229P2239M0152l9798p3338k1001N8389O8819k869
$$ 55668 58459 -7521 -64579 -45350 26889 67041 27243 -46095 -67096 -8707 60112 57243
1031E7243p0764n5979K4815P6058L9257m3089p5561j8726O0650O8249m777p1436
$$ 57243 -13521 -69500 -44685 31373 70630 27541 -48020 -66746 -6096 62153 57376 -14060
1043a4060n3727K6896P5237L6270m5744p4522j5533O1525O5647p640p1667n0575
$$ -14060 -67787 -40891 34346 70616 24872 -49650 -65183 -3658 61989 54349 -17318 -67893
1055f7893K8805P3731L2025m7306p1571j0513O3114O1410j2500p1160m5438L3857
$$ -67893 -39088 34643 66668 19362 -52209 -62722 392 61802 49302 -21858 -67296 -33439
1067c3439P2740K6137n1106o8185l989O5603N6196j9168p1593l8572L9365P0748
$$ -33439 39301 65438 14332 -53853 -57842 7761 63957 44789 -26804 -65376 -26011 44737
1079D4737J8854n5880o5183M108O7562N0652k6291p2150l2065M4682O9047J1797
$$ 44737 63591 7711 -57472 -53364 14198 64850 38559 -33591 -65656 -20974 48073 59870
1091E9870n9820o1351J0757O9957M6344l2446p2042k6539M9760O7962O642o3521
$$ 59870 50 -61301 -50544 19413 65757 33311 -38731 -65270 -15510 52452 59094 -4427
1103d427n8661J6632P2430M2473l8049p2962k2314N4101O8566J174o8080n7273
$$ -4427 -63088 -46456 25974 68447 30398 -42564 -64878 -10777 57789 58963 -9117 -66390
1115f6390K1034P5366L9382m2530p4388j8643N8658O7498l408p1219n5143K6473
$$ -66390 -45356 30010 69392 26862 -47526 -66169 -7511 59987 56579 -14640 -69783 -43310
1127d3310P6570L6957m6070p3642j5668O0343O5655o608p0165n1093K9068P4368
$$ -43310 33260 70217 24147 -49495 -65163 -4820 60835 54227 -15938 -67031 -37963 36405
1139C6405L1549m7916p0043j1131O0751O1376r595o8960m6413K9887O9442K5668
$$ 36405 67954 20038 -50005 -61136 -385 60991 51396 -17564 -63977 -34090 35352 61020
1151F1020m7198o2915n195N9217N2994j6401o6187l8299L5413O6084J9064m9151
$$ 61020 13822 -49093 -54288 4929 57923 41522 -24665 -62964 -27551 38533 57597 8446
1163H446n7701J276N8731M4142k1795o2826k6574M2777O0593N139n6257n1499
$$ 8446 -49255 -47979 10752 54894 33099 -29727 -56301 -13524 47069 52208 -4049 -55548
1175e5548J4719O2536L7478l2845o2656j7909M8478N5440n536o0323m2187K7225
$$ -55548 -40829 21707 59185 26340 -36316 -54225 -5747 49693 44157 -16166 -58353 -31128
1187c1128O4222K6660m5648o5183n566O0018N5144j4038o7098l9861L5390O9044
$$ -31128 33094 59754 14106 -51077 -56643 3375 58519 44481 -22617 -62478 -27088 41956
1199D1956J9097n5069o4920M535P1142N4091k6642p8152l8692M6014P7584J7669
$$ 41956 61053 5984 -58936 -54401 16741 70832 44190 -33962 -72654 -26640 50944 68613
1211F8613o3078o8838P816P5262N2647l3795q2187l3860N5919Q2364J3194p3257
$$ 68613 5535 -63303 -55487 19775 72422 38627 -43560 -77420 -21501 60863 74057 800
1223H00p4814J0626Q2542N7757l3829q3576l4636N5156P9817R687p3552p0492
$$ 800 -74014 -63388 19154 76911 43082 -40494 -75130 -19974 59843 69530 -4022 -74514
1235g4514J6115Q4533N5613l6825q6171l6369N3104P9330J2867o6428o5264J2942
$$ -74514 -58399 26134 81747 44922 -41249 -77618 -24514 54816 67683 1255 -64009 -51067
1247e1067P4364M6813l6358p8070k8089N4435P4730R300o5620o2943J0446O7544
$$ -51067 23297 70110 33752 -44318 -72407 -17972 56758 66058 438 -62505 -52059 15485
1259A5485M4204k9096o4145k1483M6815N8311j397o0325m7981K0916O5573L4074
$$ 15485 59689 30593 -33552 -55035 -8220 50091 48694 -11631 -59612 -38696 26877 60951
1271F0951l4371o0597j6660M2894M8095m319m9867k9441K5484N0824J2416m3140
$$ 60951 26580 -34017 -50677 -7783 40312 35993 -13874 -43315 -17831 32993 45409 2269
1283B269m9138L119N2915M0730j7465n3767k4933L1203M6526L688m2707l5097
$$ 2269 -46869 -43750 9165 49895 32430 -21337 -46270 -15067 31459 35147 -7560 -42657
1295d2657J7931N3218K3384l7519n6152j0716M9470N3102m934n5325l8958K2283
$$ -42657 -24726 28492 51876 14357 -41795 -52511 -3041 50061 45127 -10198 -49156 -26873
1307b6873N4910J9623m2686n1893J635O0948M8318k3300p2341m0089L8947P4938
$$ -26873 28037 47660 4974 -46919 -45284 15664 63982 40682 -31659 -71748 -32801 42137
1319D2137K4664n2529o6956j652O3943N1591k4652p3177l3858M9793P9732J6178
$$ 42137 66801 14272 -52684 -54336 9607 61198 36546 -36631 -70489 -20696 59036 75214
1331G5214o9153p7296K415P8952O4871k1556q0154m4301M2526P7414J7696o4072
$$ 75214 6061 -71235 -68820 10132 75003 53447 -26707 -71008 -28482 48932 66628 2556
1343B556p0967P910Q0330O0864k8791q7930m7594M4806Q5052K7904n7668p2783
$$ 2556 -68411 -60501 19829 80693 51902 -36028 -83622 -38816 46236 74140 16472 -56311
1355e6311k548O7713N5269k3251p5040l7596M6266P8108K0524o1060p2298l059
$$ -56311 -58859 8854 64123 40872 -34168 -71764 -25498 52610 73134 12074 -60224 -63283
1367f3283O6386N6899j4392o4712l5283L3479N8973J1368n0980n1795J0164O0382
$$ -63283 3103 60002 45610 -19102 -54385 -20906 38067 49435 -1545 -53340 -43176 17206
1379A7206M1888k4684o1180k8518L3788N2251R974l9905l6264J1361M3419J9643
$$ 17206 59094 34410 -26770 -55288 -21500 30751 40725 820 -35444 -24083 19336 38979
1391C8979k9630m5042m951M2377M1423o908m5457l0161J7491M0339J3107k8330
$$ 38979 9349 -35693 -40644 1733 43156 36248 -9209 -39370 -21879 18460 31567 3237
1403C237l1677P143L9301K1711k6305m5723j1940L7723M5139K205m3617l7027
$$ 3237 -28440 -21297 18004 39715 13410 -32313 -44253 -6530 38609 40814 -2803 -39830
1415c9830J2216M3641J9526k8668m1782N53M5408L8802j8285n7151l1688K9809
$$ -39830 -27614 16027 35553 6885 -34897 -34344 11064 49866 31581 -25570 -57258 -27449
1427b7449O1239K3949m0198n6910o804M8984M4262j4843n7016k9552L7057O3045
$$ -27449 33790 57739 17541 -39369 -46173 2811 47073 32230 -24786 -54338 -17281 45764
1439D5764J5562n4921o4852k096O3371N8057j1083o5448m3322K7072O3314K2713
$$ 45764 61326 6405 -58447 -60543 2828 60885 49802 -15646 -58968 -31896 31418 54131
1451E4131m5702n9084p73O1771N4405j6870p1860m7181L0767P3984L4006m1673
$$ 54131 8429 -50655 -51428 10343 64748 47878 -23982 -71163 -40396 33588 67594 25921
1463B5921o5984j4623N0034N3563p269n9007l9903K9179O5200K6013m5098o5980
$$ 25921 -40063 -54686 -4652 48911 41642 -17365 -57268 -28089 37111 63124 18026 -47954
1475d7954j3363N3246N8216l51n5029m4084J6531N3483K4455l3125m9474n217
$$ -47954 -61317 -8071 50145 49794 -5235 -49319 -32788 20695 45150 12025 -37449 -42666
1487d2666M6099M4748q916n3175l7111K0009N1981K4392k7244m2671q772L3774
$$ -42666 3433 48181 39265 -13910 -51021 -31012 20969 45361 18117 -24554 -33326 448
1499D48L1146r410l8030j9709K3815L9997R093l3497l6807N86L5286K7079j0171
$$ 448 31594 22184 -15846 -35555 -11740 28257 37350 3853 -32954 -32368 2918 29997 19826
1512A9826l3154j3228K2440K7997l813l2325k1228J7949L7592J4192k6198l7850
$$ 19826 -13328 -26556 -4116 23881 20068 -12257 -33485 -15536 22056 36248 10050 -27800
1524b7800l958L2380K9083q958l4190j5745K2738L4841K014l6111l4011J0669
$$ -27800 -31758 622 29705 20747 -13443 -29188 -6450 28391 30405 -5706 -39717 -29048
1536b9048M5343K6912k0905m6855j7077L0180M2866L467m0090l4609J3766M7511
$$ -29048 16295 43207 22302 -24553 -41630 -11450 31416 34883 -5207 -39816 -26050 21461
1548B1461K4597k9919n1640j3733M1429N0558L395m8423m4145J1366N1172L1244
$$ 21461 46058 16139 -35501 -49234 -7805 42753 46148 -2275 -46420 -35054 16118 47362
1560D7362k6227n1181j5051M0249M9082m79n1565m4983J4633N7744L4983k6538
$$ 47362 21135 -30046 -45097 -4848 44234 43755 -7810 -52793 -38160 19584 54567 28029
1572B8029n6505k1557L5755N0986N166m5684m1660J1927N2414L1808k8054n4291
$$ 28029 -28476 -50033 -14278 36708 41874 -3810 -45470 -33543 18871 50679 22625 -31666
1584c1666j9797L7623N2987O929m4135m3565O243M7489L1190k0582m6758j7341
$$ -31666 -51463 -13840 39147 46076 1941 -41624 -35381 12108 43298 22716 -24042 -41383
1596d1383L2542M4958L285m1850l9605Q442M6326K9012j8202m4156j8169K7815
$$ -41383 -8841 36117 39402 -2448 -42053 -33611 12715 41727 23525 -20631 -38800 -10985
1608a0985L8835L365l5184k9881J0668L8939K0766k2157l9168j1246L0564L4861
$$ -10985 27850 31215 -3969 -33850 -23182 15757 36523 14366 -24802 -36048 -5484 29377
1620B9377n6l3720k6730J3147L4050J4600k3715l1903j647L2004K7267j0276l6809
$$ 29377 29321 -4399 -31129 -17982 16068 30668 6953 -24950 -26597 5407 32674 22398 -14411
1633a4411j9275J9855L6046Q873k8823l0450L484L3037K3312j6784l6895j1197
$$ -14411 -33686 -13831 22215 31088 2265 -28185 -24701 8336 31648 14864 -22031 -33228
1645c3228K7284L5150J695l5609k9984R524L9652K2369k0883m0110r946L1460
$$ -33228 -5944 29206 30901 -4708 -34692 -25168 14484 36853 15970 -24140 -34086 -2626
1657b626L6089l649l8512k9439J4948M4320K0025k7703m3815q895L7809L8122
$$ -2626 33463 29814 -8698 -38137 -23189 21131 41156 13453 -30362 -39257 -1448 36674
1669C6674m374m3308l0784J8530M6500J8267l1379m4669n052M0388L9866q145
$$ 36674 32300 -11008 -41792 -23262 23238 41505 10126 -34543 -39595 793 40659 32514
1681C2514m6435l0736K2037M8169J8428l3506m4398l471M0738L8176j0812m6167
$$ 32514 -13921 -44657 -22620 25549 43977 10471 -33927 -37398 3340 41516 30704 -15463
1693a5463k8184K4317M6847J5185l4171m3383k634M0714L7306j1603m5342k5690
$$ -15463 -43647 -19330 27517 42702 8531 -34852 -37486 3228 40534 28931 -16411 -42101
1705d2101K3830M4805J2872l3556m1769J082M1483L2977j4308m3751k1432K5248
$$ -42101 -18271 26534 39406 5850 -35919 -34837 6646 39623 25315 -18436 -39868 -14620
1717a4620M2900R590l5427l7581N301M0053K9441j8358m2685j7126K7889M2391
$$ -14620 28280 37870 2443 -35138 -29837 10216 39657 21299 -21386 -38512 -10623 31768
1729C1768L205l7476l4543R581M3070K3747k3441m1850j1297L2237L9010k001
$$ 31768 34973 -2503 -37046 -27465 15605 39352 15911 -25939 -37236 -4999 34011 32010
1741C2010m0494l1352J6846M2947J9689k6810m1940q295L6954L7354o344m1516
$$ 32010 -8484 -39836 -22990 19957 39646 12836 -29104 -37399 -445 36909 30565 -10951
1753a0951k7725J7680M4456J6981l0459m2800k957L8413L5950r172m4396k6906
$$ -10951 -38676 -20996 23460 40441 9982 -32818 -35775 2638 38588 29416 -14980 -41886
1765d1886K2907M5206J4350l4082m1439l62M0861L4506j3782m5199k3163K5826
$$ -41886 -18979 26227 40577 6495 -34944 -35306 5555 40061 26279 -18920 -42083 -16257
1777a6257M5310J0074l5571l9679L111M2842L0653j7088m4322j9034K8904M1862
$$ -16257 29053 39127 3556 -36123 -33012 9830 40483 23395 -20927 -39961 -11057 30805
1789C0805O683l7565l6779P213M2765K6641k0017m3078j4886L0713L9296Q16l8321
$$ 30805 37488 -77 -36856 -29643 13122 39763 19746 -23332 -38218 -7505 31791 32607 -5714
1802e714l1947J2789M1297K1719k3717m1018r578L3028L5635l053l8643k7537
$$ -5714 -37661 -24872 16425 38144 14427 -26591 -36169 -3141 32494 29441 -9202 -36739
1814c6739J7028M0647J5730k8281l8284k471L6285L2324j0104m1272k2502K2307
$$ -36739 -19711 20936 36666 8385 -29899 -32370 3915 36239 26135 -15137 -37639 -15332
1826a5332M1341J0178l3079l6814L595L9853K8291j7026m3347j7653K8829M2657
$$ -15332 26009 36187 3108 -33706 -30111 9742 38033 21007 -22340 -39993 -11164 31493
1838C1493M765l8283l6673Q568M3668K7409k1740m5076j4366L3705M2140J235
$$ 31493 36258 -2025 -38698 -30130 13538 40947 19207 -25869 -40235 -6530 35610 36845
1850C6845m2350l6821J3059M7365K7240k5107m8073j4973L5717M3854J56m3697
$$ 36845 -5505 -42326 -29267 18098 45338 20231 -27842 -42815 -7098 36756 36912 -6785
1862f785l5956J4087M8627K5503k7653m9642j3407L8097M5925o6m5061l6866J3697
$$ -6785 -42741 -28654 19973 45476 17823 -31819 -45226 -7129 38796 38730 -6331 -43197 -29500
1875b9500M7793K5186k7137m6167j1000L8081M2125l184m5544l4138J6251M7347
$$ -29500 18293 43479 16342 -29825 -40825 -2744 39381 36197 -9347 -43485 -27234 20113
1887B0113K3793k7175m4259j0520L4997L7502m760m0593k7437J7828M2749J6453
$$ 20113 43906 16731 -27528 -38048 -3051 34451 29691 -10902 -38339 -20511 22238 38691
1899C8691k8498m0721o006L5508L4806n851l7424k4165J6009L6941J1833k6900
$$ 38691 10193 -30528 -36534 -1026 33780 27929 -9495 -33660 -17651 19290 31123 4223
1911D223l2057J648L4529K5591j3691l6471j7349K2295L4368O287k8181k7559
$$ 4223 -27834 -26186 8343 33934 20243 -16228 -33577 -11282 23086 29373 1192 -26367
1923b6367O456L1368J6553j9136l1486n679K9022L0196o518l4560k3706J6018
$$ -26367 -19911 11457 28010 8874 -22612 -28291 731 30927 24409 -10151 -33857 -17839
1935a7839L5587J2521k4540l1415Q81L2472K3942j4402l7231j5708K7401L8840
$$ -17839 17748 30269 5729 -25686 -24805 7667 31609 17207 -20024 -35732 -8331 30509
1947C0509N590l5781l5578N340L9895K6852j6759m0943j4340K8711L8919Q33l9754
$$ 30509 36099 318 -35260 -29920 9975 36827 20068 -20875 -35215 -6504 32415 33248 -6506
1960f506l4518J1474M6454K8413k3041m8354j8390L2657M3982M837l9435l6302
$$ -6506 -41024 -29550 16904 45317 22276 -26078 -44468 -11811 32171 37008 -2427 -38729
1972c8729J0523M5258K6592k4637m8604j5742L6381M7029M891m3208m0520P502
$$ -38729 -28206 17052 43644 19007 -29597 -45339 -8958 38071 42962 -246 -40766 -33264
1984c3264M5186K9233j9733m4796j5990L2369M1739J632m1372l6856R754M5642
$$ -33264 11922 41155 21422 -23374 -39364 -6995 34744 36376 -4996 -41852 -32098 13544
1996A3544K9703j9406m4698j9349K6915L9368N925l2440l1184P409L7351K2842
$$ 13544 43247 23841 -20857 -40206 -13291 26077 32002 -438 -31622 -24213 13138 35980
2008C5980j9381l9245j3917K7186L6927N580l0631l0057M100L0441J9655j4213
$$ 35980 16599 -22646 -36563 -9377 27550 33130 2499 -27558 -23458 6983 26638 12425
2020A2425k9060p283K2966K5875l417k8862k1368J0780K9669J4715j6123k5795
$$ 12425 -16635 -23918 -952 24923 21506 -7356 -28724 -17944 11725 26440 10317 -15478
2032a5478m983K0225J7637o736k2293q786J7460K3583J214k4591k2368N956K6892
$$ -15478 -20461 -236 17401 10665 -11628 -20414 -2954 20629 21843 -2748 -25116 -19160 7732
2045G732J6604j1785k4784o975J8654K0305n170k5815j4689J6850K9094R721k4778
$$ 7732 24336 12551 -12233 -19208 -554 19751 14581 -11234 -25923 -9073 20021 29742 4964
2058D964l0897k575K8754K7308o345l0571j8699J6823L1564O734k8521l0454M700
$$ 4964 -25933 -28508 246 27554 21209 -9362 -28061 -11238 20326 27060 -1461 -31915 -27215
2071b7215L7572K8310j4549m1570k2249K2698M0255J1833k9151l4270J461L5801
$$ -27215 10357 38667 24118 -17452 -39701 -17003 23252 35085 5934 -28336 -26875 8926
2083H926K6720j6139m1356j8423K8400M3503R620l5856m1943j330M0476L4580
$$ 8926 35646 19507 -21849 -40272 -11872 31631 41251 5395 -36548 -37878 2598 37178
2095C7178r944m1416k2543K2313M0040R540l3408l7871K528M1293L3730j1691
$$ 37178 27234 -14182 -36725 -14412 25628 35168 1760 -36111 -33583 7710 41440 29749
2107B9749m3524k6784J9381M1328J5639k6007l5076k629L1898K7751j0460l6515
$$ 29749 -13775 -40559 -21178 20150 35789 9782 -25294 -27923 3975 31726 21266 -15249
2119a5249j9721J9845L7458J2469k5982l4370l995K7918K6410n508k7881j5569
$$ -15249 -34970 -15125 22333 34802 8820 -25550 -29545 -1627 24783 19275 -8606 -24175
2131b4175J5184K6697M484k2542k3716L453K6845K0014r856k5868j2760J3794
$$ -24175 -8991 17706 22190 -352 -24068 -20615 6230 26244 16388 -9480 -22240 -8446
2143h446K1779L057j7214j4696O146K0448Q325j4663k1570k741J9522J8770k665
$$ -8446 13333 16390 -824 -15520 -9374 11074 19399 4736 -16834 -19575 -53 18717 16052
2156A6052k1138j3096Q481J9314N133j5354j6140M375K1017J3380j2977k4592
$$ 16052 -5086 -18182 -9701 9613 14746 -608 -16748 -12373 8644 22024 9047 -15545
2168a5545q154J8147K4581J683k1772j9049N945K4010J1926j5169k4935l901K4349
$$ -15545 -23699 -5552 19029 20712 -1060 -20109 -14164 9846 21772 6603 -18332 -22233 2116
2181B116K3882l713l0350k1660J0795L2419J5930j8629l0701n704K3761K6617
$$ 2116 25998 22285 -8065 -29725 -18930 13489 29419 10790 -19911 -25615 -1854 24763
2193B4763l872l1201k0765J4962L4360J5606k3455l5533p893K8866L3081r92l2258
$$ 24763 20891 -10310 -31075 -16113 18247 33853 10398 -25135 -33028 -4162 28919 27927 -4331
2206d331k5833J0605L4009J6719k0295l4468p460K9807L2948k460l4987k8406
$$ -4331 -30164 -19559 14450 31169 10874 -23594 -31054 -1247 31701 29241 -5746 -34152
2218c4152R547L6578K1429j7867l4957j0708K4985L0638j078l0579k4360J0407
$$ -34152 -24605 11973 33402 15535 -19422 -30130 -5145 25493 24415 -6164 -30524 -20117
2230b0117L4713J7316j8243l4370j0380K4299L0449J809k7473k2870Q251K8455
$$ -20117 14596 31912 13669 -20701 -31081 -6782 23667 25476 -1997 -24867 -16616 11839
2242A1839J3600j6981k7312m999K3178K5042l335k5971j9456Q490K6644J2089
$$ 11839 25439 8458 -18854 -23853 -675 24367 21032 -4939 -24395 -15905 10739 22828
2254B2828j5499k3253k994J9929J8555o205k2686j2902J3911K3491N452j7848
$$ 22828 7329 -15924 -18918 1011 19566 13361 -9325 -22227 -8316 15175 20627 2779
2266B779k1596J145K2098J5493r581k0997p782J5988J9785k92k1735j6486R157
$$ 2779 -18817 -17672 4426 19919 10338 -10659 -18441 -2453 17332 17040 -4695 -21181 -12024
2279a2024K3259J1682j5202k3501m872J9482K0767m415k2731j4834J2376K5119
$$ -12024 11235 22917 7715 -15786 -20658 -1176 19591 15176 -7555 -22389 -10013 15106
2291A5106P821k0143k4111O1K5599K0976q251k7955j4799J5305K7918P139k2420
$$ 15106 22927 2784 -21327 -21266 4333 25309 17058 -10897 -25696 -10391 17527 24666 2246
2304B246k5193K530K7057K1080j0867l0577j5079J8559L0401P330k4220k8272
$$ 2246 -22947 -20417 6640 27720 16853 -13724 -28803 -10244 20157 27487 3267 -25005
2316b5005J790K8055K2817j0996l0451j5603J9564L1088O034k6025k7959K660
$$ -25005 -23215 4840 27657 16661 -13790 -29393 -9829 21259 27293 1268 -26691 -24031
2328b4031L0278K2772j1116l2048j4188J8986K9764N784k5070k5969L821K9261
$$ -24031 6247 29019 17903 -14145 -28333 -9347 20417 26201 1131 -24838 -21017 8244
2340H244K0464j2749l1311j2856K0871K8883L858k5647k3883L931K7967J8381
$$ 8244 28708 15959 -15352 -28208 -7337 21546 25404 -243 -24126 -20195 7772 26153
2352B6153j3267k8828j0203K0420K6896J061k5680k1183P042K7821J4731j3572
$$ 26153 12886 -15942 -26145 -5725 21171 22232 -3448 -24631 -17589 10232 24963 11391
2364A1391k7733p454K1046K4071j041k5445j8089R512K6002J1875j5801k6590
$$ 11391 -16342 -23796 -2750 21321 20280 -5165 -23254 -13742 12260 24135 8334 -18256
2376a8256l824K2763K1728m622k5519j6396J2414K6465Q202j9316k4402j1K4619
$$ -18256 -22080 683 22411 17789 -7730 -24126 -11712 14753 22955 3639 -20763 -20774 3845
2389C845J9625q204k6816j3246J5773K6494N366k1460k3798L418K6179J7815j0992
$$ 3845 23470 15266 -11550 -24796 -9023 17471 22837 1377 -22421 -19003 7176 24991 13999
2402A3999k7808j0851J8287K6048L496k4393k2944M735K7822J7836j3715k8437
$$ 13999 -13809 -24660 -6373 19675 23171 -1222 -24166 -19431 8391 26227 12512 -15925
2414a5925r552K0090K6625J866k6298k1996P430K7587J6164j5218k7862p624K1766
$$ -15925 -25477 -5387 21238 23104 -3194 -25190 -17760 9827 25991 10773 -17089 -24713 -2947
2427b947K5028o37k5604k0567R868K7189J3046j6641k7416m332K2806K3037l746
$$ -2947 22081 21444 -4160 -24727 -14859 12330 25376 8735 -18681 -23013 -207 22830 19084
2440A9084k6775j7292J1828K6978J1087j9343k5625k061K4484K1190p142k6400
$$ 19084 -7691 -24983 -13155 13823 24910 5567 -20058 -22119 2365 23555 16413 -9987
2452i987j5071J4129K7453P275k1128k4357J303K5056K0382j0142k7646j2259
$$ -9987 -25058 -10929 16524 23799 2671 -21686 -20383 4673 25055 14913 -12733 -24992
2464b4992J7335K6936M708k4203k3340M940K6467J7985j2797k8217j0218K0350
$$ -24992 -7657 19279 23987 -216 -23556 -18616 7851 25836 13039 -15178 -25396 -5046
2476e046K6509J389k6011k2661Q056K8898J5637j6528k9443p018K3351K6553j909
$$ -5046 21463 22852 -3159 -25820 -17764 11134 26771 10243 -19200 -26218 -2867 23686 21777
2489B1777k8127k0462J0691L0110J3614j9525k9259m658K6194K6332m669l0228
$$ 21777 -6350 -26812 -16121 13989 27603 8078 -21181 -25839 355 26687 22018 -8210
2501h210k0435J3115L1548J2796k0746l0001l864K6936K5431n871l0542j9372
$$ -8210 -28645 -15530 16018 28814 8068 -21933 -25797 1139 26570 20699 -9843 -29215
2513b9215J4736L1621J1424k1943k9851k724K6937K4778n698k9464j7724J4487
$$ -29215 -14479 17142 28566 6623 -23228 -25952 985 25763 20065 -9399 -27123 -12636
2525a2636K9386R257k1682k6836j07K6482K2124q011k8456j5495J5290K7302O911
$$ -12636 16750 26007 4325 -22511 -22618 3864 25988 17977 -10479 -25974 -10684 16618 23529
2538B3529k0709k3249J955K4053J7084j0362k5254j0052J7140K3660K768k1395
$$ 23529 2820 -20429 -18474 5579 22663 12301 -12953 -23005 -5865 17795 20563 -832
2550h32k0397N005K3310J3659j1747k2273n693J7289K0041k245k1729j5653J0061
$$ -832 -21229 -16224 7086 20745 8998 -13275 -18968 -1679 18362 16117 -5612 -21265 -11204
2563a1204K3596R370j5731k2106k315J9550J7892n385k2097j1912J3627K2160
$$ -11204 12392 21762 6031 -16075 -18390 1160 19052 13667 -8430 -20342 -6715 15445
2575A5445M380j9849k1202L878K3204J7037j0570k5384r663J6224K3571K059k2185
$$ 15445 19825 -24 -21226 -17348 5856 22893 12323 -13061 -22724 -6500 17071 19130 -3055
2588c055j9465P069K6290J4724j5342k8157p777K1821K6872J74k5977k2407Q292
$$ -3055 -22520 -15451 10839 25563 10221 -17936 -25713 -3892 22980 23154 -2823 -25230 -16938
2601a6938K8367J5327j6953k8718o711K3677K7370j792k9453k3506R619L1935
$$ -16938 11429 26756 9803 -18915 -25626 -1949 25421 23629 -5824 -29330 -19711 12224
2613A2224J7329j6859l1023r268K2944K7778k11k8030k2724R781L1769J6522j8186
$$ 12224 29553 12694 -18329 -27597 -4653 23125 22914 -5116 -27840 -18059 13710 30232 12046
2626A2046l1885r508K4402K8999J109k7190k3028P976K7914J4200j5204k8197
$$ 12046 -19839 -29347 -4945 24054 25163 -2027 -25055 -17079 10835 25035 9831 -18366
2638a8366o314K2891K5036j352k6995k0507P800K7370J4398j4348k3963n969J8611
$$ -18366 -24680 -1789 23247 21895 -5100 -25607 -17807 9563 23961 9613 -14350 -20319 -1708
2651a708K0187l040k1802j5052J0598K3189R630j6096k1696k981J8248J7179l168
$$ -1708 18479 15439 -6363 -21415 -10817 12372 22002 5906 -15790 -18771 -523 16656 13488
2664A3488j7925j1703J0186J7519K279j5111j5039L859J8788J1796r592j9267
$$ 13488 -4437 -16140 -5954 11565 13844 -1267 -16306 -12447 6341 18137 8545 -10722
2676a0722o699J2706J6985K44j5646j1363P557J7575M873j4946j6473M70J9633
$$ -10722 -17421 -4715 12270 12514 -3132 -14495 -6938 10637 15510 564 -15909 -15439 4194
2689D194J4729n656k1772j0702J1447J9990M352j6390j6173L736K0508J2262j2203
$$ 4194 18923 13267 -8505 -19207 -7760 12230 16582 192 -15981 -12245 8263 20525 8322
2702H322k3378q336J9475K2492J360k0371k0051L019K3161J5686j1238k4029p591
$$ 8322 -15056 -23392 -3917 18575 19935 -436 -20487 -17468 5693 21379 10141 -13888 -21479
2715b1479J8242K2750P91k3684k1530N181K8516J8274j1576k8321j2870J7740
$$ -21479 -3237 19513 20304 -3380 -24910 -19729 8787 27061 15485 -12836 -25706 -7966
2727g966K6130K969k0854k2553M154K7452J6381j2718k8111j2096J8787K8309
$$ -7966 18164 21133 279 -22274 -18120 9332 25713 12995 -15116 -27212 -8425 19884
2739A9884M602k1993k3930Q76K3943J7798q157k4661j0234J5607K4147L839k1277
$$ 19884 24486 2493 -21437 -20561 3382 21180 13023 -11638 -21872 -6265 17882 21721 444
2752D44k2031R15K5022J8155p692k1796j3358J1409K0903N090j6466j6174K721
$$ 444 -21587 -20672 4350 22505 14813 -6983 -20341 -8932 11971 17061 595 -15579 -12858
2765a2858J9019J3283q620k0779q982J1126K0064M303j3349j6941J549J4656J0698
$$ -12858 6161 19444 10824 -9955 -18937 -7811 12253 16556 3207 -13734 -12185 2471 13169
2778A3169p734j4661m123J2341J4165j010j4786j1857M610J6112P097q429j3052
$$ 13169 5435 -9226 -13349 -1008 13157 12147 -2639 -14496 -9886 6226 13323 4894 -8158
2791h158k201J2295R338o172j2555n716J0261J5338P70j4256j3585M208J4567
$$ -8158 -10359 1936 11274 5102 -7453 -13169 -2908 12430 13200 -1056 -14641 -10433 4134
2804D134R489p763j3795m622J2711J4163m425j6634j1452R793K0360P611j3575
$$ 4134 13623 5860 -7935 -12557 154 14317 9892 -6742 -18194 -8401 11959 19570 5995
2817E995k1173l069J7054J8047l336j8675j2413R734K0650O456j7017k1281o16
$$ 5995 -15178 -18247 -1193 16854 13518 -5157 -17570 -7836 12814 19270 2253 -19028 -19644
2830a9644K2129J9821n372k5017j5229J0064K5086J0010j6725k1972k258K1779
$$ -19644 2485 22306 16934 -8083 -23312 -13248 11838 21848 5123 -16849 -19107 2672
2842B672J8680o546k4496j5412J3004K7130J0080j7217k6055m306K1340K1386
$$ 2672 21352 14806 -9690 -25102 -12098 15032 25112 7895 -18160 -22466 -1126 20260
2854B0260l017k2747j5584R901K4420R234j6936k4014l212K1385K1989k614k3429
$$ 20260 17243 -5504 -21088 -11187 13233 22467 5531 -18483 -21695 -310 21679 19065 -4364
2867d364j7063P363K2595J0866j2309k0697l238J7274J7243l839k0110j3678Q621
$$ -4364 -21427 -14064 8531 19397 7088 -13609 -16847 427 17670 13831 -6279 -19957 -11336
2880a1336K1655R072j2246j9417m021J4961J5983k909j6428j0403Q803J6887M637
$$ -11336 10319 19391 7145 -12272 -16293 -1332 14651 11742 -4686 -15089 -6286 10601 15238
2893A5238j3332j5859K77J6309J2604m902j6374q074Q938J4582J794j2515j1276
$$ 15238 1906 -13953 -13676 2633 15237 10335 -6039 -14113 -5175 9407 11201 -1314 -12590
2906a2590L766J5355P533r032j5503l953J3182J4167j228j4678j0524N977J5698
$$ -12590 -8824 6531 14064 5032 -10471 -14424 -1242 12925 11697 -2981 -13505 -7528 8170
2919H170N483j1317j4359l86J6023J2427n963j7894r366J0682J8692L826j4784
$$ 8170 13653 2336 -12023 -12409 3614 16041 10078 -7816 -17182 -6500 12192 16018 1234
2932A234j5972J605J8218J2334q628k0070o854J3554J9312L561j9009j8420M273
$$ 1234 -14738 -13133 5085 17419 8791 -11279 -18133 -4579 14733 18294 -715 -19135 -14862
2945a4862K0318J4659r305k1500q451J4417K1528J141j9780j7875M858K2659J4419
$$ -14862 5456 20115 10810 -10690 -19141 -4724 16804 17945 -1835 -19710 -14852 7807 22226
2958B2226j0871k4036r028J6681K1220L154k0291j8876M453K2465J4399j2049
$$ 22226 11355 -12681 -21709 -5028 16192 19346 -945 -19821 -15368 7097 21496 9447
2970I447k3197q485J7604K2336J952k0919j9469M849K3013J4170j0851k2742p212
$$ 9447 -13750 -22235 -4631 17705 19657 -1262 -20731 -15882 7131 21301 10450 -12292 -19504
2983a9504J5709K0750M46j9907j6541O237K1538J1261j1160k1632n431J6065J8177
$$ -19504 -3795 16955 17401 -2506 -19047 -12810 8728 19989 8829 -12803 -18234 -2169 16008
2996A6008o06j9357j3737P664J9199Q022j2566j8217k918J6958J5142k505j8711
$$ 16008 15402 -3955 -17692 -10028 9171 17193 4627 -13590 -16508 450 15592 13087 -5624
3009e624j1698R043J8004P173j3774j7217L38J6297J3658o697j8851o487R928
$$ -5624 -17322 -8279 9725 16898 3124 -14093 -13755 2542 16200 9503 -9348 -15835 -5907
3022e907J8972K339j5611j4987K798J6941J2385q742j8575o549J3603J7445N1
$$ -5907 13065 15404 -207 -15194 -12396 4545 16930 8188 -10387 -16936 -3333 14112 14163
3035A4163j6549j4290N347J8745J0418j1802j8430m626J5588J7262k384j8107
$$ 14163 -2386 -16676 -11329 7416 17834 6032 -12398 -17024 -1436 15826 13442 -4665
3047d665j2510P652J9365Q620j4172j8371l014J7458J7479m126j9642j1970R017
$$ -4665 -17175 -9523 9842 18462 4290 -14081 -17095 363 17842 13716 -5926 -17896 -8879
3060h879J9770Q742j6478j8189j610J8149J7073n909k0375j1709J0913K1055N704
$$ -8879 10891 19633 3155 -15034 -16644 1505 18578 12669 -7706 -19415 -8502 12553 18257
3073A8257j5241j8718m26J9635J4533n925k0365r995J1646K0102M055j7750j5520
$$ 18257 3016 -15702 -16128 3507 18040 12115 -8250 -18245 -6599 13503 17558 -192 -15712
3086a5712P97J9867J4285r308j9049j0031J4597J8543J780j6172j6339L990J8678
$$ -15712 -14915 4952 19237 9929 -9120 -19151 -4554 13989 15769 -403 -16742 -12752 5926
3099E926J2608j0731j9419n598J5088J6649r11j6384j4956P592J7864J0576j2985
$$ 5926 18534 7803 -11616 -17214 -2126 14523 13612 -2772 -17728 -10136 7728 18304 5319
3112E319j8308m445J6588J5952j093j8110j2966Q853J8197P522j2726j8900j857
$$ 5319 -12989 -17434 -846 15106 14013 -4097 -17063 -8210 9987 17509 4783 -14117 -15974
3125a5974J6421J6339l796j9848j0810R495J9329O347j4785j8292j56J8739J4479
$$ -15974 447 16786 12990 -6858 -17668 -8173 11156 17503 2718 -15574 -15730 3009 17488
3138A7488n450j9920j0722J1140K0233M658j6147j6895J12K0127J3504p719j8428
$$ 17488 12038 -7882 -18604 -7464 12769 17427 1280 -15615 -15503 4624 18128 10409 -8019
3151h019j0141J2754J8818M780j7614j6540K335J7506J3173p968j8701q849J4005
$$ -8019 -18160 -5406 13412 18192 578 -15962 -13627 3879 17052 9084 -9617 -18466 -4461
3164d461J7541K287j5785j5041L785J7213J1230p633j8558o985J4663J3935Q67
$$ -4461 13080 15367 -418 -15459 -11674 5539 16769 9136 -9422 -16407 -1744 12191 13058
3177A3058j4453j3682M655J6271R340p999j6843n008J2937J4880k099j4247j0529
$$ 13058 -1395 -15077 -10422 5849 15189 7190 -9653 -14661 -1724 13156 11057 -3190 -13719
3190a3719O365J5627N630j0705j4953j476J4132J1770l087j4990q265P870J4610
$$ -13719 -7354 8273 13903 3198 -11755 -13231 901 12671 9584 -5406 -13671 -5801 8809
3203H809L601j1983j3550Q15J6505R487o032j5347p581J2172J4025K959j4193
$$ 8809 12410 427 -13123 -12308 4197 13684 7652 -7695 -15276 -3104 10921 13880 -313
3216c13j3881M528J5175R820r262j7448m090J4422J4369K77j7066j2559N742J7486
$$ -313 -14194 -9666 5509 15329 6067 -11381 -15471 -1049 13320 13597 -3469 -16028 -10286 7200
3230G200R431j1269j6749l699J4118J5831q41j9927j2005Q496J9811P501j1923
$$ 7200 16631 5362 -11387 -15086 -968 14863 14022 -5905 -17910 -9414 10397 17898 5975
3243E975j9922k602J6222J6819k588j8459j2810Q444J8765P814j3394j7515k672
$$ 5975 -13947 -16549 -327 16492 13904 -4555 -17365 -8921 9844 17658 4264 -13251 -15923
3256a5923J6175J7866l889j9825j2834P732J9800P699j1922j8263j135J4928J5203
$$ -15923 252 18118 14229 -5596 -18430 -10698 9102 16801 4879 -13384 -14519 409 15612
3269A5612l595j7770j1145O879J9431Q190j2092j7771k034J3385J5013k113j5883
$$ 15612 12017 -5753 -16898 -10019 9412 17602 5510 -12261 -14295 -910 14103 11990 -3893
3282c893j0036O909J5861N476j1602j4453j918J4169J3286m061j4074q339O685
$$ -3893 -13929 -7020 8841 14317 2715 -11738 -13656 513 13799 9738 -4336 -12675 -5990
3295e990J2414M033q923j1391O49J1835Q988n694j1747o320Q537J1671J357q188
$$ -5990 6424 10457 1534 -9857 -9208 2627 11615 5921 -5826 -12146 -3609 8062 9419 1231
3309A231r718Q31J1173N077m364j0400k365R518R103k698j0442p789N382J1771
$$ 1231 -8487 -7656 3517 8594 4230 -6170 -8535 983 10086 7388 -3054 -10843 -5461 6310
3323F310M452p754j1576l30R796R569m110j2882m186Q316J2797J849j2584j2669
$$ 6310 10762 3008 -8568 -8898 898 10467 6357 -6525 -10711 -2395 10402 12251 -333 -13002
3337a3002K601J4563R876o570j4176o253J0083J3466J146j3674j2351N261J5753
$$ -13002 -10401 4162 14038 7468 -6708 -12961 -2878 10588 11734 -1940 -14291 -9030 6723
3350F723J0094q945j8470o071J2789J6547J511j4439j4498L294J7115J0260q832
$$ 6723 16817 7872 -10598 -16669 -3880 12667 14178 -261 -14759 -11465 5650 15910 7078
3363G078j8224o720J4545J7994K285j7934j5468J345J9645J3722p554k0005p869
$$ 7078 -11146 -17866 -3321 14673 16958 -976 -16444 -15099 4546 18268 10714 -9291 -17160
3376a7160J2653J8147J521j6462j4574K879J8939J2554q215k0198p383J0414J7753
$$ -17160 -4507 13640 15161 -1301 -15875 -12996 5943 18497 10282 -9916 -17299 -6885 10868
3389A0868M515j4027j4776J362J6160J0614p109j6199p338J1565J6124K422j3655
$$ 10868 15383 1356 -13420 -12058 4102 14716 7607 -8592 -15930 -4365 11759 14181 526
3402E26j3626J009J5113R423m767j3509m945Q182J1438K23j1569q524M535J0790
$$ 526 -13100 -12091 3022 12445 7678 -5831 -10776 -2594 8844 9067 -2502 -11026 -6491 4299
3416D299Q245p919j1257m199Q626J0209j389q647o134M250R222K168o976r301
$$ 4299 12544 4625 -6632 -10831 -2205 8004 6615 -2032 -8166 -3916 5306 7474 498 -8803
3430h803K81J1009Q492n186r718n107O629R460j18q028o815M710Q219M279p876
$$ -8803 -8522 2487 10979 5793 -3925 -9032 -2403 7057 6939 -1089 -7904 -3194 5025 9304 1428
3445A428r765j140J0847R852k140j2519q083N417J2494M023q983j0814o11J3060
$$ 1428 -8337 -9477 1370 11222 9082 -3437 -11520 -6103 6391 10414 1431 -9383 -9994 3066
3459C066J0330n287j4782r541R069J6749M954j0976j5236j091J4124J2427m215
$$ 3066 13396 8109 -6673 -16214 -7145 9604 14558 3582 -11654 -12745 1379 13806 9591
3472I591j5661r010R477J6883N513j3930j7221j115J6529J4782l891j7048j0954
$$ 9591 -6070 -15080 -5603 11280 16793 2863 -14358 -15473 1056 15838 11947 -5101 -16055
3485a6055P058J7873O353j2381j6375j169J6243J4884l996j8377j1973Q124J8682
$$ -16055 -8997 8876 15229 2848 -13527 -14696 1547 16431 12435 -5942 -17915 -9791 8891
3498H891Q030j1496j6752l078J4268J3801k767j5273j1130Q271J6295P147j2546
$$ 8891 16921 5425 -11327 -14405 -137 13664 10897 -4376 -15506 -7235 9060 16207 3661
3511C661j5553k007J2933J4473k030j4597r971N561J4283N670j0045j2674q82
$$ 3661 -11892 -13899 -966 13507 11477 -3120 -13091 -7530 6753 12423 2378 -10296 -11178
3524a1178J2566J1047l130j4467p486O658J3590L708r296j0634K62J1043P461
$$ -11178 1388 12435 9305 -5162 -12648 -5990 7600 11308 2012 -8622 -8360 2683 10144
3537A0144n060j1574l210P955J1167J15j0552r256M282J0175M767n483j1425l16
$$ 10144 5084 -6490 -9700 -1745 9422 9537 -1015 -10271 -5989 4186 8953 3470 -7955 -8271
3551h271J0079P859m013j0823o154Q191J0857K633r911j0296N54J1887P959m661
$$ -8271 1808 9667 5654 -5169 -11323 -3132 7725 10358 447 -9849 -9295 2592 10551 5890
3565E890j1890m355Q550J1462J157j2579j0249K801J4718Q186p407j4668n854
$$ 5890 -6000 -10355 -1805 9657 10814 -1765 -12014 -9213 5505 13691 6284 -8384 -14238
3578a4238J1271J4881j83j3731j2946O222J5605P489r409j5572l341J1500J6066
$$ -14238 -2967 11914 11731 -2000 -14946 -8724 6881 14370 4961 -10611 -13952 -2452 13614
3591A3614L44j5688j3088N332J6046P157p798j5746m384J2417J4598j69j4402
$$ 13614 13958 -1730 -14818 -9486 6560 13717 5919 -9827 -14211 -1794 12804 12635 -1767
3604a767j3288M884J7014R414r751j6289n251J2773J3712M83j4373j2031N134
$$ -1767 -15055 -10171 6843 16257 6506 -9783 -15034 -2261 11451 11934 -2439 -14470 -9336
3617i336J5295Q686r105j5942m205J2485J4003j40j3424j1218M102J4355P672
$$ -9336 5959 14645 5540 -10402 -14607 -2122 11881 11741 -1683 -12901 -8799 5556 13228
3630A3228p941j4608k687J1552J2263j445j3670r396N266J4189N530q957j1887
$$ 13228 5287 -9321 -12008 -456 11807 10362 -3308 -12704 -7438 6751 12281 3324 -8563
3643h563j886J0770J0278k773j2428o524O305J1996L706j0052j0878R80J0906
$$ -8563 -10449 321 10599 7826 -4602 -11126 -4821 7175 10881 829 -10049 -9069 1837
3656A837R187m504j2243m969Q163J1164J742j0879r701K744J1831O835n994j2790
$$ 1837 11024 6520 -5723 -10692 -2529 8635 10377 -502 -10203 -7459 4372 11207 5213 -7577
3670g577l296J0374J0338q52j1795q489N557J1896M419p415j2362q49J0429J0283
$$ -7577 -10873 -499 9839 8987 -2808 -11297 -5740 6156 10575 3160 -9202 -10051 378 10661
3684A0661k540j2569q735P353J3244M647r578j2605j415J3760J0407m516j3088
$$ 10661 8121 -4448 -13183 -5830 7414 12061 2483 -10122 -11537 2223 12630 8114 -4974
3697d974p749P849J3809L293j0692j3086P33J2781J1279m436j4813p393R375J3224
$$ -4974 -12723 -4874 8935 12228 1536 -11550 -10817 1964 13243 8807 -6006 -13399 -4024 9200
3711I200L768j2083j2992J860J3959Q911m892j3459o664Q816J3050K058j1063
$$ 9200 12968 885 -12107 -10247 3712 12623 7731 -5728 -12392 -3576 9474 11532 469
3724D69j1753J628J3884Q929o360j3776n228R303J3314P66j1909j0954K849J3616
$$ 469 -11284 -9656 4228 13157 6797 -6979 -12207 -2904 10410 11176 -733 -11687 -8838 4778
3738D778P698p050j3409m332J0544J2079k93j2233r581M345J3142O169p966j2531
$$ 4778 12476 5426 -7983 -12315 -1771 10308 10015 -2218 -11799 -7454 5688 11857 3891 -8640
3752h640k328J0756J1055j993j2153q101N721J1799N673r137j2287r9J1306R830
$$ -8640 -10968 -212 10843 8850 -3303 -11404 -5683 6116 11789 2652 -9635 -9734 1572 11402
3766A1402l310j2805o889P412J1871K608q669j1280o7J1684Q595l565j3176n124
$$ 11402 8092 -4713 -11602 -4190 7681 10289 1620 -9660 -9727 1957 10552 6987 -6189 -11313
3780a1313P237J2922J713j0645j0688J340J2947Q602n413j3355m910Q644J2262
$$ -11313 -4076 8846 10559 -86 -10774 -9434 3513 12115 6702 -6653 -11563 -2919 9343
3793I343J398j1245j0894K916J2850P715o319j2773m241Q823J1953M69j1245r799
$$ 9343 10741 -504 -11398 -8482 4368 12083 5764 -7009 -11250 -2427 9526 9995 -1250 -11049
3807a1049L784J1976O681p044j2473k426R533J0400o28j1159p840L795J1502N415
$$ -11049 -7265 4711 11392 4348 -8125 -10551 -1018 9382 8754 -2405 -10245 -6450 5052 10467
3821A0467o925j1416j671R711R578k002j0754p076M876J1404L720p757j0267m01
$$ 10467 3542 -7874 -9545 166 9744 7742 -3012 -10088 -5212 6192 9912 2155 -8112 -8513
3835h513R960Q422l583j0981n437O505J0783J944r180q668J017J0633O993m932
$$ -8513 1447 9869 6286 -4695 -10132 -3627 7156 9100 -80 -8748 -7731 2902 9895 4963
3849D963j0776l814P921R489P37r795q149L014J0760O037o276j0802l056Q731
$$ 4963 -5813 -9627 -1706 7783 8520 -1275 -9424 -6410 4350 10387 4111 -6691 -9747 -1016
3863a016R549o27j0545p333M138J1030N047p175j0907k115R744R923j409j1174
$$ -1016 8533 7906 -2639 -9972 -5834 5196 10243 3068 -7839 -9954 -210 9713 8304 -2870
3877b870q507N774J1060N732p662j2140j449J0567R626j570j2116q037N586J2578
$$ -2870 -11377 -5603 5457 11189 3527 -8613 -10062 505 10131 8561 -3555 -11592 -6006 6572
3891F572M866q161j1924j899J0488J0034j105j1775p764N104J1827M793q311j1810
$$ 6572 11438 3277 -8647 -10546 -58 9976 8871 -2904 -10668 -5564 6263 11056 2745 -9065
3905i065j571J0535J0065j873j1111p422M924J0488N422p653j0386q72R339Q682
$$ -9065 -10636 -101 9964 8091 -3020 -10442 -5518 4970 10392 2739 -7647 -8519 820 9502
3919I502k163j0406p159M791J0622M449o699r955o92Q496P292k255r845m350M861
$$ 9502 7339 -3067 -10226 -5435 5187 9636 2937 -7018 -7710 786 8078 5823 -4022 -8372 -3511
3934c511R470K051p179q306J028P552P104l488q334l789M646P898Q93p074n322
$$ -3511 5959 8010 831 -7475 -6447 1105 8209 4721 -3613 -7402 -2756 5142 6035 -1039 -6361
3949f361K199P610L794m669p534k339O702P182q94p449m865L799P862O72n437
$$ -6361 -4162 3448 7242 2573 -4961 -7300 -598 6584 5690 -1759 -6624 -2825 5037 5709 272
3964B72p424J776P547N336l218q430m068N756Q128J523p604p474J693R096N382
$$ 272 -7152 -5376 2171 7507 4289 -4141 -8209 -2453 5675 7198 -406 -7880 -6187 2909 8291
3979H291m920r256k778P799R177N69j0030p027P87J0648P041n686j0647k569P205
$$ 8291 3371 -5885 -8663 -864 8313 8882 -1148 -8175 -7388 3260 10301 4615 -6032 -8601 -1396
3994a396J0454o92r937r395L085J1661P111o069j0501n400P943J1329O28q581
$$ -1396 9058 8366 -1571 -10966 -7881 3780 10891 4822 -5679 -11079 -3136 8193 8821 240
4008B40j0008L353J0176P008n975j1484m251Q722J0251J866r257r391L24J0730
$$ 240 -9768 -6415 3761 10769 4794 -6690 -10941 -2219 8032 9898 641 -8750 -8426 2304
4022B304P197m115j0073m318O402J0872L60q037j0085J126J1104O170k655j0950
$$ 2304 9501 5386 -4687 -9005 -2603 8269 8629 592 -9493 -8367 2737 8907 6252 -4698
4036d698m619O192R571J079p067p539J082R181L999l012q483m270N968P985K070
$$ -4698 -9317 -3125 6446 7525 458 -7081 -5999 3182 7181 4169 -4314 -8584 -2616 5369 7439
4051G439p226p131J702O537M464k607p003j256N386M785J89p743m076L006O238
$$ 7439 213 -6918 -5216 1321 5785 3178 -3825 -5081 305 5090 5279 -2464 -6540 -3534 2704
4066B704K163k663o226j142N761M063k021o146j747M361O993m42o680o104J966
$$ 2704 4867 2204 -4022 -5164 597 4660 2639 -3507 -5254 -893 6100 5658 -1022 -7126 -5160
4081e160P928M734m496p780j158O087O365j232q374m850M107Q890L497o866q937
$$ -5160 2768 7502 3006 -4774 -5932 155 6520 5288 -3086 -7936 -3829 5061 8558 1692 -7245
4096g245j261Q748Q712k111r674n854M384R660L544p679j0446N28J0260R077l579
$$ -7245 -8506 242 8954 6843 -2831 -8685 -4301 5359 8903 1224 -9222 -8694 1566 10643 7064
4111G064j1276p398N859J2444L472p508j1131l82R791Q111j845j1697p090O704
$$ 7064 -4212 -11610 -5751 6693 10165 2657 -8474 -8856 935 9046 7201 -4496 -11586 -4882
4125d882J1972M245p960j2312j493R737J0574j929j1189p247M630J1990N100q338
$$ -4882 7090 11335 3375 -8937 -10430 -693 9881 7952 -3237 -10484 -5854 6136 11236 2898
4139B898j1798r71J0206J0026j567j1922o950L101J1842N564p295j0043j334Q970
$$ 2898 -8900 -9871 335 10361 8794 -3128 -10078 -6977 4865 10429 3134 -6909 -8243 727
4153G27P736k195r286o060M570R622L694n755r400r98P252P250k178p499m583
$$ 727 8463 6268 -3018 -9078 -4508 5114 8808 3053 -6347 -7345 -93 7157 4979 -2520 -7103
4168g103M191P962P71n280o545N9Q132M886l017o972l110M235O389O67o765m086
$$ -7103 -2912 5050 5821 541 -6004 -5945 2187 7073 4056 -2916 -6026 -1791 4598 5265 -1500 -5586
4184e586K353P292K420m678p463k50O687O128j256p732m458L459P714J335o269
$$ -5586 -3233 4059 6479 1801 -5662 -5912 775 6903 5647 -2085 -6543 -3084 4630 5965 -304
4199c04o494J586Q503N166m722q722l770O323R310N79q037p747K399R383N260
$$ -304 -6798 -5212 3291 8457 3735 -4987 -8757 -2434 6876 7455 -582 -8329 -5930 3453 8713
4214H713n875q126l539P418J0129p40r112q581L227J0343O227o401r776l583P907
$$ 8713 2838 -5288 -8827 -1409 8720 7980 -1132 -9713 -6486 3857 10084 3683 -6093 -9676 -1769
4229a769R638K33j0547p705K780J2150O060p058j1552k814Q611J0292J255j0875
$$ -1769 7869 8102 -2445 -10150 -7370 4780 10840 3782 -7770 -10584 -1973 8319 9574 -1301
4243a301r146L303J1605O429o349j2052l380R907J1036j324j0157q715K995J0750
$$ -1301 -10447 -7144 4461 10890 4541 -7511 -10891 -984 10052 8728 -1429 -10144 -7149 3601
4257C601P145o246j0545l624Q541Q484m57q758p715L695R917M917m771j1610j685
$$ 3601 10746 4500 -6045 -9669 -1128 7356 6899 -1859 -9574 -5879 4038 8955 4184 -7426 -9111
4272i111R180P164l73r018o174L811Q018M208o085p786j289P708P296k601q324
$$ -9111 69 7233 6860 -2158 -8332 -4521 3497 7705 1620 -6166 -7455 253 7549 4948 -3376
4287c376m924N094Q279K087o972o345M59P660N685m343q184k550O094P606K49
$$ -3376 -8300 -3206 5073 7160 188 -6157 -5698 1962 7647 3304 -4880 -7430 -1336 6270 6519
4302F519q068n324J819Q484L907m575q684q49O368P271j156q732m560M475P918
$$ 6519 -1549 -6873 -5054 3430 7337 2762 -5922 -6771 -403 6868 5712 -3020 -7580 -3105 4813
4317D813K787n267q787m28P848O652k666q817m686M904R825J650o900r475N56
$$ 4813 7600 2333 -6454 -6882 966 7618 4952 -3865 -8551 -3647 6178 7828 928 -8547 -7991
4332g991R975O790k982j0403n045O406R951J786p866r578J996R919O025l558r909
$$ -7991 1984 8774 5792 -4611 -9656 -3250 6701 8487 621 -8957 -6961 2958 8983 5425 -4484
4347d484n129O539J0055J394q550q745J749R297P032m114j0135m033O442R765
$$ -4484 -9613 -3074 6981 8375 -175 -8920 -7171 2126 9158 5044 -5091 -9124 -2682 7083
4361G083R24q075q403J980R283N869m192r833l124O761Q898J37p951p420K300
$$ 7083 8007 -68 -8471 -6491 2792 8661 4469 -5364 -8488 -1727 7171 7308 -643 -8063 -5763
4376e763R300M924n009q887k606P078Q285n37q388o401K883R007M261n677q283
$$ -5763 3537 8461 3452 -5435 -8041 -963 7322 6785 -1603 -8004 -5121 3886 8147 2470 -5813
4391e813j609P314P330j545q404n245L980Q431L401o328q181M0P745O213k232
$$ -5813 -7422 -108 7222 5677 -2727 -7972 -3992 4439 7840 1512 -6669 -6629 1116 7329 5097
4406E097q291m162M685P909J779o282p450Q25P800N517l124q508l257N433P696
$$ 5097 -3194 -7356 -2671 5238 7017 735 -6715 -5890 1910 7427 4303 -4205 -7462 -2029 5667
4421E667J008o818o844J365Q155M890l887q155k784N993P652M10p538o412K347
$$ 5667 6675 -143 -6987 -5622 2533 7423 3536 -4619 -7403 -1410 6242 6652 -886 -7298 -4951
4436d951Q089M444m479p990k220O215P471k25p894n875K921Q038M040m902q114
$$ -4951 3138 7582 3103 -4887 -7107 -892 6579 6354 -1540 -7415 -4494 3544 7584 2682 -5432
4451e432j652O717O798j034p630n168L488P778L228n217p495p24O843N856j180
$$ -5432 -7084 -367 6431 5397 -2233 -7401 -3913 3865 7093 1876 -5619 -6343 500 6356 5176
4466E176p432m522L666P534K357n736o734j2O837N414k036p648l666M303P168
$$ 5176 -2256 -6778 -3112 4422 6779 1043 -5691 -5703 1134 6548 4512 -3136 -6802 -2499 4669
4481D669J681n942o579P23P238M765l152p429k688N223P113K88o402n955J497
$$ 4669 6350 408 -6171 -5448 1790 6555 3403 -4026 -6714 -1491 5622 5910 -492 -6447 -4950
4496d950P701M262m138p429k110N789O977j65p346n513K721P777L776m689p696
$$ -4950 2751 7013 2875 -4554 -6664 -875 6102 5937 -1409 -6922 -4201 3576 7352 2663 -5033
4511e033j396O180O759q37p531n141L052P817L488n295p831q67O580O827j357
$$ -5033 -6429 -249 6510 5673 -1858 -6999 -3947 3870 7358 2063 -5768 -6635 -55 6772 5415
4526E415p598n122L612P959K938n445p738o73O981O708j394p977m999L592Q225
$$ 5415 -2183 -7305 -3693 4266 7204 1759 -5979 -6652 329 7037 5643 -2334 -7333 -3741 4484
4541D484K927n604p607n71O746O367j657p847m249L404P860K612n357o956q00
$$ 4484 7411 1807 -5800 -6371 375 6742 5085 -2762 -7011 -3607 4253 6865 1508 -5448 -6248
4556f248O638N916j662o856m063L259O773K243n117n892j11O146M672j974o082
$$ -6248 390 6306 4644 -2212 -6275 -3016 3757 6000 883 -5009 -5120 1026 5698 3724 -2358
4571b358l356L556N846J694m705n321O42N453L533k253n813j981L884N151N36
$$ -2358 -5714 -2158 3688 5382 677 -4644 -4002 1451 4984 2731 -3082 -5063 -1179 3972 4508
4586D508n160m235J638N183K809k967n384p58M414M237o51n308l495K833N639
$$ 4508 -652 -4887 -3249 1934 4743 1776 -3608 -4366 48 4285 3634 -1674 -5169 -2336 3303
4601C303J916l997n289l25N458M133j816o081k543L513O082J244o263n362R86
$$ 3303 5219 1222 -4067 -4392 1066 5199 3383 -2698 -5241 -1728 4354 5598 -665 -6027 -5041
4616e041O253M154j900o284l612M636O558R42n637o300J728O258M979l476p218
$$ -5041 1212 5366 3466 -2818 -6430 -1794 4764 5706 69 -6231 -4503 1755 6734 3258 -3960
4631c960k722M630P730J120o765o411J279P444M389l119p659l614N810Q399o3
$$ -3960 -6682 -2052 5678 6798 33 -6378 -5099 2345 6734 3615 -4044 -7658 -1848 6551 6488
4646F488p329o075L49Q807N774l133r217l996N756P492K599o931q401L245O178
$$ 6488 -841 -6916 -6567 2240 8014 4881 -4336 -8332 -2576 4916 7515 584 -7817 -4572 1606
4661A606N623j800r200k818L985P261K213o647n934L79O474N097k820p336k706
$$ 1606 7229 5429 -3771 -6589 -2604 4657 6870 223 -5711 -5332 1142 6239 3419 -3917 -6623
4676f623M958O657Q78o226n504Q24O680M343k674o414k447M271N569K18n228m382
$$ -6623 -1665 4992 5870 -356 -5860 -5036 1644 5987 3313 -3101 -5548 -1277 4292 4510 -718 -5100
4692e100J789O030K571l371n584j134M407M689o47m874l281K649M976Q72l703
$$ -5100 -3311 2719 5290 1919 -3665 -4799 -392 4297 3650 -1224 -4505 -1856 3120 3992 289
4707B89m190M48N115L274k422n189k144L582M874K18m716l781K022N115K415l759
$$ 289 -3901 -3453 1662 4936 2514 -2675 -4819 -1237 3637 3855 -861 -4642 -2620 2495 4910 1151
4723A151n904l20N320N462j431o047m046K570O861K451m652o464j06O117N369
$$ 1151 -4753 -5073 247 5709 4278 -1769 -5815 -3245 3616 6067 1415 -5049 -5155 962 6331
4738F331k163p504m061M249P875K492n757p633p6O734O391j896q143m387M284
$$ 6331 4168 -3336 -7397 -3148 4727 7219 1462 -6171 -6247 487 6878 4982 -3161 -7548 -3264
4753c264Q307K277o030p851o16P898O862j676q302n317L691Q300L278n928p708
$$ -3264 5043 7320 1290 -6561 -7177 721 7583 5907 -2395 -7712 -4021 4279 7557 1629 -6079
4768f079n74P465O533j607q251n506L804Q388L817n585q147j207O778O487j268
$$ -6079 -6653 812 7345 5738 -2513 -8019 -4215 4173 7990 2405 -5742 -6949 -171 6316 5048
4783E048p472m619L564P955K456n166p537o75O403O350j139o972m339L160O541
$$ 5048 -2424 -7043 -3479 4476 6932 1766 -5771 -6446 -43 6307 5168 -1804 -6143 -2983 3558
4798C558K333m711o109L48N563M512k125n993k687K519N882K011m468m685K58
$$ 3558 5891 1180 -4929 -4581 982 5494 3369 -2624 -5311 -2792 3090 5101 633 -4052 -3794
4813c794M883L301k027n618j678M160N140n26n270l697K081N792J958l727m614
$$ -3794 1089 4390 2363 -3255 -4933 -773 4367 3841 -1429 -5126 -3045 2747 4705 978 -3636
4828c636k50M674M135k297n627k650M387N687R80n767m742J003N869L867l041
$$ -3636 -3886 788 4923 2626 -3001 -5651 -1264 4423 5403 -364 -5106 -4103 1766 5633 2592
4843B592o968j293N368N044K23o535n522L435P238L610m805p781r15N731P292
$$ 2592 -4376 -5669 -301 4743 4966 -1569 -7091 -3656 3582 7192 2387 -5394 -6309 -578 6714
4858F714j378o998m931L111P224L188m664p145k766P036O869O74q374o167K650
$$ 6714 5336 -1662 -6593 -3482 3742 6930 2266 -4879 -7645 -609 6260 6934 -1440 -7607 -4957
4873d957P611M756m482q538j731O763O935r17p997n214L069P996M192m365q259
$$ -4957 2654 7410 2928 -5610 -7341 -578 6357 5440 -2557 -7771 -4702 3294 7486 3121 -5138
4888e138j036M192Q273r08o771n239K687P036L277m614n782j670N346O362o00
$$ -5138 -6174 -1982 6291 5383 -1388 -6627 -3940 3096 6373 1759 -4023 -5693 -347 6015 5415
4903E415o753n380L104O038L410l574o866o45M458O427j814o503k524L544M227
$$ 5415 -1338 -6718 -3614 2424 5834 2260 -4606 -5251 -793 5634 3820 -2683 -5207 -1663 2564
4918B564K068k562o883m36N570M551j431n995k642L870M994R90n306l209J66M671
$$ 2564 4632 2070 -4813 -5249 321 4872 3441 -2554 -5196 -1326 3668 4658 -648 -3857 -3691 980
4934I80L610k675n147n86L495M328K04n620l279J771O056J489l500n404m17M840
$$ 980 4590 1915 -3232 -3818 -323 4005 4209 -1411 -4690 -2919 3137 4626 1126 -4278 -4695 145
4950A45M888j468n724k857K555O263R17m678n033J92O703L567j162p273l316L830
$$ 145 5033 3565 -2159 -5016 -2461 3802 4719 41 -4992 -4800 1903 5470 4308 -2965 -6281 -2451
4966b451O888J043n437n568P44O041M407k495o846k355M332O403J255n884n902
$$ -2451 4437 5480 43 -5525 -4781 1260 5667 3172 -3674 -6029 -1697 4706 5961 77 -5825
4981e825O44P047M743l155p115k728M799O833P05o388n461J234O800M445l370
$$ -5825 -5181 1866 6609 3454 -3661 -6389 -1590 5243 5948 -440 -5901 -4667 2133 6578 3208
4996C208p015k455M872O708O98o435n414J082O396M060k895o598k449M933O180
$$ 3208 -3807 -6262 -1390 5318 6016 -419 -5833 -4751 1645 5705 2810 -3788 -6237 -1304 4876
5011D876K33n571n346J285P046K821k772o200j929M929N134p6n252m442J782O163
$$ 4876 5109 -462 -5808 -4523 2523 5344 2572 -3628 -5557 -628 4506 4430 -822 -5264 -3482 2681
5027B681K566l103o014o71L915N332j312m813l278J920N937J412l978n075R34
$$ 2681 5247 2144 -3870 -4541 -626 4706 3394 -1419 -4697 -2777 3160 4572 594 -4481 -3547
5042c547M292L745j528n313k918K676N286K855n930m189J873M663K996k961n152
$$ -3547 745 4490 2962 -2351 -5269 -2593 2693 5548 -382 -4571 -2698 1965 4961 2000 -3152
5057c152j162L547M702P66n076m059J222O316J871k792n599j315M461M107J92
$$ -3152 -4314 -767 3935 4701 -375 -4434 -3212 3104 4975 2183 -3416 -4731 -270 3837 4029
5072D029m688m035J273N617K532k792n647j154N187L481m9n186m118K875N183
$$ 4029 -659 -4694 -3421 2196 4728 1936 -3711 -4865 322 3803 3754 -1432 -5550 -2675 2508
5087B508K420l558m764j101N151L626k24n699l238K225N119K710m017n219m15
$$ 2508 4928 1370 -3394 -4495 656 4282 4058 -1641 -4879 -2654 2465 5175 1158 -4061 -4476
5102d476M798L836k32n954l134L064N195J826m010n492p6N707L229j803m896k728
$$ -4476 322 4158 3926 -2028 -5162 -2098 3097 4923 913 -4579 -4655 1052 4281 2478 -2418 -5146
5118e146L991M649O69l949m847J256M381M111k481n550j943L307N179K35m253
$$ -5146 -1155 3494 4163 214 -4633 -3377 1004 5115 2634 -2916 -4859 -1552 3627 3862 -391
5133c91m275J573M537L095k309m550k148L261M328N14m140m527K531M583K616
$$ -391 -4666 -3093 1444 4539 2230 -2320 -4468 -1207 3121 3635 -505 -5032 -2501 2082 4698
5148D698l821m283p67L701M545j30n067l486J811N310J930k699n480p68M124M602
$$ 4698 877 -3406 -4173 -472 4073 3943 -1124 -4610 -2799 2511 4441 1742 -3738 -4506 -382 4220
5164D220n26n208l224K011N230K268l462n102o89M683M003n19n037l558K373N004
$$ 4220 3694 -1514 -4738 -2727 2503 4771 1309 -3793 -4482 201 4204 3685 -1352 -4910 -2537 2467
5180B467K484l777m804p80M798M247q69n301l080K374N119J747l712m662k81M581
$$ 2467 4951 1174 -3630 -4410 388 4635 3766 -1535 -4615 -2241 2878 4625 913 -3749 -4030 551
5196E51L846j317n091k646K636M525J693l433m397j19M381L130j213m469k088
$$ 551 4397 3080 -2011 -4657 -2021 2504 4197 764 -3633 -3752 629 3759 2546 -1923 -4011
5211d011K596M291R27l413m032O08M169K880j981m188j577K775M355j71l787k865
$$ -4011 -1415 2876 3803 390 -3642 -3034 1135 4015 2034 -2154 -3731 -956 3399 3228 -559 -3424
5227c424J040L883K069k211m602p26L769M158j600l949k249J124M763J550k709
$$ -3424 -2384 1499 3568 1357 -3245 -3971 -202 3956 2356 -1593 -3842 -2718 2045 3595 886
5242H86m218M27L583L892j869m640k721L560L859J054l694l953N24M659K920j930
$$ 886 -3332 -2905 678 4570 2701 -1939 -4660 -1100 2759 3813 119 -3834 -3310 1349 4269 2339
5258B339m970j936L311N107M04m548m364R80N022L509k431n319k043L776M868
$$ 2339 -2631 -4567 -1256 3851 4255 -293 -4657 -3677 1345 4854 2423 -2896 -4939 -1163 3705
5273C705P55m786m334J042N162L735k562n906j911L623N608O22m942m548O19N927
$$ 3705 4460 -326 -4660 -3618 1544 5279 2717 -3189 -5100 -1477 4131 4753 -189 -4737 -4118 1809
5289A809L565k641n778k164L636N859O56m964m783J038N153L626k283n540k029
$$ 1809 5374 2733 -3045 -5209 -1573 4286 4942 -22 -4805 -3767 1386 5012 2729 -2811 -4840
5304d840L479M923O46m291m183Q38N094L114k223n056j910L150M435P29l668l919
$$ -4840 -1361 3562 4208 -83 -4266 -3428 1666 4780 2557 -2499 -4409 -1259 3176 3905 237 -3682
5320c682Q63M146K509j942m203j577L129L700K14l516k949Q05L681K115k263l384
$$ -3682 -2819 1327 3836 1894 -2309 -3886 -757 2943 3157 -359 -3308 -2503 1178 3293 1030 -2354
5336b354o40K909L090p11l487j959J921L478J026k728l283J32L453K348j513l620
$$ -2354 -2994 -85 3005 2294 -1193 -3152 -1231 2247 3273 545 -2738 -2606 847 3195 1682 -1938
5352a938j377K883L327q2l513k920J257M064K026k662l769q30L320L739q17m139
$$ -1938 -3315 -432 2895 2813 -700 -3620 -2363 1701 3727 1065 -2704 -3534 -214 3525 2708 -1431
5368a431k773K350M329K077m026m456j40M063M337p94m973l069K382M664K761
$$ -1431 -4204 -1854 2475 4552 526 -3930 -4070 -7 4330 3536 -1437 -4506 -2124 2540 5301
5383E301m188n291n33N462M060r65o034l500K909N944K090m559n067j38N197M270
$$ 5301 1113 -4178 -4711 751 4811 3846 -2188 -5688 -2779 3165 5255 696 -4371 -4509 688 4958
5399D958q38o490l618L404O143K343m594n945m25N025N300j345o254l086K863
$$ 4958 4120 -2370 -5988 -2584 3559 5902 1308 -4637 -5062 -37 5263 3918 -2336 -5422 -2559
5414b559N473J726l563n236l87M552M971j288n624l574K550N345K502l899m565
$$ -2559 2914 4640 1077 -4159 -4546 6 4977 3689 -1935 -5509 -2959 2386 4888 989 -3576
5429c576m61L858M350j178m982k492K387N121N92k780m452M06L947K712r46l622
$$ -3576 -4037 -179 4171 2993 -1989 -4481 -2094 3027 3619 839 -3613 -3207 740 3452 2506 -1116
5445a116k190J991M429j30k896m133J967L230K181j538l868j079K631L271q30
$$ -1116 -3306 -1315 3114 2984 88 -4045 -2078 1152 3333 1795 -2073 -3152 -521 2750 1920
5460A920k687k384J908L388O51k676k983m63M359K617j847l654j942L042L396
$$ 1920 -767 -3151 -1243 2145 2796 120 -2863 -3326 1033 3650 1803 -1851 -3793 -751 2645
5475B645M75l518l006J051M266K483k885m593j304M377L794l11m244l269J527
$$ 2645 3120 -398 -3404 -2353 1913 4396 1511 -3082 -4386 -9 3785 3474 -770 -4039 -2512
5490b512M355K849l352n256o03M067N081o88n558l074J612N504K842l857n057
$$ -2512 1843 4692 1340 -3916 -4519 -452 4629 3941 -1617 -4691 -3079 2425 5267 1410 -3647
5505c647j040M202N274q38n372l398J717N982K715l839o083j064M669N427M1n775
$$ -3647 -4687 -485 4789 3951 -1421 -4819 -3102 2880 5595 1756 -4327 -5391 -722 4705 4746 -1029
5521a029m046J586N975K263k766n737j036M842L739L67n329l769K008N146K785
$$ -1029 -5075 -3489 2486 4749 1983 -3754 -4790 52 3791 4158 -1171 -4940 -2932 2214 4999
5536D999k526n945j262M472M447l95m725k952J616M635J868l024m377o35L752
$$ 4999 2473 -3472 -4734 -262 4185 3790 -935 -3887 -2271 2364 4232 1208 -3169 -3804 -52
5551e2L712p89m033k753K158M022J205l219l869P00L520K691j644k436k530K284
$$ -52 3660 2871 -1162 -3915 -1757 2265 3470 251 -3618 -2918 602 3293 1649 -787 -3317 -1033
5567a033L440Q68k794l324N93L705K442k869l297q07K746L849r14l394k701J936
$$ -1033 2407 3275 481 -2843 -2250 1455 3897 1028 -2269 -3076 -330 3519 2605 -789 -3490 -1554
5583a554K588K762k674l816J63L417K381j308l635j884J926M317J098l313m386
$$ -1554 1034 3796 1122 -2694 -2531 886 3267 1959 -1676 -3560 -1634 2683 3781 468 -3918
5598c918Q43M074K901j820m307j741L772L597N52m371l813J140M611L230k548
$$ -3918 -3075 999 3900 2080 -2227 -3968 -196 3401 3953 -418 -4231 -3091 1520 4750 2202
5613B202m447k118L377M623M15m614l970J837M292L247l039m282j899L101M745
$$ 2202 -2245 -4363 -986 3637 4052 -562 -4532 -2695 1597 4844 1805 -2477 -4376 -1275 3470
5628C470P51m671m429K417M126K332j919m731j558L623M009K91m243l042M36M690
$$ 3470 4221 -450 -4879 -2462 1664 3996 2077 -2654 -4212 -589 3420 3711 -532 -3574 -3138 1552
5644A552K672j933n185q84K815M123k00m198k235P15M785J352k041l406q29K441
$$ 1552 4224 2291 -2894 -3778 -963 3160 2960 -1238 -3473 -2758 2027 3379 1338 -2068 -2897 -456
5660d56L352L94m671j788R77L546K327k791l566m35L216L076q49l321k121J626
$$ -456 2896 3290 -1381 -3169 -2192 1354 3681 890 -2676 -3111 105 3181 2332 -989 -3110 -1484
5676a484L329J268k746l051p3L076K556j130k987j765J750L492O69l080k646M50
$$ -1484 1845 3113 367 -2684 -2757 319 2875 1745 -1242 -3007 -1257 2235 2904 -176 -2822 -2372
5692b372L363K183j433l781j111K755L323j00l620k556J631L248J833k020l867
$$ -2372 991 3174 1741 -2040 -3151 -396 2927 2827 -793 -3349 -1718 1530 3363 1343 -2524
5707b524m97L070L141m87l607k555J531L905J451k716l565K01K793K967p34l663
$$ -2524 -3021 49 3190 2703 -904 -3459 -1928 1977 3428 712 -2853 -2652 141 3108 2374 -1289
5723a289k301J846L836J398k515l917k16L435L119q14l799k533K061M003J323
$$ -1289 -3590 -1744 2092 3490 975 -2942 -3158 277 3396 2582 -1217 -3750 -1689 2314 3637
5738C637l061l364q2L303K922j018l854k206K312L660R34k768l389n9L432K941
$$ 3637 576 -2788 -2870 433 3355 2337 -1517 -3723 -1411 2249 3183 415 -2974 -3033 399 3340
5754C340j234l969j577K176L790O15k777l203J28L837K248j489l505j712K380
$$ 3340 2106 -1863 -3440 -1264 2526 3141 364 -2839 -2711 1126 3374 1885 -1620 -3332 -952
5769i52L244Q06l145l006P11L418K197j730l551j025K242L171O29l360k876J043
$$ -952 2292 3098 -47 -3053 -2342 1076 3273 1543 -2008 -3033 -791 2380 3009 -351 -3227 -2184
5785b184L158K258j834l521q18K572L120k45l150k527J242L476J516j876l633
$$ -2184 974 3232 1398 -2123 -2941 -369 2751 2506 -644 -3171 -1929 1547 3063 1187 -2446
5800b446o05K954L160m96l565k218J720L496J307k366l289p57L143L151j078l503
$$ -2446 -3051 -97 3063 2567 -998 -3216 -1496 2000 3307 941 -2348 -3105 38 3189 2111 -1392
5816a392j976J759L725J005k572l261j19L068L123j163l606j893J804L563J259
$$ -1392 -3368 -1609 2116 3121 549 -2712 -2831 237 3360 2197 -1409 -3302 -1498 2065 3324
5831C324k367l219j003M171J816p77k697k511J885L324Q71k566k935J93L167K303
$$ 3324 957 -2262 -3265 906 2722 1945 -752 -3263 -1378 1946 2817 251 -2684 -2491 676 2979
5847B979j199l373j450K111L181N64k707k726M83K870K375j715k886j089K121
$$ 2979 1780 -1593 -3043 -932 2249 2813 106 -2620 -2137 733 3108 1393 -1493 -2582 -461
5862d61K822o4k612k299J017K993J479j861k874o35K369K734n86k796j888J212
$$ -461 2361 2297 -315 -2614 -1597 1396 2875 1014 -1860 -2495 -126 2608 2022 -774 -2662 -1450
5878a450L149J286k520k924k45K952K377o79l062j685J573L129J102k570l168
$$ -1450 1699 2985 465 -2459 -2704 248 2625 1946 -1116 -2801 -1228 1901 3003 433 -2735
5893b735J9L323K433r83l323j876J819L777P25l009l193M14L648K126j111l999
$$ -2735 -2716 607 3040 2057 -1266 -3142 -1323 2454 3179 170 -3023 -2609 1039 3165 2054 -1945
5909a945j552K389M004M05l510l095J02M146K418j560l985j407K507L988O65l548
$$ -1945 -3497 -1108 2896 3301 -209 -3304 -3202 944 3362 1802 -2183 -3590 -1083 2905 3570 22
5925B2m072R84M078K717j511m002j980K605M077M75l201l384J03M050K720j490
$$ 22 -4050 -3066 1012 3729 2218 -1784 -3764 -1159 2918 3393 192 -3192 -3089 961 3681 2191
5941B191m384j388K445L944N21l263l318O51L647K277j624l579j385K553L278
$$ 2191 -2193 -3581 -1136 2808 3329 66 -3252 -2601 1046 3323 1699 -1880 -3265 -712 2566
5956B566K68k944k855J041L105K198j848l338j019K555K983l81k890k478J537
$$ 2566 2834 -110 -2965 -1924 1181 3379 1531 -1807 -2826 -271 2712 2331 -559 -3037 -1500
5971a500L127J275k325k731l33K340K605n70k840j618J712K615Q17k622k526M10
$$ -1500 1627 2902 577 -2154 -2487 -147 2458 1888 -952 -2570 -858 1757 2574 -48 -2574 -2164
5987b164L100J910j519l065j176K473K822P0k772k497J160L223J228k127l002
$$ -2164 936 2846 1327 -1738 -2914 -441 2381 2451 -321 -2818 -1658 1565 2793 666 -2336
6002b336m86L099K737q29l520j918J613L512J220k533l399j64L441L163j180m283
$$ -2336 -2822 277 3014 2185 -1335 -3253 -1640 1872 3092 559 -2840 -3004 437 3600 2420 -1863
6018a863j942K045M035J627l428l594L15L549K985j059m713k323K641M264J232
$$ -1863 -3805 -1760 2275 3902 474 -3120 -2805 744 3729 2670 -2043 -4366 -1725 2539 3771
6033C771l184m266R4L929L258o55m269k891J910M937J383l411l753r08M541L009
$$ 3771 587 -3679 -3585 344 3602 2947 -1322 -4213 -2303 2634 4017 606 -3147 -4055 486 3495
6049C495m22m629k801K659M159J687l326l572j138M282K909j172l487k743K783
$$ 3495 3073 -1556 -4357 -1698 2461 4148 822 -2750 -3888 394 3303 2131 -1356 -4099 -1316
6064a316L697J676l445l818J058J987L226m48l877k027K179L134R54k997k916
$$ -1316 2381 4057 612 -3206 -2148 -161 3065 2617 -1260 -3287 -1108 2026 2980 -17 -2933
6079b933P29L260J977j166l991l51K062K529l60k002j755M7K938J323j518l250
$$ -2933 -2204 1056 3033 1867 -2124 -2475 -413 2116 1756 -246 -2001 -1954 984 2307 789 -2461
6095b461J65K299K598m38l394j700K519K018O42k373k014J86K942K589k903k872
$$ -2461 -2296 3 2601 2163 -1231 -2931 -412 1606 2248 -125 -2139 -1953 989 3578 675 -2197
6111b197o06J831M078j003k845k700K082K452K303k478l346m31K226L005K06l599
$$ -2197 -2803 -972 3106 2103 -742 -3442 -1360 1092 3395 917 -2429 -2860 -634 2371 2577 -1022
6127a022k383J473L836K076k870l985q84L183M192j288l773k182K099L928N04
$$ -1022 -3405 -1932 1904 3980 1110 -2875 -3759 -576 3616 2328 -1445 -3627 -1528 2400 2904
6142B904j682n056k3M815K360k07m596k079Q49N095J615l276m833M73L166M973
$$ 2904 1222 -3834 -3857 958 3318 3111 -1485 -3564 -2715 2380 3995 719 -4114 -3641 -475 4498
6158D498j741m396k659J729N238J561k834m959L09L251L766j011l823k710J190
$$ 4498 2757 -1639 -4298 -2569 2669 4230 1396 -3563 -3254 -3 3763 2752 -1071 -3781 -2591
6173b591N023J372k280m346n44L389K724m89k868k646J701L001K017k989k690
$$ -2591 2432 3804 1524 -2822 -3366 23 2747 2258 -610 -3256 -1555 1446 3463 474 -2216
6188b216m21L119J967k81l492j453J569K977N59k176k563K28K656J630o36l069
$$ -2216 -2637 482 2449 2168 -1324 -2777 -1208 1769 2328 152 -2411 -2183 473 2103 1467 -1602
6204a602o47J856K395J65k753j770P69K614J533j920k294m38K508J613l28k994
$$ -1602 -2249 -393 2002 2167 -586 -2356 -1587 1027 2560 640 -1654 -2092 416 2029 1701 -1293
6220a293r13J363K868M52k606k416K80K852K309j182l139j321K097K544M70k577
$$ -1293 -2206 -843 2025 2477 -129 -2545 -2265 587 2896 1714 -1425 -2746 -649 1895 2365 -212
6236b12k728Q51L145K172j886l230j409K531L391J97l095k770Q34L512K003j998
$$ -212 -2940 -2089 1056 3228 1342 -1888 -3297 -766 2625 2822 -273 -3043 -2209 1303 3306 1308
6252A308l440j176K774L527J07l568k895J296L421K232k001l892j138K791L715
$$ 1308 -2132 -3308 -534 2993 3100 -468 -3363 -2067 1354 3586 1585 -2307 -3445 -654 3061
6267C061l4l394k978P41L814K197j908l734j124K752L447L12l207l009O83L718
$$ 3061 3027 -367 -3345 -2604 1210 3407 1499 -2235 -3359 -607 2840 3152 -55 -3064 -2381 1337
6283A337J775j665l501j129K866K874K63l322k381R03L231J697j908l018o99K295
$$ 1337 3112 1447 -2054 -3183 -317 2557 2820 -502 -2883 -1980 1251 2948 1040 -1978 -2677 -382
6299c82K653k42k697k006R73K941J403j989k637j87K232K271p68k249j595J254
$$ -382 2271 2029 -668 -2674 -1701 1240 2643 654 -1983 -2170 62 2333 1565 -684 -2279 -1025
6315a025K681N25j741k420L08J973J787o27k539j086J721J872M68k182j557J60
$$ -1025 1656 2181 440 -1980 -1672 301 2088 1461 -1078 -2164 -443 1429 1897 -285 -1842 -1682
6331a682K586J226j214k492p71J957K502m25k234j841R05K867P93j364k747l62
$$ -1682 904 2130 916 -1576 -2347 -390 2112 1687 -547 -2388 -1483 1384 2177 813 -1934 -2296
6347b296K082K641n50k745j642J169K882J097k039k619m48K712K172m01k817j777
$$ -2296 -214 2427 1877 -868 -2510 -1341 1541 2638 599 -2020 -2468 244 2416 2015 -802 -2579
6363b579J477K985P09k167k804p8K754K310o37l178j637J691K947P48k069k729
$$ -2579 -1102 1883 2592 425 -2379 -2457 297 2607 1970 -1208 -2845 -1154 1793 2541 472 -2257
6379b257K3K787K404j107k992j584J532L023R49k590k509j1K699K253p08k971
$$ -2257 -2234 553 2957 1850 -1142 -2726 -1194 1829 2778 188 -2321 -2332 367 2620 1912 -1059
6395a059j548J619K663R71k395k631m3K844K145j083k698j295J745K376P17k312
$$ -1059 -2607 -988 1675 2646 251 -2380 -2423 421 2566 1483 -1215 -2510 -765 1611 2328 16
6411A6k162M21K512J536j088k572j020J965K289J36k124k084Q48K357J506j729
$$ 16 -2146 -1725 787 2323 1235 -1337 -2357 -392 1897 2033 -91 -2175 -1327 1030 2536 807
6427H07k434p01J974K344l18k106j744P44K637J099j296k902n19K494K070n81
$$ 807 -1627 -2328 -354 1990 1672 -434 -2178 -1434 1203 2302 1006 -1896 -2415 79 2149 1568
6443A568k150j997J208K569J137j784k342k59K086K315m89k646j610J185K502
$$ 1568 -582 -2579 -1371 1198 2335 551 -1791 -2050 36 2351 1862 -784 -2394 -1209 1293
6458A293J067k006k364K1K375J774p66k462j516J488K685O81j988k360L8K771
$$ 1293 2360 354 -2010 -1989 386 2160 1394 -1068 -2584 -1096 1589 2270 282 -2078 -2040 731
6474G31J638r32k585j106J515K474M88j974k394K83K494J716j020k812j139K010
$$ 731 2369 1437 -1148 -2254 -739 1735 2223 249 -2145 -1862 632 2348 1328 -1484 -2623 -613
6490f13K469K80k171k207M60K404J516j086k449p56J730K196J85k198j828N38
$$ -613 1856 2136 -35 -2242 -1782 622 2138 1052 -1397 -2153 -423 1773 1958 -240 -2068 -1530
6506a530K467J116j002k583n74J958J943rk459j588R91K597Q83j758k434M3K455
$$ -1530 937 2053 1051 -1532 -2106 -148 1795 1786 -673 -2261 -1270 1327 2210 452 -1982 -1939 516
6523E16J804p93k270j628J395K416O20j826k341k05K545K210r88k884j314J747
$$ 516 2320 1527 -743 -2371 -976 1440 2060 234 -2107 -2312 233 2443 1455 -1429 -2743 -996
6539i96K698O63k233k161J48K443K335j220l022j246J787K673N92k586k374R74
$$ -996 1702 2365 132 -2029 -1881 562 2897 1677 -1345 -2591 -804 1869 2461 -125 -2499 -1525
6555a525K025K046j233k808j397K051L159J17k444k618O49K800J923j120l447
$$ -1525 500 2546 1313 -1495 -2892 -841 2318 2435 -9 -2627 -1978 822 2745 1625 -1822
6570a822q41J849K986K90k656k278K98L221J660j283l000j094J960K785J93k453
$$ -1822 -2663 -814 2172 2462 -194 -2472 -2174 1047 2707 1424 -1576 -2670 -710 2075 2268 -185
6586a85k252O55K425J912j560k685p79J972K392r9k118j919Q28K317J408j525
$$ -185 -2437 -1782 643 2555 995 -1690 -2469 -497 1895 1796 -322 -2241 -1413 904 2312 787
6602G87k237o79J856K268l16k249j405Q59K260P38j358k070j25J893J577n73j953
$$ 787 -1450 -2129 -273 1995 1679 -570 -1975 -1116 1144 1882 524 -1546 -1671 222 1799 1226 -727
6619g27j120J020K169N07j754j770J54K286J398r56k470p63J591K153l7k026j740
$$ -727 -1847 -827 1342 1849 95 -1675 -1521 765 2163 1207 -1263 -2026 -435 1718 1681 -345 -2085
6636b085R16K184J420j806k323m40K090K405n91k416j678J286K449J277k212k460
$$ -2085 -1169 1015 2435 629 -1694 -2134 -44 2361 1770 -646 -2324 -1038 1411 2688 476 -1984
6652a984j56K292K259o74k680j605J037K850J286k236k793j6K788K391p87l033
$$ -1984 -2140 152 2411 1737 -943 -2548 -1511 1339 2625 389 -2404 -2420 368 2759 1972 -1061
6668a061j958J817L279P51k300k950l87L015K622p43l280j943J710L316J106k323
$$ -1061 -3019 -1202 2077 2828 528 -2422 -2809 206 2828 2085 -1195 -3138 -1428 1888 2994 671
6684F71l074l18K842K555p45l071j839J470L322J256k617k914m0K849K201m22
$$ 671 -2403 -2721 121 2676 1931 -1140 -2979 -1509 1813 3069 452 -2462 -2502 347 2548 2126
6700B126l129j800J541K883J089k224k621J17K364J931n77k957j302J685K443
$$ 2126 -1003 -2803 -1262 1621 2710 486 -2135 -2018 346 2277 1700 -1257 -2559 -874 1569
6715A569O87k046k116J93K240J735j135k238p85J711J519J61k003j487R49J887
$$ 1569 2256 210 -1906 -1713 527 2262 1127 -1111 -1896 -185 1334 1495 -508 -1995 -1046 841
6731H41R57j182k246j70J897J561l41k223q99J229J957L82j880j652K63K354J395
$$ 841 1798 616 -1630 -1800 97 1658 1317 -906 -1805 -576 1381 1763 -117 -1769 -1506 848 2243
6748B243j217k490q23J838K456l62k132j605O80K430J094j429k482l62J852K728
$$ 2243 1026 -1464 -2287 -449 2007 1645 -487 -2092 -1412 1018 2112 683 -1799 -2161 -309 2419
6764B419p61k408j785J002K965J551k465k504n28K575K630n04l062k235J528L213
$$ 2419 1658 -750 -2535 -1533 1432 2983 518 -1986 -2514 61 2691 2187 -875 -3110 -1582 1631
6780A631J392k261k914n24K590K632j97l102k156J083L151J733k040l203p98K665
$$ 1631 3023 762 -2152 -2676 -86 2546 2349 -753 -2909 -1826 1325 3058 1018 -2185 -2983 -318
6796c18L006j50l139k204J175K895J610j742k861j063K328K905k94k824k094J023
$$ -318 2688 2538 -601 -2805 -1630 1265 2875 1133 -1728 -2791 -463 2442 2148 -676 -2770 -1747
6812a747K999J408j575k732p47K179K148o6k280j854R35K477J096j627k182n88
$$ -1747 1252 2660 1085 -1647 -2394 -215 1933 1867 -413 -2267 -1332 1145 2241 614 -1568 -2156
6828b156K154J916l74k187j294R83K333L58j357j714j34J901J434n93k178q45
$$ -2156 -2 1914 1540 -647 -1941 -958 1375 1733 376 -1338 -1472 429 1863 1270 -908 -1753
6844a753J357J774P3j782j321M45J955R05j078j835m04J753J363k20j862j254
$$ -1753 -396 1378 1451 -331 -1652 -1207 748 1653 575 -1260 -1664 89 1452 1232 -630 -1884
6860a884J121K106L62j609j717J80K054J273q96k151j030J803K277L9k060j934
$$ -1884 -763 1343 1705 96 -1621 -1441 613 1886 990 -1161 -2191 -388 1889 1928 -132 -2066
6876b066N23K155J815j291k628q40K074K369J01k519k110O45K691J743j461k789
$$ -2066 -1543 612 2427 1136 -1492 -2332 -258 2111 2212 -307 -2417 -1772 919 2662 1201 -1588
6892a588r81K081K654K62k555k308P11K518J939j430k721j158K139K828O7k637
$$ -1588 -2569 -488 2166 2428 -127 -2435 -1724 794 2733 1303 -1418 -2576 -437 2391 2458 -179
6908a79k110M69K547J779j272k764j031K055K314L33k245k249O69K536J561j356
$$ -179 -2289 -1820 727 2506 1234 -1530 -2561 -506 1808 2141 -104 -2353 -1684 852 2413 1057
6924A057k549p35J485K503K16j863k040L10K356J191r24k315q95J715J967L57
$$ 1057 -1492 -2227 -742 1761 1977 114 -1926 -1616 740 1931 1007 -1308 -2203 -488 1479 1836
6940A836j983j542M20K081J096j253j893n84J587J787j03j813j258P04J862N98
$$ 1836 -147 -1689 -1269 812 1908 655 -1238 -1822 -235 1552 1449 -364 -1622 -918 944 1542
6956A542j367j332k1J468R91k09j698q86J069J481N54j659j226K25J474J026m80
$$ 1542 175 -1157 -1178 290 1281 1072 -626 -1512 -443 1038 1592 -67 -1293 -1068 406 1432 952
6973I52k012l59J234J794l66j630j426P42J896R62j030k268m3J630J782n14j856
$$ 952 -1060 -1419 -185 1609 1243 -387 -1813 -1071 825 1787 757 -1511 -1554 76 1858 1344 -512
6990e12j182P32K067J108j598k305j08J726K085l96k365j305Q90K438P91j467
$$ -512 -1694 -962 1105 2213 615 -1690 -1798 -72 2013 1617 -748 -2053 -1163 1275 2066 599
7006E99k275k00J974J838m20k116j444Q28K519Q45j836k139%K036J867n45k299
$$ 599 -1676 -1876 98 1936 1516 -600 -2044 -1216 1303 2148 312 -1827 -1827 209 2076 1531 -768
7023g68j357J130K093Q74j435k250j35K028J638l16k188j149Q39J947Q99j440
$$ -768 -2125 -995 1098 1972 537 -1713 -1848 180 1818 1502 -686 -1835 -996 951 1850 410
7039D10k010j39J707J924m08k333j092J247K048L11j353j975L56J177K198q25
$$ 410 -1600 -1739 -32 1892 1484 -849 -1941 -694 1354 1665 312 -1663 -1307 -130 2068 1243
7055A243k292q08J326J664N74j589j444j23J659J451p74j967n87J244J948k59
$$ 1243 -1049 -1857 -531 1133 1707 118 -1326 -1449 210 1661 887 -1080 -1667 -423 1525 1266
7071A266j592j445O17J816P43r95j741k74J521J374P9j811r09K92J706J113j276
$$ 1266 -326 -1771 -1154 662 1405 410 -1331 -1605 -84 1290 1369 -442 -1351 -1059 647 1760 484
7088D84j688n71J791J169n1j875j149J234J947O70j347k705L59J878J829p66k147
$$ 484 -1204 -1775 16 1185 1134 -741 -1890 -656 1291 1961 614 -2091 -1732 146 1975 1209 -938
7105i38r76J381J809M71j407k128M55J431J521l33j999p53Q24K494j57j718j738
$$ -938 -1914 -533 1276 1747 340 -1788 -1333 98 1619 1286 -713 -1466 -642 1852 1695 -23 -1761
7122a761K2K139J594m69k792o19J866J516N03j787k136P41K120L69j54k503q25
$$ -1761 -1739 400 1994 1525 -1267 -1886 -20 1496 1999 212 -1924 -1183 937 1306 1152 -1351 -2176
7139b176J773J618M64j791j618L41K284P48q09j589j227J639J796k2j605j505
$$ -2176 -403 1215 1679 -112 -1730 -1389 895 1643 834 -755 -1982 -343 1453 1431 -174 -1679
7155a679Q92J704O87r58j864n02J655K180p97k027j506J242K160L82j135k337
$$ -1679 -787 917 1604 646 -1218 -1720 -65 2115 1318 -709 -2215 -973 1187 1569 434 -1903
7171a903K43J982J724o66k110j416J337K171j85n56k322K11R88K366m54k595j157
$$ -1903 -1660 322 2046 1380 -730 -2146 -809 1362 1177 621 -1701 -1490 -502 1864 1410 -1185 -2342
7188b342J531J959M47j204j910J2J934J509k47k852m97J273J771L56k080q01o52
$$ -2342 -811 1148 1595 391 -1519 -1507 427 1936 1689 -1163 -1660 -387 1384 1740 -340 -1141 -1793
7205a793J912J639o38k341q87J488J965N19j826j858O2K354J359n22k921n72J812
$$ -1793 119 1758 1120 -1221 -2108 -620 1345 1864 38 -1820 -1758 596 1955 1433 -1488 -2060 -248
7222b48J945K23k079j732M41K036J742j284k316l18J541J781k57k347j024N09
$$ -248 1697 1920 -159 -1891 -1450 586 2328 1044 -1272 -1590 -49 1732 1475 -872 -1896 -1387
7238a387J200J282n6k500k89J511J846r90j356j224M58K248R65j806j275M37J516
$$ -1387 -187 1095 1039 -1461 -1750 -239 1607 617 -739 -1963 -1505 743 1708 -98 -1373 -936 580
7255E80J615j431j501p48O38K540n28j609r28O50J742N11r16j663j055K029J725
$$ 580 2195 764 -737 -1485 -847 1693 1165 -444 -1372 -722 1020 1531 615 -1048 -2103 -74 1651
7272A651l96j837j043J045J556M46Q7k824l15J535J701J53k780q08J579J730k37
$$ 1651 1255 -582 -1625 -580 976 1422 1509 -1315 -1630 -95 1606 1759 -1021 -1829 -250 1480 1243
7289A243j599j540K11K319J650j211j930j127O67K720M54k268j258l62K319J809
$$ 1243 -356 -1896 -1685 634 2284 1073 -857 -1984 -1317 1403 1857 -411 -1669 -2031 288 2097
7305B097m39k022j627M52L261J218k990j648k39K116K307j035k456j213J080L278
$$ 2097 1658 -364 -1991 -1539 1722 2940 -50 -1698 -1937 179 2486 1451 -1005 -2218 -1138 2140
7321B140l35k258q87q07K195J728o22k459j998K522K462L39j405k181L02J199
$$ 2140 1805 -453 -1340 -2147 48 1776 1154 -1305 -3303 -781 1681 2020 615 -1566 -1264 -65
7337f5K217q91k671l93J188K170N92j733j782j79J774J618l65k424p91J192J033
$$ -65 2152 1261 -1410 -1803 -615 1555 2147 414 -1368 -1547 227 1845 1480 -944 -1735 -543 490
7354D90N85r68j526O34J209N65l08j610p32J554J241N63k032q66K98J760M78l69
$$ 490 1075 107 -1419 -785 424 989 681 -929 -1661 -107 1134 1697 -335 -1201 -903 857 1335 966
7372I66k429J59J500R01r0j348q76R91K018m50j567j388K24J908L52r6j889r22
$$ 966 -1463 -1304 196 1097 1007 -341 -1217 -226 1792 1342 -225 -1613 -1389 519 871 775 -1114 -2036
7390b036J670J765k03j775r24K67K278Q04j407j806n81J822J613K34k608j231
$$ -2036 -366 1399 1196 -579 -1503 -1236 1042 1846 439 -1367 -1948 -126 1487 1721 -887 -2118
7406b118N60K506R23j134k160n57K584J580m07k109j849J336K554N13j006k775
$$ -2118 -1558 948 1871 737 -1423 -1980 604 2184 1777 -332 -2181 -845 1709 2222 1216 -1559
7422a559n46K167K235o91k003j745O92K504J077j492k210n72K048J839J22k557
$$ -1559 -2105 62 2297 1606 -397 -2142 -1450 1054 2131 639 -1571 -2143 -95 1744 1866 -691
7438f91j559R14K287J120j293k185q67K043J944K8j942j828Q36K178Q02r66k187
$$ -691 -2250 -1336 951 2071 778 -1407 -2274 -231 1713 1741 -201 -2029 -1193 985 1787 821 -1366
7455a366j46J588J376p8j704j257N48J630J026j092j838Q9J201J098p9j483j147
$$ -1366 -1512 76 1452 1374 -330 -1587 -1039 591 1617 525 -1313 -1224 -23 1075 996 -487 -1634
7472a634J225J503K81j458p94J54J050Q88p24j385k21J010Q99J33j398r03P08
$$ -1634 -409 1094 1375 -83 -877 -723 327 1215 491 -894 -1115 -105 794 927 -471 -1374 -666
7489f66J362L63q06j269M3J191J087n57j395q19Q23J543K42j396j094M86J383
$$ -666 696 1059 253 -1016 -973 218 1305 748 -647 -1466 -643 900 1142 -254 -1348 -862 521
7506E21J067m87k061n20J165J579L6j320j684N49J679J211q62j995m38J206J937
$$ 521 1588 1101 -960 -1480 -315 1264 1300 -20 -1704 -1155 524 1735 873 -1122 -1560 -354 1583
7523A583j39j741j413L12K097J175j303j530j026J523J925K78j937j735L80K117
$$ 1583 1444 -297 -1710 -1398 699 1874 571 -959 -1985 -462 1463 1741 -196 -1931 -1551 566
7539E66J463q97k176r93J495K221J65j893j629J75K239J393j120k055q40J372
$$ 566 2029 1132 -1044 -2037 -542 1679 1844 -49 -1678 -1503 736 2129 1009 -1046 -1886 -514
7555e14J801O76j805j953J75J904J552q41j903q64J071J889K86j390j593J57J684
$$ -514 1287 1963 158 -1795 -1620 284 1836 995 -908 -1772 -701 1188 1474 84 -1509 -1352 332
7572C32J355r29j739p12J233J721N8j379j288M51J327R67p18j551k09R89J308
$$ 332 1687 758 -981 -1693 -460 1261 1319 -60 -1348 -897 430 1397 679 -872 -1081 -92 1216
7589A216j81j305r94L11J706M61j034j098l68J532P50k67j545k99O46J401Q2j194
$$ 1216 1035 -270 -1264 -953 753 1214 180 -918 -1286 246 996 729 -816 -1115 -469 932 1014 -180
7607a80q77J09J296Q95o38j372m43J068J480k06j338q99L28J201J000r80j462
$$ -180 -1057 -948 348 1243 605 -767 -1210 -142 1338 1132 -206 -1105 -777 424 1424 444 -1018
7624a018l60J574J014p9j712j044P64K014M92j420j340l75J568J426k70j797j072
$$ -1018 -1378 196 1210 1131 -581 -1625 -861 1153 1645 225 -1115 -1490 78 1504 1234 -563 -1635
7641a635R91J682P02j321j884j12J733J535l55j779j276P70J943N91j219j841
$$ -1635 -644 1038 1740 419 -1465 -1577 156 1691 1336 -443 -1719 -949 994 1585 366 -1475
7657a475k65J687J506j86k002j001P79J895P59j192k139kJ744J598m38j857j100
$$ -1475 -1740 -53 1453 1267 -735 -1736 -957 938 1697 505 -1634 -1636 108 1706 1268 -589 -1689
7674a689Q87J939M90j121j867o2J566J462l71j838j063R63J771N27j395j494J19
$$ -1689 -802 1137 1627 506 -1361 -1423 143 1605 1234 -604 -1667 -704 1067 1594 199 -1295 -1176
7691a176J230J480m14j812r71J112J587M24j141j537M8J362J040l83j663n63R91
$$ -1176 54 1534 1120 -692 -1663 -551 1036 1460 319 -1218 -1170 192 1232 849 -814 -1377 -386
7708c86J532K65j761r59L36J590R71j273j110m33J035J481k82j372r65M87J550
$$ -386 1146 1411 -350 -1309 -973 617 1588 315 -795 -1228 -193 1288 1006 -366 -1331 -844 706
7725G06O22j136j344J20R57J237k62j323r50Q71J471N17j142j623J98J378J201
$$ 706 1328 192 -1152 -1032 -75 1162 900 -423 -1373 -502 969 1486 344 -1279 -1081 297 1498
7742A498n27j459j235J270J518M76j684j184L1J719J031m31k009p66J337J546
$$ 1498 971 -488 -1723 -453 1065 1541 -143 -1327 -1296 423 1454 1023 -986 -1752 -415 1131
7758A131L78j480j550N07J557J178q22j926o89J067J992J11j632j303M64J466
$$ 1131 1509 29 -1521 -1014 543 1721 899 -1027 -1716 -649 1343 1454 -178 -1481 -1017 449
7774D49J103o27j922k98J042J599p0j294j486M73J486J061q71j863k93J214J413
$$ 449 1552 925 -997 -1295 -253 1346 1276 -18 -1504 -1031 455 1516 645 -1218 -1511 -297 1116
7791A116l3j470j297P18J775P30j050j630m52J600J347q8j769j015R28J826K46
$$ 1116 1083 -387 -1684 -966 809 1539 489 -1141 -1593 7 1354 1266 -503 -1518 -590 1236 1482
7808A482r89j752J93J180J413l85j607r63Q24J726K26j306j380J20J451J410q21
$$ 1482 493 -1259 -1066 114 1527 1142 -465 -1428 -604 1122 1348 42 -1338 -1218 233 1643 822
7825H22j644j001J262J676K42j355j661M13J888R12n05j877p57J223J610K54j647
$$ 822 -822 -1823 -561 1115 1357 2 -1659 -1246 642 1554 1049 -828 -1585 -362 1248 1502 -145
7842a45j334L53J865Q75q57j956m29J164J610M10j707j593R31J545R21j116j429
$$ -145 -1479 -1126 739 1614 757 -1199 -1628 -464 1146 1556 -151 -1744 -813 732 1653 537 -892
7859h92o18J300J755m73j180j463O50J538Q24q02j789j24J582J212k91j622j116
$$ -892 -1510 -210 1545 1072 -108 -1571 -921 617 1441 639 -1150 -1274 308 1520 1229 -393 -1509
7876a509N21K003M71j071j585J17J203R87k37j559q06Q41J619L00j252j061qJ399
$$ -1509 -988 1015 1486 415 -1170 -1053 150 1137 900 -659 -1465 -624 995 1295 43 -1018 -1026 373
7894C73Q89n42j500n87J099J312K47j288j509O59J419R71j039j337o02J272J409
$$ 373 1262 720 -780 -1367 -268 1044 1291 3 -1506 -847 572 1543 504 -833 -1435 -163 1246
7911A246p6j400j329N51J946L94j185j478r6J452J631l87j906q77Q21J789M79
$$ 1246 1170 -230 -1559 -1008 938 1332 147 -1331 -1427 25 1656 1269 -637 -1514 -693 1096 1575
7928A575j171j667J3J472J272m24j778r49R64J816M79j543j448j27J532J684m37
$$ 1575 404 -1263 -1250 222 1494 1070 -708 -1657 -693 1123 1602 59 -1389 -1516 16 1700 1263
7945A263k130r53R91K055L90j484j806j02K144J275k74k027j372J337J952M58
$$ 1263 -867 -1820 -829 1226 1616 132 -1674 -1776 368 1643 1369 -658 -2030 -693 1259 1717
7961A717j435j820K49J595J592p47j778j019J044J718M16j373j553J56J687R37
$$ 1717 282 -1538 -1289 306 1898 1151 -627 -1646 -602 1116 1532 159 -1394 -1238 449 1386
7977A386m56j583q18J124J520P5j085j476K93J382J143j047j168p75J036J457
$$ 1386 930 -653 -1471 -347 1173 1248 163 -1313 -1020 362 1505 458 -710 -1485 -449 1008
7993A008J76j250j133J46J574P61o36j635k39J185J132lj478p20O77J313L15j229
$$ 1008 1184 -66 -1199 -1053 521 1282 646 -989 -1228 -43 1089 1086 -392 -1112 -435 878 1193 -36
8011c6q91p2J062J071l91j407o45P52J468L83j434r27K48J568P90r95j355n35
$$ -36 -927 -999 63 1134 743 -664 -1309 -557 911 1294 -140 -1067 -819 749 1539 544 -811 -1346
8029a346J214J253j62j257j109P36J486N02p76j619l62J384J372l92j407j133
$$ -1346 -132 1121 959 -298 -1407 -671 815 1317 541 -1078 -1440 -56 1316 924 -483 -1616
8045a616O23J939P90j677j467k8J344J597l23j780j270J002J714Q93j197k035
$$ -1616 -993 946 1736 59 -1408 -1436 -92 1505 1182 -598 -1868 -866 848 1741 544 -1491
8061a491k31J849J571j70k015j375J086J486Q92j152j893j10J501J485l14j467
$$ -1491 -1722 127 1698 1528 -487 -1862 -776 710 1602 450 -1443 -1553 -52 1433 1119 -348
8077c48j422P70J814O97j199j492l08J369J676l11j805r15P00J541N96q87j233
$$ -348 -1770 -1000 814 1511 312 -1180 -1488 -119 1557 1246 -559 -1474 -774 767 1363 476 -757
8094g57o35J203J335j43j156j059O39J482N78j256p82j86R33Q30m32j284m57R35
$$ -757 -1392 -189 1146 1003 -153 -1212 -573 909 1487 231 -551 -737 196 1026 594 -690 -1147 -212
8112b12R70J03q70r84J09R63R19n55j226m6R01P46k78n12r80O42P80L64o65j028
$$ -212 758 861 -9 -993 -884 79 998 443 -783 -829 72 818 540 28 -952 -310 470 834 169 -859
8132h59n0J094J076o03j318m75Q81J037L25j205r92J85J307P18o56j376k31R28
$$ -859 -909 185 1261 658 -660 -1135 -254 783 1108 -97 -1089 -904 403 1121 465 -911 -1142 -214
8150b14J314n8j080j244M33J381R89p50j950m01J280J718k93j215j591O29J629
$$ -214 1100 1042 -38 -1282 -849 532 1521 771 -1179 -1580 -300 1418 1125 -90 -1681 -1052 577
8167E77Q78p79j540o76J404J537lj745j211L28J782J068q44j720m48R25J539K88
$$ 577 1455 676 -864 -1540 -136 1401 1398 -347 -1558 -1230 552 1620 776 -944 -1392 -467 1072 1360
8185A360j276j388J52J833R09q76
$$ 1360 84 -1304 -1152 681 1590 714
8191G14
$$ Imaginary data points
##PAGE= N=2
##DATA TABLE= (X++(I..I)), XYDATA
0@%%%%%%%%%qJ6j6J6k4L2m0M8n6P2q8J03j19J44j68J93k29K67l07L57m11M68n33
$$ 0 0 0 0 0 0 0 0 0 0 -8 8 -8 8 -16 16 -24 24 -32 40 -48 55 -64 80 -88 105 -124 143 -164 193 -218 250 -283
$$ [...]
##END NTUPLES=NMR FID
##END=
