##TITLE=1H_Pr A4
 , 8 sc, 
 15.2.2019
##JCAMPDX= 6.0         $$ Bruker NMR JCAMP-DX V2.0
##DATA TYPE= NMR FID
##DATA CLASS= NTUPLES
##ORIGIN= UXNMR, Bruker Analytische Messtechnik GmbH
##OWNER= root
$$ XWIN-NMR		Version 3.5
$$ Fri Feb 15 15:41:26 2019 Russian Standard Time (UT+4h)  she@DPX200
##.OBSERVE FREQUENCY= 200.1313
##.OBSERVE NUCLEUS= ^1H
##.DELAY= (6, 6)
##.ACQUISITION MODE= SIMULTANEOUS
##.ACQUISITION SCHEME= undefined
##.AVERAGES= 8
##.DIGITISER RES= 18
##SPECTROMETER/DATA SYSTEM= spect
##.PULSE SEQUENCE= zg30
##.SOLVENT NAME= DMSO
##.SHIFT REFERENCE= (INTERNAL, DMSO, 0, 15.7039)
##AUDIT TRAIL= $$ (NUMBER, WHEN, WHO, WHERE, WHAT)
$$ ##TITLE= Audit trail, XWIN-NMR		Version 3.5
$$ ##JCAMPDX= 5.01
$$ ##ORIGIN= Bruker BioSpin GmbH
$$ ##OWNER= she
$$ F:/spectra/data/she/nmr/H-F/1/audita.txt
$$ ##AUDIT TRAIL=  $$ (NUMBER, WHEN, WHO, WHERE, WHAT)
(   1,<2019-02-15 15:39:33.79 +0400>,<she>,<DPX200>,
      <created by zg, POWCHK disabled, PULCHK disabled
       configuration hash MD5:
       00 E9 B6 7A A2 85 ED C7 34 08 36 98 17 FE 4E 26
       data hash MD5: 16K
       41 42 0F 10 B5 7D 4A D7 47 55 BD FB 61 F5 E4 74>)
$$ ##END=
$$ 
$$ hash MD5
$$ 43 49 B9 5C F0 E4 AD 6D E7 0C 64 74 3C 1D C1 18
##$RELAX= 
##$RELAX= 
##$RELAX= 
##$RELAX= 
##$RELAX= 
##$RELAX= 
$$ Bruker specific parameters
$$ --------------------------
##$DU= <F:/spectra>
##$EXPNO= 1
##$NAME= <H-F>
##$PROCNO= 1
##$TYPE= <nmr>
##$USER= <she>
##$AMP= (0..31)
100 100 100 100 100 100 100 100 100 100 100 100 100 100 100 100 100 100 
100 100 100 100 100 100 100 100 100 100 100 100 100 100 
##$AQSEQ= 0
##$AQ_mod= 1
##$AUNM= <au_zg>
##$AUTOPOS= <>
##$BF1= 200.13
##$BF2= 200.13
##$BF3= 200.13
##$BF4= 200.13
##$BF5= 200.13
##$BF6= 200.13
##$BF7= 200.13
##$BF8= 200.13
##$BYTORDA= 1
##$CFDGTYP= 0
##$CFRGTYP= 5
##$CHEMSTR= <none>
##$CNST= (0..31)
1 1 145 1 1 1 1 1 1 1 1 1 1 1 1 1 1 1 1 1 1 1 1 1 1 1 1 1 1 1 1 1 
##$CPDPRG= <>
##$CPDPRG1= <>
##$CPDPRG2= <>
##$CPDPRG3= <>
##$CPDPRG4= <mlev>
##$CPDPRG5= <mlev>
##$CPDPRG6= <mlev>
##$CPDPRG7= <mlev>
##$CPDPRG8= <mlev>
##$CPDPRGB= <>
##$CPDPRGT= <>
##$D= (0..31)
0 1.2 0 0 0 0 0 0 0 0 0 0.03 0 0 0 0 0 0 0 0 0 0 0 0 0 0 0 0 0 0 0 0 
##$DATE= 1550230773
##$DBL= (0..7)
120 120 120 120 120 120 120 120 
##$DBP= (0..7)
150 150 150 150 150 150 150 150 
##$DBP07= 0
##$DBPNAM0= <>
##$DBPNAM1= <>
##$DBPNAM2= <>
##$DBPNAM3= <>
##$DBPNAM4= <>
##$DBPNAM5= <>
##$DBPNAM6= <>
##$DBPNAM7= <>
##$DBPOAL= (0..7)
0.5 0.5 0.5 0.5 0.5 0.5 0.5 0.5 
##$DBPOFFS= (0..7)
0 0 0 0 0 0 0 0 
##$DE= 6
##$DECBNUC= <off>
##$DECIM= 32
##$DECNUC= <off>
##$DECSTAT= 4
##$DIGMOD= 1
##$DIGTYP= 9
##$DL= (0..7)
0 120 120 120 120 120 120 120 
##$DP= (0..7)
150 150 150 150 150 150 150 150 
##$DP07= 0
##$DPNAME0= <>
##$DPNAME1= <>
##$DPNAME2= <>
##$DPNAME3= <>
##$DPNAME4= <>
##$DPNAME5= <>
##$DPNAME6= <>
##$DPNAME7= <>
##$DPOAL= (0..7)
0.5 0.5 0.5 0.5 0.5 0.5 0.5 0.5 
##$DPOFFS= (0..7)
0 0 0 0 0 0 0 0 
##$DQDMODE= 0
##$DR= 18
##$DS= 0
##$DSLIST= <SSSSSSSSSSSSSSS>
##$DSPFIRM= 0
##$DSPFVS= 10
$$ [...]
##$SUBNAM2= <"">
##$SUBNAM3= <"">
##$SUBNAM4= <"">
##$SUBNAM5= <"">
##$SUBNAM6= <"">
##$SUBNAM7= <"">
##$SUBNAM8= <"">
##$SUBNAM9= <"">
##$SW= 20.0189088683792
##$SWIBOX= (0..15)
0 0 2 0 0 0 0 0 0 0 0 0 0 0 0 0 
##$SW_h= 4006.41025641026
##$TD= 16384
##$TD0= 1
##$TE= 0
##$TE2= 300
##$TE3= 300
##$TEG= 300
##$TL= (0..7)
0 120 120 120 120 120 120 120 
##$TP= (0..7)
150 150 150 150 150 150 150 150 
##$TP07= 0
##$TPNAME0= <>
##$TPNAME1= <>
##$TPNAME2= <>
##$TPNAME3= <>
##$TPNAME4= <>
##$TPNAME5= <>
##$TPNAME6= <>
##$TPNAME7= <>
##$TPOAL= (0..7)
0.5 0.5 0.5 0.5 0.5 0.5 0.5 0.5 
##$TPOFFS= (0..7)
0 0 0 0 0 0 0 0 
##$TUNHIN= 0
##$TUNHOUT= 0
##$TUNXOUT= 0
##$USERA1= <user>
##$USERA2= <user>
##$USERA3= <user>
##$USERA4= <user>
##$USERA5= <user>
##$V9= 5
##$VALIST= <valist>
##$VCLIST= <CCCCCCCCCCCCCCC>
##$VD= 0
##$VDLIST= <DDDDDDDDDDDDDDD>
##$VPLIST= <PPPPPPPPPPPPPPP>
##$VTLIST= <TTTTTTTTTTTTTTT>
##$WBST= 1024
##$WBSW= 4
##$XGAIN= (0..3)
0 0 0 0 
##$XL= 0
##$YL= 0
##$YMAX_a= 238042
##$YMIN_a= -278369
##$ZGOPTNS= <>
##$ZL1= 120
##$ZL2= 120
##$ZL3= 120
##$ZL4= 120
##$ABSF1= 10
##$ABSF2= 0
##$ABSG= 5
##$ABSL= 3
##$ALPHA= 0
##$AQORDER= 0
##$ASSFAC= 0
##$ASSFACI= 0
##$ASSFACX= 0
##$ASSWID= 0
##$AUNMP= <proc_1d>
##$AZFE= 0.1
##$AZFW= 0.1
##$BCFW= 1
##$BC_mod= 2
##$BYTORDP= 1
##$COROFFS= 0
##$CY= 11.3945322036743
##$DATMOD= 1
##$DC= 2
##$DFILT= <>
##$DTYPP= 0
##$F1P= 18.9103706918063
##$F2P= -1.10871071338519
##$FCOR= 0.5
##$FTSIZE= 0
##$FT_mod= 4
##$GAMMA= 1
##$GB= 0.15
##$INTBC= 1
##$INTSCL= 1
##$ISEN= 128
##$LB= 0.24
##$LEV0= 0
##$LPBIN= 0
##$MAXI= 10000
##$MC2= 0
##$MEAN= 0
##$ME_mod= 0
##$MI= 1.114404
##$NCOEF= 0
##$NC_proc= 0
##$NLEV= 6
##$NOISF1= 3.799351
##$NOISF2= 2.8
##$NSP= 1
##$NTH_PI= 0
##$NZP= 0
##$OFFSET= 15.70392
##$PC= 1
##$PHC0= -9131.559
##$PHC1= 8.600144
##$PH_mod= 1
##$PKNL= yes
##$PPARMOD= 0
##$PSCAL= 0
##$PSIGN= 0
##$REVERSE= no
##$SF= 200.130013532006
##$SI= 16384
##$SIGF1= 3
##$SIGF2= 2
##$SINO= 400
##$SIOLD= 16384
##$SREGLST= <1H.CDCl3>
##$SSB= 0
##$STSI= 0
##$STSR= 0
##$SW_p= 3612.71676300578
##$SYMM= 0
##$S_DEV= 0
##$TDeff= 0
##$TDoff= 0
##$TI= <>
##$TILT= no
##$TM1= 0
##$TM2= 0
##$TOPLEV= 0
##$USERP1= <user>
##$USERP2= <user>
##$USERP3= <user>
##$USERP4= <user>
##$USERP5= <user>
##$WDW= 1
##$XDIM= 8192
##$YMAX_p= 0
##$YMIN_p= 0
$$ End of Bruker specific parameters
$$ ---------------------------------
##NTUPLES= NMR FID
##VAR_NAME=  TIME,          FID/REAL,        FID/IMAG
##SYMBOL=    X,             R,               I
##VAR_TYPE=  INDEPENDENT,   DEPENDENT,       DEPENDENT
##VAR_FORM=  AFFN,          ASDF,            ASDF
##VAR_DIM=   8192,          8192,            8192
##UNITS=     SECONDS,       ARBITRARY UNITS, ARBITRARY UNITS
##FACTOR=    0.0002496,     1,               1
##FIRST=     0,             0,               0
##LAST=      2.0444736,     0,               0
##MIN=       0,             -278369,         0
##MAX=       2.0444736,     238042,          0
$$ Real data points
##PAGE= N=1
##DATA TABLE= (X++(R..R)), XYDATA
0@%%%%%%%%%%%%Qj6J6j6K4l2L2m0M8n6P2q6J00j16J34j52J73j97K25k60K96l33
34a76L74m20M75n35N96o63P37q18R05j002J109j224J349j487J640j807J988k190
52a149K416k666K948l266L627m045M531n105N798o650P730r144J1081j3907J8406
67A0605k6633M6201j69284j39258M08799j17228N04J26773k67238Q6732K78069
78B38042l68878q7663L23331q2668K3248J21293l37306O6439L21984k93098j02939
89a78215K59934q3780R6485J11330m05305o086L55408j50248m6770J61929j77643
100f2961P6754J69198l59627j8165L41857j10225k7156R3459k37813J01055K28992
111A95368l11725o3486K78399o3074L4835O9412l18523M7750K87224k03101l7615
$$ y = [0, 0, 0, 0, 0, 0, 0, 0, 0, 0, 0, 0, 0, 8, -8, 8, -8, 16, -16, 16, -24, 24, -32, 40, -46, 54, -62, 72, -80, 93, -104, 121, -139, 157, -176, 198, -222, 253, -282, 314, -349, 388, -430, 475, -527, 582, -642, 707, -780, 860, -947, 1041, -1149, 1267, -1399, 1549, -1717, 1910, -2135, 2396, -2709, 3089, -3561, 4169, -4975, 6106, -7801, 10605, -16028, 30173, -139111, -278369, 130430, 13202, 13706, 140479, -126759, -40027, 238042, -130836, -218499, 104832, 22164, 45412, 166705, -170601, -104162, 217822, -75276, -178215, 81719, -2061, 94424, 205754, -199551, -205637, 149771, -477, -47247, 114682, -62961, 13793, 182991, -176636, -194801, 147056, 36831, 9675, 103134, -134679, -33624, 195368, -116357, -179843, 98556, 35482, 70317, 139729, -178794, -131044, 156180, -46921, -84536]
122h4536K00893j23499M3957P9675l10898N2927L07503j41194n4162J04650j56855
133h1539Q4489J45017k91368m423K72069q9329k805O1500k24915O8647J84321
144A21664k10871L381K12026r4579o504L3169k27647Q2626K38346j57510l8293
155d4192J19763j13415M9530P3770k23373M5856K12837j02804j7462O7930j40470
166g2030M4737J00911j80431L9363J98485r1948l0588J8690j57979Q5344J57317
177A11871j41389m785J13591q9859R688M0713j48654N9539J53471j10568r259
188a5641Q1982j00632K0297M7398j36798O5765J53156q6133l0216J8334j04068
199h6556N4980R7802j01268K0548R6139q7580j0235L3274r2044N5944Q9587r1403
$$ y = [-84536, 116357, -7142, 36815, 116490, -194408, -141481, 166022, 24828, -29334, 75316, -81539, 2950, 147967, -143401, -147824, 124245, 34916, 32111, 93611, -131304, -62657, 121664, -89207, -85826, 126200, 31621, 25117, 58286, -169361, -86735, 151611, -5899, -44192, 75571, -37844, 11686, 85456, -137917, -92061, 120776, 17972, 510, 68440, -72030, -27293, 73618, -106813, -67450, 131035, 39087, 8499, 27189, -130790, -45446, 111871, -29518, -34303, 79288, -10571, -883, 39830, -108824, -49285, 104186, -6382, -15641, 66341, -34291, -13994, 33404, -103394, -37629, 115527, 29394, -822, 17512, -86556, -31576, 66226, -35042, -14494, 81645, -5935, -16170, 17104, -74940, -18996, 70591, -20812]
211b0812J1302O8379o9886k740J8392q1103N7166J04546o5640j9874K0172p6224
223e6322K7038N7905n7034L6842N8275p2304j3854K1596m5249L5119M7194n6449
235a7243J4371N1202n1321j1631J0868m9372M3237O3002m0593j843P803n5483
247c7003P107L3382j6923L0810L1429n2111j5280J7713k6073K0396K8003l1817
259a0367J6042K5540l3472o130J053k4456K2259L4644r657O52o45l9576o040K3618
273f535J659K3690J4030l2237j0629J617r355J3330J2765o040L952P250j0754
286B743p730j296j1964O527K1604N562L569r155k4806p745P544J5313J6056L420
300A9642r579j6788p258K663N946J0979K321l708k96q66k689p154l587J393P585
$$ y = [-20812, -9510, 58869, -11017, -13757, 4635, -76468, -19302, 85244, 19604, -270, 19902, -56322, -29284, 28621, -28413, 8429, 66704, -5600, -19454, 2142, -43107, -7988, 39206, -17243, -2872, 48330, -2991, -14622, -3754, -53126, -9889, 53113, 12520, 10677, 18480, -37003, -29896, 3486, -13437, 17373, 48802, -3309, -18589, -876, -26949, -6553, 21450, -10367, 5675, 31215, -2257, -8387, -7334, -31790, -9531, 25113, 15456, 16108, 15463, -24113, -30153, -6535, -4876, 18814, 32844, 607, -10022, -8405, -17760, -4430, 8335, 2295, 6247, 13497, 2743, -4987, -6283, -18247, -11720, 9884, 15446, 19015, 9860, -14946, -22691, -15147, 166, 16222, 19642, 10063, -6725, -13983, -11320, -5374, 5605, 7926, 4218, 3922, 3056, 367, -6787, -10374, -8981, -1396]
315a396J7122P75j1711q503j4806J058J8184R597N619k801j6904j1782N387P894
329b267M463Q124n864p885Q669m821p095M296o181M220J5671p0n309n318j2858
344a2225n155J4592J1663K453L131j5467j4958Q839L554N302R430q495n071L983
358A576k347j745J266k724j399R664N037m104j405j1359p579J0720Q382P215J056
373A2254j2406r157j200O920P776K106p25o758k486L558l08J23j081j565J535
388a414N670M612p267n294l244m818J4356R899p176q64q860r714J1621Q064l472
403B099L759j884j2868O663P773j0861P693J976j6152J5172Q301j5511O691m292
417a441j5986J9349J2083j4900O130j118k2759J6083J3265j8729J6900L284l0211
$$ y = [-1396, 15726, 16501, 4790, -3713, -18519, -17461, 723, 10320, 15939, 13138, -3766, -15548, -10161, -2267, 2196, 10320, 4456, -3429, 5240, 419, -6676, -2380, -8561, -4341, 11330, 11260, 5951, 633, -12225, -17380, -2788, 8875, 11328, 14459, -1008, -15966, -7127, -3573, 1729, 11159, 2664, -2407, 1576, -771, -2516, -1250, -3974, -5373, 4291, 9328, 5224, 3819, -7540, -15119, -4399, 3983, 11198, 12254, -152, -9309, -10509, -3589, 4187, 6293, 5568, -1190, -3676, -118, -426, -303, -1384, -2949, -1414, 4256, 8868, 1601, -3693, -6937, -11755, 2601, 12500, 5324, 4460, -4400, -14114, -2493, 5571, 2099, 5858, 3974, -8894, -2231, 5542, -5319, 2374, 4350, -11802, 3370, 11671, -3840, 2851, -1441, -17427, 1922, 14005, -895, 5235, 4117, -18642, -2559, 10706, -8023, 8877, 12161, -18050]
430a8050J7534R291k0515K0244Q65k9329K2138J3584k5482J4861K476l2686K7828
443B759J6411l2992K2893M565l9639K7286J0994l0333L2027M992m4572K4732J4921
456A4044l2595L0160N783m8238L5053J8324m4027L1095N444m7172L9818J2192
468A9881m4876L7881R180n2711L1989J4247m2540M4450R841o3483L7944J8545
480B0348m8622M4421N173n9598M8145J4891n5978M2834J0828n8320M4946J3295
492B2363n8706N3504J4549p1838M4774J4789n6408O0516O961p5005N2420J6509
504B4428o1778N4590R471p0347N8036J4553p3623O0422J5762p5945N8379R776
516B3724p0695P1632J0832q3535N7214J3706o7124O9178R209q4537O4068J5786
$$ y = [-18050, -516, 8775, -11740, 8504, 9369, -19960, 2178, 15762, -9720, 5141, 7617, -25069, 2759, 19170, -13822, 9071, 13636, -26003, 1283, 12277, -18056, 13971, 18963, -25609, -877, 14044, -18551, 11609, 17392, -30846, 4207, 22531, -21496, 9599, 15043, -32129, 7689, 19881, -24995, 12886, 22066, -30645, 1344, 15591, -26949, 17501, 27342, -36141, 1803, 20348, -28274, 16147, 21320, -38278, 9867, 24758, -31220, 11614, 22442, -35878, 9068, 22363, -36343, 17161, 31710, -40128, 4646, 19435, -36973, 23543, 30504, -44501, 7919, 24428, -37350, 17240, 26711, -43636, 14400, 28953, -44670, 15752, 31514, -44431, 13948, 23724, -46971, 24661, 35493, -48042, 9172, 22878, -44246, 24932, 34141, -50396, 13672, 29458]
528B9458p8916O8971J2756q1328O9848P721q2007P4850J2854q3062O5077R034
540B5256p6333P7244J1644r1092O7044J3402q0266P9502R881q9575P4293P139
552B8139q5225P9790J1394q4921P3941O162q6879Q1278J2541r1683P6411Q487
564B9435q7694Q7565Q139r4822P9528M234q6987Q9535Q922r2215P9010L497r1210
577f3063Q8968J0347r3632Q5694L950r4908R0037N357r2079Q8081O07r1474R1715
590B9600P256r2856Q0939p4q9762R5961Q705r6447Q3946J81r1168R2282K108q8774
604e8103R1230m03r3644Q4911M662q4464Q7181k834r2848R4036Q057r2807Q1088
617B6062n485q4423R8937K43r2021Q5752j640q7184Q5430j061q1371R5040l662
$$ y = [29458, -49458, 19513, 32269, -49059, 20789, 28510, -53497, 21353, 34207, -48855, 16222, 25256, -51077, 26167, 37811, -53281, 13763, 27165, -53101, 26401, 36282, -53293, 21000, 28139, -57086, 22704, 34098, -50823, 23118, 29280, -57599, 23679, 36220, -55463, 20948, 29435, -58259, 29306, 37445, -57377, 22151, 26385, -60602, 28933, 37855, -54360, 24650, 28147, -63063, 25905, 36252, -57380, 28314, 32264, -62644, 27393, 32750, -59329, 28752, 29359, -62115, 29600, 36856, -56000, 24939, 24865, -64897, 31064, 39769, -56678, 27268, 27449, -63719, 28563, 30671, -58103, 33127, 32724, -60920, 23991, 28653, -55811, 31370, 28536, -64312, 29724, 37781, -55026, 26062, 20577, -63846, 35091, 35334, -56687, 29065, 27425, -59759, 25671, 24610, -56761, 38279, 34617]
630C4617r8272Q6296M158q0786Q9409j2568q7601R9670O17r0099P9251o816p6305
643e8429R4341o032q7714R0554k362q9684Q1856m260p0988R7226j4423r2923Q5353
656B2515J531p1998P9384j4145p4300R3301l853q6706P5896l129o9514Q4103j2365
669B0720p3318Q9448q761q2826P0505k757n4491Q3572j7812q1364P8760J913o8686
682d5097P0120j1088o0907Q5352j4363p6728P4343l772o0323O8814j3832n5724
694d3205Q1796j3225p8478O4763R70m7908P4370k1500o7841P6425p726o2503O4247
707B0185q512m5932O9651k0098o2873O8996l020n6714N7496r921m2906P1958j9940
720A8370o6664N9505j212l7993N8559j8336m7836N9862j1818n3034N3991R7l7072
$$ y = [34617, -63655, 22641, 26799, -53987, 35422, 22854, -64747, 34923, 35540, -54559, 24692, 17876, -58429, 35912, 29880, -57834, 32720, 30358, -59326, 22530, 18270, -52718, 44508, 30085, -62838, 22515, 24046, -47952, 31432, 17287, -57013, 36288, 32435, -54271, 21625, 18496, -51018, 33085, 20720, -52598, 36850, 28089, -54737, 15768, 13011, -41480, 42092, 24280, -57084, 21676, 23589, -45097, 25023, 13935, -46972, 38380, 24017, -52711, 21632, 17860, -42463, 26351, 12519, -43205, 38591, 25366, -53112, 11651, 12621, -35287, 39083, 17583, -50258, 26167, 18441, -44062, 20185, 11673, -34259, 35392, 15294, -47579, 21417, 18397, -38317, 19179, 9258, -33648, 38310, 18370, -48294, 11211, 9999, -27994, 30565, 12229, -35607, 24255, 12437, -40597, 13394, 13491, -23581]
733b3581N1814j9514m7624O0047o901m7081M5699o244k7285N1970k0192m9089
745c7981M6592J50l2310M4416r214l4876M5249j6716m2357M8515O40k7321L6821
758B1608j8093l0588M4754q992l6093L5812n95k1442L7265j6490l6130L8140n063
771D093k5320L7198n680k1773K8425j8261k7361L6134K810j9547K3795j0364k1948
784a7799K9762q498k5008K8631n71j4047K3500j2336k0047K1337n669j4476K4131
797H910K375j4069J2339j2350j8272K4383L509j1524J5685p138j2720J3922o818
810a768j0650J5855J789p402J0307l770j2565Q474l302q228J7173L807p554L911
824F077j0390q622J1200L838r24O109k179q364J436p34m425P774L194l477M697
$$ y = [-23581, 28233, 8719, -38905, 21142, 14241, -32840, 12859, 6615, -20670, 31300, 11108, -37981, 8611, 8761, -23549, 20867, 11653, -23223, 22026, 5310, -37047, 11468, 12108, -15213, 21608, 3515, -27073, 17681, 8689, -27404, 8408, 7813, -13629, 23636, 7146, -28984, 9156, 4093, -21227, 15971, 10291, -11482, 16943, -1318, -28679, 7455, 10265, -9282, 14513, 4149, -17799, 11963, 3465, -21543, 7088, 6517, -7530, 15970, 3634, -16413, 4924, -745, -15221, 8910, 11285, -2784, 9555, -2795, -21067, 3316, 6825, -4699, 10986, 3848, -8872, 5050, -1768, -12418, 3437, 5226, -2176, 8131, 4361, -8204, 270, -3032, -11260, 5913, 9720, 2166, 6077, -4313, -12935, -1735, 2103, 1179, 7288, 5109, -3255, -1819, -2553, -6978, 796, 3990, 513, 5210]
839E210j790n946n35k515O43O286O030k01n485l984n315M7Q237L442J255K40n520
856I9m961N98K244l30M371L524m562K149j238r198L242K438j169R359K216p897
872H85k293l097n498Q043R331m287J987o88j2503M086M352o072R000L797p911
887h68L882m48r757L179M292m717Q537P036j1575l65o02j1178J0772R247o501
902I34N773j594j2988L663L874n085P938N758r659K915K751j2192M721M602p733
917f322J0851N423j0656J729k668r404Q267Q232l784M290M16j3328J865M932n903
932f060R233M585r458M278k58q684M198J705l593P085M696o504p40j269q562N660
948c688P508k446N504j648j0213J047M62j85O634J990l182o35n93l921L32J987
$$ y = [5210, 3420, -2526, -3061, -5576, -4933, 1353, 7383, 7182, 1697, -2287, -7602, -7555, 682, 4124, 5379, 5619, 99, -4862, -4264, -2020, -2350, 2021, 5545, 983, 3132, 1894, -7304, -4062, -1624, -2793, 6566, 8782, 885, -1408, -4505, -10003, -1960, 7371, 3084, 5071, 4383, -8120, -4034, 318, -5754, 3246, 7043, -868, 3014, 2566, -7191, -4012, 280, -4437, 4100, 11136, -439, -804, -1406, -12584, -1812, 7435, 934, 6707, 5113, -7875, -4212, -338, -5423, 2515, 8273, -1386, 1529, 4280, -7912, -3191, 1411, -6322, 4529, 9952, -704, 1025, -1643, -11047, -2780, 5452, 1668, 5958, 6374, -6954, -5089, -157, -6060, 3173, 7758, -1700, 2578, 2320, -6364, -2166, -461, -4054, 3031, 7727, 1223, 483, -786, -9348, -3688, 3820, 1374, 6878, 5230, -4983, -3936, -3474, -3659, 2975, 4965, 1783, 1148, 555, -3366, -3034, -1047]
964a047j319M614L013k875p40m489k858K453K199N319J550k915k771n588l01N021
980g34K436J622N23k902k885J463j779k613O523M85j555N769o313m855N107n263
996d971O19J0719j718l036K002r072l836J2327j200l566R946p935n586J0649j0307
1011d965l026J5365o956k914J1154j0087m522J1570j1165m411K0293n920p007
1024b591J2024j6985m808K2434j1765m276J8898j3819n592J5234j6252l338K4216
1037A3380j3021q925K0797j4385o090K1047k1894n234L0812j4362p642J8250k1575
1050h842l634K6873j8752o902K8973j7076j0903K2629k2518k989L4365k4194j0555
1063a3525K9949j9776n051K4575k8353l910L7794k0930j2049K7825k4553n694
$$ y = [-1047, -2366, 2248, 5261, 2386, 1646, -2843, -5701, -3248, -1049, 4270, 5820, 2905, 134, -5454, -5755, -734, 1702, 3324, 3847, 945, -1940, -477, -2256, -4869, 1654, 2139, 584, 6353, 40, -4815, 292, -4971, -4352, 6367, 4649, 1613, 3615, -5457, -9293, 3034, 1834, -1732, 8214, 279, -5307, 5342, -4965, -7991, 7374, 418, -2496, 8658, -1429, -5951, 5619, -5546, -9957, 10336, 4416, -2591, 9433, -7552, -12360, 10074, -1691, -5967, 12931, -888, -6480, 8754, -7498, -10836, 13380, 359, -8566, 12231, -2154, -8244, 12803, -9091, -14325, 16487, 2125, -5517, 12733, -8842, -12476, 14397, -4355, -11257, 17716, 640, -10263, 12366, -10152, -13141, 21224, -2970, -13525, 16424, -3352, -8403, 16172, -12181, -16091, 21703, 773, -11276, 16549, -8004, -13698]
1075a3698L3619k9977n560M1565k7091j2108K8505k8513J350L8413l3929j0534
1087a7958L9724k4510q980L1275l4597j897M6608l4678j1759L9328l0864m426
1099a2734L4699l7918j1M7980l4572j5304L5531k9998R2M2257m2568q102M9839
1112B9191l3759j0440L6115l7417K576M5803m2490r359M6457l2259r056L6336
1124B1698l9593K100N3208m4112j5132M4279l4429M21M1282m7223q11N2404m1139
1137g047j1984M1339l6369J871M5598n0016m977N5923m1422j0066M0179m3441
1149b0412Q483N1404n2925q842M9683l8291k412M1393m7436L714N4520n1294j0299
1162b2714M9618m0252K660M2718n3891L777N5676m7036r464M1748m0351P005M7466
$$ y = [-13698, 19921, -10056, -15616, 25949, -1142, -13250, 15255, -13258, -11908, 26505, -7424, -17958, 21766, -2744, -11724, 19551, -15046, -16943, 29665, -5013, -16772, 22556, -8308, -12734, 21965, -15953, -15964, 32016, -2556, -17860, 17671, -12327, -12235, 30022, -12546, -20648, 29191, -4568, -15008, 21107, -16310, -13734, 32069, -10421, -19780, 26677, -5582, -14638, 21698, -17895, -15795, 37413, -6699, -21831, 22448, -11981, -11560, 29722, -17501, -18312, 34092, -7047, -19031, 22308, -14061, -12190, 33408, -16608, -21585, 34338, -7084, -17150, 23029, -20412, -11929, 39475, -13450, -22292, 27391, -10900, -13312, 28081, -19355, -15641, 38879, -12415, -22714, 26904, -13348, -10688, 32030, -21861, -18084, 37592, -9444, -18908, 22840, -17511, -10506, 36960]
1175C6960n3816m602N3826m3547n087M2827m5513Q089M8623n4826m776N0214l8948
1188a0576n23L8537m8416O035N2993n0252q522M6198m0874N645M2842n3471M273
1201a6111N0623m8115l697M1878m0680Q376M2110n4479N9N1766m3218j312L9281
1214B6481m7576J0865M6510n3862k6M4859m1739M997L7260m7434Q223M5323m9732
1227a5851k162M3406l9758P645L7237n2056O800M5556m4117J254L5470m0364R403
1240g537L7229m6966K497M1908l9759J395L5141m0878R459L7562m7307K300L8365
1253B3409l5480O258K9722m1820P428L7113l9785J126L4307l5722O583L1489m2076
1266a7448P548L5410l9104L965K9604l4160R976K8291m0267M627L2976l2696M944
$$ y = [36960, -16856, -21458, 32368, -11179, -16266, 26561, -18952, -10863, 37760, -17066, -21842, 28372, -10576, -11099, 27438, -20978, -14943, 38050, -12202, -20724, 25474, -15400, -9755, 33087, -20384, -16111, 34512, -13603, -17300, 24578, -16102, -7726, 34384, -20095, -20036, 31730, -11488, -12800, 26481, -21095, -10230, 36280, -17582, -17608, 27251, -14488, -9491, 27769, -19665, -11442, 33881, -15851, -18013, 25393, -14365, -6720, 30517, -21539, -14739, 30817, -13300, -12046, 23424, -16940, -7537, 29692, -17274, -14777, 27131, -12628, -11233, 23908, -16970, -7511, 30051, -17256, -14956, 23409, -12071, -5813, 23909, -17911, -10483, 26630, -13155, -12029, 22278, -13444, -6861, 24628, -17448, -9900, 25510, -13594, -9629, 19975, -14185, -4209, 24082, -16185, -11558, 21418, -11278, -6334]
1279f334K7437l6521Q345K9826l7653O463K8830l2591P333K3424l3279Q847K6544
1292B0671l2693L476K5615k8073P125K3372l3477O117K5705k8870O399K1191k7798
1305a1240P019J9772k7325N715K2065k4337L164J9160k4578O178K0466k6366M329
1318e978J9319k2163O531J5744k3269N227J6438k0154M489J6448j9643L278J4934
1331A1201k0652N440J6594j9886M450J2914j8327O350J2154j7601M134J1991j4780
1344f018L973J1691j5848K823J1590j5189M841J1550j4654L746Q010j3168M862
1357a791Q786j0859K328P355j0094K054Q436j0076J533P850r559K986O899r174
1371c326J888M607o758K679N276n392j85L915n324K79N967m624J65M015n470J074
$$ y = [-6334, 21103, -15418, -7073, 22753, -14900, -8437, 20393, -12198, -4865, 18559, -14720, -5873, 20671, -12022, -8546, 17069, -11004, -3879, 19493, -13984, -7867, 17838, -11032, -4633, 16558, -11240, -4221, 15551, -11774, -6059, 16006, -8331, -5167, 13993, -10585, -4407, 16059, -10307, -5978, 13341, -8822, -2291, 13453, -9816, -4589, 11849, -8305, -3816, 12632, -7011, -3733, 11201, -9451, -4011, 12583, -7303, -2853, 10061, -8266, -1916, 10238, -7363, -3229, 8762, -6018, -2045, 9646, -6202, -3379, 8211, -6978, -2137, 9413, -5241, -1495, 6515, -6653, -1791, 6995, -3864, -1536, 5819, -4275, -2221, 6215, -3861, -2328, 5522, -4037, -1051, 5848, -3326, -1438, 3169, -3589, -910, 4366, -1026, -1211, 2704, -2620, -2341, 3626, -998, -833, 3182, -2288, -1214]
1387a214L574l667P38J726k008M94K086j377j830J770r58o33L263j115j125P88
1403E12j730M4J176J138m35j137J195j788M9K711k694J89K272k189O06J772k320
1420f29j126K481j066r88M527k600l101M336l568p36O248l861j394M134m022j029
1436b394M950k802k255N463k890k923O698m239l484P150m573j368P673n189k583
1451b766N485m551j545P294l198l446O555m570l780Q584m575l055Q345n696k212
1466c131P733n662k509O794m282k008P835m126m282P188n062l264R725m840k869
1481b760P735o707k290P822m797j758O884m471k838P174m382l745P815m698k539
1496c555Q833n456k652O574o138j233P339l680j560N314m666k968O606l274k356
$$ y = [-1214, 2360, -1307, -569, 1157, -851, -357, 1729, 352, -1478, 292, -666, -1299, 1964, 849, -276, 512, -1218, -1174, 2, 1140, 705, -432, 763, -1025, -976, 1735, -959, -770, 1502, -687, -81, 1691, -629, -1755, 726, -340, -1328, 3199, 599, -2502, 1834, -1734, -2470, 3778, -83, -1477, 2657, -1365, -2394, 2556, -246, -2501, 2962, 72, -2851, 3847, -392, -3876, 3274, -1299, -2667, 5006, -183, -2766, 2719, -1832, -3377, 3917, 719, -2727, 3828, -742, -4522, 4062, -513, -3568, 4777, -919, -3131, 4602, -1060, -3569, 3225, -1057, -3065, 4770, 644, -3638, 3550, -1512, -4776, 4949, 109, -2760, 4975, -1732, -4022, 3800, -997, -2755, 4129, -342, -3180, 3994, -388, -4133, 3682, -1016, -3555, 5278, -178, -2830, 3744, -2394, -3627, 3712, 32, -1528, 3786, -880, -3848, 2758, -516, -2872]
1511b872P099m630k324O542n156j327N512m352l10N128l080j619L416l439j866
1526c278N668j895j536M456m444j587M302l057N23L355k725l12J648j716o63J976
1542G15j021q58K894j060r67J342k754K57J987n22J435n93j207J00j200R87Q56
1559C91j57Q92o29j133J52P48j004R4J777j857J418J803m627J334J566l405L899
1576A262J297m061K526J63m612K818K762l869L061J816p057M003K964p438N124
1591G59K117o874O605R51q453N387J917p214O194K913q498O222K097j1509P658
1606B72M238r828Q713J059j1728R438K144j1339Q475L014j0404R042K449j3711
1620h166R561M167j4033J0653L824j3365J1760R86j5912J1982M426j3022J0798
$$ y = [-2872, 4227, -403, -2727, 3815, -1341, -2668, 2844, -1508, -1818, 3310, 230, -1389, 2027, -1412, -3278, 2390, 495, -1041, 3415, -1029, -2616, 1686, -1371, -848, 2507, -218, -530, 1118, -598, -1261, 715, -306, -1164, 1730, 670, -297, 1045, -1709, -1452, 535, 13, 1448, 855, -352, -252, -1452, -465, 391, 234, 1126, 497, -636, -484, 264, -740, -646, 1131, -726, 692, 2495, -2132, -798, 768, -2637, 1262, 2559, -1502, 1024, 1187, -3425, -607, 2155, -1714, 1347, 3163, -3894, 109, 3073, -4365, 759, 2876, -3998, 2607, 3558, -4895, 492, 2409, -4805, 1389, 4302, -4196, 2026, 4123, -7386, 272, 4510, -5318, 3395, 4454, -7274, 2164, 4308, -7031, 1444, 4458, -5946, 3096, 5545, -8166, 1395, 5562, -8471, 2182, 6006, -7359, 4401, 5387, -10525, 1457, 5883, -7139, 3659]
1633C659K232j5181J2201L854j7405J2565N316j6213J3582J844j8022J5581K911
1646F924j8222J4190L997j5767J4446J083k0255J6286N836j9396J5591K741j9779
1659a2325J8344J115k1812J9108M022j9461J6682P77j9950J9597K456k3524J8747
1672C776N312k0780J9105l51k3861K2745L241k3183J9770K247k0856J9999j08
1685G056k4012K2425N394k4288J8953K125k2910K3524N52k6778K3446M574k2805
1698a2744K0220p99k3563K4137K612k6386K2104M747k4221K1664r30k6096K7648
1711H393K979k7401K2497J166k2715K4640k058k6890K6650M157k6337K2297r2
1724G286k4994K7729j163k8707K8130K499k5623K3574l577k4205K9601P6k8492
$$ y = [3659, 5891, -9290, 2911, 6765, -10640, 1925, 7241, -8972, 4610, 6454, -11568, 4013, 6924, -11298, 2892, 6889, -8878, 5568, 6651, -13604, 2682, 8518, -10878, 4713, 7454, -12325, 6019, 7134, -14678, 4430, 8452, -11009, 5673, 6450, -13500, 6097, 8553, -14971, 3776, 9088, -11692, 7413, 7062, -16799, 5946, 9187, -13996, 5774, 8021, -12835, 7164, 7056, -16956, 5469, 10863, -13425, 5528, 7653, -15257, 8267, 8819, -17959, 5487, 10061, -12744, 7476, 6677, -16886, 7251, 9863, -16523, 5581, 10328, -13893, 7771, 6841, -19255, 8393, 11372, -16029, 6468, 7634, -15081, 9559, 7501, -19389, 7261, 11418, -14919, 7378, 7286, -17708, 10021, 8858, -19849, 8281, 10780, -14843, 8731, 5154, -19051, 10550, 10626, -17866]
1737a7866K4777K134k4545K5241l057k7196L0509J276k8336K4935p43k3413K6837
1750A0553l752k6632K8751K747k6752K2187j342k3825K9090j353k8949K7419J625
1763I767k5027K4138l866k3375K9355j053k7408K4517J312k3300K4384l839k5262
1776a9657L0463L17k7557K4058k351k1501K7750n093k4836K8132l53k4478K2773
1789G667l093k1205K8521l920k6429K7326p79k2677K4085o260k0583K9324l455
1802H522k4342K3221j819j9823K3948m779k1838K7510j868k4123K2515k883j8255
1815a4014K5118n910k1383K4920j168k0393J9568l373j7487K4411l155k2187K2369
1828G316j182j9023K0771m709j6799K4092m004k0070J9461j612j5360J9619m646
$$ y = [-17866, 6911, 9045, -15500, 9741, 6684, -20512, 9997, 11273, -17063, 7872, 7129, -16284, 10553, 6801, -19831, 8920, 11667, -15085, 7102, 5760, -18065, 11025, 9672, -19277, 8142, 9767, -15260, 8878, 5012, -18363, 10992, 9939, -17469, 7048, 8360, -14940, 9444, 5605, -19657, 10806, 11123, -16434, 7624, 5273, -16228, 11522, 6429, -18407, 9725, 9372, -15106, 7667, 4574, -16631, 11890, 7970, -18459, 8867, 8088, -14589, 9496, 3236, -17347, 11977, 8522, -15820, 7401, 5582, -14241, 9707, 4928, -16910, 10600, 8732, -15391, 7124, 4241, -14014, 11104, 5194, -16189, 8731, 7563, -12830, 6738, 3365, -14122, 10289, 7134, -15053, 7316, 6134, -12889, 7882, 3173, -13626, 10466, 6462, -13608, 5853, 4241, -11119, 8500, 3854]
1841C854j7586K2326j992j9016J8672l388j4499K1213n671j6417K0325l216j5405
1854a0800J6776l763j2588J9498m378j6871J7991k034j3664J7200n229j2761J8979
1867H356m415j4044J5360k904j0742J5003l934j2087J5923k330j3581J3723k177
1880B151r978J5146m518j1810J3961k281r797J1550k562q613J2194k382j0856
1893g795J1445q91r366J1040k641q302J1940l090r020R614j626n999R120k531
1907A898p543Q855j118p613Q454j197o373Q795k840o522Q354j969n172O576j787
1922G98m052O343j571n667N564j46m525N924j240m748N576j613l904M886p54k607
1938a736L324q63k900K960M55l313K560P42k859K893k01l034K307J1j367J641
$$ y = [3854, -13732, 8594, 6602, -12414, 6258, 2870, -11629, 9584, 3913, -12504, 7821, 4605, -10800, 5976, 2213, -10375, 9123, 4745, -12126, 5865, 3831, -9833, 7367, 2138, -10623, 8356, 3941, -10103, 5257, 2353, -8389, 6614, 2680, -9407, 6516, 4186, -9395, 4328, 2151, -7827, 7319, 2801, -9009, 4952, 2671, -7126, 4424, 1862, -6751, 5443, 3061, -7795, 3650, 2759, -6607, 4433, 1792, -6510, 5430, 2340, -6680, 2934, 1308, -4691, 4429, 1898, -5645, 3210, 2092, -5521, 2933, 1736, -4637, 4158, 1318, -5204, 3150, 1181, -3991, 2585, 798, -3254, 3089, 1518, -4149, 1415, 1269, -3256, 2668, 1428, -3320, 2256, 643, -3261, 1625, 871, -1736, 1588, 725, -2175, 785, 1240, -2073, 487, 1229, -1630, 1263, 1062, -1972, 335, 346, -1021, 620]
1954F20L03j250P8O94j321K50J920j546J1J178j615L19Q93p81k28Q11K46j200
1972f18J139J28k280J960K52j783K465m72k147J679k0j606J723R20k547J409J216
1989A418l498K334J441l957K958Q85l680L087L94l708K537J235l291K446J653
2004B254m609K365K030n036L603J976n318L657R86m994L830J286m650L099J754
2019B233m779K977K218n864L338K540n947M255J878o168M102J214n374M178J747
2034B548n184L148J915n655L471K660o233L883K359o444M513J622o151M348J340
2049B140n270M059J677n412L141K001n716L815K593o204M021J716o237M569J369
2064B262n403M207R98m907L564J480m959L099J896n252L714K005n725L861J067
$$ y = [620, 923, -327, -249, 445, -876, -626, 1294, -252, -241, 937, -678, -359, 534, -247, -475, 336, 582, -618, 521, 649, -1631, 329, 581, -1202, 1263, 791, -1356, 323, 303, -1303, 420, 1340, -1207, 202, 1418, -2080, 254, 1695, -2262, 696, 1581, -2099, 988, 1382, -2326, 211, 1446, -1845, 601, 2254, -2355, 10, 2040, -2996, 607, 2583, -2735, 922, 1908, -3086, 744, 2030, -2620, 479, 2233, -2546, 431, 2649, -3215, 123, 2663, -3284, 971, 2849, -3319, 783, 1997, -3377, 801, 2548, -2636, 512, 2427, -3228, 243, 2903, -3330, 553, 2912, -3532, 981, 2603, -3548, 800, 2140, -3130, 929, 2606, -2806, 335, 2336, -3380, 435, 3028, -3176, 845, 2561, -3676, 893, 2262, -3141, 1066, 2064, -2843, 721, 2201, -2758, 341, 2237, -3015, 699, 2704, -3021, 840, 1907]
2079A907n217M337Q58m312L526M46m072K947J292l921K785J388m508L219J200
2094A875m469L486L72l646L518Q2k922K474M3k596K096R45k614J965O55l224K423
2111D63M76k555K635m38j886K120n88j036J239k64q23R02L17j092Q72o7j304J460
2129D31l62m34J324j382J86O05j168J192m0q40R59m80m90Q39j27q91R47K05j446
2148i72J824k67k172K640j009j623L361j763j343K905k066j052L116j499j563
2163a483L224j719k185M370k249k422N133l116j832N420l902j492N125l790j372
2178b290N331l393k067N603l881k561O969m250k519P274n385j998P476n631j735
2193c057P246n300j960P361n159k707Q079n506l095R236o076k910R282p188k370
$$ y = [1907, -3310, 1027, 1885, -2427, 1099, 1545, -2527, 420, 1712, -2209, 576, 1964, -2544, 675, 1875, -2594, 892, 1264, -2382, 1136, 1218, -1704, 770, 813, -1783, 313, 1258, -1356, 609, 1264, -1960, 463, 939, -1616, 1019, 581, -1305, 815, 227, -809, 430, 166, -657, 245, 562, -530, 342, 275, -1029, 431, 69, -365, 959, -423, -237, 368, -800, 392, 352, -488, 471, -9, -499, 340, 213, -678, 269, 474, -972, 852, 585, -1587, 1053, 44, -1579, 1782, 19, -1324, 1581, -485, -1537, 1579, 80, -1483, 1741, 22, -2163, 2207, -42, -2464, 2669, -447, -2279, 3141, -761, -2253, 2872, -918, -2290, 3041, -352, -2419, 3184, -697, -3258, 3711, -539, -3058, 4216, -1169, -3167, 4309, -1322, -3057, 4189, -1111, -3071, 4290, -869, -3576, 4503, -1003, -4098, 5138, -938, -3848, 5434, -1754, -4124]
2208d124R559o912k187R090o868k650R512o759l178J0481p317l353J1179q302
2222a829k796J1285r052k175J1266q758k111J0783q922k558J1638q799k853J2344
2236G463r820k832J2858j0619k000J2916j1013j650J2476j0744j788J2438j0599
2249b914k344J3304j0666k658J3833j1747k514J4319j1993j733J3977j2262j823
2262e221J3609j1699k061J3911j1483k726J4563j1986k892J5217j2733k422J5277
2275I354j3009j696J4742j3183j933J4608j2368j986J4836j2800k559J5542j3383
2288c835k252J5999j3988j415J5492j4566q47J5178j4148j010J4863j3635j048
2301e212J5228j4424j594J6005j4530q82J5839j5382k14J5373j5394o9J5115j4382
$$ y = [-4124, 5435, -1477, -3664, 5426, -1442, -4092, 5420, -1339, -4517, 5964, -1353, -4706, 6473, -1829, -4625, 6660, -2392, -4567, 6699, -2059, -4170, 6613, -2309, -4867, 6771, -2028, -4881, 7463, -2357, -5189, 7669, -2950, -4950, 7966, -3047, -4697, 7779, -2965, -4753, 7685, -2914, -5258, 8046, -2620, -5278, 8555, -3192, -5706, 8613, -3380, -5113, 8864, -3398, -5221, 8388, -3311, -5372, 8539, -2944, -5670, 8893, -3093, -5985, 9232, -3501, -5923, 9354, -3655, -5351, 9391, -3792, -5725, 8883, -3485, -5471, 9365, -3435, -5994, 9548, -3835, -6087, 9912, -4076, -5491, 10001, -4565, -5412, 9766, -4382, -5392, 9471, -4164, -5212, 10016, -4408, -6002, 10003, -4527, -5409, 10430, -4952, -5166, 10207, -5187, -5256, 9859, -4523]
2315d523l64J4660j4504p64J5663j4687j286J5913j4790l87J5534j5684j99J5373
2329I955j4700k40J4648j4084n69J4725j4381j188J5821j4096j172J5251j4983
2342e013r3J5305j5206j38J4647j4030J68J3747j4200k31J4589j4040o57J4771
2356I619j4182J30J4156j5362R34J4368j4507Q96J2803j3960J256J2906j4042
2369d985M01J3611j3455L70J3091j4301J262J3250j4569J349J2675j3288J443
2382c146J1260j3257J244J2345j2509P2J2130j2430N94J2073j3302J030J2259
2395H363j2588R24J0772j1835J285J0510j1647M17J1272j0735j06J0528j1525
2408d365Q70J1162j1722Q86J0211j0923J350Q928j0621J479R391r965L69R142
$$ y = [-4523, -4887, 9773, -4731, -5495, 10168, -4519, -5805, 10108, -4682, -5069, 10465, -5219, -5418, 9955, -4745, -4985, 9663, -4421, -4990, 9735, -4646, -5834, 9987, -4109, -5281, 9970, -5013, -5106, 10199, -5007, -5145, 9502, -4528, -4360, 9387, -4813, -5044, 9545, -4495, -5152, 9619, -4563, -4433, 9723, -5639, -4705, 9663, -4844, -3948, 8855, -5105, -3849, 9057, -4985, -4584, 9027, -4428, -4058, 9033, -5268, -4006, 9244, -5325, -3976, 8699, -4589, -3146, 8114, -5143, -3899, 8446, -4063, -3991, 8139, -4291, -3697, 8376, -4926, -3896, 8363, -4225, -3301, 7471, -4364, -3079, 7431, -4216, -3799, 7473, -3262, -3368, 7160, -4365, -3495, 7667, -4055, -3169, 7042, -3881, -2531, 6397, -4224, -2745, 6646, -3319, -2950, 6192]
2422F192r658Q58R029j0600J419R340j0072J480P592r600K149P415r001J342P544
2437E429q239O39P195q458J315P787q885J154P104q123J648N871p708J606O210
2452D545o726L56N866o373L55O207o720O05O412o736N40N221o063J297M796n552
2468a970M86M684m595j77M509m694Q8N127m988R4M477m835O94L558m195R99L242
2485B504l542o7K899k836l9L276l184j44L402l316J54K618k996P72K061k328L31
2502d35J610j571m61J705j161m73K227j639p44J939j530n1J438j114j5P80l64
2519A41o86N91L58j140J012L37j382J225n8j236R13J86n34L53N66r16l34J389
2537G85j304p3J848j829J87J488j869L40J289j341n5J507j037p92J996j409j075
$$ y = [6192, -3466, -2608, 6421, -4179, -2760, 6580, -3492, -2012, 5580, -4020, -1871, 5544, -3457, -2115, 5429, -2810, -2171, 5024, -3434, -2119, 5668, -3217, -2063, 5041, -3082, -1434, 4437, -3271, -1665, 4545, -2181, -1825, 4041, -2332, -1977, 4230, -2490, -1885, 4527, -2209, -1669, 3552, -2511, -1214, 3582, -1970, -1484, 3200, -1395, -1572, 2937, -1757, -1669, 3458, -1530, -1436, 3041, -1794, -1100, 2458, -1737, -738, 2504, -1038, -1105, 1794, -1042, -1081, 2195, -989, -1133, 2269, -1047, -893, 1725, -1271, -499, 1562, -766, -435, 1175, -396, -857, 848, -313, -786, 1441, -198, -942, 997, -533, -584, 854, -260, -275, 505, 141, -545, 46, 404, -736, 276, 613, -769, 456, 398, -838, 75, 261, -273, 80, 646, -270, -604, 785, -519, -592, 1256, -573, -386, 1102, -767, -427, 862, -479, -534, 973, -64, -856, 1140, -269, -1344]
2554a344K800j799o79K830k384n10K453k019k74K379j612r73K533j521j496L283
2570A667j902j421L770k525j073L544k776p23L214k252p43L101k050j554L455
2585A732j971j673M191k523j615M276l087j114M010k919p97L607k506j176L552
2600A987k262j742M095k314j729M582l024j620M415l207r13M127k948r30L580
2615B097k567j340L816k244j703M286k641j689M506l201j228M286l157o61L752
2630B312k869r49L377k377j209L805k260j590M030k827j317M212l111o76L700
2645B251l022m20L098k543o74K987k088r85L359k268j244L503k722o70L541k853
2661g50j79K743k670o8K331j964l33K323j765p45K607k032o44K745k350k8K389
$$ y = [-1344, 1456, -343, -1022, 1808, -576, -1086, 1367, -652, -926, 1453, -159, -1132, 1401, -120, -1616, 1667, -235, -1656, 2114, -411, -1484, 2060, -716, -1439, 1775, -477, -1220, 1881, -169, -1723, 1732, -239, -1912, 2279, -244, -1859, 2417, -670, -1784, 2226, -693, -1490, 2117, -389, -1565, 1987, -275, -2017, 2078, -236, -1965, 2617, -407, -2027, 2388, -819, -1732, 2395, -553, -1483, 2097, -470, -1810, 2006, -238, -1941, 2345, -296, -1985, 2521, -680, -1908, 2378, -779, -1440, 2312, -557, -1506, 1871, -506, -1715, 2090, -170, -1760, 2270, -557, -1874, 2338, -773, -1449, 2251, -771, -1191, 1907, -636, -1310, 1677, -411, -1396, 1963, -305, -1549, 1954, -768, -1438, 2103, -750, -929, 1814, -856, -924, 1407, -557, -890, 1433, -332, -1077, 1530, -502, -1146, 1599, -751, -779, 1610]
2678A610k373K93J586j925L57J368j241r0J340j279l64J689j461nJ625j813N22
2695a61R94j610Q35L73r71P00J37n06K29K44o57K33N85q47O93J38j181J231m61
2714bo67J436j047m6J096j228J92P94q78P2Q99q86j78J438j445k64J847j955N21
2733c01J775k606R74J384k451J196J116k143J063J296k458P78J919k857J067K013
2749A765l559J881J885m000K151J463l539K380J262l610K050J750l893J878K246
2764B110m343K471K202n221L008K181n124L210J615m849L345J797n124K771K457
2779B506n221K924K626o060L608K722o655L931K440o180M268J817o316M153K407
2794B970o306L665K652o590M297K690p534M797K694p439N164J893p143N547J711
$$ y = [1610, -763, -470, 1116, -809, -452, 916, -325, -415, 925, -354, -718, 971, -490, -495, 1130, -683, -161, 833, -777, 58, 431, -540, 160, 297, -209, 20, 264, -393, -160, 425, -422, 271, 409, -772, 459, -2, -669, 767, -280, -326, 770, -458, -266, 528, -350, -278, 621, -265, -443, 995, -450, -714, 1133, -822, -301, 1474, -1132, -158, 1226, -1225, -29, 1087, -1056, 7, 1303, -1155, -377, 1542, -1315, -248, 1765, -1794, 87, 1972, -2028, 123, 1586, -1953, 427, 1689, -1921, 129, 1879, -2014, -136, 2110, -2233, 238, 2440, -2781, 227, 2408, -2716, 494, 2109, -2740, 605, 2402, -2722, 49, 2506, -2715, 209, 2835, -3225, 383, 3105, -3550, 381, 2821, -3359, 909, 2726, -3590, 563, 2970, -3336, 329, 2981, -3609, 688, 3378, -4156, 641, 3335, -4104, 1060, 2953, -4190, 1357, 3068]
2809C068p318N057K300p033M994K166p834N711K542q414N940K116q003O476J394
2824C162q111O449J848p915N753K084p946O176K243r079O538K707r003O763J816
2839C485q896P297J774q975O702K236q532O420K179r178O970K755r878P055K503
2854C917r466P672J574r649P823J936r173P094J799q985P379J976r846P688K350
2869D089r857P933J377r625Q673J033r627Q168J225q826P818R64r309Q180J651
2884C867r820Q131J435r597Q715O50r696Q941Q90r235Q096P64q845Q186J111r646
2900f053Q126J783r723Q276J102r755Q929Q92r665Q490R84q951P966Q32r105Q114
2916B242J561r597P877J478r445Q500P72r536Q749P19q907Q125L38q342Q009N37
$$ y = [3068, -4250, 807, 3107, -3926, 1068, 3234, -4600, 1111, 3653, -4761, 1179, 3295, -4708, 1768, 3162, -4949, 1500, 3348, -4567, 1186, 3270, -4676, 1500, 3743, -5336, 1202, 3909, -5094, 1669, 3485, -5411, 1886, 3660, -5315, 1387, 3623, -4909, 1511, 3690, -5488, 1482, 4237, -5641, 1414, 3917, -5549, 2123, 3697, -5952, 1871, 3807, -5366, 1728, 3527, -5458, 1921, 3897, -5949, 1739, 4089, -5768, 2165, 3542, -6083, 2590, 3623, -6004, 2164, 3389, -5437, 2381, 3345, -5964, 2216, 3867, -5953, 2178, 3613, -5984, 2731, 3381, -6315, 2626, 3516, -5719, 2377, 3141, -5704, 2482, 3593, -6053, 2073, 3856, -5867, 2409, 3511, -6244, 2685, 3577, -6088, 2402, 3386, -5565, 2401, 3233, -5872, 2242, 3803, -5794, 2083, 3561, -5884, 2616, 3388, -6148, 2601, 3320, -5587, 2538, 2876, -5466, 2543, 3080]
2932C080q688P891J014q732P922M15q684Q643O9q516Q308j86p685P884l61p556
2948e182P702K30p841P417L61p849P800m6p973Q085j60p481P518m36o920P255
2964B480j05p068O819M61p224O767L93p377P227J31p275P102j16o595O654k87
2980A987o251O322K32o375N918M09o456O219K00o473O428j53o046O188n26n359
2996c736N828m70n161N329n0n175N154k4n295N498k06n193N490o68m587N188p85
3013A137m064M648m82m016M179n1m150M236jm341M433k09m088M313n15l541L924
3030A412l84l212L298Ol286L043L98l469L182L04l548L300j0l094L130k45k557
3047a732K584n1k293K068L32k406J986N50k558K139K63k443K239n8j860J918j92
$$ y = [3080, -5608, 2283, 3297, -5435, 2487, 2902, -5782, 2861, 2930, -5586, 2722, 2536, -5149, 2735, 2374, -5182, 2520, 2750, -5091, 2326, 2687, -5162, 2638, 2592, -5381, 2704, 2544, -4937, 2581, 2145, -4775, 2480, 2375, -4693, 2126, 2587, -4637, 2130, 2523, -4854, 2373, 2504, -4771, 2331, 2215, -4380, 2274, 1987, -4264, 2058, 2290, -4085, 1833, 2242, -4214, 2005, 2205, -4268, 2160, 2007, -4039, 2149, 1623, -3736, 2092, 1622, -3539, 1790, 1740, -3435, 1719, 1695, -3600, 1898, 1692, -3501, 1989, 1321, -3266, 1922, 1137, -2927, 1721, 1239, -2777, 1402, 1351, -2799, 1437, 1436, -2905, 1528, 1319, -2769, 1544, 1029, -2512, 1412, 1028, -2184, 1114, 1120, -2166, 877, 1275, -2194, 988, 1292, -2256, 1044, 1034, -2060, 1070, 825, -1732, 852, 801, -1492, 576, 908, -1498, 488, 1038, -1520, 619, 882, -1561, 678, 620, -1240, 678, 486]
3064D86j418J313P8j248R65M88j465R44N58j588J153K72j354J122L8q22O58O6
3082B46n09J02N31n37j19Q78q72l5Q41q89K07N77n86j2L88j15m88N99O6r33J088
3103D28j21j043J278l99q29J129k82o80Q15Q4j012P15N31j465J070N57j829J435
3121C82K81j736J504J02j459J249L04j458R36P28j839J020J026k227J414Q71k463
3138a365J688N83k192J683M72j986J333P15k064J179J110k440J376J229k812J772
3154B81R41k824K011O50k478J849N96k326J469R45k443J429J279k873J677J215
3170A398l103K084Q74k917K143O22k565J841P08k472J545J092k685J605J262l080
3186a648J900J083l090K253O98k804K100N33k449J749P44k424J534J084k716J672
$$ y = [486, -932, 381, 459, -789, 176, 664, -801, 143, 701, -887, 266, 538, -816, 306, 344, -478, 180, 246, -263, -161, 370, -167, -286, 592, -280, -315, 526, -363, -156, 421, -165, -177, 211, 96, -392, 207, 273, -660, 428, 307, -736, 542, 143, -686, 443, 161, -519, 296, 380, -632, 83, 614, -851, 219, 776, -1053, 382, 663, -1073, 431, 533, -926, 323, 627, -831, 105, 833, -1006, 14, 1040, -1187, 227, 1098, -1365, 323, 906, -1286, 397, 869, -1117, 216, 931, -1133, 46, 1156, -1284, 92, 1321, -1491, 281, 1222, -1602, 409, 1059, -1419, 430, 1026, -1300, 169, 1114, -1329, 100, 1379, -1494, 183, 1398, -1705, 379, 1253, -1664, 479, 1101, -1464, 377, 1085, -1387, 158, 1250, -1435, 170, 1432, -1648, 252, 1335, -1755, 498, 1196, -1608, 492, 1025, -1424, 325, 1069, -1355, 179, 1263, -1453, 219]
3202B19J098k958K010Q24k818K191M53k477J936L74k145J612O83k218J428R12
3218A124k535J685Q32k600K008M18k338K000J13j929J669J88j668J352M82j858
3234a057J285O22k081J622M32k042J803j9j671J654j91j206J287l5j113R68K60
3251E18j322J043L04j442J357qj303J397m04p93J151m37m12O80k33m44M98M8o17
3270d19O91p5o78R21m68l61Q64p68J72N26p33M29P7m68L65M2k97K03K80n85K38
3291d4M50r83P62K71j220J227j92j046J380n54p41J283m82p14J085k52j029J329
3309E30k18j359J871n28j451K168j011j084K244j278q42K019j113r12J952r60
3325B8j199K351j045j533K807j445j395L033j915j032L046j975r88K767j772j083
$$ y = [219, 1317, -1641, 369, 1193, -1625, 566, 1019, -1458, 478, 852, -1293, 319, 1002, -1216, 212, 1124, -1411, 274, 1106, -1494, 514, 932, -1406, 594, 707, -1222, 447, 635, -1033, 319, 801, -1057, 228, 850, -1231, 391, 823, -1219, 584, 565, -1106, 548, 357, -849, 438, 403, -710, 258, 518, -804, 239, 543, -899, 458, 450, -853, 544, 140, -653, 498, 61, -351, 329, 96, -348, 150, 198, -419, 272, 197, -481, 440, -28, -389, 475, -293, -121, 405, -328, 101, 178, -290, 75, 117, -180, 23, 303, -282, -44, 406, -577, 185, 456, -764, 463, 271, -775, 605, 51, -690, 593, 111, -603, 482, 230, -799, 530, 312, -1047, 824, 296, -1155, 1013, 2, -1082, 1162, -116, -958, 1061, -52, -964, 988, 28, -1171, 1180, 135, -1398, 1409, -36, -1431, 1602, -313, -1345, 1701, -274, -1262, 1505, -267, -1350]
3341a350K924j667j518L386j814j771L787k282j498M014k635j318L877k514j279
3356a658L663k351j489M028k315j990M411k558j907M772l122j623M868l297j448
3371b016M521l109j314M469l043j678M823l023j927N103l486j600N426l983j367
3386b204N215l937j056M875l831j113N052l714j611N310l747j570N648m366j335
3401b384N876m567j163N502m460q84N410m359j335N658m102j727N950m418j583
3416b586O417m963j533O381m916j155N957m873j136O040m625j652O182m510j679
3431b651O498n067j550O790n328j280O393n279p95O112n262j037O136m840j310
3446b470O172n061j141O560n557j048O511n589n44O024n638l18N923n326p83N891
$$ y = [-1350, 1574, -93, -1611, 1775, -39, -1810, 1977, -305, -1803, 2211, -424, -1742, 2135, -379, -1658, 2005, -346, -1835, 2193, -122, -2112, 2299, -259, -2166, 2606, -516, -2139, 2729, -568, -2016, 2505, -604, -1918, 2551, -492, -2170, 2653, -370, -2297, 2806, -680, -2280, 3146, -837, -2204, 3011, -926, -1982, 2893, -938, -2051, 3001, -713, -2324, 2986, -761, -2331, 3317, -1049, -2384, 3492, -1075, -2238, 3264, -1196, -2080, 3330, -1029, -2364, 3294, -808, -2535, 3415, -1003, -2586, 3831, -1132, -2665, 3716, -1200, -2355, 3602, -1271, -2407, 3633, -992, -2644, 3538, -972, -2651, 3847, -1220, -2770, 4020, -1308, -2588, 3805, -1474, -2269, 3843, -1419, -2456, 3680, -1160, -2470, 3702, -1359, -2500, 4060, -1497, -2545, 3966, -1623, -2167, 3857, -1781, -2099, 3824, -1502, -2285, 3606]
3462C606m998q39O130n470r06O535n653p23O215n686k51N953n659m63N926n116
3478a399q62N937n143r22O423n551j041O522n586n64O124n733l22N954n402o28
3494b193N754m946p50N863n237q66O263n413o79N947n516p4N584n551n9N283m935
3511a525k32N046m812l51N381n056m58N490n123k2N084n327L83M824m969J51M483
3528B967m443pM540m524l08M975m627k96M891m795J64M620m834K08M367m280P
3545a375M089m016k44M411m067n24M612m152k50M417m393J21M132m124R7L706
3561B440l604k8L552l448l22L860l453l65L811l689J14L535l721L21L135l275
3577a137L03K693k865Q8K805k762k09L024k840o6K919l074L04K670k891L89K203
$$ y = [3606, -1392, -2231, 3899, -1571, -2477, 4058, -1595, -2318, 3897, -1789, -2040, 3913, -1746, -2209, 3717, -1399, -2261, 3676, -1467, -2389, 4034, -1517, -2558, 3964, -1622, -2186, 3938, -1795, -2117, 3837, -1565, -2193, 3561, -1385, -2135, 3728, -1509, -2375, 3888, -1525, -2204, 3743, -1773, -1847, 3737, -1814, -1873, 3410, -1525, -1757, 3289, -1523, -1874, 3507, -1549, -2007, 3483, -1640, -1662, 3422, -1905, -1522, 3302, -1667, -1516, 2967, -1476, -1483, 3057, -1467, -1775, 3200, -1427, -1723, 3168, -1627, -1463, 3157, -1677, -1469, 2898, -1382, -1375, 2714, -1302, -1546, 2865, -1202, -1726, 2886, -1266, -1516, 2901, -1492, -1371, 2761, -1363, -1266, 2440, -1164, -1192, 2360, -1088, -1410, 2450, -1003, -1368, 2443, -1246, -1132, 2403, -1318, -997, 2138, -1137, -834, 1859, -1006, -918, 1887, -875, -1084, 1940, -900, -966, 1953, -1121, -817, 1853, -1038, -649, 1554]
3594A554k433K51K049k115j16K276k038l32K448k249j13K374k384J41K060k055
3610f82J54J635j634r9J674j369m63J878j404m94J959j634j86J768j601L1J300
3627H33j204k0J014q00l36J112o21n83J276p76m68J259r24j35R31p74kM94l22
3646d6j55L46K3n13N23N5o85P32j72m79O59k55k22K91j9j96l1M52n01LO88q67
3668c69K55N88r01M19L57o46K31L67m26j51O98n34l41J085q59k29J194j125M6
3687c41J028j044J06P91p43j91R17n80n48J317p69o65J607j122m27J598j275j94
3705e35J354j083k57J213p96n66J413p44q46J782j032q00J961j349m92J837j388
3722c28l25J552j122m55J496q88p76J772r67r31K079j296p52K132j522m45J884
$$ y = [1554, -879, -628, 1421, -694, -810, 1466, -572, -904, 1544, -705, -818, 1556, -828, -687, 1373, -682, -528, 1107, -527, -626, 1048, -321, -784, 1094, -310, -804, 1155, -479, -665, 1103, -498, -467, 833, -371, -391, 623, -177, -513, 599, -22, -605, 671, -105, -573, 686, -238, -373, 558, -216, -218, 276, -46, -201, 145, 168, -345, 178, 233, -452, 280, 108, -371, 288, 33, -189, 102, 83, -113, -144, 308, -193, -190, 498, -369, -114, 474, -427, -8, 349, -297, -66, 301, -125, -276, 422, -112, -453, 632, -227, -456, 738, -387, -341, 687, -357, -251, 540, -203, -394, 523, -57, -605, 712, -57, -722, 885, -237, -664, 934, -341, -535, 819, -264, -521, 692, -104, -670, 743, -1, -847, 935, -97, -897, 1064, -285, -777, 1060, -328, -653, 899, -223, -678, 818, -70, -846, 926, -41, -972, 1107, -189, -941, 1191, -331, -776, 1108]
3739A108j441l54J626j141n56J678r85q72J987j151q95K193j462o44K130j607
3755c86l52J804j409l42J600j090o03J737j050q44K028j281p57K151j555m50J939
3772A140j560k29J610j265l29J503j020o01J674j053p35J931j330n27J910j534
3788d15j93J599j421l8J292j098k34J257r15m77J486j047m78J645j320j92J504
3805I55j428J16J127j192J44Q86q69r5R35p77k62J157r60j83J222j210J66R45
3823F77j159L87N84q66L22L96n56N4N37n58o6P56q11J35O77r42M48L63q20O15
3843A73k0m44M24o2k27J97J07l24K00K02n65M96K5o31Q23l83l69Q56o85k6O57
3864D24o66J13M68m86p8N91m71k84R53p71k24J170j159J07J098j351M16Q46j246
$$ y = [1108, -333, -687, 939, -202, -758, 920, -65, -937, 1050, -101, -996, 1197, -265, -909, 1221, -386, -738, 1066, -343, -685, 915, -175, -778, 959, -91, -935, 1093, -188, -945, 1206, -349, -799, 1140, -420, -649, 961, -304, -633, 870, -150, -751, 923, -130, -865, 1066, -264, -791, 1119, -415, -608, 991, -430, -468, 824, -274, -508, 749, -166, -643, 843, -204, -682, 963, -357, -549, 955, -473, -357, 770, -422, -278, 608, -261, -356, 579, -198, -460, 697, -263, -446, 776, -434, -268, 677, -482, -95, 489, -377, -55, 341, -215, -161, 376, -182, -248, 508, -303, -168, 509, -433, 15, 378, -442, 173, 153, -291, 133, 71, -156, 41, 148, -176, 24, 226, -339, 157, 182, -449, 374, -9, -378, 478, -207, -233, 424, -242, -129, 339, -147, -225, 366, -105, -389, 564, -207, -431, 739, -420, -313, 785, -566, -150, 696, -550]
3883e50M64O93j063K42R08j130J09J213j487K88J314j820O80J119j882R06Q41
3900H45j701Q47Q25j589O41J066j747N97J343k116Q41J345k387J229J120k388
3916a229J346R43k217J203J052k196J005J364k484J078J596k891J403J533l076
3931a570J709J288l001J738J177k825J561J369k912J415J653l237J622J733l522
3946a802J954J535l581K174J266l382K124J201l215J914J378l314J856J604l620
3961a908K120J553l836K448J275l737K570J043l516K419J084l425K230J340l653
3976a993K275J533l996K577J429m120K838J176m010K874J081l834K638J247l877
3991b162K530J537m211K679J649m500K985J457m513L191J208m320L099J160m139
$$ y = [-550, -86, 607, -456, -214, 694, -436, -327, 886, -601, -313, 1001, -819, -139, 980, -902, 4, 845, -856, -9, 816, -773, -132, 934, -813, -216, 1127, -989, -148, 1197, -1190, 39, 1159, -1229, 117, 1060, -1157, 46, 1098, -1098, -93, 1271, -1213, -135, 1461, -1430, -27, 1506, -1570, 139, 1427, -1574, 164, 1341, -1484, 77, 1446, -1466, -51, 1602, -1635, -13, 1720, -1802, 152, 1687, -1894, 280, 1546, -1836, 288, 1489, -1726, 188, 1566, -1748, 108, 1712, -1908, 212, 1765, -2071, 377, 1652, -2085, 485, 1528, -1988, 431, 1515, -1910, 320, 1660, -1993, 282, 1815, -2181, 396, 1825, -2295, 543, 1719, -2291, 583, 1664, -2170, 468, 1715, -2162, 368, 1905, -2306, 373, 2022, -2478, 507, 1964, -2549, 642, 1850, -2470, 629, 1789, -2350]
4006b350K855J343m229K833J546m496L007J486m614L314J170m461L394R27m180
4021b455L192R23m015K994J127m175L005J253m349L211J082m397L478P98m197
4036b525L424O39l915L191P53l897L023J039m147L088J119m338L375R25m379L534
4052I09P28m137L377O69l933L150Q94m046L050J117m271L199J084m396L472Q46
4068A712m278L469O38l945L270O18l775L032Q39l858K950R54m002L182P70l990
4084b414L335M98l705L210L08l327K956L98l279K727O05l351K750O52l521K999
4100H41M48l439L039K26l105K875J43k889K604L79k934K427N97l120K584N89l259
4117a994K766M00l117K768J80k789K545K53k692K251N22k735K181O28k926K374
$$ y = [-2350, 505, 1848, -2381, 452, 1998, -2498, 509, 1995, -2619, 695, 1865, -2596, 798, 1725, -2455, 737, 1660, -2355, 639, 1766, -2409, 596, 1849, -2500, 711, 1793, -2604, 874, 1672, -2525, 899, 1538, -2377, 814, 1567, -2330, 693, 1732, -2415, 673, 1792, -2546, 829, 1754, -2625, 909, 1637, -2500, 877, 1546, -2387, 763, 1657, -2389, 661, 1778, -2493, 706, 1790, -2606, 866, 1712, -2566, 903, 1541, -2404, 866, 1484, -2291, 741, 1580, -2278, 672, 1626, -2376, 806, 1576, -2414, 921, 1419, -2286, 924, 1232, -2095, 861, 1259, -2020, 707, 1312, -2039, 711, 1363, -2158, 841, 1289, -2150, 889, 1115, -1990, 885, 1028, -1861, 743, 1122, -1812, 615, 1212, -1908, 676, 1265, -1994, 772, 1172, -1945, 823, 1003, -1786, 759, 1012, -1680, 571, 1093, -1642, 539, 1167, -1759, 615]
4133F15N32k929K473K78k605K370J03k303K067K41k190J788M57k251J807M88k374
4150a433J973L14k234J987M9j868J798jj646J466K07j592J300L84j740J374L94
4167G32j835J522J87j616J496j7j350J257P9j191R48L33j269Q71M93j480J030
4184A90M44j481J142K01j234J027R2r72P31K59q78M89M83j014M96N94j148O43
4202F4M11j031O83J80p20M91J52m50J62L36m38k2N55n92M5N65o52J93L52m85J72
4223b9J68j75q6K28j6l62M77j06m52O50k92k87N75l19j75L62j06k65K81J42n37
4244c24M20J98p59O72L0p31P96j39n72O48q3m94M44J62o53M31L84r43O16L56j083
4265f24Q48J51r72Q47N0q08O47J98p88M84M47j024N68N69j277P93M68j317R53
$$ y = [615, 1147, -1782, 691, 969, -1636, 734, 837, -1466, 601, 842, -1348, 440, 897, -1354, 453, 941, -1433, 540, 854, -1380, 607, 656, -1212, 586, 585, -1061, 405, 612, -980, 320, 704, -1036, 338, 732, -1103, 419, 606, -1010, 486, 469, -881, 376, 455, -736, 212, 545, -724, 147, 640, -840, 190, 634, -847, 295, 496, -738, 289, 381, -591, 140, 399, -479, 10, 493, -521, -25, 569, -579, 64, 475, -556, 127, 307, -413, 78, 230, -220, -58, 278, -160, -182, 373, -219, -174, 391, -261, -68, 284, -201, -29, 139, -36, -122, 106, 90, -272, 205, 99, -353, 297, 5, -282, 293, -26, -201, 161, 55, -210, 71, 213, -324, 96, 294, -465, 207, 237, -494, 302, 163, -409, 239, 156, -338, 106, 268, -385, 46, 430, -513, 103, 459, -624, 224, 375, -597, 250, 300, -508, 139, 337, -451, 33, 480, -544, 24, 593, -684, 109, 577, -740, 213]
4284B13K75j167Q81K13r87O68M01j054N58O25j293P05O43j478R46M64j418J038
4302B33K61j199Q88L00j104O86N12j216O64O52j446Q63N97j541J066L56j374J063
4320B61K16j168Q68L40j144O97N40j304P38O38j483R59M89j492J108K39j269J020
4338B53J90j070P79L39j105O85N18j282P92N36j428J006L25j315J064J13j067
4355f67R18J20r23O92K97j001O62M21j174Q21L31j220J005J05j040R75o2p87P71
4374B44J2p04O00J84q20O20K50r65Q19Q1r11R10j46o64Q24k54m41N89j31m05M46
4395A38N7n59N20N4o42P06j58n31P68l77k65N93l81q9L43j97j27K77p5k79M07
4416A83j61k99N82m06j01N29n43J66L02m87K96Q9l15J89J03k64Q7K69m31J58L59
$$ y = [213, 488, -679, 202, 415, -572, 96, 497, -557, 1, 626, -667, 38, 681, -797, 149, 613, -805, 233, 494, -705, 183, 483, -621, 65, 577, -639, 25, 677, -769, 94, 691, -850, 216, 572, -802, 261, 477, -691, 177, 517, -627, 70, 610, -694, 44, 682, -801, 158, 647, -845, 263, 502, -767, 253, 443, -627, 152, 491, -614, 71, 589, -693, 99, 635, -793, 213, 538, -777, 287, 400, -667, 251, 371, -552, 140, 437, -564, 98, 519, -655, 166, 497, -723, 282, 387, -653, 322, 260, -527, 244, 256, -448, 152, 336, -484, 136, 386, -579, 240, 321, -590, 320, 174, -490, 334, 80, -361, 228, 97, -308, 138, 195, -364, 156, 210, -432, 274, 116, -415, 353, -24, -289, 304, -77, -166, 177, -20, -147, 130, 55, -224, 183, 22, -277, 305, -101, -202, 327, -216, -50, 252, -235, 61, 150, -165, 24, 127, -137, -50, 219, -212, -54, 305]
4437C05o64M38K29p85P04k7o59P41j59n02O16j03n07N52P2p31P08P8r23R78j12
4458B49r22J162l41p61J121m42o07R75l07o82R42j56q97J136k39j018J402m62
4476A53r36J486o83p11J381o88o62J266n20p91J294m31j013J575n79j087J815
4493H69q35r53J843r93p87J745r32q21J693p68j017J835p66j203K123r55j230
4510a152K307j213j038K267j308q96K144j177r71K101j051j156K297j109j300
4525a255K517j318j169K568j539r30K428j517q35K265j352r31K241j266j094K471
4541A284j379j165K655j620r62K627j761p84K482j666p71K352j493r46K498j498
4557a47j143K749j659j111K882j914r16K875j996q01K687j844q49K670j734j055
$$ y = [305, -359, 79, 308, -477, 227, 200, -459, 282, 123, -379, 237, 134, -373, 179, 251, -480, 228, 306, -617, 361, 249, -673, 489, 148, -613, 508, 66, -541, 434, 127, -555, 387, 231, -666, 470, 231, -787, 615, 153, -783, 703, 20, -691, 690, 2, -660, 606, 86, -705, 589, 158, -855, 720, 141, -946, 869, 34, -919, 924, -69, -856, 889, -43, -864, 829, 61, -956, 879, 113, -1090, 1033, 78, -1152, 1155, -58, -1096, 1171, -137, -1033, 1111, -66, -1037, 1064, 13, -1143, 1154, 45, -1255, 1262, -56, -1225, 1343, -196, -1126, 1302, -215, -1050, 1215, -137, -1068, 1173, -93, -1187, 1284, -95, -1260, 1395, -225, -1187, 1440, -321, -1105, 1377, -289, -1060, 1292, -201, -1147, 1351, -147, -1290, 1459, -200, -1311, 1571, -343, -1259, 1616, -380, -1181, 1506, -338, -1187, 1483, -251, -1306]
4573a306K855j757j192L074j987j068L147k192q74L001k143p57K779j960q39K794
4589A575j873j020K934j934j031L066k168q18L004k254o23K762k113n64K578j951
4605d30p03K653j858q69K790j985q20K905k206o17K806k224m71K576k081m85K522
4622A503j932p06K666j926q11K859k147p02K926k315n20K762k260m07K576k074
4638e08n52K598j964p23K722k015p37K859k222n86K794k282l72K534k129l22K334
4655A429j918m72K351j807n97K467j913n46K507k056l36K333k035j59K058j842
4671e36j99J943j634l76K022j603m93K179j760l84K170j883j70J978j814q6J782
4688A136j594k35J778j439m31J927j508m71K071j691l06J992j749j18J758j612
$$ y = [-1306, 1549, -208, -1400, 1674, -313, -1381, 1766, -426, -1300, 1701, -442, -1199, 1580, -380, -1219, 1575, -298, -1318, 1616, -318, -1349, 1717, -451, -1269, 1735, -519, -1142, 1620, -493, -1057, 1521, -430, -1133, 1520, -338, -1207, 1583, -402, -1222, 1683, -523, -1140, 1666, -558, -1029, 1547, -534, -1019, 1503, -429, -1135, 1531, -395, -1206, 1653, -494, -1196, 1730, -585, -1105, 1657, -603, -1010, 1566, -508, -1060, 1538, -426, -1149, 1573, -442, -1179, 1680, -542, -1128, 1666, -616, -988, 1546, -583, -905, 1429, -489, -961, 1390, -417, -1014, 1453, -460, -1006, 1501, -555, -891, 1442, -593, -752, 1306, -536, -735, 1208, -426, -802, 1220, -383, -876, 1303, -457, -841, 1329, -554, -724, 1254, -560, -646, 1136, -458, -693, 1085, -354, -785, 1142, -366, -837, 1234, -457, -763, 1229, -520, -638, 1120, -492]
4704d92r4J587j375k76J614j258m10J737j360l78J778j486j91J607j458k3J338
4721H60j241p2J192r95k51J241r46l57J359j057k66J339j153p0J120j052M2Q72
4739E65p90j11Q21o08k95R43o29l66J076p96k18J004q47k9P68o97k8N98m47k05
4759b91O43l50l85Q08m63l67Q69n90j92P34n67n7M89l59j01L51j15l25M43p5m48
4780c48N94k09l41N66k91j60L47j74q3J28N5j99P9K29l90J84K25m61L26N5l34
4801b02K51K7j55K0J81j57j30M07l32j09N23n10P2M06m97J56K51l36M1K66k13
4822d0j65M57k86k73O73m76j63O85o15J2N35n30L4M08l36j46M95k70l47P22m04
4843c0l63Q73o22k05Q32o72p0O54n33j29N87l46l25P31l71m76R50n45m02J010
$$ y = [-492, -586, 1001, -374, -650, 964, -294, -704, 1033, -327, -705, 1073, -413, -604, 1003, -455, -478, 860, -381, -453, 739, -256, -507, 734, -212, -569, 790, -267, -533, 806, -347, -417, 703, -349, -307, 565, -225, -336, 485, -123, -418, 525, -104, -470, 606, -190, -408, 596, -251, -280, 488, -209, -237, 361, -86, -291, 352, 2, -383, 425, -38, -405, 464, -126, -318, 416, -151, -208, 281, -78, -179, 172, 57, -268, 175, 100, -348, 246, 37, -304, 262, -29, -189, 158, -16, -99, 29, 84, -115, -36, 193, -197, -13, 212, -249, 77, 132, -202, 49, 76, -79, -59, 122, -35, -165, 242, -90, -199, 324, -186, -114, 292, -205, -49, 202, -134, -93, 173, -40, -205, 252, -34, -307, 366, -110, -273, 412, -203, -191, 344, -186, -152, 256, -80, -226, 269, -1, -348, 374, -30, -393, 480, -142, -347, 485, -187, -257, 397, -136, -265, 322, -24, -349, 382, 11, -465, 485, -60, -462, 548]
4863E48p07k25Q96o90j34P29n10k30P00l85m26Q81m55n02J065o61l68J045p62
4882a91j72Q62o75j37P40n02k89P69m23m43R47n30m38J065p27k71R91p84j13P94
4902D73o34j24O89m79k88P87m56m11R70o21l43J013p73j52Q67p48l4O75n56j20
4922b65O34m28k91P71m85l42R04o49k09Q81p59KO70o61N1M89m53p4N10l53k37
4943b94O64m65k25P66o44k8O36o67J54M14n19J51K79l33j6L48l01j18N04m57k3
4964a74N21n82J67L47n44K96J19l35K05Q0k00M9J81k33J5K97l76J24K65m72L44
4985I4K7l49L77j43j40K46j31l9R3%j36J37O0k99L20n8k96M79l03j25M61m29P8
5008g6K87l77J18K21k77j1L16k73j29N25m89m7O41p16J57N63p97L25L97o79K80
$$ y = [548, -159, -384, 512, -178, -312, 417, -93, -323, 377, -8, -434, 447, -8, -510, 555, -106, -474, 571, -191, -363, 499, -176, -313, 427, -75, -364, 405, -18, -461, 486, -44, -482, 583, -144, -415, 576, -208, -321, 473, -161, -285, 404, -75, -363, 424, -32, -443, 527, -94, -437, 576, -197, -349, 518, -230, -264, 411, -145, -265, 369, -59, -350, 421, -64, -406, 498, -151, -360, 521, -238, -236, 434, -227, -176, 313, -140, -214, 296, -57, -294, 370, -95, -320, 446, -198, -226, 410, -257, -103, 311, -208, -57, 222, -111, -127, 221, -80, -198, 306, -151, -174, 347, -235, -68, 279, -265, 31, 150, -185, 20, 100, -100, -51, 130, -103, -88, 209, -167, -43, 222, -250, 94, 121, -228, 149, 6, -134, 112, -19, -58, 35, 35, -101, 36, 96, -203, 117, 59, -237, 242, -61, -186, 275, -154, -76, 211, -166, -48, 173, -104, -115, 201, -72, -201, 324, -165, -212, 429, -287, -130, 433, -364, -39, 358, -321, -41]
5029d1L51n73J59M86o35O9O84q52J91P16j023M05N67j008N21M19q86M41M20p90
5049c79K87N84q88K56P32j123M56P00j243O51N32j182O86M32j048N58N15j059
5067e33M71O93j234N36P81j453P57P13j552R24N63j452R13N01j360P91O35j439
5085g45P30Q07j617Q61Q19j806J075O98j797J168N44j651J095N21j563R42P01
5102G82j664R33Q12j835J091P69j935J254N96j828J272M69j674J174N18j628J008
5119A14O86j753J071P59j955J274O66j978J406M75j853J391M24j745J241N65j798
5136a010J180P05j971J303P34k143J509N90k128J615M32j994J545M30j927J402
5152B72N82j999J403O81k191J562O46k258J686M88k154J721L41j973J567L96j888
$$ y = [-41, 310, -263, -104, 382, -253, -184, 500, -352, -161, 555, -468, -63, 504, -504, 17, 436, -450, -9, 411, -379, -92, 492, -396, -140, 592, -531, -75, 625, -618, 33, 565, -617, 69, 501, -547, 11, 526, -533, -62, 631, -603, -67, 714, -739, 18, 731, -821, 103, 666, -786, 127, 628, -732, 59, 694, -745, -15, 792, -825, 36, 855, -951, 124, 822, -975, 193, 737, -914, 181, 702, -861, 81, 782, -882, 51, 863, -972, 119, 888, -1047, 207, 803, -1025, 247, 716, -958, 216, 734, -894, 114, 800, -953, 118, 877, -1078, 196, 862, -1116, 290, 765, -1088, 303, 727, -1018, 223, 788, -1010, 170, 875, -1096, 207, 941, -1202, 307, 897, -1231, 384, 816, -1178, 367, 797, -1130, 272, 854, -1145, 258, 939, -1252, 310, 956, -1302, 384, 872, -1282, 439, 780, -1193, 374, 770, -1118]
5169a118J420N21j982J448N93k112J593M84k089J676L12j932J633K29j764J443
5185C55L48j761J367M77j905J442M98k011J587L65j963J682K00j827J590K20j732
5202a068J435L38j802J420M78j984J554M19k024J718K40j933J708J41j772J573
5218D41J95j697J423L41j794J441L95j895J557L09j870J636J37j702J558O3j508
5235i70J349J66j472J250K90j559J266L26j640J381J75j544J425L0j344J270K1
5252D20j216J108J61j263J051K86j390J142K40j433J267J06j348J266Kj183J123
5269C39M9j096R72J97j200R91K61j317J114J65j296J191J7j135J112m7r63R15
5287B69Q6r46P87K30j048Q19K37j099R28J06j015R36rq21P91j6o72N83J28o92
$$ y = [-1118, 302, 823, -1159, 289, 882, -1230, 363, 847, -1242, 434, 746, -1186, 447, 676, -1088, 355, 703, -1058, 309, 786, -1119, 323, 821, -1190, 397, 762, -1201, 481, 681, -1146, 444, 664, -1068, 367, 705, -1097, 323, 801, -1183, 371, 790, -1234, 484, 724, -1209, 499, 640, -1132, 441, 636, -1061, 362, 703, -1091, 350, 745, -1150, 407, 716, -1154, 482, 619, -1083, 475, 538, -970, 379, 545, -927, 323, 613, -946, 320, 646, -994, 387, 562, -982, 443, 473, -871, 399, 420, -796, 312, 473, -790, 261, 547, -843, 299, 539, -894, 373, 479, -869, 397, 399, -784, 339, 388, -708, 264, 461, -739, 252, 513, -804, 310, 475, -821, 370, 387, -748, 364, 317, -646, 269, 355, -591, 196, 426, -622, 197, 434, -665, 263, 369, -646, 290, 281, -540, 251, 235, -437, 146, 274, -418]
5307d18N06K45p95N78K11q02O47P6o94O43j1n17M50M4m27L02K06n24K94K75o39
5328c50M02K13o31M91N0m70M18nl19K43J09l20J25K58m23J63L05n15K81J66m38
5349b47L06N1k50J55N7j29j1J81j62q6L19k82j3K88l11P5J68j90M8Q0l4j23J47
5372C7M8k87L13l8k79L70j50j82L12j48j14J87j5j74J31J42l63K60J27m50M02
5393A29Jm09M35q5k86L25l3k43K06J15l63K17K10n05L49J68n65M66K5m77M60k6
5415A14l51L12P7l81K51K08n24L14K81o77M59J88o59N36N9n34M57N3m55L28J72
5436B28n08K79L10o51L72K99p48N21J76o77N38O7n42M45R6m96L28K22n75L32L07
5457C23p07M49K51p42N67R9o37N57K4m96M09J01m73L19K35o07L74K70p25N21J71
$$ y = [-418, 88, 333, -462, 116, 327, -475, 172, 248, -446, 197, 186, -331, 119, 163, -264, 38, 244, -280, 14, 289, -350, 52, 265, -366, 125, 175, -295, 123, 118, -201, 42, 151, -169, -44, 214, -209, -46, 259, -256, 25, 191, -247, 59, 110, -140, 15, 72, -57, -68, 113, -49, -135, 184, -98, -111, 177, -134, -59, 109, -81, -33, 47, 13, -110, 37, 85, -202, 111, 73, -206, 164, 14, -168, 144, -4, -118, 69, 54, -120, 11, 153, -210, 50, 177, -273, 129, 130, -279, 156, 71, -215, 110, 77, -166, 40, 155, -208, 9, 219, -286, 63, 231, -334, 132, 157, -320, 140, 114, -237, 75, 152, -229, 22, 230, -294, 20, 301, -376, 83, 271, -388, 148, 207, -327, 130, 183, -272, 56, 228, -280, -1, 309, -342, 30, 329, -419, 102, 278, -399, 139, 206, -336, 109, 205, -291, 37, 259, -316, 16, 323, -384, 65, 316, -426, 141, 240, -397, 160, 184, -312, 97, 198, -275, 44, 279, -328, 46, 316, -409, 112, 283]
5478B83o95N87K3n38M94Jm35L64J16m83L28K07n90M18J91o62N42O7n94N53l8m40
5500c01M43k8l50L17Q8m11K99J71n40M18R7n44N18m9m31M79j13k77L46n5k49K41
5522F9N3l23K77Q9m23L96l5l68M62j84k11L88k13q7K12j14q7J64pj98K33m6k44
5545a97L59j78j34L60l06K3K38k72Q3J08j48L4J07q7q4K07j32r0K98l06N3K46
5567A82l60K07J05k97K37j3j80J64K4j58Q2J38k80J52J80m19L04J05m59M44p6
5588H2l53M45j38k45L53p8k71L18J2m10M17J9n17O12j36n02P06k72l82O29k69
5609B0l17N46j98l75N54j07n17O63j38n94Q14k78n08Q45l93l96P47l57l61O67
5629C17k42m67O98j96n90Q53k81o00R69m51m91R72n22l99Q75m48m23Q21l53n41
$$ y = [283, -412, 175, 198, -340, 154, 155, -280, 84, 200, -283, 45, 252, -338, 80, 271, -391, 151, 218, -376, 177, 139, -301, 142, 114, -236, 81, 169, -242, 57, 228, -312, 106, 203, -341, 177, 128, -303, 176, 63, -214, 132, 77, -172, 69, 122, -201, 76, 165, -258, 138, 103, -265, 197, 13, -198, 190, -23, -110, 102, -12, -99, 65, 58, -140, 93, 47, -197, 162, -16, -150, 210, -96, -73, 165, -107, -24, 84, -64, -30, 77, -10, -94, 113, -19, -109, 189, -117, -64, 182, -178, 29, 134, -163, 74, 61, -119, 45, 69, -89, -7, 131, -149, 3, 183, -236, 68, 173, -286, 158, 82, -271, 174, 36, -209, 144, 66, -205, 113, 125, -285, 132, 151, -366, 246, 110, -392, 314, 42, -340, 289, 20, -297, 249, 51, -324, 230, 123, -394, 269, 131, -463, 351, 73, -435, 410, 17, -379, 368, 11, -350, 317, 75, -392, 306, 110, -480, 373, 92, -508, 461, 10, -481, 491, -31, -430, 445, -3, -426, 395, 42, -499]
5649d99R64l94o58J122n15o21J203o47n07J166o96m28J074o11m84J081n45o12
5667f07J217n95o69J340p36n97J372q35m81J274p95m30J167o76n29J176o08o46
5685f58J320o84o46J404q34n46J373q78m13J243p97m44J184o78n53J257o73o46
5703f69J397q07o07J467r30m75J401r56m02J291q56m47J301q00n72J427q66o08
5721g11J556r98n37J571j124l88J480j083l53J385r84m41J406r14n54J520r87
5738a56n70J616j122m31J533j135l19J390j046l27J299q94m39J329q57n35J471
5755H07r71m83J482j070l44J393j060k83J257r29l28J215q30m40J317q70m93J437
5773H07j007m07J426j089k71J319j050k30J230r49l05J247q88m25J357r54m29
$$ y = [-499, 465, 71, -587, 535, 20, -601, 602, -45, -552, 614, -82, -510, 564, -47, -531, 550, 5, -607, 610, 15, -654, 686, -50, -647, 725, -110, -591, 683, -112, -542, 625, -51, -580, 596, -12, -658, 662, -22, -668, 736, -98, -644, 729, -149, -562, 681, -116, -560, 624, -54, -607, 650, -23, -669, 728, -79, -686, 781, -149, -624, 777, -179, -581, 710, -146, -593, 708, -92, -664, 763, -103, -711, 845, -153, -690, 881, -243, -631, 849, -234, -587, 798, -186, -627, 779, -135, -689, 831, -156, -726, 890, -232, -663, 870, -265, -584, 806, -240, -567, 732, -162, -601, 728, -129, -664, 807, -164, -647, 835, -235, -579, 814, -246, -529, 728, -201, -529, 686, -144, -584, 733, -137, -630, 807, -200, -607, 819, -270, -541, 778, -272, -502, 728, -221, -526, 721, -167, -592, 765, -189, -618]
5790f18J444j097k93J379j126j77J233j026j75J147q92l05J192q48l88J278r20
5807a92l51J297j002k25J183r69j42J023q31j87R60p04l14J043p16l47J108q07
5825a73k89J101q64j66R69p99j07Q36o51k16Q40n84l13R42o41l25J010p60k02
5844c92R61q03q0Q15o95j08P31n62j91P69n41k91Q79o27k54R18p06j41P99o78
5864a97l9O32n31j05N79l89k43O43l89l03P35m85k13O93n30p8N50m40o9M17k87
5885d9j50L96j71k82M98k36k81N60l35j84N08l55p0L51k56q1K58r7j99L08o8l02
5907b37M21j56k63M60k59j27L47k26n9K08j04j15J67K2k48K25M8l12L38p7k41
5928a88L24j43j05J92n9q7N2J06j84N0J96l18J72J40l30K18O0k37J64M3j18J5
$$ y = [-618, 826, -271, -564, 815, -311, -488, 745, -281, -456, 691, -201, -506, 686, -162, -550, 728, -192, -543, 754, -248, -473, 710, -259, -401, 622, -209, -396, 564, -140, -454, 589, -127, -474, 634, -173, -462, 639, -225, -391, 578, -221, -328, 508, -143, -359, 481, -103, -416, 526, -115, -440, 570, -190, -392, 569, -234, -314, 501, -194, -302, 429, -133, -324, 445, -96, -387, 492, -135, -389, 529, -177, -318, 481, -197, -236, 396, -135, -240, 339, -50, -293, 350, -39, -342, 393, -92, -305, 388, -142, -220, 330, -110, -179, 238, -49, -199, 197, 26, -256, 242, 6, -275, 285, -50, -234, 274, -81, -151, 200, -56, -137, 121, 24, -175, 133, 65, -237, 184, 28, -235, 225, -34, -161, 186, -40, -99, 109, 5, -110, 57, 79, -169, 56, 104, -208, 130, 53, -188, 136, -7, -112, 80, 21, -66, -14, 92, -92, -42, 154, -164, 8, 148, -182, 36, 96, -141, 23, 66, -52, -37]
5950c7J39j50o1K91k72j9L37l70R4K33l25J25J45k01K2J63j42r0K76j90j33M08
5972B43l40l5L90m13Q8K62l12O5J93k01m8K70j90j38L86k78j34M73m09k7M24m05
5994a36M9K90l00lK70k07j32L64k10k01M80l35j45N30m44k1M25m17L2L34k97p0
6016a44L28k02j80M41k72k08N44m06j03N11m51J2L86l82J0L17k66r3L57k29j79
6037b09M69l23j58N31m46l1M55m46N5L17l45K7K78k27j11L65k56j43M61l66p3
6058a76M66m46M0L66m09R6K50k97J7K52k17q9L46k56j13M28l83LL72m35J23K62
6080B00l58J20J74k22J1K10j90n4L00k89l6L60l70Q9K47l69J89J13k63J63M3j45
6102g7N4J13j50KK05k47O7J92l21J99P6k88K65n3j58K06q1o4Q3K4j18P6R1k39
$$ y = [-37, 102, -48, -109, 182, -90, -109, 228, -142, -48, 185, -140, -15, 130, -71, -49, 114, -28, -118, 158, -32, -165, 243, -97, -132, 258, -155, -67, 195, -117, -52, 141, -60, -108, 162, -28, -166, 220, -58, -192, 281, -128, -155, 269, -136, -87, 203, -97, -100, 170, -37, -169, 195, -15, -216, 264, -71, -216, 314, -130, -151, 274, -143, -111, 223, -74, -144, 184, -18, -198, 243, -29, -237, 307, -99, -202, 309, -142, -130, 256, -126, -116, 201, -65, -158, 199, -30, -209, 260, -63, -221, 310, -136, -167, 288, -158, -103, 214, -131, -104, 174, -53, -164, 201, -55, -198, 263, -103, -176, 290, -156, -116, 250, -159, -63, 187, -110, -93, 159, -58, -147, 199, -57, -170, 258, -125, -122, 250, -185, -62, 200, -158, -38, 136, -86, -75, 135, -55, -109, 191, -98, -134, 226, -144, -55, 192, -177, 12, 125, -138, 25, 68, -77, -23, 90, -60, -58, 147, -100, -33, 159, -162, 37, 113, -175, 90, 37, -121, 85, 4, -60, 23, 47, -71, 5, 96, -143]
6126a43J81M6k69K97r7j72L12k02m6K05j58j2J20n5j00J79l9k00K79j11j97L86
6148B04k62p7L34l08M4K30k66N8J72j80m0K43j96j06L74l24n8M37m59R1L66m89
6170b12J81K62m16J46K35l36M9L35m02L4M56n63J17M72o50K50L58o12K90K80n12
6191b38K04L03m78J21M01n46J15N11o92K24M69p43L40L46o62L26K96n84K41L64
6211C18n78J64M76o99K24N37q31L55M51q41M43L47p66M16L33p11L29M18p57L03
6231f9N18r01M26N13r97N52L98r57N82L32q71N36L28q29M52M49r28M56N19j037
6251e28N61M77j088O65L61j010O65L00q89N53L55q80M60M75r76N01N21j087O18
6270E4M40j075O88L27r65O33K95q85N27L97r25N01M91j053O07M69j145P32L58
$$ y = [-143, 38, 84, -185, 112, 15, -157, 155, -47, -93, 112, -46, -58, 62, 7, -93, 86, 47, -153, 126, 15, -182, 204, -58, -135, 199, -109, -65, 165, -101, -43, 129, -51, -91, 152, -44, -150, 224, -100, -158, 279, -180, -89, 277, -212, -31, 231, -185, -39, 196, -140, -91, 244, -158, -124, 332, -231, -114, 358, -292, -42, 316, -296, -6, 274, -238, -34, 269, -209, -88, 313, -233, -118, 393, -299, -75, 394, -349, -9, 337, -325, 1, 297, -287, -46, 318, -260, -96, 380, -319, -95, 442, -389, -34, 417, -424, 19, 366, -400, 16, 349, -362, -33, 385, -372, -69, 449, -452, -26, 487, -510, 42, 440, -517, 65, 397, -474, 62, 390, -439, 13, 462, -466, -10, 509, -528, 33, 510, -578, 87, 448, -562, 103, 403, -486, 67, 422, -458, 2, 477, -499, 2, 523, -564, 54, 494, -581, 107, 434, -531, 102, 397, -488, 39, 436, -489, 12, 503, -550, 57, 526, -619, 113, 471]
6289D71j093P82K60r88P03K78r54O26L91j037O46M33j155P58L95j195Q62K79j107
6308f45Q47J88r82P53K55r74O71L63j070P11L78j137P96L24j133Q52K10j007P78
6327A78J97r06O50K82r23N96L78j004O51L73j076P55K76j023P97J58q93P00J90
6346C56q43O02K74q92O03L33j014P21K80j032Q17J69r59Q05J10q59P17J41q22
6365d93O28K40r07O61K69r66P43J95r61Q28P9q44P49N3p38O20J42p42N58K26q10
6386d70N87K44q65O55J60q08O86O1o64N68Q6n91M52J85o44M16K60p34N16K19p44
6407d25N73J07o63N63M9n37M49Q2n02L59J91n77L92K13o54M99J32o37N48L6n30
6428c32M86Qm26L61Q1m43L22J67n24L75J68n66M40P8n01M41Nl83L42L3l25K19
$$ y = [471, -622, 160, 420, -568, 135, 413, -541, 85, 476, -561, 85, 518, -637, 121, 516, -679, 183, 462, -645, 202, 390, -592, 161, 416, -558, 113, 476, -594, 117, 495, -642, 154, 478, -655, 197, 407, -600, 178, 375, -531, 119, 401, -522, 74, 452, -552, 99, 472, -604, 151, 427, -596, 201, 359, -534, 166, 356, -487, 115, 389, -503, 100, 433, -581, 140, 420, -612, 205, 374, -585, 220, 330, -529, 188, 329, -493, 135, 375, -532, 129, 398, -568, 175, 370, -591, 237, 316, -528, 221, 274, -464, 156, 298, -444, 114, 340, -470, 117, 361, -504, 151, 311, -497, 189, 250, -414, 154, 240, -351, 101, 286, -358, 58, 318, -416, 100, 319, -425, 148, 255, -408, 155, 204, -333, 116, 198, -304, 55, 246, -331, 61, 274, -380, 119, 251, -386, 162, 198, -332, 154, 162, -264, 97, 178, -265, 57, 224, -300, 75, 243, -323, 117, 195, -306, 135, 140, -243, 99, 132, -193, 26]
6450B6J44l53J90J93m14K44J71m36L05Q2l50K60K6k23J42R5j99N6J85k71P8K24
6472A75l35J65J59l27K02N1k03J41L8j31M3J10j40j2K08k34K6K28k89J08J35k30
6494a12J36M2j23N1N9o1n7J53j02p4K16j73k6J90j98N6R8j04lO2nj17J37J9k03
6519a39K29n6j78K72j29j02K10j26m6J21mj32J06O4k29J81N3k67K64l9k10K74
6541A17j18j28K09m8j24J07P8k07J31J03k97K39N2l03K86l8k20K64o1j62J78O
6563F4j83J34R7k72J86J13l54K98K8l32L26l6k37K60k9j93J78M6k39J64J28l38
6585a91K28J26l96L35J2l24L28m1k44K49j4k08J73Q9k82J93J16l53K83N5l58L31
6607A07k9k86L18m9j99K03J2k08J60Q2k86K18R7l43K95J1l11L30q1k07K70o6j70
$$ y = [26, 170, -183, 7, 200, -214, 30, 201, -235, 70, 152, -198, 62, 88, -135, 7, 102, -97, -41, 144, -127, -49, 175, -160, 5, 164, -163, 39, 90, -113, 28, 66, -65, -22, 88, -52, -64, 144, -90, -64, 164, -125, -17, 118, -112, 24, 66, -57, -6, 53, -8, -65, 88, -14, -88, 128, -45, -71, 119, -79, -23, 75, -29, -32, 30, 25, -92, 45, 64, -139, 90, 34, -144, 128, -1, -103, 107, -19, -65, 56, 52, -80, 26, 90, -139, 42, 95, -172, 92, 53, -157, 117, -1, -129, 80, 32, -92, 15, 93, -114, 17, 120, -177, 62, 114, -189, 97, 59, -161, 103, 42, -120, 58, 64, -119, 15, 112, -160, 26, 139, -215, 83, 111, -221, 105, 69, -168, 92, 63, -130, 48, 94, -145, 19, 147, -191, 37, 163, -233, 102, 114, -210, 118, 77, -167, 82, 68, -140, 33, 122, -160, 33, 149, -204, 79, 134, -224, 107, 78, -208, 110, 61, -138, 65, 77, -131, 29, 111, -175, 43, 140, -203, 92, 103, -208, 122, 41, -166, 104, 38, -132]
6630a32J84J2j79J51Q4k84K30M2l00L07m6k37L07j16j51K15o7j16J45J1j66J51
6652D5L9k46K45kk62K99j07j49K55j37p4J71q6o2J11kj37J57qj81K30q5j34K40
6676A20j59l8J91j72L6R2j03J8M3k5o3J31p7p2J85j54lJ70k19R0Q9j66J07J6j03
6701f6O8L5p3LJ22j46J4J49k14J11J07k47J86J7j83J71k4j08J14J7j33P6R4k07
6725a17J25J09k76K25J8k64K83o8j90K78j06j34K02n7j46J86J4k53K62lk94L52
6747A46j00k59M04j84j95L61j75j56K98j15k18L25o4l07M04j11l15M80k01k61
6767b43M81k55j82M05k20j64L44j17k63L84j01l38M90j64l43N51k62k60N18k75
6787a4k09M47k26k15M17j56l01M91j80l57N95k79l21O33l65k26N72l53k02N24
$$ y = [-132, 52, 64, -115, 36, 120, -164, 66, 108, -192, 115, 69, -168, 139, 23, -128, 87, 20, -96, 49, 60, -106, 45, 84, -162, 83, 81, -181, 118, 11, -138, 117, -20, -94, 77, -9, -71, 40, 38, -99, 58, 50, -131, 99, 14, -120, 120, -39, -77, 114, -58, -22, 70, -33, -15, 28, 3, -60, 71, -6, -78, 107, -47, -50, 120, -99, -9, 80, -86, 21, 37, -66, 2, 37, -36, -33, 89, -57, -43, 106, -108, 3, 110, -137, 49, 66, -117, 54, 30, -78, 36, 53, -80, -4, 90, -117, 8, 117, -159, 66, 84, -180, 103, 35, -155, 123, 17, -117, 85, 28, -118, 68, 82, -171, 91, 88, -206, 146, 46, -213, 191, 7, -188, 173, -2, -158, 140, 25, -193, 132, 68, -239, 165, 54, -261, 219, 18, -243, 238, -17, -199, 206, -14, -178, 166, 49, -214, 170, 69, -269, 221, 57, -286, 265, 3, -257, 261, -14, -223, 224, -2, -217, 200, 44, -257, 234, 54, -303, 292, 13, -308, 325, -40, -266, 306, -47, -249, 275]
6807B75l04k22N22k73l10O28l24l20O85m10k63O93m72j76O27m39j67N67l52k53
6827b88O07l31l10O86l93l11P29m76k24P00m77j86O16m06k03N85l35k95O56l60
6847a6l41P29m20l01P50m99k12O88m80j70O18m19k04O11l71k95P01m20l06P81
6867D24n27k27P64n82j30O79n45j24O41m67j98O70m69k46P56n28k38P93o08j46
6887c08P41n97r1O45n39j07O19m63j92O66m44k53P28n18k10P49n63j34O65n33
6907a39j05O00m57j53N82l90k39O63m20k63P25n12j80O96n61r6O15m99q7N40m15
6928i5j60N83l99k12O48m69j80O73n36r7O25n50l9N51m91l4M90m13j24N42l99
6949h6j79O22m75j25O11n23n0N51m90k1M47l87p5M42l32j54N08l42j78N56m17
$$ y = [275, -29, -251, 271, -2, -312, 316, -8, -328, 357, -53, -316, 377, -95, -271, 356, -83, -250, 317, -35, -288, 319, -12, -322, 364, -29, -340, 389, -87, -311, 389, -88, -274, 342, -64, -267, 318, -17, -312, 344, -16, -357, 372, -48, -349, 401, -98, -310, 378, -102, -272, 346, -73, -277, 334, -37, -332, 369, -51, -357, 424, -103, -330, 434, -148, -278, 401, -144, -268, 373, -94, -292, 378, -91, -337, 419, -109, -347, 446, -162, -308, 433, -164, -255, 390, -149, -256, 363, -100, -292, 374, -70, -323, 405, -113, -323, 426, -137, -271, 394, -139, -244, 356, -101, -254, 328, -62, -301, 362, -58, -321, 404, -108, -288, 408, -153, -249, 366, -133, -220, 320, -95, -255, 328, -71, -283, 365, -104, -284, 389, -147, -244, 381, -169, -208, 343, -148, -182, 308, -105, -229, 313, -86, -265, 357, -118, -243, 368, -155, -205, 346, -144, -165, 282, -105, -180, 262, -70, -224, 284, -58, -236, 320, -97]
6970i7j10N18m15o4M25l66l8L65k71j21L94k36j95M57k83j82N08l72j02M45l66
6991a06j9L27k83l7K95k18j13L48k17j64M18l02j03M21l47j8L27l07OK57k26l6
7013i7K40j59j27L06j68j55L57k38r2L20k50k5K41k11j5J68r4j06J98n5j75K58
7035A21j01j59K86j59q6K20j34o2J45p5n6J06pj31J45K1k03K20n9j51K33j27o6
7058g9J55q7k5N9Rq2N8N6j47J22K8j75J77k9j33J58o7m6O6Jl8MP9j13K3J31k04
7085i9J10O8j91J39J6j17R2J3o1lR3r4l2J79j81J9J69k27Q6J10j87J01N0j10J8
7110c9J05q7n1J77j51l4K31k31K6J94k36Q1J07j61N4Q0r7k2J33r3p8K17j71n0
7134i6K48k42M1J81k37Q1J15j54L0J08r9n3J86j34p0K42k12k1K48k55M1J95k36
$$ y = [-97, -207, 311, -104, -168, 257, -109, -147, 218, -53, -174, 220, -16, -211, 246, -37, -219, 289, -83, -185, 260, -106, -125, 202, -81, -118, 177, -41, -154, 194, -23, -187, 231, -71, -174, 247, -100, -118, 209, -98, -92, 165, -61, -97, 143, -16, -143, 163, -5, -160, 197, -41, -133, 187, -63, -88, 153, -58, -73, 95, 1, -105, 93, 38, -137, 121, 20, -139, 147, -12, -98, 122, -12, -74, 71, -4, -60, 46, 39, -92, 53, 74, -129, 91, 32, -119, 114, -13, -79, 76, -11, -36, 23, 32, -50, 8, 64, -83, 39, 67, -108, 69, 40, -93, 65, -2, -48, 18, 19, -19, -15, 64, -49, -26, 105, -99, 11, 79, -112, 27, 43, -74, 18, 31, -30, -33, 60, -34, -66, 113, -68, -49, 120, -107, -21, 89, -98, 3, 53, -57, -39, 66, -21, -72, 105, -46, -80, 151, -80, -54, 140, -96, -15, 92, -69, -15, 65, -32, -54, 79, -14, -92, 125, -46, -96, 152, -90, -49, 132, -105, -24, 91, -63, -33, 75, -24, -77, 109, -25, -95, 147, -65, -86, 162, -93, -52, 143, -93]
7157i3O3J29j48NJ42j28o4K21j58p2K78k63J0K53k77O2J60k05N4J21j35j5J64
7180A04j25p8K41j97m2K72k68L5K01k52Q2J20j71M8R9j19j0J67j49m4K26k31J9
7203g2K13k53R3J32k14J08P0j30K7R1r7l5J65j46j7J89k08N0J66k41J09Q4j83
7226i9J11L4r7K8Q7r7rJ39j63K3J53k15J07R6k04J41J4j29J21j7o7L9L9p7J5J08
7252H1j58P0Q3j82J46Rj44J70o8o1J04n8k3M8Mn9N0L8j31J17Jj42J86q8o6J72
7278I9j39%J16j09J4M5k6n6R8j5j20J84r1j10K30j68k4J82j90M2J12j16PR5o3
7303co9J45q8p5K11j69m4K52k53L9J87k39R1J08j69O4J04j50KJ85k03%K54k91
7327a11N6K26l16J33J56k90J40J14k21Q4J39j99K7K21k69M8K54l47J21K30l70
$$ y = [-93, -30, 99, -49, -44, 98, -30, -94, 127, -31, -103, 175, -88, -78, 175, -102, -40, 120, -85, -31, 90, -45, -60, 104, -21, -99, 142, -55, -97, 175, -93, -58, 143, -109, -27, 93, -78, -30, 69, -50, -60, 107, -42, -86, 140, -91, -72, 141, -112, -19, 113, -101, 7, 77, -53, -26, 65, -32, -67, 98, -48, -65, 124, -84, -34, 132, -109, 0, 84, -99, 12, 46, -51, -23, 64, -33, -42, 97, -66, -43, 110, -105, 2, 98, -106, 35, 49, -80, 41, 24, -43, -4, 35, -42, -27, 81, -77, -7, 76, -106, 40, 49, -95, 75, 7, -54, 50, -8, -31, 17, 21, -38, 12, 50, -81, 36, 37, -105, 81, -7, -73, 99, -40, -40, 76, -33, -19, 26, 0, -56, 42, 27, -93, 91, 0, -110, 120, -48, -72, 110, -80, -38, 74, -42, -35, 60, -3, -72, 73, -15, -90, 121, -48, -92, 160, -93, -54, 133, -106, -15, 93, -76, -12, 92, -58, -56, 129, -74, -74, 180, -111, -55, 171, -145, -12, 144, -146, -6, 108, -113, -29, 110, -89, -62, 159, -110, -62, 192, -155, -34, 196, -174]
7348a74J75J51l11J53J40k54Q4J94k69L7K67l44P7L00m11J66K25m02K02J60l18
7369a52J48J55k84R4K20l44R9K90m30J72K61m60K45J83m24K61J23l50K07J51l37
7390a72J51K26l99J72K62m77K56K01m79K96J52m27K91J25l70J97J88l88J73K38
7410B16m30K01K67n03K70K05m85K92J55m14K50J71l86J78K35m19J60L00n02K28
7430a1K69n33L06J88m67L06J36m14K43J60l86K04K05m32K15K64n38L23K00n13
7450b75L53J18m61L32J08l91K64J19l82K22K14m67K57K20n07L31J58m79L39R7
7470A70m11L01R8l63K26J73l97J96K24m62K41K32m94L22J48m61L19J01l70K33
7490B6J29l28J71J95l81J87K10m40K52J85m52L10J14l94K80P3l28K26J04l10J82
$$ y = [-174, 1, 152, -159, -6, 134, -120, -36, 158, -111, -74, 193, -151, -74, 226, -185, -19, 206, -196, 6, 166, -152, -4, 151, -133, -39, 181, -163, -64, 226, -204, -32, 229, -231, 14, 197, -227, 34, 157, -193, 14, 165, -172, -21, 205, -194, -22, 240, -237, 19, 220, -259, 37, 189, -238, 53, 178, -192, 5, 193, -195, -22, 216, -214, -13, 254, -249, 21, 226, -259, 33, 188, -226, 24, 195, -191, -13, 222, -197, -37, 263, -239, -11, 258, -275, 31, 219, -248, 58, 194, -220, 23, 183, -203, 1, 206, -226, -11, 253, -285, 38, 238, -275, 78, 196, -265, 67, 175, -216, 48, 167, -215, 7, 221, -246, 11, 231, -276, 55, 213, -266, 73, 170, -241, 60, 158, -205, 21, 194, -203, -7, 217, -245, -4, 228, -266, 56, 204, -257, 62, 163, -207, 26, 155, -173, -2, 193, -188, -1, 209, -231, 21, 206, -246, 64, 178, -216, 64, 137, -191, 35, 139, -171, 11]
7511A1J71l86K17J71m26L05J08m09L24M1l29K64M5k73J89J09k93J66J64l51J94
7532A2J65l93K64R9l39K61M0k62J75R0k43J31J37k81J24J92l40J79J64l42K15
7553D8Q2k75J81N0j93J09J14k17O4J64k42R6J77l14J70J15k78J87N1j96J28M1
7575F2j48P8J00j71N5J43k32R6J39k52J49P3k11J50L1j38P2N9j10J5J25j52K7
7598d0J61k17P7J22j97J01O9j51Q1M4q7PR4q8n6J76j35j8J71j96L6J32j61N9P3
7623E7r2PP0m4n7J19n0q9J71j15m0J64j48K1R9j08K6M6l6m0O6Mr8J29n1r0J65
7650H6j04m8J40r7LO5l8m7O3J1q8R1Oj40J62m1j20J84r4n8J20o0n3R6k1p6P2M2
7678E6j50J36J4j70J96n3j28J82q1o9J20l6q3Q6L0j33J09M6j78J65nj71J90m7
$$ y = [11, 182, -204, 13, 184, -242, 63, 171, -238, 86, 127, -202, 62, 107, -166, 23, 132, -161, 5, 169, -182, 12, 177, -216, 48, 147, -192, 69, 109, -153, 22, 112, -131, 0, 137, -144, -20, 172, -168, 11, 175, -167, 48, 130, -145, 36, 86, -107, 2, 116, -101, -37, 127, -115, -19, 158, -156, 14, 129, -149, 38, 89, -107, 21, 62, -86, -8, 92, -79, -24, 119, -113, -17, 122, -130, 19, 92, -119, 31, 62, -76, -4, 55, -55, -40, 85, -67, -40, 121, -96, -19, 103, -94, 7, 76, -75, 6, 50, -37, -30, 64, -24, -80, 96, -39, -57, 114, -82, -46, 86, -75, -16, 57, -35, -28, 42, -2, -59, 60, 10, -79, 92, -23, -63, 101, -47, -26, 73, -35, -9, 37, 1, -39, 27, 31, -67, 62, 11, -79, 86, -18, -66, 74, -23, -20, 45, 7, -40, 23, 34, -54, 37, 43, -97, 65, 24, -96, 88, -6, -64, 56, -4, -57, 39, 18, -58, 14, 56, -94, 42, 56, -114, 82, 29, -99, 83, 2, -67, 53, 17, -66, 20, 50, -83, 26, 72, -106, 59, 54, -117, 73, 26]
7702B6j12J49m5r1J15oj00P4O2j56J19M5k00J79j8j60J86n0j04J31l5p8R8K3j20
7727f8R7N3j95J55L1k04K03k9j43J75o5r5J36k9r5R5M2j55J16N2j91J75mj90K08
7752G5m9j37J73n1q4J11j1q6Q3L4j66J48K4j97J97l5j35J85p9p5J47p0n9R0or6
7778f9Q5L5j54J50j1j48J83n9j01J77r4n7J22n6m5P8j4r6J15Kj35J58m3j24J94
7803I3j04o7J55r1l8J02n8n0Q9j7q2J23m3j06J66q8n9J78j34j8J23j18K6O3p0
7828b5j1O8l3o3J13m9o3J48j18j2J27j41N2O6j10M5L9o1K2M4m7l7J21j02k4J47
7854I6j67N6J04j77R5L9j18Q6K5q7L3O8r7RJ17j44L9J29j97R9P8j78J32Mj28J08
7880B4K3r6M3O5j21N0J02j82J04P3k01J63J7j74J70k0j21J24jj06P8M7j44J05
$$ y = [26, -86, 63, 18, -73, 42, 36, -64, 10, 72, -84, 35, 80, -120, 59, 41, -119, 67, 17, -87, 44, 9, -69, 29, 52, -68, 29, 82, -113, 42, 73, -131, 72, 43, -100, 75, 10, -85, 51, 22, -73, 22, 64, -91, 25, 77, -114, 61, 57, -133, 75, 26, -111, 62, 11, -73, 38, 27, -59, 24, 58, -108, 40, 64, -133, 64, 29, -106, 79, 0, -75, 72, 2, -57, 33, 27, -69, 16, 51, -103, 47, 36, -112, 71, 12, -89, 88, -6, -63, 59, 3, -42, 36, 22, -74, 41, 43, -92, 66, 23, -101, 93, -11, -78, 77, -14, -52, 50, -8, -58, 31, 14, -68, 55, 12, -94, 72, -16, -75, 103, -31, -49, 74, -44, -18, 45, -25, -36, 32, -1, -64, 49, 0, -63, 85, -33, -45, 82, -59, -7, 59, -51, -6, 33, -28, -6, 38, -9, -46, 75, -27, -51, 96, -71, -15, 89, -88, 7, 46, -72, 14, 39, -48, -15, 53, -44, -35, 82, -62, -23, 106, -91, 8, 86, -92, 40, 44, -84, 24, 47, -49, -6, 59, -62, -12, 90, -92, 12, 85, -116, 47, 64, -110, 60, 40, -81, 43, 42, -64, 14, 61, -83, 22]
7904B2N5j93J56K6j96K04l2j64J99n4j00J38k2j29J19L2j70J56L2k21K19j3k10
7927a46K41n8j63K15m1j49J75k4j68J73L0k33K14J6k55K66l0k16K63q3j56K26
7949I7o1j40J73j3j91J94J4k34K52l6k29L04j00j91K98j33j21K24r2j28J98n5
7971C0j66K32l2k36L00j00k03L11j18j64K77j17j35K28p4j57K11k7k19K62m8k47
7993a92L23q0k23L15j21j75K67r7j54K24m1j95K36l9k30K99o3k53L35j19j83L04
8015A38j44j32K67j42j20K33p8j67K46m8k27L14j14j93L13j59j24K82j61j05K31
8036A10j01j26K20q5j69K65r0j92L02j33j56K99j69j13K58j33j01K06p7j45K18
8057H8m1j98K55o6k12L08j22j57K81j40j20K35j07j21J99o1j55K30m9j96K60r4
$$ y = [22, 77, -116, 40, 66, -130, 74, 42, -122, 77, 23, -77, 61, 39, -90, 29, 61, -109, 47, 79, -142, 77, 64, -146, 95, 37, -126, 89, 48, -101, 74, 50, -118, 55, 85, -148, 66, 82, -173, 93, 63, -153, 110, 27, -129, 97, 36, -104, 69, 56, -135, 59, 73, -161, 91, 55, -174, 130, 30, -161, 137, 4, -117, 107, 15, -113, 85, 30, -136, 96, 64, -172, 128, 28, -175, 136, 18, -146, 131, 14, -121, 107, 33, -124, 87, 60, -159, 103, 55, -192, 131, 51, -172, 143, 22, -153, 114, 17, -137, 87, 46, -149, 87, 48, -182, 117, 54, -199, 136, 17, -166, 138, -6, -138, 129, -13, -133, 100, 22, -145, 101, 53, -174, 140, 26, -167, 146, -13, -137, 145, -16, -121, 110, 9, -117, 103, 18, -151, 114, 24, -168, 134, 1, -155, 144, -25, -138, 120, -13, -114, 92, 15, -130, 88, 47, -151, 104, 38, -174, 134, 12, -145, 136, -4, -124, 111, 4, -117, 82, 21, -134, 96, 47, -149, 111, 17]
8079A7j68K82j48j02K43j40p2J74q4r0J56m3j34J97n6j64K45j09j20K37j50o3
8101i2J85j07o8J54n4r9J39k5j41J87m4j57K30j01j12K03j13o7J49p0p6J27k1
8124B7j17J39kj61J87l4j61K12p3j15J82q1p5J11k1q5R8K0j47J45rj46J58l5j13
8149i6J60p3n2R9m1m5N8J0q3Q0K5j23J17Pj32J37m0q0J21m6m0N9j0n4L8M5r7N1
8177eN9j37J08J7j29J29k4q2R4no9L6M1p9
$$ y = [17, -151, 131, -17, -119, 124, -16, -88, 86, 2, -88, 68, 25, -109, 88, 32, -132, 113, 4, -116, 121, -29, -92, 93, -14, -82, 72, 18, -81, 58, 33, -108, 79, 35, -122, 108, 7, -105, 98, -15, -82, 67, -3, -79, 48, 27, -90, 49, 47, -114, 73, 39, -122, 90, 17, -98, 84, 3, -72, 39, 18, -67, 31, 51, -96, 49, 40, -106, 52, 17, -96, 64, -9, -61, 38, -3, -48, 10, 20, -63, 17, 42, -81, 36, 43, -89, 48, 8, -72, 49, 3, -37, 22, 12, -42, -4, 41, -56, -5, 54, -83, 25, 42, -87, 42, 18, -64, 30, 25, -44, -8, 33, -46]
8191d6
$$ Imaginary data points
##PAGE= N=2
##DATA TABLE= (X++(I..I)), XYDATA
0@%%%%%%%%%%%qJ6j6J6k4L2l5M3n6P0p9R0j08J31j53J77k08K41k76L16l62M13
33B20m69N32o01O75p58Q51r51J059j178J310j452J607j780J967k168K389k635
50a382K900l191L517l877M278m730N239n816O482p258Q172r274J0632j2349J4601
65G944j7703K2282k9821M5109j26808K32819M5592k51588J78252j85480l1820
76a11222K93504k36414k02517M05218j4759j64906J22165k05986n5513L75304
86B04874j98159k18442L20970l928j07922J19836k86411p0511M27765p4610k13085
97i9623J87781r3657o8205J99813k36416j01555M00567n8374k02709J25014j33598
108h0962j3709K66750k21908j51323L36742j2317j43238Q2700k05066k4043L45938
$$ y = [0, 0, 0, 0, 0, 0, 0, 0, 0, 0, 0, 0, -8, 8, -8, 8, -16, 16, -19, 24, -32, 38, -41, 49, -59, 72, -81, 96, -112, 129, -147, 169, -193, 220, -249, 283, -318, 357, -401, 450, -501, 558, -620, 690, -762, 845, -935, 1032, -1136, 1253, -1382, 1518, -1673, 1844, -2033, 2245, -2485, 2754, -3062, 3420, -3838, 4334, -4940, 5692, -6657, 7944, -9759, 12523, -17298, 27811, -98997, 133822, 179414, -72174, 106078, -79402, -111222, 182282, -54132, -256649, 148569, 133810, -31096, 91069, -114917, -170430, 204874, 6715, -211727, 109243, 105315, -2607, 117229, -169182, -239693, 188072, 113462, -99623, 88158, -5499, -73704, 126109, -110307, -211862, 188705, 130331, -72378, 52636, -80962, -94671, 172079, -49829, -201152, 135590, 123273, -19965, 62735, -142331, -166374, 179564]
119A79564j31606j70084K33507o8675j01738J22803j96721j4577L51449j08350
129I5572j95966J42485p4673k5760J78122k01714p8549L20442n5902j54928R0918
140D0047j37664n505K38254j47222r1546K38020p0288j29668P8070j25540K4816
151h8226K68839j29926j50407J56415n9283m7486J14782j49185j2588K47991q6233
162F4693j27112R6007q1612j9955J44971j17160l0072K13256q3811j32608O6296
173g107p7668L5914J86149j21983q7229J39756o0541o1934P9869q6878J0995J74424
185A23767r4386r1258J06516o3137l8184R2738q3613J3733J63735r1327j04500
196f5916N7651m7517K0982J22057q2206m2918J07906o9289o2277P2490m7259J4512
$$ y = [179564, 47958, -122126, 111381, 42706, -59032, 63771, -132950, -147527, 203922, 95572, -100394, 42091, -32582, -58342, 119780, -81934, -160483, 159959, 104057, -50871, 40047, -97617, -103122, 135132, -12090, -103636, 134384, 64096, -65572, 12498, -113042, -88226, 180613, 50687, -99720, 56695, -2588, -50074, 64708, -84477, -97065, 150926, 64693, -62419, 33588, -48024, -67979, 76992, -40168, -70240, 143016, 59205, -73403, -7107, -84775, -48861, 137288, 15305, -71924, 67832, 7291, -54643, 25226, -61652, -50657, 123767, 29381, -61877, 44639, -18498, -56682, 36056, -47557, -33824, 129911, 38584, -65916, -8265, -55782, -34800, 87257, 5051, -37867, 70039, 750, -61527, 10963, -36296, -21784]
208b1784J08169q2234m3702Q5832n4207m0337N5022m0668K4171J06101p1264p3057
220d7958M5964l6900N212Q3696m4503j1115O2704o7667m1551N3362j8421J0621
232f556N6542m9775k0032N7083m1956l6411L8990j9760K0739O6373m9525l8747
244b3035K3812l4121K341N4758j0728o00K5435n0027k8960L9110o021M018L5069
257C1051k9310p760L0111l2149j7811K0654q983J5463L4795j8704k1754J794k4415
270b7018k105L9390O537J032O698l5237j5854J8324P04R991J4579j0259n262M884
284F404j0217r656N832l24O398K0944j502j2244j0209j8296K058K0332J4912O915
298B1347q110j6492j3380j19J2309Q974O668j039r143k549p47k159k928L92P319
$$ y = [-21784, 86385, 4151, -39551, 46281, -7926, -48263, 6759, -33909, -9738, 96363, 25099, -47958, -1994, -38894, -33682, 50014, 5511, -5604, 57100, -10567, -52118, 1244, -17177, -6556, 49986, 211, -19821, 37262, -4694, -41105, -2115, -21875, -1136, 65237, 15712, -23035, 777, -33344, -31003, 23755, 13027, 12427, 37862, -12165, -41125, -2015, -8036, -4018, 31051, 1741, -6019, 24092, -8057, -25868, -5214, -14197, 1266, 36061, 17357, -4397, -2603, -27018, -29123, 10267, 16804, 17836, 24534, -10703, -26557, -8233, -7529, 2462, 17041, 6782, 1520, 6404, -3813, -13469, -7637, -7961, -1563, 19381, 17879, 5635, -4574, -22870, -20812, -480, 14432, 21347, 13237, -3255, -16635, -16754, -4445, 4529, 11197, 10158, 1015, -1534, -2281, -4440, -7368, -6976, 343]
313C43O948Q576m651j8850o082j672O638K1285N571p403q701j4770n447J2645
327e570J2815J001N65n501j0886O945J269r325O917J439O45J2929l922j2902m204
342g785m537J699J6656J0914p302o227j1012j1661J4468J1530j222M760q635r039
356g393O293M03k547K495K60n25O758L447r145m478l980l272J4245R564k176m409
372E540j2878o101O545R413O702k546m952n547k118N778J066j321K31p96K217
387A233L177J187p609o535L415R05J0249R115j3273o694j448n385J2474J0665
401A1476p837k722K38r601L922J2316r578l69Q533j3837P097J4005j8592p66O836
416A121j2628J3979J5994j9407m282P480j6387R428K2049j9608J313J3005k7869
$$ y = [343, 7291, 15867, 11216, -7634, -13716, -15388, -8750, 12535, 18106, 10703, 2002, -12768, -18215, -5570, 7245, 8246, 8811, 3310, -7576, -631, 638, -8687, -1770, -331, 314, 13243, 9321, -3581, -7785, -12322, -10623, 6033, 16947, 9645, 3418, -7594, -19255, -4787, 6743, 5521, 10281, 1646, -7393, -1100, -697, -3244, -749, -489, -1014, 5744, 9191, 46, -4432, -8412, -11684, 2561, 12125, 9949, 5540, -7338, -13439, -6894, 2519, 9221, 6675, 1723, -3824, -5942, -164, 902, -419, -188, -984, 1233, 4410, 5597, -2012, -8547, -5132, -4227, 6022, 15137, 1864, -4830, -6278, -11663, 811, 11476, 3639, 917, 1155, -8446, -4524, 7792, -1786, -2155, 6378, -7459, -362, 13643, -4949, -5715, 1121, -11507, 2472, 18466, -941, -5223, 2257, -14130, -4702, 17347, -2261, -948, 12057, -15812]
429a5812Q016K3127k2251O735J2686k8180J1845K4061k7243K28J6706k6936J3879
442c139K9279l5094K937K1756l6790J3502L0108l3226J1937J9940m3886J1094
454a1582L4051l2757Q353K3221m4884J5668L8689m5919P399K9145m5799K0032
466d383L4780m8665J4417L0324n1993J3285L9230m2668J6317L0883o2073J5488
478a5058M7578n0522J5390L2027o0475K4355M2699n9676J6239L8192n8233J9347
490h137M2293n9406K1769M2455p2375J7558N0893n9184K6284L7188p8283K5889
502a3056N2181o5576K2393M1544p2046K6825M9545p5514K5788N1910p9212K4884
514a0334N0589p5136L5188M6849q9354K7210N5849p1664L1886M4560q8486L0430
$$ y = [-15812, -7796, 15331, -6920, -185, 12501, -15679, -3834, 20227, -7016, -6788, 9918, -17018, -3139, 26140, -8954, -6017, 15739, -21051, -7549, 22559, -10667, 1270, 21210, -22676, -11582, 22469, -10288, -1935, 21286, -23598, -7930, 30759, -15160, -7761, 21384, -24415, -4383, 30397, -18268, -3851, 26473, -25520, -12235, 26995, -15673, 644, 31527, -30546, -15058, 32520, -18002, -2612, 29415, -31060, -6705, 35994, -23682, -7443, 30749, -27484, -8137, 34156, -25250, -3481, 38974, -33401, -15843, 35050, -24134, 2150, 39338, -38945, -13056, 39125, -26451, -4058, 37486, -34560, -7735, 41810, -33704, -7916, 43994, -35218, -10334, 40255, -34881, 307, 47156, -42198, -14988, 40861, -30803, 1083, 45643, -42843, -12413]
526a2413N8037q2270L0886N3715q7605L2765N1890q7893L8773N4270r0965L0746
538a0064N3243q1551L8508N0901r6762L1468O0795q5204L8253N2827r8410L6827
550i169N5797r2053M2565N5685r5030L5928N2524r2649M2588N7714r9530L6686
562h944N8640r5266M5317N5622j05915M1471N7362r6006M9649N5156j04936L9937
574g913N5113r8002M9137N9453j05370M3057N6562j04989M9853N8168j05514M8356
586b089N3580j03494N2511N6160j06524M2571N4019r8195N5038N7280j11274M3147
598g270N5586j01839N4064N4546j04599N1430N0130j06563M9536N6288r7679M7675
610A305M8020j03615N4990N7840j08352M2890N1020r6247O0670M9166j10094M9113
$$ y = [-12413, 45624, -36646, -5760, 47955, -39650, -6885, 45005, -42888, -4115, 50155, -40810, -10064, 43179, -38372, 136, 51037, -45725, -14257, 46538, -38666, -413, 52414, -45996, -9169, 46628, -45425, -2860, 52825, -42205, -6277, 46247, -46402, -3814, 53900, -45630, -8944, 49696, -45570, -253, 55369, -50546, -9075, 48287, -47719, 1930, 57086, -47850, -7913, 47200, -50802, -1665, 57788, -47582, -4525, 52037, -52952, -3099, 55069, -50445, -2089, 51491, -52003, 508, 56668, -49856, -7285, 46734, -51461, 3577, 60857, -50417, -7270, 48316, -53523, 541, 55087, -49512, 1918, 52048, -54515, -4979, 51309, -46370, 1305, 49325, -54290, 700, 58540, -49812, -6922, 44098, -52149, 8521, 57687, -52407, -3294]
622c294N0792r9794N1216N0575r6219N4401M4971j11397N1797N8860r7255N0361
634E014M0632j02666O4140M9793j09216M6422M7594q9995N8638M1488j04772N4330
646A402M8292j04032N0092N0195q9305N8536L2748j09609N7592N2865r0608M6719
658D887L4027q8981O0609M0211j03137M6289M7793q4571N1674L4176r1656N7710
670I031L5865r8735M7585M5763p2571M9975K1605r4913N4282M7067q4464M1166
682A656L4131p7092N5010K6994r3313N1433M0732p7437M3920K7295p2635N3439
694A4133K3970r1293M5658M5637o5591M3282J6180q3272N5334L3770p9121M3791
706B478L0618o4448M5010J4902p6108N0401L3709p1478L6707K7451n9580M6278
$$ y = [-3294, 47498, -52296, -1080, 49495, -46724, 7677, 52648, -58749, -6952, 51908, -45347, 5014, 45646, -57020, 7120, 56913, -52303, -5881, 41713, -48282, 10356, 51844, -52928, 1402, 49694, -54338, -4246, 45949, -43356, 15180, 47928, -61681, -4089, 48776, -41832, 4887, 38914, -50067, 10542, 50753, -52384, -6095, 41698, -42873, 8801, 42977, -48679, 9031, 44896, -53839, -6254, 39509, -33062, 16913, 38518, -56395, -2113, 44954, -39510, 1656, 35787, -41305, 13705, 40699, -52614, -1181, 39551, -37886, 6034, 33329, -39306, 14133, 38103, -53190, -7532, 38105, -27486, 15796, 31976, -51296, 4038, 37808, -41313, 2478, 33096, -31352, 13658, 28560, -47548, 2853, 36562, -34916, 1791, 29242, -30338, 15940]
718A5940J3221p9576M6625L6807n5918L6280J1012o2398M3698K0218o3394L9014
730A529L0321n3109L0103J0486n8378M5168K3110o0649L2498K2828m3268L3285
742A3924L710n7758L8202K8025m4296K6679J3237m7493L0368J0802m9855L8735
754D280K4329m3874K1916M556l9854L5519J2335m4825K6772K0035l3707K1484
766H966K884m2966L1387J8226l5634K5911J0317l5396J9397J598l1276L1841J7226
779B2481l1224J2340M568k7596K2525Q342l0703K2496J3720k5145J4231p3k5646
792a9684J9582Q404j9011J7796Q890k2742N002R38j7565K1675J3235k0308P570
805C782J342j7584J2242L277j3085J3850O909j3046M348J246j3742O950O304q831
$$ y = [15940, 29161, -50415, -3790, 33017, -22901, 13379, 24391, -38007, 5691, 25909, -37485, 1529, 31850, -21259, 8844, 19330, -39048, 6120, 29230, -31419, 1079, 23907, -19361, 13924, 17634, -40124, -1922, 26103, -18193, 8486, 21723, -25770, 4598, 15400, -34455, 4280, 28609, -15265, 6651, 11207, -28647, 6872, 19207, -25618, 1154, 21189, -12518, 8966, 11850, -31116, 271, 18497, -17137, 8774, 19091, -16305, 3092, 4690, -26586, 5255, 22481, -8743, 3597, 8165, -19431, 3094, 11436, -19267, 3229, 16949, -8196, 6035, 5962, -19684, -102, 8302, -10709, 7087, 15977, -6765, -1763, -825, -18390, 3285, 16520, -3788, 3782, 5124, -12460, -218, 3059, -10026, 3824, 10733, -2313, 2035, 3281, -10461, -3511, 2793, -6038]
819f038J2466O568j5273r0k417p198J3402P462n992J286j876q870J485M630k720
834c175N544M997o765O21K3o930J279K121J674N867K494l914p525k908M05K695
850c497Q786K447m078k376n014l148L362M682O79J227K453n638j967J845o771
865g008L114P678k183M214J187j0672l074K506q98O905R119o792n211J644r055
880h526K513J0658n372L375N701j0436l99L485p765K562Q646l554K173O344j2206
895b801n159O606n947P249J2636j0203k200J952j1570L255R959m096K804O179
909H664j0283k636O780q866J356J0781o914L853P241j3400k314M205n979P206
923c06J0454o509k828J645j0587M61J1260l976K957O456j1522n37M682p877L342
$$ y = [-6038, 6428, 12996, -2277, -2367, -4784, -11982, 1420, 8882, 2890, 4176, 2300, -6570, -5085, -455, -3175, 2369, 7366, 601, 1222, 1245, -5685, -4406, -2285, -611, 5256, 7750, 3836, -3689, -6597, -6192, -3497, 5289, 7736, 3658, 1282, -3732, -6880, -3518, 1164, 1843, 3070, 5523, -115, -2082, -237, -7008, -3894, 3784, 1601, 5815, 7002, -3670, -6744, -4238, -5136, 1769, 10888, 4096, -1115, 529, -8526, -6013, 4645, -727, 2648, 8349, -2087, -2486, 999, -6766, -4204, 4442, 888, 3061, 9405, -2801, -7960, -1354, -7301, -52, 12584, 2381, 181, 2133, -9437, -6182, 3777, -319, 2485, 8664, -1619, -4255, 2525, -6341, -4985, 5796, -1118, 2735, 9976, -3424, -5738, -1533, -7512, -306, 10148, 3639, 811, 2456, -8131, -7670, 3590, -386, 2571, 9027, -2495, -3032, 1650, -6227, -2885]
938b885O372l857L359M142q189l855K849m084M465J0113m755j345r4j0038J834
953e968O302k04M474J014n766k085P16j828O55M156m26J576K443n232k448j093
969c714j310N054L228J813l39n794k789j637J501O821J913j548j445l158k378
984c782J921J343j931N007K411n266K754l015o824O982K63k030R539j775q357
999b760J507l381l167J2312K537r093O168k698j0040J0796k213p725J5365k288
1013E320j0524J0164m714r346J2311k817q715J7910o92j6518J0147n570j0314
1026a3358K3298l341j5118J7692o367j4562J6700n708j0403K3110m919j9072J9071
1039G023l406j6490K0856q113j5154L0535n627k2296J8846q539j2848K8073p676
$$ y = [-2885, 3487, -370, 2989, 7131, -1058, -4913, -2064, -6148, -1683, 8430, 3675, 2330, 2236, -7802, -5968, 334, 130, 4604, 5618, -148, -2233, -1517, -3345, -2690, 1466, 1040, 2616, 5059, -173, -2621, -3714, -5024, 30, 3258, 5071, 4732, -1062, -3851, -5488, -3987, 2834, 4747, 3199, 1754, -1404, -3782, -1861, -518, -2449, 2558, 4969, -297, 2457, -558, -7382, -400, -137, -2167, 7372, 5597, -2760, -1253, -4634, -7801, 4511, 7048, -2045, 4123, 1425, -8615, 2181, -32, -7757, 7608, 5320, -5204, 4960, 246, -9100, 3211, 394, -8321, 9589, 8897, -7621, 2526, -3044, -13358, 9940, 6599, -8519, 9173, 2806, -11756, 4944, -764, -11167, 11943, 7024, -12048, 7023, 3617, -12873, 7983, -130, -15284, 15251, 9624, -12672, 6174, -2365, -15213, 12860, 5184]
1052E184j8965K6786o189k3564K3110o098j5416L3137j1550k5838L1095o369k0564
1065a5241K6164j2773j6276L7589r508k8572K7746p458k0217L4247j2669k2920
1077a9888M0942j3029l1041L2690r829j6047L8854j9396k7873M1455q654k8294
1089b0110L2849j3984k0019M6818j8236l3622M2567j2183k5493L8941j8633k0140
1101b1245M8629j9957l5959M0280q794k1092M2371k3264k9544N2540j5432l4537
1113b6004M1328j5936j9895M8209k5252l1380N0177j3991l1785M0463j6804k0791
1125b1661N3102k5994l9311N0989j2174k5532M5060k6925k4739N6417k3406l6261
1137c0435M7708j4466k3455M7878k8617k9804O0183k1524l7690M8393j9663j9139
$$ y = [5184, -13781, 13005, 6816, -16748, 6362, 264, -15152, 17985, 6435, -19403, 11692, 5323, -15241, 10923, -1850, -18126, 19463, 9955, -18617, 9129, 1671, -18546, 15701, 3032, -19888, 21054, 8025, -23016, 9674, -155, -16202, 22652, 3256, -24617, 16838, 8184, -20110, 12739, -1245, -21264, 25554, 7318, -26304, 16263, 4080, -21413, 17528, -1105, -21245, 27384, 7427, -28532, 11748, 2954, -18138, 24233, 969, -28575, 23965, 8533, -26004, 15324, -612, -20507, 27702, 2450, -28930, 21247, 7256, -24529, 15934, -870, -21661, 31441, 5447, -33864, 17125, 4951, -20581, 24479, -2446, -27185, 29232, 5826, -30435, 17273, 2807, -20648, 27230, -1387, -31191, 28992, 7468, -30222, 18171, -1492, -20631]
1149b0631N4943l4841l4325N8189j7805k9504M6966k5403k2874N8160l1054l7038
1161c5217N8283j8248k7316M9237l2282k2992O2214k9582l6360N1422j8367k0514
1173a9722N0987l4037l0501O1157k2801l3451N1081k3771k0975N4425l5915l0232
1185c3755N9894k0583k8586M5532k7320j9718N7767l1800l5063N5764j9407k3734
1197b1009M9509l3909k2860N9344l0472l0161N2268k1997j9764M7943l5401k4592
1209c1101O0536k5104l0191M8664k7152j7348N4510l7110k6317N6570k4914k2300
1221b1257M6184l0209j7422N2849l2875k6864N3796k2292k0926M5290l4422j7954
1233b6102N5911k9680k4448M6134k4750j5148M4715l1975k0017N0609k4426k2967
$$ y = [-20631, 34312, -529, -34854, 23335, 5530, -23974, 22992, -2411, -25285, 32875, 1821, -35217, 23066, 4818, -22498, 26739, -5543, -28535, 33679, 4097, -32263, 19159, 792, -19722, 31265, -2772, -33273, 27884, 5083, -28368, 22713, -1058, -22033, 32392, -3523, -33755, 26139, 5556, -23030, 22502, -4818, -24536, 33231, 1431, -33632, 22132, 2725, -21009, 28500, -5409, -28269, 31075, 603, -29558, 22710, 713, -19051, 28892, -6509, -31101, 29435, 4331, -25860, 22804, -4348, -21696, 32814, -4296, -30613, 25957, 1043, -21257, 24927, -5282, -22704, 30145, -2730, -29594, 24202, 1910, -19016, 26274, -8148, -26102, 29809, 129, -24319, 21815, -2935, -18083, 26632, -5343, -25360, 25249, 823, -22144]
1245b2144M3896k4771j5550M5459l2667j9842M9287k2550j7928L7963k7906j3154
1257a9907M5018k6769k0290M2700k1632j6311L9409k8104j4147M4677k7224j7402
1269a9982L9895k2705j1287L5953k8723j3489M1830k1483j5956L5015k4172j1547
1281a6651L8547k6548j3128L8430k3230j1898L2446k3727q296L4110k3735j2855
1293a6535L3484j8386j0859K9958k3468j0082L4269k0488j0591K9010k0389p921
1305a1998K7306j9782p693K8098j7295j0726K5099j6085p768K6180j8808r129
1317a2601K6536j5820p052K1933j7569n739K2647j4545o536K0883j3965p745K0036
1330A0463j3768n580K1741j4855o821J9068j3660l485J7515j3945m167J6758j0902
$$ y = [-22144, 21752, -3019, -18569, 26890, -5777, -25619, 23668, 1118, -16810, 21153, -6753, -19907, 25111, -1658, -21948, 20752, -880, -17191, 22218, -5886, -20033, 24644, -2580, -19982, 19913, -2792, -14079, 21874, -6849, -20338, 21492, 9, -15947, 19068, -5104, -16651, 21896, -4652, -17780, 20650, -2580, -14478, 17968, -5759, -14055, 20055, -3680, -16535, 16949, -1437, -12296, 17662, -5806, -15888, 18381, -2107, -12698, 16312, -4077, -11998, 15308, -4474, -12167, 15931, -1364, -12090, 13009, -3076, -10844, 15336, -3472, -12601, 13935, -1885, -8937, 12996, -4573, -10312, 12335, -2210, -8746, 12137, -1828, -9573, 10463, -3305, -8885, 12856, -1999, -8820, 10248, -3412, -6897, 10618, -3327, -7494, 9264, -1638]
1343a638m473J5077j1392n238J5969j0377l840J5629j1693m297J3102j0104j324
1356d599J2478r125l380J0135p129l042J0592o842m045J0541o574k768R595p433
1370a596k567P953n219o58O687m691l027N048k792k100O584k743l438N136l559
1385i82j645N367l066j192L031j757m11K007j034k175J675P29j441K561l80k671
1401a384J237o29j77J809L72n42j576Q05j78r75K842j525j501L002j566q62K116
1418A268j708j473K538L77k029K969o72m758M073q8l105N942j899m431M601j736
1434a31k782N044q90l957M494j30n053N399n30o139O844n25n073P238k475n883
$$ y = [-1638, -6111, 8966, -2426, -7664, 8305, -2072, -5912, 9717, -1976, -6273, 6829, -3275, -4599, 7879, -1246, -4626, 5509, -1620, -4662, 5930, -912, -4957, 5584, -990, -3758, 5837, -1596, -4163, 3790, -1429, -2087, 4600, -91, -3118, 1930, -862, -2962, 3622, 879, -2559, 2577, -982, -2627, 2740, -326, -1518, 1513, -244, -655, 1352, 318, -1857, -182, 547, -894, 1667, 1287, -1384, -147, -776, -953, 856, 1228, 686, -890, -85, -263, -1238, 1604, 79, -1422, 1580, 14, -848, 1268, -440, -1913, 625, 1002, -1027, 1942, 1270, -3488, 585, 497, -2608, 3334, 1435, -2996, 1605, -131, -2913, 2131, 1241, -2716, 1778, 1648, -3405, 1994, 1464, -4675, 2169, 1644, -3429, 3809, 1334, -4549]
$$ [...]
8191d3
##END NTUPLES=NMR FID
##END=
