##TITLE=1H_Pr A3A
 CDCl3,8 sc, 
 4.02.2021
##JCAMPDX= 6.0         $$ Bruker NMR JCAMP-DX V2.0
##DATA TYPE= NMR FID
##DATA CLASS= NTUPLES
##ORIGIN= UXNMR, Bruker Analytische Messtechnik GmbH
##OWNER= root
$$ XWIN-NMR		Version 3.5
$$ Thu Feb  4 11:18:31 2021 Russian Standard Time (UT+4h)  she@DPX200
##.OBSERVE FREQUENCY= 200.1315066352
##.OBSERVE NUCLEUS= ^1H
##.DELAY= (6, 6)
##.ACQUISITION MODE= SIMULTANEOUS
##.ACQUISITION SCHEME= undefined
##.AVERAGES= 8
##.DIGITISER RES= 18
##SPECTROMETER/DATA SYSTEM= spect
##.PULSE SEQUENCE= zg30
##.SOLVENT NAME= D2O
##.SHIFT REFERENCE= (INTERNAL, D2O, 0, 15.7039)
##AUDIT TRAIL= $$ (NUMBER, WHEN, WHO, WHERE, WHAT)
$$ ##TITLE= Audit trail, XWIN-NMR		Version 3.5
$$ ##JCAMPDX= 5.01
$$ ##ORIGIN= Bruker BioSpin GmbH
$$ ##OWNER= she
$$ F:/spectra/data/she/nmr/H-F/1/audita.txt
$$ ##AUDIT TRAIL=  $$ (NUMBER, WHEN, WHO, WHERE, WHAT)
(   1,<2021-02-04 11:17:21.40 +0400>,<she>,<DPX200>,
      <created by zg, POWCHK disabled, PULCHK disabled
       configuration hash MD5:
       00 E9 B6 7A A2 85 ED C7 34 08 36 98 17 FE 4E 26
       data hash MD5: 16K
       1C D6 8A C6 6C 76 B8 C4 ED 20 3A F0 CF 43 95 53>)
$$ ##END=
$$ 
$$ hash MD5
$$ 03 3E 48 B4 09 06 1A CE 1C 59 F7 0B C0 12 7A B5
##$RELAX= 
##$RELAX= 
##$RELAX= 
##$RELAX= 
##$RELAX= 
##$RELAX= 
$$ Bruker specific parameters
$$ --------------------------
##$DU= <F:/spectra>
##$EXPNO= 1
##$NAME= <H-F>
##$PROCNO= 1
##$TYPE= <nmr>
##$USER= <she>
##$AMP= (0..31)
100 100 100 100 100 100 100 100 100 100 100 100 100 100 100 100 100 100 
100 100 100 100 100 100 100 100 100 100 100 100 100 100 
##$AQSEQ= 0
##$AQ_mod= 1
##$AUNM= <au_zg>
##$AUTOPOS= <>
##$BF1= 200.13
##$BF2= 200.13
##$BF3= 200.13
##$BF4= 200.13
##$BF5= 200.13
##$BF6= 200.13
##$BF7= 200.13
##$BF8= 200.13
##$BYTORDA= 1
##$CFDGTYP= 0
##$CFRGTYP= 5
##$CHEMSTR= <none>
##$CNST= (0..31)
1 1 145 1 1 1 1 1 1 1 1 1 1 1 1 1 1 1 1 1 1 1 1 1 1 1 1 1 1 1 1 1 
##$CPDPRG= <>
##$CPDPRG1= <>
##$CPDPRG2= <>
##$CPDPRG3= <>
##$CPDPRG4= <mlev>
##$CPDPRG5= <mlev>
##$CPDPRG6= <mlev>
##$CPDPRG7= <mlev>
##$CPDPRG8= <mlev>
##$CPDPRGB= <>
##$CPDPRGT= <>
##$D= (0..31)
0 1.2 0 0 0 0 0 0 0 0.06 0 0.03 0 0 0 0 0.0002 0 0 0 0 0 0 0 0 0 0 0 0 
0 0 0 
##$DATE= 1612423040
##$DBL= (0..7)
120 120 120 120 120 120 120 120 
##$DBP= (0..7)
150 150 150 150 150 150 150 150 
##$DBP07= 0
##$DBPNAM0= <>
##$DBPNAM1= <>
##$DBPNAM2= <>
##$DBPNAM3= <>
##$DBPNAM4= <>
##$DBPNAM5= <>
##$DBPNAM6= <>
##$DBPNAM7= <>
##$DBPOAL= (0..7)
0.5 0.5 0.5 0.5 0.5 0.5 0.5 0.5 
##$DBPOFFS= (0..7)
0 0 0 0 0 0 0 0 
##$DE= 6
##$DECBNUC= <off>
##$DECIM= 32
##$DECNUC= <off>
##$DECSTAT= 4
##$DIGMOD= 1
##$DIGTYP= 9
##$DL= (0..7)
0 120 120 120 120 120 120 120 
##$DP= (0..7)
150 150 150 150 150 150 150 150 
##$DP07= 0
##$DPNAME0= <>
##$DPNAME1= <>
##$DPNAME2= <>
##$DPNAME3= <>
##$DPNAME4= <>
##$DPNAME5= <>
##$DPNAME6= <>
##$DPNAME7= <>
##$DPOAL= (0..7)
0.5 0.5 0.5 0.5 0.5 0.5 0.5 0.5 
##$DPOFFS= (0..7)
0 0 0 0 0 0 0 0 
##$DQDMODE= 0
##$DR= 18
##$DS= 0
##$DSLIST= <SSSSSSSSSSSSSSS>
$$ [...]
##$SUBNAM2= <"">
##$SUBNAM3= <"">
##$SUBNAM4= <"">
##$SUBNAM5= <"">
##$SUBNAM6= <"">
##$SUBNAM7= <"">
##$SUBNAM8= <"">
##$SUBNAM9= <"">
##$SW= 16.9725356469052
##$SWIBOX= (0..15)
0 0 2 0 0 0 0 0 0 0 0 0 0 0 0 0 
##$SW_h= 3396.73913043478
##$TD= 16384
##$TD0= 1
##$TE= 0
##$TE2= 300
##$TE3= 300
##$TEG= 300
##$TL= (0..7)
0 120 120 120 120 120 120 120 
##$TP= (0..7)
150 150 150 150 150 150 150 150 
##$TP07= 0
##$TPNAME0= <>
##$TPNAME1= <>
##$TPNAME2= <>
##$TPNAME3= <>
##$TPNAME4= <>
##$TPNAME5= <>
##$TPNAME6= <>
##$TPNAME7= <>
##$TPOAL= (0..7)
0.5 0.5 0.5 0.5 0.5 0.5 0.5 0.5 
##$TPOFFS= (0..7)
0 0 0 0 0 0 0 0 
##$TUNHIN= 0
##$TUNHOUT= 0
##$TUNXOUT= 0
##$USERA1= <user>
##$USERA2= <user>
##$USERA3= <user>
##$USERA4= <user>
##$USERA5= <user>
##$V9= 5
##$VALIST= <valist>
##$VCLIST= <CCCCCCCCCCCCCCC>
##$VD= 0
##$VDLIST= <DDDDDDDDDDDDDDD>
##$VPLIST= <PPPPPPPPPPPPPPP>
##$VTLIST= <TTTTTTTTTTTTTTT>
##$WBST= 1024
##$WBSW= 4
##$XGAIN= (0..3)
0 0 0 0 
##$XL= 0
##$YL= 0
##$YMAX_a= 238348
##$YMIN_a= -261559
##$ZGOPTNS= <>
##$ZL1= 120
##$ZL2= 120
##$ZL3= 120
##$ZL4= 120
##$ABSF1= 10
##$ABSF2= 0
##$ABSG= 5
##$ABSL= 3
##$ALPHA= 0
##$AQORDER= 0
##$ASSFAC= 0
##$ASSFACI= 0
##$ASSFACX= 0
##$ASSWID= 0
##$AUNMP= <proc_1d>
##$AZFE= 0.1
##$AZFW= 0.1
##$BCFW= 1
##$BC_mod= 2
##$BYTORDP= 1
##$COROFFS= 0
##$CY= 11.3945322036743
##$DATMOD= 1
##$DC= 2
##$DFILT= <>
##$DTYPP= 0
##$F1P= 15.9154993809931
##$F2P= -4.1035820241983
##$FCOR= 0.5
##$FTSIZE= 0
##$FT_mod= 4
##$GAMMA= 1
##$GB= 0.15
##$INTBC= 1
##$INTSCL= 1
##$ISEN= 128
##$LB= 0.24
##$LEV0= 0
##$LPBIN= 0
##$MAXI= 10000
##$MC2= 0
##$MEAN= 0
##$ME_mod= 0
##$MI= 1.114404
##$NCOEF= 0
##$NC_proc= 0
##$NLEV= 6
##$NOISF1= 3.799351
##$NOISF2= 2.8
##$NSP= 1
##$NTH_PI= 0
##$NZP= 0
##$OFFSET= 15.70392
##$PC= 1
##$PHC0= -10406.64
##$PHC1= 17.80095
##$PH_mod= 1
##$PKNL= yes
##$PPARMOD= 0
##$PSCAL= 0
##$PSIGN= 0
##$REVERSE= no
##$SF= 200.130013532006
##$SI= 16384
##$SIGF1= 3
##$SIGF2= 2
##$SINO= 400
##$SIOLD= 16384
##$SREGLST= <1H.CDCl3>
##$SSB= 0
##$STSI= 0
##$STSR= 0
##$SW_p= 3612.71676300578
##$SYMM= 0
##$S_DEV= 0
##$TDeff= 0
##$TDoff= 0
##$TI= <>
##$TILT= no
##$TM1= 0
##$TM2= 0
##$TOPLEV= 0
##$USERP1= <user>
##$USERP2= <user>
##$USERP3= <user>
##$USERP4= <user>
##$USERP5= <user>
##$WDW= 1
##$XDIM= 8192
##$YMAX_p= 0
##$YMIN_p= 0
$$ End of Bruker specific parameters
$$ ---------------------------------
##NTUPLES= NMR FID
##VAR_NAME=  TIME,          FID/REAL,        FID/IMAG
##SYMBOL=    X,             R,               I
##VAR_TYPE=  INDEPENDENT,   DEPENDENT,       DEPENDENT
##VAR_FORM=  AFFN,          ASDF,            ASDF
##VAR_DIM=   8192,          8192,            8192
##UNITS=     SECONDS,       ARBITRARY UNITS, ARBITRARY UNITS
##FACTOR=    0.0002944,     1,               1
##FIRST=     0,             0,               0
##LAST=      2.4114304,     0,               0
##MIN=       0,             -261559,         0
##MAX=       2.4114304,     238348,          0
$$ Real data points
##PAGE= N=1
##DATA TABLE= (X++(R..R)), XYDATA
0@%%%%%%%%%%%Qj6J6j6K4l2L2m0N6o4P2q8J04j25J49j69J93k24K57k94L38l86
33b05M34m90N54o18O90p70Q56r53J058j174J300j434J584j747J925k120K333k570
51a347K831l121L443l803M211m675N207n826O557p434Q510r862J1622j4013J7451
66I751k2833L2439n4483J86525M5924m58882K55802J62703k14329k9177J65013
77G8453p7541K6348o9230L1004J33057j71323m1760J84321m7999j78014J95728
88F3044J6170j81199J07829O3041o1944o1590O3774J0023J5018p9314Q945J13992
100G7789j00613k6931P0739K7067q6952K0253L3348L708j058q2407Q1410J1254
112B7607n8944N293O6971o0687j9309J01130q0444o634M1963o535n0250M2975
$$ plain form
0 0 0 0 0 0 0 0 0 0 0 0 0 8 -8 8 -8 16 -16 16 -24 32 -32 40 -48 56 -69 80 -89 104 -120 137 -157 181 -205
33 -205 229 -261 293 -325 365 -405 451 -502 556 -618 682 -752 832 -915 1010 -1110 1223 -1347
51 -1347 1484 -1637 1806 -1997 2214 -2461 2746 -3080 3477 -3957 4553 -5309 6313 -7700 9751
66 9751 -13082 19357 -35126 151399 197323 -261559 -5757 156946 -57383 -86560 78453
77 78453 912 27260 -41970 -10966 122091 -49232 -90992 93329 45330 -132684 63044
88 63044 79214 -101985 5844 68885 6941 -54649 9125 19148 34166 -45148 -36203 77789
100 77789 -22824 -49755 20984 48051 -38901 -18648 14700 18408 17350 -65057 16353 27607
112 27607 -31337 -26044 40927 -19760 -39069 62061 -18383 -25017 16946 10411 -39839 3136
124C136J3755l9808K8607l4156O1050j1191n5528J9309N5581m9988l3560Q5852
136D3059o6518Q221M1828k2437k8754M6625j114o0980O2956j3504q805j8256J3849
149c830K5696r268k9207n156P4780o5441m168L9041j5589k2387K2114J1323m2718
162b4810M7216k9170M28J7209o20q604j2133J8799j3365K9151m7280J0481K8167
175A5469j2191r070k701K7179k7628J7646k3334K0623L687l2878J6611J1524R040
188A3977l7779L0632j0020P409J154j9935J6003j0177J7320k1989J5250j0117
200h272J4287l742k0874L5737j6389o662j3415L7989j6366j3902Q988l817K3091
213A6653k4000R519q873J7400j0566j675O704j2984K2728k9643J6618N907L285
$$ plain form
124 3136 16891 -22917 5690 -28466 32584 21393 -34135 -14826 40755 -9233 -42793 43059
136 43059 -23459 -15238 26590 4153 -24601 22024 20910 -40070 22886 9382 577 -17679 -3830
149 -3830 21866 12598 -16609 -21765 53015 -12426 -16594 22447 6858 -15529 6585 17908 -24810
162 -24810 22406 -6764 -6336 10873 10253 1649 -10484 8315 -5050 24101 -23179 -12698 15469
175 15469 3278 -5792 -8493 18686 -8942 8704 -14630 5993 9680 -23198 -6587 4937 13977
188 13977 -23802 6830 -3190 4219 5373 -14562 1441 -8736 8584 -13405 1845 -8272
200 -8272 6015 2273 -18601 17136 747 -5915 -19330 18659 2293 -11609 -2621 -6438 16653
213 16653 -7347 2172 -6701 10699 133 -1542 5162 -7822 14906 -14737 1881 7788 11073
226A1073k3643J0455K3797k5407J2151k0163J9911n212q8p273J515J4841k0607
239h650K1507j8597J3860o938l056k713Q149J1442l7910K6993j324P290j6310
252f257J304Q684k903P369k7666K8723j1716J36m831R590M201j8190J5062j3488
266i982K2933j8390q50O52O539N386j9694J6705j4221K0657j2790q33K816K110
280A038M084k1391K4841j0891N270j6351J4794R871j5428N731j0938K3647j7412
293c135M797q423R355L906j4876J5715j1060J4875j6269R612l239M059R51j9350
307a3082K1530p531P800j8295J3443L04o93K859j7849K3357j2474K969j0062J6013
321H289o056r846J2223r503J7398j9148N775k917J2433q021j2851J8173j1657
$$ plain form
226 11073 -12570 -2115 21682 -3725 8426 -11737 8174 2962 2874 -4399 -2884 11957 -8650
239 -8650 12857 -5740 8120 1182 -1874 -4587 3562 15004 -22906 4087 2763 10053 -6257
252 -6257 -4953 3731 828 8197 -19469 9254 -2462 -2326 -7157 2433 6634 -11556 3506 -9982
266 -9982 12951 -5439 -6289 -5637 902 6288 -13406 3299 -10922 9735 -3055 -3888 -1072 1038
280 1038 5122 -16269 8572 -2319 2951 -13400 1394 11265 -4163 1568 -9370 14277 -3135
293 -3135 1662 -6761 2594 6500 -8376 7339 -3721 11154 -5115 4497 1258 5317 6268 -13082
307 -13082 8448 917 8717 -9578 3865 4169 3476 6335 -11514 11843 -631 2338 -7724 8289
321 8289 2233 -7613 4610 -4893 12505 -6643 -868 -3785 8648 627 -12224 5949 -5708
334e708J1516j3984J0885o187O129l222q668J9106j6926P284r633J3553n594j068
348b517J29o803K0765j7027N082q334J4884p251n770R194p790J2950j7314J3073
362C271m032P323j1212k459J7575j3677O399j2560J6129o513K628l256k372J3075
376A0319j4419R748r204J1351j0874L010M315o436J1132j4504R561o236J3859
389A1622j3615k211R582n912P495j5400J3723p311P533r395J946J2229j6449N752
403d11m008J5340j8290N566K74N13P137j3970J0702p885J1200j2422O199m30n430
418e915R600j0706R607q567J1989j3387L596R406p698J803r239J8111j1436K590
432b46o659Q536M142j4706J0501k331P188j5056J3298k093m718L838n618J0317
$$ plain form
334 -5708 5808 -8176 2709 -3478 2651 -571 -9239 9867 -7059 225 -9408 4145 -1449 -2517
348 -2517 -2388 -9191 11574 -5453 -371 -8705 6179 -1072 -6842 2352 -5438 7512 -9802 3271
362 3271 -761 6562 -4650 -7109 10466 -3211 3188 -9372 6757 244 2872 -384 -2756 10319
376 10319 -4100 5648 -3556 7795 -3079 -69 4246 -2190 8942 -5562 3999 -2237 11622
389 11622 -1993 -4204 5378 -534 6961 -8439 5284 -2027 5506 -3889 -1943 10286 -6163 -411
403 -411 -4419 10921 -7369 -1803 -1529 -1016 6121 -7849 2853 -5032 6168 -6254 -55 -485 -5915
418 -5915 3685 -7021 2586 -5981 6008 -7379 -3783 5623 -2075 -272 -9511 8600 -2836 -246
432 -246 -6905 1631 5773 -8933 1568 -763 6425 -8631 4667 2574 -2144 1694 -3924 6393
446F393j0558J2537j3328O720j65r63M842j2925J1074m635Q637j5492J2396L125
460G658j1616N616j7R440j9427J2299m092L612p69p489Q792n608Q219j4455J4644
475F807n971k920L528l168M767q595J2450j6043J2232r36o729L874j107O527j3316
490h600J3751j2580O927J526m936L778l641Q310j1781J1048q249P430l086q104
504h207J0820k865L685j4013J5892l623k073n293M385J0919j8593R808O82M733
518F257j4737R619O017j1151N947m516J1185j4548Q876J33j541m207J425J3462
532A2221k0092R649k09N845j0987J11J1460o988o74q053K1612j6378l670R716
546C563J952n405o220J4628j2906Q694q585N028K707p476M066o98N633j6048J7933
$$ plain form
446 6393 -4165 8372 -4956 1764 1599 636 5478 -7447 3627 -1008 7629 -7863 4533 7658
460 7658 -3958 1658 1641 11081 -8346 3953 -139 3473 2704 -4785 4007 -1601 6618 -7837 6807
475 6807 836 -2084 1444 -1724 3043 -5552 6898 -9145 3087 2151 -4578 -704 -1811 4716 -8600
490 -8600 5151 -7429 -502 1024 -3912 -134 -3775 4535 -7246 3802 -4447 2983 -103 -8207
504 -8207 2613 -252 3433 -10580 5312 1689 -384 -5677 -1292 9627 -8966 842 1524 6257
518 6257 -8480 1139 7156 -3995 1952 -2564 8621 -5927 2949 3082 1541 -2666 -1241 12221
532 12221 -7871 1778 1569 7414 -3573 -3462 7998 1010 336 -7717 13895 -2483 -6153 3563
546 3563 5515 110 -6110 8518 -4388 4306 -4279 749 3456 -4020 46 -652 4981 -11067 6866
561F866o189p040O628J529j861r983J7483j0837K964m708O976P00r832R709o336
576c931P797j0995Q675k778J85J135m744J0068j1876J0709o583K255k318N533
590C132j510j0858J7778j1756L823l536P235m544j237N532p248J1014j3231Q615
604C209j949N12k065R39M639j0101J2285r608N906m790L159J40n297N587n139
619b573J0262j3300Q771J5k595j587j095R845j4194Q239l768N807p260J629O233
634D429p528N256p565R877q466M328m71j280J856o986J3805j3332O026j516L034
649A467n157J319O875j1395R286o508N886m441J533l09Q75L271j0880J3363p973
664b788L682l167L497o44m309R099r490Q629p711N443k828J87L407n348P426j0781
$$ plain form
561 6866 677 -6363 265 1794 -67 -10050 7433 -3404 -440 -5148 1828 2528 -7304 2405 -3931
576 -3931 3866 -7129 1546 -1232 -1047 88 -4656 5412 -6464 4245 -2338 -83 -2401 3132
590 3132 1622 -9236 8542 -3214 609 -2927 4308 -236 -1473 4059 -3189 7825 -5406 3209
604 3209 1260 1772 -293 646 5285 -4816 7469 -2139 3767 -1023 2136 2276 -3021 2566 -2573
619 -2573 7689 -5611 3160 3175 580 -1007 -2102 7743 -6451 1788 -1980 3827 -3433 -1804 4429
634 4429 -3099 2157 -5408 4469 -3997 331 -140 -1420 436 -6550 7255 -6077 -51 -1567 1467
649 1467 -3690 -2371 4504 -6891 2395 -4113 1773 -2668 -1135 -1444 -569 2702 -8178 5185 -2788
664 -2788 894 -2273 1224 580 -3729 5370 -4120 4509 -3202 2241 -587 -400 3007 -2341 5085 -5696
680e696J1155n971K649l789K981M374j1235J1724p292M852p280P445k621l279
694a983O163q053R345q234O467m903K551q26k240O362j1142J1005o284L510m835
709c097N079j423n664J0001r577P123o575O920n152J739J722o223R300q931P241
724B483n764M423l976J856L016p277Q948q115O351m658M166k636q67N322q343
739e071Q423o367N373n075N340k137l131P401q086P133o554O754o278L927N62
754B214m323O539p549P443o791O493n196K543K047o356Q524q249O481o881P170
769D109m625K1M509p791P782o367O076p070N717k428j281M911p287P413p152O676
785C213o746N105j357l800N996o450O791o633O038o074M415J11m859O992o660
$$ plain form
680 -5696 5459 -512 2137 -1652 1329 5703 -5532 6192 -1100 3752 -3528 3917 1296 -1983
694 -1983 4180 -3873 5472 -2762 3705 -1198 1353 527 -1713 4649 -6493 4512 -1772 1738 -3097
709 -3097 1982 559 -5105 4896 -4681 2442 -4133 2787 -2365 -626 1096 -5127 4173 -4758 2483
724 2483 -3281 1142 -2834 -978 2038 -5239 3709 -4406 1945 -2713 1453 -1183 -2050 3272 -5071
739 -5071 3352 -3015 2358 -2717 2623 486 -2645 4756 -3330 3803 -2751 4003 -2275 1652 2214
754 2214 -2109 4430 -3119 4324 -2467 4026 -1170 1373 3420 -2936 5588 -2661 3820 -3061 4109
769 4109 -516 -495 4014 -3777 4005 -2362 3714 -3356 2361 -67 -1348 3563 -3724 3689 -3463 3213
785 3213 -3533 1572 215 -3585 2411 -4039 2752 -3881 2157 -3917 498 609 -4250 2742 -3918
800c918O216o342O664n679J458K706n382O917o172O376p769O931l385k9K709n090
816c789P330n790N417p241O997k959j831M773n169N614o236P371o648M513j486
831H66k582N295m847N003o533P635o661L910L00m206N412n198N731p621P456m826
847h66R63J922l768M828n775N947o689P660m942j363L912l184L560o393Q209q310
863d289N527j690j830M152m624M326o351R133q241L475J80j897L402m235N099
878B137p894R506o025R34J287j425K978n344P488q188P212m530R22K525k515K763
894A831n962R465q409N186k489L17J501j903L392o896R406p342L727j856J070
909A038P98m074O671o869P042o403K908l0j19Q53n408P762o660O538o090K985
$$ plain form
800 -3918 2298 -4044 2620 -3059 -1601 1105 -4277 2640 -3532 2844 -4925 2006 -1379 -1408 1301 -3789
816 -3789 3541 -2249 3168 -4073 2924 -35 -1866 2907 -2262 3352 -2884 4487 -2161 2352 866
831 866 -1716 3579 -1268 3735 -2798 4837 -1824 2086 2386 -1820 3592 -1606 4125 -3496 3960 -866
847 -866 97 2019 -1749 3079 -2696 3251 -3438 4222 -720 -2083 1829 -1355 2205 -4188 4021 -4289
863 -4289 1238 -452 -2282 1870 -2754 1572 -4779 4354 -3887 -412 -232 -2129 1273 -2962 2137
878 2137 -5757 3749 -2276 -1342 -55 -1480 1498 -3846 3642 -4546 2666 -1864 -942 1583 -932 1831
894 1831 -4131 5334 -3075 2111 -378 -61 1440 -463 2929 -3967 5439 -1903 1824 -32 1038
909 1038 1836 -2238 4433 -2436 4606 -1797 1111 1081 962 1815 -3593 4169 -2491 4047 -2043 942
925I42j88k185M035n534P071p832O231m290K836m12l875N244m703N861o887N047
941A361l523K327N68l608N400n741O153o292M113k168N14O62l869P518o402M110
957A123m981N879j491k595K249k918O860q829P055l271J457j340k3L257n898O829
973C363o771O352l639J531m8k081M081m124O045q945P054j638j121M73q15M338
989D055o785O178n314N989m645j043M527l149K483n439P472o919M875j926j897
1004a538L545l415M105o443P073n104K112j579N11L278o331N605n056O503n586
1019b320J143Q51n69K282n544P392p463N220j685L1n23N50K649p734R194n205
1035a731K215l022K238J826l228K358m977R520p984J946J052J045j650k304P329
$$ plain form
925 942 754 -1431 2604 -2930 4141 -3691 2540 -1750 1086 674 -3201 2043 -2660 3201 -3686 1361
941 1361 -2162 165 733 -2875 2525 -3216 2937 -3355 758 -1410 -896 -234 -4103 3415 -2987 1123
957 1123 -3858 2021 530 -2065 184 -2734 4126 -4703 2352 -919 538 -802 -825 2432 -3466 3363
973 3363 -3408 2944 -695 836 788 -1293 2788 -1336 4709 -4236 2818 1180 59 532 -283 4055
989 4055 -2730 3448 -1866 4123 -522 -1565 2962 -187 2296 -3143 4329 -2590 2285 359 -1538
1004 -1538 2007 -1408 2697 -3746 3327 -1777 335 -1244 -733 2545 -3786 1819 -3237 3266 -2320
1019 -2320 -1177 -326 -895 1387 -4157 3235 -4228 992 -693 -662 -1185 -635 2014 -5720 3474 -1731
1035 -1731 484 -2538 -300 1526 -1702 656 -4321 5199 -2785 -839 213 1258 -392 -2696 4633
1050D633p537N049l334K729j943O82K416n763O277m433M995n759K874J040j198
1065G28J065n395R172p090J413l45M216m420k146P221o707M984m729L523k556
1080a066K491p23k692M796o499P341n755J862l96K040k329k577Q395q166L332
1095E4k792N164k855j869K456k181M639p112O607m080J671o90j01K097m539O379
1111B848o186M630l184L430k407k662P088m678J854m395P415m854N04J162j867
1126a302M559o326N360k919L145m927L496J447m848O103n623L348k770N463n421
1141a215M86L956m376M314n610N377l148J471k729K412L043q066O185k526L165
1156B739n359L806j216j313L983n603M765m080M706m387J884K59j723L492o039
$$ plain form
1050 4633 -2904 2145 -1189 1540 -403 279 2695 -3068 3209 -1224 3771 -1988 886 1926 728
1065 728 1793 -3602 5570 -1520 -107 -452 3764 -656 -2802 4419 -2288 2696 -2033 1490 -1066
1080 -1066 1425 702 -1990 2806 -3693 3648 -2107 -245 -641 1399 -930 -3507 4888 -3278 54
1095 54 -2738 2426 -429 -2298 158 -2023 2616 -4496 2111 -1969 -298 -988 -1089 1008 -3531 2848
1111 2848 -3338 1292 -1892 1538 -869 -3531 3557 -1121 733 -3662 3753 -1101 -597 565 -1302
1126 -1302 3257 -3069 2291 -628 2517 -2410 1086 2533 -2315 3788 -1835 1513 -1257 4206 -1215
1141 -1215 -729 3227 -1149 3165 -2445 2932 -216 1255 -1474 938 3981 -4085 2100 -426 2739
1156 2739 -2620 1186 -30 -1343 2640 -2963 1802 -2278 2428 -1959 -75 184 -1539 1953 -4086
1171d086O003l226K230m641M321J484n768M353l015M786n757M399k459Q17J427
1186H68l793M969m565M367m423L704j559L78J820n335N756k765L081n943M858
1201A418J26k779K506k941M970n577M400l210K994j031k718M177k991L720n486
1216b422M986l302J969P82l763L594k326L559n875N196k159n37J436k558M127
1231B707m617L805n040O020k476k803L430k266L282m857M618m451M030j355k448
1246b421L434k729K963m841N648l692J710p89j809M700l616J943m207O510m199
1261a395N62J246k006L072l826L963m028M636l732J27K863k203K509m793N273
1276B268l602L559k976l98L129k365K263m394N936m713K277n54k58J902l571L276
$$ plain form
1171 -4086 1917 -1309 921 -3720 601 2085 -3683 670 -2345 2441 -3316 1083 -1376 -559 868
1186 868 -2925 2044 -2521 1846 -2577 1127 -432 -54 1766 -3569 2187 -578 2503 -3440 1418
1201 1418 1544 -1235 1271 -1670 3300 -2277 2123 -1087 1907 876 -1842 2335 -656 3064 -2422
1216 -2422 2564 -738 1231 2013 -1750 1844 -482 3077 -2798 2398 239 -298 1138 -1420 2707
1231 2707 -1910 1895 -3145 2875 399 -2404 1026 -1240 2042 -2815 1803 -2648 1382 27 -2421
1246 -2421 1013 -1716 1247 -3594 2054 -1638 72 -717 -2526 2174 -1442 501 -3706 2804 -1395
1261 -1395 -833 413 -1593 1479 -2347 1616 -2412 2224 -1508 -1381 1482 -721 1788 -3005 2268
1276 2268 -1334 2225 -751 -1149 1980 -385 1878 -2516 3420 -1293 984 430 172 2074 -1497 1779
1292A779l533N584n242J273J292p88J355l606M474m707N280m135R77J205j608
1307d00J359l435N961n283K720k131J220J415k647J298k600N627n511K670j002
1322g39N48O96k667L164l212M521n208L156K89j028K14k085M224m133L766m220
1338b714K674P94j614P78j668M564n598M090k466J684J06j822K068j904M107n908
1354b829M012j032N53j10j507K745l074M429n473L706n71n45J8p45L477n099M047
1371B002l090K643r91q33M27n80L713n891M333k631K114j232n43J436k036L607
1387B448n312M287j768O61j502M18K703m177L450l985M158j836j52m01M88K019
1403A499m666M856l477K715k239P95N16p30J827m213M716k752J677j802O37J403
$$ plain form
1292 1779 -1754 3830 -1412 -139 1153 365 1720 -1886 2588 -2119 3161 -974 3 1208 -400
1307 -400 959 -2476 3485 -1798 922 -1209 11 1426 -1221 77 -2523 3104 -2407 263 -739
1322 -739 -191 505 -2162 1002 -2210 2311 -2897 259 548 -480 -266 -2351 1873 -2260 1506 -2714
1338 -2714 -40 754 -860 -82 -1750 2814 -2784 1306 -1160 524 630 -1192 876 -1028 3079 -2829
1354 -2829 1183 151 704 594 -913 1832 -1242 3187 -2286 1420 849 304 322 -423 3054 -2045 2002
1371 2002 -1088 1555 564 -269 158 -422 3291 -2600 1733 -898 1216 -16 -559 877 -1159 2448
1387 2448 -2864 1423 -345 316 -1186 -768 1935 -2242 1208 -2777 1381 -455 -607 -1008 -520 1499
1403 1499 -3167 1689 -1788 927 -1312 -517 -1 -731 1096 -3117 1599 -1153 524 -1278 -641 762
1419G62j533K313m504M970k859R42q34J235R78l393L828l305M012l591J478m92
1435GQ91P13l710M775l522K592k390J548o61k27J852m287N084k858R91j937K524
1452A385o54j834K664l252M534l696P77o34K044j083k216L921l876L249k870J937
1468C96r96Q62l44k282M500m032K548k486K531j056m16Q11k345M444l932J922
1484A25j879K910j475j281K816l011L404l736K840j504J533j163j095L461l714
1499a769L109k929K896j869J356n28j982M457l958K406k353L084k265J04J106
1514H65j673L467m440K847j120J991k738O38K055k909K897l145K665j819J802
1529A383j669k9K068l106K547k726L074k195J002m73p07K690l715K525j691K975
$$ plain form
1419 762 -771 1542 -2962 2008 -851 91 -743 492 1470 -1923 1905 -1400 2612 -979 499 7
1435 7 898 1611 -2099 2676 -846 1746 -644 904 243 16 1868 -2419 2665 -193 798 -1139 1385
1452 1385 731 -1103 1561 -1691 2843 -853 -76 -710 1334 251 -1965 1956 -1920 1329 -1541 396
1468 396 -600 262 -82 -2364 2136 -1896 652 -1834 697 -359 -775 36 -2309 2135 -1797 125
1484 125 -1754 1156 -319 -1600 1216 -1795 1609 -2127 713 -791 742 -421 -1516 1945 -1769
1499 -1769 1340 -1589 1307 -562 794 266 -1716 2741 -1217 1189 -1164 1920 -345 -241 865
1514 865 -808 2659 -1781 1066 -54 1937 -801 -163 1892 -1017 1880 -1265 1400 -419 1383
1529 1383 -286 -315 1753 -1353 1194 -1532 1542 -653 349 -124 -831 1859 -1856 669 -1022 1953
1545A953l909J451J392j909J845k714L012k618K718k866J108J234k562K471k198
1560a592K179k275K883l052J470K224l913K532j362K315l368K498p22r8J489l208
1576b000L452j898J602k497K567p76j139K073k646K913k268J988k453J427R62
1591A307j887J241j483L470l866K105j163J168J87k398K785j593J685l535L613
1606A636j172j078J493j856J659j592K653l502K657q72r13J657k131K771k579
1621a169K094k937L366j282k047K749j618J635l226L793k430R29k56r66K358k810
1637a817K554k633K865j878O18R34j756K097k015J940k951L630j405j166J493
1652E10q85J788l175L460k704J907j104M3J673j865J535k336L396l121J619k50
$$ plain form
1545 1953 -1956 -505 887 -1022 823 -1891 1121 -1497 1221 -1645 -537 697 -1865 606 -1592
1560 -1592 587 -1688 1195 -1857 -387 1837 -2076 456 -906 1409 -1959 539 -183 -281 1208 -2000
1576 -2000 1452 -446 1156 -1341 1226 450 -689 1384 -1262 1651 -617 1371 -1082 345 1307
1591 1307 -580 661 -822 2648 -1218 887 -276 892 1079 -1319 1466 -127 1558 -1977 1636
1606 1636 464 -614 879 -977 682 -910 1743 -1759 898 26 -887 770 -1361 1410 -1169
1621 -1169 925 -2012 1354 72 -1975 774 -844 791 -2435 1358 -1072 -143 -399 -1365 993 -1817
1637 -1817 737 -1896 969 -909 -291 643 -1113 984 -1031 909 -2042 1588 183 -983 510
1652 510 -375 1413 -1762 1698 -1006 901 -203 -160 1513 -352 1183 -1153 2243 -878 741 491
1668D91p71J274j248J350k656L538k139O20j57k35J119k213K269k159K818k776
1684h75Q54J038j404Q50j983L075l071K367j446L51R20j382J421k392L073k940
1700a544J774j068Q17O76j940J477j948L488l464J437M01k76K60j336K570l128
1716a804K972k408J376j8m77N50j425L321l538K739k120R45M71j113Q90j402K913
1733A872l190K184q92N55k90o38J787k165K833l461K514p38m08P13r38K121k984
1750a125K883k647J547k09l15L24j210K613l496K992k005J163l60p52J009j351
1766i39K459l634L109j605N43m90k5J227k177K907l062K228j145K99k71k99J954
1783A079k898K772k419J903r37RL03l74J926l627L547k057J192j206R49M22j644
$$ plain form
1668 491 -280 994 -254 1096 -1560 1978 -161 459 302 67 1186 -1027 1242 -917 1901 -875
1684 -875 -21 1017 -387 463 -1520 1555 -1516 851 -595 -244 676 -706 715 -1677 1396 -1544
1700 -1544 230 -838 -21 655 -1285 192 -1756 1732 -1732 -295 106 -170 90 -1246 1324 -1804
1716 -1804 1168 -1240 136 118 -359 191 -1234 2087 -1451 1288 -832 113 584 -529 361 -1041 1872
1733 1872 -1318 866 -26 529 239 -399 1388 -777 2056 -1405 1109 371 -37 676 -262 1859 -1125
1750 -1125 1758 -889 658 449 134 458 -752 1861 -1635 1357 -648 515 155 -597 412 -939
1766 -939 1520 -2114 995 -610 -67 -557 -582 645 -1532 1375 -1687 541 -604 -305 -576 -875 1079
1783 1079 -1819 953 -1466 437 -500 -491 -188 -562 1364 -2263 1284 -773 419 -787 162 584 -1060
1800a060K015k973L223j626P27q75O39O27j893K598k774K590j602P93j76L9O93
1817I65k361K990k264J747j362O72p2m92J654k834K936k402J407q46P82q3j079
1834f42J900k639L026k327R25q19J189l21j794K642k497K347j840Q14o29R48M3
1851C26j835K710k783K143j393J292r62J16Q51k147L142k631J378r77J238r05
1867d37l58J543k329K745k347J675q63R02o22q76K376k583K206j902J943j527
1883d54R71j93j400K499k421J915j422J590j430M10R83j973K190k070J774j535
1899e66J928j653KJ753k260K058k008J861j618J461r83l96J478k140K253j916
1915g46J988k449J523l43q42J917k195J702j622J977k079J029L00j251J942k192
$$ plain form
1800 -1060 955 -2018 1205 -421 306 -569 70 697 -1196 1402 -1372 1218 -384 409 233 272 965
1817 965 -1396 1594 -670 1077 -285 387 315 -177 1477 -1357 1579 -823 584 -262 520 437 -642
1834 -642 1258 -1381 1645 -682 243 -576 613 292 -1502 1140 -1357 990 -850 -36 -665 283 326
1851 326 -1509 1201 -1582 561 -832 460 -502 -386 465 -1682 1460 -1171 207 -770 468 -437
1867 -437 -795 748 -1581 1164 -1183 492 -371 531 -91 -967 1409 -1174 1032 -870 1073 -454
1883 -454 517 324 -1076 1423 -998 917 -505 1085 -345 65 1048 -925 1265 -805 969 -566
1899 -566 1362 -291 -289 1464 -796 1262 -746 1115 -503 958 -25 -421 1057 -1083 1170 -746
1915 -746 1242 -1207 316 -27 -869 1048 -1147 555 -1067 910 -1169 -140 160 -1091 851 -1341
1931a341K132j774J616j839R28Q47k073K041j574J620j992K120j452L33J104j753
1947a057J901j745J855k077J677o41k64J174j927K021j504J726k313J875l20p18
1963c37J259j685J983k090K063j874J259J88j373J495j531J835j947J895j641
1978e01O56P51j682J644j501J941k206J877j054l18J185j457J541j969J810j766
1994a049J628o47q16J378j472J769j907J772j766J452m26p68J405j535J716k044
2010a310K221j920Q81N2o46J701k081K051k425K592j556J87L27r94J425j427J946
2027A024k067J741p84k06P41q17J127j759K549k257J449n29j250J883q59P57j835
2044a092K269k153J573o41k31R55q14J280k248K531k185J100k9o35P86j323J954
$$ plain form
1931 -1341 791 -983 633 -1206 -278 569 -1504 537 -1037 583 -1409 711 -741 -408 696 -1057
1947 -1057 844 -901 954 -1123 554 -87 -351 823 -1104 917 -587 1139 -1174 701 381 -337
1963 -337 922 -763 1220 -870 1193 -681 578 766 -607 888 -643 1192 -755 1140 -501
1978 -501 155 906 -776 868 -633 1308 -898 979 -75 -393 792 -665 876 -1093 717 -1049
1994 -1049 579 -68 -884 494 -978 791 -1116 656 -1110 342 -84 -852 553 -982 734 -1310
2010 -1310 911 -1009 -128 -76 -722 979 -1102 949 -1476 1116 -440 -253 74 -920 505 -922 1024
2027 1024 -1043 698 -86 -292 449 -368 759 -1000 1549 -708 741 212 -1038 845 -14 743 -1092
2044 -1092 1177 -976 597 -44 -275 680 -134 1146 -1102 1429 -756 344 315 -320 466 -857 1097
2061A097j988K040j515N55O83j754J650j715J760k460K038p40o7N51p92J416k059
2078a300K375k032J182n71j69J032j497J231j495K344j874R75j79m92Q03j037
2094g04J318k201K243j766J250L46n88K78r51K125k450K098j019P22k98j181J052
2111B74j062J900k421J898j04j56l3p32J547j459J572j880J297r68M70o7q55J886
2129A107j834J824j909J103k17k0M09j242J588k104K071j137Q17n09o9M65o93
2146c50J462k587K195j493L44J22l81J513j434J482j879J902j088r7j46o57J956
2163H64k551K435j458J006o46K20L64j013J165j824K513j907J371n63N41j46q05
2180d34J864k063J292n68O49j054L05N03j367J490j299J803j062O73k54p18Q07
$$ plain form
2061 1097 -891 1149 -366 189 872 -882 768 -947 813 -1647 391 -349 -416 135 -657 759 -1300
2078 -1300 1075 -957 225 -346 -515 517 -980 251 -1244 1100 -774 201 22 -470 333 -704
2094 -704 614 -1587 656 -1110 140 486 -102 176 -775 1350 -1100 998 -21 701 403 -778 274
2111 274 -788 1112 -1309 589 485 329 296 -436 1111 -348 1224 -656 641 -327 143 76 -779 1107
2129 1107 -727 1097 -812 291 74 54 463 -779 809 -1295 776 -361 456 -53 -122 343 -350
2146 -350 1112 -1475 720 -773 -429 -307 -688 825 -609 873 -1006 896 -192 -289 -435 -1092 864
2163 864 -1687 748 -710 296 -350 -130 234 -779 386 -1438 1075 -832 539 -24 517 371 -434
2180 -434 1430 -633 659 91 740 -314 -9 494 -873 617 -682 1121 59 732 478 -240 567
2197E67j839K659k069J284j47j62n37o3J607k318K396k024Q27l32K39r6q18J582
2215G56j755J257m75km18L58N09j361K242j819J179r92R77j237M34L98r09K041
2233A183k719J987n87O31r92l21J458j904J939j676J468j041M59j62p61J706k011
2250a343J868j234J225r83Q00k95o68K065k141J079r25J155o90q4Q17j854K569
2267A361k210J782j197R05q68l21J201j173J085j595J423l86P82l29r04J942j944
2284d46M61j136J231m65N14L56j142J381o43L17j234J925j232P1m57P8O74j133
2302h80J632j152J162j536R26j48q61J624j921J382j196R74r08O46N61p52N53
2319A06p06J162j154J127p66k09R89j330J169j060J585j983K044q04k86j75q41
$$ plain form
2197 567 -1272 1387 -682 602 455 293 -244 -307 1300 -1018 1378 -646 181 -151 88 -8 -826 756
2215 756 -999 258 -217 -219 -637 -279 230 -1131 1111 -708 471 -521 456 -781 -347 51 -858 1183
2233 1183 -1536 451 -136 495 -497 -818 640 -1264 675 -1001 467 -574 -115 -277 -1038 668 -1343
2250 -1343 525 -709 516 -467 333 38 -630 1435 -706 373 -552 603 -87 -171 646 -1208 1361
2267 1361 -849 933 -264 641 -227 -548 653 -520 565 -1030 393 7 789 460 -444 1498 -446
2284 -446 15 -1121 110 -355 159 515 -627 754 111 428 -806 1119 -113 -42 -499 -421 253 -880
2302 -880 752 -400 762 -774 152 4 -857 767 -1154 228 -968 6 -902 -256 305 -447 106
2319 106 -600 562 -592 535 -231 -440 549 -781 388 -672 913 -1070 974 170 -116 -291 -1132
2336a132J795r30N36j364Q77J35k05M63q83J042j219R68l84R53j8k382K385j290
2354f53Q15o41K23P12o01J558k023J331k134J393j253J667n22j33O04j654J357
2371D6j199J332p96J148j42l16L91j393J722j787R97l83M03j021k19R11l12R36
2389C18j399J376r67J42P21j197J597j012M45j119J404j04n19P70r92J623k199
2406a112Q90o56J379j261N75M02J1N50j414J396j244J114m55j04K76m37O38p31
2424a83J262j512J255n59m69N00p45J240j158J520j267J30K70n14J233j508J015
2441E10r08O39j015N90M18k93M00n29J643j928N40p03J88M40m18M81p43J914k129
2460i03J160j78m27L15j057J418j025J203j119N68J12o38N01o67Q75j046J516
$$ plain form
2336 -1132 663 -267 269 -1095 -218 -83 -288 175 -708 334 -885 83 -301 652 634 -1748 637 -653
2354 -653 162 -479 -256 456 -145 1413 -610 721 -1413 -20 -1273 394 -128 -261 343 -1311 46
2371 46 -1153 179 -617 531 389 73 464 -929 793 -994 3 -380 23 -998 -1217 -306 -618 318
2389 318 -1081 295 -672 -530 191 -1006 591 -421 24 -1095 309 205 -314 456 -536 1087 -1112
2406 -1112 -222 -878 501 -760 -185 217 228 778 -636 760 -484 630 175 71 347 -90 548 -183
2424 -183 1079 -433 822 263 -206 294 -451 789 -369 1151 -116 14 284 -230 1003 -505 510
2441 510 -398 241 -774 -184 234 -59 341 -188 1455 -473 67 -636 -448 -8 -426 55 -688 1226 -903
2460 -903 257 79 -348 -33 -1090 328 -697 506 -613 -45 67 -571 -70 -737 138 -908 608
2477F08j215J182k00n56O44j247J723j631J278n85L3j76L7M51r36J749j715P10
2495A54J99k0l27%P69j770J539r00J032k87O4l75p4O43j608J725p62K52k75r8
2515a19O53q67J284j168J046j069K60L18m03P25j080J286j789J420m67K20l76
2532a26L3Q34j099O91j297J591p95JN4j81R66j277J067j046O90j0k3mj01N77j365
2553h20J112m18K25m38J09O26j157J141o55J182r66J30K00l49L26j262J606r27
2571c35Q21l35J06j62Q9K85q92J154j157O98l83L08O5k48K35q75J363j048N69
2590B58k82l5M47o70J010j326J025r42O03p9l1L37o06Q36j317J214q09L43p2l44
2610d40N32o21Q02q29O48m61K82j36k60M59o59J411j114q2k9P95l79l40R75p60
$$ plain form
2477 608 -607 575 375 -181 463 -784 939 -692 586 1 34 -142 -105 346 -590 1159 -556 154
2495 154 353 333 6 6 775 -995 544 -356 676 389 453 78 4 647 -961 764 2 254 -21 -119
2515 -119 534 -333 951 -217 829 -240 20 338 -65 660 -420 866 -923 497 30 250 -126
2532 -126 -93 741 -358 333 -964 627 -168 -167 -113 -294 672 -605 462 -584 106 96 73 69 -32 545 -820
2553 -820 292 -126 99 -339 -230 396 -761 380 -275 907 -59 71 271 -78 248 -1014 592 -335
2571 -335 486 151 257 95 184 469 -423 731 -426 272 -111 197 262 14 249 -626 737 -311 258
2590 258 -24 -59 388 -282 728 -598 427 -515 88 9 -22 315 -291 545 -772 442 -367 -24 -96 -440
2610 -440 92 -529 273 -556 92 -369 -87 -223 -483 -24 -683 728 -386 -468 -497 298 -81 -421 554 -206
2630b06L22m14N02m58O22p64N36J55m20O15o29j8J11N92j205N25L08j2K28J77
2650E67o00l95P25J42j013J501j421R77m56K92p4n83J066r53P38j408P50j36Q47
2669E66p13J6R54j254N97o99J284j006K60m2l53Q66j084J221r22J81l69K08L57
2688F8o74J062q83O10o37O43l74l9M20m78N41n93M79n39O27l92J10L70p94Q19
2708C46p34Q31r34N97j24l26O26p94P41n14Q45o70J69K24l39N47o44N60l68L79
2728D18o66O41k7o23N01l01L70o83P26n94O36k28m02P08o40O92j042P17j7n38
2748c52N88n73O64o21N81p81Q55m56k93N52l59M60p41N26k54L04j33m72Q75o08
2768b38M52n76P74q24M61J84o99M90m09Q29r09Q83m73r5M66m76M43n96O34q11
$$ plain form
2630 -206 116 -298 204 -254 368 -396 140 295 -125 490 -139 -157 -46 546 -659 -134 174 162 390 567
2650 567 -33 -428 297 439 -574 927 -494 483 27 319 245 -338 728 -225 513 -895 -145 -281 566
2669 566 -147 -131 823 -431 166 -533 751 -255 5 -37 -390 476 -608 613 -309 -128 -497 -289 68
2688 68 -606 456 -427 183 -454 189 -185 -224 196 -282 259 -334 145 -394 233 -159 -49 321 -473 346
2708 346 -388 443 -491 106 -18 -344 282 -512 229 -285 560 -110 59 283 -56 491 -153 407 39 418
2728 418 -248 393 366 -257 244 -57 313 -370 356 -238 398 170 -232 476 -164 528 -514 203 186 -352
2748 -352 236 -337 327 -294 287 -494 361 -95 -388 164 -195 265 -476 50 -204 100 -33 -505 370 -238
2768 -238 214 -362 412 -412 49 233 -466 24 -385 444 -465 418 -55 -150 316 -160 283 -313 321 -490
2788d90R39n53M7L47m53M85o75R71r16O41k47j64L81m59L66l68P71r65N10j56
2808A2n35Q12n41N66m72N34p17M73M9k46J77l47P33r06P62m59O0K07n11M68l67
2829b48P49q74P38l77l44N29k74K90m14O97q18L70Qo9ok41O47o89P54r17N51j51
2851h9L6o7m6M64q82P98l73K97Q2k50L66n99P68o93L89l52K94J0m12O87n52Q64
2873G40r82M99k62J52j31o5M15n20K45k38M84r4l05J30k02M89p58Q70n06J14l76
2894c01L49j9k21M74p16P83n75J25L3R3m5j06M95o76O03m48j95K80k0K23m15O81
2916D02n82L55m92K28J14k62K01m06P70n99L63l53L11k7j10N76j030P86n41L89
2936I3l24K33J64l95N96o21P70p74K30j67M47ko25R15q60Q11o61L74j14l5K89
$$ plain form
2788 -490 449 -104 -57 290 -163 322 -353 618 -298 343 96 -68 313 -146 220 -148 623 -342 168 12
2808 12 -523 289 -252 314 -158 376 -341 132 181 -65 112 -235 498 -408 354 -105 -45 162 -349 119 -248
2829 -248 501 -373 365 -12 -356 173 -101 189 -225 472 -346 24 32 -37 -43 -284 363 -326 428 -489 62 -89
2851 -89 -53 -120 -166 298 -584 214 -159 138 220 -30 336 -263 505 -188 201 -151 143 153 -259 428 -124 740
2873 740 -242 257 -5 147 16 -49 366 -154 91 -147 337 243 -62 68 -134 355 -403 467 -39 75 -301
2894 -301 48 29 -192 282 -434 349 -226 -101 -68 25 -20 -126 369 -307 296 -152 -347 -67 -87 136 -279 402
2916 402 -180 175 -317 -89 25 -237 -36 -442 328 -271 92 -261 50 23 -87 489 -541 245 -296 93
2936 93 -231 2 166 -229 367 -254 516 -258 -28 -195 252 250 -375 540 -320 491 -170 204 90 55 344
2957C44o23Q40o59M49n56M07j98j42N60q58M98l74K16j07L69o7l04M16l48O28
2977D91o68K56l62M67J89p06O08o14M11l63L12k04JJ51j91O45o32N04m90J45o6
2998a16Q2l5l28O66n97N33l74J38j3j46O02p08O52o30M41l14K8P3j88O95p03Q74
3020F32r04K40J74k15O9K65pl23J53k54M41r1j28K71l4L17r08N39k65K04l20J26
3042a8J82m89N71o83J204j410O82j04K46k7l99N86m78k82lQ42j39j68J47p06J68
3063b78J43O1k90R71n79K02O49j052K17m66J009j404Q02K64o26J116j147O48j66
3082G4O78r48O74l51p77Q78j14M56n07L22N2k34L56m59J32j322J544n92M93m31
3102g6k08P26o04M41l04Q40q43O63q49J97L55l12P18j067Q2j25K92j41J44N08
$$ plain form
2957 344 -279 561 -98 351 -205 202 4 -138 422 -436 62 -312 -96 -203 166 99 -205 211 -137 491
2977 491 -177 79 -283 184 373 -333 275 -339 72 -291 21 -183 -182 -31 -222 423 -209 295 -195 -50 -116
2998 -116 -34 -69 -397 269 -328 205 -169 -31 -44 -190 412 -296 356 -274 167 -147 -119 -46 -234 461 -242 632
3020 632 -272 -32 142 -73 -4 261 254 -69 84 -170 271 180 52 323 289 606 -302 237 -28 176 -144 -18
3042 -18 164 -325 246 -437 767 -643 39 -65 181 154 -245 341 -137 -419 -422 420 281 113 260 -446 -278
3063 -278 -135 -74 -364 607 28 230 879 -173 44 -422 587 -817 -15 249 -377 739 -408 240 74
3082 74 752 -196 478 127 -650 228 114 570 63 385 437 203 559 100 232 -1090 454 -138 355 -76
3102 -76 -284 442 -162 279 -25 815 -28 635 -214 -17 338 26 744 -323 -241 -366 -74 -215 -71 437
3122D37o72Q42n86k4m00P05N89q38J08l46P69r30O75j69j02P5n45L8J83K08k13
3143a96J38n17Q91r9o63Q11p85O60l34M06j94n07P34m70L96q95R24p15N41p0j70
3164a14R2j54O48q91O47q0j28Q5p4k3j80M63n17M06j54j05K07k53M42l67J83l60
3186b27K02R7K44j08l13M15m99M90p65K15L63k28M76p55O50l97N27l28k40J77
3206dj61K38n55M33j06L06l94R4M6j2L35m27N06n14J48n6K55j49j49M09n15N44
3228B72m43K18k47Q6K76l83L80o56R40o54Q7P8J58k4k56M38n01N46o32N26k17
3249hn3K77l79L99m74M63m42J08L80j53K42m13J62j58J81r5k51K62q9L26m34L40
3271A91l66L81j32J27k28n6L26n21M70l68K22j77j7J93j09M00p56O01k13qQ2n4
$$ plain form
3122 437 -235 607 21 -3 -403 302 891 53 161 -185 584 -346 329 160 58 133 -412 -374 -191 17 -196
3143 -196 -58 -575 316 217 -446 365 -420 240 -94 312 118 -389 345 -125 271 -624 300 -415 126 56 -114
3164 -114 -22 -176 472 -419 228 148 20 105 31 8 -172 291 -226 180 26 -79 128 -125 317 -50 133 -227
3186 -227 -25 72 316 208 -105 310 -189 301 -464 -249 114 -114 362 -393 257 -140 387 59 -181 -4
3206 -4 -165 73 -482 -49 -155 151 -243 -149 -103 -115 220 -207 299 -215 -67 -123 132 -17 -166 243 -272 272
3228 272 -171 47 -200 -114 162 -221 159 -497 443 -211 -124 -46 112 88 -168 270 -231 315 -317 209 -8
3249 -8 -61 216 -163 236 -238 225 -217 -109 271 118 360 -53 109 -49 132 37 -214 48 -41 285 -149 191
3271 191 -175 206 74 201 -27 -83 243 -278 192 -176 46 -131 -148 45 -64 336 -420 181 -32 -40 42 -12
3293a2N2l34M20m99O91m35J29K7L0J21n81P98n08L01k37L82j78j37J69l11O23
3314E11n99J25j43J77m4q1R4n4M43m93K52k04K78q5L2L2l40J64P1n9kj8m4k72
3338b59L19j25L23j77n4m8OR5k03J06k64O46n17K92k04q5K68n03P14l06J21l02
3360a57K67m9k89K18l67M5K23Mj61J97j82j25O61k80j25J04N9j10j12P15n79K10
3382A67l13L74l70O29n70L01k38l10N02k65K26k73K39l14J58L87j78p0K87n65
3402a96K44J68l51j37N74p88K44p8J77j3L48J01n06L90k47K64k52L86m63L26K26
3423D17p34P42p28K90p01N86M46o62Q44m17j70k21L62l16J73nK82J61n19N02l91
3444e9K65n12L01n5J6J7j60P94o85L50m45L64j73j31M53k13m9J32j07K94m13M8
$$ plain form
3293 -12 40 -294 126 -373 318 -117 12 39 69 190 -391 407 -101 200 -37 345 167 30 199 -112 511
3314 511 -88 37 -106 71 27 -54 40 -14 429 -64 188 -16 262 177 209 241 -99 65 136 77 75 57 13 -259
3338 -259 60 -65 258 81 27 -21 -15 80 -123 -17 -281 365 -152 140 -64 -149 119 -384 330 24 145 -157
3360 -157 110 61 -228 -10 -377 -332 -109 -105 -266 -69 -251 -376 285 5 -120 -16 43 -67 -179 536 -43 167
3382 167 -146 228 -142 487 -83 218 -20 -330 172 -93 133 -140 99 -215 -57 330 152 82 369 -196
3402 -196 48 216 -135 -272 302 -486 -242 -320 -143 -156 192 293 -213 177 -70 194 -58 328 -135 191 417
3423 417 -317 425 -303 -13 -714 -128 318 -344 500 83 -87 -308 54 -262 -89 -94 188 349 -170 332 -59
3444 -59 206 -306 -5 -60 -44 -27 -187 607 -78 272 -173 191 18 -113 340 127 78 210 103 397 -16 32
3466C2j30J20%K48m83N19n40L56K15n20M82j95O1m47K23k3J09Q5j40J22l74L52
3488G2p3J60k14p5L23j19l2k23N06l77J37j69J04m8r0J20j59J52k20L76m73L27
3510Ek12Q5K34j59j83p5L63p8k6k61Q5L01l01J14j4J10J32k44L65o06N48k26R2
3533D9Q8j51N0k64J88n1J38m19N31r2o8p2m2J19j40J94p1J26N1k10K98l13k0k03
3557b84K73k12K98O2l98K98k53N39m71J58L5J38l09k9L44k06J28k18K63k38J06
3578B4M8j92K80k08J05k90J65P5R6n6r0pM1Pj90L45k86J8K00k72M16m54K84l03
3602b44J98j7J73j71j36N34m58L32l44O6J09M5Kk71M67j73O9k37Q9j69k2K44j96
3625a10K71l34K07r0J34M8k01QK6K05k38L90k31m0m4M8L2r2J78m19L03k02J13
$$ plain form
3466 32 -98 22 22 270 -213 306 -234 122 337 -183 299 104 165 -282 -59 -82 27 112 -28 94 -280 72
3488 72 -1 159 -55 -130 193 74 42 -181 325 -52 85 -84 20 -28 -118 2 -157 -5 -225 151 -322 5
3510 5 -207 -122 112 -47 -230 -305 58 -20 -46 -307 -222 79 -222 -108 -122 -12 120 -124 241 -365 183 -43 49
3533 49 137 -14 36 -228 -40 -91 47 -372 159 67 -1 -73 -115 4 -136 58 -13 113 164 -46 252 -61 -81 -284
3557 -284 -11 -223 75 137 -261 37 -216 323 -148 10 45 183 -126 -155 189 -17 111 -107 156 -82 24
3578 24 72 -120 160 -48 57 -233 -68 7 103 47 -43 -50 -9 -2 -192 153 -133 -115 85 -187 229 -225 59 -244
3602 -244 -46 -63 110 -61 -197 337 -121 211 -133 -67 42 87 89 -182 285 112 181 -56 33 -136 -158 86 -110
3625 -110 161 -173 34 -56 78 126 -75 -67 -41 164 -74 316 85 45 1 49 81 -11 167 -252 51 -151 -38
3648c8K4k71L19j45K83l80J81L7k8N1m82M82j78M43m98L05j79k9J23rJ69n58L30
3671d8r5J7M1p5M5K26k93J02j6Q7P4J97l66K86l79M28k04j5N6j14N4k20M40l57
3695a29K23l99N48j01J4j98j48K60k35J71j04J32j11K76j72k75L28q6oR2Q7pl12
3718a52L63m12L13m61L62k70K59q5L2L42o69N41m31L63k8j40P7k65K83M7k02L9
3740i4M1P5N3rm27O46n21M57l13O7M9OJ05m17J86j71N53k91R3J61m66K63r0J0
3764c4J09%N5l24J06j9J58j88J91k49M65o15K87R8j82L09l69K34P8oq9j02K14
3787A27k70J23r0L38l81O9L03m23K34l83L95oJ45l71J85j01M1J55m81M63m00M29
3809A01k54J96o4J21j39J32J41l61K60j99Q8k76L12j70O4J02j07J95k37J12kp2
$$ plain form
3648 -38 -14 -285 34 -111 172 -208 -27 10 -18 33 -449 33 -145 298 -200 105 -74 -103 20 11 180 -378 -48
3671 -48 -143 -126 -85 -160 -115 111 -182 -80 -96 -9 65 262 -104 182 -197 231 27 12 68 -46 8 -212 228 -129
3695 -129 94 -305 243 142 156 -42 -190 70 -165 6 -98 34 -77 199 27 -248 80 -6 -12 80 167 160 -152
3718 -152 211 -201 112 -349 13 -257 2 -83 -51 291 -378 163 -268 95 67 -73 4 -261 22 69 -133 -94
3740 -94 -53 22 75 66 -361 285 -236 221 -92 -25 24 30 135 -282 -96 -267 286 -5 88 249 -217 46 -44 -34
3764 -34 75 75 130 -194 -88 -107 51 -137 54 -195 270 -345 -58 40 -142 167 -202 32 110 104 15 -87 127
3787 127 -143 -20 -110 228 -153 -84 219 -204 30 -353 42 36 181 -190 -5 -106 -65 90 -391 72 -328 101
3809 101 -153 43 -21 100 -39 93 234 -127 133 -66 22 -254 58 -112 -48 54 -53 142 -95 17 15 -57
3831e7J33j37P0j17J99k17J68K49k13K36m23L59n06M51j69L4J32k56K11k88M08
3852B67m30L19l13j70M47k30K88k45K08n2l2L2l4k8k85L35r1K37l34K66R5j98
3874E2N6n0J6j72J19j43K01j84K17P3k76J96k25j24O8L72j86O8j17k08L64J0O7
3897A94j63j91r8J97J86l7ml5K17k54N6j77l6K72k82K37l34K82p5L7K99l84K45
3920A52l28J54r9J02m1J24mj80L49k07M7j25j52J57k16K31M9n8n9N1R8n3l8J67
3944A21l6k77J42J9J79k19k0J56q2O0J8J47l47j0k9K0K04kQ9l98K64NK03j49p8
3969b0J25k59J20K4J16j62K20l81J91j21J3L35k24K62m04L68j4n0J37m69L85l65
3991a73K20O7K36k71j03N9r9L64k46j5r7N8l71K42j1mL04l97J45r7L08ml77L55
$$ plain form
3831 -57 76 -61 9 -108 91 -126 42 291 78 314 -109 250 -256 195 26 60 192 -64 147 -141 267
3852 267 -163 156 -157 -327 120 -110 178 -67 141 89 57 89 55 27 -258 77 -14 223 -111 155 250 52
3874 52 108 58 74 -98 21 -122 79 -105 112 185 -91 105 -120 -244 -176 196 10 78 -39 -247 117 127 194
3897 194 31 -160 -258 -61 125 88 84 49 266 12 68 -109 -145 127 -155 82 -252 30 -45 -8 291 -93 152
3920 152 -176 -22 -121 -19 -60 64 60 -120 229 22 69 -56 -208 -51 -267 -36 13 -45 -104 -53 45 -8 -46 121
3944 121 85 -192 -50 -31 148 -71 -91 65 -17 43 61 208 -139 -149 -178 -158 46 44 133 -265 -1 4 207 58 -20
3969 -20 105 -154 -34 -10 106 -56 164 -217 -26 -147 -134 201 -23 239 -165 203 189 139 276 -193 192 -173
3991 -173 47 114 350 79 -24 35 -64 300 54 39 -58 0 -371 -129 -140 -144 160 -237 -92 -189 119 115 -262 93
4015I3L8m08J12L69m19Q9j45J52K41j52M50m37j7k8On26M10L91jl21j76l6P8j14
4039c51O38l76L46n94N09k31L42j67k31J78j24L4L88J93p86O16l00p1l14J1K05
4060h5M1R6k74k9P29m08P7L55k21n87O03p2k88M23L16l88j64j28K89L43q49J44
4082g7J96r0k77J15j31O22j68p4l46N56m21O70j92j91O3k57J18m14Q16n48K66
4103B36k14K63l68pN99k59j66n63N98l21J37L69n25L04m96K81K06nk0l14K02k89
4125c52O24k64K84o54J61n4L23j34j07L80p5K55o29M81k24K47L1k46K07O8R5q79
4147d62M41J24j50N68n98J16R7K9J45l73J02o05Q04j67O5l08K79ok52j55K86o5
4169h5L72l98L8m1J32J77k11k83L40n30O26l64K59q0K73k5j24O6j36J96j76k67
$$ plain form
4015 93 131 -277 -165 204 -215 -126 -271 -119 122 -30 420 -17 -34 -62 -56 -582 -172 219 218 -103 -279 -315 -237 -351
4039 -351 287 -89 257 -337 172 -59 283 116 -115 63 -61 -27 361 554 -232 384 84 13 -301 -290 -85
4060 -85 -44 52 -222 -251 478 70 147 502 281 -306 297 225 -63 360 676 288 124 -4 285 628 -221 -77
4082 -77 119 29 -248 -133 -264 358 190 116 -230 326 -95 575 383 192 255 -2 116 -298 518 -30 236
4103 236 22 285 -83 -90 509 250 84 -479 119 -202 -65 304 -221 83 -413 -132 74 69 49 -265 -63 -352
4125 -352 272 8 292 -362 -201 -255 68 -66 -173 207 132 387 -242 239 15 262 293 47 254 322 417 -462
4147 -462 -21 103 -47 521 -77 39 136 165 310 -63 39 -566 238 71 136 -172 107 101 -151 -306 -20 -85
4169 -85 287 -111 -73 -114 18 195 -16 -299 41 -489 137 -227 32 -48 225 200 76 142 6 202 26 -241
4191b41J46J66k5J08m23K91j8k75L57m25K49L72m71M21n7q5K3Q1k07R8k9K12k80
4214a2Q9Q2k68L26m07K03J97j63J81m60K22J10j5L0l6J48k16N6j61K14l8k13K92
4237A61j11l15J9K47J37J39l86l9J65k82L42j82L76m36o1K35j40J56N4j18k34
4258b73M61m20N10l51K29Oj55K31k86mJ6n8K05l04k41L93J22j31M8j63K13K7j33
4281e8k8j1j39K85J7j31nJ91l62J67R1J47j11Q8j03k04J83l28M63r7J56j8p6k11
4305i4K95j19l64L77k55M67k35q7kj19M35n49K23j84M38l67k63M16j35L75k54
4326aP3l2r1o5K33l08M87k78r6K84l43J07k94N48l85J58jJ7lj17J89k74R9K57
4350A64l57K17j02K85k89O5p0K02k5l75L87k72L71k75K25q0l16M37l07J0l1J96
$$ plain form
4191 -241 -95 71 46 154 -269 22 4 -271 86 -339 -90 282 -189 232 175 90 113 194 -13 85 56 268 -12
4214 -12 77 159 -109 217 -190 13 210 47 228 -232 -10 100 85 115 79 227 11 67 -94 120 82 -131 161
4237 161 50 -265 -246 1 138 277 -109 -148 17 -265 77 -105 271 -165 -226 9 -131 25 79 -39 -273
4258 -273 188 -232 278 -73 156 162 7 238 -48 -52 -36 -94 111 -193 -434 -41 81 -50 -2 -165 48 75 -58
4281 -58 -86 -97 -236 49 66 -65 -70 121 -241 -74 17 164 53 141 38 -166 17 -311 152 55 211 193 117 -94
4305 -94 201 82 -282 95 -160 307 72 -15 -17 -136 299 -250 -27 -211 227 -140 -403 13 -122 253 -1
4326 -1 72 40 -51 -116 117 -191 296 18 -78 206 -137 -30 -324 224 -161 -3 -4 13 10 -107 82 -192 -93 164
4350 164 -193 24 -78 207 -82 -17 -87 115 90 -285 102 -170 201 -74 151 71 -245 192 -115 -105 -136 60
4372F0j35J73j14J9j6J11J8j60K34k32L41k04k10l0l7L16l64L96k28J46K7j20
4394iJ14j57K33k22J80n4j11m9L3j37J1J62K6J42k69L86k99l9J67j99Q9j3j5n6
4418h6L8J87j27P2l34M27j81k89N74j39J71l65L07q5N9n8r2k55o8M02k57K74o06
4441d31L67K72J16l3n91j48n6J077r56N68m78M50l49q8Q57m24m70O28m81O83r89
4462d76K53J4K14L57m7r07N37j99L01J14k38K3k13Q8J05M51q14K10R5M34K42p76
4484b32M42j31J90K61p54M17n97P21k95n32O52J92k94M51k1l4N24j828R90L47
4504D69k53k93J08k39N09m72j74M86O1r09L95Q05l08k49m28L74N35l69j08L77
4524C17r48J155j251L35J21L64k1o12O53Nj59m0K38l12L12o22N89M7l12J0m07
$$ plain form
4372 60 -75 98 -16 3 -13 98 116 -44 190 -42 299 95 -115 -145 -182 134 -230 166 -62 84 111 -9
4394 -9 105 -52 181 -41 139 85 -26 -75 -42 -179 -168 -6 20 162 -107 279 -20 -59 108 -91 -2 -15 -30 -86
4418 -86 -48 139 12 84 -250 177 -4 -293 281 142 313 -52 255 170 229 171 79 -176 -244 158 -99 175 -431
4441 -431 -64 208 324 291 -300 -448 -504 573 -383 185 -293 157 -192 -280 577 153 -317 311 -170 513 -476
4462 -476 -223 -209 5 362 315 -592 -55 -254 47 161 -77 -54 -267 -179 -74 377 -437 -227 -132 302 544 -232
4484 -232 210 79 269 530 -224 193 -404 317 22 -510 142 334 40 491 470 436 960 -868 122 469
4504 469 216 -77 31 -208 301 -171 -345 141 202 -707 -312 493 185 -64 -492 -118 417 48 -60 317
4524 317 -631 524 -727 -392 -271 93 72 -540 113 118 -41 -81 157 -155 157 -465 124 171 -141 -131 -538
4545e38J037k65J64l79j18O40j23m0l08M30m46l13N41m01K77J30m54K51O45j098
4565c68M37J72p75M63l35L88p69N39j18J90j5J35M0K37j73k0j37K3J25q1J84j17
4587B5l5m9O6j99m4L2L11l09M25n0q6k61L90j00q0J28k96L48l56J51P0J20k16
4610a5J66r0k97L64O7k76J74K6J75l88O4Q0Q0K0j30l98O83m59J4M20n29K10J46
4633A07N1n06L02J1l74R95p92L13Q9k53K06m25M26l93K62L79K17o54l77M12J8
4654A4j0m13L60k34P59m62J7O67j305N28L63l23M77m05J15l44O8J65q8o0j5j90
4676c16N98R7K36r00L06k6l42R7K8J44p64P44q6L68k16J7N02n20P02j64j67j21
4698B17l9l55L96M06q38K07K78o41J68K77m07J97K85p25J034nm05k33L08J78L4
$$ plain form
4545 -538 499 234 398 19 -99 541 418 378 70 500 54 -259 282 -119 158 288 -166 85 730 -368
4565 -368 69 241 -534 -71 -406 -18 -787 -248 -366 -176 -191 -56 -16 221 48 28 -109 -86 39 -42 142 25
4587 25 -10 -59 7 -192 -236 -204 107 -202 223 173 87 -174 216 116 36 164 -132 216 -140 11 81 201 -15
4610 -15 151 61 -236 128 195 -81 93 119 294 -94 -30 50 130 150 20 -378 305 -154 -140 280 -249 -39 107
4633 107 158 -348 -46 -35 -409 586 -206 107 196 -57 149 -276 150 -243 19 398 615 -39 -416 -4 14
4654 14 4 -409 -49 -283 476 14 31 698 -607 -79 284 -39 438 33 148 -196 -128 37 -51 -111 -126 -316
4676 -316 282 379 615 -285 21 -5 -347 -250 -222 -78 -842 -98 -184 184 -32 -15 487 -33 669 505 338 217
4698 217 178 -177 219 625 -213 -6 272 -369 -201 76 -331 -134 151 -574 460 455 50 -183 125 303 337
4719C37J59p39J31K68l10K6J7O8K4p9R7J79K3j42j4k27N21J04k28M3n88R8N25
4742B93n73K05J33p5K59n31P28j53j63r2j8p85J304l86L5J34J9o40O0K70J29N23
4764F76K07l00p24J99m2l3m4J66k86L79M7m96K55p2l60J38M57K7m60O6L7O24l11
4787A50j03p2j7K05n42N80k64k82N27l3l88L25%m72L98P8j25j19M30j17K8j66
4809B1P4p3P8k38K2J47Qj54K96q5m2o3L9j8K7L4k78M33l34ml5J37J4M1K94j96
4835A45j62K11o6k80K62k91jJ94j14l9K25n9kJ01m09J33K25O4j63j25J19j25l6
4858a93J82n4J50j14J43j99PJ6Q7J9K18k28j51M9l4L26l33j43K63L6k7q8J9j4
4882f3qL23l28K6J67j4l36J84O0k46K2M1J26j49J20j08L05J6j73J40j08%k7J77
$$ plain form
4719 337 496 -243 -112 156 -154 -128 -111 -43 -19 -98 -1 178 201 59 45 -182 339 443 215 258 -330 -232 293
4742 293 -280 -75 58 -17 242 -289 439 286 123 31 13 -772 532 146 181 315 334 -306 -246 24 153 676
4764 676 883 583 -141 58 16 -17 -61 105 -181 198 245 -251 4 -68 -428 -290 167 194 -266 -200 -163 461 150
4787 150 47 -25 -42 163 -379 201 -63 -345 182 149 -239 86 86 -386 12 90 -35 -154 276 159 187 21
4809 21 95 22 100 -138 -116 31 39 -115 181 96 54 -9 30 12 39 73 -205 228 -106 -110 -145 -8 6 47 341 145
4835 145 -17 194 128 -152 110 -181 -182 12 -102 -141 84 25 23 124 -285 -152 73 137 -26 -151 -32 -157 -193
4858 -193 -11 -65 85 -29 114 -85 -78 -62 25 44 262 34 -117 -68 -102 224 -109 -252 11 47 20 -68 -49 -63
4882 -63 -71 252 -76 -50 117 103 -233 -49 11 -235 -213 -172 -46 -195 -75 -183 122 138 -35 105 -3 -3 -30 147
4906A47M2k03L7k82L55k16J97l08M05k18M29n08M3K21P5j75k29L09j07R9j73J88
4928A28j68J13j94j28M06k80l65M37o8J87j37K19k40J47j72K57J06m09L21k1p0
4949F9k52K67j0j84K5J56J03k03R3j58O4l26L57P1j05K38k29P7j12Q4n7J65n6
4972G7j40j6n0L49q4j00P2j65R3J24j39L1k05o6M24k52k03M6J86J93k23J17k20
4995a51P9K29j74J41j62L48m13K13j36j10K39m0k0j86J54j89K22j45K2pm8M64
5017C30o05L53j3j93J92J3l05K42J19l99J23J97j77q7K53K63m07k0j44L58J44
5038B37k57K50o6m35K84J56j79K24k93q1J57j1K68n29L17j66K36k64P2K92k63
5059e1O9J08j34o2L8n5q4K88o4K5l22K08j51J14O4J0L1k47L20k38K40l56L26k66
$$ plain form
4906 147 189 -14 23 -259 96 -120 77 -231 174 -44 385 -123 -80 141 216 41 -188 121 14 113 -60 128
4928 128 -40 73 -121 -249 157 -123 -488 -51 -119 68 -69 150 -90 57 -115 142 248 -161 160 139 69
4949 69 -183 84 74 -110 -85 71 174 -29 64 -94 -30 -356 1 72 -33 205 -24 53 -59 25 -32 133 77
4972 77 -63 -79 -129 220 136 36 108 -57 36 160 21 52 -153 -219 205 -47 -250 -204 -18 175 -48 69 -151
4995 -151 -72 157 -17 124 -38 310 -103 110 -26 -136 103 63 43 -143 11 -178 44 -101 -79 -86 -134 330
5017 330 -275 78 65 -128 64 77 -228 14 133 -266 -143 54 -123 -210 43 306 -101 -121 -265 93 237
5038 237 -20 230 164 -271 13 169 -10 214 -79 -160 -3 -14 254 -275 42 -124 112 -152 -80 212 -51
5059 -51 18 126 -8 -70 -32 -87 -171 117 53 78 -244 -36 -187 -73 -9 1 32 -215 105 -133 107 -249 77 -189
5083a89J18p9J36j82N0j5K28L2p2j13K8J40j07k22J95j9j64K65l6L0j18O2j07
5106a39J24l4j11O2l1K94l55N5J12K74k57J31pj48K10k55K27j63Q6N0k48J70K2
5129F9J2j36O0m7J39k59K03K35l13J57lj00K2p3M2n9K53k27n1Q8o0J3O2N6j39
5154e6J54j85J37j34J51j78J29J19l06L11j47l9Rj69N4P0J17K0m4Q0O6l52J39
5177e4K01j09R0k88J01J37j55Q6J03M8j94O6j69K03k16K9K06M7N3j85P7j08J10
5200G9l19O3K47k09Q7p7J02Oo9J56k77L49r4J09mk73K29J40j89J08l2j75pj14
5224a64J77K4j40K31N4j95K13j45J05L1k78J34R7j45l0k76K22R6O7k35K50j94
5246a01Q4J2j92M92l48R2j09J94R9k27N5M4n1k41K47k34M0p6J38J02J86k25m1
$$ plain form
5083 -189 -71 -150 -14 -196 -146 -161 67 99 27 -86 -58 82 -25 -247 -52 -71 -235 30 -6 24 -94 -32 -139
5106 -139 -15 -49 -160 -98 -129 165 -190 -135 -23 251 -6 125 118 -30 180 -75 152 -11 75 125 -123 47 69
5129 69 81 -55 5 -42 97 -162 41 276 -37 120 117 17 39 -34 8 -51 202 -25 -76 12 -48 -35 27 83 -56
5154 -56 98 -87 50 -84 67 -111 18 137 -169 142 -5 -44 -35 -204 -150 -80 37 57 13 93 159 -193 -54
5177 -54 147 38 128 -160 -59 78 -77 9 112 160 -34 32 -137 66 -150 -121 85 132 185 0 77 -31 79
5200 79 -240 -177 70 -139 -52 -129 -27 -21 -90 66 -211 138 44 153 149 -124 105 245 56 164 132 -43 -50 -164
5224 -164 13 37 -103 128 182 -13 200 55 160 191 -87 47 144 -1 -31 -307 -85 11 78 -157 93 -101
5246 -101 -17 -5 -197 295 -53 39 -70 124 223 -4 51 95 44 -197 50 -184 -144 -220 -82 20 206 -19 -60
5269f0Qj25J20J73j94J78N0m31L61j12l2l5J41j23P6M8o8k30K45l9j61L74k39
5292g5J91j52k28L38p7J58k39j38L89j37J0J71k01M4j37m3K11j30p2PJ99j30n9
5315a00L75o49L66o7J55j85O5P5k25K64l4j07L11l06j19J31J68r2k9j87K75Kj94
5338a07j76L59K86l36N3j39J26j09M0K2M2J55k78J65l65K39P9o2M5J34j45q9K30
5361A69l38L20j66PJ88k03M6l0Pk21K68R0j54k7j49M20j99J22k57K49j68N4o2
5384c4K4o3oq2J98J60l19J84ll9K32k27O6j7P3k64q7K93j8k46K38J39j03j22N9
5409C6m6K14m43J21m7MP6J66j2K4r6k3lK51j18j76O5p4N1RJ85k68L14k14J12l
5435A05P0k20j35q3M80k88P0j39J65J4Q6Pk92J9M9l6J54j60J44J49K9m64J59K42
$$ plain form
5269 -60 -52 -177 -57 116 -78 100 150 -281 80 -32 -64 -99 42 -81 -5 43 -25 -255 -10 -49 -210 164 -75
5292 -75 116 -36 -264 74 -3 155 -84 -222 167 30 40 211 10 54 -83 -126 85 -45 -117 -110 89 -41 -100
5315 -100 275 -374 -8 -75 80 -105 -40 35 -190 74 40 -67 244 -62 -181 -50 118 26 -3 -190 85 87 -107
5338 -107 -283 76 362 26 79 -60 66 -43 -3 19 61 216 -62 103 -262 -23 56 -6 39 173 28 -61 169
5361 169 -169 151 -15 -8 180 -23 23 -7 0 -221 47 137 -17 -44 -193 227 28 150 -107 142 -26 28 -34
5384 -34 -10 -73 -79 -161 37 197 -122 62 59 20 252 25 91 74 147 -117 -204 89 71 -175 63 202 99 -23 36
5409 36 -10 204 -239 -118 -165 -161 -85 81 69 93 -3 -26 -29 222 104 -72 -7 -81 -30 -21 164 -104 210 -4 108 105
5435 105 175 -45 -180 -263 217 -71 -1 -140 25 39 125 132 -160 -141 -92 -128 26 -134 10 159 188 -276 -117 125
5459A25q1J21j58r4P4o3O0n9q8K70J78k98j56K27L9k99L23j17K0j07L19j24k59
5482a47K15l41L70jq7j75J10m5Q1N6R2j24O3j00o5J04j5j25J16J85j82r6J03J35
5506A27j78Q7q8J61k66K54k10K42l26K81J17n27M28r0K17m08K35j09q4J18N7O3
5528A01j93K11j84o9M8k6K52k01J03j6k6K31m3om88K37r9J39Q9k08K10j44O6o8
5552h4J15k5K34l46o2K29r3R4j96j29O4Q7K48l07R0P5J33m8L6j98L57j32p6l64
5576b98O51o48K49J31J78j15k12K9j04K9K5N4J6J5j94L45k75J71j45m6KJ93j00
5599d9j63K07L3P1J3k47j3nL32q0J1q9r2j1K94k61J03L8k02Q0J20N4k22O2k18
5624b34K46k04K37K39l32J63K7J19j99p5RJ89j77l09J48O5j34J07o3J2J59K8n6
$$ plain form
5459 125 44 165 7 -87 -13 -76 -16 -75 -163 107 285 -13 -169 58 97 -202 121 4 24 -83 236 112 -147
5482 -147 68 -273 97 96 9 -166 -56 -101 -20 36 128 4 67 -33 -98 6 -9 -134 -18 167 -15 -111 -8 127
5506 127 -51 36 -52 109 -157 97 -113 129 -197 84 201 -326 102 12 229 -179 56 -53 -137 -19 38 101
5528 101 -92 119 -65 -134 -86 -112 140 -61 42 26 0 231 188 182 -306 -69 -168 -29 60 -148 62 -82 -16 -84
5552 -84 31 6 240 -106 -168 61 -32 62 -134 -263 -199 -112 136 -171 -81 -6 127 79 115 -83 274 142 66 -298
5576 -298 353 -295 -46 85 263 148 -64 -35 -139 -110 -85 -31 -15 0 -194 151 -124 47 -98 -144 -142 51 -49
5599 -49 -212 -5 28 99 112 -135 -148 -153 179 99 110 21 -71 -82 212 -49 54 92 -110 -30 90 144 -78 -16 -234
5624 -234 12 -192 45 284 -48 115 142 261 62 -13 -4 185 8 -301 -153 -88 -222 -115 -178 -166 -7 21 -35
5647c5M9K11l83j3K56K3l5L5j08m1j43J07Q7j23J62j33J49j07k05M86k86L5k69
5670b81K09R6J45k28j17K15q6Q1m09M62j57L9j1k00k25N71j13J85k64o1K08N7
5692A16J39l91j43N5L37q3m44Q08k94m8j51K73j05k01K78j81J44K05m10J30L1
5713F5r5k3M71p41L14Lm5p4Jo2L57n49L08j70N0J14j40J29M2k07M10m6J10o9k76
5738a23J85j98M1L34j07M7m76N71l43L42k82l05J43K49l07J30R8j71m0J54R7l81
5760c42J00j07l59P99L32q04O14k46j71l3J56o2J72L05l02k64K73J0q4m0m8kJ1
5783i2J25J61J46j99l20P32p67L68m70J64M38O7m39j10M33k21j40L2K03j8n60
5804d67N42o4N07q51M9K67N94p17J38j69J58Q3L07m39N4J78j73k6Q8j84L6qK76
$$ plain form
5647 -35 14 225 -158 -171 85 108 73 108 0 -41 -184 -77 10 -113 49 -84 65 -42 -247 239 -47 -12 -281
5670 -281 -72 24 169 -59 -176 39 -47 34 -375 87 -70 -31 -42 -242 -467 104 -9 176 -88 -149 59 116
5692 116 255 -136 -279 -224 113 30 -414 394 100 52 -99 174 69 -132 146 -35 109 314 -96 34 65
5713 65 -30 -53 418 -323 -9 -6 -51 -125 -124 -186 171 -378 -70 -240 -190 -76 -216 -87 -45 -252 158 112 222 153 -123
5738 -123 62 -136 -95 239 132 179 -297 274 -69 273 -9 -314 -171 78 -229 -99 -1 -172 -212 -58 39 -342
5760 -342 -242 -349 -708 91 423 -381 233 -13 -184 -217 -61 -123 49 354 52 -212 61 71 -13 -53 -101 -103 -92
5783 -92 33 194 340 141 -179 553 -214 154 -316 -152 286 353 -86 -196 237 16 -124 -92 111 93 -467
5804 -467 75 11 518 -333 -284 -17 577 -140 -2 -171 -13 70 377 -62 -8 170 -3 -29 59 -125 -89 -97 179
5827A79j54j6J91k31N1m8k76L77k49L6m6M38k12j08J20m5j8k08n8K96L9M56m33
5850H1R8nj81N0l45J40r9K09Q1J46j46q6j55k00N99m28R1L6O6P1j79L00j99Q8
5874C3o2J46Lj55Q8p2J26l03L29j65K37k43N9P5m5j18L1l41M07j46nL58k21j44
5898a28K19m6j05j34J71J87j33K06j35l5O0n2l34K6L57k94L68k68o7p7J83r0L56
5921B35Rl96K47j49M55l38k45J49K35l6k85M06k55O6j23j68J35n6J35N6o7l65
5943c55M50j4k02j11O7L90o0l98L99N7k14JJ31pm8o0k46M11o6k42P2J85l5p5K74
5968C04k70p2K24m82N08j38k08L24m71L56l23Q9%M8K30o5M4j99L39k81J57J14
5990B28k46L1r2J46j3j58j57M60k50P3J03l19p5M30k70K4K25qj56r0J37q5r9k
$$ plain form
5827 179 25 9 200 -31 20 -28 -304 73 -176 -140 -186 252 40 -68 52 7 -11 -219 -277 19 58 514 81
5850 81 179 174 -7 43 -302 -162 -261 -52 29 175 29 -57 -212 -412 187 -241 -150 -114 -48 23 -156 144 -55 33
5874 33 -29 117 120 -35 53 -19 107 -196 133 -32 205 -38 21 96 51 -67 -36 -377 30 -116 -121 237 16 -128
5898 -128 91 45 -60 -194 -23 164 31 237 102 67 127 75 -259 -233 124 -170 198 -70 -137 -214 -31 -121 235
5921 235 244 -152 95 -54 401 63 -182 -33 202 166 -119 287 32 98 -25 -193 -58 -114 21 77 10 -355
5943 -355 95 81 -121 -232 -165 225 165 -233 166 223 9 10 141 134 86 26 -220 191 125 -117 -45 140 105 30 304
5968 304 34 -38 186 -296 212 74 -134 190 -281 75 -248 -159 -159 -111 119 54 98 -101 238 -43 114 228
5990 228 -18 13 -79 67 54 -104 -261 199 -51 22 125 -194 -269 161 -109 -85 140 132 -24 -114 23 -62 -161 -163
6014a63k3p1K45K13k8j85l4j23J90J56l38j3K46k18J09K25j20j74N4Qn8n0K2J60
6038C0k19j01L97j15k53L30p4R9J14l62j24L05j02j32J14n8K16n5K09j42n6k54
6060b33P6K95k63J16j92K54k4o7k10K81M12m06j5p1K83o09O97K6n62M06k63l2
6082a01p3J15L86Q2l27k56m22M98M5L05K8k71k08N45j59l3O8n41K19K76j99Q9
6104F6o86N26j15j75N31n5k14K95n4M06r82K77K27R4N4l68Kj82P71l3l67k30R6
6127a16L13J39n32q5N31j58p3o18J64M43j00J89l83k86K07j14P22l44k29O23k13
6148H0p3j06R94j110L62L38k76j03j61l65N05j85j90K33J25o53R07r8J42l40n11
6169d85L82L67l68N9J48m49j80L58o50J318p37J20l11L42P50p23K56k06J72K03
$$ plain form
6014 -163 -186 -257 -12 201 173 -12 -46 -169 21 177 -161 -174 72 -146 -37 188 68 -106 -52 -44 -102 -152 -130 30
6038 30 -189 -290 107 -8 -261 69 -5 94 208 -154 -278 27 -75 -207 -93 -151 65 10 219 77 21 -233
6060 -233 -157 138 -125 -9 -201 53 29 -38 -248 33 445 39 24 -47 236 -373 324 350 -212 194 -69 -101
6082 -101 -174 -59 327 409 82 -174 -596 -98 -53 252 280 9 -199 346 187 154 222 -319 -100 176 -23 66
6104 66 -620 -94 -209 -384 147 92 -122 173 119 525 -457 -180 47 141 195 -173 -171 -353 418 385 18 -212 -116
6127 -116 197 336 -196 -281 250 92 19 -599 -435 8 -92 97 -286 -572 -365 -479 243 -101 -330 293 80
6148 80 7 -99 895 -215 147 485 209 106 -55 -420 85 -100 -290 -57 68 -585 322 224 366 26 -485
6169 -485 -103 264 -104 -45 103 -346 -526 -168 -818 500 -237 -117 -428 -86 664 -59 197 -9 163 366
6189C66l40j58K9M04j63k85K23o84O74J78o31L14M08o66L10L79j31k79M1j28N09
6210C70q08O85L87o19M8m62L62M16j49r8m57K29J46j23R2K47l12j26M36l72L18
6231B10j2Q0n97N26m71M87L9l34J81r6o62J26K75P70n13K06r3l54K48n98P34k71
6253a19K89n97P86p49L16K44n75J96K4rr8N69m96K54Q03q78K66m21L56p08L26
6274b21K36j55o00L86N52l71N18Q4p06o78J441j80r66J451j641P26p27Q53K47
6293B49m00r6O83n49n96J143n45l58J45j31l0O88l75J90k62R7J69j91J72q2k01
6314b80J48L07n23R63j127J74O26J80p4k05j131P37O25n69LM62n75M12k2m5l84
6335b98R6J45k01n0Q69k63o07O52p85k00N22M91j76l96l39Q69n20L66q96R46l31
$$ plain form
6189 366 26 -132 -103 301 138 -147 76 -608 66 244 -387 -73 335 -331 -21 358 227 -52 -11 -139 370
6210 370 -438 247 634 15 63 -399 -37 379 230 132 -325 -96 50 -73 19 266 -46 -172 264 -108 210
6231 210 198 278 -319 207 -264 223 262 -72 109 13 -649 -523 -248 522 9 215 122 -232 16 -582 152 -119
6253 -119 170 -427 359 -390 -74 170 -405 -209 -185 -194 -292 277 -219 35 838 -40 226 -195 161 -547 -221
6274 -221 15 -140 -740 -354 198 -173 345 429 -277 -955 486 306 -660 791 -850 -124 -851 2 249
6293 249 -151 -247 436 -113 -709 434 -111 -469 -324 -455 -485 203 -172 18 -244 -147 22 -169 3 -79 -280
6314 -280 -132 175 -348 615 -512 -338 288 468 394 189 -942 -205 420 -149 -146 316 -259 153 131 86 -298
6335 -298 -202 -57 -258 -308 561 298 -309 343 -442 -642 -120 371 195 -201 -540 329 -191 175 -721 225 -106
6356a06L75j81K17m80J50R50j153l62J231m67R7n48k89J073o14p33J154m94Q5
6375i5N85r39R95q31oK57m15J86J06L83Q0r91Q9R94j8k11k9j31j9J52j14O9J60
6398B57K59r33L05L18o44N29K02N1m97K07p01P03J63M80o64l5l60o20R52L31l13
6419a0l30J26M55L98m41p8J14N4l55m31L74K97k80O00l49j33M2j83J37l16L65
6440E6j35k30M4N40m08K60l0j54o4j87l68P42K10l17n2j58k46O34N5q29Q01k89
6462a25m3P69o69P9j01m2j67o6O84J67n15K08k96j91M90L01r57N32J66l08l97
6483d81P01p4p51J01R37K23j77Nn76N05j288O44M06q2k56L42m12l16M66L61n56
6504b78k36R22m85N84l21M89j003P01j07o7k06r53O48J3L2Q41r69L13k78J059
$$ plain form
6356 -106 269 88 305 -175 -25 925 -228 -590 641 174 271 -277 -566 507 -107 -840 314 -180 -95
6375 -95 490 -449 546 -285 -291 -34 -449 -263 -157 226 306 -685 -596 398 380 169 140 9 -10 142 28 97 257
6398 257 516 -417 -112 206 -438 91 293 344 -153 54 -647 56 219 699 35 0 -360 -980 -28 303 -10
6419 -10 -340 -214 241 639 198 120 234 288 -67 -498 -124 173 -107 493 144 11 53 -130 7 -309 56
6440 56 -79 -309 -265 275 -133 127 97 -57 -121 -308 -676 66 276 -41 -93 -251 -497 137 192 -637 164 -125
6462 -125 -168 601 -68 11 -90 -132 -299 -365 319 486 -29 179 -117 -308 182 483 -474 58 224 -84 -481
6483 -481 220 146 -605 -504 433 656 479 484 -92 413 -875 -231 175 93 -163 179 -233 -549 -83 278 -278
6504 -278 -514 408 -77 507 186 675 -328 373 266 199 -7 -960 -312 -299 -267 574 -395 -82 -360 699
6524F99o52J86J63k20l47K58m14K18R3k40J004j207O58rl46J72K46n64l48K42
6544d08M10N64jo04O63q49L86m70K33j59j97n06R37K48o30Q74p77j70R62n23p9
6565i6L15O2k51r2k3q5L11m09J11l47M22K96m25K56j9m45j34P72l17j41o7K46
6587f0J37m47M79J50l57J74L16L79p20l7r0o2J52P4N0K1o9K72l90J64l3L25q59
6610d31O35m39n2L24l2k18R5j51j23N32k83K18m76L13l69k1L36L39j47p00M77
6631a73L2J32N1J03j75J19p8L42n31K54n4k96L52L8Qn71L20k15M83N09p25P4L01
6654C00n18Q08n78K24p81M2O92o97M63K83k95k66K96J40p7M86n87l21P29n75J16
6675a16j8K06j70N44n19P02j82q71Q25m20L20m57j1O5l82N73P7k46o4M06j45K3
$$ plain form
6524 699 47 233 396 176 -171 87 -327 -109 -16 -256 748 -459 199 190 -156 16 262 -302 -650 -408
6544 -408 2 566 565 -39 624 -225 161 -309 -76 -235 -432 -938 -1 247 -383 491 -286 -456 506 -17 -96
6565 -96 219 281 30 -62 -85 -170 141 -268 -157 -504 -82 214 -211 45 26 -419 -553 219 -98 -239 -306 -60
6587 -60 77 -370 109 259 -98 76 392 771 51 14 -76 -138 14 88 138 159 90 362 -28 136 103 428 -431
6610 -431 204 -235 -287 37 5 -213 -118 -269 -392 140 -143 75 -401 -88 -457 -478 -142 197 50 -650 -173
6631 -173 -141 -9 42 145 -30 89 11 353 -178 76 22 -274 78 116 124 -447 -127 -342 141 650 -75 -1 300
6654 300 -218 590 12 236 -545 -503 189 -508 -45 238 -57 -323 -27 113 36 522 -65 -386 343 -232 -116
6675 -116 -134 72 -98 446 -73 629 447 -424 401 -19 301 -156 -167 -102 -484 89 166 -80 -144 262 117 140
6697A40l83K75j37J10K39J48m52k01l6j07L73J04m13K90l5j51L86L26l11J04k62
6718Gj17l69J70O14K52J09m17j66K04m41L5Q5k75O89l63N06o97J84Jj59K86j94
6740e6J89j07L55n58Q3K32m22j81O64k66l30L75K76M2k97k10jM1n37R22m09j37
6762c32L04q5l4k1K65o39R80m44J66P9l52N85l82K98l27m97J32m11J326o51mK71
6784B27o6j87J82r69N84Q86j007k40N60j67K40J86n52L48J97l72l3l76K73J45
6804a41q1l63N82M4J37K26o60J08L96Q9j61Q3m58J16k66p0J35K57J28J66L15k10
6826C72L06o75r3N75k2k43J00m82P27o72R4k01K28m2J9k92K73j37N02j85m19P42
6848D75n80L9Mr0L79Q2o25m0L93j25L13j131Q33j30K11K38m36j08N03q2p98J208
$$ plain form
6697 140 -243 32 -105 5 244 392 -60 -261 -297 -404 -31 73 -340 -50 -85 -236 150 476 165 269 7
6718 7 -110 -479 -309 305 557 666 249 83 287 -154 -119 -34 -309 380 17 523 -174 10 11 -148 138 -56
6740 -56 133 26 381 -177 -94 138 -284 -465 199 -67 -397 -22 254 296 -1 -211 -212 -171 -708 214 -195 -332
6762 -332 -28 -113 -147 -168 97 -542 438 -6 160 239 -113 472 90 388 61 -436 -304 -715 611 -40 -44 227
6784 227 161 -26 156 -813 -229 657 -350 -590 -30 -197 43 229 -323 25 222 -150 -183 -559 -286 -141
6804 -141 -222 -585 -3 41 178 404 -256 -148 248 337 176 259 -199 -83 -349 -419 -284 -27 101 267 582 372
6826 372 678 3 -90 485 463 220 320 -162 565 -107 -13 -214 14 -28 -9 -301 -28 -165 337 152 -267 475
6848 475 -105 -66 -62 -152 227 309 -316 -356 37 -88 225 -906 -73 -203 8 246 -190 -298 205 123 -675 533
6870E33p66J88L40m21j96L50L20n79K55J08n54L13J87J47J89l82m2o2O9j05k4
6891a32J4M14o41L6L23j49j6M04n44K44K19J2m52j33M28P1N60l94n57K24k26k79
6913e74K59m3k88P16p75L93J57J75j77J59n2L01j34m50K05K91J33k50k43L41Q4
6934B28k34l0r4j83M35n07K52J96j53M41L4j18o16M07Q8l37P87l85k85P19o74
6955b9m54N59j37p05J108k09l77L08o6l01J80Q8K94k59j0J56l13L53l31l57Q09
6976C07n41j5J39M66o46j28N99j34L13l63l48K05P57o37LJ6K36l05P2P61p55N22
6998E24j43n72P76j38Mm63l92Q03p84J185n83m24N97q86R12J18r27N37m54O88
7018C78l26k07L12l03m10J236p17k51J84j55R22j059N57m9k5m33L07j03K80j57
$$ plain form
6870 533 -233 -45 295 -126 -322 28 348 -231 24 132 -422 -109 78 225 414 32 -10 -72 -3 -108 -132
6891 -132 -118 296 -345 -309 14 -135 -151 253 -291 -47 172 184 -268 -401 27 98 658 264 -293 -69 -295 -574
6913 -574 -315 -358 -646 70 -705 -312 -155 20 -157 2 -50 251 117 -333 -128 163 296 46 -197 144 228
6934 228 -6 -36 -130 -313 122 -385 -133 63 -90 351 385 267 -349 58 146 -191 596 211 -74 645 -29
6955 -29 -483 76 -61 -766 342 133 -244 64 -2 -303 -123 -35 259 0 -10 146 -167 186 -145 -502 307
6976 307 -234 -249 -110 356 -290 -418 181 47 360 -3 -351 -146 611 -26 -23 -7 229 -76 -4 757 2 524
6998 524 381 -191 585 447 451 -12 -404 399 -385 800 217 -207 390 -496 416 534 -393 144 -310 378
7018 378 52 -155 157 -146 -556 680 -37 -288 -104 -259 663 -396 161 112 87 -346 -39 -142 138 -19
7038a9L32m38l94K37l04J09M91Q8P8n52N29k85N25r35R94p39Q39n34m7K15m37
7059b47J106q21r44J379k75l21j70J85r3JM19n7K14l38J74k24M21j126L09L42
7079f6K0k14M07m0l19Q0L56q50N15K75M62p24P25p99J61o58L95J40m4N88q53N0
7101c93j70N88l64K84O68m98k43m36P89k71k9N8J18m99Q64n81n09K53K17l72O54
7122A28j97O0l41J44O37l47k94O04k7p56P0p69J277K13l79l76Q80l21l2j69p44
7143g39R97M10r53J81j76K18m43P22L97q39Q11j369O88M91l46K79q5n16J6k64
7163e20P3K94J9Q3K95r95O97R21r63l91j09l49R23j84J6M17K7m62j78K68j52N66
7185B96l30L8J3k39j53P8M83m98K94n77M57ml7N73j036J268n04L28l62K26m07
$$ plain form
7038 -19 313 -125 -519 -282 -586 -477 14 102 180 -372 157 -128 397 -538 456 -283 556 22 -25 190 -247
7059 -247 859 38 -906 473 198 -123 -293 -108 -201 -200 219 162 376 38 212 -12 409 -717 -408 -66
7079 -66 -46 -260 147 107 -212 -132 224 -626 -111 164 626 -98 627 -172 -11 -669 -274 -134 -178 410 -443 -393
7101 -393 -563 25 -339 -55 613 115 -128 -564 225 -46 -75 -17 101 -398 466 -115 -624 -371 -154 -526 128
7122 128 -69 -9 -350 -206 431 84 -210 394 367 -389 -319 -1088 189 402 23 -353 527 206 174 5 -739
7143 -739 258 668 -285 -104 -280 -62 -505 217 614 -225 586 -783 -95 396 50 329 244 -272 -256 -520
7163 -520 -447 -153 -134 -51 244 -751 -54 867 -96 -487 -596 -945 -22 -206 -190 227 254 -208 -386 -118 -270 296
7185 296 -34 4 17 -222 -375 -297 186 -312 -18 -595 -138 -142 -179 394 -642 626 122 450 88 314 -93
7206i3K3K33Mm73l04P15j27J95m79J38J121p43o94j0N67p2P0r86P02j39j12K76
7228a88K89K98p33J58M43k03o20K00J545j622N4N81K48q98j97k58P73P7K06n02
7248c49J032m8k137J454K59l91L63L40n32R5q83M23J82J057j359M20J797r90o7
7267F66j024R67j95K78k00q59K96k5N00q21J134j075J717j324k91K87o96O84l98
7286c79o3N66k04k71P09m73L94o28M11nl40m78N96o05J061l75l32O99n01m64N53
7307a29r45Q21N1N06n26L75R6k25J58l44l67P37r0L14n49K21J35k67J62k20K48
7328A62k32J99j09QM1j71N4J85j91k4j11K5k87K71PK27l13Q40n20j9J22q4k58
7351a78K14l97K46N63l88j25N9j57k54Q94k10n39M61l27J25J21n00M52J28k0l62
$$ plain form
7206 -93 -70 163 167 -306 -610 105 -22 173 -306 -168 953 210 -484 -494 73 1 71 -915 -213 -352 -464 -188
7228 -188 101 399 -334 -176 267 64 -556 -356 1189 -433 -379 202 450 -448 -645 -903 -130 -53 153 -349
7248 -349 683 635 -1502 -48 211 -180 183 523 -9 86 -797 -374 -192 865 -494 -74 1723 733 666
7267 666 -358 609 414 692 492 -367 -71 -96 404 -417 717 -358 1359 35 -256 31 -665 19 -379
7286 -379 -442 124 -80 -351 358 -115 279 -349 62 57 -283 -761 -165 -770 291 -84 -416 283 -218 -682 -129
7307 -129 -1074 -253 -202 304 -222 153 249 24 182 -162 -529 208 118 432 -117 104 239 -28 134 -86 162
7328 162 -70 129 20 28 69 -102 -48 137 -54 -78 -189 -164 -451 -180 -173 54 -259 581 61 42 164 80 -178
7351 -178 36 -361 -115 448 60 -65 -6 -163 -417 477 267 -272 189 -138 -13 108 -392 60 188 168 -194
7372a94M50p90M51J6K17k72L22n63N08j78L61n68L05k78N16m11J59P07o66K32
7392C24m48K67k34K05Q0n8n60M17K92l93J64K70m73l20Q88j62l11k13M0N54p42
7413d13M37K4N60l57k40R7J8q56J179l82m22N60%m21K44N65q21O10o92J99r1L45
7435A43O0Nq34N39oM60l31j2m0J06J38k35K74k69j45J96j09N31j115Q62n1j1m67
7458c11N91r29J04R81o46K71m15L51l93O60l2j79P21r13L63J28n90j7K68k0p1
7479g8q7k0O11n07K45k24PN10r56M19O52j121O13o31N18n5L35k69l2m2J16k69
7501b65mP20o31p6O94J06r0o24r0L91j14J02J12l61j0n21K57%Q27j36n59N60j185
7524h97J426n24l70L25K06p48O99J97R8l42m84K36M33L04o38o97R00j590J674
$$ plain form
7372 -194 256 -534 -83 -67 150 -122 200 -363 145 -33 328 -240 65 -213 303 -108 51 758 92 324
7392 324 -124 143 -91 114 194 136 -424 -7 285 -108 56 326 -147 -467 421 259 -52 -265 -225 329 -413
7413 -413 24 48 608 251 11 108 126 -730 449 67 -355 205 205 -216 28 593 -228 382 -310 -111 -202 143
7435 143 203 208 -626 -87 -93 367 36 24 -16 90 228 -7 267 -2 -147 49 -60 471 -644 218 167 156 -311
7458 -311 280 -649 -545 436 -210 61 -354 -3 -396 264 232 53 774 -139 224 352 -238 -255 13 -7 -78
7479 -78 -165 -185 426 -81 164 -60 -53 457 -499 -80 572 -549 64 -567 -49 -104 231 -38 -70 -112 4 -265
7501 -265 -269 451 -180 -256 438 544 454 -170 -260 131 17 119 231 -130 -140 -661 -404 -404 423 287 -272 288 -897
7524 -897 529 5 -365 -40 166 -582 117 314 412 70 -414 -178 255 559 -79 -776 124 -1466 208
7543B08M02j339R84L48j126K50O03L71o13K61o10K4l09L21M65M4n88J78j31LO50
7564C96m3r80M0R72q96rP06P5k00k81R6L24j96k13n86O45L35N20j250J061r30
7585d14l08O02O11j497J021J40o59j42L74l14M51o3N50J71j007Q49m24k20J28
7604a51K27j58J13K0m73j63O11j231N77N87p5k44J028o42R47o11m27L94n03O51
7624D77o90r23N64p8J583r23J4O04j215J100p18L85l54K8j025Q76K21L03k7p69
7644e67q78J362m62J002m63N86m39K20m50JM24o0l89j042P85J24N50M77j224J8
7664d25K23j83j64M58K52P89j657P72l87j77o43J249r4n87O66p39O03r1O73m38
7684A00O2j55L95K66K32j386l29R45j193M61L79k65J143k82L1r76L64M27m91j72
$$ plain form
7543 208 610 -729 255 603 -523 -273 330 701 88 349 -261 -237 -546 -225 240 284 -304 -126 -257 -254 396
7564 396 353 -627 -587 385 -511 -520 186 261 61 -220 -124 200 4 -209 -795 -150 185 705 -545 516 -414
7585 -414 -722 -120 491 -1006 15 155 -504 -646 -272 -586 -135 -198 352 523 -484 365 -59 -279 -151
7604 -151 76 -82 31 51 -422 -585 26 -1205 -628 -41 -116 -360 668 26 973 362 -65 329 -174 477
7624 477 -213 -1136 -572 -650 933 10 24 628 -587 513 -205 180 -174 -146 -1171 -295 -74 229 202 -567
7644 -567 -1445 -83 -545 457 -6 580 141 361 -89 -88 336 276 -113 -1155 -370 -246 304 781 -443 -425
7664 -425 -202 -385 -549 -91 161 950 -707 65 -322 -499 -1142 107 13 -574 92 -647 -44 -135 538 100
7684 100 162 7 402 668 900 -486 -815 130 -1063 -602 -223 -488 655 373 404 -572 -208 219 -272 -444
7704d44J000k89p78J01K01L15L10N0k36l55j09J35M3L23MO9p62M51k02Q6J082
7725I95j629k71K54J822j433J45J59L26m33N18l84l20Q05j379J202j004M64O53
7743D90n54m2m20Q91r46Q0J026n95L27k56k57M37p66M82k26N14K3r8j39m72M20
7764h1N4Po9k88P64o25J11P51r07Q25r51J72M79j19o85K14L41N6Q2M21n40L8Q4
7787A34j62j76M14k14j22N91l8m24k28m05P61J42p90L84J65K99j91L84J8m35o9
7808C8M83j043R28k29m78Q60l84k94P09j045J74M58r38O23L5L76o17N31m37P11
7828D61k64p36J331o48L0r48Q30L2L02n32j37M59J90n32L21j29k26j91k90M96
7848a81M30j8m47L00L20j82o5m48R37j02p48k90M56km34N27l50k07L61J003n00
$$ plain form
7704 -444 556 267 -511 -410 -209 106 416 466 230 -125 -234 -99 -56 267 271 340 -422 29 -173 -87 995
7725 995 -634 -905 -651 1171 -262 -117 42 368 -65 453 69 -251 554 -825 377 -627 -163 490
7743 490 -64 -106 -526 365 -581 -501 525 -70 257 1 -256 181 -585 -103 -329 185 208 110 -29 -501 -81
7764 -81 -27 -20 -89 -377 387 -238 -127 624 -283 542 -409 -237 242 123 -562 -348 -7 49 131 552 12 50 134
7787 134 -28 -204 210 -4 -126 465 427 3 -225 -630 131 273 -517 -133 32 331 140 524 542 107 38
7808 38 521 -522 406 177 -301 559 175 -119 590 -455 -281 177 -761 -138 -103 273 -344 187 -250 461
7828 461 197 -539 792 144 174 -774 56 88 390 -142 -279 180 370 -162 159 30 -196 -387 -677 -181
7848 -181 249 231 -216 84 404 222 157 -291 646 544 -204 -494 -38 -40 -474 53 -297 -504 -143 860 360
7869C60n65o9m07J478p37j03k55n26N77N25k99J8K77k14j09K5k00m1J022j372
7889f15p9R29o4n14J42O94p46O51o09k72j01L92N56p37L04M1r2j77J48M16k24
7910D3k35o3J01L84o02R40q04m4l29N98m3m7l83L20o7L72m51nJ67n2N97nm44M71
7934D19n87jP56q36j99K63O15o24QL89n32j15K21L67k57N26m36j01p0l8j27J32
7956b27Q8m73M34K52j64j00K13r7p8q70J166R7m4r1k11J92k36j4o59J219m11J88
7978A74j07l59k20L90p5O28j24j37j28J72K24o24n1K18l86J54P6nL0M3J07j55
8000a55l9O8M72k02j72P5N2m43N86j80j05j51L57l62J41J62j03j46M3L3k7K91
8022A95l54j9j9J90k03J04j99M95j17K8l45N52n03K36K4M1p5j59J85l89K39N4
$$ plain form
7869 360 -205 -274 -681 797 60 -43 -298 -824 -247 278 -21 -3 274 60 -49 -24 -224 -265 757 -615
7889 -615 -694 235 171 -343 -201 493 -253 398 -211 -483 -584 -192 364 -373 -69 -28 -120 -297 -149 267 43
7910 43 -192 -255 -154 230 -372 568 -236 -280 -609 -11 -54 -101 -484 -164 -231 141 -310 -315 -148 -200 397 392 -52 419
7934 419 -168 -169 587 -249 -448 -185 430 -194 -186 203 -329 -444 -223 144 -113 413 -23 -124 -194 -232 -359 -227
7956 -227 -139 -612 -178 74 -90 -190 23 -74 -152 -1022 144 241 197 106 -105 87 -149 -163 -822 397 -14 174
7978 174 67 -292 -512 -122 -197 431 307 170 42 214 438 -186 -237 -19 -405 -251 -175 -180 -150 -107 0 -155
8000 -155 -194 -126 346 144 -28 47 99 -344 242 62 -43 -194 163 -199 -58 104 1 -145 -102 -69 -96 195
8022 195 -159 -178 -197 -7 -210 -106 -305 190 73 101 -244 308 -195 41 65 106 31 -128 57 -332 -93 -39
8044c9Q3l6q8Q8J40k1n9K28j31o8R7k88J68k69N20m33L36L8l46k4j32K50J33l45
8068a98J16k00L00l92K11Mk6K6J15K10l91K24k21L47k08O8R0j6P1l55Q5J80J03
8091A43j75J54j55R6j10n8J27p1K38m35M29j87K12l41K03J85j42K04m33L0K5Q5
8113B4j30J30nn2J2oj08M5l5J73m5l28K86J37k16J76J12l47J79MK4k17K06j45
8137a26p6K17Rj18O0p1J57J40j58O3k73M2K59m4O9k42J53k81K54J52j48p0R0q6
8161b8K8K1j1QN3K5O7l84P49q37K74M7K18l61J4J79j86M12l24J52J4j10j47j71
8185b98N11j69O8j43j70P6
$$ plain form
8044 -39 44 8 -80 8 148 127 68 296 165 97 194 -94 74 -195 325 -108 228 266 -80 -104 -236 14 147 -198
8068 -198 -82 -282 18 -374 -163 -159 -185 -159 -44 166 -225 -1 -222 125 -83 -15 75 59 130 -225 -140 40 143
8091 143 -32 122 -33 63 -47 -105 22 -49 189 -246 183 -4 208 -133 70 255 113 317 -116 -86 -61 24
8113 24 -106 24 19 -33 -21 -27 -135 -90 -125 48 3 -325 -39 98 -118 58 170 -177 2 6 30 -187 19 -126
8137 -126 -202 15 24 -94 -34 -105 52 192 34 97 -176 -134 125 81 150 -92 61 -220 34 186 38 -32 58 -28
8161 -28 0 21 10 18 71 96 163 -221 528 -309 -35 12 230 -131 -117 62 -124 288 -36 116 130 20 -127 -298
8185 -298 213 44 112 -31 -201 -125
8191a25
$$ Imaginary data points
##PAGE= N=2
##DATA TABLE= (X++(I..I)), XYDATA
0@%%%%%%%%%%%Qj6J6j6K4l2L2m0N6o4P2q8J04j28J52j76K08k40K76l16L61m13
33b20M71n35O04o81P65q57R60j071J192j327J472j630J804j993K201k427K673
50A401k945L246l576L940m344M797n309N887o548P314q213R288j0597J2234j4352
65g777J7215k1337K7894m0486J07689k79936J04027L31059k78489p8798J82167
76F3228l2050p7417M3422m1050J48837j22697q2766J75148K037j98302J21569
87d1J13118k19787P5021J13013q5928n6603O1629L8235l4394k4705l2256J22706
99G0008p1649o7329Q8590K1064p4142j0968P8160k8026P144n7112M4984N3400
111E4124q3436L810N0099j9600o3440J05365m0558n1035P3497q710l7288J1490
$$ plain form
0 0 0 0 0 0 0 0 0 0 0 0 0 8 -8 8 -8 16 -16 16 -24 32 -32 40 -48 56 -72 80 -96 112 -128 148 -168 193 -220
33 -220 251 -284 320 -361 404 -453 507 -564 628 -699 773 -857 947 -1046 1155 -1272 1401
50 1401 -1544 1702 -1874 2066 -2278 2519 -2790 3097 -3451 3863 -4350 4938 -5659 6575 -7777
65 -7777 9438 -11899 15995 -24491 83198 -196738 -92711 238348 -40141 -118939 63228
76 63228 31178 -46239 -2817 -43867 104970 -17727 -100493 74655 76692 -121610 -41
87 -41 113077 -106710 -31689 81324 -4604 -61207 422 38657 4263 -20442 -52698 70008
99 70008 -1641 -68970 19620 40684 -33458 -44426 33734 5708 12852 -44260 724 54124
111 54124 -29312 -25502 24597 4997 -58443 46922 6364 -44671 28826 20116 -17172 -5682
123e682M4198o4754K4060p031J5912K5080o8357K9818M6747k0499o5036Q1854
135C6310k7134m4987O6618k8605k3123K5207L0553o8931M4892J9867m3449Q386
147d396l212L3751k4516j5340j1067O2491l0908m7284O6264j9644j8333Q311K8320
160B4437m5921K3942O527l3395L6916j4574N42j5745K5853p953Q708j5232k0292
173b6187M9960k8000o237o121K7695j5727j070P717q021K7658m2646J7393J0697
186G111J443k9240J1422K2110k1359K1990k7597K0012l581M204q220m491J1730
199E534j1812J8170l0595L2131l625j8109K538J8153O685l8755K5899q204J6566
212A4576j6573m538R784j288Q674k0519K2343j8089J7247j3868n153K1022j4075
$$ plain form
123 -5682 38516 -26238 -2178 -9209 6703 31783 -36574 -6756 39991 19492 -45544 36310
135 36310 9176 -35811 30807 2202 -20921 4286 34839 -34092 10800 30667 -12782 -4396
147 -4396 -7608 26143 1627 -13713 -24780 37711 6803 -40481 25783 6139 -12194 -3883 24437
160 24437 -21484 2458 8985 -24410 12506 -2068 -1526 -17271 8582 629 9337 -5895 -26187
173 -26187 23773 -4227 -10464 -16585 11110 -4617 -5687 2030 -5991 21667 -20979 -3586 7111
186 7111 8554 -20686 -9264 12846 -8513 13477 -14120 5892 2311 6515 -1705 -6196 5534
199 5534 -6278 11892 -18703 13428 9803 -8306 -5768 12385 19070 -19685 6214 -1990 14576
212 14576 -1997 -6535 3249 1961 10635 -9884 12459 -5630 11617 -2251 -7404 13618 -457
225d57n487p774L6879k8046K034J229K184J2661j9300O806j1448K1810k2488J1231
239a66J16n623J2987j7250J2789n868J6827l3162J1601J9171j5612J143j1983
252a5030K4187j1875R467j9692J3052R776k1117J1508n784J5514k3960J4471k325
265a808N965J168j9269J9932o957J3082k3201J2181j388J494N949j9140J9062
278G070q255J1643j9773J5916K470j2271K123m504K3731k6022Q169l846J3476
291I927k647j2983J0505p105J5882k3650J4774n301K167l38o734J4550j2054J2554
305I547k1907J7601N21o856l313k950J7499j7266J2362j7178J6596K95j1414M960
319a503j80R790k3212J8761q267P807o110o906J2829l175O552k2487K1871o626
$$ plain form
225 -457 -5944 -13718 23161 -4885 -2851 -1622 562 13223 -6077 729 -10719 11091 -11397 -166
239 -166 -50 -5673 7314 -9936 2853 -3015 13812 -19350 -7749 11422 -4190 -3047 -15030
252 -15030 9157 -2718 6749 -12943 109 9885 -11232 276 -5508 10006 -13954 517 -1808
265 -1808 4157 5325 -13944 5988 -969 12113 -11088 1093 -295 1199 7148 -11992 7070
278 7070 -1185 10458 -9315 6601 9071 -3200 -1077 -5581 18150 -7872 297 -3549 9927
291 9927 7280 -5703 4802 -2303 13579 -10071 4703 -598 1569 1231 -5503 9047 -3007 9547
305 9547 -12360 5241 5762 -1094 -4407 -7357 10142 -7124 5238 -11940 4656 4951 -6463 -1503
319 -1503 -1683 8107 -15105 3656 -4611 3196 -2914 -9820 3009 -166 6386 -16101 5770 -856
333h56K16k087l387R987r584J0877j6337K0126r504l460M443j322Q495j5899J1691
348C399j1603J7941r200n623P320k18P755j9660J7910j0641Q692q447J18J0174
362G917q416M480j3669K3677j3094r98j865L847O365j3756J0503j2346J6863j1808
376b300K427K039l98K822j1911J6778j4885J0717r547J676M077j78J842j5763
390a2604K0867j0004M907q978L456N195o654N121j1924K0675j6444K295K780O287
404D975n084j1065J6734j0608J1073j4451P470N83r5J819q167J3250j4094J3823
418F163r745L798l41m2J802r762J8763j3052L293n888J1564j702j0180Q161n229
433b397J3665j9842J0197J731M8m904M15J2775j8095J2173o597O411m932J168
$$ plain form
333 -856 -640 -2727 -6114 3873 -5711 5166 -11171 8955 -549 -4009 434 -888 7607 -8292 3399
348 3399 -8204 9737 537 -5086 2234 2016 9771 -9889 8021 -2620 6072 -2375 -2257 7917
362 7917 -499 3981 -9688 13989 895 -103 -1968 1879 8244 -5512 4991 -7355 9508 -2300
376 -2300 127 2166 1768 4590 -7321 9457 -5428 5289 -4258 -2582 1495 1317 3159 -12604
390 -12604 8263 -1741 3166 -5812 -2356 2839 -3815 1306 -10618 10057 -6387 -4092 -1312 4975
404 4975 -109 -11174 5560 -5048 6025 -8426 -956 -373 -468 1351 -6816 6434 -7660 6163
418 6163 -3582 216 -125 -167 1635 -8127 10636 -2416 877 -5011 6553 4851 -5329 2832 -2397
433 -2397 11268 -8574 1623 3354 3402 -1502 -1087 11688 -6407 5766 -831 5580 648 1816
447A816R2n541J2400j2809J1556j3348O342L168k065m383k401J6889k0615R080
461A81k60O679j1731R30J0499r743P185j2735J1526m183L089o976K540R641j4838
476h196J1439o009M700o791O199l525l736J3652j6132Q820l803P899r606N596
490E07N53o658J3111j4507Q923m982O844o568J950L959n334R446j5256J3541l778
505A751J246q078N411Q686j3719N757l956J4886j7078L047R055m289l755l871
519d907J6790j6659N774n50M354m879l767J2305j1251M110n306J4295j5444j33
533e268J1296n488k40q672J6853r725l32m216J2376k905j7279J8653l509j599
547e5r845J5177o309k429M914p096J1438j2732P026k026M316r388N523Q776j7543
$$ plain form
447 1816 1908 -3633 8767 -4042 7514 -5834 508 3676 1611 -2772 -5173 11716 -8899 181
461 181 -79 6600 -5131 -4201 6298 -3445 3740 -8995 2531 -1652 1437 -5539 -2999 6642 -8196
476 -8196 3243 -2766 1934 -4857 1342 -2183 -5919 7733 -8399 421 -3382 4517 -5089 507
490 507 1060 -5598 7513 -6994 1929 -3053 3791 -2777 -827 3132 -2202 7244 -8012 5529 1751
505 1751 2997 -5081 330 9016 -4703 1054 -2902 11984 -5094 -2047 7008 2719 -1036 -4907
519 -4907 11883 -4776 998 448 4802 -77 -3844 8461 -2790 1320 -3986 10309 -5135 -5268
533 -5268 6028 540 300 -8372 8481 -1244 -1576 -5792 6584 3679 -13600 5053 1544 -55
547 -55 -9900 5277 -1032 -3461 1453 -5643 5795 -6937 89 -1937 2379 -7009 -1486 7290 -10253
562a0253J2641j841J743j0925J2803j246r180O848k876R510j4654R960k138J158
576A550k026j570Q229j0326Q729q685R831p025M55N712p736O501l851O886j4315
591g641J3357k465o465N556k142M813r762J0829q358O816n251k200Q736q987N176
606B012o005R643j0622O205M4m534N809o481R218j0373O188l728M693l985k872
621d788J0780j0937M844m140J0424j0387M60N703l294J666p254J2579j0373M610
635a07j810J939J891o344Q216p604O899q390R954o136l484R235m717J960o035
650d533J1641j0754M753J107l211N419q192P480n835P157r422O075K271o373N854
665C437n159O004q711J0116o787K420Q66l913O323p401P739p240O394n530J558
$$ plain form
562 -10253 2388 547 2290 -8635 4168 2922 -6258 590 -2286 7224 -7430 2530 392 1550
576 1550 -476 -2046 6183 -4143 4586 -4099 5732 -1293 -838 4874 -2862 3639 -212 6674 -7641
591 -7641 5716 3251 -3214 2342 200 5013 -4749 6080 -2278 4538 -713 -2913 5823 -3164 2012
606 2012 -3993 5650 -4972 1233 1277 -3257 2552 -3929 5289 -5084 1104 -2624 2069 -1916 -4788
621 -4788 5992 -4945 -101 -4241 6183 -4204 -3744 1959 -1335 331 -6923 5656 -4717 -107
635 -107 -1917 22 1913 -4431 3785 -3819 3080 -5310 4644 -1492 -4976 4259 -458 1502 -4533
650 -4533 7108 -3646 1107 2214 -997 4422 -3770 3710 -2125 5032 -4390 1685 3956 -2417 3437
665 3437 -1722 4282 -4429 5687 -1100 1320 2186 -1727 4596 -2805 4934 -2306 4088 -1442 116
680A16L949p054M508m057Q915j1745P080o44k885J114j370O829j1797J0214p250
695d077N499j423j836M022o136P064q011R699j0433M281K957n390M053l396P161
710D034j0844J0500n356L05J824k667M308n939P943r633Q364l838m69L164m001
725b305M972o520Q550q962O577j963j066L148l646M944p292R258q677N270r14
740A374k133L196l618O483r854R902o275K465J87j378K381o293R028r583P390
755C272m668K520n79k216M826o780Q790j0236P723l537j55J221j699L910p582
770e190R437q785N384j671j20P23l265O743r324R053o921L914j178n9J547l946
786c658P489r446Q304n611L517q33j634L379m972Q274r784P681l965R66O70j196
$$ plain form
680 116 4065 -2989 1519 -2538 6377 -5368 1712 1068 -1817 -703 -2073 4756 -7041 3173 -4077
695 -4077 1422 -1 -1837 2185 -3951 3113 -4898 4801 -5632 -1351 1606 -3784 269 -3127 4034
710 4034 -6810 3690 -1666 -1361 463 -2204 2104 -3835 4108 -5525 2839 -999 -1468 1696 -2305
725 -2305 2667 -3853 4697 -4265 2312 349 -717 2431 -1215 3729 -3563 5695 -2982 2288 1374
740 1374 -759 2437 -1181 5302 -4552 5350 -925 1540 1727 349 2730 -3563 5465 -4118 3272
755 3272 -1396 1124 545 -1671 3155 -3625 5165 -5071 2652 -885 -1040 181 -1518 2392 -5190
770 -5190 4247 -4538 846 -825 -945 -222 -3487 3256 -6068 2985 -3936 -22 -1200 -1259 288 -3658
786 -3658 3831 -5615 2689 -2922 595 -238 -1872 1507 -3465 4809 -4975 2706 -1259 -293 377 -819
802h19L104o933R552q544O312l015J438m33j879O227q603Q537p695O038k927n3
818C07P16j892O060r324R085o363L966k721Q71J648m299O114q498Q528n367K189
834A020j865J510K051o141Q061q892O565l883K729k369m78M056p580Q535p212
849c893N907m392K136q60n60M575r279R702n796L540l958K922L8l517O806q601
865e230Q064n527L167k968L188P64n828Q301p619O454n045M399l932K591K632
880C411p994Q643n878N208n409M728k534r20M424p268Q161o163M191m844N403
895C159j102m089N593o423P023n684M513m857L672M34m728N636n290N463o258
910b938N967l737J210K65m390P028n681M363n998N793k105j194K140m425O777
$$ plain form
802 -819 2285 -4648 4904 -3640 2672 -343 1095 662 -1217 5010 -3593 4944 -2751 3287 360 307
818 307 1023 -869 5191 -4133 4952 -1411 2555 -166 705 2353 -1946 4168 -4330 4198 -1169 1020
834 1020 -845 665 2716 -3425 4636 -4256 2309 -1574 1155 -1214 -1692 2364 -5216 3319 -3893
849 -3893 2014 -2378 -242 -1102 -1662 2913 -6366 3336 -2460 1080 -2878 44 82 -3435 3371 -5230
865 -5230 2834 -2693 474 -2494 694 1458 -4370 3931 -3688 2766 -2279 2120 -1812 779 3411
880 3411 -4583 4060 -1818 3390 -2019 2709 175 -745 3679 -3589 4572 -1591 2600 -2244 3159
895 3159 2057 -2032 3561 -2862 4161 -1523 2990 -1867 1805 2239 -2489 3147 -2143 3320 -2938
910 -2938 3029 -708 502 767 -3623 3405 -2276 2087 -3911 1882 -223 -1417 723 -3702 3075
925C075p236O145m984L927k026j193L413m070N780q040P010l968K525j349j282
940b273L853n324O938p348N929l679K645p56k336N339n818N740o147O032l553
955g58j70J925j728M938p966O039l959N221m365L60M275n782M601m460O498p004
971b335M486k035l45L718n717N730n954N699m122L221l368j42N641p361M975m162
987b071N660o100K860M74k006L426p252Q879n437K235l431L461j93l142N386p398
1003d649P080m744L301l506K177J770n126N449n070O459o771L470m42N77J175
1018A150n400O953m934M359n390M856j775j737N037n744M191l328N268p006M911
1033A411J269m841L594k819N840o317L587l742M977r39n689P626m159K146m860
$$ plain form
925 3075 -4161 1984 -3000 927 -1099 -2292 1121 -2949 2831 -5209 1801 -2167 358 -991 -2273
940 -2273 1580 -3744 3194 -4154 1775 -1904 741 -15 -2351 2988 -2830 2910 -3237 2795 -758
955 -758 -928 997 -731 4207 -3759 2280 -1679 3542 -823 -463 3812 -1970 2631 -1829 4669 -2335
971 -2335 2151 116 -229 3489 -2228 3502 -2452 3247 -875 2346 -1022 -1164 4477 -2884 2091 -2071
987 -2071 3589 -2511 349 823 -1183 2243 -5009 3870 -1567 668 -2763 698 505 -2637 2749 -4649
1003 -4649 2431 -2313 988 -2518 -341 1429 -3697 1752 -3318 3141 -3630 -160 -602 -25 1150
1018 1150 -4250 2703 -2231 2128 -3262 1594 -181 -1918 3119 -2625 1566 -1762 3506 -3500 1411
1033 1411 2680 -2161 1433 -1386 4454 -1863 1724 -2018 2959 2020 -3669 3957 -202 1944 -2916
1048b916P546n186m07L246l366L981n104O043p010M903o14r99O64l725O612n335
1064a667L837n750O579k007m630M958j128J489p544R585m981N56P22k186L302
1079A135l240M562o844O329m581K435J206m537N018l013K497n643Q466n028j625
1094b863L414p86K831p225O566l720M118l947J265K466m691M964m333M903n496
1109b534M550j734j134L054k967L511p021Q315l415j044l34K446J367o222O402
1124C240m982M891m364J715J884k479P93l075P068p965N407k342j105K286n49
1139D23J195o129Q526n697K375j857N00K333l919K962l206O510q115L411J666
1154I78j647J61k024M885n880N983n050K326k86j16J554m363N984n298M513m438
$$ plain form
1048 -2916 4630 -556 -963 2283 -1083 2898 -2206 3837 -3173 1730 1116 117 781 -2944 3668 -1667
1064 -1667 2170 -3580 2999 992 -3638 1320 192 1681 -5863 3722 -1259 -703 19 -2167 1135
1079 1135 -2105 2457 -4387 1942 -2639 -204 1002 -3535 1483 -1530 967 -4676 3790 -1238 -2863
1094 -2863 551 -235 2596 -4629 1937 -1783 2335 -1612 -347 2119 -2572 2392 -1941 2962 -2534
1109 -2534 2016 282 -852 2202 -765 2746 -4275 4040 625 -419 -753 1693 3060 -3162 3240
1124 3240 -1742 3149 -1215 500 2384 -95 698 -2377 4691 -3274 2133 -209 -1314 972 423
1139 423 1618 -4511 4015 -1682 693 -1164 -664 1669 -2250 712 -2494 4016 -4099 -688 978
1154 978 -669 -508 -2532 2353 -3527 2456 -2594 -268 -554 -670 884 -3479 2505 -2793 1720 -2718
1170b718K932J198k977J125j468O536q371M195o23J396j096j544L715m728N500
1185C072n621M610j928J64L63j550L764m792N472o221M451k12j288m33j244N944
1201D551p009M396k787L245k412q74K809k955L901o225N857k553J088j863j86
1216a017L073m304N092o182M528j389J136k491L5M155o024N010m180M126k931
1231a363L44N63l46L194p083O194k690K093k502P84R60k212M695o491N519k818
1247a159J521j934J712J343m058M652n299N949k976M64j261J984J622n782O061
1262B839m623M026l029J449n5n79K011m977O609m317K341k918K417K86k030K368
1278A818m804O280l877J743k376K179L55l371M457m274M253m424K885j181J138
$$ plain form
1170 -2718 214 1412 -1565 -440 -1908 4628 -3743 452 -171 1225 129 -1415 2300 -2428 3072
1185 3072 -2549 2061 133 297 660 -890 2874 -1918 3554 -2667 1784 1572 284 -149 -1393 4551
1201 4551 -2458 1938 -849 2396 -16 -890 1919 -1036 2865 -3360 2497 -56 1032 -831 -1017
1216 -1017 2056 -2248 2844 -3338 1190 -199 937 -1554 -1519 2636 -3388 1622 -2558 1568 -1363
1231 -1363 -1019 -456 -802 2392 -4691 1503 -1187 906 -1596 -812 148 -2064 2631 -3860 1659 -1159
1247 -1159 362 -1572 140 1483 -2575 2077 -3222 2727 -249 215 -1046 938 2560 -3222 2839
1262 2839 -1784 2242 -787 662 607 28 2039 -2938 3671 -646 1695 -1223 1194 1480 -550 1818
1278 1818 -2986 3294 -583 1160 -1216 963 1318 -2053 2404 -1870 2383 -2041 844 -337 801
1293H01J01m078N648l810L054m291L166q83l05J464m161N636m003K444k985L278
1309A076j422j996L320l449M733m923K741j832L336j797k555M502l873L832l967
1324b274L167j792J600n12k281N212m749K923l274M108k128J43M84k614N539m948
1340a396K401k216L704k645o21K861l153L753m517L769k235K163k478l58M240
1355C272m418L051l594L741k925K130j330j348M206m372K527k670M253m228J462
1370b43Q19j689K982m359L354k280L433l998J159K299l014K478l353L683l470
1385b199L452k781M12K603l439K414k811M467m038J971q72K44K322m303L507k298
1401a349L525m443K580M88j799K227l078L778k992K893l484K524P61k768K334
$$ plain form
1293 801 902 -3176 2472 -1338 1716 -2575 591 -292 -597 867 -3294 2342 -1661 783 -2202 1076
1309 1076 -346 -2342 978 -2471 2262 -2661 80 -1752 1584 -213 -2768 1734 -2139 1693 -2274
1324 -2274 893 -899 701 189 -2092 3120 -1629 1294 -1980 2128 0 143 627 -1987 3552 -1396
1340 -1396 1005 -1211 2493 -152 -773 2088 -1065 2688 -1829 1940 -295 1868 -610 -968 3272
1355 3272 -1146 1905 -1689 2052 -873 1257 -73 -1421 2785 -1587 940 -1730 2523 -1705 -243
1370 -243 576 -1113 1869 -2490 864 -1416 2017 -1981 -822 1477 -1537 941 -2412 1271 -2199
1385 -2199 1253 -1528 -1116 1487 -1952 462 -2349 2118 -1920 51 -821 -577 1745 -2558 949 -1349
1401 -1349 2176 -2267 313 801 -998 1229 -1849 1929 -1063 1830 -1654 870 1631 -1137 1197
1416A197k602L660l152K495k930K040J544l448K588k250L250m482L655j073p7
1431D15Q65k925L545k645K822m512L798n20j398J628k464L236l437L114l781L151
1447H92k14k198K054j569K924m659L760k462J982j1k814K867j529K297m502M731
1463A549k476J28J192j756K104k293K655l642L812j628p03J409j501K910l633
1478a873L250l551L702j605j218K007j131K189m002M218k512J287n95o36K233
1493A763j966J863l733M768k805L44L64n64J504k384K979m057M361k611k31J113
1509G08l64P74k852L964l511L264k775K21J765j653J116k835M514m188K272q64
1525d44j14J140j745J969k963L980l295J389n18K34R67k308K664l036L774l348
$$ plain form
1416 1197 -1405 2255 -897 1598 -1332 708 2252 -1196 1392 -858 2392 -2090 1565 492 415
1431 415 1280 -1645 1900 -745 2077 -2435 1363 843 -555 1073 -1391 1845 -1592 1522 -2259 892
1447 892 678 -1520 534 -1035 1889 -2770 990 -1472 510 499 -2315 552 -977 1320 -3182 1549
1463 1549 -927 -799 393 -1363 741 -1552 1103 -2539 1273 -355 -1058 351 -1150 1760 -1873
1478 -1873 1377 -2174 1528 -77 -1295 712 -419 1770 -2232 1986 -526 761 166 -470 1763
1493 1763 -203 1660 -2073 2695 -110 234 598 34 1538 -846 2133 -1924 2437 -174 -405 708
1509 708 344 1118 -1734 2230 -1281 1983 -792 -571 1194 -459 657 -2178 2336 -1852 420 -444
1525 -444 -558 582 -1163 806 -2157 1823 -1472 -83 -601 -367 600 -1708 956 -2080 1694 -1654
1541a654Q46P92K1o7k405M788m139K332j369R20J9o68J249k686M185l892K452
1558G24r80L40J61r01J265k260M519m584J846M99M68r12j219L131l232L509l858
1575a484K548J25j287N48r00K582l854L403k418J841n54m91P36j983L728l778
1591a238J810j491K076j098j305K443k521L152l823K671p91N1o73O5K438m235
1607b469L396k300J516j057Q96l98q95K718l773L412k272J526p08p1K25n19K600
1624A827m699L866j093K15j383J255J111k483K759k822K959k066P25j67k64J420
1640A160k399K992l088K861j527M74l28K1K020l842L130j681J688k436J478M52
1656I75j419J788k792L347k320R30r72J160J58k200L165l289K616j974J751j812
$$ plain form
1541 -1654 -808 -16 5 -62 -2467 2321 -1818 514 -855 65 84 -584 665 -2021 2164 -1728 724
1558 724 -256 84 245 -656 609 -1651 2868 -1716 130 629 1097 185 -1034 2097 -1135 2374 -1484
1575 -1484 1064 1189 -98 450 -450 2132 -1722 1681 -737 1104 550 59 795 -1188 2540 -1238
1591 -1238 572 -919 1157 59 -1246 1197 -1324 1828 -1995 676 -115 -64 -737 -672 1766 -2469
1607 -2469 927 -1373 143 -914 -18 -416 -1311 1407 -2366 1046 -1226 300 -408 -479 -254 -773 1827
1624 1827 -2872 994 -99 116 -1267 -12 1099 -1384 1375 -1447 1512 -554 171 4 -260 1160
1640 1160 -1239 1753 -1335 1526 -1 473 145 166 2186 -1656 1474 -207 1481 -955 523 975
1656 975 -444 1344 -1448 1899 -421 509 -463 697 855 -1345 1820 -1469 1147 -827 924 -888
1672h88J020P38k666K968k306K088k435J658n41J52N19k574L748k635J323j450
1688a281J757q95m94J749k669K765k188J943j734J623n03j527K186j908K444k590
1704a322J864j249J453m83j737L251k465J656k237K717j760L30O97j854K651k531
1720a019K179j997K306j442j58J519k328K822k602J666j652K213j528n52K275
1735A702k531K091k361K395j997J377o02j054K631k869J963j743K025j907P92
1750h8M45j705K484k506J684j671K259j650p1J307j692J941k227K001j931K186
1766G66j741J8J821k107J946k050K472k314J723j020l69K053k245J614j550K289
1782A306k639J648J11n64J317k373K433j924K087k220J280M12j395J660j816K321
$$ plain form
1672 -888 132 870 -1796 1172 -1134 954 -1481 177 -364 -212 307 -2267 1481 -1154 169 -1281
1688 -1281 476 -419 -913 836 -1833 932 -1256 687 -1047 576 73 -1454 732 -1176 1268 -1322
1704 -1322 542 -707 746 263 -1474 1777 -688 968 -1269 1448 -312 18 715 -1139 1512 -1019
1720 -1019 1160 -837 1469 27 -131 1388 -940 1882 -720 946 -706 1507 -21 -573 1702
1735 1702 -829 1262 -1099 1296 -701 676 74 -980 1651 -1218 745 -998 1027 -880 -88
1750 -88 357 -1348 1136 -1370 314 -1357 902 -748 -819 488 -1204 737 -1490 511 -1420 766
1766 766 -975 -957 864 -1243 703 -1347 1125 -1189 534 -486 -855 1198 -1047 567 -983 1306
1782 1306 -1333 315 426 -138 1179 -1194 1239 -685 1402 -818 462 874 -521 1139 -677 1644
1798A644k547K355j818Q53P68k057J834j490K392k880J923j001l3J152k149J812
1814G58j610K120k864K211l17j001J616j718J939k052K035k635J990p1j468J749
1830F82j509J896k838K722k132J231j8j176J511j348J879k673K660j568O84Q2
1846H5j165J703j842K136k457K583j445k16J164j261J519k265K747k612K318j062
1862g0p35J270o07J355k590L024k479J326m8n89J252j744J605k416L137j962N74
1879C03n1l31R96j697K365k919K668j379Q9N56o28R68j894K616k953K207r23l28
1897c35O35r06J309k178K930k538J425p38J79N11r24J367k538L063k421J137k43
1914b65k57N95j244K084k555K499j902N73L15k57O82j613K638k834K378j256L42
$$ plain form
1798 1644 -903 1452 -366 487 1255 -802 1032 -458 1934 -946 977 -24 -57 1095 -1054 758
1814 758 -852 1268 -1596 615 298 -703 913 -805 1134 -918 1117 -1518 472 401 -1067 682
1830 682 -827 1069 -1769 953 -1179 52 34 -1142 369 -979 900 -1773 887 -681 3 85
1846 85 -1080 623 -1219 917 -1540 1043 -402 -618 546 -715 804 -1461 1286 -1326 992 -70
1862 -70 -805 465 -142 1213 -1377 1647 -832 494 446 -143 1109 -635 970 -1446 1691 -271 303
1879 303 252 -79 917 -780 1585 -1334 1334 -45 44 600 -28 940 -954 1662 -1291 916 -7 -335
1897 -335 300 -606 703 -1475 1455 -1083 342 -396 -217 294 -630 737 -1801 1262 -1159 -22 -265
1914 -265 -522 73 -1171 913 -1642 857 -1045 -472 -157 -414 268 -1345 1293 -1541 837 -419 -77
1931g7L32o64R45j598K539k665J746o43K66Ol91J156k077L083k633J304m90L56
1949D95j32p84J518k117K417k191J445l18k47K95j182K506k831K125j596J090
1965D93m71j13P61j560K307k596J924j109N81n00PR59k049K604k289J461q55P54
1983C09p09j88J412k466K466k031J553r26N83r5p16J734k447K367j624J047o36
2000c67J71N62j246J820k351K405j708J159o66n0P91j456K346k245J585j220M01
2017f9j37O4J098k005K495j852J184j153Q74m63k41J602k638K663j764J221j263
2034c84J221m20j091J524j753K141j365N69r75J046j5j404J993k245K089j459
2050e28J111j030O76L70j813J995j629J270j135J125p27k61J214j998K110j679
$$ plain form
1931 -77 255 -409 536 -1062 1477 -1188 558 -85 181 187 -204 952 -1125 1958 -675 629 139 495
1949 495 363 -421 1097 -1020 1397 -794 651 333 86 381 -801 1705 -1126 999 -597 493
1965 493 22 -91 670 -890 1417 -1179 745 -364 217 -283 -276 683 -1366 1238 -1051 410 -445 309
1983 309 -400 -588 824 -1642 824 -1207 346 -580 3 -92 -808 926 -1521 846 -778 269 -367
2000 -367 -196 366 -880 940 -1411 994 -714 445 -221 -271 520 -936 1410 -835 750 -470 -69
2017 -69 -206 -142 956 -1049 1446 -406 778 -375 499 36 -205 1397 -1241 1422 -342 879 -384
2034 -384 837 417 -674 850 -903 1238 -127 442 -533 513 498 -906 1087 -1158 931 -528
2050 -528 583 -447 229 599 -1214 781 -848 422 -713 412 -315 -576 638 -1360 750 -929
2066i29J354j078N16J00o41J542k176K435j815J765j879J110n0j548K088j178
2082c84J288j482J593j626P08N74j426J932k545K659k047J481j238M56J382k076
2098g51J436j547J569o48Q37r32J68J101j703J335j616J678j123R38r63m8J509
2115A240j950J453j659K385k126Q31k47l58J164j709J307j458K299k043J589n90
2131A28q93J413j223J002j436J999j347j13J243j867J614j742K176k090J575j164
2147g25l46J074j245J739j459J462j555J800o94m35R28j538J707j206J599j940
2163h34J100k57m94J405j584J474q41Q33j327J261p85m64M85m26R97j237J995
2180A301j341m5M66j41J083k072J652j574J539o19O6K46j054J680j271J044j608
$$ plain form
2066 -929 425 -653 -137 -37 -678 864 -1312 1123 -692 1073 -806 304 254 -1294 794 -384
2082 -384 904 -578 1015 -611 97 671 -755 1177 -1368 1291 -756 725 -513 -57 1325 -751
2098 -751 685 -862 707 59 896 -36 132 1233 -470 865 -751 927 -196 742 -221 -269 1240
2115 1240 -710 743 -916 1469 -657 174 -73 -431 733 -976 331 -1127 1172 -871 718 128
2131 128 -765 648 -575 427 -1009 990 -357 -470 773 -1094 520 -1222 954 -1136 439 -725
2147 -725 -1071 3 -1242 497 -962 500 -1055 745 51 -384 544 -994 713 -493 1106 -834
2163 -834 266 9 -485 920 -664 810 -31 802 -525 736 -49 -513 -28 -454 543 -694 1301
2180 1301 -40 -85 381 240 1323 -749 903 -671 868 249 315 561 -493 1187 -84 960 -648
2197f48J154o49m48J076q74J438j944J778j800J377k95o38N87j297K418k285J841
2214G91j929O98M89n17J294j158O60j516J470l09p09J203j233J728j711J368j934
2231a315J997p27k58R47q83J233j853J903j404J108o26j33J062r29J099k412K411
2248A220j537R63j72j533J988j801J674j766K458j494N67l64m08Q61j161J651
2264A146k226K323j063r7K62o02Q89j601J263j171J771j827J109Lo45J690j826
2281f02K285j805N23n01l51J191j910J898j690J873j328J93j35j67R43j343J228
2298C02j544J648j255J201m13N1k1m79J590j613Q04q91K28J258j719J716j726
2315h63K341k122J115L76j066M62k36N19j243K265k232J005n3l18N0P5K45n81
$$ plain form
2197 -648 506 -143 -591 485 -389 1049 -895 883 -917 460 165 -473 114 -1183 1235 -1050 791
2214 791 -1138 -440 49 -468 826 -332 328 -1188 282 -27 -736 467 -766 962 -749 619 -1315
2231 -1315 682 -45 -303 644 -239 994 -859 1044 -360 748 122 -11 1051 122 1221 -1191 1220
2248 1220 -317 646 474 -1059 929 -872 802 -964 1494 0 567 203 -205 656 -505 1146
2264 1146 -1080 1243 180 83 345 -257 632 -969 294 -877 894 -933 176 179 -466 1224 -602
2281 -602 1683 -122 401 -100 -451 740 -1170 728 -962 911 -417 -224 -359 -526 417 -926 302
2298 302 -1242 406 -849 352 -61 -10 -31 -510 1080 -533 271 -620 -392 866 -853 863 -863
2315 -863 1478 -644 471 847 -219 243 7 526 -717 1548 -684 321 268 -50 0 75 320 -261
2333b61O67j42oM92j34k31l70J629k497J433q42N99j04j303J709j130J814j790
2351d67P64K79j87k17j217P13o46J372j230J699m45j63l74k20l8j093K139j263
2369e94J70n86R5J170j88P01j181J004r44K48p43J196M94j220N23j080J221m22
2387a36M35l69J10Q16j582J477j236Q81m93K65n96j32J082p30J262j728R60r08
2405f22J101j56o52J238j449J439j037J11L04k08M8p53J612j350J156r66K76l11
2423b19J56Q54j765J727j576P10p40M49J37j18P56q82P82j001P63p6K91n13n7
2442c22O51j110Q44q70J437j561J370n72n01O95m40J033j268J036p13K02K02p62
$$ plain form
2333 -261 406 264 258 750 616 385 15 1644 -853 580 -262 337 233 -1070 639 -491 1323 -467
2351 -467 297 576 389 172 -1045 -332 -978 394 -836 863 418 255 -119 -339 -377 -1470 669 -594
2369 -594 -424 -1010 -915 255 67 768 -413 591 -353 -105 -848 348 842 -378 145 -935 286 -136
2387 -136 299 -70 40 856 -726 751 -485 396 -97 168 -428 -560 522 -208 1054 -674 286 -622
2405 -622 479 323 -329 909 -540 899 -138 -27 277 69 117 -636 976 -374 782 -184 92 -219
2423 -219 -63 791 -974 753 -823 -113 -853 -404 -267 -385 371 -511 271 -730 33 -43 248 -265 -322
2442 -322 329 -781 63 -807 630 -931 439 -133 -634 61 -379 654 -614 422 -291 -89 113 -649
$$ [...]
8191C4
##END NTUPLES=NMR FID
##END=
