##TITLE=1H_Pr A3A-2
 CDCl3,8 sc, 
 5.02.2021
##JCAMPDX= 6.0         $$ Bruker NMR JCAMP-DX V2.0
##DATA TYPE= NMR FID
##DATA CLASS= NTUPLES
##ORIGIN= UXNMR, Bruker Analytische Messtechnik GmbH
##OWNER= root
$$ XWIN-NMR		Version 3.5
$$ Fri Feb  5 12:18:24 2021 Russian Standard Time (UT+4h)  she@DPX200
##.OBSERVE FREQUENCY= 200.1315066352
##.OBSERVE NUCLEUS= ^1H
##.DELAY= (6, 6)
##.ACQUISITION MODE= SIMULTANEOUS
##.ACQUISITION SCHEME= undefined
##.AVERAGES= 8
##.DIGITISER RES= 18
##SPECTROMETER/DATA SYSTEM= spect
##.PULSE SEQUENCE= zg30
##.SOLVENT NAME= CDCl3
##.SHIFT REFERENCE= (INTERNAL, CDCl3, 0, 15.7039)
##AUDIT TRAIL= $$ (NUMBER, WHEN, WHO, WHERE, WHAT)
$$ ##TITLE= Audit trail, XWIN-NMR		Version 3.5
$$ ##JCAMPDX= 5.01
$$ ##ORIGIN= Bruker BioSpin GmbH
$$ ##OWNER= she
$$ F:/spectra/data/she/nmr/H-F/1/audita.txt
$$ ##AUDIT TRAIL=  $$ (NUMBER, WHEN, WHO, WHERE, WHAT)
(   1,<2021-02-05 12:16:51.29 +0400>,<she>,<DPX200>,
      <created by zg, POWCHK disabled, PULCHK disabled
       configuration hash MD5:
       00 E9 B6 7A A2 85 ED C7 34 08 36 98 17 FE 4E 26
       data hash MD5: 16K
       46 BE A1 B0 E9 82 42 82 3E 8B DE E1 0C 89 E1 4D>)
$$ ##END=
$$ 
$$ hash MD5
$$ 89 C5 C0 E6 49 2A 21 76 3C 24 E2 78 20 88 94 A1
##$RELAX= 
##$RELAX= 
##$RELAX= 
##$RELAX= 
##$RELAX= 
##$RELAX= 
$$ Bruker specific parameters
$$ --------------------------
##$DU= <F:/spectra>
##$EXPNO= 1
##$NAME= <H-F>
##$PROCNO= 1
##$TYPE= <nmr>
##$USER= <she>
##$AMP= (0..31)
100 100 100 100 100 100 100 100 100 100 100 100 100 100 100 100 100 100 
100 100 100 100 100 100 100 100 100 100 100 100 100 100 
##$AQSEQ= 0
##$AQ_mod= 1
##$AUNM= <au_zg>
##$AUTOPOS= <>
##$BF1= 200.13
##$BF2= 200.13
##$BF3= 200.13
##$BF4= 200.13
##$BF5= 200.13
##$BF6= 200.13
##$BF7= 200.13
##$BF8= 200.13
##$BYTORDA= 1
##$CFDGTYP= 0
##$CFRGTYP= 5
##$CHEMSTR= <none>
##$CNST= (0..31)
1 1 145 1 1 1 1 1 1 1 1 1 1 1 1 1 1 1 1 1 1 1 1 1 1 1 1 1 1 1 1 1 
##$CPDPRG= <>
##$CPDPRG1= <>
##$CPDPRG2= <>
##$CPDPRG3= <>
##$CPDPRG4= <mlev>
##$CPDPRG5= <mlev>
##$CPDPRG6= <mlev>
##$CPDPRG7= <mlev>
##$CPDPRG8= <mlev>
##$CPDPRGB= <>
##$CPDPRGT= <>
##$D= (0..31)
0 1.2 0 0 0 0 0 0 0 0.06 0 0.03 0 0 0 0 0.0002 0 0 0 0 0 0 0 0 0 0 0 0 
0 0 0 
##$DATE= 1612513010
##$DBL= (0..7)
120 120 120 120 120 120 120 120 
##$DBP= (0..7)
150 150 150 150 150 150 150 150 
##$DBP07= 0
##$DBPNAM0= <>
##$DBPNAM1= <>
##$DBPNAM2= <>
##$DBPNAM3= <>
##$DBPNAM4= <>
##$DBPNAM5= <>
##$DBPNAM6= <>
##$DBPNAM7= <>
##$DBPOAL= (0..7)
0.5 0.5 0.5 0.5 0.5 0.5 0.5 0.5 
##$DBPOFFS= (0..7)
0 0 0 0 0 0 0 0 
##$DE= 6
##$DECBNUC= <off>
##$DECIM= 32
##$DECNUC= <off>
##$DECSTAT= 4
##$DIGMOD= 1
##$DIGTYP= 9
##$DL= (0..7)
0 120 120 120 120 120 120 120 
##$DP= (0..7)
150 150 150 150 150 150 150 150 
##$DP07= 0
##$DPNAME0= <>
##$DPNAME1= <>
##$DPNAME2= <>
##$DPNAME3= <>
##$DPNAME4= <>
##$DPNAME5= <>
##$DPNAME6= <>
##$DPNAME7= <>
##$DPOAL= (0..7)
0.5 0.5 0.5 0.5 0.5 0.5 0.5 0.5 
##$DPOFFS= (0..7)
0 0 0 0 0 0 0 0 
##$DQDMODE= 0
##$DR= 18
##$DS= 0
##$DSLIST= <SSSSSSSSSSSSSSS>
$$ [...]
##$SUBNAM2= <"">
##$SUBNAM3= <"">
##$SUBNAM4= <"">
##$SUBNAM5= <"">
##$SUBNAM6= <"">
##$SUBNAM7= <"">
##$SUBNAM8= <"">
##$SUBNAM9= <"">
##$SW= 16.9725356469052
##$SWIBOX= (0..15)
0 0 2 0 0 0 0 0 0 0 0 0 0 0 0 0 
##$SW_h= 3396.73913043478
##$TD= 16384
##$TD0= 1
##$TE= 0
##$TE2= 300
##$TE3= 300
##$TEG= 300
##$TL= (0..7)
0 120 120 120 120 120 120 120 
##$TP= (0..7)
150 150 150 150 150 150 150 150 
##$TP07= 0
##$TPNAME0= <>
##$TPNAME1= <>
##$TPNAME2= <>
##$TPNAME3= <>
##$TPNAME4= <>
##$TPNAME5= <>
##$TPNAME6= <>
##$TPNAME7= <>
##$TPOAL= (0..7)
0.5 0.5 0.5 0.5 0.5 0.5 0.5 0.5 
##$TPOFFS= (0..7)
0 0 0 0 0 0 0 0 
##$TUNHIN= 0
##$TUNHOUT= 0
##$TUNXOUT= 0
##$USERA1= <user>
##$USERA2= <user>
##$USERA3= <user>
##$USERA4= <user>
##$USERA5= <user>
##$V9= 5
##$VALIST= <valist>
##$VCLIST= <CCCCCCCCCCCCCCC>
##$VD= 0
##$VDLIST= <DDDDDDDDDDDDDDD>
##$VPLIST= <PPPPPPPPPPPPPPP>
##$VTLIST= <TTTTTTTTTTTTTTT>
##$WBST= 1024
##$WBSW= 4
##$XGAIN= (0..3)
0 0 0 0 
##$XL= 0
##$YL= 0
##$YMAX_a= 339974
##$YMIN_a= -360313
##$ZGOPTNS= <>
##$ZL1= 120
##$ZL2= 120
##$ZL3= 120
##$ZL4= 120
##$ABSF1= 10
##$ABSF2= 0
##$ABSG= 5
##$ABSL= 3
##$ALPHA= 0
##$AQORDER= 0
##$ASSFAC= 0
##$ASSFACI= 0
##$ASSFACX= 0
##$ASSWID= 0
##$AUNMP= <proc_1d>
##$AZFE= 0.1
##$AZFW= 0.1
##$BCFW= 1
##$BC_mod= 2
##$BYTORDP= 1
##$COROFFS= 0
##$CY= 11.3945322036743
##$DATMOD= 1
##$DC= 2
##$DFILT= <>
##$DTYPP= 0
##$F1P= 15.9154993809931
##$F2P= -4.1035820241983
##$FCOR= 0.5
##$FTSIZE= 0
##$FT_mod= 4
##$GAMMA= 1
##$GB= 0.15
##$INTBC= 1
##$INTSCL= 1
##$ISEN= 128
##$LB= 0.24
##$LEV0= 0
##$LPBIN= 0
##$MAXI= 10000
##$MC2= 0
##$MEAN= 0
##$ME_mod= 0
##$MI= 1.114404
##$NCOEF= 0
##$NC_proc= 0
##$NLEV= 6
##$NOISF1= 3.799351
##$NOISF2= 2.8
##$NSP= 1
##$NTH_PI= 0
##$NZP= 0
##$OFFSET= 15.70392
##$PC= 1
##$PHC0= -10761.71
##$PHC1= 12.80094
##$PH_mod= 1
##$PKNL= yes
##$PPARMOD= 0
##$PSCAL= 0
##$PSIGN= 0
##$REVERSE= no
##$SF= 200.130013532006
##$SI= 16384
##$SIGF1= 3
##$SIGF2= 2
##$SINO= 400
##$SIOLD= 16384
##$SREGLST= <1H.CDCl3>
##$SSB= 0
##$STSI= 0
##$STSR= 0
##$SW_p= 3612.71676300578
##$SYMM= 0
##$S_DEV= 0
##$TDeff= 0
##$TDoff= 0
##$TI= <>
##$TILT= no
##$TM1= 0
##$TM2= 0
##$TOPLEV= 0
##$USERP1= <user>
##$USERP2= <user>
##$USERP3= <user>
##$USERP4= <user>
##$USERP5= <user>
##$WDW= 1
##$XDIM= 8192
##$YMAX_p= 0
##$YMIN_p= 0
$$ End of Bruker specific parameters
$$ ---------------------------------
##NTUPLES= NMR FID
##VAR_NAME=  TIME,          FID/REAL,        FID/IMAG
##SYMBOL=    X,             R,               I
##VAR_TYPE=  INDEPENDENT,   DEPENDENT,       DEPENDENT
##VAR_FORM=  AFFN,          ASDF,            ASDF
##VAR_DIM=   8192,          8192,            8192
##UNITS=     SECONDS,       ARBITRARY UNITS, ARBITRARY UNITS
##FACTOR=    0.0002944,     1,               1
##FIRST=     0,             0,               0
##LAST=      2.4114304,     0,               0
##MIN=       0,             -360313,         0
##MAX=       2.4114304,     339974,          0
$$ Real data points
##PAGE= N=1
##DATA TABLE= (X++(R..R)), XYDATA
0 0 0 0 0 0 0 0 0 0 0 0 -8 8 -8 8 -16 16 -16 24 -32 35 -40 48 -56 72 -80 96 -111 128 -144 167 -190 216 -244
33 -244 276 -311 351 -393 441 -490 546 -606 675 -747 827 -912 1007 -1111 1224 -1346 1485
50 1485 -1634 1801 -1985 2192 -2424 2687 -2988 3335 -3741 4226 -4812 5539 -6467 7699 -9409
65 -9409 11950 -16100 23996 -44060 193236 267401 -360313 -10112 227731 -108610 -101135 98907
77 98907 5938 19134 -51771 -3610 146645 -66873 -133571 151356 29796 -176682 100879
88 100879 93207 -150686 18992 115196 -34470 -60636 20825 29766 26228 -67942 -20049 92629
100 92629 -38145 -70793 64497 43000 -62877 -12446 26867 28722 -11581 -66032 35622
111 35622 33819 -61213 -1340 55752 -54502 -10930 70846 -39155 -22650 38648 -17773 -35952
123 -35952 24001 -393 -11395 -6656 -17611 56135 5861 -64258 22105 49143 -56938 -9850
135 -9850 44460 -46040 3379 41607 -24569 -8243 43665 -22437 -23533 37117 -5160 -14277 -12818
148 -12818 4985 32683 366 -43145 27539 45627 -48133 2501 35859 -24591 -14177 30215
160 30215 -12598 -8759 27001 -21318 937 25428 -1261 -14668 2091 932 9904 5099 -34604
173 -34604 11493 23163 -13299 -10492 17124 1800 -10417 2737 -7591 12160 -9524 -22115
185 -22115 8566 20411 -11296 -15252 14505 436 3324 -8204 -8319 -1741 402 -2130 -8224 3915
199 3915 1653 4398 -12266 7518 13715 -15374 -14859 7214 14876 -13872 -8211 648 14506 2493
213 2493 -10764 5591 2734 -234 -4281 3644 -4152 7247 -4187 -11517 22479 9309 -16991
226 -16991 -5243 24000 -2250 -6665 -701 -4425 11177 183 -4847 2375 11649 -7908 4362
239 4362 8671 -7149 5487 -4738 -8111 7830 15165 -21674 -6268 23304 438 -7505 -4081
252 -4081 4333 36 1565 -13031 2364 10127 -14484 -1958 11761 4503 -14606 816 1290 1841
266 1841 1145 -14546 -2709 6593 4600 -11297 2155 2091 -1044 2459 -6325 283 400 -1541 -12192
281 -12192 9229 8482 -11630 -5768 9047 11243 -9803 -2900 -1317 6781 1190 -8304 973 6202
295 6202 2389 -8336 11158 3257 -3129 -440 -72 3938 3158 -1735 -12241 13176 8089 -6172
309 -6172 -1201 5496 3983 -650 1682 -8211 9106 191 -9928 5419 10377 -5513 -8312 11369
323 11369 559 1948 -5605 -7296 6076 5922 -8503 -7985 12625 -3715 -2937 2203 -246 -1704
337 -1704 -1233 -3498 -3793 9409 -9828 -6633 6089 4336 -4405 -3753 498 -2320 7905 -8770 -7129
352 -7129 5196 2969 -7572 -1488 8806 -5427 172 -1659 3327 2883 -4071 -7681 3723 11536
366 11536 -10328 -2123 5069 4700 -1425 669 223 -136 5945 -7330 2259 5714 -891 -5772 6457
381 6457 7107 -4060 3043 -3597 3043 5457 -627 -8671 4408 8431 -6024 2090 612 2596 -122
396 -122 342 -2538 4267 1644 -12487 5517 7150 -3729 -8550 5853 2889 -2191 130 -6466 3744
411 3744 -155 -3537 -3796 4387 -2844 -4033 4998 -3918 887 -159 -2994 -5528 7390 30 -11928
426 -11928 2437 4844 1417 -7122 626 2515 3452 -5806 -5003 10789 -3699 -8691 3741 10712
440 10712 -9051 -2698 8560 -2111 318 1315 369 -3644 5642 -903 42 1707 -2763 7279 1259
455 1259 -4766 831 12104 -8352 -6529 13830 669 -9578 957 11892 -4179 -1967 587
468 587 2634 4232 -5635 -2141 4659 4011 -11252 4231 7051 -7004 -464 4237 -1764 -4580 6821
483 6821 -6102 -2847 4315 -2529 -2503 323 431 -2569 4462 -7351 -499 6315 -5536 -5779 3058
498 3058 3293 -7021 1254 -1273 2291 1275 -6371 234 4557 -446 -9267 4924 3413 -2718 -3522
513 -3522 1817 5802 -3834 -1782 1072 6165 -4547 -2278 5270 558 -2698 442 7482 -5592 608
528 608 6043 -1116 -4657 5038 5081 -7651 2875 2560 2720 -1463 -2919 4098 6674 -5678 -7575 14919
544 14919 -2162 -10654 6206 6575 -7278 -762 5478 -3980 3942 -3859 -2601 5175 -1131 -6323
558 -6323 3407 2835 -9302 5946 1489 -7006 238 5595 -4713 -5962 6259 -1835 -3564 -2399
572 -2399 4160 -781 -4056 -282 911 3062 -5747 -1091 2285 2153 -5593 763 4511 -5552 2395
587 2395 1964 -2129 -1265 5697 -4611 -1745 7371 -3556 -1104 1809 2206 -520 2239 -3140 1942
602 1942 6187 -6602 1536 4478 -458 -3071 4880 19 -693 3498 -3444 3225 1482 -1279 -1579
617 -1579 3452 -1308 -286 3754 -4666 1373 3150 -299 -5119 4188 2030 -5824 1072 2096 97
632 97 -4819 2096 117 527 -1526 -3805 3525 -1015 -2539 -1348 3037 -5046 387 3433 -5885 517
648 517 2589 -2548 -4500 6241 -2741 -4413 3096 -968 253 -894 -601 -1360 4835 -3659 -2257 5339
664 5339 -2286 -1722 1679 2370 -3539 3132 117 -1380 3709 -639 -640 347 3268 -2905 2373 530 -1746
681 -1746 4260 376 -1993 595 6253 -4774 -213 5104 -1331 -2022 1360 3036 -2822 2328 -1978
696 -1978 1354 2186 -2778 18 1505 -444 -3218 4944 -3339 -2097 4239 -1825 -3477 2189 2512 -6917
712 -6917 2568 1188 -2830 -869 -151 -408 -637 1053 -4937 2937 175 -3454 166 965 -1869 -1850 3463
729 3463 -4125 1124 1233 -2281 -247 2307 -758 -3510 4319 -1979 99 1573 -1176 -759 3130 684
745 684 -4556 5526 -407 -1946 1600 2027 -1386 425 2599 -2510 4354 -716 -1705 2149 2176 -1999
761 -1999 378 3542 -3831 3307 1048 -2151 621 3114 -2282 -1259 5012 -3786 -24 1501 -187
776 -187 -953 1463 -1487 -1924 4410 -3577 -759 1352 -217 -2860 1289 148 -3526 3217 -2547 -1167
792 -1167 995 329 -3710 1073 1797 -4308 1877 -1177 -1305 -63 1340 -3202 295 2897 -4651 1386
808 1386 1185 -550 -1959 2290 -1158 -716 3316 -3510 1229 1721 -217 -2036 3444 -542 -1931 3888
824 3888 -1826 400 1763 921 -2404 3658 990 -3450 3694 163 -362 595 2294 -2627 2442 1835
840 1835 -3472 2927 870 -1160 -655 3258 -2927 296 2504 -3214 1728 1038 -1449 -1826 4164 -2628
856 -2628 -1876 2967 -2496 -533 771 -71 -3335 3499 -2015 -2776 3190 -1582 -2339 250 1874 -4172
872 -4172 1844 -173 -3192 2346 -184 -2401 -561 3089 -4329 933 1976 -3206 375 1023 -446
887 -446 -1470 3477 -3284 570 2952 -1703 -481 1336 464 -1993 4334 -1902 -1078 3144 -87 -918
903 -918 1250 2010 -3178 2913 412 -425 1239 -724 273 2064 1781 -4080 3160 1077 -1592 1137
919 1137 985 -740 -861 3115 -2592 1650 29 -1754 891 1027 -861 -2004 2469 -2899 973 1061
935 1061 -2077 -1061 1049 260 -2863 2294 -2257 -551 476 -712 -1123 17 -283 -3292 3476 -958
951 -958 -2767 -158 1741 -1367 -1264 1615 -2775 1687 -610 -327 489 508 -1928 226 3834 -3669 679
968 679 1338 -198 -184 2349 -837 -1648 3572 -1060 1210 -166 163 857 1504 -526 -299 3343 -2940
985 -2940 1460 2199 192 -1774 1077 1772 -644 1698 -1933 1488 61 244 55 195 -43 -938 2296
1002 2296 -1799 602 -427 -256 -1077 989 1006 -3630 1062 618 -296 -2399 1031 -785 -1388 1723 -2266
1019 -2266 401 -727 -623 -885 2013 -2153 -2015 3132 -2828 349 1795 -1540 -3625 4276 294 -4224
1035 -4224 2584 -443 -482 52 1003 -1635 1653 -527 -1357 4437 -1657 -1712 1494 2884 -2812 1490 1988
1052 1988 -2959 2035 2091 -492 -2157 3239 -25 -402 1844 -648 832 -309 920 79 2393 -2897
1068 -2897 -583 4754 -1693 -1949 1574 1570 -3508 3013 723 -3155 1572 393 -438 -636 1136 -2740
1084 -2740 1372 -401 -1527 1935 -2416 -1562 1620 1957 -5156 911 2068 -2670 -329 732 -21 -2708
1100 -2708 1547 -632 289 -599 -1524 801 -109 356 -1635 1538 -1893 225 2422 -1492 -1596 1539
1116 1539 2708 -4025 1877 1849 -1887 -304 2188 694 -1310 1439 -1658 2744 618 -1855 1424
1131 1424 1583 -1156 215 3698 -3653 1049 3031 -1642 -593 2553 -265 -2613 3699 -696 -31
1146 -31 10 -653 1139 1112 -1429 -1576 3936 -2343 -1015 1951 -542 -2103 850 1285 -3052 1673 -832
1163 -832 -1297 180 708 -1331 -1380 1050 -1844 1605 -1653 -1517 929 760 -2373 -639 3032 -3297 -186
1180 -186 1270 5 -1725 644 -75 -1063 2324 -2037 25 666 395 -927 971 -85 -1336 3038
1196 3038 -1513 -100 1517 749 -2107 1558 2492 -2442 1078 472 949 2 826 -999 871 2234
1212 2234 -2102 1441 439 -255 -443 2200 -832 -613 2187 -2384 931 1576 -380 -2515 2183 462
1228 462 -1644 1356 -1765 294 596 -99 -1995 1716 -420 -2848 2264 -560 -1350 -498 928 -1828
1244 -1828 1245 78 -3310 1561 445 -1067 -1125 1483 -2038 312 945 -2314 1363 25 -1013 -567
1260 -567 2863 -2055 -1195 2285 -715 613 6 -51 -947 2793 -836 -1133 2173 -551 140 553 1248
1277 1248 -1561 1673 -100 -582 2506 -604 -913 654 2733 -1769 877 689 -770 1302 284 -469
1293 -469 -349 2125 -1949 649 1662 -1457 -77 462 501 -1025 1591 -2343 50 1962 -1438 -1109
1309 -1109 392 784 -2274 1572 -1114 -798 805 -1307 -719 689 448 -3243 1586 196 -1424 255
1325 255 -477 -725 182 1168 -3202 1331 758 -1702 79 1018 -578 -969 1804 -1799 1105 795 -1637
1342 -1637 134 1932 -10 -1979 2291 -680 331 1081 -358 -271 1384 445 -2070 2827 -281 -1004
1358 -1004 991 1229 -685 110 1119 -1727 2550 58 -1477 804 1514 -964 -519 1868 -1716 1251
1374 1251 61 -757 218 1195 -1318 -1268 2535 -1738 -201 52 -47 -381 542 -940 -1400 2231 -1931 -739
1392 -739 378 181 -1730 369 298 -1692 1485 -1552 -605 810 250 -2014 212 1298 -1914 911
1408 911 -580 -457 224 726 -1657 446 1682 -2391 764 771 37 -786 1115 -499 209 2145 -1823
1425 -1823 538 1262 389 -1310 1576 458 -787 1721 -877 508 848 419 -1548 2124 855 -2168
1441 -2168 1514 373 -32 -111 972 -1418 1119 999 -2263 1174 531 -622 -752 1446 -1316 220
1457 220 810 -2074 1047 597 -1030 -1389 1961 -1158 -1134 901 -1168 195 -237 -438 -1219 1776 -1363
1474 -1363 -1400 1432 -738 -333 -258 589 -1329 1323 -612 -1462 1634 -224 -954 -423 1893 -1425 247
1491 247 516 -351 1048 -72 -392 8 2187 -1838 356 1815 -862 44 792 151 -831 2332 -1299
1508 -1299 -135 2109 -593 -665 826 838 -1033 1865 -1239 -150 2130 -1091 -867 1383 918 -2452
1524 -2452 1741 118 -1143 524 -172 -236 39 872 -2149 969 438 -967 -112 -14 -401 -405 1339 -2369
1542 -2369 478 851 -1580 -1094 1358 45 -2449 1494 -597 -393 0 -690 -525 798 -221 -2274
1558 -2274 2239 -736 -993 1057 38 -1164 936 851 -2477 2252 269 -1250 335 1270 -235 -245
1574 -245 972 -847 1821 -364 -783 996 1166 -1028 -139 2412 -1354 191 822 88 -392 1140 105
1591 105 -1271 1974 -285 -425 118 760 -725 365 70 -1123 2092 -1058 -1097 1111 914 -2343 395
1608 395 1819 -2421 722 16 -768 -295 786 -1732 -196 1248 -1986 655 -220 -870 -238 776 -1900
1625 -1900 -22 1925 -2570 -132 1072 -149 -1840 931 132 -914 857 -1140 541 220 58 -1033
1641 -1033 1196 203 -1348 1501 -237 -1 501 890 -1626 1133 1505 -1758 791 1039 117 -779 1364
1658 1364 -542 463 876 -1351 1230 773 -758 -800 2515 -975 -577 1849 -1018 96 868 -18 -1430
1675 -1430 1861 -285 -1345 1268 -445 -277 -145 108 -1146 1349 -944 -1483 1767 -307 -1402 -377
1691 -377 1223 -1899 481 262 -1608 538 15 -755 -538 1281 -1683 -183 642 -874 315 126 -587
1708 -587 -373 1825 -1584 -656 1593 -576 -808 439 738 -1286 1407 -405 -239 1268 -448 -346 840
1725 840 1189 -1559 1360 85 -237 1224 167 -596 674 1691 -1815 887 1139 -669 141 694 196
1742 196 -415 1253 -1616 794 906 -1182 -216 987 182 -1066 1518 -1181 -23 835 -638 -769 866
1759 866 99 -1915 1542 -555 -627 186 -168 -556 469 95 -2101 1438 -192 -960 -194 590 -913 -455
1777 -455 859 -1595 814 47 -1194 -132 987 -797 -879 1477 -939 497 242 -371 -21 1111 -374
1794 -374 -1036 1938 -867 -301 665 387 -599 842 283 -1056 2002 -499 -421 803 863 -740 568 899
1812 899 -1158 1484 -279 -359 661 979 -1305 384 1485 -1482 670 262 -63 -173 894 -1028 -23
1829 -23 1635 -1678 -23 610 -99 -881 887 -575 -848 1341 -1407 -172 416 -46 -1638 915 115
1846 115 -1341 984 -831 -273 192 285 -1711 794 603 -1560 882 5 -378 -400 908 -1058 340
1863 340 930 -1588 727 756 -85 -867 1374 -528 -20 1163 -959 500 734 -57 -1003 1653 -224
1880 -224 -712 1279 -112 120 335 512 -892 1732 -10 -1188 1393 150 -444 -44 1149 -1241 915
1897 915 414 -1149 885 91 -510 -556 1428 -1417 9 657 -909 204 4 -669 -802 1624 -1558
1914 -1558 -480 968 -679 -413 29 239 -1261 921 -975 -726 900 -863 -1294 486 667 -1619
1930 -1619 691 -106 -667 703 -97 -809 257 1156 -1784 741 630 -537 147 458 -160 -104 1306 -1474
1948 -1474 584 956 -675 27 947 258 -826 1393 -868 251 697 -126 -717 678 767 -1380 1343
1965 1343 -304 -212 375 -63 -176 666 626 -1585 1494 -380 -1020 517 727 -788 -29 1180 -1878 717
1983 717 50 -732 -394 863 -904 -668 1219 -1364 454 187 -862 -387 929 -866 -1336 1673 -950
2000 -950 -365 211 -66 -629 381 3 -1006 1255 -690 -259 436 394 -707 363 544 -877 1127 -259
2018 -259 -430 115 999 -737 -63 1293 -656 565 38 65 166 928 -624 -10 1717 -1132 179 720
2036 720 288 -790 1073 -171 -747 1555 -557 -104 364 534 -1102 798 153 -787 1132 -531 -134
2053 -134 286 236 -1581 892 756 -1420 545 109 -123 -482 594 -891 185 300 -1147 362 -38
2070 -38 -112 -754 829 -966 -320 879 -998 48 313 41 -1450 1195 -173 -947 799 -221 12
2087 12 -2 428 -951 1327 -220 -926 1163 32 -328 59 1039 -1301 959 581 -875 678 515 -214
2105 -214 -375 1457 -813 259 449 -433 707 171 -323 -298 1764 -964 -81 868 -450 -171 349 511
2123 511 -935 1114 -501 -530 732 -64 -370 -141 706 -1176 705 -441 -666 708 -223 -709 -46 1108
2141 1108 -1856 403 428 -596 -332 167 -362 -478 988 -1493 251 480 -745 -71 401 -290 -658 1262
2159 1262 -1285 143 596 -451 -583 641 415 -1202 1060 -237 -173 264 47 -299 512 585 -1132 1368
2177 1368 -55 -404 341 443 -371 -64 1180 -1226 886 513 -269 -223 733 -67 -346 1085 -738 530
2195 530 212 -377 -231 782 -367 -891 1451 -844 -337 376 189 -585 524 16 -1115 1070 -478
2212 -478 -410 71 198 -917 270 271 -1179 967 -364 -675 -88 626 -1219 -301 882 -921 257 -22
2230 -22 -340 -295 854 -680 -354 1126 -748 152 350 75 -497 782 -363 -511 1270 -750 -160 507
2248 507 572 -873 696 333 -554 941 -253 -85 151 676 -891 842 415 -1089 783 18 4 -133
2266 -133 809 -676 277 917 -963 370 256 -42 -524 839 -506 -130 795 -808 85 143 -125 -947
2284 -947 854 -345 -815 389 -479 -141 68 20 -1262 718 -136 -866 515 -69 -444 -239 666 -1072
2302 -1072 408 -125 -980 426 199 -437 -480 1085 -881 97 559 -688 137 392 -188 -588 1252 -882
2320 -882 -93 740 -67 39 499 237 -704 1234 -490 -354 1002 76 -261 245 741 -820 963 -8
2338 -8 -299 722 99 -456 160 1163 -1191 528 384 -434 31 275 -463 -284 1085 -1029 204 505
2356 505 -389 -329 229 -139 -880 977 -968 -52 544 -405 -712 337 88 -1166 786 -588 -207 385
2374 385 -226 -616 238 416 -1176 735 45 -413 222 379 -563 -27 621 -1233 769 294 -424 -153 760
2393 760 -228 -349 1070 -686 394 327 -226 -241 931 -260 -679 1213 -402 179 378 243 -285 761
2411 761 139 -920 1199 -217 -127 375 319 -433 419 495 -846 892 -18 -466 24 635 -746 -118 723
2430 723 -940 299 -15 -263 -368 573 -735 -474 760 -778 -66 95 -94 -678 618 -489 -653 988
2448 988 -554 -489 182 408 -1017 508 76 -821 600 -375 -374 118 491 -1018 513 504 -938 480 -12
2467 -12 -158 -140 779 -815 240 702 -800 316 487 79 -473 951 -449 115 924 -638 357 477
2485 477 49 -750 935 -73 -561 723 -137 -34 251 388 -900 661 179 -661 446 16 -72 -71 362
2504 362 -804 526 168 -786 337 164 -471 -360 838 -978 83 310 -682 119 154 -345 -761 927
2522 927 -1031 -377 396 -638 -36 207 -2 -906 1172 -517 -416 458 -174 -312 -17 458 -766 674
2540 674 -100 -402 553 1 -364 170 852 -944 486 353 -347 262 214 -254 -317 1180 -642 168 607
2559 607 -28 -3 449 224 -484 948 -656 -80 775 -183 -489 621 358 -923 1010 -263 -70 399
2577 399 33 -358 364 360 -1047 674 -244 -397 163 239 -628 86 577 -1357 525 220 -517 -321 549 -394
2597 -394 -404 632 -976 222 58 -308 -241 550 -298 -750 951 -506 -13 280 65 -507 441 67 -983
2616 -983 661 -194 -245 52 235 -525 430 422 -702 914 -146 -308 177 710 -375 141 787 -653 510
2635 510 199 -45 -180 795 -454 -201 913 -636 198 57 -104 -245 798 -425 -308 869 -478 -89
2653 -89 227 226 -829 479 94 -603 526 -402 -203 115 237 -966 311 289 -920 413 -84 -277 -136
2672 -136 494 -1014 -82 588 -867 196 263 -222 -661 682 -514 -145 523 -775 96 362 -10 -675
2690 -675 759 -186 -380 678 -397 -173 346 430 -750 720 264 -515 593 52 81 -85 396 -732
2708 -732 765 434 -604 634 244 -155 -137 985 -761 232 673 -322 153 176 -141 -491 1046 -456
2726 -456 -60 583 -354 -46 112 111 -793 875 -317 -524 471 -214 -457 161 455 -990 463 -258 -633
2745 -633 368 -27 -527 -173 741 -908 187 103 -674 118 242 -255 -425 826 -915 147 482 -261
2763 -261 -120 364 22 -340 779 -640 1 680 -191 -324 398 373 -596 920 -118 -116 419 204 -612 275
2783 275 608 -888 759 21 -282 115 398 -382 68 750 -847 431 118 -407 -125 497 -296 -340 749
2802 749 -613 216 342 -243 -390 647 -62 -604 690 -395 -17 99 -85 -618 248 -106 -797 853
2820 853 -458 -470 -26 149 -557 -46 287 -992 734 -189 -412 -191 409 -500 -11 455 -720 269 79
2839 79 -176 -344 640 -487 -217 985 -543 71 229 80 -196 908 -31 -406 927 -238 -44 315
2857 315 216 -654 361 232 -366 895 -244 20 75 632 -643 259 379 -626 654 -26 -91 -68 650
2876 650 -425 222 550 -780 179 201 -55 -353 640 -513 -95 606 -750 -90 133 78 -892 655 -196
2895 -196 -471 521 -352 -130 99 173 -768 571 -10 -762 383 -7 -306 -73 486 -691 415 155 -528
2914 -528 342 150 -93 -256 596 -643 132 319 -464 181 346 -131 -449 965 -340 -64 588 -183 31
2933 31 314 201 -592 1016 -154 -234 575 101 -197 91 459 -686 757 -109 -430 290 219 -293 -176 807
2953 807 -728 202 104 -419 86 149 -379 -317 663 -868 139 259 -250 -251 271 -95 -435 664 -478 -267
2973 -267 233 -169 -254 308 128 -779 598 -430 -293 286 8 -528 69 521 -728 395 -66 -204 159
2992 159 195 -358 152 688 -772 512 265 -69 -118 568 -184 -336 910 -454 210 506 -20 -134 565
3011 565 40 -424 836 -374 197 401 36 -382 529 101 -740 779 -265 -122 95 271 -519 199 226
3030 226 -690 401 -18 -197 -132 444 -438 -220 604 -646 434 7 -375 -286 581 -406 -374 577 -605 0
3050 0 9 74 -387 300 -182 -384 672 -387 -94 70 162 -556 556 -37 -536 647 -124 -123 77 399 -392
3071 -392 376 290 -426 285 54 0 -34 636 -517 91 624 -339 255 263 -91 -186 614 -59 11 514 -341 -21
3093 -21 122 253 -588 622 -239 -392 620 -262 -271 160 476 -825 385 79 -705 352 5 -82 -23 329
3113 329 -666 331 27 -567 176 -22 -201 -197 463 -587 67 338 -413 40 166 -7 -538 614 -342 -261
3133 -261 242 -327 -29 134 19 -526 607 -250 -350 415 54 -210 120 380 -746 634 -91 -504 469
3152 469 166 -167 -47 758 -578 443 187 -274 280 269 -277 -108 821 -535 113 358 -128 -18 231
3171 231 -84 -449 765 -434 21 432 -8 -323 274 -7 -597 542 -295 -257 134 53 -437 -18 327 -743
3191 -743 337 72 -219 151 125 -533 -60 498 -878 327 156 -377 -34 380 -266 -311 614 -678 64
3210 64 230 -168 -346 328 -34 -644 590 -397 -149 222 62 -305 424 316 -688 679 18 -260 249
3229 249 336 -336 448 335 -707 628 78 -70 -143 497 -312 38 556 -586 269 234 -152 -164 706 -299
3249 -299 -188 625 -423 123 149 70 -331 483 -158 -379 608 -321 -67 -17 65 -434 286 72 -466 563 -305
3270 -305 -387 -99 282 -541 206 162 -542 386 -234 -185 -193 464 -466 50 523 -448 207 -25 -54 -302 490 -409
3292 -409 -205 481 -403 -22 109 247 -395 516 -172 -358 582 -162 18 118 217 -464 538 190 -276 385
3312 385 -127 -17 14 385 -608 419 179 -398 238 123 -283 -53 603 -595 225 286 -372 238 97 31
3332 31 -361 518 -447 -167 204 -416 -106 179 48 -667 493 -336 -317 201 18 -195 -21 288 -685 479
3352 479 36 -509 228 9 -290 -116 572 -580 231 -62 -415 208 211 -156 -209 679 -475 55 205 -269
3372 -269 -44 366 -178 -334 687 -529 -172 172 -24 -214 111 211 -386 600 -130 -160 340 120 -359 282
3392 282 227 -455 614 35 -31 2 311 -303 -22 460 -661 376 345 -118 -171 188 -218 -72 514 -608
3412 -608 173 161 -270 -213 271 -130 -459 547 -448 -14 5 84 -494 279 234 -634 480 -220 -200 98 196 -460
3434 -460 276 163 -666 377 -66 -254 -83 198 -494 -92 389 -509 262 71 -53 -119 458 -196 -117 634
3454 634 -391 192 211 71 -159 548 63 -439 672 -273 4 199 211 -179 422 132 -405 477 -163 -185
3474 -185 91 406 -522 178 272 -395 306 162 -74 -41 341 -338 -110 309 -489 86 20 -152 -261 498 -312
3495 -312 -183 540 -529 -16 120 -76 -490 387 -40 -433 345 -169 -125 64 185 -742 245 -101 -363 236
3515 236 -63 -108 -35 442 -406 207 255 -606 15 129 -24 -144 445 -303 320 364 -196 -45 173 135 -252 545
3537 545 -134 -162 474 -139 -3 308 113 -328 420 -8 -76 239 -38 -162 170 85 -523 662 -52 -244 91
3558 91 4 -193 -138 193 -402 239 178 -320 28 153 55 -405 497 -381 -219 151 -129 -51 96 -26 -382 361
3580 361 -386 -106 210 -165 -201 220 198 -513 387 -201 -275 368 166 -379 61 286 -529 378 33 -156 283
3601 283 420 -124 12 419 -480 347 156 -2 33 310 -254 -109 516 -304 135 384 -40 -137 269 -30 -319
3622 -319 509 -272 -196 231 -165 -300 201 259 -397 295 -272 -93 225 123 -340 170 276 -460 340 -49 -300
3643 -300 -115 307 -239 -112 263 -570 194 207 -116 -224 409 -353 -270 463 -470 122 -35 -136 -284 448 -126
3664 -126 -379 550 -355 -97 -4 141 -350 270 221 -525 586 30 -164 90 321 -294 177 303 -417 344
3684 344 111 -45 -55 463 -175 174 389 -319 178 87 -54 -158 562 -301 -77 533 -182 13 298 91 -491
3705 -491 427 -212 -212 440 -314 -66 31 256 -512 359 28 -477 411 13 -129 23 280 -514 155 135 -424
3726 -424 46 -50 -11 -188 274 -452 -80 311 -355 80 182 -49 -262 361 -248 50 269 -125 -130 302 114
3747 114 -427 545 -18 -133 427 -97 -132 280 286 -291 478 46 -285 302 171 -102 -52 366 -295 113 221
3768 221 -364 46 105 -136 -90 356 -441 -108 246 -233 143 73 -180 -429 447 -346 -159 181 -117 -146 248
3789 248 73 -364 330 -249 -44 409 132 -380 26 353 -494 243 -81 -360 -28 160 -281 2 381 -663
3809 -663 -43 169 -253 -34 115 -228 -131 435 -447 253 222 -18 20 140 72 -339 493 -207 -97 205 148 -208
3831 -208 327 87 -270 512 154 54 109 209 -279 250 257 -451 362 38 -66 -51 301 -273 -66 411 -345
3852 -345 328 53 -70 -178 367 23 -282 254 -382 -16 57 -172 -406 245 -210 -388 359 -251 -176 -20 108
3873 108 -423 357 60 -571 159 -46 46 -31 125 -372 43 110 -432 107 35 -298 -215 237 -421 168 259 -201
3895 -201 189 65 -74 -189 133 51 -116 494 -323 209 108 188 -176 818 -12 -134 741 -175 89 18 739
3916 739 -297 369 406 211 73 172 -78 -154 273 -249 -79 579 -152 -28 -96 8 -321 308 -198 -22 111
3937 111 -67 -339 223 26 -420 542 -193 54 -25 -56 -157 -223 223 -610 334 -294 -216 -83 -25 277 -415 433
3959 433 -649 44 352 -490 -197 150 -689 -222 323 -436 70 126 -212 53 39 -236 -509 299 -578 194
3979 194 348 -410 -236 666 -57 -108 -16 -278 332 412 -17 -278 194 47 -335 455 -220 -114 264 -13 -360
4000 -360 409 274 -241 397 80 -151 38 246 -376 210 503 -420 214 42 -158 135 45 0 -290 616 -424
4021 -424 -74 107 -50 -152 24 35 -238 590 -366 -82 94 -30 -151 66 112 -378 247 -208 -92 60 246
4042 246 -260 103 124 -516 195 -50 -47 42 299 -189 17 399 -417 177 195 -2 -77 490 -123 -162 318 -353
4064 -353 98 135 140 -278 298 -134 -307 393 -209 -51 76 102 -177 273 140 -294 240 -7 -67 -15 191 -234
4086 -234 167 145 -160 320 -43 -172 -136 319 -185 128 222 -342 59 50 -178 -312 351 -149 -173 221 -231 -162
4108 -162 79 -46 -380 470 -249 -287 289 -154 -161 55 290 -334 261 189 -284 367 20 -169 32 193 -369
4129 -369 9 202 -172 220 -87 -84 -91 329 -326 99 162 -328 214 -60 -11 -317 517 -165 7 371 -159 2
4151 2 85 74 -532 234 -193 -78 175 -29 -118 -38 145 -434 208 -43 -209 247 12 -169 -92 299 -367 43
4173 43 62 -321 -26 89 -237 -196 244 -338 50 169 -78 -100 190 -7 -240 502 -136 -43 136 -214 -31 106
4195 106 115 -397 345 -124 -256 80 143 -193 -74 195 -384 302 1 -145 197 324 -109 76 322 -359 121
4216 121 134 77 -30 126 -181 -70 392 -363 142 127 121 84 240 -119 -68 546 -54 78 295 81 -474 -123
4238 -123 103 -82 495 53 -207 144 -53 -450 -153 55 -342 181 -149 -132 302 355 -148 -70 342 -455 -38
4259 -38 357 93 -150 173 -39 -4 -193 -683 -154 106 -300 -228 497 104 -164 510 -305 443 46 -23 -214
4280 -214 66 220 -237 210 -321 39 181 294 -511 248 342 -392 365 -1 86 -105 264 -133 -70 208 -356
4301 -356 227 164 80 -192 253 -27 -135 128 -312 51 51 96 -263 397 -67 -391 46 -280 -29 16 174 -273
4323 -273 338 -5 -153 94 -193 -348 -168 213 -150 392 32 -150 310 264 40 -38 558 -217 -16 651 -28
4344 -28 293 78 272 -396 434 -343 -23 531 -234 -80 300 526 -260 132 -31 147 590 114 402 27
4364 27 501 -462 -31 220 -373 208 -16 35 -87 81 -418 115 -64 -111 31 269 -106 -137 201 -244 62
4385 62 307 -245 -79 72 3 -178 302 -336 -27 151 -13 -92 142 155 -220 402 -161 -70 202 -77 -156 43
4407 43 148 -355 253 5 -239 68 -92 -75 -11 191 -251 236 181 -260 58 232 -74 -136 378 -291 -56 94
4429 94 -170 -93 287 -107 -256 422 -32 84 112 29 -34 137 138 -301 287 -88 1 101 120 -142 32 106 -116
4452 -116 309 10 -98 -44 106 -243 18 330 -232 156 45 -36 -140 219 -194 -216 346 -253 -95 7 -127
4473 -127 -54 176 -177 -252 268 -237 -78 165 -12 -210 155 183 -299 311 -6 8 -2 123 -407 -49 260 -280
4495 -280 294 -96 87 -10 160 -44 10 240 -239 73 9 -1 -203 243 -50 -99 249 -191 -109 78 35 -239
4517 -239 247 -122 -114 396 2 61 -58 195 -394 400 112 -234 203 31 -90 -98 200 -226 254 -20 -333 -59
4539 -59 44 -121 -141 251 -340 -124 135 -252 42 199 -22 -219 219 -226 -71 145 -12 6 94 187 -421 230
4561 230 -40 -201 69 -49 -90 -26 123 -372 155 95 -157 106 60 -113 13 248 -159 107 -53 -207 31
4582 31 146 -8 -143 248 -203 139 250 -68 -155 258 120 -133 419 -168 -12 218 -45 -200 189 21 -367
4603 -367 393 80 -111 129 18 -200 -42 158 -447 282 36 -130 139 181 -174 -62 184 -111 203 96
4623 96 -144 -73 210 30 -180 267 -273 -69 68 81 -223 162 11 -196 365 -81 25 113 41 -281 124 6
4645 6 -224 255 -86 -22 -33 -134 -80 134 264 -254 115 107 32 161 143 -37 2 258 -185 8 269 83 -120
4668 -120 475 -40 -298 317 -179 53 96 -20 8 132 188 -248 310 -47 -170 229 50 -81 277 27 -308
4689 -308 161 -37 -83 22 113 -237 51 122 -325 70 19 -148 -183 73 -195 38 187 -164 -41 135 -107 -81
4711 -81 248 77 -118 150 -65 -56 86 -23 -91 213 -103 -52 364 -61 -108 -13 109 -218 203 25 -256 102
4733 102 -138 -133 -8 76 -175 180 100 -3 147 110 -130 -248 340 -151 175 195 -172 54 125 -84 -21 180 -160
4756 -160 32 118 -274 -32 -3 60 -96 218 -132 -162 154 -18 4 33 57 -219 227 50 -271 -43 98 -158
4778 -158 -12 214 -365 164 -42 -331 3 262 50 -150 289 -220 52 144 -57 68 191 -47 -173 271
4798 271 -309 -96 118 -13 -54 68 129 -305 309 -73 -99 189 16 -22 -53 197 -47 208 -50 -213 -69 279
4820 279 -93 45 154 -245 126 143 -63 -72 318 -123 -126 152 -176 -46 104 42 -226 115 70 -202 270 -151
4842 -151 -181 -100 127 -204 193 -212 -196 250 -295 52 42 195 -193 12 35 -95 134 87 -102 -17 179 -82
4864 -82 -193 124 -127 115 50 -83 -70 293 -100 -72 215 -187 36 141 -139 -299 154 -92 -216 37 -234
4885 -234 -17 200 96 -80 79 88 -70 348 11 102 122 8 -234 91 85 -104 101 32 -5 61 159 -181 131
4908 131 205 -145 79 128 24 4 172 -218 0 156 -105 -85 37 -81 -229 183 -164 -147 317 -61 -215 157
4930 157 227 -343 43 105 -131 22 10 -224 -70 119 -227 195 37 -144 -22 -92 -132 -187 175 -158 -59 174
4952 174 -226 150 39 -50 61 359 -159 -191 267 82 -25 173 120 -320 266 -42 -150 122 76 -166 76
4973 76 142 -261 249 44 -51 -15 43 30 -6 143 -178 143 153 -32 -155 215 -15 -89 89 -119 -103 88 -97
4996 -97 -47 -1 -147 -255 234 -79 -65 29 39 -32 170 23 -218 149 -151 -139 -4 25 -59 135 65 -339 -88 63
5020 63 -142 -18 99 -39 112 291 -90 56 105 -80 -3 184 -150 77 186 -190 86 272 -19 -16 96 -96
5042 -96 -67 364 -255 -23 54 -119 30 165 -111 -244 89 -101 -12 5 19 -249 -39 78 -143 53 -50 -193
5064 -193 35 168 -119 -140 168 -62 203 82 21 -134 263 -213 -75 84 -260 -23 -89 -77 -187 130 -136
5085 -136 -5 189 21 -186 56 149 -291 65 -84 -79 73 28 68 1 137 14 255 113 -16 134 -109 22
5107 22 -86 183 -164 194 176 -205 -55 157 -116 -220 128 -50 -14 89 -140 -14 2 147 -306 254 -200
5128 -200 -198 123 25 114 48 116 -280 212 17 -287 135 133 -12 -133 88 -159 150 62 -210 103 5 28 -158 81
5152 81 -8 71 0 -64 147 -7 27 -116 -104 -86 -174 170 -58 63 -3 22 -218 65 -51 -105 133 -89 5 -66 243
5177 243 -129 204 -76 65 135 16 112 -199 78 -264 146 -50 -20 236 305 270 -43 247 -188 -72 138 10
5199 10 69 21 -93 -233 89 1 -81 -77 1 11 -97 -128 -162 -265 -224 -345 115 30 -155 -47 -133 -200 130 -82 -68
5224 -68 -25 193 -59 -208 133 -236 215 29 83 23 105 129 -398 351 -308 -221 75 -276 -261 377 -97 -344 47
5247 47 -562 -127 -116 -81 81 47 -29 -127 192 23 -59 127 203 110 109 121 -111 192 -3 95 34 320 -2 -205 -13
5272 -13 -236 -107 -90 455 -526 352 -315 -128 627 -504 247 -149 13 -79 349 -70 -380 136 -371 24 639
5293 639 -10 240 -183 -68 -48 31 187 -178 413 -111 -28 94 289 -500 37 -134 -289 207 25 276 -395
5314 -395 -198 -448 -50 -247 -28 -487 170 -131 -98 73 -299 37 -101 -313 -506 88 -108 -175 248 -31 -223
5335 -223 65 308 -397 549 276 -56 -148 99 477 219 -14 -374 -113 -164 -143 -47 -95 -290 1 -144 105 465
5357 465 -198 -9 75 57 -256 271 102 -49 -50 110 -132 398 184 443 -258 -12 -400 73 -80 -345 526
5378 526 375 -225 -271 348 -284 125 9 157 -370 -246 87 -119 -52 -52 -354 66 -284 -496 -335 36 -345
5399 -345 82 -228 13 50 12 13 -150 527 -248 -87 145 160 -117 223 192 23 137 157 -315 26 75 214 194
5422 194 214 119 6 174 -426 -19 122 -165 524 69 -203 -163 -26 -89 -17 -243 122 -277 188 -123 -300 -176
5444 -176 -191 -241 149 106 -330 23 -84 73 -21 -261 -103 403 128 -152 211 240 148 109 32 -167 -114 -29 29 -86
5468 -86 69 -122 -144 -160 54 -126 255 -117 -98 507 -160 -26 99 -75 -420 106 -29 141 -2 302 103
5489 103 291 -66 -135 -111 -4 160 242 215 194 -11 -118 -415 238 16 264 65 -156 -82 -388 248 -184 -221
5511 -221 -96 -76 -128 623 436 -232 180 99 -97 644 -219 -380 255 -119 116 -74 17 4 -343 365 -403 -259
5533 -259 -96 -385 -696 -46 -260 235 203 -200 52 900 -20 262 398 -334 44 417 -526 -278 407 479 18
5554 18 -309 464 -222 155 -245 -51 231 -10 285 82 60 -183 129 333 159 -375 380 -397 38 157 -21
5575 -21 -98 -91 -29 47 -173 94 -390 201 -46 332 280 -152 248 -1 202 24 69 -234 -98 1 134 216 -125
5598 -125 -155 351 321 -160 29 -234 -222 -242 5 -62 -613 -495 -19 -368 477 -499 46 453 427 -103 -408 -51
5620 -51 -374 -111 -19 304 -62 285 -469 98 62 -711 -2 33 -39 326 132 32 414 68 -269 95 180 127
5642 127 440 292 -148 258 79 112 123 -87 -14 -404 369 -174 146 133 71 185 -295 200 47 541 -121 -179
5664 -179 16 -16 29 159 -207 131 323 132 21 373 21 -101 -181 -12 -72 -94 -221 -210 292 14 52 -247
5686 -247 -61 -273 -420 -2 248 -354 -121 72 -98 -299 -224 -245 -29 42 -346 -386 167 -509 -269 152 246 77
5708 77 -22 -58 -31 8 -220 364 -217 28 314 59 126 -705 -668 -323 -281 -428 439 -324 102 -318 -212 -277 -185
5731 -185 327 267 -167 182 255 -323 -348 147 52 134 261 -136 -253 517 38 -414 102 367 -271 -372 -247 -8
5753 -8 85 -464 -505 -267 199 169 0 3 -332 -298 -91 -24 473 285 45 -48 182 131 -121 438 335 -580 36 -147
5777 -147 -24 -44 -245 296 -10 34 -135 403 191 378 -98 -549 150 306 -308 -138 412 162 -228 -51 545
5798 545 -239 449 304 516 74 66 -271 -116 1 -308 99 403 135 -123 419 292 -133 79 -199 -39 263
5819 263 -8 -365 69 61 -266 324 -157 59 250 383 -62 -151 29 -193 -167 -60 -13 -10 35 -84 -231 306 115
5842 115 262 -82 -139 -63 205 -161 28 200 -301 42 153 152 132 -79 -121 -366 -12 -27 -214 264 344 -134 143
5865 143 -39 -237 -164 71 -59 134 115 207 397 -87 453 -405 -232 -69 26 -39 -31 -112 -56 -91 164 267 -176
5888 -176 -88 -178 -61 375 -149 -30 195 212 104 -249 350 -219 -31 266 -228 44 119 -117 -282 -112 -81 -580
5910 -580 -54 -86 -367 -3 183 -262 -179 229 151 -64 88 -171 118 450 -364 -113 300 -261 -70 8 -158
5931 -158 -121 86 136 -9 -261 289 -1 171 -3 -167 96 -4 215 155 11 -68 131 -162 -183 -85 258 -117
5953 -117 -218 -79 -207 -51 105 48 361 67 231 -1 33 77 -218 43 -289 -35 2 -97 -45 -4 -105 -102 -35
5976 -35 -161 134 154 34 9 71 276 -216 70 -75 162 173 -212 14 177 -375 -252 219 -74 -238 -305 636
5998 636 -231 -281 499 526 -6 116 109 10 72 -653 237 -270 164 4 -390 53 -137 210 -108 -112 -112 171 -35
6021 -35 275 -191 -392 -116 22 88 163 123 8 24 94 -143 127 -18 69 34 78 -13 -96 154 -69 119 19 -67
6045 -67 86 24 -59 120 -19 -86 -180 173 -23 -222 73 -9 -163 32 -109 -62 6 -184 83 -108 41 -218 -23
6068 -23 -157 -82 -50 49 -170 -38 173 -205 62 -21 -26 137 149 -144 40 -145 -32 148 -24 19 -10 202 -30
6091 -30 -30 219 -48 78 67 160 150 99 -85 28 286 -221 -45 164 53 -29 61 -39 29 146 -29 -165 -158 -7
6115 -7 -109 -13 -157 -314 109 -28 -111 36 24 -178 87 -7 -56 -53 47 25 -55 130 -76 131 -87 -8 -8 85 -14
6140 -14 -103 -4 -12 -90 104 1 -106 -4 9 -63 31 -4 -64 88 27 -118 -111 -3 -106 142 17 -17 29 14 16 64 228
6167 228 -187 -2 130 67 82 53 144 -14 226 30 21 53 90 151 18 65 -101 52 -95 -150 111 19 0 12 -64
6192 -64 -16 66 -111 89 77 -1 107 -46 148 -79 148 44 50 42 97 1 -8 -8 128 56 132 11 -56 -70 -5 -81 181
6219 181 -39 -113 125 -70 -67 6 187 -28 78 -134 -119 2 101 73 65 36 98 72 54 92 162 -68 86 22 161
6244 161 -169 24 -40 -13 93 77 88 -5 37 -35 41 187 -26 -86 150 -83 -141 70 49 260 -47 -89 -43 69
6268 69 132 -197 55 -34 -166 55 91 -32 43 36 -43 210 -68 -77 -3 21 -63 -74 -59 -81 69 -164 -108 7 -79 -66
6294 -66 -100 20 -171 35 -54 61 -91 -15 -36 91 307 50 54 173 9 -247 60 87 -29 -8 -6 41 37 116 -65
6319 -65 -135 26 -116 -49 -56 175 6 82 -106 109 128 -248 116 86 -270 -191 502 93 5 174 -104 238 59
6342 59 58 -167 426 -18 143 87 -207 93 -127 4 -125 103 -6 -121 98 37 82 -138 160 -80 45 129
6364 129 76 130 -118 -65 266 -263 -95 221 -346 12 -185 2 -81 309 148 -327 -63 163 66 -80 80 131
6386 131 -122 56 -211 -90 163 -68 9 -60 -133 -95 105 101 10 146 17 -352 19 62 -225 -89 45 -78 278
6409 278 190 45 38 -71 265 135 -224 77 165 -56 -120 -10 -36 247 -116 -10 -165 268 19 -3 29 -270 -62
6432 -62 -144 -3 363 -16 7 188 -236 -54 -120 -31 -85 -141 129 -137 -84 41 49 -124 -198 30 390 36 -137 367
6456 367 -73 -3 386 175 19 213 -74 -381 467 -103 -250 -328 -357 139 -95 -350 -286 -627 127 -39 -466
6477 -466 -97 207 -31 -417 -22 -155 -312 54 -5 267 -243 394 298 -251 -27 -317 -96 -203 -47 -105 -178
6498 -178 120 -300 -43 35 -222 100 83 -347 -87 -304 65 49 -84 254 78 16 -16 198 -64 -1 55 28 -121
6521 -121 -482 -30 208 -146 -80 87 97 68 211 99 -460 -254 198 -114 139 -201 -223 36 350 377 83 64
6543 64 212 -50 -304 -322 225 -202 -143 51 -227 259 69 -48 -96 9 62 1 17 -109 68 181 -65 52
6565 52 -64 93 -12 -55 5 -51 -111 17 -79 105 -108 -146 -75 -4 187 -135 117 -7 -215 207 -140 -67 -168
6588 -168 -97 -8 294 -118 199 -135 -159 -187 147 -4 85 -31 -15 -29 39 120 -111 -57 272 -142 112 98 -216 94
6612 94 -1 84 34 56 -72 66 225 157 -45 29 12 85 27 -185 -155 166 -36 5 -135 -76 -50 102 6 -167 57
6637 57 28 70 73 -80 -121 54 -3 134 77 73 122 -81 191 -117 60 234 56 -97 -463 -64 -67 9 79 -154 -51
6662 -51 -30 421 -114 -177 -113 40 -209 121 42 -135 46 238 -43 -71 112 -72 -17 -97 10 -111 48 -77 40
6685 40 -58 -38 -103 -114 -47 39 73 84 -146 40 47 41 32 10 -255 -81 -90 -179 60 87 391 149 2 130 -196 1 -262
6712 -262 -99 -14 226 -329 52 238 -183 219 -336 99 21 0 40 -331 141 -66 116 103 286 -209 -114 -38
6734 -38 30 -22 -156 198 104 74 -166 -202 -47 50 163 -454 -12 107 264 -152 58 32 329 -128 -4 149 181
6757 181 -15 -75 293 22 -118 -152 176 178 -22 132 -161 -129 -42 -325 126 -107 46 100 21 -154 104 142 -157
6780 -157 -486 37 81 -77 -44 -161 98 -118 -40 -282 320 -317 -29 105 -100 241 -13 30 141 266 190 31
6802 31 297 169 -250 -86 -59 -18 -53 185 -124 87 37 -61 80 257 -13 -21 -115 57 -61 -24 -88 5 79 -43
6826 -43 -296 120 80 38 158 17 -27 19 -59 -19 68 -196 -165 125 91 -111 40 80 -12 25 16 -24 32 177 -36 -63
6852 -63 263 -4 1 5 172 27 48 95 -175 170 -56 -187 -18 105 194 131 18 41 125 33 79 -119 99 31 -108
6877 -108 -170 153 105 240 -94 201 -15 -159 6 -107 -228 12 133 67 361 142 239 -74 111 37 114 -221
6899 -221 -517 -64 121 -359 -82 -90 -364 -167 337 -338 -62 138 -111 -54 0 -71 26 38 64 -222 -64 162 -63
6922 -63 305 -105 -470 -65 208 22 -154 -170 57 271 18 81 -327 -144 150 -116 -253 -239 -63 -57 14 -264
6944 -264 42 138 154 -258 -155 16 17 -72 -164 2 -333 168 2 -339 346 118 -66 44 218 6 -72 -390
6966 -390 -359 11 -88 -113 -37 -416 -429 54 301 364 -246 11 -40 286 -18 -285 -256 -304 30 199 -413 -200 336
6989 336 188 160 408 237 -104 89 71 104 86 -201 253 224 -20 -146 89 439 -436 82 120 -94 -101 57 -189
7012 -189 -111 30 -23 -134 81 -198 -508 28 56 371 103 86 60 -79 -131 170 -401 58 -93 -462 -26 8
7034 8 -107 -125 78 29 186 197 -226 -76 113 23 32 38 41 -102 -74 50 -98 -77 -35 -87 -72 133 -66 -131 103 24
7060 24 78 47 87 -116 47 46 65 71 -11 48 -16 -36 -72 -101 7 68 152 -62 26 -98 -79 150 -43 -145 11 97 96
7087 96 -4 -119 21 -82 -92 61 -137 -96 55 -204 24 -17 -173 -14 -92 -6 -28 -117 -5 -55 -11 -124 -32 -45
7111 -45 116 -143 -21 -58 61 14 -117 49 0 82 -23 -26 -50 -197 113 -79 5 89 67 -109 58 -49 -65 -71 126
7136 126 114 61 18 -59 -50 -71 -68 -53 62 9 -74 208 235 -56 210 131 -29 -89 56 -66 161 174 46 76 14 188
7162 188 48 166 257 92 27 27 52 83 94 -8 8 10 106 -5 -150 105 -79 -267 -127 -21 -75 27 -178 -71
7186 -71 -87 145 -113 73 95 -12 181 -52 27 2 89 131 105 -37 -100 38 77 -143 -139 -113 129 -54 7 10 -111
7211 -111 -5 130 35 -40 110 -49 -41 13 -96 23 -154 60 -14 50 -92 -114 15 -72 -8 -4 14 20 51 -106 -37 71
7237 71 128 80 -16 -101 -67 107 -25 -124 88 177 112 -113 -16 18 38 11 -9 7 -113 34 -27 -103 -157 41 -105 51
7263 51 -101 -35 -227 -106 45 -139 69 33 -41 -3 -88 -172 -74 113 23 -100 86 -33 -7 -1 32 2 234 -32 86
7288 86 -16 51 -18 -127 86 -119 28 -53 79 12 28 6 2 70 -73 -17 5 -116 -27 172 -108 24 68 -122 -17
7313 -17 -5 -11 216 -87 -118 -7 95 30 54 43 -185 -49 -8 25 -45 -64 -57 -120 11 -122 -148 34 -163 -28 -14 10
7339 10 -49 -30 70 -220 69 111 94 -151 -56 -88 25 -60 42 66 175 28 -118 6 -235 -166 -90 16 -53 78
7363 78 -162 -117 -70 -5 -33 -54 -107 -83 -7 -2 -50 -48 145 83 11 34 188 -112 170 -38 -118 254 47 -55 54 -125
7389 -125 -48 25 -111 -45 -77 27 24 -58 115 -140 -70 -27 -42 72 4 72 47 -198 -38 -77 131 -26 82 81 -8 -20
7415 -20 -34 -56 -69 -51 -67 -44 -125 -335 110 -107 -105 -33 0 -86 89 119 69 36 91 22 -131 44 -183 118 17 -117
7441 -117 137 -76 49 181 85 97 -150 -20 -18 88 -36 -73 1 82 137 35 -59 -16 -127 -69 -89 -18 203 -49
7465 -49 -18 121 63 3 -76 88 -39 218 249 9 -63 179 14 69 -11 -26 113 -23 72 -163 76 176 -174 -90
7489 -90 108 -189 246 96 172 196 -33 -229 172 -7 -102 232 62 -217 180 41 -252 -263 -76 -131 263 228
7511 228 -240 -168 -148 -351 8 263 -197 -138 -163 110 -104 -67 -312 -12 -25 288 9 -81 -49 -30 -177 -308 -152
7534 -152 -130 100 20 166 319 -209 273 63 49 -201 -293 78 -57 104 352 -101 -196 -58 249 412 -441 -140
7556 -140 -17 7 358 142 -209 -46 -77 99 -107 -148 -115 -137 -26 114 5 -238 -70 -142 27 -405 -199 -110
7578 -110 265 -81 145 -156 -131 -231 -36 273 153 393 -196 101 -369 -14 -43 106 178 -65 58 105 288
7599 288 -78 152 107 -311 -127 78 -6 -239 77 -54 -14 202 89 30 -393 -251 45 -32 64 11 -79 -214 197
7622 197 -87 300 216 -207 174 99 27 -150 143 119 124 -296 -54 241 78 -284 -128 82 252 -242 -221 32
7644 32 12 -170 -187 144 257 53 7 92 -175 15 150 124 135 54 -187 -10 185 -286 -106 61 -19 -10 219 134
7668 134 99 -112 -160 -78 13 163 106 -66 -85 -185 70 -94 120 84 52 -159 110 55 -339 -39 44 -62 -7 139
7692 139 -115 -114 190 -126 -85 -123 132 25 -313 68 -206 166 -53 165 -261 32 282 -66 129 176 -149 168
7714 168 -163 -258 -143 -326 -62 -111 161 -137 18 -91 -168 -93 -9 -192 185 -228 28 -139 48 -112 89 185
7736 185 -106 -19 46 108 -87 -233 -78 129 166 99 162 -19 46 -186 224 81 278 251 -39 165 139 350 225
7759 225 -40 -55 -21 -116 93 14 -138 89 -15 -241 260 -43 -72 -25 -153 30 -60 -157 -110 -155 -152 -134 -533 144
7783 144 116 355 159 8 105 225 10 194 27 -44 182 -194 -48 -34 -134 -192 128 9 137 -214 -309 -127
7805 -127 173 158 -134 -336 -18 159 106 -14 -169 94 -306 -155 -165 181 315 57 -268 216 119 112 23 -439
7827 -439 25 173 -335 -100 -250 133 7 83 -190 13 43 156 170 -232 77 -60 -15 -148 -19 -155 -145 -117
7849 -117 94 0 238 -60 290 229 -104 91 -78 -212 -322 78 -226 -55 27 207 133 84 -199 75 -43 158
7871 158 109 -4 -207 -188 34 291 19 -199 -60 236 142 -162 94 -3 58 -9 -93 -121 195 -115 8 228 39
7894 39 -97 -118 -5 -269 23 -98 -182 -215 -114 -103 -250 186 -57 142 -186 146 25 6 -237 28 244 87
7916 87 -262 65 82 -190 123 101 -62 -98 -12 -145 -34 174 -233 -254 26 -81 2 248 31 -257 14 74 -200
7939 -200 -200 -178 -297 236 -7 -104 -97 -120 71 -408 -65 80 -95 62 72 -77 210 146 -12 -121 227 -92 -44
7962 -44 -132 -190 -64 -169 183 149 -100 39 -59 37 -74 -53 29 -27 24 -25 103 -113 34 23 305 -101 163 146
7986 146 -62 -24 223 13 10 117 -107 -63 7 205 -138 222 155 89 -13 -128 164 -435 -70 -44 -241 -114 24
8009 24 25 -273 285 185 -310 -98 -105 102 -78 276 -14 -238 256 126 152 169 190 102 120 -145 106 142 -414 -168
8033 -168 145 60 -79 -9 -160 -118 -214 132 -188 269 -224 -29 -39 -52 263 -128 -99 360 -226 57 71 108 -154
8056 -154 -50 264 -30 -343 -102 -103 -197 -67 -137 -230 274 -409 270 170 189 -126 -307 678 219 -81 160 150
8078 150 6 59 -200 -272 99 17 -86 173 19 -264 -32 55 133 116 102 145 17 -9 4 233 -78 327 -180
8101 -180 -203 306 47 10 -139 -190 254 110 86 59 84 -78 -260 71 -282 214 -337 15 -185 47 206 -49
8123 -49 111 -290 388 -340 -272 13 -112 168 37 39 -93 342 -253 -578 229 297 77 -292 -329 -242 -716 23
8145 23 -186 343 225 -70 45 -1 -176 150 -289 247 171 294 -56 262 18 63 94 243 -197 77 -461 -255
8167 -255 197 120 202 -91 -143 -11 -31 166 -1 239 185 6 97 -208 10 -15 98 -40 139 35 -21 139 -137
8190 -137 77
8191G7
$$ Imaginary data points
##PAGE= N=2
##DATA TABLE= (X++(I..I)), XYDATA
0 0 0 0 0 0 0 0 0 0 0 0 0 8 -8 8 -16 16 -19 24 -32 36 -44 54 -64 72 -88 104 -120 136 -160 183 -210 238 -274
33 -274 308 -348 396 -444 498 -558 623 -694 773 -858 950 -1053 1162 -1283 1417 -1562 1722
50 1722 -1895 2087 -2300 2536 -2798 3094 -3428 3810 -4249 4763 -5369 6101 -7009 8163
64 8163 -9689 11811 -14973 20265 -31287 104848 -262207 -136576 339974 -76534 -159477
75 -159477 98036 29663 -59508 -13429 -33317 120332 -20264 -137965 116913 96058 -181583
86 -181583 32345 136138 -148912 -36734 136317 -36000 -84030 34325 42571 3268 -41364
97 -41364 -37586 85059 -15713 -89427 49529 52805 -71503 -27569 48360 14897 -8135 -49050
109 -49050 24418 55715 -53811 -23668 53998 -32722 -45597 70912 -17121 -43255 51597 7363
121 7363 -32212 24899 16674 -29655 -2039 -13396 29018 18130 -59047 17664 68174 -31995
133 -31995 -30965 58769 -27330 -26483 44931 -20672 -24705 39322 335 -31579 43099 9336 -25242
146 -25242 -1209 3501 20434 -5326 -39178 9231 52470 -38785 -18987 49141 -15206 -23199
158 -23199 27544 131 -27870 21531 -12429 -16787 25445 -4376 -18350 2533 11369 903
170 903 5579 -27386 -1255 27240 -19962 -18714 11497 7675 -15515 6641 1717 5315 793 -22561
184 -22561 7402 14996 -12586 -23837 15077 7963 -2569 1582 -4982 7970 2412 385 -9242
197 -9242 1195 1130 -438 -4599 1918 19987 -10059 -8438 12402 17247 -12085 -12999 6992 8407
211 8407 4287 -14182 6294 8762 1463 -508 4048 1665 -733 2485 -14179 14377 9092 -19508
225 -19508 -5934 23224 4861 -15729 5440 -1983 7044 -184 -10572 -1866 6135 -5213 -5806
238 -5806 12851 -7891 1495 1509 -6916 4399 8853 -17314 -16985 23471 -1227 -14577 -2308 7100
252 7100 3166 -999 -5657 -4530 11932 -13898 -7337 10927 2279 -13018 -1208 11488 -558
265 -558 3552 -10194 -1415 8726 2459 -10469 -3234 8992 -2897 4744 -2076 2214 4687 729
279 729 -5378 3533 11766 -13712 -5169 9557 11478 -8030 -4427 7787 5308 5226 -9038 1360
293 1360 5104 1586 -8273 4694 8042 -7550 2379 1835 5315 602 -1626 -9513 5749 10141 -13288
308 -13288 -3527 4213 4616 -3646 1560 -3783 2723 4974 -13731 2100 6430 -6173 -12585 9209
322 9209 3846 -5445 -866 -6837 7117 4004 -7739 -10881 9632 269 -10105 4476 -607 16
336 16 -1231 1523 -2812 6871 -3868 -10718 8928 3081 -4148 -5205 5297 762 6225 -1324 -8231
351 -8231 9003 3686 -5140 -4186 9833 -3050 -2965 4287 2187 5828 -3282 -2520 2973 11819 -8112
366 -8112 -7192 8664 2343 -1087 -2069 4000 -768 6043 -3207 -1973 7278 -3424 -5553 1453 8067
381 8067 -7279 -306 609 209 5879 -2953 -6703 -499 9170 -8426 -3580 2015 -1104 -61 -2133
396 -2133 -176 4 3777 -10986 1329 8550 -6955 -8826 2770 6381 -6279 657 -3473 2390
410 2390 3413 -4383 -1983 1806 877 -6961 5423 -1263 -1587 2806 -1395 -1098 4791 4987 -11676 2572
426 2572 7315 -317 -5688 -36 6537 1467 -650 -4839 11018 984 -9088 3957 9616 -5531
440 -5531 -7962 11907 -547 -1770 2757 1224 -1630 2881 2728 -4618 3052 -3208 3500 1940 -5595
455 -5595 51 8624 -2972 -11051 12939 1757 -11890 -1301 10029 -3518 -8480 3724 225
468 225 3084 -5259 -2937 3806 2611 -9116 -2349 9833 -8499 -3344 4427 -343 -5462 4736
482 4736 -686 -6672 6260 -2293 -3214 -24 1639 -2632 2383 -1666 -3675 9134 -3418 -4850 3618
497 3618 5231 -5933 -893 3740 -717 3786 -4765 1529 5736 1389 -6563 3180 7526 -4798 -1489
512 -1489 1444 6620 -2962 -2434 3129 4848 -916 -4654 6836 536 -2699 -1074 5802 -2971 -3816
527 -3816 7498 -1538 -4023 2383 6469 -7850 -751 4991 -1781 -1507 -4349 3194 3504 -3558 -8903
542 -8903 10692 2786 -15018 4679 6831 -7244 -5525 7132 -3627 -771 298 -4977 5359
555 5359 -582 -5593 605 5239 -8303 1109 5687 -8164 484 5687 -1436 -6791 6982 1226
569 1226 -4868 280 3031 1810 -5107 1990 1803 3125 -2965 -1389 4977 1570 -2436 -1680 7032 -3786
585 -3786 3 4426 -1845 -401 4544 281 -4526 8327 -1572 -3543 3245 1754 -540 -157 -52
600 -52 -1204 7019 -5001 -1811 5712 -1506 -3691 1971 2261 -4679 3045 -2731 136 2765 -3022 -1445
616 -1445 1285 585 -4090 3296 -3885 -1740 3494 -1659 -3985 671 4302 -6761 -81 2723 -898
631 -898 -4346 71 2577 -2324 263 -3529 3419 751 -3071 -308 2640 -1463 -2852 5877 -4448
646 -4448 -738 4162 -1080 -3300 4787 2232 -6227 4917 1008 -543 249 120 287 3425 458 -4309
662 -4309 6790 -347 -2461 2226 2707 -2117 182 3246 -3352 3485 0 -1045 665 2658 -1292
677 -1292 -941 2955 -3464 2689 106 -2787 -462 4402 -2694 -4318 6223 -2026 -3124 217 2586
692 2586 -3345 -919 357 -2017 2966 -3618 -802 988 -167 -3583 2077 -84 -5434 4520 -1183
707 -1183 -3638 814 3304 -5182 -381 4598 -4122 -93 255 711 -1003 1443 -2474 851 3742 -4081
723 -4081 1421 1697 30 -1917 3531 -1188 -1386 3914 -2301 583 2342 1177 -3148 3759 1368 -2320
739 -2320 3195 -1108 33 1946 2155 -4391 3303 2968 -4048 2338 1488 -621 -1792 3162 -2181 1297
755 1297 1402 -3744 2413 1279 -1503 -2200 3647 -3149 -424 2730 -3864 281 1324 -1165 -3651 4349
771 4349 -2280 -3191 2766 -1407 -1221 -458 179 -3278 3350 -1771 -3426 2550 -550 -1734 -484 2236
787 2236 -4020 2006 175 -2684 2161 45 -1809 -538 4089 -3547 824 1924 -1842 1186 998
802 998 -464 -1206 4677 -2759 99 3463 -743 -623 1648 1450 -2296 3960 -1687 -362 3331 -570
818 -570 -998 1881 2038 -3710 3555 -248 -1463 2160 86 -1818 962 2874 -4753 2465 1164 -2383
834 -2383 4 929 -1515 -935 3189 -4618 1038 1532 -2418 -1043 1820 -1138 -2933 3410 -3506 -300
850 -300 1435 -2065 -1951 2179 -127 -4465 3764 -1580 -1673 1129 25 -2476 1185 1496 -4724 3539
866 3539 -174 -2383 669 2490 -2276 -479 2883 -3587 2589 1017 -1726 -206 3360 -1441 -1296
881 -1296 4764 -2579 428 1887 463 -1093 2544 -171 -1867 4739 -1602 -528 1464 1316 -1730
896 -1730 2328 591 -3314 3971 -22 -1240 416 2246 -2693 498 2321 -2803 1273 -1215 -266
911 -266 628 920 -3628 210 3003 -3523 360 120 -602 -2077 2098 -1415 -1415 1486 -3040 855 338
928 338 -463 -2649 1907 -939 -1537 2315 -2873 -510 669 1320 -2894 1485 368 -1892 2227 -669
944 -669 -85 -402 1475 -2324 2299 1685 -3537 1331 2057 478 -2042 2599 -1007 551 1805 -1223
960 -1223 1626 367 -155 -591 4264 -2015 -1232 3311 -550 304 771 813 -2810 3349 151 -1176 1148
977 1148 -1105 1335 122 28 -1763 2524 -1808 -1082 3010 -1471 -1532 -397 2034 -2047 348 -1270
993 -1270 -612 1152 -1583 357 -1174 397 -1910 1256 -968 -1345 835 -1261 37 -523 1487 -3526
1009 -3526 175 1846 -1106 -1385 -203 1293 -2186 2215 -968 -429 932 -652 122 1111 376 -2826
1025 -2826 3830 -874 -1211 2869 -870 -2177 2624 3099 -4888 2496 2087 -1313 916 921 -219 -83 1695
1042 1695 -2146 3455 -338 -2809 2155 2341 -1715 -1216 3514 -3075 798 2203 -1100 -1984 1621 1448
1058 1448 -2680 1837 -1053 -268 -295 76 -1 75 -1313 -2647 4252 -1562 -3236 1101 1631 -3126 -85
1075 -85 2503 -4352 968 757 -985 -1158 671 -1249 -587 1786 -2512 1735 -1161 -1665 1750 1935 -3505
1092 -3505 -1135 4353 -2573 -224 1300 669 -1796 1090 1483 -1181 1030 -1369 1711 447 506 -511
1108 -511 1025 704 -886 3182 -1215 -936 1397 3069 -2614 -173 3865 -2339 -58 1842 1324 -2316
1124 -2316 1242 -46 513 1849 -3084 928 1406 -778 -1178 2933 -2292 -1791 4037 -2397 -1590 1388
1140 1388 387 -3484 2122 590 -2641 846 -1165 823 7 -1184 -2362 2820 -680 -3245 2456
1155 2456 -850 -1737 -73 2019 -2800 76 1140 -2274 991 378 -347 -1720 1844 -734 330 417
1171 417 -2021 1796 883 -738 -1219 3536 -1428 -1328 3095 -192 -681 240 1808 -1106 2102 -386
1187 -386 -1037 2057 104 140 130 1375 -1507 2321 47 -1542 2077 213 -1251 -162 3214 -2758
1203 -2758 -81 1509 -155 -2 -554 -244 -756 2301 -2187 34 1170 -1381 -454 472 60 -2490 2021
1220 2021 -1708 -715 1561 -1184 -1930 566 1801 -2980 804 -614 -619 756 -504 -1277 99 1277
1236 1277 -3312 1844 660 -1905 -61 928 -333 -413 1877 -2872 1345 1769 -1188 -666 1321 378
1252 378 -836 2377 -1768 812 1147 -881 134 1966 60 -2192 3268 -223 -239 443 69 -243 1607
1269 1607 867 -2426 2533 -78 -474 555 759 -980 50 1495 -1762 1979 -312 -1514 176 1878
1285 1878 -1272 -1493 1819 -1674 846 -189 -873 -690 1164 -1073 -1580 2133 -1773 -717 318 188
1301 188 -1299 343 -802 -1609 2606 -1419 -1520 449 945 -1782 179 722 -1948 1486 -893 -541
1317 -541 375 753 -2275 595 2407 -2094 762 109 -41 198 1584 -1464 -87 2608 -1755 612
1333 612 1145 442 -1146 1928 -225 -355 2126 -1566 571 1605 613 -2118 1888 976 -1422 1578
1349 1578 -655 -101 659 857 -2044 1544 983 -2320 1229 575 -440 -1150 1254 -1583 780 864 -2504
1366 -2504 758 800 -663 -1787 1737 -1163 -687 993 -1649 5 410 -469 -1885 1956 -797 -1810
1382 -1810 1056 -390 -155 -294 189 -1812 1944 -636 -1883 1377 185 -895 -443 1615 -1695 982
1398 982 141 -1209 1387 492 -908 -449 2423 -1351 311 723 -670 973 462 -203 -431 2335 -1503
1415 -1503 154 2133 -443 -244 636 800 -895 1966 -1287 -358 1777 -148 -899 323 1516 -1852
1431 -1852 1219 -410 -632 1033 -120 -1155 162 1574 -2826 618 702 -1030 -516 197 -527 -729 1541
1448 1541 -2567 183 962 -1068 -1067 789 -271 -1399 1323 -1954 193 948 -1221 -1089 1411 251
1464 251 -2318 1599 -654 -200 249 -151 -280 788 338 -1981 2057 -48 -405 361 626 -362 568 1006
1482 1006 -1742 1688 612 -744 -40 1845 44 -785 1668 -557 982 114 -382 280 1674 -639
1498 -639 -1226 2518 -1007 -386 804 267 -1068 1141 -120 -1843 2355 -789 -1076 430 853 -1316
1514 -1316 369 52 -1626 2072 -1008 -1340 740 941 -2483 132 1540 -2123 320 -87 -187 -419
1530 -419 457 -1416 -321 1491 -1722 -59 12 106 -710 910 -985 -819 1843 -1319 -769 1066 974 -2108
1548 -2108 1105 1228 -1242 892 -180 161 613 909 -1786 1544 1000 -1661 1625 291 -563 353 1627
1565 1627 -1945 1073 1790 -1813 644 1253 162 -1164 1329 -402 426 649 -1474 1158 581 -638
1581 -638 -1280 2164 -880 -1008 1379 -607 -549 36 480 -1872 1196 79 -1587 339 85 -200 -945
1598 -945 438 -1464 1134 -204 -2037 1153 625 -1873 -942 2309 -2046 -521 1035 -958 -58 574
1614 574 -635 -1153 1940 -1540 -125 1013 -836 170 669 -358 -792 2598 -1435 -885 2155 16
1630 16 -1052 440 1502 -1240 1042 -57 93 1099 -10 -198 752 1223 -1751 1391 463 -636 653
1647 653 568 -736 -85 2213 -1846 9 1385 -77 -759 652 285 -992 1049 -1561 490 897 -1098
1664 -1098 -905 1345 -48 -2227 1687 -782 -730 705 -315 -1502 505 698 -2411 1030 -280 -703
1680 -703 -185 208 -805 345 415 -2225 1553 284 -1627 -326 1355 -799 -676 1367 -1324 598
1696 598 538 -458 -374 1238 -242 -1061 1773 -686 190 456 89 -212 1566 -372 -1640 2504 -104 -730
1714 -730 459 1061 -1098 631 602 -1032 1565 -378 -477 499 1146 -1233 158 1309 -1277 1025 21
1731 21 -692 -171 1399 -1434 -522 1584 -1481 -256 325 248 -985 748 -1037 -729 1557 -1430 -565
1748 -565 462 246 -1678 853 -252 -1431 1214 -883 -506 288 476 -1794 831 656 -1456 583
1764 583 -105 -112 -193 865 -1521 598 1095 -1526 629 611 -164 -830 1407 -701 230 1149 -1097 512
1782 512 864 221 -1289 1818 -66 -373 1092 -555 220 765 406 -1409 1802 137 -1091 1108 276
1799 276 -296 -46 1013 -1120 1129 250 -1213 1005 389 -600 -587 1289 -1227 504 430 -1169 454
1816 454 320 -887 -830 1726 -1461 -627 751 -705 -250 130 -300 -1105 1662 -1203 -954 916 -311
1833 -311 -831 92 437 -1516 1163 -572 -592 1049 -118 -920 200 1324 -1592 729 65 -304 643
1850 643 294 -668 118 1584 -1366 636 916 -378 53 550 90 -354 1531 -1120 588 1162 -399
1867 -399 -609 1069 641 -1063 1517 -622 167 723 -31 -764 930 817 -1846 1293 -19 -360 63
1884 63 349 -601 314 746 -1974 993 215 -710 -275 757 -775 -489 966 -1572 597 274 -674 -751
1902 -751 957 -686 -1378 1176 -1208 111 208 -335 -528 1191 -216 -1665 1603 -590 -295 464 637
1919 637 -836 587 292 -1517 1407 16 -826 -6 1169 -1293 81 802 -1003 1306 519 -586
1935 -586 288 1572 -790 -384 1716 -744 255 557 11 -312 1180 -542 -405 1640 -1049 -114 568
1952 568 577 -1081 865 -16 -937 1144 -663 -325 246 768 -1280 783 377 -1144 401 -483 -274 -319
1970 -319 471 -1613 430 727 -1674 348 930 -8 -903 936 -948 -211 867 -1305 -199 525 87
1987 87 -1288 1421 -569 -468 995 -897 -34 622 420 -1567 1444 -4 -910 774 22 35 102 843
2005 843 -913 1040 152 -777 851 422 -84 -282 1311 -933 822 749 -732 511 746 -152 -883 1597
2023 1597 -630 -120 540 -237 196 274 99 -874 1648 -832 -694 1053 -122 -564 138 710 -1313 1228
2041 1228 -241 -849 470 22 -837 -215 854 -1353 706 -319 -847 567 92 -929 -210 1281 -1649
2058 -1649 293 382 -264 -321 147 -146 -677 1021 -1112 188 460 -277 -302 594 243 -824 1442 -839
2076 -839 -152 860 273 -794 743 1273 -1204 1114 202 -95 208 428 -362 317 912 -1295 1040 463
2094 463 -543 65 970 -529 -179 1445 -1319 442 595 -338 -608 1131 -107 -712 917 -884 539
2111 539 -87 -498 -221 1005 -327 -1250 1263 -654 -313 -48 380 -935 95 330 -1291 626 -415
2128 -415 -385 -462 726 -701 -217 496 -1262 743 -49 -651 -447 951 -930 -483 1538 -821 -57 167
2146 167 159 -511 859 -410 -407 1127 -815 162 253 241 -636 1034 -66 -772 1491 -405 -302 623 1084
2165 1084 -1115 652 719 -602 757 -223 125 201 699 -987 535 817 -972 439 135 -59 -572 1075
2183 1075 -798 -104 953 -901 -238 290 345 -1106 720 -418 -422 578 -872 -272 309 180 -1395 1054
2201 1054 -190 -895 390 -170 -355 -96 500 -1361 571 102 -966 219 -48 -213 -276 742 -977
2218 -977 582 417 -893 310 537 -420 -765 1327 -624 -159 613 -205 75 213 68 -743 1420 -319
2236 -319 -209 729 9 -260 299 613 -810 1154 -96 -569 729 429 -505 69 1007 -849 555 210
2254 210 -543 197 169 -409 -300 1109 -1195 433 390 -384 -148 181 -270 -672 1070 -1120 -166 389 -276
2273 -276 -677 178 186 -818 820 -751 -155 325 -170 -710 504 494 -1323 756 -162 -383 95 98 -670 85
2293 85 635 -1186 674 196 -334 -145 645 -290 -221 1016 -947 544 525 -256 -186 939 -41 -498 1084
2312 1084 -462 159 503 50 -389 918 123 -798 1267 -297 -43 280 492 -652 633 347 -1063
2329 -1063 1048 20 -397 67 633 -674 -67 727 -1042 520 -113 -460 -209 651 -896 -461 898
2346 898 -1006 49 66 -134 -634 806 -621 -728 854 -708 -346 30 16 -819 549 -172 -700 929
2364 929 -431 -344 267 494 -1040 445 368 -846 637 -118 -246 155 1055 -922 333 832 -905 517
2382 517 319 -32 -494 1196 -668 160 1086 -662 147 492 411 -626 1101 -109 -392 823 -464 -41
2400 -41 379 280 -1119 777 -40 -646 444 -113 -305 136 605 -1134 586 289 -920 247 263 -341 -390
2419 -390 579 -1017 123 239 -851 100 394 -305 -939 948 -814 -121 505 -502 -215 254 48 -915
2437 -915 863 -449 -374 548 -191 -156 27 205 -929 899 -187 -602 628 266 -311 -197 999 -788
2455 -788 563 60 -400 283 460 -247 -283 1272 -883 443 631 -282 57 636 -227 -628 1187 -746
2473 -746 -37 491 49 -377 511 278 -571 999 -662 -273 488 104 -605 232 424 -1034 509 -238 -449
2492 -449 129 67 -777 -15 660 -1067 217 56 -385 -185 309 -436 -208 614 -1030 233 348 -416 -541
2511 -541 630 -178 -531 1063 -770 53 288 15 -562 776 55 -818 1089 -417 -244 425 284 -563
2529 -563 793 359 -893 750 154 -243 -3 685 -324 211 721 -689 608 120 -198 -147 859 -429
2547 -429 -70 853 -642 265 218 -77 -462 894 -290 -651 800 -352 -76 92 133 -750 561 -210 -603
2566 -603 891 -388 -557 212 482 -1106 349 53 -837 499 -106 -362 -63 541 -831 98 504 -878
2584 -878 234 47 -217 -167 789 -850 22 709 -584 61 196 267 -566 700 -510 -3 632 -330 13
2603 13 265 357 -784 894 117 -304 740 -110 -89 181 724 -945 673 644 -483 492 234 -10 -153
2622 -153 831 -826 539 373 -656 247 399 -304 -504 1118 -574 -89 498 -422 -160 188 70 -878
2640 -878 896 -482 -437 251 -366 -266 42 75 -936 894 -403 -837 302 13 -602 -234 601 -898
2658 -898 413 -57 -423 42 144 -331 -155 800 -821 190 290 -409 -40 451 -328 -621 1045 -530
2676 -530 12 528 77 -368 376 186 -700 877 -454 -13 560 177 -340 460 520 -833 836 -10 -331
2695 -331 453 450 -426 84 526 -776 419 121 -153 -116 340 -370 -5 772 -941 371 455 -350 -333 594
2715 594 -251 -566 788 -717 -28 271 -207 -591 643 -35 -969 700 -341 -102 36 -60 -619 396
2733 396 282 -933 503 -83 -229 -36 453 -541 120 480 -853 521 266 -338 -249 729 -449 -167 671
2752 671 -516 180 343 -30 -427 880 -260 -402 992 -329 -26 226 237 -439 733 -81 -489 832
2770 832 -168 -116 154 638 -647 344 188 -526 585 86 -222 -47 618 -825 -61 571 -736 333
2788 333 117 -69 -292 811 -680 -258 624 -688 -60 176 -12 -824 639 -414 -362 514 -495 -483 174
2807 174 302 -968 478 -126 -446 452 -371 -252 0 269 -941 519 130 -549 524 258 -11 -210
2825 -210 590 -709 465 560 -549 108 406 39 -371 1052 -454 245 481 -344 99 406 216 -744 976
2844 976 -125 -316 528 95 -169 313 427 -627 814 -2 -435 301 222 -227 107 547 -896 424 106
2863 106 -387 248 261 -328 -287 878 -630 241 332 -321 -172 247 -325 -488 721 -687 -55 371 -208 -317
2883 -317 153 -80 -798 849 -583 -346 120 107 -356 183 352 -763 721 -28 -265 220 178 -514 128
2902 128 743 -786 392 170 -71 -30 318 -247 -38 814 -529 329 217 -108 -357 479 -139 -437 794
2921 794 -441 156 225 -7 -561 656 192 -693 874 -137 20 78 203 -524 388 205 -1011 604 -22
2940 -22 -371 -12 441 -382 -57 538 -761 319 -36 -300 -439 618 -610 -300 395 -716 197 145 -125
2959 -125 -594 596 -335 -612 600 -497 67 18 68 -548 483 50 -581 826 -299 -84 -17 442 -601
2978 -601 425 50 -546 622 64 -240 -188 856 -515 144 459 -472 225 38 198 -438 708 -650
2996 -650 33 707 -318 49 189 165 -665 781 -323 -311 513 -307 -178 249 410 -755 586 -30 -342
3015 -342 272 -491 -181 -20 507 -888 458 131 -595 6 50 -174 -452 488 -656 133 195 -576 43 171
3035 171 -40 -424 761 -489 58 484 -382 -165 333 244 -867 649 -253 -301 298 19 -289 112 175 -684
3055 -684 560 47 -282 306 213 -154 7 399 -585 523 129 -412 149 274 -98 -142 842 -488 215 97
3075 97 -255 -9 302 -233 -399 632 -415 -123 268 -110 -347 275 106 -522 701 -210 -198 247 71 -350
3095 -350 85 275 -833 545 -251 -281 125 369 -541 -52 623 -721 190 116 -297 -108 260 -249 -194 749
3115 749 -699 176 54 -179 -144 339 -96 -426 617 -613 -33 333 30 -535 457 231 -566 574 -146
3134 -146 -3 164 270 -378 407 444 -627 421 -77 -66 79 586 -423 154 588 -652 547 145 -222
3153 -222 -233 502 -268 -247 466 -528 207 137 -104 -257 434 -166 -327 672 -526 -109 6 222 -588 484
3173 484 -47 -443 498 -392 -131 -163 219 -717 332 145 -679 437 61 -198 -196 443 -489 -17 408 -514
3193 -514 139 -32 -130 -287 656 -347 -238 602 -307 114 176 32 -533 529 -333 -232 502 -161 -101 150
3213 150 469 -593 389 -99 -250 433 -45 -52 123 322 -580 458 130 -413 96 327 -269 -73 608 -538
3233 -538 169 432 -433 -36 104 -148 -552 533 -522 25 353 -213 55 209 7 -705 679 -269 -313
3252 -313 330 -227 -124 45 219 -798 444 -68 -348 142 -41 -285 -180 286 -703 408 44 -418 82
3271 82 271 -295 -144 512 -599 195 117 -224 88 411 -132 -369 804 -155 33 271 -35 -148 224 134
3291 134 -279 666 -282 -104 239 155 -209 211 203 -496 552 -112 -291 235 293 -366 4 520 -773 319
3311 319 -116 -191 14 419 -438 -165 519 -511 94 285 -60 -227 226 -234 -378 585 -388 34 180 -159
3331 -159 -550 206 101 -638 445 -329 -220 52 64 -512 217 267 -727 483 -5 -98 -152 271 -499 52 446
3352 446 -648 477 333 -203 -166 438 -164 -123 507 -352 248 45 25 -302 505 -87 -281 685 -245 -50
3372 -50 178 162 -345 643 117 -426 692 -103 -106 52 200 -385 221 265 -497 396 -64 -218 -79 522 -622
3393 -622 166 350 -492 56 42 -134 -440 461 -453 -191 455 -530 -121 232 -25 -497 532 -282 -188 352
3413 352 -155 -107 146 222 -491 512 -156 -296 355 -46 -123 -12 427 -722 199 91 -414 353 201 -246
3433 -246 -118 553 -611 210 382 -393 99 318 0 -187 578 -331 -15 254 -345 26 422 181 -569 604
3453 604 -114 9 257 -137 -61 4 60 -500 409 -250 -189 114 21 -141 -162 454 -525 349 91 -204 78 301
3475 301 -126 -121 491 -394 20 188 -466 -133 175 -220 -405 514 -468 -87 144 -262 -278 249 -41 -513 640
3496 640 -234 -83 83 80 -200 157 300 -440 439 -55 -182 169 209 -236 123 488 -408 331 79 -106 -2
3517 -2 530 -84 -117 584 -523 217 245 153 -131 348 -73 -182 370 -494 87 260 -132 -158 329 156 -410 555
3539 555 -236 -168 273 234 -507 179 363 -423 390 -227 -175 12 255 -587 44 329 -498 132 -35 -299 -213
3560 -213 173 -335 -280 437 -385 100 -23 -80 -303 459 -192 -246 469 -239 55 93 -53 -360 549 58 -375
3581 -375 585 -84 -13 127 371 -337 142 317 -447 496 77 -123 -40 652 -375 104 347 -328 362 75
3601 75 -113 -185 460 -133 28 361 -416 198 57 102 -360 530 -205 -191 418 -201 -88 41 79 -674 271 -98
3623 -98 -312 254 46 -205 -22 148 -458 62 97 -413 195 102 -214 -242 276 -494 36 325 -393 31 36 -17
3645 -17 -292 336 -387 -117 371 -274 -72 96 136 -438 591 -32 -202 343 -156 -105 176 275 -455 383 20
3666 20 -83 325 121 -47 48 382 -596 324 269 -166 80 279 -95 -236 434 -412 118 218 -108 -140 208
3687 208 -9 -171 628 -301 -3 415 -32 -199 489 136 -291 613 -387 -290 9 235 -426 60 229 -580
3707 -580 320 -130 -187 44 179 -269 49 154 -595 222 -72 -224 3 195 -343 -263 421 -525 -30 241 -24
3728 -24 -141 401 -122 -39 326 -208 59 68 71 -332 528 69 -336 514 -195 -87 155 265 -329 127 373 -413
3750 -413 639 -240 -210 109 313 -328 -3 304 -486 219 56 -158 -239 393 -278 -198 231 -386 66 252 12
3771 12 -517 213 -106 -124 314 -262 -120 51 75 -359 422 -78 -552 266 -212 -260 41 302 -434 24 201
3792 201 -381 230 85 -186 -229 340 -353 -97 354 -309 81 157 -104 -141 480 -147 -184 358 -276 0 219
3813 219 145 -310 583 -17 -118 382 -99 -73 55 183 -362 317 26 -227 331 41 -143 -25 366 -379 167
3834 167 97 -269 172 135 -169 -59 436 -521 169 171 -266 80 165 -109 -313 336 -334 -59 343 -148 -110 276
3856 276 228 -279 360 36 -195 326 -54 -301 57 91 -458 345 -136 -173 14 8 -290 -42 408 -593 370
3877 370 -15 -83 130 125 -302 -232 342 -434 64 125 -251 66 318 -108 -369 510 -253 127 85 13 -114 409
3899 409 148 -364 224 -39 -61 406 -58 -36 461 79 -447 332 12 -41 -72 -128 -264 -183 -127 153 972 -212
3921 -212 134 167 -294 -529 -354 280 -239 146 -338 -179 -169 267 -350 -109 82 -136 -28 259 30 -184 230
3942 230 64 -174 19 4 -294 122 144 -419 145 -30 -392 136 -192 81 -210 122 -38 545 148 -331 783
3963 783 227 -314 190 289 -294 -299 185 -157 -131 -131 254 -439 331 147 70 630 -433 -224 222 522 -81 629
3985 629 394 -265 573 -343 -127 -155 78 -443 268 185 -573 218 65 -222 36 163 -364 366 350 -336 110
4006 110 -36 -96 -428 398 -302 -353 389 -324 -71 -90 -77 -124 317 -228 -312 339 -140 -183 73 213 -286 385
4028 385 -10 -65 204 2 -257 -94 221 -403 97 74 -159 123 -54 -117 -41 315 -374 19 403 -289 -7
4049 -7 228 -88 -83 327 -507 -56 307 -56 -48 -16 122 -319 279 -185 -14 234 209 -119 91 335 -481 363 2
4072 2 -234 207 -38 -87 -116 120 -622 170 91 -277 84 134 -175 -212 373 -467 68 197 -290 -155 80 99 -302
4095 -302 527 -278 -8 -27 -96 -118 132 236 -363 470 -82 -238 244 315 -102 -53 194 -485 366 -10 -139 14
4117 14 148 -116 60 288 -490 208 210 12 123 108 -272 -62 432 -282 86 -33 55 -117 201 60 -77 327
4139 327 -227 115 -88 -13 -118 85 180 -349 421 -254 -150 11 -83 -336 -22 99 -386 352 -131 -251 -69
4160 -69 117 -198 -87 253 -431 81 19 -181 -204 239 -231 -70 259 -300 80 24 54 -251 405 -77 -178 410
4182 410 -222 -45 144 97 -215 211 93 -197 247 -153 129 32 163 -303 233 14 -258 319 -46 -39 -69 275
4204 275 -245 39 184 -272 61 214 -94 -93 469 -186 -64 294 -124 7 202 12 -185 255 -102 -144 211
4225 211 -226 -183 85 29 -282 417 -12 -100 357 -116 -214 -93 251 -234 70 84 -285 -65 253 -155 132 514
4247 514 -479 -127 155 48 -103 28 269 -409 167 -501 -10 458 -317 18 -65 295 -486 341 -95 100
4267 100 211 77 -174 353 224 -327 -86 -161 -115 256 99 -188 -132 234 -406 90 -316 -639 123 -354 -317
4288 -317 -117 357 -615 338 219 -195 -53 111 -8 -157 410 -144 -84 74 32 -27 119 -21 -392 336 -318
4309 -318 -3 67 -198 -337 -134 372 -396 225 -373 -301 -183 92 -210 86 218 -296 160 -236 -151 -90 321
4330 321 -99 -130 59 -293 -118 245 -351 -210 312 119 -206 197 68 51 84 -119 107 542 -81 -221 274
4351 274 23 -221 401 226 -54 208 218 -365 25 -152 327 -283 -85 -299 64 206 -107 438 104 122 -221
4372 -221 168 -313 96 197 -477 -95 -105 -15 -43 74 29 -339 203 -193 -29 -12 -13 -368 158 -77 -165 83 -184
4395 -184 -67 58 211 -272 137 68 -284 140 -66 -82 -33 436 -229 -64 255 -265 248 -41 27 -185 262
4416 262 -117 -140 199 -60 19 172 108 -348 258 -92 -300 156 -45 -111 -73 41 -178 349 99 -364 325 -27
4438 -27 -162 122 93 -281 117 123 -267 3 48 -124 -201 301 -251 71 138 -240 -47 64 -179 -221 205 -143 -27
4461 -27 235 -144 -90 225 35 -293 262 -170 -199 242 11 -257 51 105 -372 258 75 69 73 87 -151 33 311
4484 311 -143 278 44 -217 39 211 -88 42 291 -341 -7 232 -89 -125 165 56 -118 224 -205 52
4504 52 69 12 -38 167 140 -254 522 66 -165 -20 24 -89 30 120 -323 217 109 -148 158 170 -68 -87 268
4527 268 -249 68 -21 -179 -8 259 -108 -134 395 -322 113 -49 -70 -85 254 -205 -344 292 -142 -65 56 84
4549 84 -157 268 39 -229 270 -106 -149 42 -12 -296 197 236 -370 230 62 -82 16 200 -274 -102 233 -393
4571 -393 104 22 -30 -35 192 52 -30 333 -163 -42 82 -30 -156 171 -86 -132 67 -302 16 90 60 -242 302
4594 302 48 -300 167 -30 -116 2 65 -231 48 49 -345 223 -83 -94 -72 17 -189 44 192 -263 0 -35 -57
4617 -57 -47 260 -13 28 150 -193 -172 -45 -72 -344 150 -13 -96 417 -154 -47 244 193 -197 91 -32 -175
4639 -175 155 168 -107 -50 141 -310 141 160 -308 91 238 66 -100 308 -154 -65 160 -203 69 92 -144 -35
4661 -35 158 -278 -52 272 -187 -225 69 13 -258 274 -112 -156 184 -49 -10 -1 22 -370 25 135 -258 -58 -46
4684 -46 -173 178 212 -259 162 -5 -61 133 145 -121 -168 209 -285 51 42 -242 -38 159 -46 -281 231 -282
4706 -282 -88 164 44 -10 129 -8 -180 210 -7 -63 98 20 -156 47 198 -369 121 21 -145 34 50
4727 50 -300 6 124 -168 156 155 -114 -24 91 -43 -124 198 -221 -63 129 -107 29 115 -55 -177 184 -238
4749 -238 30 139 -48 -228 232 92 -319 177 -52 -180 -9 139 -229 -35 109 -293 112 96 -154 -31
4769 -31 199 -26 -67 123 -194 83 -7 62 32 59 -218 -36 229 -137 84 133 172 -98 316 -100 -34 392 -100
4792 -100 -127 -4 102 -245 289 -22 -14 365 11 -153 83 91 -140 229 132 -202 112 -53 -76 -84 177 -170 89
4815 89 280 -351 152 61 -21 -102 272 -116 -55 137 -202 -49 65 -85 -254 206 -94 -278 152 -259 -102 86
4837 86 -30 -281 174 -5 -111 92 -67 -110 -103 -49 -185 -53 -200 -375 -27 88 -196 -70 391 -342 -36 141
4859 141 -126 98 86 -136 -360 213 -62 -100 140 -105 76 65 53 -127 224 -42 -112 162 46 -100 77 288
4881 288 -238 186 -2 -72 169 89 -185 99 141 -159 143 114 -172 132 -7 -42 -73 274 -303 65 118 -205
4903 -205 -174 112 -22 -340 85 -283 -81 19 -167 -281 52 16 -259 301 -136 -86 -26 25 -95 104 117 -326
4925 -326 196 -42 39 64 66 -48 5 109 -104 102 58 -161 -63 54 -94 -137 250 -144 128 113 -39 -31 31 -5
4949 -5 -162 312 -75 75 -50 147 -246 243 66 -87 297 -103 0 1 60 -111 169 139 -199 246 90 -85
4971 -85 -19 -79 -222 -56 103 -110 -15 9 -45 -168 133 -121 54 135 -145 79 -35 93 -306 220 -171 -122 268
4994 268 -75 99 73 27 -308 186 62 -109 259 -150 -170 -7 147 47 -23 188 -76 161 18 55 -85 190
5016 190 -166 112 161 -237 164 -16 -7 -93 191 -125 32 211 -66 142 -30 70 -58 152 -177 -56 166
5037 166 -21 -121 118 -8 -178 283 -73 -116 40 -13 93 -47 199 -234 61 47 -107 67 -133 -85 16
5058 16 134 -129 41 -25 -124 33 131 -6 10 290 -122 96 74 -80 117 2 28 -153 190 36 29 -50 60
5081 60 -41 -15 172 -202 175 -67 -116 75 99 -79 1 97 -185 118 114 -182 -62 21 -67 -23 278 -67 24 137
5105 137 -71 -80 181 185 -122 46 -164 -37 90 -72 -51 164 57 -205 106 -46 169 -22 74 17 77 45 -144
5128 -144 23 24 16 -143 104 -34 -89 206 -170 202 -3 -126 26 51 -53 -23 128 -168 140 9 -106 110
5150 110 198 -93 -36 221 -126 -45 -17 -46 -199 62 60 -120 409 -70 -78 -93 -53 -278 181 115 -224 128 -59 -123
5174 -123 22 132 -50 26 37 62 -126 -69 -21 -76 134 -167 -175 238 -36 1 196 29 -264 133 56 -160 254
5197 254 22 39 -139 -201 -66 200 83 -125 301 30 -190 -123 45 -299 20 64 -19 32 -69 -261 -28 115
5219 115 -240 -75 -103 -317 -100 -278 -43 -73 -19 -304 -40 139 -226 83 -54 104 -194 286 -140 -255 352
5240 352 -104 -44 -11 27 -99 250 256 41 318 -116 -254 -79 232 -178 -41 142 5 15 133 144 -198 97
5262 97 -125 172 307 87 -155 72 -83 -135 -35 -133 -209 392 2 -28 44 230 -351 114 -74 -400 335 246
5284 246 84 -156 -33 -322 633 352 -229 -433 38 -83 -254 -38 -336 -58 -90 -86 90 31 -124 -69 325 -105
5306 -105 490 -455 178 33 343 25 -190 194 -167 257 132 -115 -370 68 297 -138 163 56 -6 -79 -121
5327 -121 23 70 58 -137 161 224 199 -44 104 -86 -55 -5 -11 -72 87 180 -145 224 -403 -214 150 238 233 493
5351 493 -52 -59 145 -224 -41 97 49 -155 7 221 -649 60 -160 -444 -41 -122 455 79 365 -207 140
5372 140 153 -257 -55 -13 -78 -129 298 -319 -50 -110 89 182 -89 336 298 -266 -51 115 67 -31 228 23 90
5395 90 -163 71 -24 50 -175 -611 260 186 30 108 24 -105 -2 492 -374 24 222 -207 49 386 175 -93
5417 -93 -208 23 -356 -137 64 -355 307 -240 186 193 -351 -99 344 83 63 -432 2 -13 -160 125 -83 -368
5439 -368 242 -36 -199 339 121 -90 -10 -119 -135 -333 -74 -116 -352 -240 28 -465 -174 -89 9 260 -158 314
5461 314 -515 -363 149 449 -53 -12 196 22 57 382 -25 -97 196 -119 -30 -174 -614 191 335 154 -105
5482 -105 362 -177 68 209 -474 51 239 39 -120 133 -278 -506 -247 -462 111 -356 282 409 243 126
5502 126 -234 -84 -346 156 268 200 236 281 -143 -84 61 -267 389 161 2 4 -312 103 56 123 -127 136 -363
5525 -363 91 72 188 400 112 -171 -432 418 127 91 440 -310 -221 -33 -355 -40 44 -694 -152 223 56
5546 56 -55 295 -112 -340 -236 511 -123 669 -465 -57 -62 188 83 283 -276 278 374 -544 -163 155 384
5567 384 -277 316 133 458 -245 -183 177 318 509 237 -3 343 248 147 142 -239 60 241 477 29 -896
5588 -896 31 -116 -111 38 -102 247 -531 364 62 -76 -182 413 363 -53 -367 203 42 30 79 64 319 -549
5610 -549 -1 350 -19 104 399 339 7 -235 1017 -2 434 109 117 -284 61 80 -221 -352 -91 -383 53
5631 53 252 -465 7 -520 26 160 -12 313 472 -214 -444 89 104 31 -120 100 370 -10 220 -152 69
5652 69 -107 2 175 -120 273 -374 -12 -132 -20 174 -112 -109 -56 35 -53 -21 -2 -133 -266 152 148 -127 -221 -118
5676 -118 25 138 -247 64 -139 140 16 45 -255 430 281 384 -142 -380 -56 370 264 -305 121 428
5696 428 -40 -378 -122 -67 -102 138 -275 131 253 120 221 403 -65 -583 621 -145 299 337 -127 -98 -80
5717 -80 423 -185 -539 16 244 292 -90 -61 193 -112 -423 460 -55 -74 599 -400 -451 -463 17 -177 -500 -148
5739 -148 332 282 -345 -4 189 367 -327 170 -275 469 142 35 -369 -193 416 -525 -567 92 184 -347 -209
5760 -209 -47 19 2 -83 -101 -307 228 -731 -539 184 -180 164 -406 225 -319 -29 638 26 637 98 -274
5781 -274 40 -472 126 -353 -236 65 386 543 362 651 23 575 -111 632 -65 388 -197 891 -27 390
5801 390 -219 83 -129 -488 -447 -48 28 -226 -68 73 11 76 -105 104 -100 -127 -358 151 0 -102 -318 -185
5823 -185 202 -203 178 92 108 -162 -89 340 -178 -206 -358 -249 68 -104 19 -164 185 55 370 49 -63
5844 -63 -332 158 -140 79 -12 -97 260 96 -3 -229 258 -53 -101 163 -75 -215 111 -263 -53 31 279 -64
5866 -64 37 -32 -61 -206 267 21 -75 256 -70 217 307 91 -73 448 93 -149 250 -140 71 13 8 -117 -10
5889 -10 34 -68 47 -148 271 -48 394 -141 -7 -44 -163 105 -162 -89 -126 229 -300 -290 133 -187 -270 -104
5911 -104 -56 38 -26 -342 61 45 -78 -30 206 6 -97 -47 -300 352 229 341 -114 162 -31 34 570 58
5933 58 -75 617 188 0 -96 -63 -213 -120 -40 227 -79 137 94 -66 195 -256 42 -51 205 -124 231 256 -375
5956 -375 30 3 -6 167 -298 105 -95 158 -170 221 -180 52 222 115 11 346 -1 -29 211 212 104 -7
5978 -7 38 -14 -186 252 -78 -128 -117 -211 -53 110 83 -181 408 91 212 -151 65 -619 275 -163 -52 400 -145
6001 -145 -92 -265 236 -242 325 303 -536 67 -486 205 262 -92 -187 241 512 -36 -82 -18 18 233 57 -278
6023 -278 -141 -167 -147 -46 -82 -131 -146 -123 -178 -4 72 -129 27 22 -334 -163 88 -105 -15 112 -70 -68 -130 -120 -99
6048 -99 159 48 -162 229 99 -58 78 105 -163 42 29 -162 147 135 -192 -129 11 -22 58 25 -142 61 43
6071 43 -15 -38 0 28 -47 195 -56 -23 -61 58 -86 -29 -55 -94 61 74 -83 144 -49 27 63 -83 19 15 -45 170
6097 170 24 -43 -408 52 180 -263 175 -107 118 92 93 -147 379 139 -254 -100 52 -86 -157 79 -230 -9
6119 -9 -7 55 74 1 164 -217 200 -124 -95 -14 -184 -92 -8 92 -123 233 -96 76 27 -76 -155 -6 208 -60
6143 -60 105 -22 -234 -40 69 -37 95 49 -102 196 70 -89 32 237 -150 75 246 -65 -95 -17 57 75
6165 75 83 87 -23 -30 -98 -13 94 -221 15 68 -19 -154 111 -180 -107 55 43 44 91 -17 -163 70 -164 -223 -77 103
6191 103 -78 -137 85 -80 4 139 7 -204 60 -26 -37 49 -85 110 -170 -226 -121 112 -99 -76 68 -123
6213 -123 -35 71 23 -93 120 33 -114 116 129 35 -18 129 -24 120 53 -81 11 165 -40 4 27 95 120 -16
6237 -16 6 -19 30 -9 -78 101 -121 16 94 -166 -75 -225 -119 60 73 -162 -181 40 -164 -177 47 59 45 -70
6261 -70 -50 -50 -9 -67 -76 -21 82 -251 282 191 -157 92 -79 -57 92 93 -96 -46 113 -99 -30 -69 -50 -132 261 -60
6287 -60 53 69 1 -46 -3 87 -186 100 -133 -51 44 30 -128 -42 22 -87 49 -97 -53 12 109 148 -92 72 12
6312 12 22 -75 32 97 102 36 -291 160 -47 -5 -127 -152 28 5 -142 -73 208 25 118 -138 -227 66 -211 126
6336 126 -203 121 -311 1 71 -449 -165 27 270 -103 206 -163 -114 187 11 -65 41 37 -104 63 58 -66
6358 -66 -3 80 -66 -35 337 -62 118 148 119 -52 235 105 -97 173 -136 68 37 -211 -97 56 -67 -31 181
6381 181 46 -120 50 68 -104 -158 93 -162 185 229 131 49 119 -62 31 188 -2 -43 -18 28 -241 -45 -170
6404 -170 -101 217 -38 103 -110 179 -70 55 46 110 -73 -246 176 32 -88 -71 101 75 -175 -173 -149 -196 -195 196
6428 196 -23 296 12 -144 -239 -217 257 -200 -344 73 34 232 -227 239 -66 -107 82 118 52 72 382 -69
6450 -69 73 -111 414 169 100 -96 78 197 -141 25 86 50 -403 457 564 -103 240 -223 -403 -363 -400 -144
6472 -144 -145 357 27 206 -37 359 -212 175 -260 -58 -86 -119 -127 -544 73 102 174 358 -8 48 -151 -179 -27
6495 -27 -242 -262 202 -35 -147 115 -171 -285 -83 381 17 107 190 202 -40 -431 -33 1 42 -162 -310 -142
6517 -142 -52 171 -265 -224 -93 -15 -130 -20 -192 145 -31 -34 38 181 14 -147 176 54 -57 110 37 179
6539 179 -163 114 -287 -93 49 360 234 51 15 80 -71 -79 -154 -72 -85 49 -102 12 -11 -203 -86 -31 -33 -109
6563 -109 -325 -12 104 -73 -107 -121 28 -23 69 34 -164 -76 -212 -77 168 -492 -179 129 -215 -73 -110 -123 -15
6586 -15 -306 81 -67 45 10 -398 85 14 -45 118 -99 32 30 23 -199 -19 36 58 31 -29 53 -3 117 26 188
6611 188 65 -85 -56 110 17 6 220 64 100 214 -58 102 -114 -238 101 57 -5 -18 66 -89 -155 149 34
6634 34 -214 101 -22 -90 -99 103 19 -40 -101 23 21 73 60 48 -161 148 -106 164 1 297 79 -82 -241 14
6658 14 -148 63 -151 -172 -164 483 78 -86 -18 112 183 9 -205 -99 82 -104 -24 47 222 -107 55 197 -53
6681 -53 -132 -76 17 92 -92 -163 99 -90 11 360 92 -88 -216 101 295 100 -80 -5 152 -141 -75 -148 -20
6704 -20 -38 9 -89 249 -106 284 13 64 240 -76 -19 -30 -133 -236 -153 -202 -267 16 -195 69 49 -96 -317 26
6728 26 -213 18 305 33 -246 -129 -344 84 478 57 97 -195 -62 -235 74 165 288 64 -242 -204 6
6749 6 89 82 -24 156 -32 209 -81 -10 -273 521 44 -146 337 350 59 -262 -57 -35 -151 4 42 -15 322
6772 322 80 294 97 152 -118 -30 -127 51 9 -180 27 74 13 -350 76 173 36 -16 -92 135 317 224 119
6795 119 178 -283 -352 18 -7 239 -87 89 117 20 -29 -76 156 -126 -279 -21 21 45 -109 -72 -180 -82 121 -140
6819 -140 19 -92 38 -89 18 -18 15 169 77 -176 42 -123 11 28 -136 79 272 -135 24 30 -240 -238 -179
6842 -179 22 -15 83 -25 41 -85 7 -123 -23 -46 -134 111 350 -130 18 40 93 77 -190 -107 -76 116 -162 -8
6866 -8 -40 -246 -141 -96 -95 164 -332 -62 -112 97 166 110 -8 99 199 54 -81 -59 -331 -192 11 -173 136
6889 136 -66 46 189 -168 291 -261 -178 -207 -3 216 68 11 -222 -92 97 34 53 194 233 208 -12 45 -427
6912 -427 348 47 41 308 -263 33 30 -2 -150 -181 -132 -45 11 115 86 -201 -82 121 12 -93 57 155 -295 -8
6936 -8 47 -142 131 -74 110 11 17 -136 235 -166 -462 -216 -101 262 -280 165 -383 122 -126 -55 250 -217
6958 -217 -85 108 -3 375 -251 -618 123 -158 5 -261 2 6 -94 185 -507 228 -24 -202 274 464 188
6979 188 -246 -119 -77 141 574 -467 184 338 -87 19 -33 -30 -149 190 -53 274 -74 252 -139 -472 373
7000 373 -202 10 -562 -311 153 -370 464 -168 -418 312 -118 -3 -251 -26 149 -260 51 128 -352 -228
7020 -228 147 -97 -254 -129 -34 -224 222 72 -303 121 25 60 15 -399 -24 238 187 -77 93 -30 291 217
7042 217 -117 30 -62 123 -26 208 109 -174 -17 143 -32 8 195 -4 -33 -53 -88 97 105 -43 34 3 11 38
7066 38 159 77 125 -82 102 -196 -17 -21 77 115 -14 94 -140 6 -334 19 58 -33 78 -80 -55 50 33 -176
7090 -176 68 114 -39 116 104 43 -92 81 56 -139 -78 -163 -41 -73 129 -61 -60 84 -110 37 90 5 32 -176
7114 -176 0 76 -19 30 -32 73 33 -48 -58 -81 -77 -7 34 -90 -1 -45 -14 149 -9 81 -63 112 139 -78 10 103
7140 103 110 -72 -59 -90 -180 -38 -2 21 67 201 -95 -17 17 6 -33 174 11 -91 22 -235 -92 8 -124 -36
7164 -36 90 -6 4 39 73 -98 -74 -113 -14 -51 58 -154 -97 4 -67 -89 82 87 -10 59 -115 34 -100 -72 -167 90
7190 90 82 5 39 -12 -14 95 -73 -66 -68 12 -47 117 -77 37 -30 -27 152 136 82 -64 -6 -67 -20 94 78 -147 -37 70
7218 70 -65 -140 -113 12 -51 -26 16 -166 38 -1 -197 49 -69 -111 53 -43 -29 -134 -43 28 -128 -123 -114 -44 48 -44
7244 -44 -94 99 -23 -32 -42 -152 34 36 -98 -59 -48 -44 -43 81 -212 103 58 -44 51 26 132 38 -32 70 -39 151
7270 151 -18 -128 48 -16 -72 -71 11 -91 23 -17 -66 -56 169 -64 227 134 -58 69 6 -57 48 87 -133 -39
7294 -39 48 -52 104 -94 24 -15 -57 -69 11 -9 -37 -37 -10 -61 20 114 110 17 67 60 -62 -25 -44 100 57 -173 -37 -136
7322 -136 -192 22 -28 28 -124 -22 11 67 44 -182 -89 108 74 -95 108 87 -154 -1 -91 119 7 -54 -111 -131
7346 -131 -12 109 -20 84 -22 54 176 107 29 -29 -66 87 -54 -54 -129 175 115 -234 10 52 -210 139 -48
7369 -48 79 78 -94 78 -24 31 -106 -6 -21 -7 -123 -44 144 32 -7 27 152 -66 -219 20 -179 -17 118
7392 118 -41 77 -159 -44 -73 -182 28 46 183 40 164 -43 -56 -117 61 109 -11 -2 -56 -38 -72 -13 -92 -244
7416 -244 35 139 -57 150 -55 23 60 37 -127 -81 43 239 -64 -51 -100 173 238 -11 -131 70 -57 -56 27
7439 27 45 123 240 30 76 89 -46 174 316 111 12 -93 -38 132 -42 154 -122 163 -2 -184 -77 202
7461 202 -35 -191 -15 -119 74 52 46 -35 81 -220 36 59 -171 -125 -78 -15 -215 57 -16 0 64 -102 -223 -16
7485 -16 109 93 154 -218 83 18 -68 -150 138 114 -75 162 -193 118 -75 -65 -436 98 -24 43 -71 -8 -40 28
7509 28 -235 -92 -77 256 123 -181 359 -48 181 349 87 -72 136 2 -47 -251 135 73 148 176 -123 -38
7531 -38 -38 -37 61 51 8 -24 -38 -47 160 -323 -321 -229 -482 133 268 -131 -99 -165 105 188 -129 114 162 212 2 -395 -77
7558 -77 -172 -237 183 -184 115 115 573 264 -361 45 -78 -186 -2 114 233 -174 -25 -204 -43 -194 162 3
7580 3 96 12 -129 -233 -122 -121 -176 -418 19 65 -153 -207 -161 15 -288 -32 190 310 -302 -223 -110 -1 249 109
7604 109 34 184 -211 -142 14 48 159 103 53 -107 -27 -83 -1 -247 133 147 -275 -221 2 166 -361 1 -198
7627 -198 221 -144 65 -215 -101 -147 -123 -107 50 46 160 -29 224 -127 101 101 -289 -101 -89 -85 -14 117 -194 -25
7651 -25 -373 -314 -22 136 -25 166 -167 -45 -99 213 24 165 -129 -51 -180 111 -682 129 29 253 116
7672 116 144 -210 -167 207 140 -44 14 64 -153 -236 -68 -258 -47 -140 -174 -176 46 -123 -37 -29 -243 194 143 83 -329
7697 -329 -39 -196 -93 -47 -227 75 -194 -8 -199 141 -389 -90 311 -36 -104 -230 56 -268 -18 -42 -89
7718 -89 -21 169 64 -94 -199 -7 -78 -152 -201 -24 29 -130 46 132 -164 -449 2 163 39 35 189 7 -64
7741 -64 -62 -258 -194 -219 -152 176 25 -49 -145 173 -98 171 366 -49 127 -50 -213 64 230 187 165 -229 -402
7764 -402 121 96 -245 47 261 147 -193 -134 -28 43 -226 115 -177 -212 23 39 -379 24 -38 370 101 143
7786 143 -313 -12 95 90 104 -111 311 22 108 -291 102 70 17 -124 -115 -159 -13 -247 -88 -240 39 161 290
7809 290 -74 -265 -236 -69 27 -15 82 -376 93 -100 -371 7 251 283 121 -62 71 302 116 -172 120 -29
7831 -29 65 -55 210 55 -94 -103 -21 -89 25 2 256 14 -164 -160 -354 -47 -320 13 -82 91 209 123 47 -63
7855 -63 -187 49 64 -54 231 -14 -200 -42 -181 -90 49 35 -9 -247 -113 72 -105 139 -123 -53 32 -117
7877 -117 141 -39 167 -227 240 50 206 -121 140 -420 -305 119 85 -153 221 -186 142 162 170 99 190 -195
7899 -195 -146 401 -170 131 -27 -22 240 133 -145 -130 260 180 -13 -312 -65 -143 191 -256 -59 105 128 -199
7921 -199 173 111 29 -71 -19 -220 -107 -71 -12 47 -109 -23 -162 -158 -212 -130 -55 -98 -200 71 -138 39 -48 21 104
7946 104 126 26 47 -36 -55 -147 152 -19 -75 -103 -109 -32 112 -111 100 106 124 -63 51 79 220 167 142 143 -51 -31
7972 -31 4 170 89 137 11 292 -142 170 -155 -39 123 84 345 41 -40 -66 4 -171 -121 61 -78 -123 22
7995 22 73 68 -141 -156 -173 -197 -95 10 -547 55 305 431 -155 72 -27 327 -54 -209 93 239 -269 55 -159
8018 -159 -195 301 107 -125 -289 13 -277 -154 64 197 -63 -156 -6 62 291 45 181 17 120 -422 15
8039 15 -266 -56 -80 139 353 -74 69 -385 175 10 231 264 107 6 -59 108 92 61 0 -73 167 47 -317
8062 -317 184 -180 225 194 -34 -272 167 -273 -346 16 -295 457 228 184 73 -14 -113 402 7 296 -333 -239
8084 -239 -117 198 160 -108 -65 240 60 -98 -206 -46 1 -329 -46 -164 7 94 -245 -120 1 -116 -278
8105 -278 -227 286 272 332 -174 -19 -147 59 -241 16 33 -92 84 604 -74 255 -205 -116 3 114 -120 6
8127 6 -222 -77 58 -318 -137 -4 391 121 36 65 74 23 21 -230 -88 -307 392 -225 238 127 -195 5 -103
8150 -103 -56 296 350 -367 -31 -78 222 -301 -223 -178 159 -54 83 -75 162 -157 -35 -117 50 104 97 216 -78
8173 -78 -17 6 24 57 -22 -119 54 141 -53 -78 12 -34 112 -35 -98 -3 49 -2
8191b
##END NTUPLES=NMR FID
##END=
