##TITLE=1H_Pr A3
 , 8 sc, 
 15.2.2019
##JCAMPDX= 6.0         $$ Bruker NMR JCAMP-DX V2.0
##DATA TYPE= NMR FID
##DATA CLASS= NTUPLES
##ORIGIN= UXNMR, Bruker Analytische Messtechnik GmbH
##OWNER= root
$$ XWIN-NMR		Version 3.5
$$ Fri Feb 15 15:54:42 2019 Russian Standard Time (UT+4h)  she@DPX200
##.OBSERVE FREQUENCY= 200.1313
##.OBSERVE NUCLEUS= ^1H
##.DELAY= (6, 6)
##.ACQUISITION MODE= SIMULTANEOUS
##.ACQUISITION SCHEME= undefined
##.AVERAGES= 8
##.DIGITISER RES= 18
##SPECTROMETER/DATA SYSTEM= spect
##.PULSE SEQUENCE= zg30
##.SOLVENT NAME= DMSO
##.SHIFT REFERENCE= (INTERNAL, DMSO, 0, 15.7039)
##AUDIT TRAIL= $$ (NUMBER, WHEN, WHO, WHERE, WHAT)
$$ ##TITLE= Audit trail, XWIN-NMR		Version 3.5
$$ ##JCAMPDX= 5.01
$$ ##ORIGIN= Bruker BioSpin GmbH
$$ ##OWNER= she
$$ F:/spectra/data/she/nmr/H-F/1/audita.txt
$$ ##AUDIT TRAIL=  $$ (NUMBER, WHEN, WHO, WHERE, WHAT)
(   1,<2019-02-15 15:53:34.00 +0400>,<she>,<DPX200>,
      <created by zg, POWCHK disabled, PULCHK disabled
       configuration hash MD5:
       00 E9 B6 7A A2 85 ED C7 34 08 36 98 17 FE 4E 26
       data hash MD5: 16K
       32 1C D1 DB DA 22 97 72 EB E9 B1 F9 3E 78 9D 2B>)
$$ ##END=
$$ 
$$ hash MD5
$$ 52 1A 9B F3 F9 75 3C 18 4A 82 93 FA 52 7A E6 A5
##$RELAX= 
##$RELAX= 
##$RELAX= 
##$RELAX= 
##$RELAX= 
##$RELAX= 
$$ Bruker specific parameters
$$ --------------------------
##$DU= <F:/spectra>
##$EXPNO= 1
##$NAME= <H-F>
##$PROCNO= 1
##$TYPE= <nmr>
##$USER= <she>
##$AMP= (0..31)
100 100 100 100 100 100 100 100 100 100 100 100 100 100 100 100 100 100 
100 100 100 100 100 100 100 100 100 100 100 100 100 100 
##$AQSEQ= 0
##$AQ_mod= 1
##$AUNM= <au_zg>
##$AUTOPOS= <>
##$BF1= 200.13
##$BF2= 200.13
##$BF3= 200.13
##$BF4= 200.13
##$BF5= 200.13
##$BF6= 200.13
##$BF7= 200.13
##$BF8= 200.13
##$BYTORDA= 1
##$CFDGTYP= 0
##$CFRGTYP= 5
##$CHEMSTR= <none>
##$CNST= (0..31)
1 1 145 1 1 1 1 1 1 1 1 1 1 1 1 1 1 1 1 1 1 1 1 1 1 1 1 1 1 1 1 1 
##$CPDPRG= <>
##$CPDPRG1= <>
##$CPDPRG2= <>
##$CPDPRG3= <>
##$CPDPRG4= <mlev>
##$CPDPRG5= <mlev>
##$CPDPRG6= <mlev>
##$CPDPRG7= <mlev>
##$CPDPRG8= <mlev>
##$CPDPRGB= <>
##$CPDPRGT= <>
##$D= (0..31)
0 1.2 0 0 0 0 0 0 0 0 0 0.03 0 0 0 0 0 0 0 0 0 0 0 0 0 0 0 0 0 0 0 0 
##$DATE= 1550231613
##$DBL= (0..7)
120 120 120 120 120 120 120 120 
##$DBP= (0..7)
150 150 150 150 150 150 150 150 
##$DBP07= 0
##$DBPNAM0= <>
##$DBPNAM1= <>
##$DBPNAM2= <>
##$DBPNAM3= <>
##$DBPNAM4= <>
##$DBPNAM5= <>
##$DBPNAM6= <>
##$DBPNAM7= <>
##$DBPOAL= (0..7)
0.5 0.5 0.5 0.5 0.5 0.5 0.5 0.5 
##$DBPOFFS= (0..7)
0 0 0 0 0 0 0 0 
##$DE= 6
##$DECBNUC= <off>
##$DECIM= 32
##$DECNUC= <off>
##$DECSTAT= 4
##$DIGMOD= 1
##$DIGTYP= 9
##$DL= (0..7)
0 120 120 120 120 120 120 120 
##$DP= (0..7)
150 150 150 150 150 150 150 150 
##$DP07= 0
##$DPNAME0= <>
##$DPNAME1= <>
##$DPNAME2= <>
##$DPNAME3= <>
##$DPNAME4= <>
##$DPNAME5= <>
##$DPNAME6= <>
##$DPNAME7= <>
##$DPOAL= (0..7)
0.5 0.5 0.5 0.5 0.5 0.5 0.5 0.5 
##$DPOFFS= (0..7)
0 0 0 0 0 0 0 0 
##$DQDMODE= 0
##$DR= 18
##$DS= 0
##$DSLIST= <SSSSSSSSSSSSSSS>
##$DSPFIRM= 0
##$DSPFVS= 10
$$ [...]
##$SUBNAM2= <"">
##$SUBNAM3= <"">
##$SUBNAM4= <"">
##$SUBNAM5= <"">
##$SUBNAM6= <"">
##$SUBNAM7= <"">
##$SUBNAM8= <"">
##$SUBNAM9= <"">
##$SW= 20.0189088683792
##$SWIBOX= (0..15)
0 0 2 0 0 0 0 0 0 0 0 0 0 0 0 0 
##$SW_h= 4006.41025641026
##$TD= 16384
##$TD0= 1
##$TE= 0
##$TE2= 300
##$TE3= 300
##$TEG= 300
##$TL= (0..7)
0 120 120 120 120 120 120 120 
##$TP= (0..7)
150 150 150 150 150 150 150 150 
##$TP07= 0
##$TPNAME0= <>
##$TPNAME1= <>
##$TPNAME2= <>
##$TPNAME3= <>
##$TPNAME4= <>
##$TPNAME5= <>
##$TPNAME6= <>
##$TPNAME7= <>
##$TPOAL= (0..7)
0.5 0.5 0.5 0.5 0.5 0.5 0.5 0.5 
##$TPOFFS= (0..7)
0 0 0 0 0 0 0 0 
##$TUNHIN= 0
##$TUNHOUT= 0
##$TUNXOUT= 0
##$USERA1= <user>
##$USERA2= <user>
##$USERA3= <user>
##$USERA4= <user>
##$USERA5= <user>
##$V9= 5
##$VALIST= <valist>
##$VCLIST= <CCCCCCCCCCCCCCC>
##$VD= 0
##$VDLIST= <DDDDDDDDDDDDDDD>
##$VPLIST= <PPPPPPPPPPPPPPP>
##$VTLIST= <TTTTTTTTTTTTTTT>
##$WBST= 1024
##$WBSW= 4
##$XGAIN= (0..3)
0 0 0 0 
##$XL= 0
##$YL= 0
##$YMAX_a= 264016
##$YMIN_a= -278224
##$ZGOPTNS= <>
##$ZL1= 120
##$ZL2= 120
##$ZL3= 120
##$ZL4= 120
##$ABSF1= 10
##$ABSF2= 0
##$ABSG= 5
##$ABSL= 3
##$ALPHA= 0
##$AQORDER= 0
##$ASSFAC= 0
##$ASSFACI= 0
##$ASSFACX= 0
##$ASSWID= 0
##$AUNMP= <proc_1d>
##$AZFE= 0.1
##$AZFW= 0.1
##$BCFW= 1
##$BC_mod= 2
##$BYTORDP= 1
##$COROFFS= 0
##$CY= 11.3945322036743
##$DATMOD= 1
##$DC= 2
##$DFILT= <>
##$DTYPP= 0
##$F1P= 18.9103706918063
##$F2P= -1.10871071338519
##$FCOR= 0.5
##$FTSIZE= 0
##$FT_mod= 4
##$GAMMA= 1
##$GB= 0.15
##$INTBC= 1
##$INTSCL= 1
##$ISEN= 128
##$LB= 0.24
##$LEV0= 0
##$LPBIN= 0
##$MAXI= 10000
##$MC2= 0
##$MEAN= 0
##$ME_mod= 0
##$MI= 1.114404
##$NCOEF= 0
##$NC_proc= 0
##$NLEV= 6
##$NOISF1= 3.799351
##$NOISF2= 2.8
##$NSP= 1
##$NTH_PI= 0
##$NZP= 0
##$OFFSET= 15.70392
##$PC= 1
##$PHC0= -9130.146
##$PHC1= 8.000144
##$PH_mod= 1
##$PKNL= yes
##$PPARMOD= 0
##$PSCAL= 0
##$PSIGN= 0
##$REVERSE= no
##$SF= 200.130013532006
##$SI= 16384
##$SIGF1= 3
##$SIGF2= 2
##$SINO= 400
##$SIOLD= 16384
##$SREGLST= <1H.CDCl3>
##$SSB= 0
##$STSI= 0
##$STSR= 0
##$SW_p= 3612.71676300578
##$SYMM= 0
##$S_DEV= 0
##$TDeff= 0
##$TDoff= 0
##$TI= <>
##$TILT= no
##$TM1= 0
##$TM2= 0
##$TOPLEV= 0
##$USERP1= <user>
##$USERP2= <user>
##$USERP3= <user>
##$USERP4= <user>
##$USERP5= <user>
##$WDW= 1
##$XDIM= 8192
##$YMAX_p= 0
##$YMIN_p= 0
$$ End of Bruker specific parameters
$$ ---------------------------------
##NTUPLES= NMR FID
##VAR_NAME=  TIME,          FID/REAL,        FID/IMAG
##SYMBOL=    X,             R,               I
##VAR_TYPE=  INDEPENDENT,   DEPENDENT,       DEPENDENT
##VAR_FORM=  AFFN,          ASDF,            ASDF
##VAR_DIM=   8192,          8192,            8192
##UNITS=     SECONDS,       ARBITRARY UNITS, ARBITRARY UNITS
##FACTOR=    0.0002496,     1,               1
##FIRST=     0,             0,               0
##LAST=      2.0444736,     0,               0
##MIN=       0,             -278224,         0
##MAX=       2.0444736,     264016,          0
$$ Real data points
##PAGE= N=1
##DATA TABLE= (X++(R..R)), XYDATA
0@%%%%%%%%%%%%Qj6J6j6J9k7L2m0M8n6O9p7Q8j04J23j46J67j89K18k50K82l17
$$ 0 0 0 0 0 0 0 0 0 0 0 0 0 8 -8 8 -8 11 -16 16 -24 24 -32 37 -40 48 -56 67 -79 88 -101 117 -133 149 -168
34a68L57m02M51n07N70o34P02p79Q64r57J058j166J286j419J564j723J897k089
$$ -168 189 -213 238 -269 301 -333 369 -410 454 -503 555 -611 675 -744 820 -903 994 -1095
52a095K303k542K811l115L458l854M318m868N533o349P381q736J0596j3312J7639
$$ -1095 1208 -1334 1477 -1638 1820 -2034 2284 -2584 2949 -3400 3981 -4755 5841 -7471 10168
67A0168k5572M4505j63986j43339M00225j05835K432J28920k66512O7301K63151
$$ 10168 -15404 29101 -134885 -278224 122001 16166 18598 147518 -118994 -51693 211458
78B11458l55701o9723L45817o5810j03P4557l66340O6587L66648k25068p7513
$$ 211458 -144243 -213966 131851 66041 65938 140495 -225845 -159258 207390 -17678 -95191
89i5191K23037j50260L6410J04678l44382O8231L93231j61764j09263Q9892k02661
$$ -95191 127846 -22414 13996 118674 -225708 -157477 235754 73990 -35273 54619 -148042
100a48042J01323K24525k95854P871L14204j63957q5427N9095k13756J66315K92471
$$ -148042 -46719 177806 -118048 -110177 204027 40070 -45357 13738 -200018 -33703 258768
111B58768k76340q8849J95039j38723J2568J11437k22715J26766K84424k71482
$$ 258768 -17572 -106421 88618 -50105 -37537 73900 -148815 -22049 262375 -9107
121i107j27429J40901j01667J24660J51487k77110K9557K31964k03739o8597J28355
$$ -9107 -136536 4365 -97302 27358 178845 -98265 -68708 163256 -40483 -109080 19275
132A9275r6366J41234J51419l15696m5210K19339j08923K2206J04388j70724R6432
$$ 19275 -77091 64143 215562 -100134 -145344 73995 -34928 -12722 91666 -79058 17374
143A7374J46055k72459l6849K02939n1594N5952N4418k39422M9379J87918j72959
$$ 17374 163429 -109030 -145879 57060 5466 61418 115836 -123586 -74207 113711 -59248
154e9248r390J50737q7790N3099M0688k44031N4064K15742r7441j1055N7489j37214
$$ -59248 -68638 82099 -5691 47408 88096 -155935 -101871 113871 16430 5375 62864 -74350
166g4350N9689R3301j85872M3807J88416r4179k3185J2369j52920J00043J50665
$$ -74350 -14661 78640 -107232 -63425 124991 30812 7627 19996 -132924 -32881 117784
177A17784j44089K849J01329j02630O049L4687j24654J00500J53559j39428m4080
$$ 117784 -26305 -23456 77873 -24757 -18708 15979 -108675 -8175 145384 5956 -38124
188c8124M8938q8242P0277P9735j23815N3489J00400j28394k8890M4569n3381
$$ -38124 10814 -77428 -7151 72584 -51231 2258 102658 -25736 -54626 -10057 -63438
199f3438R6022Q0754j41651j0173P0117q1479K4515O0967o4566O6513N0685j41585
$$ -63438 32584 113338 -28313 -38486 31631 -49848 -25333 35634 -28932 37581 88266 -53319
211e3319j3295O9732k7215N5820L7024r7805J6970M5242q8940J4746P3957k6595
$$ -53319 -66614 3118 -24097 31723 68747 -29058 -12088 33154 -55786 -41040 32917 6322
223F322L7309O596j14800J5508O6681l3048L1317L2956n7073J0634P726p4141
$$ 6322 43631 50227 -64573 -49065 17616 -15432 15885 48841 -8232 2402 10128 -64013
235f4013L2098P6199k2844O202m761p4878K2006M2803l3187L3691L6653m5219
$$ -64013 -31915 44284 21440 27642 22881 -51997 -29991 12812 -20375 13316 49969 4750
247D750r153q538m2129M2741N6462k5417k809j258n0747R262K6385j4992L7996
$$ 4750 -4403 -12941 -55070 -12329 44133 18716 15907 14649 -36098 -26836 -451 -15443 22553
260B2553K5959m5634j7539o658j7261L6654L5337j5530k220n991l9543m15K3678
$$ 22553 48512 2878 -14661 -21319 -38580 -1926 33411 17881 15661 9670 -29873 -30288 -6610
273f610M812K9703J0551l9105j7093m807n241K8198K5308k958o258j6267k8369
$$ -6610 -1798 27905 38456 -649 -17742 -22549 -27790 408 25716 22758 16500 233 -28136
286b8136j325K2894J5735J7587J699k8295j8530o355K771K4871K1044K106j2740
$$ -28136 -29461 -6567 9168 26755 28454 159 -18371 -24726 -21955 2916 23960 26066 13326
299A3326k2083j6378k89J8920K1599J0145k833k1113k2486n821J1418K2293J6351
$$ 13326 -8757 -25135 -25424 -6504 15095 25240 22407 1294 -21192 -27013 -15595 6698 23049
312B3049K388j6065k2821q770m30J5885K6694N557q479j7130k3830k571J7634
$$ 23049 25437 9372 -13449 -22219 -22649 -6764 19930 25487 17008 -122 -23952 -26523 -8889
325h889J7483J2839K916j7596k2895n671J353J5994K8374R82j3812j3367k1925
$$ -8889 8594 21433 24349 6753 -16142 -21813 -20460 -4466 23908 24890 11078 -2289 -24214
338b4214n78K0212J3911J1919K337k0068k2174l672N424J6721K4925j618j6171
$$ -24214 -24792 -4580 9331 21250 23587 3519 -18655 -22327 -16903 -182 24743 23125 6954
351F954j1400j8934l6K1238J3489J0822r14k1847j9269k248R128J7075J8989j265
$$ 6954 -4446 -23380 -23416 -2178 11311 22133 21219 -628 -19897 -22145 -13017 4058 23047 21782
365B1782j6630j3106j4535J090K0808J5023Q181n606k0928j5700k436J2501J7790
$$ 21782 5152 -7954 -22489 -21399 -591 14432 22613 17007 -3921 -19621 -22057 -9556 8234
378H234J2098N34j6290j7494q170L002J7772J8320M867j1549j7239j2596l878
$$ 8234 20332 20866 4576 -12918 -21088 -18086 -314 18006 22873 11324 -5915 -18511 -22389
391b2389J6421J8010M672L632j5357k3873p43N988J2819K2868N42j8779j0011
$$ -22389 -5968 12042 16714 20346 4989 -18884 -19627 -13639 -820 22048 22590 3811 -6200
404f200r873p289K0442J7876j410P441j6010l1402Q649J0977N283K5986l514k4703
$$ -6200 -16073 -23362 -2920 14956 13546 20987 4977 -26425 -17776 -6799 -1516 24470 20956 -3747
418c747N47r990j4289K7299J9566p469Q976j9015l5763K1708J3929p425K9470
$$ -3747 -3200 -13190 -27479 -180 19386 11917 20893 1878 -33885 -12177 1752 -5673 23797
431B3797k610k9456R196j4690k0970M1636K0315j9907R539j8677l4472L3413Q857
$$ 23797 21187 -8269 927 -13763 -34733 6903 27218 7311 16850 -1827 -36299 -2886 5971
444E971k1284M0386K518m0070J2011j7033k0433N8667J1809l8292J8075j0751
$$ 5971 -15313 25073 27591 -12479 -468 -17501 -37934 20733 32542 -5750 12325 1574
456A574l5198L5337M3k4486N8008K63o0397J6871o760j6722O3637n626m8454M0185
$$ 1574 -33624 1713 1756 -22730 35278 35541 -24856 -7985 -14745 -31467 32170 26544 -21910 18275
470A8275n830m9857L2861L221j5572O5912j7942p6563L7640R104k7506N4644j3089
$$ 18275 12445 -37412 -4551 -1330 -16902 49010 31068 -45495 -7855 1249 -26257 28387 15298
483A5298m0628O0913k0354p1726M7810K0058j6467N4219l6485p0065O7849O119
$$ 15298 -25330 35583 15229 -56497 -8687 11371 -5096 49123 12638 -57427 10422 16541
495A6541n5669N5595K079l2382N9187m6657p5726Q4901K6132m3628M1752l1240
$$ 16541 -39128 16467 18546 -13836 45351 -1306 -77032 7869 34001 -9627 32125 885
507H85m8152P9881k2736p4594Q5078K1531n0331L8993n3333n1268J14424k81p8180
$$ 885 -47267 32614 9878 -64716 20362 41893 -8438 30555 -22778 -74046 40378 40097 -38083
520c8083N8379m649m4424N9182m7037n5950J23114R505r1108L6062k3470k8581
$$ -38083 20296 15647 -28777 30405 -16632 -72582 50532 60037 -31071 4991 -18479 -47060
532d7060J02327l9672p8458J02257K931p8227L8698l0685j8331J25238l5825j10368
$$ -47060 55267 15595 -62863 39394 42325 -35902 2796 -27889 -46220 79018 43193 -67175
544f7175P3354P246m6787O7374m4819m1341J27988l3945j15465O2142R315j3500
$$ -67175 6179 13425 -33362 34012 -10807 -52148 75840 41895 -73570 -11428 -2113 -15613
556a5613Q7792o8126q1157J19247p692r2964O3608o967j4585J04323q3520j08233
$$ -15613 72179 4053 -77104 42143 34451 -58513 5095 -1872 -16457 87866 4346 -103887
568a03887J20162J9249n7233N8317m9426l3684J21051o2710j10678J11032K7187
$$ -103887 16275 35524 -21709 36608 -12818 -46502 74549 11839 -98839 12193 39380
579C9380m0503N6433q7470n5773J50671k5681j00798Q2727k571k8932P2477r4180
$$ 39380 -1123 55310 -32160 -87933 62738 37057 -63741 18986 16415 -12517 59960 -34220
591c4220o7410J59244N093r4674M7564l7998k0476J15757p6602q5853J38093N826
$$ -34220 -101630 57614 62707 -31967 15597 -22401 -42877 72880 -3722 -89575 48518 54344
603E4344p7023L7109o2610j0394J49452n5118j09778R3038J002m5046O1023p3762
$$ 54344 -22679 14430 -48180 -58574 90878 35760 -74018 19020 20022 -25024 35999 -37763
615c7763k7633J59125m3252j19417O3056q139m108R3687q8318o4287J39993k2059
$$ -37763 -65396 93729 50477 -68940 -5884 -14023 -18131 75556 -12762 -77049 62944 40885
627D0885r7501N4265k1366P713J17843r8427j01262J23088J565n2910N7253n7905
$$ 40885 -56616 -2351 -23717 -16004 101839 3412 -97850 25238 26803 -26107 31146 -26759
639b6759p876J27763q3705j07092J04014J5775k0171N9210r4220l9839J41195
$$ -26759 -34635 93128 9423 -97669 6345 22120 1949 61159 -33061 -72900 68295
650F8295m5791q9942Q1680o264o287O8466j07966n5960J43385p563o8834M8582
$$ 68295 22504 -67438 14242 7978 1691 70157 -37809 -93769 49616 42053 -26781 21801
662B1801m1584o859R5963q7991o6692J27955J168n1816L1663p1736k326J25124
$$ 21801 -19783 -26642 69321 -18670 -85362 42593 43761 -8055 23608 -48128 -50454 74670
674G4670n9117p5405Q5844p515l0160M2134p7286j0660J36549m0829q4111N1249
$$ 74670 15553 -59852 25992 18477 -11683 30451 -46835 -57495 79054 38225 -45886 5363
686E363k2719R04P2263p9075l1896J16238k9267p0037L6044k9879J7262R4183
$$ 5363 -17356 -16452 55811 -23264 -55160 61078 31811 -38226 -2182 -32061 -14799 79384
698G9384p8577o3197R0612j6518l5890M3840m7997R735R6162p2134p0287O9019
$$ 79384 807 -62390 28222 11704 -24186 19654 -28343 -18608 77554 5420 -64867 4152
710D152k724l257M8255o7685j8314R1893m6784n5866N8566r385P721M9716q1105
$$ 4152 1428 -1829 46426 -21259 -39573 52320 5536 -50330 8236 -1149 6572 56288 -24817
723b4817l3292Q7504j6417l1605L9000k9896P80N4760o6506l6339Q1377k897k0747
$$ -24817 -58109 29395 12978 -18627 20373 -9523 -8743 46017 -20489 -56828 24549 21652 905
736I05K3856n3095j990O9455m2143l0834N6828r982j4021J9965n3101k452P7923
$$ 905 24761 -28334 -30324 39131 -3012 -33846 22982 13000 -1021 18944 -34157 -36609 41314
749D1314k3412l5283L1176k4233k629L7351m5004n298O5160k1583l1961J5411
$$ 41314 17902 -17381 13795 -10438 -13067 24284 -20720 -26018 39142 17559 -14402 1009
761A009k5432J0746N0465l5676k1654M2577k0401j8916K2866k4268J2103M8492
$$ 1009 -24423 -13677 36788 1112 -20542 22035 1634 -17282 5584 -18684 -6581 41911
773D1911l6808k8739K5739j2013K552K7717k5152l057L4334k8585k3617K5577
$$ 41911 5103 -23636 2103 -9910 -7358 20359 -4793 -7850 26484 -2101 -25718 -141
785a41m976R218K5528l4247j4303K6692j3824n317K1701q429J926J4824k9123
$$ -141 -5117 4101 29629 -4618 -18921 7771 -6053 -11370 10331 1902 3828 18652 -10471
798a0471j4068K7660M78k77J3703k0418o459J5941j6121k357K3086j768l229J649
$$ -10471 -24539 3121 3599 3322 17025 -3393 -9852 6089 -10032 -12389 10697 8929 5700 7349
812G349j9889l817K0576o60k191J1131j0747q363N534j0256M022J9669k801o177
$$ 7349 -12540 -16357 4219 3559 1368 12499 1752 -6611 -1077 -11333 -7311 12358 9557 3380
826C380j806j1255r86J1188K115J426O737p612j0594J145j616N351J2562j437
$$ 3380 1574 -9681 -10667 521 2636 4062 10799 3187 -7407 -6262 -7878 -2527 10035 8598
840H598n442l989p093r38O219P215K932m34m570r428j904M401M029P283K906n985
$$ 8598 3156 -833 -7926 -8864 -2645 4570 7502 7068 2498 -6930 -8834 -4433 -404 6879 9785 3800
856C800p758l561K05M028R949J998n430o45p972n792Q444M259L878N769q282j0203
$$ 3800 -3958 -7519 -7314 -3286 6663 8661 3231 2586 -5386 -11178 -2734 1525 5403 11172 2890 -7313
872g313J131R16J727J0734J681p278J132p918q150J2399N205o8O603r276j0511
$$ -7313 -6182 -5266 -3539 7195 8876 1598 2730 -5188 -13338 -939 4266 4198 10801 1525 -8986
887h986M829l43J88J2360J488q767O88p399p477J4647M802l586P524q565j1148
$$ -8986 -4157 -4500 -4312 8048 9536 769 1457 -5942 -13419 1228 6030 2444 9968 1403 -9745
902i745O421j306N49J3959n33j0060O57o028n799J4117M095m550P783q198j2146
$$ -9745 -3324 -4630 -4081 9878 9345 -715 -58 -6086 -11885 2232 6327 1777 9560 1362 -10784
917a0784P364n04J210J3594k960r671J117n522m204J2606M248l803N681q094j1412
$$ -10784 -3420 -3924 -2714 10880 7920 -1751 -634 -6156 -10360 2246 6494 2691 8372 278 -11134
932a1134P740P32J206J2041l928q397M70n747j608J1201M075k737K223p071q969
$$ -11134 -3394 -2662 -1456 10585 6657 -1740 -1270 -7017 -8625 2576 6651 3914 6137 -934 -9903
947i903O098J888J929R892l891p609j136m897J560Q879L229q17j234n931o093
$$ -9903 -3805 -1917 12 9904 6013 -1596 -2732 -7629 -6069 2810 6039 5222 3988 -1943 -8036
962h036K832L973L865N835l456o283l035l115L825N765L279J758n386n481k270
$$ -8036 -5204 -1231 2634 8469 5013 -1270 -4305 -7420 -3595 2170 5449 7207 1821 -3660 -5930
977e930m01O041N680L52j593l848o508j405O217L099M047K957j0072l835K599
$$ -5930 -6331 -290 5390 5742 4149 301 -6207 -7612 -1395 1704 5751 8708 -1364 -5199 -2600
992b600m478O533Q186m292R98k221j2079K192J0235j028L799L505j3062k67N628
$$ -2600 -7078 -545 7641 3349 4347 2126 -9953 -7761 2474 1446 5245 8750 -4312 -4579 1049
1007A049j0906Q066J3385r263J312j430j6511R151J3103r724M642P236j5010J661
$$ 1049 -9857 -1791 11594 2331 3643 2213 -14298 -5147 7956 -1768 2874 10110 -4900 -3239
1021c239M797j5956J4266J8342j8696k69L280j7346J4142J1021j9270J1566J3464
$$ -3239 1558 -14398 -132 18210 -486 -755 2525 -14821 -679 10342 -8928 2638 16102
1034A6102k1912m56N915j4506K0817J5892l0381L384J3510k0542J0967Q866k0879
$$ 16102 -5810 -6266 -351 -14857 5960 21852 -8529 -5145 8365 -12177 -1210 7656 -13223
1047a3223K1892J3535l5581J195J5350j2589J8717Q153l4204J5098J9449l3010
$$ -13223 8669 22204 -13377 -12182 3168 -9421 9296 17449 -16755 -1657 17792 -15218
1059a5218O615J6425j6707K4310M405m5845J4782K6149k2370J0805P861k7341
$$ -15218 -8603 7822 -8885 15425 19830 -26015 -11233 14916 -7454 3351 11212 -16129
1071a6129K4767J1450m8102J5173L1653k1122J4426k214m1767L3200K3416m3430
$$ -16129 8638 20088 -28014 -12841 18812 -2310 12116 9902 -31865 1335 24751 -18679
1083a8679J2914K1858k3062J9274l073m8499L6791L6527m1802N997Q901k9760
$$ -18679 -5765 16093 -6969 12305 9232 -39267 -2476 34051 -7751 -1754 7147 -22613
1095b2613L5386O158n4562L3562L4989l8080N123j658l1484M8429J9552o0930
$$ -22613 12773 18931 -35631 -2069 32920 -5160 -37 -1695 -33179 15250 34802 -26128
1107b6128J7696K9549l2696J7792k405m1521N3987K6206o3909O952J9864k1575
$$ -26128 -8432 21117 -11579 6213 3808 -37713 16274 42480 -21429 -14477 5387 -16188
1119a6188L5564j396n6304M3285L3042n6560O017J3825k2037N0897N31p3872L3371
$$ -16188 19376 17980 -38324 4961 38003 -18557 -12540 1285 -20752 30145 30676 -43196 -9825
1132i825L6877l8931J5310K78l2548N5705Q590p8086K3683L9662k5813K6058j2353
$$ -9825 27052 -11879 3431 3709 -28839 26866 35456 -42630 -18947 20715 -5098 20960 8607
1145H607n4369N9955K3829p0001J9277K6330k1384L7638j8308o8234N7409M0772
$$ 8607 -45762 14193 38022 -31979 -12702 13628 -7756 29882 11574 -56660 749 41521
1157D1521n5423J1901O764k9411N3700p257p6364N0099M3059m2463J2133j3704
$$ 41521 -13902 -2001 4763 -24648 29052 21795 -54569 -4470 38589 -3874 8259 -5445
1169e445l6784O7653J1486p5560K9808L3980l2354K2885j8366m9068P3499K6416
$$ -5445 -42229 25424 36910 -38650 -8842 25138 -7216 15669 -2697 -51765 21734 48150
1181D8150p3246J3797J6200k1879M4113j6054o1274O1675L3335o1597O727L932
$$ 48150 -25096 -11299 4901 -16978 27135 11081 -50193 11482 44817 -16780 -10053 -6121
1193f121j9618O2938q091p7668M5153L3701m2605J6969j0530k7425P0311J20q1003
$$ -6121 -25739 37199 29108 -48560 -3407 30294 -12311 4658 -5872 -33297 37014 37134 -43869
1206d3869K8187L1695k3071L0672k0529m8361O8590J4214p1817K1894J8870j4680
$$ -43869 -15682 16013 -7058 23614 3085 -45276 23314 37528 -34289 -12395 6475 -8205
1218h205M4888k7244o3593O0007K8336n0610J6328P03k0731N4959j7473p0640
$$ -8205 36683 9439 -54154 5853 34189 -16421 -93 610 -20121 34838 17365 -53275
1230e3275N0168L3171l4102J7598j9797l0350O3727q13o4142L2870K4941k3132
$$ -53275 -3107 30064 -4038 13560 -6237 -36587 27140 26327 -37815 -4945 19996 -3136
1242c136K2425k5415m0345O6391J6165n7914J8097P798j7189L8061k2505m6269
$$ -3136 19289 -6126 -46471 19920 36085 -21829 -3732 4066 -13123 24938 2433 -43836
1254d3836N7348K1310m6351Q383n004j4106N2012j1635n5288M0960J9254l3249
$$ -43836 13512 34822 -11529 -3146 -8150 -22256 29756 18121 -37167 3793 23047 -10202
1266a0202J5255j4593j7467N8331n376n6136K4028J3976j6210K5739j7924k9654
$$ -10202 5053 -9540 -27007 31324 25948 -30188 -6160 7816 -8394 17345 -579 -30233
1278c0233N1945L193m9777J8097O876q310L6452k1868m0132M1639R753l1814J5628
$$ -30233 21712 24905 -24872 -6775 101 -8209 28243 6375 -33757 7882 17635 -14179 1449
1291A449k549j0199L7563j6358m3980L2968J5396j9086J6976j4519j8114L8793
$$ 1449 -1100 -11299 26264 9906 -34074 -1106 14290 -4796 12180 -2339 -20453 18340
1303A8340p469l5937K4222J1375j1162J5312j8627k2972L7400N357k8933J5629
$$ 18340 10871 -25066 -844 10531 -631 14681 -3946 -26918 10482 15839 -13094 2535
1315B535J593j1091K0875j6222k2659L3746P902k1275P328p162q727K5827o782
$$ 2535 4128 -6963 13912 -2310 -24969 8777 16679 -4596 2732 -4430 -13157 12670 5888
1328E888k2936K3248N639j7510Q715r752q069K9685l634k2105J2431K8q580J2775
$$ 5888 -17048 6200 11839 -5671 3044 -6708 -14777 14908 11274 -10831 1600 1628 -6952 5823
1342E823p219r499K2784j288k0745P905k36l803J7871p503j3804J5173j814j1856
$$ 5823 -1396 -10895 11889 10601 -10144 -2239 -2475 -6278 11593 4090 -9714 5459 3645 -8211
1356h211Q016o13j646J3479o511j5278R257L092n590R197k734o389R918n320j0152
$$ -8211 -195 -808 -2454 11025 4514 -10764 -1507 1585 -4005 5192 2458 -3931 5987 667 -9485
1371i485Q552L451j166M742n251p501O126J454m819O297J964m582K645m444n169
$$ -9485 -933 2518 1352 6094 843 -6658 -532 922 -3897 2400 4364 -218 2427 -2017 -7186
1386g186P406K884j519J677k569l896J058J066o25L958K459m097j359j311k225
$$ -7186 220 3104 1585 3262 693 -3203 -2145 -1079 -1704 2254 4713 616 -743 -2054 -4279
1401d279L698K930J82l4k039k668j611K542K407R3K450j889m097N11r53O19N043
$$ -4279 -581 2349 2531 2497 458 -2210 -3821 -1279 1128 1221 3671 1782 -2315 -1804 -2757 -2138 2905
1418B905J227l208j329j011k830L423L291k740L627J36p481J525J123j346O596
$$ 2905 4132 924 -405 -1416 -4246 -823 2468 -272 3355 3491 -3990 -2465 -1342 -2688 3908
1433C908Q39o122J006L08m671L681M086l509M165K99r933L153L632l693O599R66
$$ 3908 4747 -1375 -369 -61 -4732 -1051 3035 -474 3691 3990 -5943 -2790 842 -2851 3748 4714
1449D714p344L175Ro567N070N030m169L312l1r900M526M492n872O669K234q279
$$ 4714 -2630 545 554 -6013 -943 4087 -82 3230 3199 -6701 -2175 2317 -3555 3114 5348 -2931
1465b931L602n35o971P101M704n513L014J74q911M532M097o185P090K775r547
$$ -2931 671 136 -6835 266 4970 -543 2471 2645 -6266 -1734 2363 -3822 3268 6043 -3504
1480c504L473N2o558P957L399o022L735j99q338M159L902m978O453K057r582L556
$$ -3504 -31 21 -6537 1420 4819 -1203 2532 2333 -6005 -1846 2056 -2922 3531 5588 -3994 -438
1496d38Q00o441P710K860n540L910j507p394M559L470l783M950J334p908K849
$$ -438 362 -6079 1631 4491 -1049 2861 1354 -6040 -1481 1989 -1794 3156 4490 -3418 -569
1511e69N62n640P386K887n231K951k286n445M775J999k529M052P36n912R55K10
$$ -569 -7 -5647 1739 4626 -605 2346 60 -5385 -610 1389 -1140 2912 3648 -2264 -1309 -1099
1527a099l115O362K195m747J848j974l595L666O96k75L351p37m138o74M00p3L841
$$ -1099 -4214 2148 4343 -404 1444 -530 -4125 -459 237 -38 3313 2576 -1562 -2236 -1836 -1909 1932
1544A932J205k742N77j949k235K228O44K068J551k561j498j511j90K435J211Q39
$$ 1932 3137 395 972 -977 -3212 -984 -340 1728 3279 718 -780 -2291 -2481 -46 1165 2004
1560B004K43k064k527K65J058O13L373o22l040J542l185j641N523l38R1K434n330
$$ 2004 2247 183 -2344 -2079 -1021 -408 2965 2343 -697 845 -2340 -3981 1542 1204 1295 3729 -1601
1577a601j974M124j769l19N446k073k737L012o031j348R828k946k321M958o882
$$ -1601 -3575 549 -1220 -1539 3907 1834 -903 2109 -3922 -5270 4558 1612 -709 4249 -2633
1592b633o51O578o798L01J0049m739m272L877p115J366J2050q346l659J0287p695
$$ -2633 -3284 3294 -3504 -3203 6846 2107 -2165 1712 -5403 -4037 8013 -333 -3992 6295 -1400
1607a400k325P103r598L867J3904j1304o287Q361o084J613J0290j2348n11J5866
$$ -1400 -3725 3378 -6220 -2353 11551 247 -6040 2321 -3763 -2150 8140 -4208 -4719 11147
1621A1147j2128o862J0439p576N629J2740j8531l731J6217q632k977R637j0639
$$ 11147 -981 -7843 2596 -4980 649 13389 -5142 -8873 7344 -1288 -4265 5372 -5267
1634e267M449J5578k0404p288J9228o535P49R456j9671L907K0207j8769o220J6835
$$ -5267 -818 14760 -5644 -12932 6296 -239 510 9966 -9705 -5798 14409 -4360 -10580 6255
1648F255p089L529R097k5014J543K6833j4639o821J3196j3830P408J4671k8808
$$ 6255 -834 2695 11792 -13222 -11679 15154 515 -6306 6890 -6940 468 15139 -13669
1661a3669P28K8186j2181m905P083j9377J0978K3115k7598n374K5356j2004o19
$$ -13669 -12941 15245 3064 -1841 5242 -14135 -3157 19958 -7640 -13014 12342 338 -281
1674b81Q029k6523J2932L0387k6612r528J7307j1840Q177J2025l0907P005L3126
$$ -281 7748 -18775 -5843 24544 -2068 -11596 5711 -6129 2048 14073 -16834 -9829 23297
1687B3297k2255j1499J3028j4799J5821J9697l7257p68L1312j6365m674Q894k0248
$$ 23297 1042 -10457 2571 -12228 3593 23290 -13967 -14735 16577 212 -4462 4432 -15816
1700a5816J7942K5456l7748r067K8785j0493L856Q956l1845J5299L2004l4252
$$ -15816 2126 27582 -10166 -19233 9552 -941 2915 11871 -19974 -4675 27329 -6923
1712f923r813K2295r823J3136R097m0682R173L7172k4372q586J4662j6820J8840
$$ -6923 -16736 5559 -4264 8872 17969 -22713 -13540 23632 -740 -9326 5336 -11484 7356
1725G356J6337m5851L873L7837j6784k258N173k6690K2411K5996m1500l685L1497
$$ 7356 23693 -22158 -18285 19552 2768 510 5683 -21007 1404 27400 -14100 -17785 13712
1738A3712j2637M429L827l6682K1679L6246l5535q251J9574j3686J5236P792m1501
$$ 13712 1075 5504 9331 -27351 -5672 30574 -4961 -13212 6362 -7324 7912 15704 -25797
1751b5797J4929L8862k6418j0422J0214j7412K3335J8106m5350M803L5535j9392
$$ -25797 -10868 27994 1576 -8846 1368 -16044 7291 25397 -19953 -15150 20385 993
1763I93l056M112k3852K7241K5262m3489n314K8179j1914P069M332l3909K3055
$$ 993 -2063 2049 -21803 5438 30700 -12789 -18103 10076 -1838 5231 9563 -24346 -1291
1776a291L1769l8479p823J9438j0631J9034N590m2436J4989L3640k6354n482J0571
$$ -1291 30478 -8001 -15824 3614 -7017 12017 17607 -24829 -9840 23800 -2554 -8036 2535
1789B535j5475K4164J2394m6359O826L3041j6851K360K080k5389K5882J9749m0535
$$ 2535 -12940 11224 23618 -22741 -15915 17126 275 2635 4715 -20674 5208 24957 -15578
1802a5578L76K5878j0627Q408k43l3720K2320K8646l2244l093J5498j2154J6385
$$ -15578 -15202 10676 49 8457 8214 -25506 -3186 25460 -6784 -9877 5621 -6533 9852
1815I852K489l6930J6913L0169k2251m726N672j5021K1186J1244l6858Q226K6990
$$ 9852 12341 -24589 -7676 22493 242 -4484 1188 -13833 7353 18597 -18261 -10035 16955
1828A6955j6692J25M34j9959K4598J7098l3350K89J8397j0713P441R06k4746K0308
$$ 16955 263 388 822 -19137 5461 22559 -10791 -10502 7895 -2818 4623 5529 -19217 1091
1842A091K1253k8690k891J1299r568J6604K874k9460J3711J9693j9537p83N091
$$ 1091 22344 -6346 -9237 2062 -7506 9098 11972 -17488 -3777 15916 -3621 -4404 687
1855F87j0561J8846O840l0600O221J8519j2380M787J154j6430J8227R541k5994
$$ 687 -9874 8972 15812 -14788 -8567 9952 -2428 2359 3513 -12917 5310 14851 -11143
1868a1143K967J3706o813P748q70k0098J3498J4121j9063J263Q927q028J0338
$$ -11143 -8176 5530 -1283 6465 5595 -14503 -1005 13116 -5947 -4684 4243 -3785 6553
1881F553P1k1074J0879J4461j1960N61K414r041J0577M477j8021O131J2995r281
$$ 6553 6624 -14450 -3571 10890 -1070 -509 1905 -7136 3441 7918 -10103 -3972 9023 -258
1895b58J411j64j1237J2230P477j4598K726O790o547L711J20j0253R437Q754j1886
$$ -258 1153 989 -10248 1982 9459 -5139 -2413 4377 -2170 1541 1661 -8592 845 9599 -2287
1910b287k68L692n967P358K133j0733O424N747q449O24J443l774P167K870r733
$$ -2287 -2555 1137 -4830 2528 4661 -6072 352 6099 -2350 -1726 -283 -4057 3110 5980 -3753
1925c753J609M887n322K423K102n047N529K052q189J165L260j727K884P91m785
$$ -3753 -2144 2743 -2579 -156 1946 -3101 2428 4480 -3709 -2544 716 -1011 1873 2664 -2121
1940b121J496K661m461O26L786j957J483M78m966J175K717j289R51J192j675q41
$$ -2121 -625 2036 -2425 -1799 1987 30 1513 1991 -2975 -1800 917 -372 579 1771 96 -745
1956g45P17j443ML270n58j095Q32k213o94J857M37L23O73n80k132L20J101j358
$$ -745 -28 -1471 -1467 1803 1245 150 982 -1231 -1925 -68 369 692 1365 785 -1347 -1027 74 -1284
1974a284J916J578k274L91o49k336K252K211j342n9P46k457nK093k470J664L644
$$ -1284 632 2210 -64 327 -322 -2658 -406 1805 463 404 1150 -1307 -1312 781 -1689 -25 3619
1991C619l943o60J290l087K582K958l433N36K355l597n82K858k525J899M123n665
$$ 3619 -324 -984 306 -2781 -199 2759 -674 -138 2217 -1380 -1962 896 -1629 270 4393 -1272
2007a272q02L595l958J850L606m387J588K924n483k59M153k583J362L730o006
$$ -1272 -2074 1521 -2437 -587 3019 -1368 220 3144 -2339 -2598 1555 -1028 334 4064 -1942
2022a942j61M688n195J189M934m668J501K753o462J029M859l541R65L730n470
$$ -1942 -2103 2585 -2610 -1421 3513 -1155 346 3099 -3363 -2334 2525 -1016 -51 3679 -1791
2037a791K8M310n541J420N826n251P75L077o399J808M566m404J586L751n467j00
$$ -1791 -1763 2547 -2994 -1574 4252 -999 -224 2853 -3546 -1738 2828 -1576 10 3761 -1706 -1806
2053a806L809m775J695N392n538O07L563o301J678M386m375K241K976n736N22
$$ -1806 2003 -2772 -1077 4315 -1223 -616 2947 -3354 -1676 2710 -1665 576 3552 -2184 -1662
2068a662L460m070J507M418m678O66L004o086J717M574m091J963K086n185J439
$$ -1662 1798 -2272 -765 3653 -1025 -359 2645 -3441 -1724 2850 -1241 722 2808 -2377 -938
2083i38K462l820J752L692l503J42J713m731K070M006l947J504J884m155J428
$$ -938 1524 -2296 -544 3148 -355 -213 1500 -3231 -1161 2845 -1102 402 2286 -1869 -441
2098d41J040k970K681K521k922l46P71k516J748K352k883J519J524l463P15L27
$$ -441 599 -2371 310 2831 -91 -437 334 -2182 -434 1918 -965 554 2078 -1385 -670 -343
2114c43j269K974N51k203Q7r7q68Q97Q07n83J224Ok445M63J20P7K234j010o27
$$ -343 -1612 1362 1913 -290 -203 -300 -1168 -271 536 -47 1177 1183 -1262 -799 -679 -602 1632 622 -5
2133eO28j833L19R15l28J441J92j783j46L70j057J159J698j611Q72m4l479K391
$$ -5 623 -1210 -891 24 -304 1137 1329 -454 -600 -230 -1287 -128 1570 -41 831 787 -2692 -301
2151c01J395k262K682l12k719K404j079k748L787J454k900J616r24l417M754Q8
$$ -301 1094 -1168 1514 1202 -1517 887 -192 -2940 847 2301 -599 1017 93 -3324 1430 1518
2167A518m635N026K83m191L449k681k787P405o09n522L626l74l257N187k327m827
$$ 1518 -3117 1909 2192 -1999 1450 -1231 -4018 3387 2778 -2744 882 508 -2749 2438 111 -4716
2183d716Q738l49p655M513j583k211Q829m272o946Q322r7o039M653k236k709J0645
$$ -4716 4022 3673 -3982 531 -1052 -3263 5566 1294 -5652 2670 2573 -3466 1187 -1049 -3758 6887
2199F887l911j0669Q515J145m611P232n718m959J2845l592j0552P578R32k442
$$ 6887 2976 -7693 822 1967 -2644 4588 -1130 -6089 6756 3164 -7388 190 1122 -1320
2213a320Q239p768q664J4470k69j0462P574k223k592J2112r906j0628J5371J197
$$ -1320 6919 -849 -9513 4957 4688 -5774 1800 -423 -3015 9097 -809 -11437 3934 5131
2227E131p625N854o506l060J5810p569j3238J4133J427o032P635j1341m668K0721
$$ 5131 -2494 3360 -3146 -6206 9604 2035 -11203 2930 4357 -1675 5960 -5381 -10049 10672
2241A0672n638j3576J0227j385k244J0625j2904q129K1743j779j4017P527n049
$$ 10672 5034 -8542 1685 300 -1944 8681 -4223 -12352 9391 7612 -6405 1122 -3927
2254c927m27J7405j3869j2687J9953l28r795O317r152j15K1580j1277j7453J5813
$$ -3927 -4354 13051 -818 -13505 6448 6120 -3675 2642 -6510 -6625 14955 3678 -13775 2038
2268B038J424n485R480j3890m161K5172q718j7836J1846m26J86J2726j7236r642
$$ 2038 3462 -2023 7457 -6433 -10594 14578 5860 -11976 -130 -556 -370 12356 -4880 -14522
2282a4522K4935k989j5607R063m708J436J8708j8984j4635K3816O2r189P035j2105
$$ -14522 10413 7424 -8183 880 -3828 -2392 16316 -2668 -17303 6513 6575 -2614 4421 -7684
2296g684J098K3260j5336j7461J9039J607m133Q624j8633l040K8476j0336j7052
$$ -7684 -6586 16674 1338 -16123 2916 4523 390 9014 -9619 -12659 15817 5481 -11571
2309a1571J3073k587J603J2513k1353p621K8201l645j5018P586p596L243K0096
$$ -11571 1502 -1085 518 13031 -8322 -15943 12258 8613 -6405 1181 -6415 -3172 16924
2322A6924k0428j3385K5150j122r447N708j3730L598K5058j6041j7387J7974N30
$$ 16924 -3504 -16889 8261 7139 -2308 3400 -10330 -6732 18326 2285 -15102 2872 3402
2335C402l758Q320j7912j185K8526j1604j7960J2282k371L029J2735k1076o569
$$ 3402 -356 7964 -9948 -11133 17393 5789 -12171 111 -2260 769 13504 -7572 -14141
2348a4141K6429n388j4293P669o340M927J8613k1255j2651K3447j878p004O224
$$ -14141 12288 6900 -7393 276 -6064 -1137 17476 -3779 -16430 7017 5139 -1865 4359
2361D359j3762M561K2237j7418j4569J7003J49q51P163j8839m86K5380j1422j3702
$$ 4359 -9403 -4842 17395 -23 -14592 2411 2560 1709 8872 -9967 -10453 14927 3505 -10197
2375a0197J1672l577M022J0463k1193m360K3877m897j0407O084p488M523J5614
$$ -10197 1475 -2102 1920 12383 -8810 -13170 10707 5810 -4597 1487 -6001 -1478 14136
2388A4136j8644r106K0915k267o101M539j2772M500J9257j4315j0986J4004j174
$$ 14136 -4508 -13614 7301 5034 -1067 3472 -9300 -4800 14457 142 -10844 3160 1986
2401A986j618N603j4638P54K1171r729j1643R144l716L174R260j6204k526J8339
$$ 1986 368 5971 -8667 -7913 13258 3529 -8114 1030 -2686 488 9748 -6456 -8982 9357
2415I357n514q301M840n679M672J2547j4749p092J5089l068l516M658r937M270
$$ 9357 3843 -4458 382 -5297 -625 11922 -2827 -9919 5170 2102 -1414 3244 -6693 -2423
2429b423J3914j2315p505R992j396Q21M611j1538M73J4163p882o922P432l066
$$ -2423 11491 -824 -8329 1663 267 1088 5699 -5839 -5366 8797 915 -6007 1425 -1641
2443a641K879O226j2683j476J2424l970m065L900m499K388P469r822l914J0764
$$ -1641 1238 7464 -5219 -6695 5729 1759 -2306 1594 -2905 -517 6952 -2870 -6784 3980
2457C980j952k568L200p099J912Q918p180l654O747j552o71K532o479K19R028
$$ 3980 2028 -540 2660 -4439 -2527 6391 -789 -4443 2304 752 81 2613 -3866 -3647 5381
2472E381l981m417M399k711O33M414o395l64P025k810k662J789k499J393M670
$$ 5381 1400 -3017 1382 -1329 -696 3718 -2677 -3041 3984 1174 -1488 301 -2198 -805 3865
2487C865m244k414M884j753j698K521l054J145M461l855j956K508r15K34J779
$$ 3865 -379 -2793 2091 338 -1360 1161 -1893 -748 3713 -142 -2098 410 -505 -271 1508
2502A508j990n22K900j771k207K472m27r6K104k357r92J952p90m82J252N0p59
$$ 1508 -482 -1004 1896 125 -2082 390 -37 -133 1971 -386 -1378 574 -216 -698 554 604 -155
2519a55O03l82j606J593P39j227J321l16j610P64K45l68P22O43j133k95J102j567
$$ -155 448 66 -1540 53 792 -435 886 570 -1040 -276 -31 -399 323 966 -167 -462 640 -927
2537i27RK047j127K99P46k281K83J733q29l01J312q04q32J492j699p57L446j174
$$ -927 -918 1129 2 301 1047 -1234 -951 782 -47 -348 964 160 -672 820 -879 -1636 1810 636
2555F36j320J734k096p5K585j847o82K627r92j692J642j334p01L928j845k328
$$ 636 -684 1050 -1046 -1121 1464 -383 -1065 1562 570 -1122 520 -814 -1515 2413 568 -1760
2571a760L203j833j107L035k274m02L621k200k224K571r80r10L545k125k183M138
$$ -1760 1443 -390 -1497 1538 -736 -1138 2483 283 -1941 630 -350 -1260 2285 160 -2023 2115
2587B115k224k222L917j961o11L765l203j855L629j495j350L474j810j846L882
$$ 2115 -109 -2331 1586 -375 -986 2779 -424 -2279 1350 -145 -1495 1979 169 -1677 2205
2602B205k600k361M741j859j421L888l247j461L953k341j183L854j860j828L317
$$ 2205 -395 -2756 1985 126 -1295 2593 -654 -2115 1838 -503 -1686 2168 308 -1520 1797
2617A797k370j890M638k018j797M229l062j662L924k565o50L881k485j507L184
$$ 1797 -573 -2463 2175 157 -1640 2589 -473 -2135 1789 -776 -1426 2455 -30 -1537 1647
2632A647k159j550L898j785j408L911l082j791M112k356o01L447k744p02K927
$$ 1647 -512 -2062 1836 51 -1357 2554 -528 -2319 1793 -563 -1164 2283 -461 -1163 1764
2647A764k553j101L446j274j107K770k751j181L896k373q25L273k347k80K105
$$ 1764 -789 -1890 1556 282 -825 1945 -806 -1987 1909 -464 -1289 1984 -363 -643 1462
2662A462k867OL099j388r41J753j818m57K637k231m12L145k022n63J344k272J056
$$ 1462 -1405 -1399 1700 312 -629 1124 -694 -1151 1486 -745 -1157 1988 -34 -597 747 -1525 -469
2679d69K113j870k12J214j108k33J042j251M46K110j916n99J048j354J197Q28
$$ -469 1644 -226 -438 776 -332 -565 477 -774 -328 1782 -134 -733 315 -1039 158 986
2695I86j636R32L77j156J92L5r4R78K47j255J45L55r08J075Q6q11J516j040j033
$$ 986 -650 282 659 -497 -305 -270 -364 614 861 -394 -249 106 -802 273 359 -452 1064 24 -1009
2714a009J405r08K31J360j195k3P39j361j54J725o83l81J416j913l0K087k497
$$ -1009 396 -512 -281 1079 -116 -139 600 -761 -915 810 127 -254 1162 -751 -781 1306 -1191
2731a191N01K460k204N25P06k740J682K147k635K14J878k168P07J375l671K125
$$ -1191 -690 1770 -434 91 797 -1943 -261 1886 -749 -535 1343 -825 -118 1257 -2414 -289
2747b89L418m155M15J468l030L123J242m862K344L031l632M02J029l193L943K558
$$ -289 3129 -1026 -611 857 -2173 950 2192 -2670 -326 2705 -927 -525 504 -2689 1254 3812
2763C812o727J450L776l841K362M24n182N316K896p085Q75L159k632L492M14p403
$$ 3812 -2915 -1465 2311 -1530 832 1256 -3926 1390 4286 -2799 -1924 1235 -1397 2095 2509 -4894
2779d894M612N095p173J015K509l851N944L44r563M589N602n298J375M28n000
$$ -4894 -282 4813 -2360 -1345 1164 -2687 3257 3601 -5962 -1373 4229 -1069 306 734 -4266
2794d266O958K335j0710L349O231m816L197j351p873R092L977j0290K312L772
$$ -4266 2692 5027 -5683 -2334 3897 -919 2278 927 -6946 2146 6123 -4167 -1855 1917
2808A917l489N269j904r982Q714O639r516J253J344m476R277r35j2586P802O680
$$ 1917 -1572 3697 1793 -8189 525 7164 -2352 -1099 245 -4231 5046 4111 -8475 -673 6007
2823F007p027J729j831n334J1500J865j3947M474O610n296M383l106q980J3124
$$ 6007 -1020 709 -1122 -6456 5044 6909 -7038 -2564 4046 -1250 3133 27 -8953 4171
2837D171M286j3810K477L916l094P730l463j2171J1233P230j1785J301J619l981
$$ 4171 8457 -5353 -2876 1040 -2054 5676 2213 -9958 1275 8505 -3280 -1979 -360 -4341
2851d341J1638k221j5706R434P841q032K550k435n632J3651N15j6364N885P641
$$ -4341 7297 5076 -10630 -1196 6645 -1387 1163 -1272 -6904 6747 7262 -9102 -3217 4424
2865D424m995N118m976r988J5316L788j5077L773L709k645Q913o254j3044J3715
$$ 4424 -571 4547 -429 -10417 4899 8687 -6390 -2617 1092 -1553 7360 1106 -11938 1777
2879A777P116j1681J738k32l520J3226m080j6157J1337P582p789K702m926n150
$$ 1777 8893 -2788 -1050 -1282 -4802 8424 4344 -11813 -476 7106 -683 2019 -2907 -8057
2893h057J5843m72j6349O529O639m681N235o254r301J6766L358j5522L734K931
$$ -8057 7786 7314 -9035 -2506 4133 -548 4687 -1567 -10868 5898 9256 -6266 -2532 399
2907C99k449R516o556j2383J4161O110j2032J689j80k803J3292m263j5843J1079
$$ 399 -2050 7466 910 -11473 2688 8798 -3234 -1545 -1725 -4528 8764 4501 -11342 -263
2921b63O679p806L273m579m435J5387j642j5658O531N767l610N560o631q491J5652
$$ -263 6416 -1390 1883 -2696 -7131 8256 6614 -9044 -2513 3254 -356 5204 -1427 -9918 5734
2936E734J999j3949M249K009j403R319p745j1091J3367M537r584K232j549j946
$$ 5734 7733 -6216 -1967 42 -1361 7958 213 -10878 2489 7026 -2558 -326 -1875 -3821
2950c821J1957n181j3315J0563N201o132L250n415l697J3692k209j2441O416L996
$$ -3821 8136 2955 -10360 203 5404 -728 2522 -2893 -6590 7102 4893 -7548 -1132 2864
2964B864l193M564o065o650J3534J403j1442L983J093j893P826o119q424J1339
$$ 2864 -329 4235 -1830 -8480 5054 6457 -4985 -1002 91 -1802 6024 -95 -8519 2820
2978B820K985q184J979j300j686R790l757j0371Q353L423n378L103m004k688J0973
$$ 2820 5805 -2379 -400 -1700 -3386 6404 2647 -7724 629 4052 -1326 1777 -2227 -4915 6058
2993F058k257r555M904K312k033M131m658m761R850K43q278L398M13r55O239n125
$$ 6058 3801 -5754 -850 1462 -571 3560 -1098 -5859 3991 4234 -4044 -646 -233 -1188 5051 -74
3009g4n936P998J169n001K146j305r81O470l211o721N935K011l409K714k965k187
$$ -74 -6010 1988 3157 -1844 302 -1003 -1984 4486 1275 -5446 489 2500 -909 1805 -1160 -3347
3025c347O970j868n569L876J220j649K495k842l147N988M77m993K556K32j652
$$ -3347 3623 1755 -3814 62 1282 -367 2128 -714 -3861 2127 2604 -2389 167 399 -1253
3040a253L742k595l457N011O74l146J264p43j089L564r38l638L136J039k546J594
$$ -1253 2489 -106 -3563 1448 2122 -1024 240 -503 -1592 1972 1034 -2604 532 1571 -975 619
3056F19j117j383L801p06k834J711K20r35J316o39j349K239K71k461J059L98r60
$$ 619 -498 -1881 1920 1214 -1620 91 311 -624 692 53 -1296 943 1214 -1247 -188 210 -750
3073g50J795o08j511J517p4j068O69L03m54N24K14j308M37Q28j060P03N68j129
$$ -750 1045 437 -1074 443 369 -699 -30 273 -181 343 557 -751 -314 514 -546 157 725 -404
3091d04L51J97o10L49N50m19k74Q40o57p64J202m29j03J126j223m54J160m12n30
$$ -404 -53 144 -466 -117 433 14 -260 580 -77 -841 361 -68 -171 955 -268 -722 438 26 -504
3110e04P68mn70R45n68j476J841K71j318J248o56r07J749o77j313J568M15j226
$$ -504 264 260 -310 635 67 -1409 432 703 -615 633 -23 -930 819 142 -1171 397 812 -414
3128d14P10k49j442K144K96k346J747K24j701J737o81j484K460P7k126J120K62
$$ -414 296 47 -1395 749 1045 -1301 446 670 -1031 706 25 -1459 1001 1078 -1048 72 334
3145C34j461J881N2k435K377M26k701J901p8j661K704n15k433K051K42j938J768
$$ 334 -1127 754 806 -1629 748 1174 -1527 374 296 -1365 1339 824 -1609 442 684 -1254 514
3162E14J75k065K382Q0l064K380M03k226K601n02k354K570k71k252K212K53k003
$$ 514 689 -1376 1006 1086 -1978 402 805 -1421 1180 678 -1676 894 623 -1629 583 836 -1167
3179a167K033p6k693K508L44k597K682j50k514K540m87k102K605j33k069K065
$$ -1167 866 790 -1903 605 949 -1648 1034 884 -1630 910 423 -1679 926 793 -1276 789
3195G89q6k314K125K18k253K616j59k714K560k99k021K540n18j727K296n19k101
$$ 789 703 -1611 514 732 -1521 1095 936 -1778 782 483 -1538 1002 484 -1243 1053 534 -1567
3212a567J970K68j738K049l83k255K538k78k161K361l75j327K057j138j551K184
$$ -1567 403 671 -1067 982 599 -1656 882 604 -1557 804 429 -898 1159 21 -1530 654
3228F54j3j451J407k87j379J967o26j867K416j61j344J489j204o93K080p39j075
$$ 654 641 -810 597 310 -1069 898 272 -1595 821 660 -684 805 -399 -1092 988 249 -826
3245h26J288j49p72R22p01q26K025l58j375J185p02k21J362j179k25J273n27m52
$$ -826 462 313 -459 463 -238 -1064 961 603 -772 413 -289 -510 852 -327 -552 721 194 -258
3263b58K08l45J77R71o20o83R02m65j63O54r05N99P01j104K50J9l90Q09r9n01
$$ -258 -50 -395 -218 753 133 -550 352 -113 -276 378 -527 72 773 -331 -81 -62 -452 357 258 -243
3283b43M14K1o32M08K27o50R27q2j104J187n11q71J642o08n25J141j108l68J458
$$ -243 171 192 -440 -32 195 -455 472 390 -714 473 -38 -909 733 125 -400 741 -367 -735 723
3302G23p35p28J426m83q05J436j378o63K694j342j031J800j549J55J903k277k32
$$ 723 -12 -740 686 203 -602 834 -544 -1207 1487 145 -886 914 -635 -480 1423 -854 -1086
3319a086K572j245r54J318j602L49K937k819j153L178j693k39J703l094J167L509
$$ -1086 1486 241 -713 605 -997 -648 2289 -530 -1683 1495 -198 -437 1266 -1828 -661 2848
3335B848l243j314K454j255N86J994l934J83M741l113j685K636k337J801K939
$$ 2848 -395 -1709 745 -510 76 2070 -1864 -1681 3060 -53 -1738 898 -1439 362 3301
3350C301n504j73M846k292r14J753l116J873M287n702j576N360k095Q9J922n472
$$ 3301 -2203 -2376 2470 178 -736 1017 -2099 -226 4061 -1641 -3217 2143 48 137 2059 -3413
3366c413K318N616n530j652L971j915J522J954o633J302P011m412k067K966l344
$$ -3413 -1095 4521 -1009 -2661 1310 -605 917 2871 -3762 -2460 4551 139 -1928 1038 -2306
3381b306L281L405q208P44O868l234q58R89m563M261N192p978j324O283k464P75
$$ -2306 975 4380 -3828 -3084 3784 550 -308 681 -3882 379 5571 -2407 -3731 2552 88 863
3397H63J020p200M600P101p573j960M047k208L296J452q689K797Q336n748k487
$$ 863 1883 -5317 -717 6384 -1189 -3149 898 -1310 1986 3438 -5251 -2454 5882 134 -2353
3412b353K791l563N107L716j0548J105Q206m090o55R24n320N839N649j0044j389
$$ -2353 438 -3125 1982 5698 -4850 -3745 4461 371 -284 640 -4680 1159 6808 -3236 -4625
3427d625P365k615J258R12q481N540P943r113j899M761k360M220R00j0298L785
$$ -4625 2740 125 1383 2295 -6186 -646 7297 -1816 -3715 1046 -1314 2906 3806 -6492 -2707
3442b707R063o238k237K377l754O275L149j1860J969Q735m092j39l63n870P442
$$ -2707 6356 118 -2119 258 -3496 2779 5928 -5932 -3963 4772 680 541 178 -5692 1750
3457A750N268j0723o30O950k363J902m77q779O871P855r402j514M000k417N050
$$ 1750 7018 -3705 -4335 2615 252 2154 1677 -7102 -231 7624 -1778 -3292 708 -1709 3341
3472C341J49j0346M791Q585o490j974J816l596O678K941j1698K278Q303m565J15
$$ 3341 3490 -6856 -2065 6520 30 -1944 -128 -3724 2954 5895 -5803 -3525 4778 213 328
3487C28j89n679P638M804j0662l45O472k424K139l35q320O633P102r229j126L797
$$ 328 139 -5540 2098 6902 -3760 -4105 2367 -57 2082 1747 -6573 60 7162 -2067 -3193 604
3503F04k252N240k68r888M797P415n845j244J204l074O526J836j0641K547P066
$$ 604 -1648 3592 3324 -6564 -1767 5648 -197 -1441 -237 -3311 3215 5051 -5590 -3043 4023
3518D023l810P54r89n086P291L357r104N41M967j928K187j081o930O055N526p605
$$ 4023 213 967 -22 -5108 2183 5540 -3564 -3023 1944 16 2203 1122 -5808 247 5773 -1832
3534a832l01K821k292M529n19p948M560N619m966o18Q02k741N222J629q312K303
$$ -1832 -2133 688 -1604 2925 2406 -5542 -982 4637 -329 -947 -145 -2886 2336 3965 -4347 -2044
3550b044N500l677P35m11m241N930K692p265O16L669j860J871n20n244M608M091
$$ -2044 3456 -221 514 103 -4138 1792 4484 -2781 -2165 1504 -356 1515 995 -4249 359 4450
3566D450o021j33K185j890L737l47n989L492L619l664j0M71j797L766Q04n760
$$ 4450 -1571 -1704 481 -1409 2328 1981 -4008 -516 3103 -561 -571 -100 -1897 1869 2673 -3087
3582c087J711L515k518R57l00k960L985J257m662R84K090j204J298m41l216K696
$$ -3087 -1376 2139 -379 578 278 -2682 1303 2560 -2102 -1118 972 -232 1066 625 -2591 105
3598A05K373l612L54J494j637K101q9l572K278K051k229J90L77j319J784P75l033
$$ 105 2478 -1134 -780 714 -923 1178 1089 -2483 -205 1846 -383 -193 184 -1135 649 1424 -1609
3615a609R41K197j865L71L26j921K049R70k445N65J034r18M58K05j366R93J322
$$ -1609 -668 1529 -336 35 361 -1560 489 1459 -986 -421 613 -305 153 358 -1008 -15 1307
3632A307j795o3J020j047P99M53j460P99O31r84Q0M04l09J81N13p60j86Q77p20
$$ 1307 -488 -551 469 -578 221 674 -786 13 644 -340 -260 144 -165 16 529 -231 -417 460 -260
3651b60l5P95o41Q9L23n14Q2L23j12k83M92O5p86N19j4m30R30m09o48P38n8m47
$$ -260 -295 500 -141 -52 271 -243 -161 162 50 -233 259 324 -462 57 43 -387 543 134 -514 224 166 -281
3673b81K44J56l18N02J82j282O18P83j022O25O9r53J082N3j217N83P01o25J90
$$ -281 -37 119 -199 303 485 -797 -179 604 -418 207 276 -677 405 458 -759 -176 525 -100 90
3692I0K50j175P65J059j693M51R71j251P86J81j534J150R18j363J55O79j003N68
$$ 90 340 -835 -70 989 -704 -253 718 -533 253 434 -1100 50 968 -395 -240 439 -564 4
3710DQ66j817P00J481j859M31P42j562J301P52j925O75J017j354L80Q39j519Q44
$$ 4 870 -947 -247 1234 -625 -194 548 -1014 287 1039 -886 -211 806 -548 -168 671 -848 -4
3728dJ303k228N10J339j823J050P94k010J163Q90j868O53R91j422P09J010k046
$$ -4 1299 -929 -419 920 -903 147 941 -1069 94 984 -884 -231 760 -662 47 1057 -989
3745i89P03J401k089Q84J160k057J139P56k029J097Q98j644P81R11j758O34J138
$$ -989 -286 1115 -974 -90 1070 -987 152 908 -1121 -24 874 -770 11 922 -836 -202 936
3762I36j924R54J226k198R97R28j982J159O84j681J111O92j757O37R68j482P78
$$ 936 -988 -34 1192 -1006 -9 919 -1063 96 780 -901 210 902 -855 -218 750 -732 46
3779D6R18j970J015J017k061R98P50j503J239K21j696R89P68j302N46O27j333
$$ 46 964 -1006 9 1026 -1035 -37 713 -790 449 670 -1026 -37 731 -571 -25 602 -731
3796g31R48O23j967J045R01j417R60l3j300J351K24j307O73N11q02N50P8j291
$$ -731 217 840 -1127 -82 819 -598 362 329 -971 380 604 -703 -30 481 -321 229 307 -984
3814i84J134P07j470P05J44q69J166l70r63J077J78o43K29j50l72Q56Q3j072O87
$$ -984 150 857 -613 92 236 -633 533 163 -800 277 455 -188 41 -109 -481 375 458 -614 73
3833G3K50o97O80m72l78J153m26m92L64k69J55L61l66j98N12j07m32M30l61L3
$$ 73 323 -374 306 -166 -544 609 183 -309 55 -214 -59 302 -64 -262 250 143 -289 141 -220 -187
3853a87P96q14J2N08p56N02K54p07N52J08o04L45J98o15M17N09q97M62K79j182
$$ -187 609 -205 -193 315 -441 61 315 -392 160 268 -336 9 207 -408 9 518 -379 83 362 -820
3873h20J097K74j271J028m3q81J115l92r86J255K46j147O60rr64J578k06j801
$$ -820 277 551 -720 308 265 -616 499 107 -879 376 622 -525 135 126 -838 740 534 -1267
3891a267J722J36j269J281r13p63K268n88j733J247J39p14J379j036j490K781
$$ -1267 455 591 -678 603 -310 -1073 1195 607 -1126 121 260 -454 925 -111 -1601 1180
3907A180j85k252J483m55m09K438j915j829K833Kj605J088r14m79L102j552k948
$$ 1180 995 -1257 226 -229 -638 1800 -115 -1944 889 891 -714 374 -540 -1019 2083 531 -2417
3924b417K927K96j369J846k202r29M177j497k918K306K3n01K149k647j954M640
$$ -2417 510 806 -563 1283 -919 -1848 2329 832 -2086 220 243 -258 1891 -756 -2710 1930
3940A930m39l206K113r21k34L629l419k633M667p6k092J312k023L3M574k755l724
$$ 1930 1491 -1715 398 -523 -757 2872 -547 -3180 1487 1411 -681 631 -1392 -1359 3215 460 -3264
3957c264L990L44j322J887l602m40N909k364l698K671k73L28K428m280j591O064
$$ -3264 726 1070 -252 1635 -1967 -2407 3502 1138 -2560 111 -162 166 2594 -1686 -3277 2787
3973B787q91l706J864j327Q25M366m866k892N737l33k168J267k856R35N532l957
$$ 2787 1896 -1810 54 -1273 -448 3918 -948 -3840 1897 1564 -604 663 -2193 -1258 4274 317
3989C17m221M619L19j091K098m518k18O998l165m306L314m49P06K896n471j623
$$ 317 -3904 715 1034 -57 2041 -2477 -2695 4303 1138 -3168 146 -303 403 3299 -2172 -3795
4005c795P044j275l989K153j646J242M818n928l083O629m36k117J184l611J612
$$ -3795 3249 1974 -2015 138 -1508 -266 4552 -1376 -4459 2170 1734 -383 801 -2810 -1198
4020a198N976m775m148M896L40o13J576n261N01P358l543m142L094o60J452K477
$$ -1198 4778 3 -4145 751 1091 478 2054 -3207 -2706 4652 1109 -3033 61 -599 853 3330
4036C330o118q05P024j519l572J599j844J899M543o122k566O431p86j815J076
$$ 3330 -2788 -3593 3431 1912 -1660 -61 -1905 -6 4537 -1585 -4151 2280 1494 -321 755
4051G55l769K049N786m979l688M634j5l72J650n120O14P080l750l903L206r04
$$ 755 -3014 -965 4821 -158 -3846 788 773 401 2051 -3069 -2455 4625 875 -3028 178 -726
4067g26J529K576o081o45O670j763l190J635j800J967M145n961k275O007q38j398
$$ -726 803 3379 -2702 -3347 3323 1560 -1630 5 -1795 172 4317 -1644 -3919 2088 1250 -148
4083a48R40l663K195N003m784k866M005m7N7J037m606Q80N894l343k890K604r95
$$ -148 792 -2871 -676 4327 -457 -3323 682 635 692 1729 -2877 -1997 3897 554 -2336 268 -727
4100g27J554J887n243j7N288j667k139J143j649J697L201m735j504M768j019j050
$$ -727 827 2714 -2529 -2546 2742 1075 -1064 79 -1570 127 3328 -1407 -2911 1857 838 -212
4116b12R35l093J814M012l890j988L162m41K0J042l533O82M621k766k278K262
$$ -212 723 -2370 -556 3456 -434 -2422 740 299 319 1361 -2172 -1490 3131 365 -1913 349
4132C49r93J092J735m045M7L983j558j535J039j215J219K351l475j083L435q99
$$ 349 -644 448 2183 -1862 -1815 2168 610 -925 114 -1101 118 2469 -1006 -2089 1346 447
4148D47o78Q85k200J267K569k790j037K052l91J32O45k179L58K703j714j213J566
$$ 447 -231 654 -1546 -279 2290 -500 -1537 515 124 256 901 -1278 -920 1783 69 -1144 422
4165D22p72N48J058k415J59K223j011o63O79p59M59J274j730o02K027o42n65P90
$$ 422 -350 198 1256 -1159 -1000 1223 212 -451 228 -531 -72 1202 -528 -1130 897 255 -310 480
4183D80j275M60J530j480m64J212l74k11N16q71n0J468q15q48J083m75j24Q47
$$ 480 -795 -335 1195 -285 -749 463 89 -122 394 -477 -527 941 126 -722 361 -114 -238 609
4201F09r71l5J007n74m14M83j26j69N53l04n20P84k18n48P13k17k44M59l14j84
$$ 609 -362 -397 610 36 -378 105 -21 -190 363 59 -461 323 105 -443 270 53 -191 268 -46 -230
4221b30L46k2l14K34L16n29J43J97m95N41J13o57L67K26l56M8J17k04J98M39p56
$$ -230 116 94 -220 14 330 -199 -56 141 -354 187 300 -357 10 236 -120 -72 45 -159 39 478 -278
4242b78q9P66n53Q3L80p34M67M95q72J0N82k45l2L41o93K7J036q54l20R33o48
$$ -278 -367 399 -154 -71 309 -425 42 537 -335 -325 257 12 -20 321 -372 -345 691 -163 -483 450 -198
4263a98J72N71j142K54R92o67k98N94m71k3Q60r82k87J404p83l85Q80r82K56J075
$$ -198 -26 545 -597 -343 649 -18 -316 278 -193 -216 644 -338 -625 779 -4 -389 491 -491 -235 840
4283H40j143j84J049n97k87P97q06j30J376j039n50J326r11p2J107j236O5J225
$$ 840 -303 -487 562 -35 -322 475 -331 -461 915 -124 -674 652 -259 -331 776 -460 -395 830
4301H30j039k79R75o91j32J119j057l81J445j029l03J318j154L6J184j275l0J132
$$ 830 -209 -488 487 -204 -336 783 -274 -655 790 -239 -542 776 -378 -342 842 -433 -463 669
4319F69r22j16J038r21k37J226j044k65J428j165j47J276j250N7J099j140J21
$$ 669 -253 -369 669 -252 -489 737 -307 -572 856 -309 -456 820 -430 -373 726 -414 -293
4336b93J040j011j81J035q45j54J173j119j20J342j208j02J081j053K75Q83j194
$$ -293 747 -264 -445 590 -255 -409 764 -355 -475 867 -341 -443 638 -415 -140 743 -451
4353d51N4J015p96j60Q44q20O0J067j240j09J204r28J52O55j111M31Q14j012j6
$$ -451 -397 618 -178 -338 506 -314 -254 813 -427 -536 668 -260 -108 547 -564 -133 681 -331 -347
4372c47P43n26Q2N43j015J76J101r73k6O41q10N24M08j102M22O36n57L3J74n14
$$ -347 396 -130 -48 495 -520 -344 757 -216 -242 399 -411 113 521 -581 -159 477 -80 -47 127 -387
4392c87L97N53r15Q2O91o17K85J07p98P55L03p13J93Q4j83L30jn26L33M16n47
$$ -387 10 563 -352 -270 421 -196 89 196 -602 153 456 -257 -64 20 -163 167 166 -360 -27 389 -158
4413a58J08J13m22O65o1o36N09r1j64L61l49p7M26j17k83K09o8j61N15l01l25
$$ -158 -50 63 -359 306 245 -391 118 27 -137 224 -125 -202 224 107 -176 33 -35 -196 319 18 -307
4434c07O25m43r2O04o57J35N43o24J57K95n36J84N52n77p0N59o48K05O58j098
$$ -307 318 -125 -217 387 -270 -135 408 -216 -59 236 -300 -116 436 -141 -211 348 -300 -95 563 -535
4454e35L47Q09r51L31K66q91Q05M78j127K02O84o45L13L14j220Q65R48j530K72
$$ -535 -188 621 -330 1 267 -624 181 659 -468 -266 418 -227 86 400 -820 45 993 -537 -265
4473b65N56q18J081k0j585J020Q82j107J26K05p69J279L94k133P77J199j140O81
$$ -265 291 -527 554 534 -1051 -31 851 -256 -130 75 -694 585 979 -1154 -377 822 -318 363
4491C63k48j394J954M85k155N57Q49o78R74l33k023J860J296k281M77N18j039
$$ 363 115 -1279 675 1160 -995 -438 411 -267 707 374 -1649 211 1507 -774 -297 221 -818
4508h18K017m34k721J936J344j674M64k57j120K427K02l198J351J618j415J010
$$ -818 1199 765 -1956 -20 1324 -350 114 -143 -1263 1164 1366 -1832 -481 1137 -278 732
4524G32q59j911L194N84l138Q59Q84o19J559j144k507K901J480k827L78K54p30
$$ 732 -127 -2038 1156 1740 -1398 -539 345 -274 1285 141 -2366 535 2015 -812 -434 -180 -910
4541i10K764j046l376K616J541j824M26q59q36L332k76l746J570J699j206J160
$$ -910 1854 808 -2568 48 1589 -235 191 -668 -1504 1828 1552 -2194 -624 1075 -131 1029
4557A029j445j998L982M40l696J058P98m33K076j750k885L547J484l145N42P8
$$ 1029 -416 -2414 1568 2008 -1688 -630 168 -265 1811 61 -2824 723 2207 -938 -396 -318
4573c18p16L376j465l992L220J677k052O95j275r11M017o34m222J973J792j158
$$ -318 -1034 2342 877 -3115 105 1782 -270 425 -850 -1761 2256 1622 -2600 -627 1165 7
4589GJ261j954k053M599L08l992J190O88j91K230k360k756L935J328l020L67k05
$$ 7 1268 -686 -2739 1860 2168 -1824 -634 54 -137 2093 -267 -3023 912 2240 -780 -413 -618
4606f18k98L406j784l785L285J462j810O17j614n46M041r07l830J855J428q48
$$ -618 -916 2490 706 -3079 206 1668 -142 475 -1139 -1685 2356 1449 -2381 -526 902 54
4622E4J224k036j808M450J10l724J232M06j28K356k412k592L866R69k805N37l17
$$ 54 1278 -758 -2566 1884 1994 -1730 -498 -92 -220 2136 -276 -2868 998 1967 -838 -301 -618
4639f18k64L334j822l615L257J248j776Q24j627n04L902j136l498J908J198p17
$$ -618 -882 2452 630 -2985 272 1520 -256 568 -1059 -1563 2339 1203 -2295 -387 811 94
4655I4J132j979j528L994o5l214J224K58n9K027k286j975L272O33k106M22m18
$$ 94 1226 -753 -2281 1713 1648 -1566 -342 -84 -143 1884 -402 -2377 895 1528 -578 -156 -574
4672e74r0K589j514k694K573Q41j312P10j424l30L048r96k481J479P09n13R02
$$ -574 -664 1925 411 -2283 290 1131 -181 529 -895 -1225 1823 827 -1654 -175 534 21 923
4689I23j504j115L040j13k469J084Q3j80J707j760j468K595K46j649N13l25j40
$$ 923 -581 -1696 1344 1231 -1238 -154 -71 -251 1456 -304 -1772 823 1069 -580 -67 -392 -532
4706e32K008j153k067K067N15j196P91r83l36K249q70j723J207L74m12O83r27
$$ -532 1476 323 -1744 323 838 -358 433 -550 -886 1363 493 -1230 -23 351 -61 622 -305
4723c05p78J919r7j618Q69N1k66J117j070q59J527M0q63L59j69j64R81m87j111
$$ -305 -1083 836 739 -879 -10 41 -225 892 -178 -1037 490 530 -333 26 -143 -307 674 187 -924
4742i24J117L03p77N33m46l25J169m41q32O94J63l47L03k46m62Q75P2r43N59J42
$$ -924 193 496 -281 252 -194 -519 650 209 -623 71 234 -113 190 -56 -518 357 429 -514 45 187
4762A87m66O16l37m79P73m1n27K66Q7k49L06O4n66M39K33o54L92J12l86L93n1
$$ 187 -279 337 0 -479 294 253 -274 -8 79 -170 136 200 -366 73 306 -348 44 156 -230 163 112
4783A12l30K66R6k80L3L32k80n2K95m02J80L37n24R6L25k16n3J07j37OL98k94
$$ 112 -218 48 144 -136 -103 229 -51 -103 192 -210 -30 307 -217 -121 204 -12 -65 42 -95 -89 309 15
4805A5l77N70j48k19M02m27J3N81m39k61L70j9j05K58k87k91P22j90n83N88j56
$$ 15 -362 208 60 -159 243 -184 -171 410 -29 -290 80 61 -44 214 -73 -364 358 168 -415 173 17
4826A7j63N81o09k36P44j81l76L16r2k22O00l11o48Q89m1n88O08m09k52Q90m63
$$ 17 -146 435 -174 -410 334 153 -223 93 1 -221 379 68 -580 309 268 -320 288 -121 -373 517 54
4847E4n08O91p1l95M51k34m84R18j54q36Q39j71m80Q48n14m66R63k76n71N91j35
$$ 54 -454 237 166 -229 222 -12 -496 422 268 -568 271 100 -380 468 -46 -512 451 175 -396 195 60
4868F0m14P54k38p48R47j41p40Q90l32n10R91m72n46Q42k60m59O90k21n62Q41
$$ 60 -354 400 162 -586 361 220 -520 370 38 -472 519 47 -499 343 83 -376 314 93 -469 372
4888C72k16p21R59k55o44R78m47n01R23m61m07Q12l17m92P24k18n51Q50k85o53
$$ 372 156 -565 394 139 -505 473 26 -475 448 -13 -420 392 75 -417 307 89 -462 388 103 -550
4908e50J023l70o06R03m50l14Q51n24l98P74k27m57O11k42m19Q95m27o56R66l28
$$ -550 473 103 -503 400 -50 -364 487 -37 -435 339 112 -345 266 24 -395 500 73 -583 383 55
4928E5l61P33n88j85Q23m58m05N89j53k46N59m48m06R40l29m97O73m39l1O67o85
$$ 55 -306 427 -161 -346 477 19 -386 203 50 -196 363 -85 -491 449 120 -377 296 -143 -174 493 -192
4949a92j77O93k47k11K83l16n1O56m64l89P04k75j26M13o44J57O37n31r6K67k02
$$ -192 -369 324 77 -134 149 -167 -218 438 -26 -415 289 14 -112 301 -343 -186 451 -80 -176 91 -111
4970a11J40K14m39l6N71l03k07L23m07K63L94o67J49L08k87J69j9k98K65K36l59
$$ -111 29 243 -196 -232 339 36 -171 152 -255 8 402 -265 -116 192 -95 74 55 -243 22 258 -101
4991a01l8K57k46J82J77n48L52J79m34L33q9k60M52j24k79K42oj95K65j1l64L95
$$ -101 -139 118 -128 54 231 -317 35 214 -220 113 24 -236 216 92 -187 55 49 -146 119 108 -256 139
5013A39k2m00N26k48l21O78l47k53M96l70m9N15l72k86N36j59k86N18m65k06R36
$$ 139 117 -283 243 -5 -326 352 5 -248 248 -122 -171 344 -28 -314 222 63 -223 295 -170 -376 560
5034E60n63m05O99m58R5N57q31k2Q49m07l45M12l57R0Q22r48l60J097m53j43M43
$$ 560 -3 -408 291 -167 -72 485 -346 -368 481 74 -271 141 -216 -126 696 -252 -612 485 32 -111 332
5055C32q83M17R69r99l88P77k23P3M18j104J18J421r18n22P59o24N55O91j625
$$ 332 -551 -134 835 -164 -552 225 2 75 493 -611 -493 928 10 -512 247 -377 178 869 -756
5074g56J38J376o44k90L46q09O62J136j687l52J551o23L0L83j553R51J501j705
$$ -756 -618 758 114 -176 170 -639 23 1159 -528 -880 671 48 78 461 -1092 -141 1360 -345
5092c45m04J033m39N19L19j834N86J941j349o49Q01p89J068P21k359L94J849q89
$$ -345 -749 284 -155 364 683 -1151 -565 1376 27 -622 179 -610 458 1179 -1180 -786 1063 174
5110A74k86J10r77J294J168k220l46J738n22J46R5j808J395J702k056m78J019
$$ 174 -112 -2 -979 315 1483 -737 -1083 655 133 279 374 -1434 -39 1663 -393 -871 148
5127A48l60Q98O4k211Q76K116j455o85O32p84J462O99k833N18K080j006j30n1
$$ 148 -212 686 750 -1461 -585 1531 76 -609 23 -761 701 1400 -1433 -915 1165 159 29 -22
5145b2j258J763J219k670k04J892o04L44o0k149J795J895k505l49J098m68J189
$$ -22 -1280 483 1702 -968 -1172 720 116 460 400 -1749 46 1941 -564 -913 185 -283 906
5162I06j38k536J269K200j660o23N14p54J667N54k993O96K118j029q0k59j206
$$ 906 768 -1768 -499 1701 41 -582 -68 -822 845 1399 -1594 -898 1220 191 111 -148 -1354
5179a354J976J046k609j51J673m35L84k42j989J772J762k320l36R00l99J274k43
$$ -1354 622 1668 -941 -1092 581 146 530 288 -1701 71 1833 -487 -823 77 -322 952 709
5196G09k395J268J939j499n03L50o83J676M63k849P30J945j074P9k64j221K014
$$ 709 -1686 -418 1521 22 -481 -131 -814 862 1325 -1524 -794 1151 77 156 -108 -1329 685
5213F85Q56k548Q4J509n06M55k69j876J751J544k266j38Q79n09J234k88k159J293
$$ 685 1541 -1007 -923 586 80 535 266 -1610 141 1685 -581 -719 160 -349 885 597 -1562 -269
5231b69J585j361l11K69o03J420L43k350O47J579r12J32k50j005J630O28j918
$$ -269 1316 -45 -356 -87 -690 730 1073 -1277 -630 949 37 169 -81 -1086 544 1172 -746
5248g46Q1J068l47L44k22j369J260J190j683r2O51m41R53j86j617J005J115j048
$$ -746 -665 403 56 400 178 -1191 69 1259 -424 -516 135 -306 647 461 -1156 -151 964 -84
5266h4j89K35m74J018K98j762N36J192q61J58k5q45J226M22j502K36P80m06K75
$$ -84 -273 -38 -512 506 804 -958 -422 770 -91 67 42 -803 423 845 -657 -421 359 -47 228
5285B28k9j007Q61Q28j273L9N78n01O51j2j131O91O71o98m3K06l46M93K84j007
$$ 228 199 -808 53 881 -392 -353 225 -276 375 363 -768 -77 594 -104 -147 59 -287 206 490 -517
5305e17K30P68n69Q5J37n69N98K77p58J26M21k43K3J35m69K52N37o58l5M74l97
$$ -517 -287 481 -88 -3 134 -435 163 440 -318 -192 229 -14 9 144 -325 -73 464 -194 -229 245 -152
5326a52K02J67n34K88L34m06l5K56k04K4K99m10J6M82m56j8L63l53J17K23l44
$$ -152 50 217 -317 -29 305 -101 -136 120 -84 -60 239 -171 -155 327 -129 -147 216 -137 -20 203 -141
5347a41N8K58k16j20L18j38j77L28k50q8M27l18j23L51j58r5J55j21q2L02n9l86
$$ -141 -83 175 -41 -161 157 19 -158 170 -80 -168 259 -59 -182 169 11 -84 71 -50 -132 170 111 -275
5369b75L29P2k98L27j74k34M95j22l49K38N1j37J96n9l47L91J59n26K74Q5k98
$$ -275 54 126 -172 155 -19 -253 242 120 -229 9 60 -77 119 60 -287 104 263 -263 11 96 -202
5390b02M48j68m45M74Q7l44J73K4k28L53L7n89L79K82m88K94j2m16N82k1n41L35
$$ -202 246 78 -367 107 194 -150 23 47 -181 172 209 -380 -1 281 -207 87 75 -341 241 220 -321 14
5412A4J49l08K29K1m57M46K50o73L17K17m89M75l1n80N54J41n14K68R4l77L75
$$ 14 163 -145 84 105 -352 94 344 -329 -12 205 -284 191 160 -420 134 275 -239 29 123 -254 121
5433A21J48o53L95L20o47L94J23n85N82N3o17M38J28m63L52J02n14L86K39o68
$$ 121 269 -384 11 331 -316 78 201 -384 198 251 -366 72 200 -263 89 191 -323 63 302 -366
5453c66L95K45o33M99Q6o15N39O3n48M45Q8m90L73J30n25L86J93o32M87J52o48
$$ -366 29 274 -359 140 226 -389 150 213 -335 110 198 -292 81 211 -314 72 265 -367 120 272 -376
5474c76N10L9n05N29k5n12M38J09m66L28J00m93M78J16o75M97J22m97M80j03m54
$$ -376 134 173 -332 197 172 -340 98 207 -259 69 169 -324 154 270 -405 92 214 -283 197 94 -360
5495c60N73j6m94L31R5l32L70k2n40N41J45n97M10l1l47N69k10m62N05K9l06K34
$$ -360 213 197 -297 34 129 -203 167 145 -395 146 291 -306 104 73 -274 295 85 -377 128 157 -149 85
5517H5q4k62M81m5n38M54N9l30L97k77k63O15j79l35L01p7q1K98k37k78M75k0
$$ 85 1 -261 220 175 -363 91 150 -180 217 -60 -323 292 113 -222 79 2 -79 219 -18 -296 179 159
5539A59l47L08j91j02N08l78k31M63j88n1J88k86J5L85k16k39L12j16q0L36l95
$$ 159 -188 120 -71 -173 335 -43 -274 189 1 -50 138 -148 -133 252 36 -203 109 -7 -87 249 -146
5560a46m8M89l43o7K54k88J36K34l37j4K91k00m4K71l36N1L78m44P4L12m34K30
$$ -146 -194 295 -48 -115 139 -149 -13 221 -116 -130 161 -39 -83 188 -148 -97 281 -163 -89 223 -211 19
5582A9J88m23K24J54l32J98J65l83J56K66m33K11J99n25M18J77n91L66J03l94
$$ 19 207 -216 8 162 -170 28 193 -190 -34 232 -201 10 209 -316 102 279 -312 54 157 -237
5602b37M06n4m60M46J76n16K34J26m01N03L6p61N90K10n43M08j62l74P08p0o83
$$ -237 169 115 -345 101 277 -239 -5 121 -280 223 259 -502 88 298 -245 163 1 -373 335 265 -418
5623d18L81K44l55L54j46o20Q39J67q66M28O6l02O88l95o99Q34K03o16K47j00
$$ -418 -37 207 -148 206 60 -560 279 446 -420 8 74 -228 460 65 -634 200 403 -213 34 -66
5643f6l02R04k38j052Q22K95n45M86n08m07J239k58r98O12J54k36N77o18o87J350
$$ -66 -368 536 298 -754 68 363 -182 304 -204 -611 628 370 -628 -16 138 -98 479 -139 -826 524
5663E24M1j093N52j03j66J037q51q89J329J26p45L17l81r0J262o21j237J100L21
$$ 524 565 -528 24 -79 -245 792 -59 -948 381 507 -238 79 -302 -392 870 249 -988 112 433
5682D33n47M97q03l06J626m61j210O88J63o6O37r44o63J588M2j210M73j27lJ190
$$ 433 -114 383 -420 -726 900 439 -771 -83 80 14 651 -293 -956 632 674 -536 -63 -190 -193 997
5702I97j102j021J506J85p29K62n72O1J456p91j355J183L37m48N10j023k72J903
$$ 997 -105 -1126 380 565 -164 98 -474 -413 1043 252 -1103 80 417 -31 479 -544 -816 1087
5720A087o48j297Q26M7O4P19j274n77J842j25j230N34k59J30J312j384r86J739
$$ 1087 439 -858 -32 15 79 798 -476 -1053 789 664 -566 -32 -291 -161 1151 -233 -1219 520
5738E20K6p13L28p60K21J551j000j280J210K94l90M87j124j86J918o55j274P76
$$ 520 546 -167 161 -599 -378 1173 173 -1107 103 397 7 494 -630 -816 1102 447 -827 -51
5756e1PJ52P00j283n45J726n9j124L91k30J75J226j281r49J597M7o41L03p56K53
$$ -51 -44 108 808 -475 -1020 706 647 -477 -86 -316 -141 1085 -196 -1145 452 499 -142 161 -595 -342
5776c42J445r84j127J126K15l06M40j063j29J770p20j120Q37j07J52O85j293l62
$$ -342 1103 119 -1008 118 333 27 467 -596 -725 1045 325 -795 42 -65 87 772 -521 -883
5794h83J616k59r15M35k91J75J099j208p69J480j05n21L52p44K24J266q87q76
$$ -883 733 474 -441 -6 -297 -122 977 -231 -1000 480 375 -146 206 -538 -314 952 65 -811
5812h11R22J14k30L89q36j58J442n32r31O83j11Q6N80r72k95J203j72p14L37j76
$$ -811 111 225 -5 384 -452 -610 832 300 -631 52 -59 27 607 -365 -660 543 371 -343 -6 -182
5832a82M5Q43q24o36J139j00m66L62n36J18R30o82o20P53L1k42L55n80j40J057
$$ -182 -137 706 -118 -754 385 285 -181 181 -355 -237 693 11 -609 144 175 -67 288 -292 -432 625
5852F25m57o77O40j72k8N19p16j99Q79k28m46L36j71o7O20n18m62Q13j34l57M02
$$ 625 168 -509 131 -41 -69 450 -266 -465 414 186 -260 76 -95 -162 458 -60 -522 291 157 -200 202
5873B02l82m6O43l99l79M83Pk51K84k25k55O36j74m88M82q6k02L83l08j91M69
$$ 202 -180 -226 417 18 -361 122 129 -122 162 -63 -318 318 144 -344 138 52 -150 233 -75 -266 203
5894B03r4l31K81kk31L36j06l55M78p1l62L92j25j80L44j47k17K98l3k57K39L3
$$ 203 109 -222 59 57 -174 162 56 -299 179 108 -254 138 13 -167 177 30 -187 111 78 -179 60 93
5916I3k76K90j2l37L83n1l08L30m7k03K22m9j88K19P9l22J66J54l04K35L0l49
$$ 93 -183 107 95 -242 141 90 -218 112 65 -138 84 35 -153 66 145 -177 -11 143 -161 74 104 -245
5938b45L41O8l37J67O9j72J63O4l14J61K70l69M6K26l15K57J01m40K27K17k66
$$ -245 96 164 -173 -6 63 -109 54 118 -196 -35 235 -134 -88 138 -177 80 181 -259 -32 185 -81
5959h1O7Q7k12J50K17m03L3L60l11O2J90l98K70K32m39J03J95j98Q7J23l30J11
$$ -81 -14 73 -139 11 228 -175 -142 218 -93 -31 159 -239 31 263 -176 -73 122 -76 11 134 -196 -85
5981h5L61l90j4L04l31J66K04m56J86K88l36M5J71k45J06K71m05OM16l76L9K82
$$ -85 276 -114 -128 176 -155 11 215 -241 -55 233 -103 -58 113 -132 -26 245 -160 -154 262 -114 -75 207
6003B07m23J87L08m67J05K73l02P0K24l35O4L58l94nL74m05R7L13m64J57K88l97
$$ 207 -216 -29 279 -188 -83 190 -112 -42 182 -153 -89 269 -125 -130 244 -161 -64 249 -215 -58 230 -167
6025a67J22K37l29P6K69l37L5L39m09O4L65m48J33K74m38K10K10l88J38K29l08
$$ -167 -45 192 -137 -61 208 -129 -94 245 -164 -100 265 -183 -50 224 -214 -4 206 -182 -44 185 -123
6046a23O6K35l42J11L18m54Q5L33m09J87J87m39K71K01l94J14J94k71J38J93m13
$$ -123 -57 178 -164 -53 265 -189 -104 229 -180 7 194 -245 26 227 -167 -53 141 -130 8 201 -212
6067b12J37L42m35J22K07l85K97J24m40K13J99k74J22P6k82K17K09m47J32K65
$$ -212 -75 267 -168 -46 161 -224 73 197 -243 -30 169 -105 17 93 -189 28 237 -210 -78 187
6087A87l35K21M4m03L68J09l51J65N2j72K10K1l36K29J99l45J55M6k84L98m7l82
$$ 187 -148 73 117 -286 82 191 -160 5 57 -115 95 116 -220 9 208 -137 18 64 -220 178 131 -251
6109b51L22J7j92K12j15j71L02Jl01J98N2k23L05j27l02M47r0k59K92j57r5L22
$$ -251 71 88 -104 108 -7 -178 124 125 -176 22 74 -149 156 29 -273 174 84 -175 117 -40 -135 187
6131A87j73j96K84m0k01K55j05k11M08j66k71M09k07j22L61k78p3L06j94j11K98
$$ 187 14 -182 102 62 -139 116 11 -200 208 42 -229 180 -27 -149 212 -66 -139 167 -27 -138 160
6152A60j75j60L80k20j82M16l11p7M49l78o3L79l17J8K83l54J4L89l07j14L66
$$ 160 -15 -175 205 -15 -197 219 -92 -169 280 -98 -161 218 -99 -81 202 -152 -138 251 -56 -170 196
6173A96l26K6M46n51K2M99m34N6K57m44K36L39n00k1M27l04K8L04n64J77N81o16
$$ 196 -130 -104 342 -209 -187 312 -122 -66 191 -253 -17 322 -178 -199 228 -76 -48 256 -308 -131 450 -166
6195a66l1L99m00K74K38o88K04N61m48p6K68l93K90M50q40P5O59m63J08J30o10
$$ -166 -197 202 -198 76 314 -374 -170 391 -57 -133 135 -258 32 482 -358 -283 376 -87 21 151 -459
6216d59N18M66q00JM77k94K21J30p99M47P19q27j2L66m28N35J37j033M87O55o01
$$ -459 59 525 -275 -274 203 -91 130 260 -539 -92 627 -200 -212 154 -274 261 398 -635 -148 507 -94
6237i4L0J09m58O53L34j136K80P17n44K44k7p65Q81M44j090J41M59k85M10p7r54
$$ -94 -64 45 -413 240 574 -562 -282 435 -109 135 108 -657 224 668 -422 -281 178 -107 303 226 -728
6258g28P11P61r61j4L16m24P57L5j230N90P61o29L2k2m53Q50L09j275K50P97m74
$$ -728 -17 744 -217 -231 85 -339 418 453 -777 -187 574 -55 -23 -45 -498 352 661 -614 -364 433 -41
6279d1K34j24q51J048M93j206J51M41k56N17k17j019Q54P62j026K5K50m02R04
$$ -41 193 69 -782 266 759 -447 -296 145 -111 406 189 -830 24 786 -240 -215 35 -367 537
6298E37j01j330P96P03o94J48j76m32J047J26j312M03P01m76L44k71q44J191L94
$$ 537 436 -894 -98 605 -89 59 -117 -549 498 624 -688 -285 416 -60 284 13 -831 360 754
6317G54j247K34L60k42O26l46j013R24O83r31pJ82l38R18j26j299P47O89o21J23
$$ 754 -493 -259 101 -141 485 139 -874 50 733 -198 -205 -23 -361 557 431 -868 -121 568 -53 70
6337G0k02m00J003J17j210L31O46l88K74k32p64J082L67j160K61L12k33O00l73
$$ 70 -132 -532 471 588 -622 -291 355 -33 241 9 -755 327 694 -466 -205 107 -126 474 101
6356A01q85Q97N11q46Q9J07k98Q29j59j131P49N15n99K40k44l82R74j8j033M01
$$ 101 -784 113 624 -222 -133 -26 -324 505 346 -785 -36 479 -120 120 -124 -506 468 450 -583 -182
6376a82M47l17K84k31o57R48K89r89K79K16k24N44l13p30P39L86o53O9R9k61O12
$$ -182 265 -52 232 1 -656 292 581 -408 -129 87 -137 407 94 -636 103 489 -164 -95 4 -257 355
6397C55n3r01N58M43n32K01j18l43P15J4p55K93L59l16K13r3m89O52K16p66K84
$$ 355 302 -599 -41 402 -130 71 -47 -390 325 339 -416 -123 236 -80 133 40 -449 203 419 -347 -63
6418f3J76k65M23j86n38N52K12m82J20Q4k33M27j7o42M37K65m41K46o1k99N06
$$ -63 113 -152 271 85 -453 99 311 -171 -51 33 -200 227 210 -432 5 270 -171 75 14 -285 221
6439B21j4m96K51J92k34J59ol71M05J65n06K12J51k76K74k9l51L04J31l12Q5J44
$$ 221 207 -289 -38 154 -80 79 73 -298 107 272 -234 -22 129 -147 127 98 -253 51 182 -130 -45 99
6461I9k31J65J41l89J96K32l62J46J08k63K17O6k80J41J40k28P0J57k51J21J64
$$ 99 -132 33 174 -215 -19 213 -149 -3 105 -158 59 125 -155 -14 126 -102 -32 125 -126 -5 159
6482A59l26J46J80l03J41J09k09J20P4k02Q5J53k02MJ94k05N4J74k94J23J67k36
$$ 159 -167 -21 159 -144 -3 106 -103 17 91 -111 -26 127 -75 -71 123 -82 -28 146 -148 -25 142 -94
6504i4O6R7j35O1J03j83pK34j54q5K03j85M8K14k92J7K20j56j2R8j17QK16j80
$$ -94 -28 69 -66 -5 98 -85 -92 142 -12 -97 106 -79 -31 183 -109 -92 128 -28 -40 58 -59 -51 165 -15
6528a5j40K73j07q5K17k56J4K90k28q0J94r2k2J48j63p3K83j17j83K58j42n7K67
$$ -15 -155 118 11 -74 143 -113 -99 191 -37 -117 77 -15 -37 111 -52 -125 158 41 -142 116 -26 -83 184
6551A84k55n8K77j46p2J45j19l4K16j45j65K90r4j42K55k02n3L00k21r0K36j32
$$ 184 -71 -129 148 2 -70 75 -44 -78 138 -7 -172 118 24 -118 137 -65 -118 182 -39 -129 107 -25
6573b5n0J84j36j05K67j00j86K76j44j07K99k23q6L01j93p6K17j40p1K33j32j43
$$ -25 -75 109 -27 -132 135 35 -151 125 -19 -126 173 -50 -136 165 -28 -104 113 -27 -98 135 3 -140
6595a40K74j35j48L05j78j17L17k31n9K62j87n7K10j27r7K17j18j20K76j65j34
$$ -140 134 -1 -149 156 -22 -139 178 -53 -112 150 -37 -94 116 -11 -108 109 -9 -129 147 -18 -152
6616a52L04j91n3K52k41j1K57j96o9J97j12n4K01j69j09L15j81j12K56k16K9K30
$$ -152 152 -39 -92 160 -81 -92 165 -31 -100 97 -15 -69 132 -37 -146 169 -12 -124 132 -84 -55 175
6638A75k69lK18j43j6J31j69%K40j97j04K75j84qK04k86O6K54k53QJ35j37O3J29
$$ 175 -94 -97 121 -22 -38 93 -76 -76 164 -33 -137 138 -46 -54 150 -136 -70 184 -69 -61 74 -63 0 129
6662A29k20j5K62j93l9J82k27J05J81l02P6J81j88R0M3j89J17J42k13jJ61j62
$$ 129 -91 -106 156 -37 -76 106 -121 -16 165 -137 -61 120 -68 22 65 -124 -7 135 -78 -79 82 -80
6684h0R4J15k97J64J51k60J33K1j66J93K3k18J20R8j83R2Q6k40J93R2k90K00M3
$$ -80 14 129 -168 -4 147 -113 20 41 -125 68 91 -127 -7 91 -92 0 86 -154 39 131 -159 41 84
6707H4k18K23k8k16K16K4k04J61M0k31K10M0k75K44J0k52K80k9k75K92n1j81K45
$$ 84 -134 89 61 -155 61 85 -119 42 82 -149 61 101 -174 70 80 -172 108 79 -196 96 45 -136 109
6730A09p7k03K76j4k64K34j5k10L28j26k79M01j01k07K82j78j11L66j86k49L15
$$ 109 32 -171 105 91 -173 61 46 -164 164 38 -241 160 59 -148 134 -44 -155 211 25 -224 91
6751I1k7j81K80k05k04N04j90k92L53j60p0L56l46j68M70j15k52K43j54q2M90
$$ 91 64 -117 163 -42 -246 258 68 -224 129 -31 -101 255 -91 -259 211 96 -156 87 -67 -149 341
6772C41l55l39N51j17k00K95l43l3N70l41l29L94o6q6L02m04j74O96k48l94L77
$$ 341 -14 -353 198 81 -119 176 -167 -200 370 29 -300 94 28 -58 244 -160 -334 362 114 -280 97
6793I7j94M1M50n69j94O56j74k53K38k79P1N57n34l46O66j62j39K95n53J23P16
$$ 97 -97 -56 394 -175 -369 287 113 -140 98 -181 -110 447 -87 -433 233 71 -68 227 -326 -203 513
6814E13n37l15M44j25M5K72o04l6Q14l74l85L73k74K14M58p86j16P64k29k28J97
$$ 513 -24 -339 105 -20 25 297 -307 -343 471 97 -288 85 -189 25 483 -303 -419 345 116 -112 85
6835H5l89K38O44p06l62P10j32j03K40o45J99Q24o05l97M80j21J28K71p43RQ96
$$ 85 -304 -66 578 -128 -490 220 88 -15 225 -420 -221 603 -2 -399 81 -40 88 359 -384 -375 521
6856E21l93m26L61k73K57N03r08q7Q49k91j89J56m35L42O17p91k89P07j70k8J97
$$ 521 128 -298 63 -210 47 550 -358 -445 404 113 -76 80 -355 -13 604 -187 -476 231 61 33 230
6877B30p19L13Q24p23k77M42k03K83J90q11J33Q46m36l33K81l01L54M55r24m0
$$ 230 -489 -176 648 -75 -352 90 -113 170 360 -451 -318 528 92 -241 40 -261 93 548 -376 -416
6897d16Q15k98j37J05m61M07N89p81k88O73j43k5J79o74K86P73o72k85M47j88
$$ -416 399 101 -36 69 -392 15 604 -177 -465 208 65 40 219 -455 -169 604 -68 -353 94 -94
6917i4K35J93p55J42P56m10k97K91k61K86M00q42j1P40l35p0J08m41M00M63o96
$$ -94 141 334 -421 -279 477 67 -230 61 -200 86 486 -356 -367 373 38 -32 76 -365 35 498 -198
6938a98j51N44j66K7J35o01K84O69o35j65L65k15K51J41o65J80N98l75j72K02
$$ -198 -349 195 29 56 191 -410 -126 543 -92 -257 108 -107 144 285 -380 -200 398 23 -149 53
6958E3k49K67L35o85rO06k97n1J15l82L12L78n53j02M33j59j5J63m31J57N28m95
$$ 53 -196 71 406 -279 -288 318 21 -30 85 -297 15 393 -160 -262 171 12 -3 160 -271 -114 414 -81
6980h1j38L51k20J42J67m84J17M37k98j38K24k01J33K70m85%M50k68k7J52l19
$$ -81 -219 132 -88 54 221 -263 -146 291 -7 -145 79 -122 11 281 -204 -204 246 -22 -49 103 -216
7001b16K32K58m07k9K98j40kJ31l03R7L62l50p0K71k17J09J45l48R8K69k16p3
$$ -216 16 274 -133 -162 136 -4 -6 125 -178 -81 281 -69 -139 132 -85 24 169 -179 -81 188 -28 -101
7023a01J92j39QK18k72l9L05k05m6J98k13N3J98k34k1K13j14p8J79j44n8K59k14
$$ -101 91 -48 -40 178 -94 -133 172 -33 -79 119 -94 -41 157 -77 -98 115 1 -77 102 -42 -100 159 -55
7046e5o8K66j78l9J86j73KJ71j40m9J71q3r4J82j20p0K30j72o9K18j42l1J39j25
$$ -55 -123 143 -35 -74 112 -61 -59 112 -28 -77 94 11 -83 99 -21 -91 139 -33 -102 116 -26 -57 82 -43
7070d3lJ28r0p4J56l4j23J60r0q5K21j30r5J91q0o7J18q2n7J61k8j71J55J3j34
$$ -43 -46 82 -8 -82 74 40 -83 77 -13 -98 123 -7 -102 89 9 -58 60 -22 -79 82 54 -117 38 51 -83
7095h3J71r7j19K41p6j32J45l4o7J11l3j41J60L5j80J42jj44K08q1j61K02qj18
$$ -83 88 -9 -128 113 37 -95 50 16 -51 60 27 -114 46 81 -99 43 42 -102 106 25 -136 66 58 -60
7119f0J03l7p5J30J0j86J42N6j78J64m2j55K16l9j60J59k1p9J13k6j25J31M9j92
$$ -60 43 6 -69 61 71 -115 27 83 -95 69 27 -128 88 49 -111 48 27 -52 61 35 -90 41 90 -102
7143a02J39K6j79J96l0j83K01j3j37J38k5j22J44J3j83J50M1j83J70Jj97K16k3
$$ -102 37 63 -116 80 50 -133 68 55 -82 56 31 -91 53 66 -117 33 74 -109 61 62 -135 81 58
7166E8j67J86m1j26J37nj37J39J7j71J59K3k04J82jj71K07n8j43K04n8j22J34
$$ 58 -109 77 36 -90 47 42 -95 44 61 -110 49 72 -132 50 49 -122 85 27 -116 88 30 -92 42
7189D2%j11J35j4j76K00qj76J74n8j20K23j01j14J72m6q0J05m2r1J69j5j85J66
$$ 42 42 -69 66 52 -124 76 68 -108 66 8 -112 111 10 -104 68 22 -58 47 5 -86 83 68 -117 49
7213D9j7j14J97j21j07K19q6r7J27n8m6J49j00j10J98l7j28J65j07o6K35j59q4
$$ 49 32 -82 115 -6 -113 106 20 -77 50 -8 -54 95 -5 -115 83 46 -82 83 -24 -90 145 -14 -98
7236i8J85j05j8J26j29k6J67r3r2J58q8n7J93j75m1K37j75nJ25j65M8J22j39k6
$$ -98 87 -18 -36 90 -39 -65 102 9 -83 75 -13 -70 123 -52 -93 144 -31 -36 89 -76 -28 94 -45 -71
7260g1J44r4k8J47j63KK05k07K5J51j91P2J11j79N5J19j43J6J21j70L8J76k20
$$ -71 73 -21 -49 98 -65 -63 142 -65 -40 111 -80 -8 103 -76 -21 98 -45 -29 92 -78 -40 136 -84
7283h4M6J70k44J09J31k48J15J13j91R0R2k04Q4J69k26M1J67k40J17J29l11J78
$$ -84 -38 132 -112 -3 128 -120 -5 108 -83 7 99 -105 -21 148 -78 -37 130 -110 7 136 -175 3
7305CJ43k56J27N9k18J97P6k69J09J61k16J02Q8k97K45J30l54J73O9k02K32j3
$$ 3 146 -110 17 76 -142 55 131 -138 -29 132 -84 18 106 -191 54 184 -170 3 72 -130 102 89
7327H9k90K44J18k64J07O5k25K84L3m28K83J49k78J87l8k52L75L0l85J62J43j87
$$ 89 -201 43 161 -103 4 69 -156 128 161 -267 16 165 -113 74 36 -216 159 189 -196 -34 109 -78
7349g8J88l8l63L90J45m43J86Q6k09L37j15m20L95J50l24J20qk07M06j0n33L47
$$ -78 110 72 -291 99 244 -199 -13 73 -136 201 86 -334 61 211 -113 7 -1 -208 198 188 -345 2
7371BJ82k94K34j50k71N31k4m68K33J18j71K69j74l72N16J20m97K14Mj66M76k50
$$ 2 184 -110 124 -26 -297 234 210 -258 -25 93 -78 191 17 -355 161 281 -216 -2 2 -164 312 62
7393F2m52N01J14l28J49j25j34N23j16n95M13J84k74K51k54k71O73o7n71K75J05
$$ 62 -390 111 225 -103 46 -79 -213 310 194 -401 12 196 -78 173 -81 -352 321 254 -317 -42 63
7414F3j18L06k86l94O12J19n26J98Lj30N16l00n19N59J42l49J70j61j40N84j70
$$ 63 -55 251 -35 -429 183 302 -224 -26 -23 -153 363 63 -456 103 245 -104 66 -95 -235 349 179
7435A79n91M17J73k70K83k94k59P02j14n42L13M0q5L38l50l52O35N9m89K14o5
$$ 179 -412 5 178 -92 191 -103 -362 340 226 -316 -3 37 -48 290 -60 -412 223 282 -207 7 -58
7456e8q5N41l55n01N98Q3k97J53k25p5N95k12n70M16J57k27K64l22k51P24j36
$$ -58 -143 398 43 -458 140 223 -74 79 -146 -221 374 162 -408 8 165 -62 202 -120 -371 353 217
7477B17n34L06K7n9L32l62l27O16M5m65K18m6j21N12l20m71N81M9l05J97k21p7
$$ 217 -317 -11 16 -43 289 -73 -400 216 261 -204 14 -32 -153 359 39 -432 149 198 -107 90 -131 -208
7499b08N45k17m78L96J05k07K51k91k13O39j43m56L07k7n0L06l42k51N39j3l44
$$ -208 337 120 -358 38 143 -64 187 -104 -317 322 179 -277 30 3 -47 259 -83 -334 205 192 -152
7520a52J74p0o3M08k83l69M89Mk25J91k09p0M58k06l53L24O3j63K06k11j88M83
$$ -152 22 -48 -111 297 14 -355 134 138 -87 104 -105 -175 283 77 -276 48 111 -52 154 -57 -245 238
7542B38r9l71K86l7r5K83k47k18M13j4k82J79k6j29L26j70l04L88mk22K00j45
$$ 238 139 -232 54 17 -78 205 -42 -260 153 139 -143 36 10 -119 207 37 -267 121 117 -105 95 -50
7564e0q7L37j34k61K41J7j38J81j27j65L57p8k70K39l3r8K15j70j35K66k1j95
$$ -50 -137 200 66 -195 46 63 -75 106 -21 -186 171 93 -177 62 29 -69 146 -24 -159 107 86 -109
7586a09J38j2j07K19j05k07K82k2j82J84r2r2K19q3j69J90J1j46J44j5j80K18
$$ -109 29 17 -90 129 24 -183 99 77 -105 79 -13 -105 114 31 -138 52 63 -83 61 46 -134 84
7608H4qk11J93qj47J74o0j13J65k4j44J29K9j52J29K7j84J76J5j87J70j1j25J37
$$ 84 76 -135 58 50 -97 77 17 -96 69 45 -99 30 59 -93 36 63 -121 55 70 -117 53 42 -83 54
7632E4k4j17J24J5j42J06N0j46J08L7j66J45J8j59J26K3j02Q3Lj16J02M8j30M9
$$ 54 30 -87 37 52 -90 16 66 -80 28 65 -101 44 62 -97 29 52 -50 33 36 -80 22 70 -60 -11
7656a1P2j28R2M9j73J17N2j49R3J6q1P9M3j44P0R6j48M0Q2j38R6O2j89J03P7j30
$$ -11 61 -67 25 74 -99 18 70 -79 14 30 -51 28 71 -73 -3 93 -55 -15 67 -71 25 87 -102 1 78 -52
7682e2O6L5j08N9Q9j46K4J23j39M7Q1j71R7Q7j61O5M9r4O6M6j23L4J22j46K7R6
$$ -52 14 49 -59 0 89 -57 -33 90 -49 -2 79 -92 5 92 -69 -4 45 -49 17 63 -60 -26 96 -50 -23 73
7708G3j45Q0P9j66P6Q3j37O1O1j22M3Q6j20K2J13j44M4J13j69P3J01j85P9P7j40
$$ 73 -72 8 87 -79 -3 80 -57 4 65 -57 -14 72 -48 -26 87 -57 -13 100 -69 4 105 -80 -1 76 -64
7733f4O1P6j25M0R5j41M9J00j73P0R9j74J01N8j57R5O7j39O5O4j22N0Q8j64O0
$$ -64 -3 73 -52 -12 83 -58 -9 91 -82 -12 87 -87 14 72 -85 10 77 -62 3 67 -55 -5 83 -81 -21
7758b1J13j63Q6N7j50J03N6j65R7M0j10P7M1j21O1Q7j73P2R9j60J21K8j64J15
$$ -21 92 -71 15 72 -78 25 81 -84 13 53 -57 20 61 -60 1 88 -85 -13 86 -74 47 75 -89 26
7782B6M8j37Q8Lq7J00L1j49P7P9j49Q5L4j57J75%j62J27jr4J01j7r8J14L0j35
$$ 26 74 -63 25 28 -59 41 72 -77 0 79 -70 15 49 -108 67 67 -95 32 31 -63 38 21 -77 37 67 -68
7808f8Q7K2j21J51l2j63J92k6j16J32n4q5J62n2j11J21Qj21J29l6j24J85m4j35
$$ -68 19 41 -80 71 39 -124 68 42 -74 58 4 -81 81 29 -82 39 47 -74 55 19 -105 80 36 -99
7832i9J74o7p9J69j15n5J45n9r0J40m8j07J80o9j16J91r7q1J88j29o4J78j02n3
$$ -99 75 8 -71 98 -17 -72 73 14 -76 64 16 -91 89 20 -96 95 -2 -83 105 -24 -88 90 -12 -65
7856f5J55j13o6J94q7j19K07j08p8K24j88o2K42j54n2J73j55j1K10j58j03K41
$$ -65 90 -23 -89 105 18 -101 106 -2 -80 144 -44 -106 136 -18 -70 103 -52 -63 147 -11 -114 127
7878A27j32o4K00k08j9K89k24n9J96j64L3J66k35qK60j75p2J96j83K7K37k90j6
$$ 127 -5 -69 131 -77 -96 193 -31 -90 106 -58 -25 141 -94 -102 158 -17 -89 107 -76 -49 188 -102 -118
7901a18K72j85pJ47k49J04K44k81n7K41j42RJ68k90O3L22k90n8K19k11J30J76
$$ -118 154 -31 -38 109 -140 -36 208 -73 -130 111 -31 -22 146 -144 -81 241 -49 -107 112 -99 31 207
7923B07l86O7L21k31m9J60k34J42K65m08j8L49k27L0J49l52J95K95l93k3K64j71
$$ 207 -179 -112 209 -22 -71 89 -145 -3 262 -146 -164 185 -42 -12 137 -215 -20 275 -118 -141 123 -48
7945d8Q0J37l98J33L86l68l5K17k50K15J61m68J16L51k43k4J12k66K31K50m77
$$ -48 32 169 -229 -96 290 -78 -113 104 -146 69 230 -238 -122 229 -14 -38 74 -192 39 289 -188
7966a88K5L60k32P3P8l89K87L02m48kK31j60J60N2m37K07L89l80l5J82k39K84
$$ -188 -163 197 -35 38 116 -273 14 316 -132 -134 97 -63 97 149 -288 -81 308 -72 -107 75 -164 120
7988A20J49n51J67L71k87NP9k83K98K50n42N0L71k47R6P7m40L39L29n06K6K23
$$ 120 269 -282 -115 256 -31 -26 53 -230 68 318 -224 -174 197 -50 46 123 -317 22 351 -155 -129 94
8010I4j77J99M7m61K30L89l85k1J48k35L15J11n57K00L50k83M8J8k71L45J86n09
$$ 94 -83 116 163 -298 -68 321 -64 -85 63 -172 143 254 -303 -103 247 -36 12 30 -241 104 290 -219
8032b19N9L39k23J19J5m06L71K68m75M7J73j50K15Lm53K66L43l62nJ39k28L07
$$ -219 -160 179 -44 75 90 -316 55 323 -152 -105 68 -82 133 136 -317 -51 292 -70 -75 64 -164 143
8054A43R5n25K05L11k82P8J6k62L26J71m72P9K85k16J17L3l85L26K56m51O4J63
$$ 143 238 -287 -82 229 -53 25 41 -221 105 276 -196 -117 168 -48 69 102 -283 43 299 -152 -88 75
8076G5j83K40jm02K47K82l35K0J04j87K65P9m73K06K53k46R2j0k29L07R8l84J14
$$ 75 -108 132 131 -271 -24 258 -77 -57 47 -140 125 204 -269 -63 190 -56 36 26 -203 104 202 -182 -68
8099f8J92j63R4K7l18K79J86l74Q4J42j79J95%l08J97K03k52K6J00j79J95R2l60
$$ -68 124 -39 55 82 -236 43 229 -145 -61 81 -98 97 97 -211 -14 189 -63 -37 63 -116 79 171 -189
8122a89J54K03k34Q0L5k06K27R3l06R8J56j60Q1N3k49J88J52k96P6J25j61J46
$$ -189 -35 168 -66 14 49 -157 70 163 -143 -45 111 -49 32 85 -164 24 176 -120 -44 81 -80 66
8144F6K0k44J62J21j95M5Q6j33J13P0k49J08J56j94Q4N2j58J42M7j95Q1J06j38
$$ 66 86 -158 4 125 -70 -25 61 -72 41 111 -138 -30 126 -68 16 68 -90 52 99 -96 -15 91 -47
8167d7N4O9j69J06J06k02O9R3j45R3N0j58Q7R0j41J8J01j16M3Q8j69N0J29j70
$$ -47 7 76 -93 13 119 -83 -14 79 -66 27 77 -81 6 96 -45 -27 74 -42 1 89 -80 -30 99 -71
8191g1
$$ Imaginary data points
##PAGE= N=2
##DATA TABLE= (X++(I..I)), XYDATA
0@%%%%%%%%%%%qJ6j6J6k4L2l5M3n6P0p9R0j08J31j53J77k08K41k76L16l63M15
$$ 0 0 0 0 0 0 0 0 0 0 0 0 -8 8 -8 8 -16 16 -19 24 -32 38 -41 49 -59 72 -81 96 -112 129 -147 169 -194 221
33B21m71N33o01O76p60Q52r52J060j178J309j451J607j781J967k167K389k633
$$ 221 -250 283 -318 358 -402 450 -502 558 -620 689 -762 845 -936 1031 -1136 1253 -1380
50a380K900l195L519l880M282m731N241n820O486p262Q177r283J0646j2368J4629
$$ -1380 1520 -1675 1844 -2036 2246 -2485 2756 -3064 3422 -3840 4337 -4946 5700 -6668 7961
65G961j7751K2366k9980M5495j28925K25773N6663k46947J71931j86795m3406
$$ 7961 -9790 12576 -17404 28091 -100834 124939 181602 -65345 106586 -80209 -123615
76a23615K86769k15043j82225M09359j9601j96128Q3854k06032k2078M23556j58153
$$ -123615 163154 -51889 -234114 175245 155644 -40484 43370 -162662 -184740 238816 80663
87H0663k34547K52715o3094j21643J60823k07274j7265M13638j32454k81579J46839
$$ 80663 -153884 98831 35737 -85906 74917 -132357 -149622 264016 131562 -150017 -3178
98c178o9571k905K57189k08337j22263L37215j15575k25209J41298p4564N4909
$$ -3178 -72749 -75654 181535 -26802 -149065 188150 72575 -152634 -11336 -85900 -30991
109c0991K93460k45432k15065K57291m3944j00424J63658j26777j680K80519k29513
$$ -30991 262469 17037 -198028 59263 15319 -85105 78553 -48224 -49904 230615 1102
120A102k29601K38525N094p792J59973k25570p9795K76411j37293j57696K02226
$$ 1102 -228499 10026 15120 7328 167301 -58269 -138064 138347 1054 -156642 45584
131D5584k0898j559J43663k58103j15869K99938l9397j00510J35726j18476j9073
$$ 45584 24686 23127 166790 -91313 -207182 92756 53359 -47151 88575 -29901 -48974
142d8974J76676k05763r4429K72594j4752q2129O6622j73108j3667K41980j19146
$$ -48974 127702 -78061 -172490 100104 85352 3223 69845 -103263 -116930 125050 5904
153E904j00360J88044n8343o3561P8248j66845Q541K61656q5394j22162Q8237
$$ 5904 -94456 93588 35245 -28316 49932 -116913 -108372 153284 67890 -54272 33965
164C3965q4056o435J37943j29552k3950K09853q7259j21129O5377p8268M8018
$$ 33965 -50091 -56526 81417 -48135 -72085 137768 50509 -70620 -5243 -83511 -35493
175c5493J78893j33427q1250J32550p1685n3594Q7618o9601L6107J56575j38317
$$ -35493 143400 9973 -71277 61273 -10412 -64006 23612 -45989 -9882 146693 8376
186H376j12763J05768l1395J4764J06460j07787j8605J20077j09361o8740J03850
$$ 8376 -104387 1381 -30014 -15250 91210 -16577 -35182 84895 -24466 -93206 10644
197A0644j4290K9746P8561j36025n6177J15901m2375j9041Q9933n2912k217O2315
$$ 10644 -3646 26100 104661 -31364 -87541 28360 -14015 -33056 56877 3965 1748 64063
209F4063j20863l3531J21918q034l371L8959r1640j7702P8602n7463j0785R6927
$$ 64063 -56800 -90331 31587 23553 20182 59141 -32499 -50201 28401 -29062 -39847 57080
221E7080k6861k4173J8195q9561N013J05317k5054j4755L7082n6929j7046L6842
$$ 57080 30219 6046 24241 -65320 -60307 45010 19956 5201 42283 -14646 -31692 5150
233E150m4598J7976Q7335l2616m1510Q659n0375J4897P1367k7784k101L7225n1040
$$ 5150 -39448 -21472 65863 33247 -8263 396 -49979 -35082 36285 8501 6400 43625 -7415
246g415k7804K1484j6566L2462N7981l8710l5945J0206l0661P167M9084j1071
$$ -7415 -35219 -13735 -30301 2161 60142 21432 -14513 -4307 -34968 -27801 21283 10212
258A0212P559K0976n2371k5807K2225J715K8742L1942l0161k4414J369k2742N182
$$ 10212 17771 38747 -13624 -39431 -17206 -15491 13251 45193 15032 -9382 -8013 -30755 -25573
271b5573M0232N215L617J417m3356j7273J9849Q677K3280J8772j9277k0866j1246
$$ -25573 14659 19874 23491 24908 -18448 -35721 -15872 -7195 16085 34857 15580 -5286 -16532
284a6532j3014J0644L2502J2225l275j0092k9952j3336J3709J4499K1630J1299
$$ -16532 -29546 -18902 13600 25825 22550 12458 -17494 -30830 -17121 -2622 19008 30307
296C0307j5036k1724j7082k268J4890K3011J5097n803j6634k0904j2814J0432
$$ 30307 15271 -6453 -23535 -25803 -10913 12098 27195 21392 4758 -16146 -28960 -18528
308a8528K1796J9088L692j3715k0991j7285M181J5822J6616J7611p001k3103j5257
$$ -18528 3268 22356 26048 12333 -8658 -25943 -21762 -5940 10676 28287 21286 -1817 -17074
321a7074j0185J0062K6467J3891j972j0967k0172j6815P116J7102J4623J6868
$$ -17074 -27259 -17197 9270 23161 21189 10222 -9950 -26765 -19649 -2547 12076 28944
333B8944r609k7247j0176n725R022K7388J0073m456r267k1229j5200R894J8749
$$ 28944 19335 -7912 -18088 -23813 -14791 12597 22670 18214 8947 -12282 -27482 -17588 1161
346A161J3961J2003j1482k6758p559j996Q294K6436Q998o296j0576k1726j1121
$$ 1161 15122 27125 15643 -11115 -18674 -20670 -12376 14060 23058 16762 6186 -15540 -26661
359b6661J2023J8846J3645N904j1805k3430q737J516R988K3412Q985q094j3840
$$ -26661 -14638 4208 17853 23757 11952 -11478 -20215 -18699 -8711 14701 23686 15592 1752
372A752j9669o130J1880J8370J4290m23j1683j8826j2263N477J3831J7514R719
$$ 1752 -17917 -24047 -12167 6203 20493 20070 8387 -10439 -22702 -17225 -3394 14120 23839
385B3839q707j9011j5395q65R422J8585J5154p179j0636j3506j7492R494J9439
$$ 23839 15132 -3879 -19274 -20139 -10717 7868 23022 15843 5207 -8299 -25791 -16297 3142
398C142R777J0568q466k5876q438M834L760J9399J6592j3279q818r834k3500J5150
$$ 3142 12919 23487 15021 -10855 -19293 -14459 -10699 8700 25292 12013 3195 -6639 -30139 -14989
412a4989K6747m55R569o349l1655K73Q532n884K3453K0644k0908q766p561k6603
$$ -14989 11758 11303 20872 14523 -17132 -16859 -8327 -14211 9242 29886 8978 212 -7349 -33952
426c3952K3802L1283j5135R632J279l7168N429R547j4854L3937K4045l5928q223
$$ -33952 -10150 21133 5998 15630 16909 -20259 -14830 -5283 -20137 13800 37845 1917 -6306
439f306m86k6371L0182K8483k9529J7654J1631m9423N329J4984j7401M4581J9168
$$ -6306 -6792 -33163 -2981 25502 -4027 13627 25258 -24165 -18836 -3852 -21253 23328 42496
452D2496n5679J633J3431l1562K7979K4441l3251L1119J2469o9747R981L1805
$$ 42496 -13183 -11550 1881 -29681 -1702 22739 -10512 20607 33076 -36671 -26690 5115
464E115j9366M2342Q307o5068K3153K1525n1025K5374L3397k8511L3601j337q2484
$$ 5115 -14251 28091 36398 -28670 -5517 16008 -35017 -9643 23754 -4757 28844 27507 -54977
477e4977L0849M9115l6759K9811J0249n7982L8644J0646p3685M1832N2992l7999
$$ -54977 -24128 24987 -11772 18039 28288 -29694 8950 19596 -54089 -12257 40735 2736
489B736J9380j0411p3400N6757M4768o7706L2034L2743n5763L0853o198p5800
$$ 2736 22116 11705 -61695 -4938 39830 -27876 4158 36901 -18862 11991 5793 -70007
501g0007P5709N7849p2637J0815O092n6190O1414J8842q4351O2270N2309q1374
$$ -70007 5702 63551 -9086 1729 7821 -48369 13045 31887 -52464 9806 62115 -19259
513a9259J1453M79n3787R5355L1435j07155L4086L7231o3374L8585M256o4676
$$ -19259 -7806 -7327 -61114 34241 65676 -41479 -7393 29838 -33536 5049 9305 -55371
525e5371R4559L5961j22454J6957L7397m1179P4387o06j02367P7663M1111j03709
$$ -55371 39188 75149 -47305 -30348 7049 -34130 40257 39651 -62716 14947 56058 -47651
537d7651K5623K9723l5334Q7458p427j33510O0080O3356o9860M0880O056o6342
$$ -47651 -22028 7695 -27639 59819 52392 -81118 -21038 42318 -27542 13338 19394 -46948
549d6948R3924L234j36510N8034O9163m5803M8166k7242r9365J01145M0630j17224
$$ -46948 46976 50210 -86300 -28266 40897 -4906 43260 16018 -83347 17798 58428 -58796
561e8796M7018M8948n1598O2637l5683j20984J14580P0287r9176K8720M098o0143
$$ -58796 -11778 37170 -14428 48209 12526 -108458 6122 76409 -22767 5953 10051 -50092
573e0092R3619j2378j27103J00123P4786q9736K0783k4256o9408J33098J9999
$$ -50092 43527 31149 -95954 4169 78955 -10781 10002 -14254 -83662 49436 69435
584F9435j38022O4939M9822p0425M5717l1444p9541J41355M0108j42276K7700
$$ 69435 -68587 -3648 46174 -24251 21466 -9978 -89519 51836 91944 -50332 -22632
595b2632K8948m6112Q9879k4502j12692J19536M6031j23586K4066R261l1763J20190
$$ -22632 6316 -39796 50083 25581 -87111 32425 78456 -45130 -21064 -11803 -43566 76624
607G6624k1218j44693Q2077N6563q1278M1605j0581n4682J28460r277j56140O3314
$$ 76624 55406 -89287 -7210 49353 -31925 9680 -901 -55583 72877 63600 -92540 -29226
619b9226N9018m1873O3711m2473r2511J23676K0887j31590N0153M2789l2911P9906
$$ -29226 29792 -12081 51630 9157 -83354 40322 61209 -70381 -20228 22561 -10350 69556
631F9556n6061j25277J23066N4662r7924M0209k678m4731J02338m0374j29382
$$ 69556 13495 -111782 11284 65946 -31978 8231 5553 -39178 63160 22786 -106596
642a06596J07699O5884p2357L0187m0046o2673J30293j289j26028P6835M2227
$$ -106596 1103 66987 -5370 24817 -15229 -77902 52391 51102 -74926 1909 44136
653D4136n6199M5561n4105p1622J40458K6663j16924L5998J1546l8866P9527l9977
$$ 44136 -12063 33498 -20607 -92229 48229 74892 -42032 -6034 5512 -33354 46173 6196
665F196r0164J21437L3830j02964K2597j2085k4207J12241k8220j10349Q1065
$$ 6196 -83968 37469 71299 -31665 -9068 -21153 -45360 66881 38661 -71688 9377
676I377L2029o8647L3816k2609l2847J19330j6778j23551N3895L0041l1938N9621
$$ 9377 41406 -27241 6575 -16034 -48881 70449 53671 -69880 -15985 14056 -17882 41739
688D1739m0781o0548J06736j967j03688M1675K1861j4404P2237n1017r0316R3155
$$ 41739 958 -59590 47146 45179 -58509 -16834 5027 -9377 62860 11843 -78473 14682
700A4682K2820p0417M1346o417k4188Q0211m5857r2453Q0580L5419m0900L3612
$$ 14682 37502 -32915 8431 2014 -22174 58037 12180 -80273 307 35726 -5174 28438
712B8438l5478m2422Q7561j5556q0418O3499K3589l2323L5751m9502m8512R4419
$$ 28438 -7040 -49462 38099 22543 -57875 5624 29213 -3110 32641 -16861 -65373 29046
724B9046R081o4132L4702j944k6390M8094l5278n0159Q4087J7009n8136J8015
$$ 29046 38127 -26005 8697 6753 -19637 28457 -6821 -56980 27107 44116 -14020 3995
736C995k0127j8165P0305k0362n3950N6159P611m1997J9229k0710j3658P4216
$$ 3995 -16132 -34297 36008 15646 -38304 17855 25466 -16531 2698 -18012 -31670 42546
748D2546j0978o3319L1232K777k1401L8393k1485k4088O1266j1702n4697K2437
$$ 42546 31568 -31751 -519 2258 -19143 19250 -2235 -26323 34943 23241 -31456 -9019
760i019K707l341M4803k4445m1472M2401j718l4708K8126k311p380M1283k8563
$$ -9019 -6312 -9653 35150 10705 -30767 11634 9916 -24792 3334 1023 -6357 34926 6363
773F363m3803L5277P965j1872K5171j5278j9248L1764j5071l1827L2595J0404
$$ 6363 -37440 -2163 5802 -6070 19101 3823 -15425 16339 1268 -30559 2036 12440
785A2440r843J8380k5459k3999L4068m5j5869K2039k872j2754J2212j7554j5835
$$ 12440 2597 20977 -4482 -28481 5587 5542 -10327 11712 8840 -3914 8298 -9256 -25091
798b5091L2853Q737j5451Q156j2920j3338K0952m750q642K3203j042j5614J429
$$ -25091 7762 16499 1048 9204 -3716 -17054 3898 -852 -9494 13709 12667 -2947 -1518
811a518j0000k804K3613K990j2381O200o394j2394J0037j92N0J7780m819j5176
$$ -1518 -11518 -14322 9291 12281 -100 6100 -294 -12688 -2651 -2843 -2793 14987 10168 -5008
825e008j08l860J223J3735K764n247J548o231j0605N438N998L144Q883m579j1118
$$ -5008 -5116 -8976 -7753 5982 8746 3499 5047 -1184 -11789 -6351 -353 2791 11674 7095 -4023
840d023k160j716K816Q606N160j547n500n231n573J638R020M181K116j284q678
$$ -4023 -6183 -7899 -5083 3523 8683 7136 1636 -3595 -9168 -7530 1490 5671 7787 6503 -2175
855b175o568R65N465N374N869q25r905k607j615k814J0624O520k626M15q032r591
$$ -2175 -8743 -7778 -2313 3061 8930 8105 -1800 -4407 -6022 -8836 1788 8308 5682 6097 -1935 -11526
871a1526N226P030J581N882jj1385j481j61n056J2629Q449p407N39o314j0495
$$ -11526 -6300 730 2311 8193 8192 -3193 -4674 -4835 -9891 2738 11187 3780 4319 -1995 -12490
886a2490Q269O494j406P489L02j2949j466J077m345J3372P989j0811J175l830
$$ -12490 -4221 2273 867 8356 8658 -4291 -5757 -4680 -9025 4347 12336 1525 2700 -1130
900a130j1522R222O339k427Q993j316j4375j78K377l101J2212O611j1136J417
$$ -1130 -12652 -3430 2909 482 9475 8159 -6216 -6394 -4017 -7118 5094 11705 569 1986
914A986k823j2146R715P374k930Q492l219j3994J707K250k132J1068N471r788
$$ 1986 -837 -12983 -3268 4106 1176 9668 6449 -7545 -5838 -3588 -5720 5348 10819 1031
928A031o5k989j0378R790P794l324O920l843j2541K200J376k06J0422L535q184
$$ 1031 966 -2023 -12401 -2611 5183 1859 8779 4936 -7605 -5405 -4029 -4235 6187 9722 1538
943A538k054l032o730Q128P251k120M825m195j0929J576J399K438Q768R10n659
$$ 1538 -516 -3548 -10278 -2150 5101 2981 7806 3611 -7318 -5742 -4343 -1905 6863 7773 2114
958B114l600l588k708N534O750Q25J065m862p948L33J794M733O111o49k503n790
$$ 2114 -1486 -5074 -7782 -2248 4502 5327 6392 1530 -6418 -6085 -4291 442 6553 5904 3401 -2389
974b389m905K155L306N623L906l523m828l381k719J723P953L481j691l82q607
$$ -2389 -7294 -5139 -1833 3790 7696 4173 -655 -4036 -6755 -5032 2921 6402 4711 4329 -4278
989d278m850P742J77K928P916o880m910O24p430L031J3204j115l841K169j0202
$$ -4278 -9128 -1386 -1209 1719 9635 2755 -2155 -1531 -8961 -5930 7274 6159 2318 4487 -5715
1004e715l262J1333n140J822J4373j0823p619M464j0386O327J7526j0016m824
$$ -5715 -8977 2356 -2784 -962 13411 2588 -5031 -567 -10953 -4626 12900 2884 -1940
1017a940Q887j2073l933J2344q942N178J9823j9332j1144J2647j0541O466J7543
$$ -1940 6947 -5126 -9059 3285 -5657 -479 19344 12 -11132 1515 -9026 -2560 14983
1030A4983j8412n3J7417j9837p749J6874p556P937J7948k9070q072K4583j4423
$$ 14983 -3429 -3482 13935 -5902 -13651 3223 -4333 3604 21552 -7518 -15590 8993 -5430
1043e430n30J8766j8416O287J8837l2820o449K9167q059K148J3050l0291J990
$$ -5430 -5960 12806 -5610 677 19514 -13306 -19755 9412 1353 3501 16551 -13740 -11750
1056a1750L0045k7045n897K9591j4745L451J2677l9960N617M0567k0943p195J8107
$$ -11750 18295 -8750 -14647 14944 199 3650 16327 -23633 -18016 22551 1608 -5587 12520
1069A2520k3266P369K2742l9999K685M5533k2077r609J2257l3373J8725L7696
$$ 12520 -10746 -3377 19365 -20634 -17949 27584 5507 -4102 8155 -25218 -6493 31203
1081C1203m2136m368L6383k3024k099J3377l7713K1549M8260m4370j6383K9103
$$ 31203 -10933 -15301 21082 -1942 -4041 9336 -28377 -6828 41432 -2938 -19321 9782
1093I782k3311J4314K3228m9760J5313M9112m2181j5479K2121k2164K7190L0619
$$ 9782 -13529 785 24013 -25747 -10434 38678 -3503 -18982 3139 -19025 8165 38784
1105C8784o0535j490M9679l0983n225K0733l4462L0113L8183o6569r525M6764
$$ 38784 -21751 -23241 26438 -4545 -9770 10963 -23499 6614 44797 -21772 -31297 15467
1117A5467j8514R907J4619n1900K2670M9067n6419j2860M1535j8718J9997J5227
$$ 15467 -3047 6860 21479 -30421 -7751 41316 -15103 -27963 13572 -5146 14851 30078
1129C0078p0478J7530O1096m1668q839K4407k9899K8643K4235p4003R226O5857
$$ 30078 -40400 -22870 38226 -3442 -12281 12126 -17773 10870 35105 -38898 -29672 36185
1141C6185l0112o060J0717m8006L8089M4730p1872L37N3782k6973O568M619n9874
$$ 36185 6073 13 10730 -37276 813 45543 -26329 -25992 27790 817 7385 12004 -47870
1154d7870M1022O1034o2925j3674L5545k7915K5263J6065p2130L2285O5634n4146
$$ -47870 -6848 54186 -8739 -22413 13132 -14783 10480 26545 -45585 -13300 52334 -1812
1166a812j4671J7781l0771M4478K9360p8636J0816N9501l8403m429J1802m2066
$$ -1812 -16483 1298 -29473 15005 44365 -34271 -23455 36046 -2357 -6786 5016 -37050
1178c7050M9845M2972q2193n120M9101k4043J7329P274n9302M1587N1391o9610
$$ -37050 12795 55767 -26426 -31546 17555 -6488 10841 18115 -41187 400 51791 -17819
1190a7819j2140L8104j8367L2798R884p9021K8773O0535n0933n323K0616k8272
$$ -17819 -29959 8145 -10222 22576 32460 -46561 -17788 42747 -8186 -13509 7107 -21165
1202b1165M3541J6547q3980J6496O1944l1018K038M804m7212M7312L5471p7970
$$ -21165 22376 38923 -45057 -28561 33383 2365 4403 9207 -38005 9307 44778 -33192
1214c3192P410N0584k4553J5737m435o1936M7528N0799o1354l466K9190k5174
$$ -33192 -25782 24802 249 15986 11551 -50385 -2857 47942 -13412 -16878 12312 -12862
1226a2862K9452M679o9909L8155N7093m8945n703R119l0537M5918J8282o9991
$$ -12862 16590 21269 -48640 -10485 46608 -2337 -8040 1079 -29458 16460 34742 -35249
1238c5249K0130M7933l4340K28J388l6813N0273L2481o9218K974L5502k3682J8586
$$ -35249 -15119 32814 -1526 -1298 90 -36723 13550 46031 -23187 -20213 15289 -8393 10193
1251A0193J52m7457M3887L6416n8510n013K3411j5459L2216M245o0046K8663M0005
$$ 10193 10345 -37112 6775 43191 -15319 -20332 3079 -12380 19836 24081 -35965 -7302 32703
1264C2703m3259R01J2323k0825M0382P479o3894J7046L7750k4030Q978J376l2857
$$ 32703 -10556 -9655 2668 -18157 22225 29704 -34190 -17144 20606 -3424 5554 6930 -25927
1277b5927L7429J8305n6882J0472L1632j7307J8020o096m4156L4825K6997m0651
$$ -25927 11502 29807 -27075 -16603 15029 -2278 15742 9646 -34510 315 27312 -13339
1289a3339N940J6560j6961K1933k226m5661K7818L2835k9919L086K979k2311K9473
$$ -13339 -7399 9161 -7800 14133 11907 -33754 -5936 26899 -3020 66 3045 -19266 10207
1302A0207O654m0901J9069K5326k1297L125l371k2505L0919J6583l6621O880J6227
$$ 10207 16861 -24040 -4971 20355 -942 2183 -1188 -23693 7226 23809 -12812 -5932 10295
1315A0295j7401J1681j492k4558K8280J6439l1064P09P337j0337J8918K548k7015
$$ 10295 -7106 4575 3083 -21475 6805 23244 -7820 -7111 226 -10111 8807 11355 -15660
1328a5660J6534J5081k3993K974N143j0416K2605K786k9236R231J1205j2304Q459
$$ -15660 874 15955 -8038 -5064 79 -10337 12268 15054 -14182 -4951 6254 -6050 2409
1341B409J685j2799J6188M258k4677N709J1630p261J1176j557j8588J2465N923
$$ 2409 4094 -8705 7483 11741 -12936 -7227 4403 -2858 8318 6761 -11827 638 6561
1354F561j4974O827O358n801P725k870j6295Q696J0389q160M312J727r882O938
$$ 6561 -8413 -1586 4772 -1029 6696 3826 -12469 -3773 6616 -1544 2768 4495 -5387 1551
1368A551M53j1087Q677P401n507R32k794p184O186N419n586L010L701o972K62
$$ 1551 2004 -9083 -406 6995 1488 2420 -374 -7558 -1372 4047 -1539 1471 5172 -1800 -1538
1383a538K04m426P298M540m966n71j387l315K174L073l39J587J593m958k493J660
$$ -1538 -1334 -5760 1538 6078 1112 541 -846 -4161 -1987 1086 747 2334 3927 -1031 -3524 -1864
1399a864m97L447L129k158j705j945j544M96L007K915j390k50j347m214J500K042
$$ -1864 -2361 1086 4215 2057 352 -1593 -3137 -2641 366 3281 1891 1641 294 -3920 -2420 -378
$$ [...]
8191g4
##END NTUPLES=NMR FID
##END=
