##TITLE=1H_Pr A1
 , 8 sc, 
 15.2.2019
##JCAMPDX= 6.0         $$ Bruker NMR JCAMP-DX V2.0
##DATA TYPE= NMR FID
##DATA CLASS= NTUPLES
##ORIGIN= UXNMR, Bruker Analytische Messtechnik GmbH
##OWNER= root
$$ XWIN-NMR		Version 3.5
$$ Fri Feb 15 15:47:18 2019 Russian Standard Time (UT+4h)  she@DPX200
##.OBSERVE FREQUENCY= 200.1313
##.OBSERVE NUCLEUS= ^1H
##.DELAY= (6, 6)
##.ACQUISITION MODE= SIMULTANEOUS
##.ACQUISITION SCHEME= undefined
##.AVERAGES= 8
##.DIGITISER RES= 18
##SPECTROMETER/DATA SYSTEM= spect
##.PULSE SEQUENCE= zg30
##.SOLVENT NAME= DMSO
##.SHIFT REFERENCE= (INTERNAL, DMSO, 0, 15.7039)
##AUDIT TRAIL= $$ (NUMBER, WHEN, WHO, WHERE, WHAT)
$$ ##TITLE= Audit trail, XWIN-NMR		Version 3.5
$$ ##JCAMPDX= 5.01
$$ ##ORIGIN= Bruker BioSpin GmbH
$$ ##OWNER= she
$$ F:/spectra/data/she/nmr/H-F/1/audita.txt
$$ ##AUDIT TRAIL=  $$ (NUMBER, WHEN, WHO, WHERE, WHAT)
(   1,<2019-02-15 15:44:16.12 +0400>,<she>,<DPX200>,
      <created by zg, POWCHK disabled, PULCHK disabled
       configuration hash MD5:
       00 E9 B6 7A A2 85 ED C7 34 08 36 98 17 FE 4E 26
       data hash MD5: 16K
       AB 8F 2E C7 81 D0 9A B0 26 49 B1 25 C8 06 35 18>)
$$ ##END=
$$ 
$$ hash MD5
$$ 22 F5 48 B9 FF 1C 6B 87 9B 0D C7 20 48 9F 3A EF
##$RELAX= 
##$RELAX= 
##$RELAX= 
##$RELAX= 
##$RELAX= 
##$RELAX= 
$$ Bruker specific parameters
$$ --------------------------
##$DU= <F:/spectra>
##$EXPNO= 1
##$NAME= <H-F>
##$PROCNO= 1
##$TYPE= <nmr>
##$USER= <she>
##$AMP= (0..31)
100 100 100 100 100 100 100 100 100 100 100 100 100 100 100 100 100 100 
100 100 100 100 100 100 100 100 100 100 100 100 100 100 
##$AQSEQ= 0
##$AQ_mod= 1
##$AUNM= <au_zg>
##$AUTOPOS= <>
##$BF1= 200.13
##$BF2= 200.13
##$BF3= 200.13
##$BF4= 200.13
##$BF5= 200.13
##$BF6= 200.13
##$BF7= 200.13
##$BF8= 200.13
##$BYTORDA= 1
##$CFDGTYP= 0
##$CFRGTYP= 5
##$CHEMSTR= <none>
##$CNST= (0..31)
1 1 145 1 1 1 1 1 1 1 1 1 1 1 1 1 1 1 1 1 1 1 1 1 1 1 1 1 1 1 1 1 
##$CPDPRG= <>
##$CPDPRG1= <>
##$CPDPRG2= <>
##$CPDPRG3= <>
##$CPDPRG4= <mlev>
##$CPDPRG5= <mlev>
##$CPDPRG6= <mlev>
##$CPDPRG7= <mlev>
##$CPDPRG8= <mlev>
##$CPDPRGB= <>
##$CPDPRGT= <>
##$D= (0..31)
0 1.2 0 0 0 0 0 0 0 0 0 0.03 0 0 0 0 0 0 0 0 0 0 0 0 0 0 0 0 0 0 0 0 
##$DATE= 1550231055
##$DBL= (0..7)
120 120 120 120 120 120 120 120 
##$DBP= (0..7)
150 150 150 150 150 150 150 150 
##$DBP07= 0
##$DBPNAM0= <>
##$DBPNAM1= <>
##$DBPNAM2= <>
##$DBPNAM3= <>
##$DBPNAM4= <>
##$DBPNAM5= <>
##$DBPNAM6= <>
##$DBPNAM7= <>
##$DBPOAL= (0..7)
0.5 0.5 0.5 0.5 0.5 0.5 0.5 0.5 
##$DBPOFFS= (0..7)
0 0 0 0 0 0 0 0 
##$DE= 6
##$DECBNUC= <off>
##$DECIM= 32
##$DECNUC= <off>
##$DECSTAT= 4
##$DIGMOD= 1
##$DIGTYP= 9
##$DL= (0..7)
0 120 120 120 120 120 120 120 
##$DP= (0..7)
150 150 150 150 150 150 150 150 
##$DP07= 0
##$DPNAME0= <>
##$DPNAME1= <>
##$DPNAME2= <>
##$DPNAME3= <>
##$DPNAME4= <>
##$DPNAME5= <>
##$DPNAME6= <>
##$DPNAME7= <>
##$DPOAL= (0..7)
0.5 0.5 0.5 0.5 0.5 0.5 0.5 0.5 
##$DPOFFS= (0..7)
0 0 0 0 0 0 0 0 
##$DQDMODE= 0
##$DR= 18
##$DS= 0
##$DSLIST= <SSSSSSSSSSSSSSS>
##$DSPFIRM= 0
##$DSPFVS= 10
$$ [...]
##$SUBNAM2= <"">
##$SUBNAM3= <"">
##$SUBNAM4= <"">
##$SUBNAM5= <"">
##$SUBNAM6= <"">
##$SUBNAM7= <"">
##$SUBNAM8= <"">
##$SUBNAM9= <"">
##$SW= 20.0189088683792
##$SWIBOX= (0..15)
0 0 2 0 0 0 0 0 0 0 0 0 0 0 0 0 
##$SW_h= 4006.41025641026
##$TD= 16384
##$TD0= 1
##$TE= 0
##$TE2= 300
##$TE3= 300
##$TEG= 300
##$TL= (0..7)
0 120 120 120 120 120 120 120 
##$TP= (0..7)
150 150 150 150 150 150 150 150 
##$TP07= 0
##$TPNAME0= <>
##$TPNAME1= <>
##$TPNAME2= <>
##$TPNAME3= <>
##$TPNAME4= <>
##$TPNAME5= <>
##$TPNAME6= <>
##$TPNAME7= <>
##$TPOAL= (0..7)
0.5 0.5 0.5 0.5 0.5 0.5 0.5 0.5 
##$TPOFFS= (0..7)
0 0 0 0 0 0 0 0 
##$TUNHIN= 0
##$TUNHOUT= 0
##$TUNXOUT= 0
##$USERA1= <user>
##$USERA2= <user>
##$USERA3= <user>
##$USERA4= <user>
##$USERA5= <user>
##$V9= 5
##$VALIST= <valist>
##$VCLIST= <CCCCCCCCCCCCCCC>
##$VD= 0
##$VDLIST= <DDDDDDDDDDDDDDD>
##$VPLIST= <PPPPPPPPPPPPPPP>
##$VTLIST= <TTTTTTTTTTTTTTT>
##$WBST= 1024
##$WBSW= 4
##$XGAIN= (0..3)
0 0 0 0 
##$XL= 0
##$YL= 0
##$YMAX_a= 232809
##$YMIN_a= -280045
##$ZGOPTNS= <>
##$ZL1= 120
##$ZL2= 120
##$ZL3= 120
##$ZL4= 120
##$ABSF1= 10
##$ABSF2= 0
##$ABSG= 5
##$ABSL= 3
##$ALPHA= 0
##$AQORDER= 0
##$ASSFAC= 0
##$ASSFACI= 0
##$ASSFACX= 0
##$ASSWID= 0
##$AUNMP= <proc_1d>
##$AZFE= 0.1
##$AZFW= 0.1
##$BCFW= 1
##$BC_mod= 2
##$BYTORDP= 1
##$COROFFS= 0
##$CY= 11.3945322036743
##$DATMOD= 1
##$DC= 2
##$DFILT= <>
##$DTYPP= 0
##$F1P= 18.9103706918063
##$F2P= -1.10871071338519
##$FCOR= 0.5
##$FTSIZE= 0
##$FT_mod= 4
##$GAMMA= 1
##$GB= 0.15
##$INTBC= 1
##$INTSCL= 1
##$ISEN= 128
##$LB= 0.24
##$LEV0= 0
##$LPBIN= 0
##$MAXI= 10000
##$MC2= 0
##$MEAN= 0
##$ME_mod= 0
##$MI= 1.114404
##$NCOEF= 0
##$NC_proc= 0
##$NLEV= 6
##$NOISF1= 3.799351
##$NOISF2= 2.8
##$NSP= 1
##$NTH_PI= 0
##$NZP= 0
##$OFFSET= 15.70392
##$PC= 1
##$PHC0= -9131.467
##$PHC1= 8.600144
##$PH_mod= 1
##$PKNL= yes
##$PPARMOD= 0
##$PSCAL= 0
##$PSIGN= 0
##$REVERSE= no
##$SF= 200.130013532006
##$SI= 16384
##$SIGF1= 3
##$SIGF2= 2
##$SINO= 400
##$SIOLD= 16384
##$SREGLST= <1H.CDCl3>
##$SSB= 0
##$STSI= 0
##$STSR= 0
##$SW_p= 3612.71676300578
##$SYMM= 0
##$S_DEV= 0
##$TDeff= 0
##$TDoff= 0
##$TI= <>
##$TILT= no
##$TM1= 0
##$TM2= 0
##$TOPLEV= 0
##$USERP1= <user>
##$USERP2= <user>
##$USERP3= <user>
##$USERP4= <user>
##$USERP5= <user>
##$WDW= 1
##$XDIM= 8192
##$YMAX_p= 0
##$YMIN_p= 0
$$ End of Bruker specific parameters
$$ ---------------------------------
##NTUPLES= NMR FID
##VAR_NAME=  TIME,          FID/REAL,        FID/IMAG
##SYMBOL=    X,             R,               I
##VAR_TYPE=  INDEPENDENT,   DEPENDENT,       DEPENDENT
##VAR_FORM=  AFFN,          ASDF,            ASDF
##VAR_DIM=   8192,          8192,            8192
##UNITS=     SECONDS,       ARBITRARY UNITS, ARBITRARY UNITS
##FACTOR=    0.0002496,     1,               1
##FIRST=     0,             0,               0
##LAST=      2.0444736,     0,               0
##MIN=       0,             -280045,         0
##MAX=       2.0444736,     232809,          0
$$ Real data points
##PAGE= N=1
##DATA TABLE= (X++(R..R)), XYDATA
0@%%%%%%%%%%%%Qj6J6j6K4l2L2m0M8n6P2q5R8j14J33j52J70j94K24k56K89l26
34a73L70m18M67n23N86o51P23q03Q92r89J091j206J332j467J617j780J958k158
52a132K380k625K902l217L574l983M460n026N707o547P614r009J0919j3707J8149
67A0459k6281M5649j67781j42091M05989j09679J884J22368k69964Q8890K72937
78B32380l68902o9411L18483r5319K9431J08148l32324R2825L02073l07229q1436
89a71281K56494q5928J07307Q4286m12213L4119L44682j69419j9356J46273j88563
100g3599J01310J33359l62401M1850L24317j39538j1290P0384k31366J45846J87967
111A86839l35999m311K68700q6937N7012K5517l18321J16105K48178k27978J7416
$$ plain form
0 0 0 0 0 0 0 0 0 0 0 0 0 0 8 -8 8 -8 16 -16 16 -24 24 -32 40 -45 53 -61 72 -80 90 -104 120 -136 153 -173
34 -173 197 -221 246 -277 309 -342 381 -422 470 -519 572 -634 698 -769 848 -932 1026 -1132
52 -1132 1248 -1377 1525 -1692 1882 -2101 2359 -2667 3040 -3507 4107 -4902 6017 -7690 10459
67 10459 -15822 29827 -137954 -280045 125944 16265 18149 140517 -129447 -40557 232380
78 232380 -136522 -205933 112550 17231 46662 154810 -177514 -84689 217384 -89845 -171281
89 -171281 85213 -715 106592 190878 -221335 -187216 157466 -11953 -31309 114964 -73599
100 -73599 27711 161070 -201331 -159481 164836 25298 14008 84392 -146974 -1128 186839
111 186839 -149160 -153471 115229 28292 85304 110821 -207500 -91395 156783 -71195 -53779
122e3779J77120j43335O7307L1350l01151J38759K70392j88873j6509P8482j55947
133i6184J35849Q2253l01349Q2745K38278j24283K7617J7540k15888J33493J28540
144A08611k26434Q1869J77274j33921K0601j4094k03555J74221J75266j98477
154c8639J6985Q5170j17945R1191J4717k12083J31329J60879j42448K6747L0369
165D6272j38232R9618L9535j74519J27508J42226j36165j145k0341j23673J59317
176B0401Q8607j65551N5562P0762j07409N1583m457j26957J33859Q3436j37459
187c7623M7069L9406j02925O0960m129j10047J39904Q6775j26811L664j2291p8043
199i4091J15759L7798j07652P4683L6984j03431L4220J271o5821J03019K4511
$$ plain form
122 -53779 123341 -19994 47313 78663 -222488 -83729 186663 -2210 -18719 59763 -96184
133 -96184 39665 121918 -179431 -96686 141592 17309 44926 62466 -153422 -19929 108611
144 108611 -117823 -35954 141320 7399 28000 13906 -189649 -15428 159838 -38639
154 -38639 -21654 63516 -54429 36762 51479 -160604 -29275 131604 -10844 15903 46272
165 46272 -91960 7658 47193 -127326 182 142408 6243 5098 -15243 -138916 20401
176 20401 109008 -56543 -981 69781 -37628 13955 9498 -117459 16400 99836 -37623
187 -37623 9446 48852 -54073 6887 2758 -107289 32615 119390 -7421 -3757 -16048 -94091
199 -94091 21668 59466 -48186 26497 63481 -39950 -5730 -4459 -70280 32739 57250
210E7250r9302N9810K7168p9580L0171j3078n2742J12025M0396r3108J1709j1369
222a0650n4688P3121J8638m9646O4620J548q2055K5245O830k8279O3299o76n6519
235b9212N1094J0845n8441J6225r700k2145P5615J5060n3561J3399j8598m0197
247d9616M4403J7404j2628M0717j6501n6799J9024P658j1985L7338n038k7281
259a3304L2114k640l3862J0232p472q114M2047R888k1255L659k2213k7272K6083
272a2109J9579M950J8699j9312l2763O715M541K274J9439j768j0802Q300k902
285D841j2100J390m719k382J9582J2030l360p010j9993j4289J1027J8645J3919
298A7581L627j2806j8562p555O146J0746R311K136o631n299R48J78m505l066J358
$$ plain form
210 57250 -42052 17758 44926 -34654 -4483 -17561 -70303 41722 82118 -10990 719 -10650
222 -10650 -65338 7783 26421 -23225 41395 42943 -39112 -13867 -7037 -35316 27983 27307 -29212
235 -29212 21882 32727 -25714 -9489 -19189 -41334 34281 49341 -4220 9179 -9419 -49616
247 -49616 -5213 12191 -437 40280 23779 -33020 -13996 -6338 -18323 19015 13977 -13304
259 -13304 18810 16170 -17692 -7460 -14932 -23046 19001 28889 7634 11293 -10920 -38192 -12109
272 -12109 7470 12420 31119 11807 -20956 -14241 -9700 -7426 12013 10245 -557 7743 4841
285 4841 -7259 -5869 -10588 -12970 6612 18642 15282 8272 -11721 -26010 -14983 3662 17581
298 17581 21208 8402 -10160 -17715 -11569 -823 8488 10624 3993 -1306 -358 -180 -4685 -7751 -6393
313f393N787J3100M607j3333j2056p824p80J8060J5537j306o307j4253j4256P581
327a1836J4783L998L211m538j2101M335M973p724J482J132k155J2607N544j1137
341B574o091o917n933J4855J5685j528l550j1874j5888Q180J3833K480M554n572
355D808j1907L742M303l132K138p04l714P554O242n348m460o886o234J0333J2732
370I467K513l241j1750j0610L330J0626P757O82n495p273k300M712L766j025j814
385f55j042L00N009L959p088p021k57j23J0634J1117r188q877l062o254J0178
400b370J4084o463l855L94j1423M288J3344q583n30O158j3200O498J5025j5215
414a848l234N800j3193J2365J9040j8267m592O481j8162J0382K1838j7967K044
$$ plain form
313 -6393 -606 12494 17101 3768 -8288 -16112 -16892 1168 16705 15399 9092 -5161 -19417 -11836
327 -11836 2947 6945 10156 5618 -6483 -2148 2825 -4899 -3417 -2285 -4440 8167 13711 2574
341 2574 -3517 -10434 -16367 -1512 14173 12645 9095 -2779 -18667 -10487 3346 5826 10380 4808
355 4808 -7099 -3357 946 -2186 -48 -752 -4466 3088 9330 3982 -478 -7364 -13598 -3265 9467
370 9467 11980 8739 -3011 -13621 -10291 335 8092 8774 3279 -3994 -6294 -1582 2184 1159 -655
385 -655 -1697 -1397 3612 7571 483 -6538 -6795 -6918 3716 14833 5645 -3232 -6294 -12548 -2370
400 -2370 11714 5251 1396 1790 -9633 -5345 7999 -584 -1114 5044 -8156 -1658 13367 -1848
414 -1848 -5082 718 -12475 -110 18930 663 -3929 2552 -15610 -5228 16610 -1357 687
427F87J0201k6772P634K2697j9641N779J1472k8734J2094K4845k6893K144J3783
440I296k8247J6944K6613l3358N617J6991l5613J5410K7385l1349J3931J6335
452A9955m4738J5097L1338l3003J3778J6615m5553K2565L2019m4300J3463K1135
464A8371m4441K5640K7962m7449K1252K2721n3175K2202L1512m2795K6414J8595
476B6809o2057K7755L6222m8725K5271J8665n8481L5711L0349n9061K8959K5141
488B6558n8881L3757K7050n8463L8573K3385p1606L5293L3166n5849M1396J5668
500C0047p5395M5203L3294o4621M0771J9764p0314M8881K4708p2993N0059K4933
512C4337p6251M7661K3265o8655N8243J6231q5630N3597K8998o7940N6168J1200
$$ plain form
427 687 10888 -15884 -8250 14447 -5194 585 12057 -16677 -4583 20262 -6631 -4487 9296
440 9296 -18951 -2007 24606 -8752 -3135 13856 -21757 -6347 21038 -10311 3620 19955
452 19955 -24783 -9686 21652 -11351 2427 19042 -26511 -3946 28073 -16227 -2764 18371
464 18371 -26070 -430 27532 -19917 1335 24056 -29119 -6917 24595 -18200 8214 26809
476 26809 -35248 -7493 28729 -19996 5275 23940 -34541 1170 31519 -27542 1417 26558
488 26558 -32323 1434 28484 -29979 8594 31979 -39627 -4334 28832 -27017 14379 30047
500 30047 -45348 -145 33149 -31472 9299 29063 -41251 7630 32338 -40655 9404 34337
512 34337 -41914 5747 29012 -39643 18600 34831 -50799 2798 31796 -36144 20024 31224
524C1224q3584O1646K4367p7587N9958J7248q0199O1521J4264p8646O9586J6072
536C5870q5451O1248J6381p3003P0701O938q9617O8999J9154p5960P0612M899
548C0771q5982P3450R858q0385P7566Q254q4524P1752L652p9040Q3307M223q8647
561e5745P6811N359p7941Q4295m201q9041Q3979K403p8616Q7440n737q6965Q4240
574B6281m878p9258R3604n391q6372Q6059j0001p9323R5947j0466q4000R0575
586C2777j2265p6945R5753j5765q3375R1143j3547p2843R8383j9129q3180R1454
598C2461j8145p1676R9525k0244p6075R2618k5286p2825R8853k0016p1654R1904
610C9440k7709o8109J00952k6871p4972R2651k5927o0531J00379l4508p1544R5248
$$ plain form
524 31224 -52360 9286 33653 -43934 16024 33272 -46927 14594 28858 -49788 19798 35870
536 35870 -49581 11667 28048 -44955 25746 32684 -56933 12066 31220 -44740 25872 30771
548 30771 -55211 18239 28097 -52288 25278 33532 -50992 20760 24412 -54628 28679 32902 -55745
561 -55745 21066 26425 -51516 32779 28578 -60463 23516 25919 -52697 34743 29006 -57959 26281
574 26281 21403 -57855 35749 30358 -56014 30045 20044 -59279 36668 26202 -57798 32777
586 32777 20512 -56433 39320 23555 -59820 31323 17776 -55067 43316 24187 -58993 32461
598 32461 14316 -57360 42165 21921 -54154 38464 13178 -59647 39206 19190 -52464 39440
610 39440 11731 -56378 44574 17703 -57269 35382 9455 -51076 49303 14795 -56749 38499
622C8499l0682o2699R8941l0590o1536R4286m2026o4832J03806k9825o0687R1619
634D4274m2835n4068J03867m2779o3994R5132l6112m8666R6688m7621n5755R7624
646D5755m5164n4369R8538l7968m5609Q8897n7551m9304J03184l9339m8203Q4546
658D3413m8715l7483R4073n3494m8105R2181m1762l8101Q4850n1671l5410Q7675
670D7451n5823m0445R1013l8459l1238P2824o1481l0863R3051m5658l6019P6450
682D0803m8344k4061P7568n9324k7835Q5249m7921k8269P2413m9724j7974P2398
694D4979o2748k4898Q4856m1071k1704O0366o1519j3494P9313n3448k0220P0078
706D0490m8539j4774N9789n7799q576P3129n2606j8498O2638m5327p057N4495
$$ plain form
622 38499 7817 -54882 44059 13469 -48067 46219 4193 -60639 43167 13342 -47345 44274
634 44274 1439 -52629 51238 8459 -55535 39597 3485 -45181 51507 3886 -51869 45755
646 45755 591 -53778 44760 6792 -38817 50080 -7471 -56775 46409 7070 -41133 43413
658 43413 -5302 -42785 51288 -2206 -50311 41870 108 -37993 46857 -4814 -40224 47451
670 47451 -8372 -48817 42196 3737 -27501 45323 -16158 -47021 46030 372 -35647 40803
682 40803 -7541 -31602 45966 -13358 -41193 44056 -3865 -32134 40279 -9445 -27419 44979
694 44979 -17769 -42667 42189 1118 -20586 39780 -21739 -35233 44080 -9368 -29588 40490
706 40490 -8049 -22823 36966 -20833 -29409 43720 -8886 -27384 35254 -10073 -17130 37365
718C7365o1696p651P1906m2331j2351M6785n2698k446N7381m9801n171N8533m4163
731f338j0780M2445m6865M395N4230m9692p623M9615l7479j753L5215m9718M320
744b0028N3364l8338n312L5972m1849J085L7791m1118P590M5197m0774o469K9118
757A6229l5299J0968L5813m1711J847L7159l2308K44K3646l7469J0278L5993l3350
770g960L163K6357l4271K129K2394k8421J4404K9833l3459l255J8890k4566J0487
783d275K2065k8878O759K3111k5521J665J4093k3333R589J9517k0862O239J5494
796A5663k3773r18J2196j4159J3273J7066k2474k004R311j4873P609J2126j4005
809d962O004J0115j5788O80P683j1668M984J0013r454N618P046j5502k210N519
$$ plain form
718 37365 -24331 -31982 39924 -2407 -14758 32027 -20671 -23117 34264 -15537 -20708 37825 -6338
731 -6338 -17118 25327 -21538 -17143 37087 -12605 -20228 29387 -8092 -9845 25370 -24348 -20028
744 -20028 33336 -5002 -10314 25658 -16191 -15106 22685 -18433 -10843 34354 -6420 -12889 16229
757 16229 -19070 -8102 27711 -14000 -12153 25006 -7302 -7058 16588 -20881 -10603 25390 -7960
770 -7960 -4797 21560 -12711 -10582 11812 -16609 -2205 27628 -5831 -9086 9804 -14762 -4275
783 -4275 17790 -11088 -4329 18782 -6739 -5074 9019 -14314 -4725 14792 -6070 169 15663
796 15663 -8110 -9028 3168 -10991 2282 19348 -3126 -5130 4181 -10692 -3083 9043 -4962
809 -4962 1042 11157 -4631 -3951 3732 -7936 -2952 7061 -2393 3225 10271 -5231 -7441 -1922
823a922m274R936Q224j0986k893J316p081L975P869l266J961K589p780p11L073
838C0l896J586M433j91J994P21o108n091J346L258M198N042j611o764l070q39
854d962N00N502M398k536j587o4m772N6L688l016K570N960l657n91N50q396l76
871f733P341K53L889M263j0274n132M198l338M709R254o616j678L453q791L74
886d828P230n218K148P667o496o20M286j0591q84R710l071M427O667j2733l722
901f028N176n886N565J0213p443j245L588j0207J041Q870o461K398P794q373R27
916g1M591j1259Q61Q355l941N175N761j1513k808L852o007N856R770o950m43J938
932C167j0026K667P038n271L432M697o697J389K377q203J072N696k477M750L917
$$ plain form
823 -1922 -6196 3740 11964 978 -1915 -599 -7680 -3705 4164 898 2859 5448 -2332 -3043 30
838 30 -3866 -2280 2153 1962 3956 4677 -1431 -6522 -5176 -1918 2280 7322 5711 -1053 -4123 -4962
854 -4962 -4462 1040 5438 2902 1315 1251 -3521 -3465 223 -2793 -223 5737 2080 1489 2039 -6357 -6733
871 -6733 608 861 4750 9013 -1261 -6393 -2195 -5533 -824 8430 1814 136 3589 -5202 -4828
886 -4828 2402 -2816 -668 6999 503 -117 4169 -6422 -7306 2404 -667 3760 10427 -2306 -6028
901 -6028 -852 -6738 -1173 9040 1597 352 3940 -6267 -5226 3644 -2817 -419 7375 -998 -71
916 -71 4520 -6739 -5878 2477 -1464 3711 9472 -2041 -4849 -997 -7004 -1148 8622 1672 1229 3167
932 3167 -6859 -4192 2846 -2425 1007 5704 -993 396 2773 -5430 -4358 1338 -1139 3611 7528
947G528q716k011Q50m052O184O339l259k80k009n963J959L929p87K155J432l054
963B45L98l85l699P51J711J468L362j97k369k947l263J203L353L176K856k752
979B911n306o36N4P61M666j00k536L280k275m567L742j851j705P493j547k805
995d21N391n963o406O688k99N41R796o843q786P478l955k839J1934n313m150J1130
1011G983q971o755J2102o161l728J3186p991l968J4760j1927r554J4963o461p18
1025c240J7463j5141q502J6989j1810m621J8893j1217l317J7771j7879p233K2211
1038A0367j2647n618J9417j5923j801K3022k1621r085K3116j3348o43K1864k2260
1051e160n148K4589k1080n819K6572j6878j812K2257k7742l227L0669k1809n256
$$ plain form
947 7528 -1188 -3199 -2349 -6401 -217 6122 2863 2583 574 -5389 -3430 499 -288 1867 3299 245
963 245 643 258 -3441 -2690 -979 489 3851 3654 1285 -1662 -4925 -3722 -369 2807 5663 2911
979 2911 -2395 -3031 -2977 -2216 2450 2350 -186 3094 819 -3748 -6 -1857 -3562 3931 2384 -421
995 -421 4970 -993 -7399 -711 -1010 -469 9327 2484 -6302 1176 -2779 -5618 6316 1003 -3147 7983
1011 7983 -988 -7743 4359 -1802 -5530 7656 -335 -4303 10457 -1470 -11024 3939 -2522 -3240
1025 -3240 14223 -918 -9420 7569 -4241 -8862 10031 -1186 -4503 13268 -4611 -11844 10367
1038 10367 -2280 -7898 11519 -4404 -6205 16817 -4804 -13889 9227 -4121 -4764 17100 -5160
1051 -5160 -10308 14281 -6799 -12618 13954 -2924 -4736 17521 -10221 -13448 17221 -4588 -9844
1064i844K4263k2252K236K6872l1340n260L1278k2148p47K6340k9398J537K9640
1077B1177l4236j806L4249k4941J486K3877l6559N130L5882l4079k216L0766k9606
1090a0876O790K8222m2016M589L7222l5076K424K9769l4811R705K8735m5365O336
1103a4352L9652l3799L910K5112m1607J3945L5539m5596N299L5211l6251J0192
1115b745K5635m5832J5082L6353m5223O615L2897l7577J4120K5077n1423J6777
1127a0244M0267m3495Q435K5771m3403K1263K9299n2608J6222L6485m3873J3089
1139b792K3904m7126K5505L0961n5642J6915L4392m3339J9621J9418n3610K9524
1151b269L4231n2994J7016K6462m5741K6451K1487n5780K9738L2645n2775J9454
$$ plain form
1064 -9844 14419 -7833 -5597 21275 -10065 -15325 15953 -6195 -6942 19398 -10000 -8463 21177
1077 21177 -13059 -14865 19384 -5557 -4071 19806 -16753 -11623 24259 -9820 -12036 18730 -10876
1090 -10876 -4086 24136 -17880 -13291 23931 -11145 -8721 21048 -13763 -4058 24677 -20688 -14352
1103 -14352 25300 -8499 -4589 20523 -21084 -7139 28400 -17196 -11897 23314 -12937 -2745
1115 -2745 22890 -22942 -7860 28493 -16730 -10115 22782 -14795 -675 24402 -27021 -10244
1127 -10244 30023 -13472 -5037 20734 -22669 -1406 27893 -24715 -8493 27992 -15881 -2792
1139 -2792 21112 -26014 -509 30452 -25190 -8275 26117 -17222 2399 21817 -31793 -2269
1151 -2269 31962 -21032 -4016 22446 -23295 3156 24643 -31137 -1399 31246 -21529 -2075
1163b075K1922m6314L2922K0763n8534K8234L0890m7429K2697J5627n0037L6025
1175D691K4465n6277K6245K4748m6796K7930J3969n0767L7920K3222n4993K4751
1187h92J9859m3014L3545J1878n4438L6524K3709n0224K6841J2723m5063L8836
1199A0284J2357n3520L5894J8849m7519K9467Q493m4205M2733J1782n4575L3557
1211C597J5122m2626L5575L663m7496M3376J1482m9464L3440Q453m0759L8551
1223A2914K550m6415M2333R918m6618L2523M055l7584M2550J089m6966L8246P576
1236A6171l9044L4075l91l7635M1180J890m2964L5789M635l5947L4520k902l5878
1249b6501M1438J011m0135L2290Q00l0233L6776m710l6290L7473N65l4386L2699
$$ plain form
1163 -2075 19847 -26467 6455 27218 -31316 -3082 27808 -19621 3076 18703 -31334 4691
1175 4691 29156 -27121 -876 23872 -22924 5006 18975 -31792 6128 29350 -25643 -892
1187 -892 18967 -24047 9498 21376 -33062 3462 27171 -23053 3788 16511 -28552 10284
1199 10284 22641 -30879 5015 23864 -23655 5812 14305 -29900 12833 24615 -29960 3597
1211 3597 18719 -23907 11668 15331 -32165 11211 22693 -26771 6669 15122 -25637 12914
1223 12914 15464 -30951 11382 21300 -25318 7205 11260 -26324 16226 17315 -29651 8595 16171
1236 16171 -22873 11202 10811 -26824 14356 16246 -26718 9071 13706 -22241 12279 9377 -26501
1249 -26501 14937 15948 -24187 8103 8903 -21330 15446 10736 -25554 11919 12484 -21902 10797
1262A0797k829k9389L6881o236l3558L6593j755l0186L1367o710k6173L7504o451
1275I855l1897L2455l990k4963L3134q905k6218L4893p495k6759L1477o433k1713
1288a6559L0822j0409k3336L2738o613k3438K7624q256j8638L0803r997k1967
1300a7226K8186p568j8114K6534q956j6853K6438r622j8365K5635o555j5596K3163
1313A1101r960j4931K5328q433j5653K1663q233j1902K2096r376j3206K0818q291
1326A021j2151K0260p658j0633J9092j0025j0962J9759p562r290J6835r294q171
1339h779J7478q229q677J5567p692p170J5547p829p215J4247q252o411J4221o573
1353B33n231J1706p917n349J2081n397m695J0221o157m692J0233n229m220R023
$$ plain form
1262 10797 7968 -21421 15460 9224 -24334 12259 10504 -19682 11685 4975 -21198 16306 9855
1275 9855 -22042 10413 6423 -18540 14594 5689 -20529 14364 6869 -19890 11587 5154 -16559
1288 -16559 14263 3854 -19482 13256 6643 -16795 10829 2573 -16065 14738 4741 -17226
1300 -17226 10960 3392 -14722 11812 2856 -13997 12441 2819 -15546 10089 3534 -12062 11101
1313 11101 1141 -13790 11538 3105 -12548 9115 882 -11020 11076 1700 -11506 9312 1021
1326 1021 -11130 9130 1472 -9161 9931 -94 -11056 8703 1141 -8149 8686 -608 -8779
1339 -8779 8699 470 -8207 7360 -332 -7502 8045 216 -6999 7248 -1004 -7415 6806 233
1353 233 -4998 6708 -1209 -6558 5523 126 -4569 5652 -505 -5197 5036 -193 -4413 4610
1367D610n269l485Q547m263l261O643m421l021P055k440k819N338l627l206N707
1382B088j882j947M534k822k350L875j367j579K829j304j748K859k53j944J712
1397G01p77j706K228N54j001P34m97j655N23J710m78k38J030j857n04K338j254
1414a49p47K067j400r09K723j209j972K645j382j868M385j072k750L435k470k438
1430c111N232j272k562M173k448l124N116j515l219N350k125l642O069k304l846
1445c228N820k871l237O861k279l758N525l240l791P086j925l778O506l530m411
1460d250P244k875l519P181l658l690P119l359l756O737l514l527P704l063l946
1475c172O843m412l766Q003l287k891P018m761l561P065l537k637P064m043l280
$$ plain form
1367 4610 -659 -4144 4403 140 -3121 3522 -899 -3920 3135 695 -2124 3214 -413 -3619 2088
1382 2088 206 -1741 2793 -29 -2379 1496 129 -1450 1379 75 -1673 1186 933 -1011 701
1397 701 -76 -1782 446 1000 -1 733 236 -1419 -896 814 336 98 1128 -729 -1233 1105 -149
1414 -149 -896 1171 -229 -1138 1585 376 -1596 1049 -333 -2201 2184 1112 -1638 1797 -673 -3111
1430 -3111 2121 849 -1713 2460 12 -3112 2004 489 -2730 2620 495 -3147 2922 618 -3228
1445 -3228 2592 -279 -3516 3345 1066 -2692 2833 -407 -4198 2888 963 -2815 3691 161 -4250
1460 -4250 2994 119 -3400 3781 123 -3567 3552 193 -3563 3174 -340 -3867 3837 774 -3172
1475 -3172 3671 -741 -4507 3496 209 -2682 4336 -425 -3986 3079 -458 -3095 3969 -74 -3354
1490c354P037m009l074O953m400k497P290m034k285O003m935k309O612l235j609
1505a846N844m651k644N961l679j335O084m274j638N199m148j028M879l834q99
1520b009M812l097r36L866m012j154M543k563o9L633l913q02K982k620N56K977
1536B194k451l28J829k199P8K086j952J08J864j440M93O42k123M49P82k63J261
1553A030k43r17M8q42J53J213j69K84L28j769L05J304j689R01J126k316J970J047
1571A764l504J683P15k955L201J109l604K713K28m749L521J650m044M369J25o127
1587c905N011P64n679N608P6n688O519l34o932O370k7o660P523j9p157Q140j406
1604B204q813Q981j11p165R493k321q839J0170j357q796J0316j337q582J1196
$$ plain form
1490 -3354 3683 -326 -3400 3553 -847 -3344 3946 -88 -2373 3630 -1305 -3614 2998 -237 -1846
1505 -1846 3998 -653 -3297 2664 -1015 -2350 3734 -540 -2178 3021 -1127 -2155 2724 -1110 -2009
1520 -2009 2803 -294 -1230 2636 -1376 -2530 2013 -550 -619 3014 -899 -1701 1281 -1339 -783 2194
1536 2194 -257 -585 1244 -955 -877 1209 -743 -635 1229 -211 282 924 -1199 -750 32 -231 1030
1553 1030 787 -130 -82 -924 -771 442 273 557 885 -884 -579 725 -964 -63 1063 -1253 717 1764
1571 1764 -1740 -57 658 -2297 904 2013 -1591 1122 1350 -3399 122 1772 -2272 2097 2222 -3905
1587 -3905 1106 1870 -3809 1799 1875 -3813 2706 2372 -4560 1810 1783 -4877 2646 2627 -4530 3610 2204
1604 2204 -6609 2372 2261 -4904 4589 2268 -6571 3599 2242 -6554 3762 2425 -6157 5039
1618E039k597j0113J2155k098r966J2433k465r136J3122m361j1205J3815k041
1631B582r628J3617m441j0912J5185m257j1618J5787l817j0553J5674o340j1091
1644i812J7509n666j1860J6915n266j0175J7594q423j2415J9742o187j1355J8739
1657I340q651j0740K0114j0038j1688K1370q139j1005J9534j0841j0314K2545
1669A1487j1163j2377K2325r747r936K1468j3838j0672K4291j1713j1070K2443
1681A1498j2071r577K2593j4780j0490K5689j2304j1182K2498j4357q413K4981
1693A4085j6239j0675K5584j3260r231K2775j6722q195K6310j6453j0123K5720
1705A3576j5199q205K3711j9275o830K8104j7778r169K4428j7617n358K5193k1173
$$ plain form
1618 5039 2442 -7671 4484 2386 -7580 4853 2388 -6748 6374 2013 -9192 4623 2582
1631 2582 -7046 6571 2130 -8782 6403 2146 -9472 6315 2498 -8055 7619 1279 -9812
1644 -9812 7697 2031 -9829 7086 1820 -8355 9239 816 -11599 8143 1956 -9399 9340
1657 9340 689 -10051 10063 25 -11663 9707 1568 -9437 10097 -744 -11058 11487
1669 11487 324 -12053 10272 525 -9411 12057 -1781 -12453 11838 125 -10945 11498
1681 11498 -573 -10150 12443 -2337 -12827 12862 558 -10624 11874 -2483 -10896 14085
1693 14085 -2154 -12829 12755 -505 -9736 13039 -3683 -11878 14432 -2021 -12144 13576
1705 13576 -1623 -9828 13883 -5392 -12222 15882 -1896 -11065 13363 -4254 -9612 15581 -5592
1718e592o679K8114j8619p235K4368k0597l661K6637k2957n341K7731k0024m929
1731h784K3272k2865j559K7840k3231n345K5830k1079k260K4107k4766j102K7770
1744A7828k3450l832K4139k2098o3K3879k5401q64K7249k2640l047K2316k3353
1757i337J922K5147k5869j076K5185k2713k39K1333k4372L131K4594k5668o19
1770h581K3413k2561K097K0631k6131M321K4603k5542Q11K0483k3552N625K0364
1783A5981k6766M643K2484k4861K886J8809k4178P668J9900k7581N171K0723k3937
1796i058N595J6403k5107R156J9290k6229N038J7793k2899P612J5795k5136Q941
1809b806J8078k5149N723J5701k1807R397J4297k4950Q311J6687k2460O277J3362
$$ plain form
1718 -5592 -12271 15843 -2776 -10011 14357 -6240 -9901 16736 -6221 -11562 16169 -3855 -8784
1731 -8784 14488 -8377 -9936 17904 -5327 -10672 15158 -5921 -8181 15926 -8840 -9942 17828
1744 17828 -5622 -9454 14685 -7413 -7476 16403 -8998 -9862 17387 -5253 -8300 14016 -9337
1757 -9337 -7415 17732 -8137 -9213 15972 -6741 -6980 14353 -10019 -6888 17706 -7962 -8581
1770 -8581 14832 -7729 -5632 14999 -11132 -6811 17792 -7750 -6939 13544 -10008 -4383 15981
1783 15981 -10785 -6142 16342 -8519 -5633 13176 -11002 -3334 16566 -11015 -5844 14879 -9058
1796 -9058 -3463 12940 -12167 -3011 16279 -9950 -4912 12881 -10018 -2406 13389 -11747 -2806
1809 -2806 15272 -9877 -4154 11547 -10260 -863 13434 -11516 -3205 13482 -8978 -2701 10661
1822A0661k1415J0041J4147k4015P728J4597k1050P958J1598k0903J0673J2554
1834A2574k2717P516J2522j8840R331R856k1151J0519J1776k0844Q338R823j8236
1847i533J0945Q376k0197J0416R652j8655Q870P797j6921J1401P266j9483R754
1860c12Q341j6329R867N630j6501J1153O281j6970R124O413j4293R484M709j5149
1874h552J0085N745j5168Q303N190j2542R523L536j4099Q771M938j2176P668L755
1888D977j1358Q332L342j2279P790M204j0661P223K541j0119Q039K492j0530O719
1902G12K988q357O752J571r179O757K309q508O277J905p493O238P03p560O249
1917A364J499o652N120R17n855N341O65o378M789J365n135M528M06n124M227M64
$$ plain form
1822 10661 -10754 -713 13434 -10581 -2853 11744 -9306 -1348 10250 -10653 20 12574
1834 12574 -10143 -2627 9895 -8945 386 10242 -10909 -390 11386 -9458 -1120 8703 -9533
1847 -9533 1412 9788 -10409 7 9659 -8996 -126 7671 -9250 2151 9417 -10066 -312
1860 -312 8029 -8300 1567 7197 -9304 1849 8130 -8840 284 6697 -7596 1888 6597 -8552
1874 -8552 1533 7278 -7890 413 5603 -6939 2584 6120 -7979 792 5730 -6446 1222 4977
1888 4977 -6381 1951 5293 -6986 804 5008 -5653 1570 4111 -6008 2031 4523 -6007 712
1902 712 3700 -4657 2095 3666 -5513 1244 3553 -4955 1322 3227 -4266 1972 2675 -4885 1364
1917 1364 2863 -3789 1331 2248 -3607 1734 2399 -3979 810 2175 -2960 1568 1974 -3150 1077 1541
1933A541m477L854R12l785K822L56l642K952J081l471K244R30k870K129N32k781
1949a673J711R44j941J203Q72j899M74R53j553O67J448j472n9R05j139P0J163
1966F74o82n17J094l38r69J276k87j349J567J8j307J599j80j846J425L92j694
1983a124J719N76k477J564O57k652K230Q47k982K170O75l003K368P14l289K372
1999C65J145l351K507J003m004K710J188l938L233J082m290K997Q10m089L428
2014G96J125m345L134J122m481L438J131m820L726J137m739L909Q00m880L830
2029H83Q04m576M066R37m899L694Q13m852M256R48n058M220N67m929M422M18m762
2046c048M323L89m576M290M07m808M173L90m626M620L09m806M385j18m440M671
$$ plain form
1933 1541 -2936 918 1830 -1955 867 1223 -2419 533 1614 -1857 387 1317 -1553 576 1108 -1673
1949 -1673 38 982 -959 244 1116 -783 -309 644 -909 -242 1206 -266 -325 580 -559 -489 674
1966 674 -8 -525 569 231 -738 538 251 -1098 469 487 -820 779 599 -1247 178 570 -1124
1983 -1124 595 1171 -1306 258 915 -1737 493 1340 -1642 528 1203 -1800 568 1282 -2007 365
1999 365 1510 -1841 666 1669 -2335 375 1563 -2375 858 1940 -2350 647 1457 -2632 796
2014 796 1921 -2424 710 1832 -2649 789 1920 -2900 826 1963 -2776 1133 1933 -2947 883
2029 883 1687 -2889 1177 2114 -2785 909 1722 -3130 1126 2074 -2984 1236 1803 -3126 1296 1714 -3048
2046 -3048 1275 1664 -2912 1378 1785 -3023 1150 1540 -3086 1534 1843 -2963 1422 1304 -3136 1535
2062A535m6m216M272k82m124M271q1m090M218k14l997M416m40l942M234o68l430
2079b584M277o54l300L746q00l139L878m97l028L639q74k968L784q96k590L501
2095A495j107k190L272j082k034K844j004j807K873q24j766K533j181j508K637
2110A151j021j081K103j287q24J816r81n40J456r13m70J313q39l28J067j020P3
2127c25R58r24M24K84j038O90Q7n69R53l74o59Q86n19m36J269p50o32J536j117
2146b56m35J856j712k67K115j993J35K125k445J82K149k575N06K560k983L41K573
2163A876l422Q78K999m007J124K958m341J523K886m653J790K986m903J973L216
2178B883n299K028L263n813K707L633o333K775L314o536L378L416o814L430L516
$$ plain form
2062 1535 1489 -2727 1545 1263 -2861 1410 1329 -2761 1457 1243 -2754 1662 1222 -2720 1514 846 -2584
2079 -2584 1693 1039 -2261 1485 685 -2454 1424 927 -2101 1538 664 -2304 1480 584 -2006 1495
2095 1495 388 -1802 1470 388 -1646 1198 194 -1613 1260 436 -1330 1203 22 -1486 1151
2110 1151 130 -951 1152 -135 -959 857 -124 -664 792 -121 -591 722 -117 -445 622 -398 -325
2127 -325 633 -291 133 417 -621 69 156 -413 540 166 -493 393 -126 -562 707 -43 -675 861 -256
2146 -256 -691 1165 -547 -814 1301 -692 -557 1568 -877 -695 1454 -1121 -615 1945 -1038 -697 1876
2163 1876 -1546 -668 2331 -1676 -552 2406 -1935 -412 2474 -2179 -389 2597 -2306 -333 2883
2178 2883 -2416 -388 2875 -2938 -231 3402 -2931 -156 3158 -3378 0 3416 -3398 32 3548
2193C548p075L498L642p375L837L784p941M255L911q245M443L543q408N076L771
2208D264q728M906L638q892N341L801r338N786L772r872O130L614r926O730L185
2223D411j0211P144L243j0341P141K939j0522P891L014j1015Q168K696j1247Q762
2237B073K369j1209R299J974j1490R405J965j1366R699J691j1724J0184J753j2043
2251g420J0370J369j2012J0989J162j2102J1084Q67j2146J1183R30j2036J1451
2264C689P65j2555J1697P57j2510J2103L16j2570J2467P4j2531J2509k36j2376
2278h401J2760k83j2424J2934o59j2639J3375r14j2371J3809j558j2390J3968
2291E207j936j1970J4188k278j1913J4308k509j1836J4532k947j1778J4997l274
$$ plain form
2193 3548 -3527 -29 3613 -3762 75 3859 -4082 173 4084 -4161 282 3825 -4583 493 4264
2208 4264 -4464 442 4080 -4812 529 4330 -5008 778 4550 -5322 808 4422 -5504 1226 4411
2223 4411 -5800 1344 4587 -5754 1387 4326 -6196 1695 4709 -6306 1862 4558 -6689 2073
2237 2073 4442 -6767 2532 4506 -6984 2421 4386 -6980 2719 4410 -7314 2870 4623 -7420
2251 -7420 2950 4319 -7693 3296 4458 -7644 3440 4307 -7839 3344 4274 -7762 3689
2264 3689 4454 -8101 3596 4353 -8157 3946 4262 -8308 4159 4233 -8298 4211 3975 -8401
2278 -8401 4359 4076 -8348 4586 3927 -8712 4663 3749 -8622 5187 3629 -8761 5207
2291 5207 3271 -8699 5489 3211 -8702 5606 3097 -8739 5793 2846 -8932 6065 2791
2304B791j1540J5076l895j1293J5183m085j0907J5242m248j1000J5073m381j0727
2317h711J5433m629j0844J5494m827j0497J5397n217j0206J5492n173j0101J5203
2330F814n238r992J5179n375r805J5547n593r896J5257n905r160J5415o308r035
2344h095J5230o243q737J4879o521q336J5167o815q302J5157p092p833J4873p585
2358b53p071J5051p843p075J4436p757o362J4384q117o303J4497q197o152J4126
2372G364q388n396J4034q772n213J3825q465n106J3132q375m539J3339q541m967
2386f068J3053q266m448J2770q540m039J2665q526m146J2144q030l645J1729q227
2400a574l603J1903q074l756J1372p991k896J1272q424k896J0902q037k531J0303
$$ plain form
2304 2791 -8749 6327 2432 -8861 6322 2237 -8670 6572 2324 -8676 6397 2016 -8711
2317 -8711 6722 2093 -8751 6743 1916 -8581 6816 1599 -8607 6885 1712 -8389 6814
2330 6814 1576 -8416 6763 1388 -8417 7130 1537 -8359 6898 993 -8167 7248 940 -8095
2344 -8095 7135 892 -7845 7034 513 -7823 7344 529 -7773 7384 292 -7541 7332 -253
2358 -253 -7324 7727 -116 -7191 7245 -512 -6874 7510 -607 -6910 7587 -610 -6762 7364
2372 7364 -1024 -6420 7614 -1158 -6371 7454 -1011 -6117 7015 -1360 -5899 7440 -1101 -6068
2386 -6068 6985 -1281 -5729 7041 -1499 -5538 7127 -1399 -5545 6599 -1431 -5076 6653 -1574
2400 -1574 -5177 6726 -1348 -5104 6268 -1723 -4619 6653 -1771 -4667 6235 -1802 -4333 5970
2414E970p880k047J0125q121k242J0000p717j762R465q092j178R368q093j233
2428c437Q709p564o10Q292p681p01Q181p417p45P874p123k30P478p469k13P335
2444D679o838j27O642o563J01O511o472k96O410n946j34O082o026L8N887n940
2460a992j6N572n240J78M951n260L7N051m808j22M728m606J52M439m713K12M208
2477B771m257L30L711l923M11L351l817K27L396l280K44K973l419L71K887l163
2493a187M42K496k743M60K064k498L14K050k148J00J960j871M3J718j931N5J752
2510A076j478J2J287j255j67J179q36l92J245n74o81J115m95o85J114l62o81R51
2528C73l4q10O04J80r76O99O04j196O34N78j407O41P51j274N86Q49j401L29J106
$$ plain form
2414 5970 -1910 -3957 6168 -1953 -4195 5805 -1912 -3674 5791 -2301 -3479 5889 -2204 -3437
2428 -3437 5272 -2292 -2902 5390 -2291 -2992 5189 -2228 -2973 4901 -2222 -2452 5026 -2443 -2656 4679
2444 4679 -2159 -2286 4356 -2207 -2106 4405 -2067 -2363 4047 -1899 -2033 4049 -1977 -1939 3948 -1992
2460 -1992 -2008 3564 -1676 -1498 3453 -1807 -1770 3281 -1527 -1649 3079 -1527 -1375 3064 -1649 -1437 2771
2477 2771 -1486 -1156 2555 -1368 -957 2394 -1423 -1196 2200 -1080 -836 2137 -1282 -911 1976 -1187
2493 -1187 -745 1751 -992 -532 1532 -966 -652 1398 -750 -650 1310 -561 -518 1200 -731 -676 1076
2510 1076 -402 -390 897 -358 -525 654 -182 -574 671 97 -584 531 36 -649 465 103 -578 373
2528 373 339 -471 133 313 -663 36 640 -556 78 656 -751 -110 641 -633 -47 802 -599 -270 836
2547H36j469K40J395j684L02J583j921K80J565j999M14J716j924K40J710k107
2563h23J32K074k169J79K201k505K35K260k641M29K248k643M33K259k656L26K311
2580A650k773L50K632k913L92K569l227N78K623l174P45K503l226O43K474l158
2596a312O49K631l268O41K729l450P58K638l573R92K611l477J012K392l495R55
2612e67K466l349R88K537l555R62K491l605J222K415l624J328K207l509J308K064
2628A779l389J308K130l328J272K074l487J346K060l421J592J845l403J561J609
2643A548l155J583J573l039J486J541l035J484J489l046J623J374k916J740J066
2658A316k805J648R41k465J649Q70k417J453Q31k340J547Q06k277J578N58k118
$$ plain form
2547 836 -633 -393 1002 -682 -380 1203 -718 -438 1127 -872 -458 1258 -666 -426 1284 -823
2563 -823 -691 1383 -786 -607 1594 -911 -676 1584 -1057 -628 1620 -1023 -590 1669 -987 -661 1650
2580 1650 -1123 -773 1859 -1054 -662 1907 -1320 -742 1881 -1293 -548 1955 -1271 -628 1846 -1312
2596 -1312 -663 1968 -1300 -659 2070 -1380 -622 2016 -1557 -565 2046 -1431 -419 1973 -1522 -567
2612 -567 1899 -1450 -462 2075 -1480 -518 1973 -1632 -410 2005 -1619 -291 1916 -1593 -285 1779
2628 1779 -1610 -302 1828 -1500 -228 1846 -1641 -295 1765 -1656 -64 1781 -1622 -61 1548
2643 1548 -1607 -24 1549 -1490 -4 1537 -1498 -14 1475 -1571 52 1426 -1490 250 1316
2658 1316 -1489 159 1100 -1365 284 1154 -1263 190 1021 -1319 228 1034 -1243 335 893 -1225
2674a225J611L16j837J502K44j544J335J83j490J165K10j332J273Q3j279J201
2690D16j90r63J178k93o42R47m17m51P40l47l21O86m17j91P09o00n1N77p87L87
2710c0N06r23N99J79r32Q30L4q86J003m7j019J068j08j102J409k96j297J774m93
2729B69j299J935q89j166K228j042j128K229j170j149K385j338j151K806j612
2744i2j305K958j886j036L176k301r53L374k390r14L289k566q09L625k794r66
2760a590L918l009r46M028l401o07M355l720p28M321l685n40M373l973n85M814
2776C025m143p57M901m383m45N118m887l00N334m981l04N126n070O2N387n472
2792a789j60N624n508M3N581n992M91N802o370N30N685o310R20N464o666J148
$$ plain form
2674 -1225 386 702 -1135 367 611 -933 402 585 -905 260 470 -862 411 494 -785 416
2690 416 226 -737 441 148 -494 453 36 -415 325 -22 -343 343 -74 -265 444 -156 -207 370 -417 -30
2710 -30 476 -447 152 331 -601 229 263 -623 380 333 -686 382 274 -828 581 285 -1012 762 269
2729 269 -1030 905 16 -1150 1078 36 -1092 1137 -33 -1182 1203 -135 -1286 1520 -92
2744 -92 -1397 1561 -325 -1361 1815 -486 -1439 1935 -455 -1369 1920 -646 -1455 2170 -624 -1590
2760 -1590 2328 -681 -1627 2401 -1000 -1607 2748 -972 -1700 2621 -1064 -1604 2769 -1204 -1789 3025
2776 3025 -1118 -1875 3026 -1357 -1802 3316 -1571 -1871 3463 -1518 -1822 3304 -1766 -1704 3683 -1789
2792 -1789 -1949 3675 -1833 -1790 3791 -2201 -1710 4092 -2278 -1748 3937 -2373 -1453 4011 -2655 -1507
2808a507N764o829R85N661o917J569N675p535J759N800p507J897N429p567K330
2823i93N530p939K150N747p825K283N546q229K786N812q595K637N672q330L025
2838g23N412q694L145N739q756K922N667q718L386N566r310L605N781r226L629
2853e75N279r162M204N227r521M042N327r234M217M947r527M775M962r847M817
2868f9M750r479N223M126r694N553M281r641N321M001r413N827L748r884O019
2883F69L861r709O065L308r511O513L125r738O343L306r349O274K931r532O689
2898A245L089r771O555K975r392O767K501r494O942K648r403O635K527r085O877
2913A616K269r452P065K411r225O989J867q962P366J604q989P237J610q566P141
$$ plain form
2808 -1507 4257 -2572 -1587 4074 -2843 -1274 4401 -3134 -1375 4425 -3082 -1185 4244 -3323 -993
2823 -993 4537 -3402 -1252 4495 -3330 -1047 4499 -3730 -944 4868 -3727 -1090 4582 -3748 -723
2838 -723 4689 -4005 -860 4879 -3877 -955 4712 -4006 -620 4946 -4364 -759 5022 -4204 -575
2853 -575 4704 -4458 -254 4973 -4548 -506 4821 -4413 -196 4751 -4776 -1 4961 -4886 -69
2868 -69 4681 -4798 425 4551 -5143 410 4691 -4950 371 4372 -5041 786 4534 -5350 669
2883 669 4530 -5179 886 4194 -5317 1196 4321 -5417 926 4232 -5117 1157 4088 -5444 1245
2898 1245 4334 -5437 1118 4093 -5299 1468 3969 -5525 1417 4065 -5338 1297 3824 -5261 1616
2913 1616 3885 -5567 1498 3909 -5316 1673 3540 -5422 1944 3548 -5441 1796 3406 -5160 1981
2928A981J191q498P466J105q568P394R25q109P550K81q001P726K95p741P386P5
2944B458p363P474j58p452P553p1p282P409m22o963P573o50o919P381n27o532
2960d491P095p31o467P208o19o528P067o56o267P037r57o104P067r38n918O705
2976B503r64n597O643j074n626O618r73n451O450j243n176O530j459m929O305
2991B557j462m589O005j622m316N960j599m266N771j665l952N712j939l716N601
3006B480j937l428N275j988l130N035j929l060M935j829k994M725j864k783M682
3021B190j922k640M443j853k417M143j743k316L975j594k317L818j496k266L710
3036A715j524k088L607j517j947L297j430j728L075j290j689K868j171j645K749
$$ plain form
2928 1981 3172 -5326 2140 3245 -5323 2071 2996 -5113 2437 2718 -5283 2443 2738 -5003 2383 2458
2944 2458 -4905 2569 2411 -5041 2512 2441 -4841 2568 2146 -4817 2756 2106 -4813 2568 2041 -4491
2960 -4491 2604 1873 -4594 2614 1995 -4533 2534 1878 -4389 2648 1691 -4413 2654 1716 -4202 2503
2976 2503 1539 -4058 2585 1511 -4115 2503 1530 -3921 2529 1286 -3890 2640 1181 -3748 2557
2991 2557 1095 -3494 2511 889 -3427 2533 934 -3332 2439 774 -3178 2534 595 -3121 2480
3006 2480 543 -2885 2390 402 -2728 2307 378 -2682 2253 424 -2570 2155 291 -2492 2190
3021 2190 268 -2372 2071 218 -2199 1944 201 -2115 1860 266 -2051 1767 271 -1995 1715
3036 1715 191 -1897 1710 193 -1754 1543 113 -1615 1460 170 -1519 1349 178 -1467 1282
3051A282j151j515K639j183j310K418j148j133K111j018r67J897q68r52J712p76
3067C8r12J654p34q13J486p21o63J275n97n54J008m00n40Q40k20o25P54j01o33
3086d58P31o6n85N52jm87L82J94m80J49M05n73Q0N64o55N1O53o65j6O62n95j60
3108c18P61n31l34R65n92m98J123o69m93J249p33n33J254p14n75J288o36p27J418
3127G05o41q84J591p14r42J719q27q80J784r12q94J763q57r18J812q46j033J932
3145I58r05j116K098j023j069K169j163r99K160j179r81K143j157r99K196j174
3161d1j095K304j260j071K420j382r93K406j495q91K356j453q66K312j425r11
3177a085K357j444r61K461j556q78K490j658p80K397j682o64K331j623o74K265
$$ plain form
3051 1282 131 -1384 1255 72 -1238 1180 32 -1101 1010 -8 -975 922 54 -898 814 38
3067 38 -874 780 46 -767 719 -2 -665 610 13 -541 467 67 -473 367 147 -478 276 175 -458
3086 -458 273 207 -378 174 173 -314 68 262 -218 -69 336 -237 -157 407 -248 -197 456 -209 -225 437 -158 -318
3108 -318 443 -88 -422 543 -49 -547 576 -93 -586 663 -70 -603 651 -63 -638 650 14 -713 705
3127 705 64 -820 771 57 -885 834 7 -873 911 -1 -895 868 11 -907 905 59 -974 958
3145 958 53 -1063 1035 12 -1057 1112 -51 -1050 1110 -69 -1050 1093 -64 -1063 1133 -41
3161 -41 -1136 1168 -92 -1163 1257 -125 -1118 1288 -207 -1098 1258 -195 -1061 1251 -174 -1085
3177 -1085 1272 -172 -1133 1328 -228 -1106 1384 -274 -1054 1343 -339 -1003 1328 -295 -969 1296
3193A296j601p14K315j605o85K344j716n87K295j785m35K173j754l56K057j664
3209d22l87K005j629l95K071j680l34K003j760j88J904j720p8J748j661n0J623
3226A050j556o2J601j514n1J579j557K9J468j569J87J339j488K42J140j358K28
3243b92J050j227K08J008j215K18R55j196L11Q19j138M13O28r92M10M66q23L63
3261c4M00o87L05L57o88L42K74o02M51Q1n08M68j06k96M60k59j23L89l01l0L23
3282B16l55L4L89m96J30M75p23K89M59q98N55L89j009O94K79j037P88K44j082
3301f59Q81K83j262J025K61j428J259J78j540J503K9j573J605j28j530J758j88
3318D74j609J821j99j714J991k95j824K268m44j892K436o17j834K539p60j841
$$ plain form
3193 1296 -305 -1019 1296 -309 -994 1350 -366 -953 1342 -443 -878 1295 -459 -815 1242 -422
3209 -422 -809 1196 -433 -828 1243 -437 -771 1232 -528 -716 1188 -532 -610 1138 -523 -573 1050
3226 1050 -506 -568 1033 -481 -532 1047 -510 -481 987 -582 -395 944 -544 -302 838 -520 -292
3243 -292 758 -469 -261 747 -468 -250 705 -491 -180 639 -499 -86 542 -450 -40 426 -397 -34
3261 -34 366 -321 -16 341 -347 -5 269 -333 118 199 -309 159 53 -243 217 -42 -165 224 -77 -107 216
3282 216 -139 -105 284 -212 -82 393 -330 -41 418 -480 75 464 -545 149 428 -609 179 423 -659
3301 -659 222 505 -757 268 529 -899 360 538 -1002 501 530 -1043 562 434 -1096 662 474
3318 474 -1135 686 487 -1227 764 469 -1355 913 469 -1423 1013 396 -1438 1101 341 -1500
3334a500K671p74j946K733q11k039K993r40k168L228j089k193L345j239k132L498
3350A637j357k221L566j322k300L718j461k385M003j585k491M155j793k367M296
3365B093j998k308M370k061k349M420k135k298M598k364k331M787k521k237M853
3380B519k788k016M937k978j971M916l000j865M937l164j828N150l358j864N240
3395B867l506j622N269l787j512N344l827j501N291l857j426N430m037j513N621
3410C234m116j480N653m337j256N738m532j270N727m441j186N697m613j152N906
3425C572m741j212N931m844r38N899n137p68N934n159o74N719n141m57N712n336
3441a640m64N797n358k89N643n565M2N608n742J69N458n612L41N241n721M77N341
$$ plain form
3334 -1500 1171 397 -1549 1184 373 -1666 1327 387 -1781 1447 358 -1835 1510 271 -1861 1637
3350 1637 280 -1941 1625 303 -1997 1721 260 -2125 1878 293 -2198 1957 164 -2203 2093
3365 2093 95 -2213 2157 96 -2253 2167 32 -2266 2332 -32 -2363 2424 -97 -2334 2519
3380 2519 -269 -2285 2652 -326 -2297 2619 -381 -2246 2691 -473 -2301 2849 -509 -2373 2867
3395 2867 -639 -2261 3008 -779 -2291 3053 -774 -2275 3016 -841 -2267 3163 -874 -2387 3234
3410 3234 -882 -2362 3291 -1046 -2302 3436 -1096 -2366 3361 -1080 -2266 3431 -1182 -2334 3572
3425 3572 -1169 -2381 3550 -1294 -2232 3667 -1470 -2238 3696 -1463 -2137 3582 -1559 -2016 3696 -1640
3441 -1640 -2104 3693 -1665 -1954 3689 -1876 -1834 3774 -1968 -1799 3659 -1953 -1612 3629 -2092 -1615 3726
3458C726n789M26N282n793O89N180o032Q52N180n983Q94M971n921J063M925o023
3474b353R74N057n964R74M966o100J223M972o243J260M869o079J379M638o110
3489b537J459M691o092J386M625o040J587M454o226J820M380o132J871M049n948
3504b653K059L869n965K057L847n802K072L626n827K334L501n878K425L317n644
3519b662K509K966n534K584K970n455K461K888n328K554K765n422K674K718n311
3534b623K649K513n139K704K393n077K604K448m932K505K350m917K630K318m948
3549b522K629K220m768K651J974m621K667J923m473K497J878m313K516J743m306
3564b305K599J671m188K574J416l938K629J212l760K528J156l544K387J048l432
$$ plain form
3458 3726 -2063 -1637 3645 -2148 -1459 3721 -2311 -1459 3721 -2262 -1368 3603 -2318 -1255 3670 -2353
3474 -2353 -1379 3678 -2286 -1312 3654 -2446 -1223 3749 -2494 -1234 3635 -2444 -1065 3573 -2537
3489 -2537 -1078 3613 -2479 -1093 3532 -2508 -921 3533 -2693 -873 3507 -2625 -754 3295 -2653
3504 -2653 -594 3275 -2690 -633 3214 -2588 -516 3110 -2717 -383 3118 -2760 -335 2982 -2662
3519 -2662 -153 2813 -2721 -137 2833 -2622 -161 2727 -2601 -47 2718 -2704 -30 2688 -2623
3534 -2623 26 2539 -2600 104 2497 -2580 24 2472 -2460 45 2395 -2522 108 2426 -2522
3549 -2522 107 2327 -2441 210 2184 -2437 230 2153 -2320 177 2055 -2258 258 2001 -2305
3564 -2305 294 1965 -2223 351 1767 -2171 458 1670 -2090 438 1594 -1950 437 1485 -1947
3579a947K433R78l387K420Q52l178K392O46k988K335O01k806K138O02k678K050
3595D63O07k648K044O09k595J983M99k419J953M05k278J811M48k143J631M75k069
3612a224J575N12k049J532M63j942J498L43j759J411L01j602J214L24j434J076
3628B39L53j399J019L63j334R83K53j160Q99J81r76P69J62q30N67K31p22M53K97
3647C48p34M06L02o67L75K27n23K78K07l96J11K91l21n5M00l11j23M57l47j36
3667b11M59k79j83M30j84l15M74r1m57N92p9n82P01j27o01P43j40o03P15n1o67
3688d56O72N3q16P73J13r54Q86O9j011R65K2r81R70L9j004R25J27j081R41J98
3708D50j207J042J98j294J166R9j282J210N0j246J197N3j253J169J22j331J231
$$ plain form
3579 -1947 486 1464 -1923 497 1349 -1829 563 1209 -1779 556 1157 -1649 489 1091 -1587 463
3595 463 1070 -1578 466 1075 -1520 463 962 -1457 496 901 -1377 434 882 -1261 370 845 -1224
3612 -1224 351 863 -1186 346 809 -1133 365 708 -1051 360 661 -941 273 597 -837 239
3628 239 592 -807 212 575 -759 224 477 -683 216 397 -579 190 352 -478 89 320 -402 51 348
3647 348 -386 20 322 -345 30 257 -266 12 219 -177 -66 225 -96 -151 249 -62 -185 272 -75 -211
3667 -211 248 -31 -214 216 32 -283 191 100 -357 235 156 -426 275 148 -453 290 150 -453 262 211 -456
3688 -456 216 269 -547 226 339 -615 271 340 -671 294 316 -665 305 344 -660 265 392 -689 252 450
3708 450 -757 285 483 -811 355 454 -828 382 432 -814 383 436 -817 352 474 -857 374
3725C74J34j432J353N9j433J432l7j381J422o7j332J404o2j348J376kj405J451
3743E06m4j463J555j33j408J576k17j335J550k32j291J493j86j307J487j64j347
3760i60J548k28j344J617l12j245J583l82j171J516l65j118J471l28j143J468
3776F07l43j147J526m23j091J538m97r78J461n29q71J349m85q48J307m35q70J318
3794E89m85q18J340n66p40J298o18o01J196o29n05J079n69m82J033n36m88J025
3812E23n70m21J013o42l01R14o49j76P62n81j42O48m90j51O36m89j31O09n15m3
3832a96N36n26O7M03m94J73K52l98J74J65l18J67J38l02K01R3l36L08j9l23M27
3853A92j82k23M73l23j31M93m09o3M99m52o7N71n39o2O76o88JP79q75J32P83j003
$$ plain form
3725 374 508 -924 429 488 -945 487 450 -931 491 424 -908 496 434 -914 462 460 -945 506
3743 506 462 -1001 554 421 -987 589 372 -963 587 355 -936 557 371 -936 551 387 -960
3760 -960 588 360 -984 633 321 -924 659 277 -894 622 257 -861 610 282 -861 607
3776 607 264 -883 643 220 -871 667 170 -808 653 124 -747 602 117 -731 576 141 -729 589
3794 589 104 -714 626 60 -680 618 0 -601 595 -34 -539 540 -29 -511 522 -14 -502 523
3812 523 -47 -468 545 -97 -398 516 -133 -309 453 -128 -270 378 -112 -263 373 -116 -247 362 -153 -196
3832 -196 340 -186 -119 284 -210 -37 215 -183 -9 156 -162 5 143 -159 42 135 -201 107 88 -235 192
3853 192 10 -213 260 -63 -194 299 -110 -173 326 -126 -193 378 -161 -223 453 -235 -234 545 -330 -198 585 -418
3875d18K70P47j041L19P28j094L45P96j178L71Q86j350N09Q86j487O60Q36j562
3893g77P85P64j572Q43P29j595Q48P96j709R49Q12j853J102P79j970J254P08j991
3911a098J346O41k041J395O75k088J423P32k251J551P54k407J723P04k492J844
3927D11O28k522J935N95k575J985O19k654K054O48k790K192O21k898K377M94k916
3944a796K481L85k867K532L38k880K576K99k916K670K56k994K813J33k976K935
3960I89j3k935L012j43k860L015j73k857L054j91k928L187k55k969L300l92k944
3977b103L404n03k910L442n57k891L467n68k937L531n80l022L665o45l075L807
3993A525p90l040L877q65k977L863r21k957L892r29k984L966r94l000M075j140
$$ plain form
3875 -418 -148 599 -442 -123 605 -489 -144 652 -526 -155 731 -619 -110 776 -711 -51 785 -777
3893 -777 8 772 -800 43 772 -823 25 821 -888 61 873 -980 122 901 -1069 185 893 -1098
3911 -1098 248 889 -1152 243 918 -1170 253 985 -1266 285 1039 -1368 355 1059 -1433 411
3927 411 1039 -1483 452 1047 -1528 457 1076 -1578 476 1124 -1666 526 1147 -1751 626 1120 -1796
3944 -1796 685 1070 -1797 735 1073 -1807 769 1068 -1848 822 1078 -1916 897 1030 -1946 989
3960 989 976 -1959 1053 910 -1950 1065 892 -1965 1089 898 -2030 1157 902 -2067 1233 841 -2103
3977 -2103 1301 798 -2112 1330 773 -2118 1349 781 -2156 1375 795 -2227 1438 793 -2282 1525
3993 1525 735 -2305 1572 707 -2270 1593 672 -2285 1607 678 -2306 1660 666 -2334 1741 601
4009F01k945M145j282k809M115j389k682M074j429k616M046j455k575M068j546
4024C21k527M135j696k386M115j810k252M063j874k137L994j859k123L991j880
4039G5k125M054j975k068M081k074j971M067k149j897M038k153j848L995k134
4054h4j870M035k176j876M092k261j812M092k341j690M028k382j606L954k359
4069b56j552L891k370j506L871k400j452L868k476j305L765k546j126L628k513
4084d79j043L499k460r65L392k450r24L368k488q10L287k528o89L182k535n77
4100a220L065k476n30K949k410n34K954k412n27K947k451m55K881k473l61K805
4116A752k423l42K695k340l49K655k302l59K663k307l27K610k324k26K527k310
$$ plain form
4009 601 -2344 1801 519 -2290 1825 436 -2246 1828 399 -2217 1829 374 -2201 1867 321
4024 321 -2206 1929 233 -2153 1962 152 -2100 1963 89 -2048 1946 87 -2036 1955 75
4039 75 -2050 2004 29 -2039 2042 -32 -2003 2064 -85 -1982 2056 -97 -1945 2050 -84
4054 -84 -1954 2081 -95 -1971 2121 -140 -1952 2140 -201 -1891 2137 -245 -1851 2103 -256
4069 -256 -1808 2083 -287 -1793 2078 -322 -1774 2094 -382 -1687 2078 -468 -1594 2034 -479
4084 -479 -1522 1977 -483 -1448 1944 -506 -1430 1938 -550 -1360 1927 -601 -1290 1892 -643 -1220
4100 -1220 1845 -631 -1161 1788 -622 -1156 1798 -614 -1141 1806 -645 -1100 1781 -692 -1053 1752
4116 1752 -671 -1013 1682 -658 -1007 1648 -654 -1013 1650 -657 -984 1626 -698 -924 1603 -707
4132g07j59K397k223j15K261k111j15K196k063j24K150k039m4K037k021P0J898
4149A288j954J23J729j809J24J619j709R0J579j653R7J516j621J52J449j606K06
4166c80J320j494K21J195j369J55J181j301J02J184j280J07J150j255J27J101
4182G64j206J41J000j100J11R39j006M9R39r36rR27r14NQ87q87M7P73p85L9O65
4203D43o40l0O21n50j06O36m85j34O03m74r2N27m00j01M12k76j36L53j62k09L40
4224A40p7k94L65o1l04L61m9k96L12J1l10K51J15l82K54J82m91L10K12n41L37
4245D5K00n10L17K05n28K77K85n59K37L87o79K78M23p30L31M05p55L50M20p56
4265c57L01M52p45K72N16q16K72N83q88L13O16r61L72N79r60L80N81r39L40O09
$$ plain form
4132 -707 -866 1531 -692 -807 1454 -657 -772 1424 -639 -763 1387 -652 -696 1341 -680 -610 1288
4149 1288 -666 -543 1186 -623 -499 1120 -589 -499 1080 -573 -476 1040 -581 -429 1020 -586 -380
4166 -380 940 -554 -333 862 -507 -352 829 -472 -370 814 -466 -359 791 -464 -337 764
4182 764 -442 -301 699 -401 -290 649 -357 -308 631 -305 -314 613 -301 -296 591 -296 -249 524 -261 -222 443
4203 443 -197 -227 394 -156 -262 374 -111 -245 358 -116 -208 319 -81 -182 230 -46 -182 171 9 -200 140
4224 140 63 -231 134 73 -231 130 81 -215 97 108 -202 49 164 -218 36 218 -273 37 249 -292 45
4245 45 245 -265 52 257 -271 6 291 -268 -31 356 -323 -45 378 -352 -21 384 -371 -21 399 -357
4265 -357 -56 396 -349 -77 439 -377 -105 478 -410 -97 519 -442 -70 509 -451 -71 510 -429 -89 520
4285E20r49L17O71j002L29P00j081M18O75j112M66O20j086M60O29j082M41O51
4303E85j093M38O86j167N02O67j189N51O24j193N96N47j132N85N50j120N51N90
4321E78j163N75O00j212O56N42j206P11M75j169O88M27j095O52M47j095O45M68
4339E24j122O83M38j137P32L80j113P62L18j036P26K71r90P00L06r93O92K86r82
4358e55P19K52r91P72J59r14P60J15q32P17Q2p76O83Q9p61O65R3p66P20J0p18
4379d77P35p7o12O88j15n14O03q9m83N73j09m72N97j46m51O15k02l67N89k77k57
4400b48N13k86j83M29k45j69M03k37j60M06k76j10L95l33rL24l66J00K44l45J39
4421a4J79l25J62J52l29J89J45l80K84J06m44M06J2m42M90r8l94N35j54l95N64
$$ plain form
4285 520 -429 -112 559 -443 -114 586 -495 -77 598 -514 -48 572 -514 -54 575 -507 -66 585
4303 585 -508 -70 616 -551 -49 618 -571 -20 604 -589 7 554 -578 7 557 -563 -12 578
4321 578 -585 -10 590 -622 34 576 -630 81 556 -613 75 502 -593 59 506 -589 56 524
4339 524 -598 85 523 -614 118 498 -615 147 465 -571 155 426 -564 136 442 -551 141 427 -555
4358 -555 164 416 -575 197 356 -558 202 317 -515 202 284 -492 191 280 -481 184 277 -489 231 241 -477
4379 -477 258 181 -431 257 142 -372 231 142 -341 232 123 -349 248 102 -349 266 64 -303 286 9 -248
4400 -248 265 -21 -204 225 -20 -189 214 -23 -183 223 -53 -163 232 -101 -110 214 -152 -52 192 -153 -14
4421 -14 165 -160 2 154 -175 14 159 -221 63 169 -275 131 143 -299 191 93 -301 234 80 -315 249
4442B49j81l97O11k06m44P13k92m72Q23l88m45Q95n13l76R14n64l46R17n69l58
4462d29R54o23l64J040p12l47J099q06k69J123r08k05J116r20j76J107r50j78
4480d48J184j021j86J254j116j21J291j232l8J299j298K2J284j323K6J320j370
4497d73J7J422j474L6J495j586J06J528j715K12J519j755K66J496j793K88J545
4514A134j846K76J621j950L57J633k057M60J597k101N53J517k088N93J496k111
4530i16O23J510k144O43J507k197P30J493k273Q47J409k275R05J332k248R34J326
4547A206k276R43J346k329J000J359k418J099J331k474J184J259k468J241J233
4562A236k500J275J253k541J289J286k637J373J285k721J491J220k727J552J136
$$ plain form
4442 249 68 -329 282 76 -368 345 53 -419 404 16 -429 466 -47 -423 491 -73 -419 498 -71 -429
4462 -429 525 -98 -462 578 -134 -481 618 -188 -457 666 -242 -447 669 -251 -427 680 -270 -448
4480 -448 736 -285 -471 783 -333 -454 837 -395 -433 866 -432 -410 874 -449 -423 897 -473
4497 -473 -456 966 -508 -472 1023 -563 -457 1071 -644 -432 1087 -668 -402 1094 -699 -411 1134
4514 1134 -712 -436 1185 -765 -408 1225 -832 -372 1225 -876 -323 1194 -894 -301 1195 -916
4530 -916 -293 1217 -927 -284 1223 -974 -244 1249 -1024 -177 1232 -1043 -138 1194 -1054 -120 1206
4547 1206 -1070 -127 1219 -1110 -110 1249 -1169 -70 1261 -1213 -29 1230 -1238 3 1236
4562 1236 -1264 11 1264 -1277 12 1298 -1339 34 1319 -1402 89 1309 -1418 134 1270
4577A270k689J576J121k706J588J105k693J616J083k736J689J028k736J773R20
4592A209k690J821Q05k609J817P66k546J779P41k530J824O96k562J902O12k512
4608a477J939N17k446J962M51k397J934M60k375J929M45k402K004L97k427K055
4624E69L48k408K096K67k349K087K60k336K079K49k339K108K26k359K169J87k346
4641a492K200P7k261K199K1k204K172Jk113K111k2k100K135n8k053K134j36j963
4659a352K108k02j859K060k45j743J961k52j683J928k45j669J932k83j626J920
4675G50l43j542J896l90j467J834l95j397J779l79j398J767l62j420J793l98j383
4692a055J807m67j303J758m68j247J696m60j221J661m39j221J647m36j192J649
$$ plain form
4577 1270 -1419 157 1278 -1428 160 1265 -1428 188 1271 -1465 224 1252 -1484 289 1209
4592 1209 -1481 340 1145 -1464 353 1119 -1427 352 1093 -1437 387 1083 -1479 423 1035 -1477
4608 -1477 462 979 -1467 495 946 -1451 483 943 -1432 497 942 -1460 544 941 -1486 569
4624 569 917 -1491 605 872 -1477 610 870 -1466 613 862 -1477 631 857 -1502 667 854 -1492
4641 -1492 708 785 -1476 723 744 -1460 712 713 -1400 711 689 -1411 724 666 -1387 747 611 -1352
4659 -1352 756 554 -1305 755 510 -1233 728 476 -1207 721 476 -1193 739 456 -1170 750
4675 750 407 -1135 761 371 -1096 738 343 -1054 725 346 -1052 715 353 -1067 726 328 -1055
4692 -1055 752 285 -1018 740 272 -975 721 261 -960 701 262 -959 688 252 -940 709
4708G09n00j114J608n32j026J517n19r44J420m70r14J358m31q99J328m55q30J285
4726E91m81p60J202m68o66J092m41o16J017l81o20R76l50o19R64l55n75R31l94
4745D7m97Q44l39m65P61k85m61P24k48m86P31k27n12P38k55m53O89k48l96O21
4765B83k22l72N31j38l84N11r1m12M96r1l94M60p9l45M07o7k98L26j8k69K40O7
4787A41l22K36R6l35K10J08k92J65J29k65R7J72k45L4K45k74LK98l21K4L06l35
4809a25L3K94l13LL03k73o4L70l04j04M42l52q2M60l92p1M60l85o9M46l66r5M72
4832B88l51j58N34l85j64N83m43j33N90m72j32N96m70j15N85m49j70O15m34k12
4852b97O84m96k01P13n37j53O97n51j34O74n29j57O92n15j89P18n38k00P66o03
$$ plain form
4708 709 209 -905 703 171 -855 662 143 -801 619 149 -765 593 162 -737 591 136 -694 591
4726 591 110 -650 552 84 -582 510 69 -547 470 89 -531 445 95 -524 440 85 -490 441 47
4745 47 -450 394 55 -410 351 66 -395 329 81 -405 326 99 -413 325 70 -383 306 58 -338 283
4765 283 61 -311 220 82 -302 209 118 -294 202 111 -283 177 98 -247 160 93 -205 121 103 -166 74 141
4787 141 -181 55 151 -184 26 134 -158 7 136 -129 -32 140 -105 -71 174 -100 -97 201 -120 -96 210 -125
4809 -125 -92 202 -111 -108 195 -78 -142 228 -76 -180 262 -90 -172 288 -104 -175 285 -100 -169 277 -89 -184 288
4832 288 -63 -221 313 -72 -236 347 -96 -229 361 -111 -243 353 -117 -232 353 -96 -266 349 -85 -297
4852 -297 387 -109 -310 403 -134 -287 410 -141 -275 399 -130 -287 405 -110 -299 419 -119 -319 447 -156
4872a56j53P72o30j10P25o19r2P03o05j08P16o06j20P51o36j07P52o74n1P20o91
4893b19j9O87o63j4O60o43l1O87o55l4P07o98jO96p10M4O58p09R5N88o78P4N85
4916D07o30N2N97o48N0O05o94J10N79o95J54N05o56J71M46n96J50M38n80J34M60
4937C59o20J82M44o46K29L80o02K50L13n58K61K80n09K33K68n09K24K71n02K51
4957aK31m90L03J61m53L21Q9l89K92Q1l36K54Q6l45K71N9l46L23Nl12L22n5k62
4980a91L30r1j98K87j06j65K45q1j67K60j14j50K91j74j01K97k38l2K66k54J7
5001f9K37k70M8K05k67N9K31l14R8K44l88J73K27m41K59J73m56L22J32m50L24
5022G7J15m67L72J13n23M13J20n74N02O7n87N48J1n66N77l0n51N98m1n83O21j8
$$ plain form
4872 -156 -309 463 -167 -277 448 -171 -263 440 -165 -273 443 -163 -283 468 -168 -275 477 -197 -248 472 -219
4893 -219 -238 449 -214 -228 432 -211 -242 445 -210 -244 463 -235 -236 460 -250 -206 452 -257 -162 426 -252 -178 407
4916 407 -223 -171 426 -222 -172 433 -261 -151 428 -267 -113 392 -264 -93 353 -243 -93 345 -235 -101 359
4937 359 -261 -79 365 -281 -52 328 -274 -24 289 -269 -8 272 -237 -4 264 -245 -21 250 -252 -1
4957 -1 230 -260 43 204 -249 72 161 -228 64 145 -191 63 149 -196 75 134 -212 111 116 -196 126 71 -191
4980 -191 139 48 -150 137 31 -134 111 30 -137 123 9 -141 150 -24 -125 172 -66 -98 168 -86 -69
5001 -69 168 -102 -54 151 -116 -57 174 -140 -42 202 -186 -13 214 -227 32 205 -251 71 203 -247 77
5022 77 192 -275 97 210 -313 100 220 -354 148 215 -372 176 187 -379 198 168 -383 215 174 -409 212 194
5044A94o25O70o5o25P26j03o35P75j78n90P65j96n84P90j74o18Q16j97o52Q81
5064C75k46o67R63l28o36R97l78o14J014l96o33J048m20o50J101m63o76J188n31
5083D8o88J255o06o52J278o64o07J283o68o19J296o78o39J343p24o25J388p99
5101g8n86J390q32n44J393q53n12J348q45n02J359q59n01J382r00m74J403r67
5119a78m21J389j000l58J354r91l68J361r90l71J393j046l60J443j120l27J467
5136H77j181k78J472j214k41J444j212k17J458j267k23J520j313j96J537j373
5152d07j46J532j423q7J495j411n2J458j406m7J448j400n0J456j433mJ430j445
5170d92N0J372j430R6J302j405J25J272j379J02J270j384J18J262j403J69J230
$$ plain form
5044 194 -431 239 174 -451 275 172 -463 312 134 -456 309 113 -471 319 145 -473 343 146 -506 375
5064 375 129 -538 425 97 -539 458 80 -534 480 84 -549 499 79 -571 530 67 -609 579 48
5083 48 -640 615 9 -643 635 -29 -636 647 -21 -640 656 -22 -661 682 -42 -667 721 -78
5101 -78 -664 726 -106 -650 743 -110 -622 726 -119 -621 738 -121 -622 760 -140 -614 789 -178
5119 -178 -599 790 -210 -568 786 -205 -573 788 -202 -573 820 -226 -586 857 -263 -590 877
5136 877 -304 -582 890 -324 -565 879 -333 -550 908 -359 -582 938 -375 -571 966 -407
5152 -407 -553 979 -444 -531 964 -447 -499 959 -447 -494 954 -446 -496 960 -473 -477 953 -492
5170 -492 -442 930 -500 -404 898 -507 -382 890 -489 -387 883 -501 -383 879 -524 -355 875
5187H75j407J98J181j403K49J143j385K36J150j388K37J169j432K88J155j476
5203f10L36J145j501L86J094j465L93J059j459M07J064j460L81J082j488M39J041
5220H44j502M94R85j467N11R14j411N02Q86j367M79Q72j342M79Q42j335N12Q08
5238G04j315N40P35j247N17O90j184M87O67j128M65O68j132M76O49j134N14O15
5256E87j134N28N55j060N28N28j038M95N39j037M98N43j041N12N22j055N48M84
5274E02j024N64M18r59N26M22r20M85M29r21M98M33r22N04L83q60M95L29q08M67
5294D1L06p48M32L13p05L72L24o73L64K99o63L64K77o20L44K41n42K97K36n08
5314b49K45K55m81K21K66m94K37K47m81K39K18m40K16K01m06J91K20l77J50K40
$$ plain form
5187 875 -532 -334 847 -556 -307 836 -549 -313 837 -551 -314 855 -577 -289 866 -610
5203 -610 -274 871 -630 -244 850 -615 -222 837 -622 -215 849 -611 -230 852 -636 -197 844
5220 844 -658 -164 821 -646 -135 779 -632 -130 756 -611 -132 740 -602 -123 719 -616 -104 704
5238 704 -611 -71 664 -583 -66 624 -560 -73 594 -534 -69 599 -533 -57 592 -542 -28 587
5256 587 -547 -19 536 -524 4 532 -506 -11 528 -509 -11 532 -509 3 525 -530 18 502
5274 502 -522 42 460 -499 27 449 -471 14 443 -478 20 453 -469 35 418 -442 53 382 -426 41
5294 41 347 -401 31 344 -361 11 335 -338 26 325 -338 26 303 -317 27 268 -274 23 259 -249
5314 -249 -4 251 -230 -9 257 -237 0 247 -234 5 223 -217 -1 200 -206 -15 205 -172 -22 218
5334B18l93J41K33l98J68K26l70J53J83l20J24K05l00O0K37k75L0K60k93L9K45
5355A73k75K7K22k18j6K24j86n0K38j54j04K74j61j36L02j75j22K84j62j36K87
5376A36j37j50K86j09k02L12r5k42L43j05k37L57j32k21L46j03k28L19q1k61L58
5397A54p1l12M00r8l09M08j09k84L99j21k80L94j10k85M01r8l22M04p6l60M60
5418A85r9l46M67j46l39M77j28l26M52j13l59M57p7m08M91r7l99N18j37l77N29
5439B25j59l61N09j48l44M77j31l67N21j46l80N38j59l87N69j99l51N51k10l19
5459b71N20j99l26N18j93l27N25j93l45N55k45k97N61k75k70N32k65k50M93k52
5479dk51N02k53k51N22k72k57N44l15k11N16l15j79M81k90j71M53k83j70M58k86
$$ plain form
5334 218 -175 -34 199 -199 -31 195 -175 -22 161 -159 -35 170 -130 -70 167 -108 -78 182 -111 -72 173
5355 173 -102 -75 147 -71 -87 137 -49 -99 139 -15 -119 155 -6 -142 160 -15 -137 147 -15 -151 136
5376 136 -1 -151 135 26 -176 136 41 -201 142 37 -200 157 25 -196 150 47 -181 138 57 -204 154
5397 154 83 -229 171 73 -236 172 63 -221 178 57 -223 171 61 -224 177 79 -243 161 85 -275 185
5418 185 86 -260 207 61 -278 199 71 -255 197 84 -275 182 105 -303 188 91 -308 210 73 -304 225
5439 225 66 -295 214 66 -278 199 68 -299 222 76 -304 234 75 -312 257 58 -293 258 48 -271
5459 -271 249 50 -276 242 49 -278 247 54 -291 264 19 -278 283 8 -262 270 5 -245 248 -4
5479 -4 -255 247 -6 -257 265 -7 -264 280 -35 -246 270 -45 -224 257 -33 -204 249 -34 -204 254 -32
5500c2j71M64l07j68M86l29j29M44l33q0L99l09p9L76k98q3L87l17o5L86l37l5
5522a30L73l62K2L01l20L9K63k97L4K59k93M6K53l06N3K62l54J25K06l29J54J61
5544A60l05J49J26k70J39J27k58J41J32k90J86R6l01K20Q3k95K34J4k49K38jk17
5566a41K19j4k13K23Nk48K72m1k39K97r2j98L10j31j71L04j62j25K91j72j31L23
5588A66k01j28L68k49j13L92l14o0L77l47oL53l47PL49l64JL83m01J2M11m47N5
5611a03L87m63P9L93m86J08L60m75J14L73m92J05L99n22J32M06n62J70M05n92
5631b64K02L74n82K25L56n83K16L77o11K47L82o60K95L77o88L40L58p22L85L14
5651C38p04M04L16p31M21L17p53M41L35q08N00L08q44N50K74q25N72K36q23N95
$$ plain form
5500 -32 -203 261 -46 -214 272 -57 -186 258 -75 -155 244 -65 -144 232 -66 -149 238 -79 -144 242 -95 -130
5522 -130 243 -119 -97 204 -116 -77 186 -111 -77 182 -111 -65 188 -118 -65 197 -157 -32 174 -155 -1 160
5544 160 -145 4 130 -140 -1 126 -132 9 141 -149 37 133 -168 52 135 -160 74 88 -161 77 76 -141
5566 -141 78 64 -149 74 79 -169 103 62 -177 120 28 -170 140 9 -162 142 -20 -145 146 -26 -157 166
5588 166 -35 -163 205 -44 -157 235 -79 -139 238 -109 -115 238 -109 -102 247 -117 -116 267 -134 -122 289 -158 -103
5611 -103 284 -179 -100 293 -193 -85 275 -200 -86 287 -205 -100 299 -223 -91 315 -247 -77 328 -264
5631 -264 -62 312 -270 -45 311 -272 -56 321 -290 -43 339 -321 -26 351 -337 3 361 -361 24 338
5651 338 -366 38 354 -377 44 361 -392 49 384 -424 76 384 -460 90 364 -461 111 347 -476 119
5671A19K34q28N89K33q44O22K33q71O60K01q58O76J60q31O75J51q10O52J69q16
5691d84O55J63q36O86J49q64P31J27q45P33Q6q14P33R5q29P50O5q29P63Q0q80
5712e65Q23N2q76Q59k0q46Q76m6q22Q89p2q31Q86o3q36R27q7q43R60j40q09R59
5734C75j66p97R69j68p77R29j54p64R22j63p71R31j60p66R43k05p22R30k28o86
5754e28R06k12o80Q77k00o85Q85k00o85Q99k33o74R15k67o27R05k87o12Q89k81
5774A05o18R03k86o15R11l12o11R38l36n82R39l77n42R23l97n18Q97l73n10Q83
5794D22l70n14R02l88n03Q97m19m60Q73m35m22Q30m05m03P87l63m31P73l41m27
5814c97P75l50m13P68l73l79P25l53l60O84l23l51O74l02l65O68l09l55O78l41
$$ plain form
5671 119 353 -475 114 347 -497 125 358 -513 147 348 -510 166 326 -505 170 321 -489 163 332 -484
5691 -484 171 334 -502 184 333 -531 200 327 -518 215 301 -513 220 315 -514 236 301 -528 235 315 -565
5712 -565 258 310 -566 293 273 -573 303 257 -565 324 252 -579 307 244 -592 335 248 -595 365 225 -584 375
5734 375 209 -588 381 213 -564 365 211 -553 369 206 -565 366 206 -560 383 178 -544 386 158 -528
5754 -528 378 166 -514 363 163 -522 363 163 -522 377 144 -530 385 118 -509 396 109 -503 386 105
5774 105 -513 390 104 -511 400 88 -523 415 79 -503 436 59 -483 440 43 -475 422 49 -461 422
5794 422 52 -462 440 52 -451 446 27 -433 440 5 -417 413 8 -395 392 29 -402 371 30 -397
5814 -397 378 28 -385 383 10 -369 356 3 -357 327 4 -347 327 25 -340 328 19 -336 342 1
5834Al28O76l68k87O25l34k85O16l17k91O02l10k96O27l33k88O20l67k29N95l75
5855d6k08N58l33k23N39l07k27N09k81k28N24l09k10N10l06j83M62k63j85M24
5875B17k25j86L91j84k22M06j70k36M04j84k04L68j68j90L58j44k09L32j14k05
5895a65L14j02k28L41j11k18L23j24j88L04j14j86K90r8j92K74o8k19K87n8k38
5916a76K95q0k02K73p5j86K48n0j89K18j1k04K23jk33K37Jk39K32Lk27K25J0k14
5940a22J67M8k31J86P1k72J96Q6k91K14O8k79K07P7k65J74J02k86J71J12k77J61
5962A7J25l24K06J20l13K03J01l19K12J00k85J78J17k97J71J37l27J87J48l39
5982a82K09J27l33K16J08l18K04J20l26K02J41l47J94J56l66K15J54l66K32J22
$$ plain form
5834 1 -327 349 -19 -306 319 -15 -300 316 -1 -292 310 0 -296 331 -2 -290 330 -37 -266 329 -46
5855 -46 -254 304 -29 -252 287 -20 -247 262 -19 -247 277 -32 -242 268 -38 -221 241 -22 -207 217
5875 217 -8 -194 197 13 -209 197 27 -209 195 11 -193 175 7 -183 175 31 -178 154 40 -165
5895 -165 149 47 -181 160 49 -169 154 30 -158 146 32 -154 136 38 -154 120 52 -167 120 62 -176
5916 -176 119 39 -163 110 35 -151 97 47 -142 76 65 -139 84 83 -150 87 88 -151 81 84 -143 82 92 -122
5940 -122 45 93 -138 48 119 -153 43 129 -162 52 120 -159 48 125 -140 34 136 -150 21 133 -144 17
5962 17 142 -182 24 144 -169 34 135 -184 28 128 -157 21 138 -159 12 149 -178 9 157 -182
5982 -182 27 154 -179 37 145 -173 31 151 -175 27 168 -179 15 171 -195 20 174 -192 40 162
6002A62l74K52J12l52K36J22l60K28J46l74K36J48m01K61J16l75K69R9l63K62
6022E0Q9l41K37J27l66K51J13l67K58J13l87L05O2l59K98N5l35K74O0l28K67N9
6044A35l32K75O1l55L08L0l39L18Jl09L06mk88K86kl01L05J1k95K81Kl02L21l5
6068G8k87L31o0k53L20p8k32L02m5k55K98n1k53L20p9k32L20j11k09L23j23j72
6090a48K94j26j58K75j19j58K86j45j49L04j65j33K94j78j03K79k01o4K55j93
6110e3m9K40j95m1K45k01l9K44k25j3K49k43K6K18k60L8K08k37M3J93k39M0K23
6133A72k67M6K17k88Q8J96k97J31J52k88J40J29k77J45J45k89J49J44l13J82J34
6154A51l30K23R4l24K45N3l08K65M4l07K67L4l05K83K5l14L15Kl29L51l9l22L77
$$ plain form
6002 162 -212 40 152 -200 36 158 -202 26 172 -202 34 182 -219 42 158 -217 52 151 -212 50
6022 50 139 -202 35 162 -204 47 160 -207 51 164 -223 82 144 -215 83 138 -197 77 137 -191 76 135
6044 135 -197 78 139 -216 92 122 -217 101 102 -207 99 95 -193 93 91 -210 95 106 -189 92 94 -208 113 78
6068 78 -209 122 62 -191 129 51 -181 121 76 -179 119 68 -185 135 56 -176 144 33 -176 147 24 -148
6090 -148 146 20 -138 137 18 -140 146 1 -148 156 -9 -142 152 -26 -129 150 -51 -115 140 -53
6110 -53 -102 138 -57 -98 147 -54 -93 151 -74 -87 162 -81 -55 163 -97 -59 149 -88 -45 148 -91 -51 172
6133 172 -95 -49 168 -120 -32 164 -133 -2 150 -138 2 131 -146 -1 144 -145 4 148 -165 17 151
6154 151 -179 44 138 -186 59 112 -196 69 113 -194 73 107 -198 85 110 -204 111 113 -216 135 96 -226 151
6177A51o9k99L62p0k92L63o7l08L99j04l13M36j28l07M62j64k89M57j75k87M30
6198A88j48k81M49j67l01M87j96k96M99k12k97N19k46k59N17k63k36M99k64k59
6218b67N22k66k45N56l21k42N56l41k07N85l94j84N78l98j73N72m15j70N94m34
6238i4j48N94m61j38O11m98j02O11n13r2N92n02q7N89m98r5O10n28r0O31n56o3
6260b27O11n67m1O02n58l1N91n53m3O02n52m9O11n78k5O13n97mN95n98L1N70o21
6283b18M8N68o18O0N77o38N3N87o71Q5N94p04J49N40o99J65N13o74J70M97o75
6304b91J63N29o95J77N28p10J96N06p17K25M76p03K28M62o71K12M61o78K29M60
6324C87o78K11M54o79K47M47o92K47M27o56K29M17o43K25M24o57K27M25o64K43
$$ plain form
6177 151 82 -217 145 75 -217 146 79 -229 170 66 -247 189 61 -246 216 52 -237 220 45 -242 188
6198 188 40 -241 208 41 -260 227 31 -265 234 22 -275 244 -2 -261 256 -7 -243 256 -8 -267
6218 -267 255 -11 -256 300 -21 -263 293 -48 -255 330 -64 -248 330 -68 -241 331 -84 -254 340 -94
6238 -94 -242 352 -109 -247 364 -134 -236 375 -138 -230 362 -140 -227 362 -136 -231 379 -149 -239 392 -164 -227
6260 -227 384 -183 -224 378 -180 -211 380 -173 -216 386 -166 -215 396 -182 -207 406 -191 -195 400 -198 -167 403 -218
6283 -218 -170 398 -220 -160 417 -221 -168 419 -252 -167 427 -277 -128 412 -287 -122 391 -283 -113 384 -291
6304 -291 -128 401 -294 -117 411 -299 -103 403 -314 -89 387 -316 -88 374 -297 -85 376 -302 -73 387
6324 387 -291 -80 374 -305 -58 389 -303 -56 371 -285 -56 361 -282 -57 367 -290 -63 362 -302 -59
6344e9M18o74K82L70o55L05L34o31K91L44o36L09L26o34L06L24o44L38L01o46
6364c31L61K65o23L67K39n93L42K56n98L55K42n82L48K31n92L61K23n81L60K15
6384B65n45L41J99n30L11K09n17K90K34n37K97K22n05L07J83n00L13J74m67K93
6404C7J72m56K74J89m63K73J81m60L02J55m60L05J37m20K95J13l97K74J15l85
6424b19K66J18l89K80J20m03K86R4l64K77O8l35K61P3l10K33R6l34K42J00l49
6445a89K36R1l30K36Q4l00J96Q6k69J93R4k74J62J20k85J61J27k84J58J14k63
6466a36J54J09k50J38R6k22J06J41k51J14J30k52J20J28k41J31Q8k17J22R3j98
6487i7J02J07k01O8J28k04Q5J27k30J01J24k15J01R6j77P3J11j72M8J35j91N1
$$ plain form
6344 -59 359 -315 -33 337 -318 -13 321 -310 -19 325 -311 -2 324 -310 -4 320 -324 14 315 -331
6364 -331 30 295 -328 39 278 -315 27 283 -315 40 282 -300 48 279 -313 48 271 -310 50 265
6384 265 -280 61 260 -270 41 250 -267 23 257 -280 17 239 -266 41 224 -276 37 211 -256 37
6404 37 209 -247 27 216 -247 26 207 -253 49 204 -256 49 186 -234 61 174 -223 51 166 -219
6424 -219 47 165 -224 56 176 -227 59 153 -211 66 134 -201 60 133 -177 56 152 -182 60 160 -189
6445 -189 47 138 -192 44 128 -172 24 110 -159 34 128 -146 16 136 -149 12 139 -145 13 127 -136
6466 -136 18 127 -123 15 111 -111 -5 136 -115 -1 129 -123 -3 125 -116 15 103 -114 8 101 -97
6487 -97 5 112 -89 -21 107 -97 -12 115 -115 -14 110 -105 -4 92 -85 -12 99 -73 -25 110 -81 -30
6509c0J48j95N0J54k12N6J50j91L5J54j77K1J55j73NJ79j85MJ88k02RJ73j91L2
6533d3J69j96J4J72j78jJ82j66j6J96k02kK02k12K6J92k10J5J88j95OJ96k03K
6557f4J88j86rK08k09LK04k12K4J94k17J8J94j91nJ95j97JK04k15J3K18k39J7
6581f3K10k29J9J93k14L4J80j99LK09k17NK17k37L3K05k44N1J84k25N1J65k16
6604h5M5J75k18L8J81k18M9J74k40P6J81k54P1J58k30R3J38k17N5J61k27P9J50
6627A35k42R6J44k43J04J26k38J15J06k05J07J06k21R2J22k16J07J15k42J36J04
6648A08k36J54O7k12J59N0k07J36O7j99J40N7j98J45O0k15J73M0k02J66J6j83
6670a14J75kj70J77j5j55J60lj60J75k3j56J90l9j57K00o3j34K00q0j02J75p7
$$ plain form
6509 -30 118 -77 -27 127 -85 -29 121 -70 -35 119 -58 -37 118 -55 -50 129 -56 -52 136 -66 -57 116 -75 -43
6533 -43 126 -70 -56 116 -62 -63 119 -47 -63 133 -69 -71 131 -81 -55 137 -73 -58 130 -65 -59 137 -66 -64
6557 -64 124 -62 -71 137 -72 -69 135 -77 -53 141 -76 -58 136 -55 -60 135 -62 -61 143 -72 -59 159 -80 -63
6581 -63 147 -82 -63 130 -84 -50 130 -69 -66 143 -74 -69 148 -89 -56 149 -95 -44 140 -85 -34 131 -85
6604 -85 -40 135 -83 -45 136 -82 -33 141 -99 -23 158 -96 -25 133 -97 -4 134 -83 -28 133 -94 -15 135
6627 135 -107 -11 133 -110 -6 120 -118 -3 103 -102 5 111 -110 -18 104 -112 -5 110 -132 4 108
6648 108 -128 26 93 -119 40 90 -117 19 86 -113 27 84 -114 31 91 -124 49 89 -113 53 69 -114
6670 -114 61 59 -111 66 51 -104 56 53 -107 68 45 -111 79 40 -117 83 20 -114 86 6 -96 79 2
6693Br4J86q4j17K16j08j06K07j08r5K18j37p4K21j51n7K03j36p1J95j26q6K37
6716A35j61o7K45j99l2K20j94j2K11j93j9K15k10j3K26k24QK13k36K3K19k58N4
6739d9J98k56P6J73k45N9J94k63P5J99k93J08J87l00J35J67l07J52J48l04J58
6760A2J54l05J44J61l20J62J70l46J81J58l58J99J51l46K17J44l58K11J36l39
6780a72J97J47l82K41J36l83K51J42l97K74R9l80K89Q2l72L00Q5l82K91Q7l92
6801b39L23P9l98L39M3l89L60K6l73L59pl54L57Ql78L78ll88M06j5m03M25m9l83
6825b76M41n6l66M12o3l46M17n6l77M28o0l72M31o0l73M51p2l75M56r0l55M29
6847A68q2l52M35p8l59M56p9l80M72j13l63M88j32l42M67j42l14M63j62l22M95
$$ plain form
6693 2 -92 94 10 -107 109 1 -105 102 -6 -101 117 -20 -94 127 -24 -81 122 -14 -85 110 -16 -102 135
6716 135 -26 -93 152 -47 -79 141 -53 -65 146 -47 -66 149 -61 -74 152 -72 -64 149 -87 -64 155 -103 -49
6739 -49 149 -107 -31 142 -103 -44 150 -113 -38 161 -132 -24 163 -137 -2 165 -142 10 158 -146 12
6760 12 166 -139 5 166 -154 8 178 -168 13 171 -187 12 163 -183 34 178 -180 31 167 -172
6780 -172 25 172 -210 31 167 -216 35 177 -220 54 153 -227 62 144 -228 72 157 -225 66 153 -239
6801 -239 84 163 -235 104 147 -242 118 144 -229 130 123 -231 126 134 -244 134 131 -257 149 134 -269 156 107 -276
6825 -276 165 109 -257 155 92 -254 163 107 -270 158 98 -274 157 97 -276 175 103 -272 184 94 -261 168
6847 168 86 -266 169 91 -268 188 109 -271 201 88 -275 213 81 -261 206 64 -250 213 51 -271 224
6868B24j74l08M83j82l14M97j91k88N01k41k57M85k27k60M88k20k67M90k29k63
6888b53M89k35k57N13k62k37M86k52k24M68k53k16M73k32k48M81k34k51N10k71
6908ek36M87k52k24M87k69k09M79k73k02M55k57k06M63k68j83M58k75j72M60l04
6929d6j52M39k93j36M39l17j18M19k95j38M46l19j01M20l25r7M05l05p8L87k97
6950f2q5L70k89r0L89l00r4L90k95q2L86l15o3L55k84p2L47k71p2L48k81q3L69
6973B16k77r0L59k81p1L48k78n5L20k67n2L21k56o5L17k58n7L17k61n2L21k83
6995h4j8K88k58k1K68k18l9K58k27l3K58k39j3K49k47%K38k33kK27k27jK25k12
7019f1j4K15j94l3K38k09k3K10j82k3K07j86k0J99j74l6K07j58n5K10j61n9K16
$$ plain form
6868 224 50 -258 225 43 -271 226 35 -253 248 7 -250 235 8 -252 236 16 -251 239 10 -253
6888 -253 236 1 -256 257 -5 -242 244 -8 -232 236 -17 -233 240 8 -240 241 7 -244 266 -5
6908 -5 -241 246 -6 -230 257 -12 -221 258 -15 -217 238 -19 -225 238 -30 -213 245 -30 -202 258 -46
6929 -46 -198 241 -52 -188 251 -66 -184 235 -60 -198 248 -71 -172 248 -77 -174 231 -74 -152 235 -62
6950 -62 -147 223 -66 -156 233 -67 -161 229 -66 -148 238 -77 -140 215 -69 -141 206 -65 -137 211 -70 -153 216
6973 216 -61 -151 208 -73 -144 204 -74 -129 191 -76 -128 193 -63 -128 189 -69 -126 191 -70 -122 199 -84
6995 -84 -102 186 -72 -93 175 -43 -82 176 -51 -84 174 -65 -78 171 -76 -76 162 -71 -73 154 -73 -74 151 -61
7019 -61 -75 140 -54 -87 151 -58 -81 129 -53 -76 131 -55 -75 124 -50 -86 121 -37 -92 118 -43 -102 114
7042A14j60k9J88j61k4J80j47l0J70j24l8J69j31n2J83j29m9J71j34l8J77j33
7064b7k9J48j08m3J49j04m6J50r3p7J73j08o0J57j09m3J52r5o6J58r3n1J34o3
7088Fo6J42q3p0J65r3o3J55r0p5J59q0q4J51m9r9J59o9j07J80p0j04J73q5q8J77
7114I2r1q1J48o5r1J44m5j02J51o6r3J82r1q3J68q3o9J51o8q3J38n8q2J51o0j03
7140h9J78p3j06J73q5p8J71r8o1J46o5q5J55o6r5J71p8j01J82r5q0J75j06o6J60
7165H4q3q0J44p0p4J49p9r4J87q4q7J87j12o6J60j05m5J47r7n6J64j13m9J54r8
7190a6o2J81j26m9J69j33j5J54j34k5J42j28pJ42j28j9J54j37k0J52j39jJ45j49
7214d9NJ31j29kJ30j32JJ28j42J7J33j56L2J26j61L8J19j54N1R8j49N9R2j46M4
$$ plain form
7042 114 -46 -75 113 -48 -72 108 -39 -69 101 -23 -61 108 -23 -75 108 -21 -70 101 -33 -71 106 -27
7064 -27 -56 92 -16 -59 90 -14 -60 90 -3 -80 93 -15 -75 82 -27 -70 82 -13 -79 79 -14 -65 69 6
7088 6 -60 82 -1 -71 94 1 -62 93 3 -72 87 7 -77 74 25 -74 85 16 -91 89 19 -85 88 3 -85 92
7114 92 1 -80 68 3 -88 56 11 -91 60 -6 -99 83 -8 -91 77 -6 -75 76 8 -75 63 5 -77 74 14 -89
7140 -89 89 16 -90 83 -2 -80 91 -7 -68 78 13 -72 83 17 -78 93 15 -86 96 1 -79 96 -10 -76 84
7165 84 1 -79 65 -5 -79 70 -9 -103 84 0 -87 100 -12 -78 82 -23 -68 79 -18 -74 90 -23 -72 82 -16
7190 -16 -78 103 -23 -72 97 -36 -51 103 -31 -56 86 -42 -49 93 -35 -54 100 -37 -57 95 -44 -45 100 -49
7214 -49 -44 87 -42 -44 86 -46 -45 83 -59 -42 91 -65 -33 93 -68 -30 89 -65 -14 84 -65 -6 86 -60 -16
7239a6J02j53N2J13j66P3Q9j78R6P6j67J04N2j62J00O0j53R3N9j54R5O5j82J28
7263B6M1j69J52Lj62J46J8j49J39J1j54J56mj60J50J6j69J75k9j60K09m3j51J91
7287H3m7j49J96l9j46K02m8j68K19o7j63K35q3j51K45j07j34K31j03j28K37j05
7309A0j37K38j11j30K48j33j16K54j39j01K50j58p9K41j60q6K33j52q2K45j70
7330c5q4K72j97o2K69k10m8K55k11n1K67k11n5K68k21n0K77k35n3L08k53l2K77
7353A85k56l3K92k62k3K80k72j2K90k84j3L04l08J0L08l18K1K87l05L5K72l15
7375a17M8K68l12L7K74l20M8K75l35P2K68l32Q4K49l46R9K39l42J03K48l43Q5
7397e0K69l71J21K41l62J24K58l94J39K38l67J31K13l68J46K39l79J32K45l87
$$ plain form
7239 -16 86 -67 -15 98 -68 5 94 -84 12 88 -79 25 77 -85 15 75 -78 15 74 -80 15 80 -102 26
7263 26 67 -102 50 53 -109 37 55 -94 45 56 -98 58 54 -106 44 60 -109 66 37 -123 86 43 -108 83
7287 83 36 -113 83 44 -102 100 52 -116 103 36 -127 108 25 -126 119 12 -122 109 6 -122 115 10
7309 10 -127 111 0 -130 118 -15 -131 123 -16 -117 133 -25 -104 137 -23 -109 124 -28 -110 135 -35
7330 -35 -119 153 -44 -106 163 -47 -95 160 -51 -102 165 -46 -101 167 -54 -104 173 -62 -115 193 -60 -92 185
7353 185 -71 -104 188 -74 -97 183 -89 -101 189 -95 -108 196 -112 -102 206 -112 -91 196 -109 -74 198 -117
7375 -117 -69 199 -113 -76 198 -122 -74 201 -134 -62 206 -126 -42 207 -139 -40 199 -143 -40 208 -135 -50
7397 -50 219 -152 -31 210 -152 -28 230 -164 -25 213 -154 -23 190 -178 -32 207 -172 -40 205 -182
7417a82J45K54m08J62K40l88J52K34m00J84K16l96J73K35m06J77K29m14J99K12
7437B18m21K22J82l99K13J77l78K04J73l80K11J75l93K35J60m00K50J33l86K47
7457D3J23l74K48J19l60K38J31l67K42J29l90K63J21l80K77R5l72K63J14l66K62
7478E9J01l52K41J15l57K42J28l90K70J04l72K74Q3l46K67P8l37K71P3l51K58
7499E9Q0l42K82M7l29K93L3l25K74M1l00K69K5k98K68L4k97K64L7l07K81Nk81
7522a87K81Pk83K65Ok55K56jk52K55J0k68K61Jk60K50%k54K72k7k40K50kk50K46
7547H1Rk36K24J7k64K45Ok49K51qk37K45j7k22K36j3j95K09j7k02K21j9k11K16
7571G0Kk14K26l4j74K15m0j73K05l4j66J88j4j72J97k5j73J93j8j75K01l9j50
$$ plain form
7417 -182 -37 217 -191 -29 211 -177 -25 209 -191 -7 209 -187 -14 221 -185 -8 221 -193 6 218
7437 218 -203 19 201 -198 15 192 -186 18 191 -189 22 197 -196 39 199 -201 49 182 -204 43
7457 43 166 -208 40 159 -201 37 168 -199 43 172 -218 45 166 -214 63 158 -214 49 163 -203 59
7478 59 160 -192 49 164 -193 49 177 -213 57 161 -211 63 146 -200 67 145 -192 79 152 -199 59
7499 59 139 -203 79 126 -203 90 123 -202 72 113 -187 82 107 -191 77 111 -186 78 115 -192 89 94 -187
7522 -187 94 101 -182 83 89 -166 90 89 -163 92 102 -166 95 96 -164 86 86 -168 104 77 -163 87 85 -165 81
7547 81 90 -146 78 95 -169 76 82 -167 84 76 -161 84 67 -155 81 68 -127 82 65 -137 84 65 -146 70
7571 70 72 -142 84 50 -124 91 51 -122 83 49 -117 71 57 -115 82 57 -116 77 59 -116 85 46 -104
7594a04J77l4j44J61j8j37J58j3j60J69pj59J71k3j45J65j0j46J52lj38J37Jj41
7618i1J33J5j61J43%j36J45mj31J32Oj19J12Nj13J01J1j21J19Jj27J22Qj24J18
7643D4Qj21J04pr5R7Lr7R4Rj24J10K0j18J15qj09J09J2j12Q0L3j16Q3M1j23Q7
7670A9L5j24J02J5j17Q7L4j22R7K3j12P8L0j10P6N7j34R9L4j29Q9K3j07Q6K6j23
7696f8Q9J9r7O8L9j13P0M8j35R4L3j16R4J2j01Q5L0j10Q7K2j12P4M0j13R0K3j23
7723g1R9J9j08Q8J8j00Q4Rr2Q0K3j21J05K0j20R9Pj05J12pj06J07nj03J07mj01
7750f6R5Rj16J05Pj11J19k3q5J09j9r0J03j4r9J08Nr8J12k5r3J26l3r0J21l6q1
7777f0J23n3o1J09l6p5J13m5q1J14k9p3J18n8p6J35o6n2J18o8n6J22n8n7J23p9
$$ plain form
7594 -104 73 39 -105 56 38 -99 59 46 -114 55 48 -111 60 37 -108 57 47 -99 53 50 -88 49 50 -91
7618 -91 42 57 -104 39 39 -97 48 44 -87 45 51 -68 44 49 -64 37 48 -73 46 47 -80 42 50 -74 44
7643 44 52 -69 35 28 -67 30 33 -64 30 39 -85 25 45 -73 42 34 -75 34 46 -66 14 47 -69 14 55 -68 19
7670 19 54 -70 32 47 -70 17 51 -71 26 49 -63 15 45 -65 11 68 -66 33 67 -62 27 50 -57 29 55 -68
7696 -68 21 40 -57 11 50 -63 7 55 -80 14 47 -69 25 37 -64 21 51 -59 28 50 -62 12 52 -61 29 52 -71
7723 -71 28 47 -61 27 45 -55 29 38 -54 26 49 -72 33 53 -67 32 39 -66 46 39 -67 40 35 -68 39 35 -66
7750 -66 29 38 -78 27 34 -77 42 19 -66 43 24 -66 37 23 -76 32 37 -61 51 26 -67 59 26 -64 57 21 -60
7777 -60 63 10 -51 58 22 -53 60 15 -66 48 19 -54 64 6 -70 65 -1 -53 65 -3 -59 63 5 -52 71 -8
7803hm9J31q8m9J35r5l2J20r1k7J27r8j4J13q9l5J22q9k5J23j18OJ24j22lJ26
7829I5j36K0J06j30J8J19j31J7R9j25K7J06j40L3J13j48N7R4j67O3Q8j59O2J06
7853H7j55N3J06j55N6Q5j62Q2R8j77R0Q1j70R3Q6j81J02P5j76R5Q2j88J04Q7k02
7878a04J36O4k04J42N1j96J43N5j96J49L8j91J46M2k04J67L5j96J76J2j81J80
7900F4nj85J88Lj82J80J1k02J85K4k11K00Ok03K16l6j78K04j8j86K19k8k04K28
7924I0k5k09K44l6k01K36m8j91K61n8k10K60n6k03K53o3j88K64o7k12K71p0j94
7947a52K64q8j76K69q6j82K71j03j59K61j03j61K75j14j50K84j45j42K79j39j32
7968a29K72j40j42K80j30j50K80j40j29K87j47j50K93j60j34L11j91j13K87j85
$$ plain form
7803 -8 -57 74 -14 -63 72 -23 -55 65 -26 -53 74 -24 -38 75 -14 -49 73 -16 -41 82 -36 -30 94 -28 -31 95
7829 95 -41 -21 85 -45 -27 92 -39 -22 77 -48 -21 85 -55 -22 91 -57 0 94 -73 -10 78 -81 -19 87
7853 87 -68 -15 91 -64 -8 77 -85 -3 95 -82 8 89 -81 12 98 -83 19 94 -82 13 95 -93 11 98 -104
7878 -104 32 96 -108 34 85 -111 32 87 -109 40 78 -113 33 75 -129 38 73 -123 53 65 -116 64
7900 64 59 -126 62 65 -117 63 74 -128 57 81 -130 70 76 -127 89 53 -125 79 61 -125 94 66 -138 90
7924 90 65 -144 100 64 -137 99 51 -140 121 63 -147 113 57 -146 107 44 -144 120 53 -159 112 42 -152
7947 -152 112 24 -152 117 31 -151 120 17 -142 119 16 -145 130 16 -134 150 5 -137 142 3 -129
7968 -129 143 3 -139 141 11 -139 141 1 -128 159 12 -138 155 -5 -139 172 -19 -132 155 -30
7988c0j04K88j73j18L06j79j32L00j88j15L04j86j15L08k03r9L04k01r9K95j91
8009b8r9L02k15q2L01k17p6K92k21p0K96k24o1K69k13n0K64k24l8K64k14o2K75
8032A69k35k3K52k32k2K58k44rK50k27l3K57k28k6K63k36j9K49k28k7K61k48k
8055h0K36k23PK30k43j0K41k17oK33k50J4K27k48K7K39k53K8K18k40RK16k26J1
8079f0K19k33J7J96k28K9J97k18L5J82k25M4J79k08L2J77k21L9J80k20M3J73k13
8102h4N9J46j95M0J48j94N0J58k06M1J62k06N8J45j96M3J68k11M1J57k02O8J29
8125A19j90N3J39j87L2J52j90M7J38j89N7J36j97O2J07j61N3J09j45L4J19j71
8147g3M6J23j58N8J03j68O8R0j43N3Q4j39N1Q2j43M8R4j35M8Q3j24N6P6j31N7
$$ plain form
7988 -30 -134 154 -19 -137 169 -10 -142 158 -30 -145 159 -27 -142 166 -37 -136 168 -33 -132 163 -28
8009 -28 -127 175 -40 -122 179 -38 -114 178 -43 -113 183 -41 -102 167 -46 -96 168 -56 -94 170 -44 -106 169
8032 169 -66 -89 163 -69 -91 167 -77 -86 164 -63 -96 161 -67 -93 170 -66 -85 164 -64 -91 170 -78 -80
8055 -80 156 -67 -60 170 -73 -83 158 -59 -65 168 -82 -68 159 -89 -62 177 -76 -48 170 -70 -61 155 -71 -60
8079 -60 159 -74 -57 139 -89 -60 137 -81 -46 136 -89 -45 134 -74 -42 135 -86 -47 133 -87 -44 129 -84
8102 -84 -25 121 -74 -34 114 -80 -30 128 -78 -37 125 -81 -23 122 -74 -31 137 -74 -33 124 -78 -10 119
8125 119 -71 -18 121 -66 -34 118 -72 -25 113 -76 -19 117 -80 -18 89 -72 -19 90 -55 -21 98 -73
8147 -73 -27 96 -62 -4 99 -69 -1 89 -54 -1 83 -56 -5 77 -66 -18 76 -59 -11 72 -52 4 80 -51 6
8172FP3j22M4Q3j33L5Q0j17L4R5j27L3Q6j25L8Q4j12K7Q5
$$ plain form
8172 6 79 -43 1 84 -49 -14 66 -51 -17 78 -49 -16 70 -55 -17 67 -45 -18 67
8191F7
$$ Imaginary data points
##PAGE= N=2
##DATA TABLE= (X++(I..I)), XYDATA
0@%%%%%%%%%%%qJ6j6J6k4L2l5M3n6P0p9R0j07J30j53J77k08K41k76L16l62M13
33B20m70N32o00O76p59Q50r51J060j177J309j453J609j780J965k167K387k631
50a380K900l193L519l880M281m731N239n820O485p261Q179r280J0641j2363J4620
65G956j7734K2334k9917M5331j27997K30067N2201k49903J71892j87807k8843
76a12420K93952k37781j90087M03071l3753j58131J22634k08040l2304L62197
86B09338k20724j95185L25447j8089r9396J07201k96860l3103M27385j08325j91850
97i4161J88558j18279m3291J88416k52174m7327L90987j09161j83090J27070j40534
108i2986K6021K43479k60523r6329L43289o1232j23044P2226k19990M1492L26080
$$ plain form
0 0 0 0 0 0 0 0 0 0 0 0 0 -8 8 -8 8 -16 16 -19 24 -32 38 -41 49 -58 72 -81 96 -112 129 -147 169 -193 220
33 220 -250 282 -318 358 -401 449 -502 558 -619 690 -763 846 -934 1031 -1136 1251 -1380
50 -1380 1520 -1673 1846 -2034 2247 -2484 2755 -3065 3420 -3841 4338 -4942 5699 -6664 7956
65 7956 -9778 12556 -17361 27970 -100027 130040 182241 -67662 104230 -83577 -112420
76 -112420 181532 -56249 -246336 156735 122982 -35149 87485 -120555 -152859 209338
86 209338 -11386 -206571 118876 100787 1391 108592 -188268 -221371 206014 97689 -94161
97 -94161 94397 -23882 -67173 121243 -130931 -178258 212729 103568 -79522 47548 -92986
108 -92986 -66965 176514 -84009 -180338 162951 101719 -21325 50901 -169089 -127597 198483
119A98483j84075j17648K29714j12755p1621J09308k04894O0667L25630j84280
129D8529j54269J52111r8125K2784J46096k37685N244L04269j25545j16575Q3840
140C0674j50960N9443K05126j92946j8790K23428j38196r0671P5458j29143J05515
151b1062K20584k06263q4844J55341r3186J455Q6315j67397O7682K11087j57464
162A2248p3022R5178j06146L7944J12450j47363N2108J74309j58987q0467O8571
173a3177p4783J03235J28904j79437j7993J26000j03495q724O6181j00455P9233
184E489J21954j53702k0483R4601r4718J5248O6037r3410Q2336J08418j56289
195b4519m6782O3276n0681P7026P4072j24245J8862P5492j07435J164O3235n7526
$$ plain form
119 198483 14408 -103240 126474 13719 -57902 51406 -153488 -92821 232809 48529
129 48529 -105740 46371 -51754 -28970 117126 -120559 -115315 188954 63409 -53166 30674
140 30674 -120286 -60843 144283 -48663 -67453 155975 17779 -72892 2566 -126577 -21062
151 -21062 199522 -6741 -91585 63756 -29430 -27975 58340 -109057 -41375 169712 12248
162 12248 -60774 34404 -71742 -33798 78652 -68711 -16603 157706 -1281 -81748 -13177
173 -13177 -87960 15275 144179 -35258 -53251 72749 -30746 -39470 26711 -73744 5489
184 5489 127443 -26259 -46742 47859 -46859 -31611 34426 -58984 23352 131770 -24519
195 -24519 -71301 -8025 -58706 18320 92392 -31853 -12991 62501 -44934 -43770 19465 -38061
207c8061O0735N4829j15308J8209O5563q4261O069M3783m5350P1890N1739j19595
219b9758j7974M3422l9759N3642M7886o9340K4103K4334q6982J5030N1486k9835
231a3745L5964J8425o9210K6365L3880o4572O343L1226k0701N0276K0791p6467
243b1425l339J7037l0393M0840L6407l2219J1748n368n8098K0133L7322j6029
255c384K0582N473l8587J8888J0981l8745R463J6836q580L0064R393l8540o006
268a2162k324j6729L0887K9143j1636j261j6430l1820J4611K1834l54J1299k028
281A3030j8287L895K258j2278L435N915k42J5071P355j5274j2543j0693l403K0116
295a645K0442K629r334j7672j4411K490J5014J2435L415m552r928n718K665K443
$$ plain form
207 -38061 22674 77503 -37805 -19596 45967 -38294 -32225 11558 -33792 38098 89837 -29758
219 -29758 -47732 -4310 -44069 9573 57459 -11881 12222 36556 -50426 -35396 16090 -13745
231 -13745 22219 40644 -28566 -2201 31679 -32893 -26550 4676 -16025 34251 55042 -21425
243 -21425 -24764 -7727 -38120 2720 39127 6908 18656 13288 -44810 -24677 12645 -3384
255 -3384 17198 22671 -15916 2972 13953 -24792 -15329 1507 -7073 22991 32384 -6156 -12162
268 -12162 -14486 -31215 -328 28815 17179 15918 -512 -32332 -17721 4113 3759 15058 13030
281 13030 -5257 -1362 896 -11382 -7947 -2032 -2274 12797 20152 4878 -7665 -18358 -21761 -1645
295 -1645 18797 21426 12092 -5580 -19991 -17501 -2487 9948 13363 8811 -1117 -6835 -4170 -1727
309a727k152m44M946N743N747j926j6556j0406L884P916J6443J0124j2009j4171
323d588q881m807J3271J8014p05o454n372j0103L653R664o341p59O272j976O170
338G058L386j4789p135K751J407J3695J2846j0010j2384o854p437J2086J8251
351A2871k453m906n188j0705M661R031l381k28J977l072M405M869q213o513m74
366g319k07J0869J1178n124r806r124m572R387J2775L390n395q290n284J235O718
381D31L917k550k732K1J172K729J397o865o361M632M865O111O284j1922j2269
396a1140L469J860Q072J2327r260j0863L218m499J948J4644o673q087Q787p229
410c426o11J5980j2625j0482J2831n295L596J8392j7737j4228J4037p417K343
$$ plain form
309 -1727 -3879 -4323 623 6366 12113 10187 -6369 -16775 -12891 -4975 11468 21592 9583 -4588
323 -4588 -13469 -18276 -5005 13009 12304 5850 478 -9625 -5972 3692 -2649 -3408 2864 888 7058
338 7058 10444 -4345 -11480 -8729 -7322 6373 19219 9209 -3175 -10029 -17466 -5380 12871
351 12871 10418 5512 324 -10381 -5720 3311 -70 -298 1679 -1393 3012 7881 -332 -6845 -7319
366 -7319 -7526 3343 14521 9397 -409 -9533 -14105 -4718 8057 11447 6052 -2238 -7522 -6287 431
381 431 4348 1798 -934 -913 259 2988 4385 -2480 -8841 -4209 656 6767 13051 1129 -11140
396 -11140 -7671 -5811 2261 14588 5328 -5535 -2317 -6816 -4868 9776 3103 -4984 3803 -3426
410 -3426 -4037 11943 -682 -11164 1667 -3628 -32 18360 623 -13605 432 -6985 -4642
423d642K3790j5977j2321J5977j6682j728K9027j5553r817J8343j9807l64L0518
436B0764k2286j3070K3974j7195J219L1952k8851j2944K9011k3686p21L7215k7032
449a650q570K7406l3635r06M3953k7577j0193K9294l4171K305M4767l8251j0658
462a7886L8190l3703K345M2434m2182m662M0194m2589J27M9385l7790l781L5869
475B5951n0742M676N6815m4112o038L9652m8921Q928N1562n4222p98M8504n0886
488a9631M970N0401n3399N456M7447o3102P082O0886n3272M368M2106o7533J6310
501a7911O2777o3014M755M9059o4840J5992N5637o9946J4103N6609p3057J3434
513a6402N8208o7997J9378M9533q2632K1713O6087p0553J5782M6300q1112K8266
$$ plain form
423 -4642 19148 3171 -9150 6827 -9855 -11583 17444 1891 -7926 10417 -9390 -9754 20764
436 20764 -1522 -14592 9382 -7813 -6594 25358 -3493 -16437 12574 -11112 -11833 25382 -1650
449 -1650 -10220 17186 -16449 -17355 26598 -979 -11172 18122 -16049 -13744 31023 -7228 -17886
462 -17886 20304 -13399 -11054 31380 -10802 -15464 24730 -17859 -17732 31653 -6137 -9918 25951
475 25951 -24791 -20115 36700 -7412 -13450 26202 -22719 -13791 37771 -16451 -17249 31255 -19631
488 -19631 -14661 35740 -17659 -12203 35244 -27858 -20776 40110 -13162 -8794 33312 -34221 -17911
501 -17911 44866 -18148 -13393 35666 -29174 -13182 42455 -27491 -13388 43221 -29836 -16402
513 -16402 41806 -26191 -6813 42720 -39912 -18199 47888 -22665 -6883 39417 -41695 -13429
525a3429O2757p9854K0806N4884q1891K5417N5347q1109L1590N4726q9303K6568
537a3491N8812p8275L0928M6804r2290L5606O2943q3893K9899M7081r1312L9228
549g960N5997q8534L9316N1039r4160L6698N1327q7373M5651M8633r9103M1940
561f529N4413r0201M5474M3256j00376N0999N3146r4070M9251M2025j01363N1865
573b110M7976r4280N6954M2864j04462N2694M4308r6017O1472M0260j04103N8616
585D172M1326r7294O2391L5339j03453O2154M0607r4973O4590L0968j05345O3970
597D452L7751r4238O8674K9779j02120O5059K9129r5505P2153L0511r8533O5004
609A2116K5467r3096P3914K3963j01435O9776K8381q9134P3230J5053r9779P4788
$$ plain form
525 -13429 49328 -30526 -9720 45164 -36727 -11310 44037 -37072 -5482 49244 -40059 -13491
537 -13491 45321 -32954 -2026 44778 -47512 -11906 51037 -32856 -2957 44124 -47188 -7960
549 -7960 48037 -40497 -1181 49858 -44302 -7604 43723 -43650 2001 50634 -48469 -6529
561 -6529 47884 -42317 3157 46413 -53963 -2964 50182 -43888 5363 47388 -53975 -2110
573 -2110 45866 -48414 8540 51404 -53058 -364 43944 -52073 9399 49659 -54444 4172
585 4172 45498 -51796 10595 45934 -57519 4635 45242 -49731 14859 45827 -59518 4452
597 4452 42203 -52035 16639 46418 -55702 9357 38486 -57019 15134 45645 -52888 12116
609 12116 37583 -55513 18401 42364 -59071 10705 39086 -50048 23182 38235 -61544 13244
621A3244K3540r0747P5768J8450r3673P1785J1599r1859Q4379K0189r5038P1059
633A8696J0206q5394Q4448O754r6299Q0264J5578q3404P7247O64q8891Q3426O398
646B9693q6905Q3986Q749q4417P3615o683p9940R2817N464q6556P2522j209p1726
659e0590Q2346q643q1419Q4258L025p5131P4107q429p0734Q0373j1252p2730Q5318
672C0499j54p1140O4874j7456o0401Q8951q067p3365P1081q518n9361P3319j9697
685A0565o0722Q3421j1964o4765P0180j3696n3472P0794k4710n5278Q5080j0338
697B5095o1600N9342k3602m3663Q1692k2185n6277P1297j8183m9513O3385k4648
709A140l9598P5507k5084n1908O6543j7241m1133N8597l0707l5417P6932k0776
$$ plain form
621 13244 36784 -53963 21805 40255 -53418 18367 29966 -61893 22486 42675 -52363 18696
633 18696 28902 -56492 27956 34710 -61589 18675 34253 -49151 28096 28760 -60131 23295 29693
646 29693 -57212 26774 35523 -48894 24721 18038 -61902 30915 36379 -50177 22345 21136 -50590
659 -50590 31756 23113 -58306 25952 28977 -46154 27953 19524 -51210 29163 17911 -54819 30499
672 30499 30345 -40795 24079 6623 -53778 35173 27106 -46259 24822 16304 -43057 30262 10565
685 10565 -50157 33264 21300 -43465 26715 13019 -40453 30341 5631 -49647 35433 25095
697 25095 -36505 22837 -765 -44428 37264 15079 -41198 30099 11916 -37597 25788 1140
709 1140 -38458 37049 11965 -39943 26600 9359 -31774 26823 -3884 -39301 37631 16855
721A6855m8038N1705k4720k8940O4308k6229l5221O1836k3929l9972N0650k1193
733b888k2228N8906l0603l4939N6722j9113k9720M2950k7269j7610N9344k4614
745H938l3376M2414k2514k0355M7255k3445j7187M9252k8907k9542M0516j7462
757d413j0298M1937k9653j9320M4436k0942k1071L2991k1706p559M2848k5070
769B180j8864L3617k2959j3479L3812j7180m318L3127k8147j8975K9733j2900
781d353m278K7978k2268q942K9141j9580j2021K3132j4594j886K5218j7544p819
794g816J9854j8086q861K1487p248Q89J7912k1115j1294J7797p875k1J6469j2329
808b37l575J3123j3210n335J3473o919p91J3047q446l076Q736j2753m848J2739
$$ plain form
721 16855 -31183 20522 -4198 -33138 31170 4941 -30280 31556 7627 -32345 18305 -2888
733 -2888 -25116 33790 3187 -31752 24970 5857 -23863 19087 -8182 -25792 33552 8938
745 8938 -24438 17976 -4538 -24893 22362 -1083 -18270 30982 2075 -27467 13049 -4413
757 -4413 -14711 27226 -2427 -21747 22689 1747 -19324 13667 -8039 -15598 27250 2180
769 2180 -16684 16933 -6026 -19505 14307 -2873 -7191 25936 -2211 -21186 8547 -4353
781 -4353 -8631 19347 -2921 -11863 17278 -2302 -14323 8809 -5785 -7671 17547 3 -7816
794 -7816 12038 -6048 -14909 6578 -670 219 18131 -2984 -14278 3519 -4356 -4377 12092 -237
808 -237 -3812 9311 -3899 -9234 4239 -2680 -3471 9576 1130 -1946 6790 -5963 -10811 1928
822A928r34L116P105j2654o817O401k393K392R229l898l540K821o275k087O316
837G10j559L5N164j307j654l20n093k996M633N462K128Q13l875p401j235L442
853c053K780M276K438m559m154P32j923K5N461j029n01N086m074m452K087m327
869e187jR619Q07k172J688q597n899Q494J680P45P717o653o963N243m409j579
885e467R746k681k597P268n396n446N845n492k548J2346r33l288N225j0524o361
900a0303J0550q31Q83R632p719p121N763n380j339J1474l755l514Q195o757m563
915d785P296p009j562J1853k585j842N040j0173n228Q978j331J690R458p611o447
930d258M714n871O23J0345m191j659N570o426k323M929n361k14Q435j790o57L263
$$ plain form
822 1928 994 4110 11215 -1439 -8256 -1855 -4248 -1856 7373 3475 -65 2756 -3519 -5606 710
837 710 -849 -814 4350 3043 1389 1069 -4024 -7020 -2387 3075 5203 6016 2141 -5260 -6495 -3053
853 -3053 -273 4003 6441 1882 -2272 -1540 -3463 -3438 2023 994 493 5579 1505 -2947 -860 -5187
869 -5187 -5188 4431 5238 3066 4754 -3843 -9742 -1248 432 1177 8894 2241 -4722 521 -3888 -5467
885 -5467 4279 1598 -999 6269 873 -4573 1272 -4220 -6768 5578 4645 1357 6582 -3942 -10303
900 -10303 247 -584 299 9931 2212 -4909 854 -4526 -5865 5609 1854 -1660 6535 -222 -4785
915 -4785 2511 -4498 -6060 5793 3208 1366 6406 -3767 -8995 -17 -1348 342 9800 2189 -4258
930 -4258 456 -5415 -4792 5553 1362 -297 5273 -1153 -3476 1453 -3908 -4122 4313 2523 1866 5129
946E129q350l626N697r07L778O268n795m134J92l545K561O064j111p07J082l524
962i28j033J369k308J204L568M45J062j424l969j612m77K788M489J154m69l723
978A36n137R53L237J235K983o4m389J333om775L579K080k979N622K20o486L521
995A063j952o673P696M047l498N487m271j1188P899L092n781R721j038r801R072
1010C875k891j0490J2259O37q901J1430k266j0518J2491m438j3931J5923K188
1023E368r332J3903q278j5600J8212j768j2028J8272l678j3349J6383q226j4643
1036a4764K2978k807j5833J9026n907j3150K2123j1191j8311K6064k460j3710
1048g942K0589j2438j6353K6551q704j7058K7882o472j7030K2720j4710j5225
$$ plain form
946 5129 -3221 -6847 -1150 -2057 1721 7989 2194 -1940 -1748 -5293 -2732 3332 2221 1514 2596 -928
962 -928 -1961 -592 -2900 -1696 1872 2317 3379 1955 -2014 -3626 -4103 -1315 3174 4328 3859 136
978 136 -5001 -4048 -811 424 3407 3343 -1046 287 281 -4494 -915 1165 -1814 3808 4028 -2458 1063
995 1063 -889 -7562 134 4181 683 6170 1899 -9289 -1390 1702 -4079 5642 4604 -5197 3875
1010 3875 984 -9506 2753 3390 -5511 5919 3653 -6865 5626 1188 -12743 3180 5368
1023 5368 -3964 9939 1661 -13939 4273 2505 -9523 8749 5071 -8278 8105 -121 -14764
1036 -14764 8214 5407 -10426 8600 2693 -10457 11666 475 -17836 8228 5768 -7942
1048 -7942 12647 209 -16144 10407 1703 -15355 12527 6055 -10975 11745 -2965 -18190
1060a8190L3526j0461k0217K7099j0170j3575K8237j8831j8529L6005r635j8364
1072a3105K8519j6746j5461L4015j9961j7749L9679j3804j9144K8660k1922j1601
1084a8620M1569k1968k1379L7609j6435j4629L3892k7700j4100M5565k2724j9497
1096a8417L7848k2288j2488L6980l0953j2785M8695k3403k0398L4558k6674p488
1108a6813M4742l3501j6987M6426k4859j4520L6453l2283o789M7223l4139j6494
1120b1541M4983k6464j1460L6988l7171n275N2610l4732j7792M0326l0910l338
1132a3776M2640m1730p521N0798l5154j3156L9849l5217o4M5526m5959p832N1553
1145B9957l5831q421L7279m2305N114N0579m7061r332M5545l7294k72L9896m6930
$$ plain form
1060 -18190 15336 4875 -15342 11757 1587 -11988 16249 -2582 -21111 14894 5259 -13105
1072 -13105 15414 -1332 -16793 17222 -2739 -20488 19191 5387 -13757 14903 -7019 -18620
1084 -18620 22949 981 -20398 17211 776 -13853 20039 -7661 -21761 23804 1080 -18417
1096 -18417 19431 -2857 -15345 21635 -9318 -22103 26592 3189 -17209 17349 -9325 -16813
1108 -16813 27929 -5572 -22559 23867 -992 -15512 20941 -11342 -18131 29092 -5047 -21541
1120 -21541 23442 -3022 -14482 22506 -14665 -19940 32670 -2062 -19854 20472 -10438 -13776
1132 -13776 28864 -12866 -20387 30411 -4743 -17899 21950 -13267 -13331 32195 -13764 -21596 29957
1145 29957 -5874 -14295 22984 -19321 -14207 36372 -10689 -20021 25524 -11770 -12042 27854 -19076
1158a9076M214N0564m7677o915M3392l9009N952L9487n2070M288N0749m4146m081
1171a4328L7012m2476J1071M3394n2575J262M6132m3120K303L6063m5559J3239
1183g582M2480n3215J485M2811m0039P952L2705n0445J3629M4611n0093K519L6569
1196B3387m2462J4855L3936n2853J3404M0980m8520O877L2920m3072J9214L2703
1208C1369n5698J2643L9690m4686J2408K7583m8300K2451L3853n3304J3263L3003
1220B4275m3550J7671K5751m8946K2469L2033n1290J3780K9315m1216K2264K2797
1232B5353n1472K1393L0740m4768J6120K2548m1813K3689K2933m8220J9717K6955
1244B3175m1839J7882J9563m0984K5319K1068m6863J8565K3213l6491K1112J5121
$$ plain form
1158 -19076 -14862 35702 -11975 -18890 24502 -14507 -8555 30932 -21138 -16850 33899 -10247 -14328
1171 -14328 22684 -19792 -8721 34673 -17902 -16640 29492 -13628 -11325 24738 -20821 -7582
1183 -7582 34898 -18317 -16832 25979 -14060 -6108 26597 -23848 -10219 34392 -15701 -13182 23387
1196 23387 -19075 -4220 29716 -23137 -9733 31247 -17273 -10396 22524 -20548 -1334 31369
1208 31369 -24329 -11686 28004 -16682 -4274 23309 -24991 -2540 31313 -21991 -8728 24275
1220 24275 -19275 -1604 24147 -24799 -2330 29703 -21587 -7807 21508 -19708 2556 25353
1232 25353 -26119 -4726 26014 -18754 -2634 19914 -21899 1790 24723 -23497 -3780 23175
1244 23175 -18664 -782 18781 -22203 3116 24184 -22679 -4114 19099 -17392 3720 18841
1256A8841m2197K3987K0937m1374J9143J8223l6426K3039J3655m0640K4710J7864
1268A9762l8586J9795J3593l3588K5396J1437l9849K2550J5780l3350K1937R485
1280A4362l4625K5192J0619l5413K2915J1397l0914K1804O586l1277K4766R379
1292A4791l2247K0173Q623k7004K2707M990l0477K2157P917k6616K0173N082k5189
1305a4920K0411M031k5647K0479O565k3828J7451L222k2202K0395L591k3523J7712
1318C737L981j9444J7718J327k0359J7409K682j8862J6700K460j7991J5531L04
1331E193j7387J7378J758j6700J4348k37j4487J5511j76j4927J3827M07j3082
1344h574J3531n08j3225J2867p47j1809J3180l47j1194J0658j798r700J1596j76
$$ plain form
1256 18841 -23356 631 21568 -19806 -663 17560 -18866 4173 17828 -22812 1898 19762
1268 19762 -18824 971 14564 -19024 6372 17809 -22040 510 16290 -17060 4877 14362
1280 14362 -20263 4929 15548 -19865 3050 14447 -16467 5337 11923 -19354 5412 14791
1292 14791 -17456 2717 11340 -15664 7043 12033 -18444 3713 11630 -14986 5187 10269 -14920
1305 -14920 5491 9522 -16125 4354 10919 -12909 4542 7764 -14438 5957 9548 -13975 3737
1318 3737 7718 -11726 5992 7319 -13040 4369 7051 -11811 4889 7349 -10642 4889 5193
1331 5193 -12194 5184 6942 -9758 4590 4353 -10134 5377 5201 -9726 4101 4508 -8574
1344 -8574 4957 4449 -8776 4091 3344 -8465 4715 4368 -6826 3832 2034 -7666 3930 3754
1358C754r490R056j010q609R495m34q259Q380p73p122Q073p04o738O344q35n351
1374d223O648K17n598M412n73m886N482P13m350L806p06l940L905L83k968K481
1390H03O4k535K361P59k749J124O44j900J861J180j856J47Q6j267O53J843l86
1407H32j176P72q80r90K395l40j726J900l44j706K222j33k686K124N28k580L239
1424A451N58m261K570K28l414M501P35m477L070K2m226M280J062m770L912P56
1440A997n307M648Q29n806M748O34n200N625M95o161M422L20n304N960J170o286
1456c216M788J62o437O256R68o232N916j07o326O185J33o248N835K03n871O451
1472B460K82o850N691k34o137P289L11o325N990j227o129O868K4n512O138q07
$$ plain form
1358 3754 -5736 3320 2310 -6299 3196 2762 -5497 2883 2110 -5012 3061 2357 -4381 1963 1128 -4223
1374 -4223 2425 2642 -2956 1456 883 -4003 1479 2192 -2158 1648 942 -2998 907 1290 -1678 803
1390 803 867 -1668 693 1452 -1297 -173 471 -1429 432 1612 -244 -97 -11 -1278 -625 1218 832
1407 832 -344 428 -452 -1442 953 613 -1113 787 443 -1263 959 826 -1860 264 792 -1788 1451
1424 1451 2009 -2252 318 546 -2868 1633 2368 -2109 961 983 -3243 1037 2099 -2671 1241 1997
1440 1997 -3310 1338 2167 -3639 1109 1743 -3457 2168 2663 -3498 924 1244 -4060 1900 3070 -3216
1456 -3216 1572 1734 -4703 1553 2521 -3711 2205 2098 -4228 1957 2090 -4158 1677 1880 -3991 2460
1472 2460 2742 -4108 1583 1349 -4788 2501 2812 -3513 2477 1250 -4879 1989 2013 -3499 2639 1832
1488A832o019O318m29n881O423p19n480O861j014n599N813j611m686O740n43m708
1504b702N178j823m943O125n48m174N760j771m536N535j607l560N293j641l211
1519b625M995j378l350L972j785k850N047q05k671L607k404k559M049j130j216
1534a103L290j857j859K377j170r59K513j132j079K243j020q48J247j651K8J790
$$ plain form
1488 1832 -4187 2131 1702 -4179 2244 1525 -3955 2906 1892 -3707 2106 495 -4191 2549 2006 -2702
1504 -2702 2476 653 -4290 1835 1287 -2887 2873 1102 -3434 2101 494 -3066 2227 586 -2625
1519 -2625 2370 992 -2358 1614 -171 -3021 2026 1221 -1450 2157 -247 -2806 1243 113 -1103
1534 -1103 2187 330 -1529 848 -322 -1281 1232 100 -979 1264 244 -604 643 -1008 -980 810
$$ [...]
8191c6
##END NTUPLES=NMR FID
##END=
