##TITLE=1H_Pr A-T-2
 200.13MHz, CDCl3,
 8 sc
 
 22.1.2025
##JCAMPDX= 6.0         $$ Bruker NMR JCAMP-DX V2.0
##DATA TYPE= NMR FID
##DATA CLASS= NTUPLES
##ORIGIN= UXNMR, Bruker Analytische Messtechnik GmbH
##OWNER= pz
$$ XWIN-NMR		Version 3.5
$$ Wed Jan 22 14:08:46 2025 Russian Standard Time (UT+4h)  she@DPX200
##.OBSERVE FREQUENCY= 200.1313
##.OBSERVE NUCLEUS= ^1H
##.DELAY= (6, 6)
##.ACQUISITION MODE= SIMULTANEOUS
##.ACQUISITION SCHEME= undefined
##.AVERAGES= 8
##.DIGITISER RES= 18
##SPECTROMETER/DATA SYSTEM= spect
##.PULSE SEQUENCE= zg30
##.SOLVENT NAME= D2O
##.SHIFT REFERENCE= (INTERNAL, D2O, 0, 14.3821)
##AUDIT TRAIL= $$ (NUMBER, WHEN, WHO, WHERE, WHAT)
$$ ##TITLE= Audit trail, XWIN-NMR		Version 3.5
$$ ##JCAMPDX= 5.01
$$ ##ORIGIN= Bruker BioSpin GmbH
$$ ##OWNER= she
$$ F:/spectra/data/she/nmr/H-C/1/audita.txt
$$ ##AUDIT TRAIL=  $$ (NUMBER, WHEN, WHO, WHERE, WHAT)
(   1,<2025-01-22 14:07:20.53 +0400>,<she>,<DPX200>,
      <created by zg, POWCHK disabled, PULCHK disabled
       configuration hash MD5:
       00 E9 B6 7A A2 85 ED C7 34 08 36 98 17 FE 4E 26
       data hash MD5: 16K
       1D DF 45 47 D2 79 80 03 75 25 67 BE 50 DB 39 FB>)
$$ ##END=
$$ 
$$ hash MD5
$$ 54 DE 3F 9A 73 C1 45 9F DB 46 47 DD 33 82 99 25
##$RELAX= 
##$RELAX= 
##$RELAX= 
##$RELAX= 
##$RELAX= 
##$RELAX= 
$$ Bruker specific parameters
$$ --------------------------
##$DU= <F:/spectra>
##$EXPNO= 1
##$NAME= <H-C>
##$PROCNO= 1
##$TYPE= <nmr>
##$USER= <she>
##$AMP= (0..31)
100 100 100 100 100 100 100 100 100 100 100 100 100 100 100 100 100 100 
100 100 100 100 100 100 100 100 100 100 100 100 100 100 
##$AQSEQ= 0
##$AQ_mod= 1
##$AUNM= <au_zg>
##$AUTOPOS= <>
##$BF1= 200.13
##$BF2= 200.13
##$BF3= 200.13
##$BF4= 200.13
##$BF5= 200.13
##$BF6= 200.13
##$BF7= 200.13
##$BF8= 200.13
##$BYTORDA= 1
##$CFDGTYP= 0
##$CFRGTYP= 5
##$CHEMSTR= <none>
##$CNST= (0..31)
1 1 145 1 1 1 1 1 1 1 1 1 1 1 1 1 1 1 1 1 1 1 1 1 1 1 1 1 1 1 1 1 
##$CPDPRG= <>
##$CPDPRG1= <>
##$CPDPRG2= <>
##$CPDPRG3= <>
##$CPDPRG4= <mlev>
##$CPDPRG5= <mlev>
##$CPDPRG6= <mlev>
##$CPDPRG7= <mlev>
##$CPDPRG8= <mlev>
##$CPDPRGB= <>
##$CPDPRGT= <>
##$D= (0..31)
0 0.7 0 0 0 0 0 0 0 0 0 0.03 0 0 0 0 0 0 0 0 0 0 0 0 0 0 0 0 0 0 0 0 
##$DATE= 1737540439
##$DBL= (0..7)
120 120 120 120 120 120 120 120 
##$DBP= (0..7)
150 150 150 150 150 150 150 150 
##$DBP07= 0
##$DBPNAM0= <>
##$DBPNAM1= <>
##$DBPNAM2= <>
##$DBPNAM3= <>
##$DBPNAM4= <>
##$DBPNAM5= <>
##$DBPNAM6= <>
##$DBPNAM7= <>
##$DBPOAL= (0..7)
0.5 0.5 0.5 0.5 0.5 0.5 0.5 0.5 
##$DBPOFFS= (0..7)
0 0 0 0 0 0 0 0 
##$DE= 6
##$DECBNUC= <off>
##$DECIM= 32
##$DECNUC= <off>
##$DECSTAT= 4
##$DIGMOD= 1
##$DIGTYP= 9
##$DL= (0..7)
0 120 120 120 120 120 120 120 
##$DP= (0..7)
150 150 150 150 150 150 150 150 
##$DP07= 0
##$DPNAME0= <>
##$DPNAME1= <>
##$DPNAME2= <>
##$DPNAME3= <>
##$DPNAME4= <>
##$DPNAME5= <>
##$DPNAME6= <>
##$DPNAME7= <>
##$DPOAL= (0..7)
0.5 0.5 0.5 0.5 0.5 0.5 0.5 0.5 
##$DPOFFS= (0..7)
0 0 0 0 0 0 0 0 
##$DQDMODE= 0
##$DR= 18
##$DS= 0
##$DSLIST= <SSSSSSSSSSSSSSS>
$$ [...]
##$SUBNAM0= <"">
##$SUBNAM1= <"">
##$SUBNAM2= <"">
##$SUBNAM3= <"">
##$SUBNAM4= <"">
##$SUBNAM5= <"">
##$SUBNAM6= <"">
##$SUBNAM7= <"">
##$SUBNAM8= <"">
##$SUBNAM9= <"">
##$SW= 18.0517328524113
##$SWIBOX= (0..15)
0 0 2 0 0 0 0 0 0 0 0 0 0 0 0 0 
##$SW_h= 3612.71676300578
##$TD= 16384
##$TD0= 1
##$TE= 0
##$TE2= 300
##$TE3= 300
##$TEG= 300
##$TL= (0..7)
0 120 120 120 120 120 120 120 
##$TP= (0..7)
150 150 150 150 150 150 150 150 
##$TP07= 0
##$TPNAME0= <>
##$TPNAME1= <>
##$TPNAME2= <>
##$TPNAME3= <>
##$TPNAME4= <>
##$TPNAME5= <>
##$TPNAME6= <>
##$TPNAME7= <>
##$TPOAL= (0..7)
0.5 0.5 0.5 0.5 0.5 0.5 0.5 0.5 
##$TPOFFS= (0..7)
0 0 0 0 0 0 0 0 
##$TUNHIN= 0
##$TUNHOUT= 0
##$TUNXOUT= 0
##$USERA1= <user>
##$USERA2= <user>
##$USERA3= <user>
##$USERA4= <user>
##$USERA5= <user>
##$V9= 5
##$VALIST= <valist>
##$VCLIST= <CCCCCCCCCCCCCCC>
##$VD= 0
##$VDLIST= <DDDDDDDDDDDDDDD>
##$VPLIST= <PPPPPPPPPPPPPPP>
##$VTLIST= <TTTTTTTTTTTTTTT>
##$WBST= 1024
##$WBSW= 4
##$XGAIN= (0..3)
0 0 0 0 
##$XL= 0
##$YL= 0
##$YMAX_a= 223367
##$YMIN_a= -257415
##$ZGOPTNS= <>
##$ZL1= 120
##$ZL2= 120
##$ZL3= 120
##$ZL4= 120
##$ABSF1= 10
##$ABSF2= 0
##$ABSG= 5
##$ABSL= 3
##$ALPHA= 0
##$AQORDER= 0
##$ASSFAC= 0
##$ASSFACI= 0
##$ASSFACX= 0
##$ASSWID= 0
##$AUNMP= <proc_1d>
##$AZFE= 0.1
##$AZFW= 0.1
##$BCFW= 1
##$BC_mod= 2
##$BYTORDP= 1
##$COROFFS= 0
##$CY= -3
##$DATMOD= 1
##$DC= 2
##$DFILT= <>
##$DTYPP= 0
##$F1P= 0
##$F2P= 0
##$FCOR= 0.5
##$FTSIZE= 0
##$FT_mod= 4
##$GAMMA= 1
##$GB= 0.15
##$INTBC= 1
##$INTSCL= 1
##$ISEN= 128
##$LB= 0.25
##$LEV0= 0
##$LPBIN= 0
##$MAXI= 10000
##$MC2= 0
##$MEAN= 0
##$ME_mod= 0
##$MI= 1.114404
##$NCOEF= 0
##$NC_proc= 0
##$NLEV= 6
##$NOISF1= 3.799351
##$NOISF2= 2.8
##$NSP= 1
##$NTH_PI= 0
##$NZP= 0
##$OFFSET= 14.38212
##$PC= 1
##$PHC0= 266.0821
##$PHC1= -5.407804
##$PH_mod= 1
##$PKNL= yes
##$PPARMOD= 0
##$PSCAL= 0
##$PSIGN= 0
##$REVERSE= no
##$SF= 200.129724274929
##$SI= 16384
##$SIGF1= 3
##$SIGF2= 2
##$SINO= 400
##$SIOLD= 16384
##$SREGLST= <1H.CDCl3>
##$SSB= 0
##$STSI= 0
##$STSR= 0
##$SW_p= 3205.1282051282
##$SYMM= 0
##$S_DEV= 0
##$TDeff= 0
##$TDoff= 0
##$TI= <>
##$TILT= no
##$TM1= 0
##$TM2= 0
##$TOPLEV= 0
##$USERP1= <user>
##$USERP2= <user>
##$USERP3= <user>
##$USERP4= <user>
##$USERP5= <user>
##$WDW= 1
##$XDIM= 8192
##$YMAX_p= 0
##$YMIN_p= 0
$$ End of Bruker specific parameters
$$ ---------------------------------
##NTUPLES= NMR FID
##VAR_NAME=  TIME,          FID/REAL,        FID/IMAG
##SYMBOL=    X,             R,               I
##VAR_TYPE=  INDEPENDENT,   DEPENDENT,       DEPENDENT
##VAR_FORM=  AFFN,          ASDF,            ASDF
##VAR_DIM=   8192,          8192,            8192
##UNITS=     SECONDS,       ARBITRARY UNITS, ARBITRARY UNITS
##FACTOR=    0.0002768,     1,               1
##FIRST=     0,             0,               0
##LAST=      2.2672688,     0,               0
##MIN=       0,             -257415,         0
##MAX=       2.2672688,     223367,          0
$$ Real data points
##PAGE= N=1
##DATA TABLE= (X++(R..R)), XYDATA
$$ [...]
1880a10R4M8R7l9j35J48J07j46P6j48j57J47J64m48J88N47o14j75M56L4l02K16
1902D8J50o0j82J91l27J84L85P8m33M9K07n4k33J35m3l77P9k39kJ74K97j78J44
1925gq6j66K05J13L77k51j55J10J23m25J96J0J79m63M1L7Q3K09q9l93J85K07k6
1948A4k22O5L40m63N3K95J92k78J98n16M81j82j02J09J63l65J42l27L46J15n1
1969Gl05J05L00P1l32L1J99jJ05j4n7j4j20j48K05N7k75j13L78j90O3j85L15l4
1993D8J5m3l02N22P5j09k45L66j43m55J21L27j68l09q7M68Pj62l14K62J43M0l02
2016b45K80K22j91j87R4L57n9k34L3L0M04p67L64j64J14j66m08N96m4n7j89O5
2038a52M73j08k19O3K38o5l49J32N69m33L0k19K44k58n5j41L36m2j80p8L77K41
$$ plain form
1880 -110 -16 32 129 90 -45 103 210 64 140 -8 -165 -18 146 -302 -114 433 -181 -356 100 134 -168 48
1902 48 198 138 -44 147 -180 4 389 467 34 83 290 236 3 138 95 -282 -203 -442 -444 -270 27 -151 -7
1925 -7 -93 -259 -54 59 436 185 30 140 263 -162 34 44 223 -240 -199 -162 -79 130 41 -352 -167 40 14
1948 14 -208 -143 197 -266 -213 82 274 -4 194 -322 159 -23 -125 -16 147 -218 -76 -403 -57 58 7
1969 7 -298 -193 107 178 -154 -123 76 75 180 166 109 95 -25 -173 32 89 -186 -299 79 -111 -48 -233 82 48
1993 48 63 20 -282 240 315 206 -39 327 184 -271 -150 177 9 -300 -387 81 88 -74 -388 -126 17 57 -245
2016 -245 35 257 66 -121 -27 330 271 37 70 100 504 -263 101 -63 51 -115 -523 73 29 -28 -217 -152
2038 -152 321 213 -6 57 295 230 -119 13 582 149 179 -40 204 -54 -109 -250 86 44 -136 -214 163 404
2060D04k21l73p4M55P5r9l06K23K8j75O5J49mm00N1J44L59m00J47k56J35k44J76
2083a41L8J73K61k73R7j15j29K13k43N6L08n29K17O8J16k08j74K20J36O4l40J40
2105d5J72Pl69L08L40m14l52J70P8K24l17L08l75L41k41q6K39K29m01M5J90L11
2127C62k89O0j40K92j41k7k27J46J75k36J32l85M57j81j93j99M14k24o4M57j34
2148E5L7N6l62L30P1k9k69K15Ok1m1N2K3J1l19L82j87m02j8J74m2N16k04j96l9
2173b01J80Q7k47N09j57j99J4j1M32k40r4k9k22p0J55j9K24n4j35o7J08J59k40
2196a17K96j83J98k31J71o0N0j10n7K31n20M21q8M0J16k57mJ71p0K5j60K09OJ63
2220B40j84J71p1m4j23j03pQ4k5K01n96N49ol8R9Rk48j35J2K00J28k64l9Q4L75
$$ plain form
2060 404 183 -190 -264 191 266 167 -139 84 112 -63 2 151 147 -253 -202 -58 301 -99 48 -208 -73 -317 -141
2083 -141 -103 70 331 58 155 40 -89 124 -119 -63 245 -284 -67 1 117 -91 -265 -45 91 155 -185 -45
2105 -45 127 134 -235 73 413 -1 -353 -183 -105 119 -198 110 -265 76 -165 -251 -12 217 -184 -139 51 362
2127 362 73 133 -7 285 144 117 -110 36 211 -25 107 -278 179 -2 -195 -394 20 -204 -268 189 55
2148 55 92 148 -214 116 187 158 -111 104 110 89 48 100 123 134 -185 197 10 -392 -410 -236 -278 238 34 -162 -201
2173 -201 -21 66 -181 328 171 -28 -14 -25 407 167 73 44 -178 -248 -93 -112 112 58 -77 -144 -36 123 -117
2196 -117 179 -4 194 -37 134 74 124 14 -43 188 -332 89 1 41 157 -100 -104 67 -3 22 -138 71 77 240
2220 240 56 227 156 112 -11 -114 -121 -37 -62 139 -457 92 86 48 147 156 -92 -227 -215 -15 113 -151 -190 -106 269
2245B69l38m6J58l7N2J50k76j64L26k73n0J82M8n1j6k2l2K46j28J40k77M20l43
2268f2j08K76L62l08j95p5J98k39L52j74L05o93j1L11P2k98L14j09Qm5r2L91j00
2291H0R3j09j41J20K51k03o6M9oj39M7K63n00K44j53J08k8P4l9mK83l3l8l67M70
2316B56l79k11K33J72J50k33k46J58K07j84N6O3K56l4m58L80k13K54m02M31J65
2337D21l25r2J08J12k74J03n6Q3j60rk7l93N99P4m04J97J6K63l51K78J31j10l50
2360a66K69j25K61N6j66l51K46j21JK38K8j90q7Q5O5q4j54L79k1M9q5j22j59K80
2384A26l15L1L46j42j29J43j08k83L13j32L20j20j50J64n9j12L04j86J04J01p0
2405A46k14l00P64k35k10K02l60K73k07N9k0J95k7k6j47J36K7m54J27M04M3j26
$$ plain form
2245 269 -69 -115 43 6 58 208 -68 -232 94 -179 -229 -47 1 -50 -66 -88 -120 126 -2 138 -139 281 -62
2268 -62 -170 106 468 160 -35 -110 88 -151 201 27 332 -361 -372 -61 11 -287 27 -82 -74 -119 -211 180 80
2291 80 173 64 -77 43 294 91 25 74 68 -71 -24 239 -261 -17 -170 -62 -90 -16 -55 -59 224 191 153 -214 256
2316 256 -123 -334 -101 71 221 -12 -258 -100 107 -77 -21 42 298 264 -194 186 -27 227 -175 256 421
2337 421 96 4 112 224 -50 53 -3 80 -80 -89 -116 -509 90 164 -240 -43 -27 236 -115 163 294 184 -166
2360 -166 103 -22 239 295 129 -222 24 -97 -96 142 170 -20 -107 -22 43 -41 -195 184 163 212 127 5 -154 126
2384 126 -189 -158 188 46 -83 60 -48 -331 -18 -150 170 50 -100 64 5 -107 197 11 115 216 146
2405 146 -68 -368 396 161 -49 153 -207 66 -141 -82 -102 93 66 40 -107 29 56 -398 -271 133 176 50
2427E0k53L23M0k74J45qR9k38J90j39J18O7m53J93M64k11j62K89j92L9l24L55
2449A18K23o27K53l0l82M79o8k89J59K53m92PL58L22n81K40j00J64jR3J89n63
2471b75L21k21J98q2L08l06j07K3L13o50M02K67q6l85K47O1O6k93K5K63j58M38
2493C69k76j3m2P3l18O5K81n1l20L88j91l0k01J11J92q4J75J76m95J76L48m17
2515h4l5L16p9m29M17k99L07o6j6K7k18L39l76K36p%l31K94J55P3o6j62K39k33
2539BK59k05Qn6J44k0k64O2ok13K4N12m31RJ28J32R1n0J42o7r9p6K2o7J21l28
2565b26L8J04J32r2n4k07K90J58j85qK32p9j55J26j91J42nm9N7R0M2k56K40M3
2589A87k17k5o19O64j91J36j4J42j47J4J57l26O14n54K72q7K7J89l21j13M45r4
$$ plain form
2427 50 -203 120 160 -114 31 23 122 -116 74 -65 53 120 -333 -140 324 113 -49 240 48 87 -237 118
2449 118 341 -286 -33 -63 -445 34 -34 -323 -164 89 -403 -396 -38 284 -297 -57 -157 7 6 99 288 -275
2471 -275 46 -175 23 -59 249 -57 -164 -141 172 -478 -76 191 105 -280 -33 28 94 -199 -174 89 -69 369
2493 369 93 80 38 111 -207 -142 139 88 -232 156 -35 -65 -266 -155 37 -47 128 304 -191 -15 333 -84
2515 -84 -119 197 118 -311 106 -193 114 48 32 59 -159 180 -196 40 33 33 -298 -4 151 224 158 -4 235 2
2539 2 261 56 64 8 152 132 -132 -70 -76 -289 -265 247 -184 -175 -47 85 176 126 268 201 102 26 48 -19 102 -226
2565 -226 -188 -84 48 -44 -98 -305 -15 143 -42 -50 182 103 -52 74 -117 25 20 -29 28 118 160 -96 144 187
2589 187 -30 -55 -674 -10 -201 -65 -79 63 -84 -70 87 -239 375 -179 93 6 33 222 -99 -212 233 139
2611A39k92l3L23k59J10j63K67m2l90J15K53J58m4k62K60j91P7M3j87K97M5j53
2633G1j60j14K38Q6j98k48M04k04K4J12R6m46m1L61o4K09K19l85J18m1j80R3k0
2656g0J87k27Q2L9j14J02k86K47J20r0n0J20L3P0k22rK46o7K49m82j08J97J05
2679G2K6j11r9n3K4%K42Jk54K47M6M5l00N28m70L6N8M2j22J10K4j57K9l4J19k08
2705a59K33p9k49R0j42L87q4j43J1J75J55j46J30j22j86J21J29m8N0M9j45l72
2727c45M82m2k03K31k57J92J5l0K29j95r3mO8j8J09k0j49J69m37K70m1N4k28R5
2751a48J38l6k04L16N7J4J1j86Q4o0J50k77j0K08P4j01j04K42l01J41j78K93M5
2774A68m60K84j89K90j16J35K16l98L1N2R0L5K84k88N0j74j25R2k33K13L06l44
$$ plain form
2611 139 -153 -186 137 -122 -12 -175 92 50 -340 -225 28 186 142 -120 140 -51 26 69 -118 179 224 71
2633 71 -89 -203 35 121 -77 -325 79 -125 -101 11 107 -339 -380 -19 -83 126 345 -40 78 37 -143 -50 -70
2656 -70 117 -110 -28 11 -103 -1 -287 -40 80 -10 -60 60 93 163 -59 -68 178 111 360 -122 -230 -33 72
2679 72 98 -13 -112 -165 -141 -141 101 102 -152 95 141 186 -114 414 -56 -20 38 80 -42 68 92 -65 -36 -70 49 -159
2705 -159 74 -5 -254 -164 -306 81 -3 -146 -135 40 195 49 179 57 -129 -8 121 73 123 172 27 -345
2727 -345 137 95 -108 123 -134 58 73 43 272 77 -16 -20 48 30 139 119 -30 139 -298 -28 -69 -15 -243 -148
2751 -148 -10 -46 -250 66 123 137 148 -38 46 -14 136 -141 -151 57 131 30 -74 168 -133 8 -170 123 168
2774 168 -292 -8 -197 93 -23 112 328 -70 -39 13 103 138 422 134 184 10 -115 -23 -256 -43 263 -81
2796h1j07J15K38j67k45J67K31k56q5L16J08o22L57l8pj8J8k37J74J52k39J42
2818h4q8K33j69j61R1Q4l3J88J51k29R8Q9l85L37k12N2J23j74L9j34j6K46j74
2841a28K11k98L43J08j32m2J22P7k08r1NK9L24k66k84R3M31m20JJ43l1K14m19
2864b18K37n6K42j84J96m82J78J15m4l9L37j65o4p1L8L9k43J24Oj20RJ03L26k49
2888A5q9k4O2J92k08R5K1L92l61j38K89R4m08J26m9r4N3R2P8m5j75M9j0m2K85
2913B00k41L1K91r6j87k63M62l8r6J11j0k13o2J65p2k7j64J31N0K34k08m09K55
2936a56K99N7j97k2q4N4K11j76on3J77o3J05j65L97l68Mm6K32k57J05p5J06j87
2960a08K85k80J88j3q0P6o0J42k23K1K56j81k86L7N50k03k83L40n10M09J31j38
$$ plain form
2796 -81 -188 -73 165 -2 -247 -80 151 -105 -190 126 234 -388 -31 -69 -76 -94 -76 -313 -139 13 -226 -84
2818 -84 -172 61 -108 -269 -178 -94 -127 61 212 -17 81 170 -215 122 -90 -38 85 -89 -50 -184 -200 46 -128
2841 -128 83 -215 128 236 104 62 184 261 53 -38 -33 -4 320 54 -230 -137 294 -126 -125 18 -13 201 -218
2864 -218 19 -37 205 21 217 -265 -87 28 -16 -55 282 117 53 -18 20 59 -184 -60 -54 -174 -165 -62 264 15
2888 15 -74 -98 -36 156 -52 43 64 456 95 -43 246 340 -68 58 9 -85 -32 60 138 93 -82 -33 -43 -85 200
2913 200 -41 -10 281 185 -2 -265 197 159 63 174 164 -49 -111 54 -18 -45 -209 -78 -28 206 -2 -411 -156
2936 -156 143 200 3 -19 -103 -49 162 -14 -20 -73 104 41 146 -19 378 10 14 -32 200 -57 48 -27 79 -108
2960 -108 177 -103 85 72 -8 68 8 150 -73 -52 204 23 -263 -226 324 121 -162 178 -332 77 208 70
2982G0r0J19J14j27k44N7R0L02j8l37o6J68k16J29j2k4l6j63J94o5NO06k52J20
3006C24n42J31M42l60j76J69J19r6m5M8Q6j05p6L8L05j83o1j62R7K46l27R9L4
3029EJ43j06J04l9J73m74N42l59M9j91N12p85J21O20k51M4l98M92p4j68K53k44
3051c1K34M1k56J00k02J87l00K97j94Rr9k3K73j09k67M81k13qr2J0L40j60j8J4
3075A4l25M35k27J3M50m12O6Q1n9K51j80j77Q8j3j81L94k75k4L04k08J87P6j74
3098A04J04j23p5k0J8O6J31m25K41l05R6J54J21k18J55J5J34m70J96J14Q5l54
3120b56J55K79p6j22K13j23L4N5k85k78N84l4k79N5J54o4J22J43j73Q7l53J82
3142B0K47k91j74L55j93K18k95k9K7K07l02m2K62r9oQ9q7j93L05j49L92k33j4
$$ plain form
2982 70 -20 99 213 86 -158 -101 -11 291 273 -64 -130 38 -178 -49 -61 -85 -121 -284 -90 -155 -150 456 204 324
3006 324 -218 -87 355 -5 -181 -12 107 11 -34 14 100 -5 -81 -43 262 79 18 -144 -47 199 -128 -29 5
3029 5 148 42 146 107 280 -194 348 -11 38 -153 359 -426 -305 315 64 108 -290 202 128 -40 213 -31
3051 -31 203 244 -12 88 -114 73 -227 70 -124 -115 -214 -237 36 -73 -340 141 -72 -80 -172 -162 178 18 0 14
3075 14 -311 124 -103 -90 360 -52 14 95 36 287 107 -70 18 5 -176 218 -57 -81 223 15 202 278 104
3098 104 208 85 10 -10 8 74 205 -220 21 -284 -188 -34 87 -131 24 39 173 -297 -101 13 98 -256
3120 -256 -101 178 102 -20 193 70 104 159 -126 -404 180 146 -133 -78 76 12 134 277 104 191 -162 20
3142 20 267 -24 -198 157 -36 182 -113 -142 -115 92 -210 -252 10 -89 -95 -6 -93 -286 19 -130 262 29 15
3165A5K20j59o0l80L20O9j68K01j47L4k92L66k1j9m3N3O7p9O2j08J61P2l86L83
3189A61J02k0q3k3j95j06N29m63M50l76k13N6O0K09j43O5L7j03N5j34J79o1r2
3212a09L89k41Kl68K45nor0J76K18k05O7l6R7NJ63j61l72O3L64k29j3J03K9k53
3237a67k2J01L55l28N5l25J44J31J60k97J28j34J3J77J35J46l01J8k42O82k08
3258B21m92L00Ql2Lk5O6j13j99j4L05M3J86j84po9k5R3J02R4j17j17j57J89L1
3283I0q7j47k1K85j18J25K92l32J31m72L44j16P9k22k9L13j45M9m9P7N4jm13J57
3307a56K21j83j29J99J00o7k35p3N99l24O4R6P3j53J5j11j20K97n30L43j04M10
3329B32r3l79K98L5j42j6j3K15k42m9K18J37M0KM4q3j03j36P4k77K05J3l6K25
$$ plain form
3165 15 235 76 16 -364 -44 25 -143 58 -89 -55 -347 19 -2 -21 -64 -11 56 -23 39 -69 92 164 -222 161
3189 161 263 243 160 137 -58 -164 365 -98 352 -24 -237 -181 -121 88 -55 10 47 -56 -1 -135 44 -17 -109
3212 -109 280 39 41 -327 -82 -87 -93 -183 -7 211 6 73 37 134 139 302 141 -231 -168 196 -33 -46 57 86 -167
3237 -167 -189 -88 267 -61 -6 -331 -187 -56 104 -193 -65 -199 -186 -9 126 272 -29 -11 -253 429 221
3258 221 -271 29 37 5 8 -17 49 -64 -263 -277 28 71 257 73 66 -3 -28 65 167 261 144 27 -130 59 90
3283 90 3 -144 -165 120 2 127 419 87 218 -254 90 -26 53 -169 -198 115 -30 19 -30 47 101 100 -313 -156
3307 -156 65 -118 -247 -48 52 -15 -250 -323 276 -48 16 112 185 32 47 -64 -184 113 -417 -74 -178 232
3329 232 139 -240 58 93 -49 -65 -78 137 -105 -154 64 201 241 243 287 204 101 -35 39 -238 -33 -20 -56 169
3353A69l42J09j80J60P2j13O4j34M26j51j34k5L39j7j90J1q6O8m1L3j31L89m60
3376a64NJ54K68l84q8k6L29K2m02J32L02k83L47j06lJ32m90K54o6J91j14L9j06
3399e7j58P2L97k15n5J0J08J78m25K06q6k29K70J3j28L2k7J32r0J44k3l9r0k22
3423b82J19O8L05p6J39j24K9k17r4K66k17n1J72J05O7k9j77r7n0K31k54J08J2
3446d7j72J20Q2K13j19j99K48n3J84k95P7k3J23o5j01J13J0J28k40K70pk91M1
3469cj71L74j56m5j74L89m1m71M30P9p6r4j25J54Q2k88M12k63m4p6k41L32L22
3492C06l26n6k20J99J64k25L37j02J28m8k18L00k83j69L73k00K5R3m4k2J65k46
3514f9J56l0J52n4l0m34O37l23N2q0M1p6j4J28q3j4J3k34J45K06N4l73L66j80
$$ plain form
3353 169 -173 -64 -244 -84 -12 -125 -61 -195 231 80 -54 -79 260 243 53 64 -22 46 5 38 -93 296 -164
3376 -164 -159 -5 263 -121 -209 -235 94 116 -286 -154 148 -135 212 106 103 235 -255 -1 -67 124 10 49 -57
3399 -57 -215 -143 254 39 -16 -6 102 280 -145 61 -25 -254 16 29 -99 -67 -94 38 -52 92 69 30 -60 -282
3423 -282 -163 -95 210 134 273 149 178 -39 -133 133 -84 -135 37 142 209 180 3 -94 -144 87 -167 -59 -47
3446 -47 -219 -99 -17 196 77 -122 126 73 257 -38 39 16 139 74 -27 86 96 224 -16 254 247 -44 -3
3469 -3 -174 200 44 -1 -175 214 173 -298 132 211 135 41 -84 70 152 -136 276 13 -31 -107 -348 -16 306
3492 306 -20 -76 -296 -97 67 -158 179 77 205 157 -61 239 -44 -213 160 -40 -15 78 34 12 177 -69
3514 -69 87 57 209 155 125 -309 328 5 57 -23 18 -58 -72 56 -27 -41 -28 -262 -117 89 143 -230 136 -44
3538d4J7M7J51j6q9r9k6o0Q3R5j24m2j5j1L2PJ17K33m21k01L06L39n32K95%r3
3564e1O2j23K06l60M89k92jK14rj90m5K40o6j83J18p7j78J97M9r9L69M4m52J4
3588a24L60k42K42j66k6j74%J50O6k7j84J37j90K05O1j39j13J52j9k42L67j39
3610d5J01j08K18m4m54L55K04m9M7K7j84o5P0N9q0p8L2n8j58L39N0q4J80rq2j67
3636A7L86l56J26j39p7J65j26j31K24l85L88m8N7j03J73p5k32j31K31j18K04j3
3658C7j56J29j44J89j03J14J24m74J03K32l03J5K51O1j56K87j44j48O9N8m96N45
3680I0J94j75l40J53jp2J09J36p2j63J3K56R6l11J34k5j19P0j03l9J95L15Nk57
3704H9j51q6J80N4N4k35o1J07J09j93N6L83m60J80L98l56mQ5k26n2L4K22n6k26
$$ plain form
3538 -44 -27 20 171 155 66 -33 -59 -119 -36 59 -65 -107 -122 -133 -101 -94 23 256 -165 -366 -60 279 -253 42 42 -51
3564 -51 11 -112 94 -266 223 -69 -70 144 135 -55 -100 140 74 -109 9 -68 -246 -49 0 -99 270 314 -138 -124
3588 -124 236 -6 236 70 44 -130 -130 20 86 59 -125 12 -178 27 88 -51 -164 -12 -31 -273 94 -45
3610 -45 56 -52 166 122 -332 23 227 178 225 252 68 3 73 132 52 -26 6 -52 -210 129 179 95 275 266 184 17
3636 17 403 47 173 34 -43 122 -4 -135 89 -296 92 44 101 -2 171 96 -136 -267 -36 -154 50 37
3658 37 -119 10 -134 55 -48 66 190 -284 -181 51 -252 -237 14 75 -81 206 62 -86 -17 41 -455 90
3680 90 284 109 -231 -78 -79 -151 -42 94 22 -141 -128 128 224 -87 47 22 -97 -27 -130 -169 26 341 346 89
3704 89 -62 -148 32 86 140 -95 -156 -49 60 -133 -77 306 -154 26 424 68 64 149 -77 -129 -95 127 71 -155
3728a55N49l44j20K59m54L54j31l4Q4m31N22L0j37o6J63k7j89J31J36j43L04l25
3750b4m9L1J38j7J3j98j49K24J06J38N3m10J91J57R5j6m48K47o4K51l40J3P4n9
3774d3p1J9J29J98m89K30J35j57J23j68J65J39L7k82j43K67j13j53L61R1j29L0
3796A76j69pL77k89k23J51k26M40l34M7J91J27n55K09L38k4j81K40k15k8l7K90
3818B98k06k88J71j22L68k27j10nl1J23m9k4LJ72O0q2k16J01M36m14j9K72m49
3841b38L17J87K24l79j22j00k8L76j42q0l5k06L99m10K29j83L35j45m9J97j37
3862A0O6l10K48l4j9o4l8J80j44j82J73K84j04L1k96K62j71M5Q8j33J38J51k76
3885i5j2J53J52j11J01O5k00j34O9K88l86j02L93l85K06J12j08P5j06R0M8j68
$$ plain form
3728 -155 394 50 -70 189 -265 89 -42 -76 8 -423 99 129 -8 -74 89 62 -127 4 140 -3 301 -24
3750 -24 -73 -42 96 79 92 -106 -255 -31 75 213 266 -144 47 204 299 283 -165 82 18 269 -71 -58 16 -43
3774 -43 -114 -95 34 232 -257 -27 108 -49 74 -94 71 210 247 -35 -178 89 -24 -177 184 275 146 176
3796 176 7 0 377 88 -135 16 -210 230 -104 -57 134 261 -294 -85 253 229 48 288 73 45 8 298
3818 298 92 -196 -25 -147 221 -6 -116 -121 -152 -29 -78 -102 -99 73 133 51 -165 -64 372 -42 -61 211 -238
3841 -238 79 266 490 111 -11 -111 -139 237 95 15 -20 -226 173 -237 -8 -191 144 -1 -50 147 10
3862 10 76 -234 14 -20 -39 -103 -141 39 -105 -287 -114 170 66 97 -199 63 -108 -63 25 -108 30 181 -95
3885 -95 -107 46 198 87 188 253 53 -81 -12 276 -110 -212 181 -204 2 114 6 81 -25 65 113 -55
3907e5J63k51J02J35L11n04l6j7L38k93p9J73K26j88k07K13N2k00J43p2K03k60
3929a03pk9r5R1l2J82Q5O1p7j93K8K30M6l55J37K30k25j2J4J16K07k2n75J35J99
3954C6j03J11k09K97p7j43N6P0J60k48M6j28p8K36j92L13n1l13K13J21j68k18
3976b69L42r2j5J66l04J30k44K65O7L9o8J01K05m86K32k45%K23L3K63k82k71k8
3999b38L07k62J47k12M01j63L29k27l0K11k68L0o3r5j77J75K87k12K44l33L75
4020B26o7qk71J19N0L0J0O4k10N8J33P0l50J5m7L07m7J53j04m8j90L30k35k45
4044b57K05k19K16J75k12J40M1k72l9J67r0J02j71M27J6k16n3q2O5K74j78r1K6
4067b6jl51M72j28R0j61K10j53n0J21L4j04Q7j63J78n2J84j88l07K67J41k07J59
$$ plain form
3907 -55 108 -143 -41 94 405 -99 -135 -152 186 -107 -186 -13 213 25 -182 31 83 -117 26 -46 157 -103
3929 -103 -110 -139 -234 -143 -175 7 92 153 76 -117 -89 141 187 -168 -31 199 -26 -38 -24 92 299 277 -298 -163 36
3954 36 -67 44 -165 132 55 -88 -32 38 198 -50 -4 -132 -210 26 -166 147 96 -217 -4 117 -51 -269
3976 -269 73 -19 -34 132 -172 -42 -286 -21 46 85 17 118 323 -163 69 -176 -176 47 80 343 61 -210 -238
3999 -238 69 -193 -46 -258 143 -20 309 82 52 263 -5 25 -38 -133 -310 -135 152 -60 184 -149 226
4020 226 159 151 -120 -1 49 79 89 153 -57 1 134 204 -146 -131 -178 129 82 235 131 83 -107 223 -12 -257
4044 -257 -52 -271 -55 120 -92 48 89 -183 -222 -55 -145 -43 -214 213 229 13 -40 -122 -57 217 39 -52 -26
4067 -26 -27 -378 94 -34 56 -105 105 -48 -98 23 57 -47 40 -123 55 3 187 -1 -308 -41 100 -107 52
4090E2N6k1m0N2q9Kj45K57p2l3j03K44n32J59J79j93J14P5J32j34J61l09l6J67
4114e7L35l86O6M0P8k50p7L36r1j63J77J30M2j55q6K72r4k44N0lL8J23k95M61
4138B47m84J82r3J51k11K39K70j22k88p6K83j96P3M5lK43j70l5j74J98l37O3L28
4161A33k93J94j03j04r3K03M1J54k6J46k66K65j03k59K36K17n59L98j9k77kK27
4183A10j56k15M00j53k48J76%K46J72k33Q9j91J23K7j73k82J43L09j08j4J08j64
4205c4j17k0N8Q1K97k71k82J54J44J2j09Q8R6O9l83J25j04K35l3j72K40k9j29
4228h4J59j58J56j83Q0RM58l63k04p5J47J99j43J43l15J66J80l70J27l3J8MO4
4251a8K05j01M3K03l61r9Q7j25K44Qj21J45p7J14O2j04o1J57l67k7K25j23k12
$$ plain form
4090 52 108 87 47 99 10 12 -133 124 52 19 -84 160 -372 -213 -34 -227 -113 -38 94 -40 121 -188 -224 -57
4114 -57 278 -108 -42 -2 76 -174 -251 85 -6 -169 8 138 180 25 -61 211 117 -127 -77 -80 -42 81 -214 247
4138 247 -237 -55 -148 3 -208 31 301 179 -109 -185 98 -98 -25 20 17 260 90 55 -119 79 -258 -195 133
4161 133 -160 34 -69 -173 -266 -63 -22 132 106 252 -14 251 148 -111 125 342 -217 181 162 -115 -117 110
4183 110 -46 -261 139 -14 -262 -86 -86 160 332 99 188 -3 120 147 -26 -308 -165 144 36 22 130 -34
4205 -34 -151 -171 -113 -32 265 -6 -288 -134 10 22 -87 1 97 166 -217 -92 -196 39 6 -166 74 45 -84
4228 -84 75 -83 73 -110 -30 -21 437 74 -130 -205 -58 141 -2 141 -174 -8 172 -198 -71 -104 -86 -82 -18
4251 -18 187 86 129 332 -29 -128 -41 -166 78 86 -35 110 33 147 209 105 44 201 -166 -193 32 -91 -303
4274c03K21K06r1p4J98l89K56OO0L6p2k9m5Lj13K36m6m04L15J59J66l70J80l05
4298a99K08j11j56K61R7j82N2J92K18k94k42N6l3J64rk5J75j88J40n7j24K03k80
4321a34p3K37RQ1k32l5J06J93m4j31J1j15KJ31j12K78m22K01J98p6k44l0q4M41
4345A56j85j23K24j07L9K52k09m2l8J20J2k11K56j62n0J0J29j5k03L55j87J03
4367A24j47J40j5p5l20L19J38p0j1j9P4j05k30l1K10r4j74K5K58mj7k8r9K02P5
4392A26k06j25j15L33M7k28K20j10j18K29K89l49K1n9N8n0j02K11j76o9M30l32
4414g5J27j03r5K29Q5m0j81J49j60Q5R1l37K03o4P3m06L91Pk66L15j44K62j7K7
4438A56j31M8j30L0L7j34L32M8l04k5J69j69J50j21J46n3k63N1O6j56L30j88n
$$ plain form
4274 -303 -82 124 33 -41 157 -232 24 30 90 126 54 25 -20 -17 -130 106 60 -344 -29 130 296 -74 106 -199
4298 -199 9 -102 -258 3 100 -82 -30 162 380 86 -156 -100 -133 31 22 -3 172 -16 124 67 -57 146 -134
4321 -134 -207 30 39 120 -112 -147 -41 152 108 -23 -12 -127 -125 6 -106 172 -250 -49 149 73 -171 -201 -285 156
4345 156 -29 -152 72 -35 4 256 47 5 -33 87 99 -112 144 -18 -68 -58 71 56 -147 208 21 124
4367 124 -23 117 102 27 -293 26 164 94 83 64 138 33 -197 -228 -18 -112 -286 -261 -3 -7 -24 -52 -151 51 126
4392 126 -80 -205 -320 13 60 -168 52 -58 -176 53 342 -7 14 -45 13 -37 -139 72 -104 -173 257 -75
4414 -75 52 -51 -146 83 168 128 -53 96 -64 21 112 -225 -22 -86 -13 -419 -28 -21 -287 28 -116 146 129 156
4438 156 25 73 -57 -27 10 -124 208 256 -48 -73 96 -73 77 -44 102 49 -214 -163 -97 -253 77 -111 -116
4461a16J36M7n62L16J58P0L5J91l01J43n2O6l95J87M8jpL8k32K34nJ3J44j4k67
4486a26j24M78J4m70L19m9k5J22m8J6j37m6j4k47M28M8k76N1K30m46L23L4l8L8
4510E5K5l0J5R1k13J21j01K6m1k51K69L98m64N9J09l42K76M5J09q7k32K25J99
4533B61j80k52n5L90j93R9m2p9L5L95j33n16K33M2Q2k16J34K19k10J6j20J95k25
4556a20N2K51l37J15p0J02k10K68k06l5Q8L08j93k64K44K6k11K80JJ08l2l21J4
4579a42K54k24J70k91J72Q9J58j13K87o32M42j58q5P2k34L59q8l8R6j14k13M81
4601B48q2J9l32K03j86K57j59j78J88N4j92P1J29k64K78J1N6Lj07Q0K3j6j1M0
4625A33p9J6J10j65k37N07k77j44o5K21p8Q9J85l30L62j90j50Q2J20J9l49N4M8
$$ plain form
4461 -116 20 67 -495 -179 -21 49 84 275 -26 117 65 131 -264 -77 -29 -30 -37 1 -231 3 -2 11 155 141 -126
4486 -126 -250 228 242 -228 91 42 17 139 91 107 -30 -76 -90 -337 91 139 -137 -86 144 -302 21 55 17 55
4510 55 80 50 65 156 -57 64 -37 -11 -52 -303 -34 364 -100 -41 68 -274 2 47 156 69 -163 62 261
4533 261 81 -171 -226 164 -29 70 28 -51 -16 379 246 -270 -37 5 87 -129 5 224 14 30 -90 105 -120
4556 -120 -68 183 -154 -39 -109 -7 -217 51 -155 -190 -102 206 13 -251 -7 19 -192 88 89 197 165 -156 -142
4579 -142 112 -112 58 -233 -61 28 186 73 360 -272 170 12 -73 -1 -235 124 36 -2 94 -20 -233 248
4601 248 166 185 -147 56 -130 127 -32 -210 -22 32 -160 -89 40 -224 54 65 121 124 17 97 120 104 93 133
4625 133 54 70 180 15 -222 285 8 -136 -201 20 -58 31 216 -114 248 58 -92 -10 110 129 -220 -166 -118
4648a18M5m9P0nJ91j73J81k42L05k03p9J15o3p7K98k00R8j63j96M03j94Q4j7q0
4672f9Jo1K71k76J49l2J04k07J49K6R6q8j67L70k22pj10J78m7k3J54j66l45J76
4696a46J92j23K15k90pJ79Q9k03P4J86N7l28K56r5O7N0p1k70N9J39n6j65O5P2
4720e4L20l75qJ70j29Q0N1O8j94J90J97l89J16kj24O5o5L8K1O6Rk6q6M87m98P0
4746bj96L36q9K46k99k05L04L0j2r8K37m03R5q5K00j06J5j14K19M9k27K81q4l23
4770b31K89j46Q4j80J57J83m58J90O8m2O5P2J09k64n7L06k03l5p8L0j2J32J45
4793A24j20k63M87m04J65K60k88J33j12j42K33J16j46J17k35K41Q5o2j56J62j60
4814C5j31J1J71J15M1k87K42R6j90K31j97M8k95J41l4k01J33L04N9n27J21J76
$$ plain form
4648 -118 -73 -122 -52 -57 134 -39 142 -100 205 2 -77 38 -25 -102 196 -4 94 -69 -265 138 -56 28 11 -69
4672 -69 -68 -129 142 -134 15 -17 87 -120 29 55 151 63 -104 266 44 37 -73 105 58 35 189 23 -322 -146
4696 -146 46 -77 138 -152 -159 20 109 -94 -20 166 223 -105 151 56 123 173 102 -168 -109 30 -26 -191 -126 -54
4720 -54 266 -109 -117 53 -76 4 55 123 -71 119 316 -73 43 41 -83 -18 -83 -45 -24 42 51 25 -61 426 -72 -2
4746 -2 -198 138 49 295 -4 -209 95 125 113 15 252 -151 -56 -141 59 -47 -32 -146 73 122 -105 176 92 -231
4770 -231 58 -88 -4 -184 -27 156 -302 -112 -44 -86 -21 51 160 -104 -161 145 -58 -93 -171 -141 -153 -21 124
4793 124 4 -259 228 -176 -11 249 -39 94 -18 -160 73 189 43 160 -75 166 251 189 33 195 35
4814 35 -96 -85 86 201 242 -45 197 293 103 334 137 185 -110 31 -3 -204 -71 233 292 -235 -114 62
4836F2k4J94j14l04j13L91K7K9L0k99M2K79j94J02m01L36J37k77l40L57K19r1
4858D8J22j75R1l09L61j23j4k69K76%o3j06k0K01K2Q5k49KJ5J5n7j2OL13m7P5
4884A88j97J87k97K06j2k7J05l87N31k04lk38J23o2pj01J51J30j44J63k49M12
4906B68m67K27r3k35Q5J35j02j2K1J49o2j01J00R2J51j04m37K56K7n7pK22m8n8
4930e0J86j44Q4J89l77K93L5l49j15J06J09L4l8J06Ql21K74k52K19N4j30j7J2
4953h4l9r3K56r8Oo0J50k5j10m3R7k01K76N5j18k03J34J7Q0j54q0L24L9n2Q9k78
4979a15R5Q6k04K58K8o6j83K8J06R0j50K59l33K4J83l64J62l6o8J24J32k02K28
5002H2o5J46j72j81L35k88J14J02m73M64o0r2j74M97q7K38l81K57k42jl04M10
$$ plain form
4836 62 38 232 118 -186 -299 92 119 148 178 -121 -79 200 6 108 -293 43 180 -97 -437 -80 139 48
4858 48 170 -5 86 -223 138 15 1 -268 8 8 -55 -161 -181 20 42 127 -122 -120 -105 -90 -147 -159 -153 160 113 188
4884 188 -9 178 -119 87 75 48 153 -234 297 93 90 -148 -25 -87 -94 -195 -44 86 -58 105 -144 268
4906 268 -199 28 -65 -300 -215 -80 -182 -194 -173 -24 -86 -187 -87 5 156 52 -385 -129 -102 -159 -166 56 8 -50
4930 -50 136 -8 76 265 -112 181 216 -133 -248 -142 -33 1 -37 69 77 -244 30 -222 -3 51 -79 -96 -84
4953 -84 -123 -216 40 -58 -52 -112 38 13 -97 -140 -43 -244 32 87 -31 -234 -100 -83 -3 -157 -237 87 126 74 163 -115
4979 -115 -20 66 -138 120 148 82 -101 -73 33 123 -27 232 -101 -77 106 -258 -96 -132 -200 -76 56 -146 82
5002 82 17 163 -9 -190 145 -143 -29 73 -400 64 4 -88 -262 235 148 386 5 262 20 19 -285 125
5024A25Mj90K20j09j0O2n4k57L56k29Q5J53j56k82L49k38R7l2P04n33j69P8J85
5047A59k57J18l7J44k17O9k22K88j74q2J45P5m0J35j07l5M5J08j37j03j9J42K1
5070A9r7Q6k19O9J54j73L4m0M09p9m7k85J77K57k01J16j24j20L30l46K74l30R8
5093c8O2k04M46L2l53M8j85j8J53M9K48p3q9J39m53K86j95P1Pj98o5J58K21qK74
5118C15m04p1J99M8j91K14l16L80k07Kp5K28J44l52L08l25J89j39J47%m8j16n5
5141a25L85l46J73j93K93l9J41k78q1n3N0J50l1k93J20J01L3J5j26J19j0N0q2
5164b7o2o9J72L27l62q7o8J32k2J41R5N7k58M1L5j04lJ6j8J42K4K6j59K7J28j95
5190g1O2pljN4k86L37j13j49K06n4k82L79j53M5J36k21j07J84K5L2j32k5J95J6
$$ plain form
5024 125 129 -61 159 50 40 102 48 -209 147 -82 3 156 0 -282 67 -171 -74 -106 598 65 -104 -26 159
5047 159 -98 20 -17 127 -90 -21 -243 45 -129 -211 -66 9 -31 104 -3 -38 7 115 -22 -125 -144 -2 19
5070 19 -78 8 -211 -142 12 -161 -127 -167 242 163 116 -169 8 265 64 180 56 -64 266 -80 194 -136 -38
5093 -38 24 -180 266 298 -55 -7 -192 -210 -57 -8 240 167 78 217 -236 50 -145 -74 -67 -265 -330 -172 49 41 315
5118 315 -89 -160 39 87 -104 110 -206 174 -33 -31 -106 122 266 -86 222 -103 86 -53 94 94 46 -70 -125
5141 -125 260 -86 87 -106 187 148 289 11 -70 -123 -73 77 46 -247 -127 -26 7 22 -104 15 5 55 -27
5164 -27 -89 -158 14 341 -21 -108 -176 -44 -66 75 170 227 -31 10 45 -59 -62 -46 -64 78 102 128 -31 -4 124 -71
5190 -71 -9 -16 -19 -20 34 -252 85 -28 -177 29 -25 -307 72 -81 -36 100 -121 -228 -44 -19 13 -119 -144 51 67
5215F7k07K48l8k31K36l97M98q6R3k61N8M59k07l31J73K6j76n7K79j13P7j36J65
5238A39j34L9K58j50l22K63k04L43k19J92r8J47k40k14L5J93qJ38j30k14O3M49
5260C26j71k10k64J88j0J60j49K19J10j42j3o9j79j04N25j85K76k04l49L00j78
5281a23J29J27j0k8j83j6J80M7k52L27k39J15k0J15o7k4Q6j6l17q6J72p3L62k48
5305d2Q4N3j01J0q6j53P1K34K0j21j31K4K39m5K8J10j34J66l23J26K02m46K57
5328D2Q4J39m44L82J7j16j15Rm7j0p6J94j53j11L5N9K78p5j84M10j31j06r9K53
5352B35k00j03m9J75Q2k41L4K46k46J6J40N7k28J61k92J62P8L5j06l1k2J80j64
5375h1P1J63l76L85l62L50n02J59k6j70K85J0J47o9j8K77r2k78K08Nj42PJ55Q0
$$ plain form
5215 67 -140 108 70 -161 75 -322 176 90 183 -78 -20 439 232 -99 74 100 -76 -133 146 33 110 -26 139
5238 139 5 44 302 152 -170 93 -111 232 13 205 107 254 14 -200 -165 28 20 158 28 -186 -123 326
5260 326 155 -55 -319 -131 -141 19 -130 89 199 57 44 -25 -204 -308 217 32 308 104 -245 55 -123
5281 -123 6 133 123 95 -88 -104 76 123 -129 198 -41 74 54 169 102 78 164 148 -169 -255 -83 -156 206 -42
5305 -42 42 95 -6 4 -82 -235 -164 70 90 -31 -162 -138 101 56 84 194 60 226 -97 29 231 -215 42
5328 42 126 265 -179 203 220 104 -11 -2 -49 -59 -135 59 -94 -205 -170 -111 167 92 -92 318 187 81 -18 235
5352 235 35 -68 -117 58 140 -101 -67 179 -67 -51 89 146 -82 79 -213 -51 27 62 -44 -75 -97 83 -81
5375 -81 -10 153 -223 162 -200 150 -352 -193 -219 -389 -104 -94 53 -16 -34 243 151 -127 81 86 -56 -49 106 186
5399A86k04J0O6J75k98O4o2LJ35O0j58J39k58J53K4P9j71m0J95k05J72j45N9j8
5423c9o3k19L48K03l19J25K43j55k59q9K11j29j73K36o6j23L03p2r2K70j90J34
5445H5k70n7K11K52k51k24J44J39P8m01M49k5l4q4Q4J39j86N3m8k29K18k07K01
5468C7j74O8Q0O1l12J05J68L6j46j41J83L35k50l04R1L99j58j98J61j31j65K56
5490Aj5L53j48J6k96Q2R2j00Kl9l7O5N4p6j8J60k72K52q5K02k92j74K47Q3j70
5515a13o4L05n0k19K17K89n31K6K12Jk04J10R0J35j35J13j51p3O0P5j03j93J53
5538e0J83k38J59j89j15K45K18l28Q3J43k49J85k07KR4QJ07j29P6K02j71J37N6
5561B22l72J31K61j22l62K59rj38J00j17n9Q7M12k48L8l39K91j96j9K44m5k86
$$ plain form
5399 186 -18 -8 58 233 -65 -1 -63 -60 75 135 -23 116 -142 11 35 114 -57 -97 98 -107 65 -80 -21 -39
5423 -39 -102 -321 27 230 -89 36 279 124 -135 -224 -13 -142 -315 -79 -145 -268 35 -37 -129 141 -49 85
5445 85 -185 -242 -31 221 -30 -254 -110 29 107 -294 155 130 96 12 96 235 49 102 54 -175 43 -164 37
5468 37 -137 -69 11 72 -240 -135 33 69 -77 -218 -35 300 50 -254 -163 236 78 -120 41 -90 -255 1
5490 1 -14 339 191 207 -89 -7 85 -15 -13 -52 -89 -24 30 -46 -64 96 -176 76 -9 193 -99 -273 -26 57 -113
5515 -113 -177 128 78 -141 76 365 -166 -140 72 73 -131 -21 69 204 69 182 31 -42 18 93 -10 -203 -50
5538 -50 133 -105 54 -135 -250 -5 213 -115 -32 111 -138 47 -160 -158 -64 -56 51 -78 -2 200 29 166 222
5561 222 -150 -19 242 120 -242 17 8 -130 -30 -147 -206 -119 293 45 83 -256 35 -161 -180 64 19 -267
5583b67Q3K89r0p0j5K87k77j71K72n3J0M7N7r7j1J13m9n0q5lJ34o0J64k98K17
5608G7j56J93j52j73M08j80QO3J13k07Q3j62J39n2l2J08k22J64P9l31J95K41n29
5631c25K13N5j23L47j46P2k8j42J06L7J52l00K5R8m03P25k82jL5p5J93m80L97
5654A50k6K7k97J53o2L96m19J09M7r4j14L3L47l56j08m2L71l23L65k94L34L8l17
5677h2o9K37k38O0K09K2K33k00l43M7K05j73J92k26J19R3n5K1J64n6j25k01K39
5700G3J54km4k06m1K57m34Q0K66K1j11n5%J09n9p9r4J35K10p0j2o4j79L02k43
5725h6o0M11k07p6K06j27%J77o26L57J18P6Q3k64M4l2K20n6k89K40j62K8K80j73
5749H2j43J71k73J40j99K07M3j10J56J0k8jJ0J55j59N3J33m70L29k05l2J8P6k6
$$ plain form
5583 -267 -184 105 15 -55 -70 217 -60 -231 41 -12 -2 45 102 5 -6 107 58 8 -77 -80 54 -6 158 -140 77
5608 77 -79 114 -38 -211 197 17 25 88 201 -6 77 -85 54 2 -30 78 -144 20 99 -232 -37 204 -325
5631 -325 -112 -57 -180 167 21 93 65 -77 29 66 218 -82 -57 41 -362 363 81 80 115 40 233 -247 150
5654 150 124 151 -146 7 -55 341 -78 31 78 -16 -130 -97 250 -106 -214 -256 115 -208 157 -137 197 235 -82
5677 -82 -151 86 -152 -92 117 139 372 172 -171 -124 81 -92 100 -126 -7 86 31 52 216 160 35 -166 73
5700 73 227 225 181 -25 -66 191 -243 -163 103 124 13 -42 -42 67 8 -71 -165 -30 180 110 98 34 -145 157 -86
5725 -86 -146 265 58 -18 188 61 61 238 -388 -31 87 163 246 -18 26 -6 214 158 -131 109 -53 -25 255 82
5749 82 -61 110 -163 -23 -222 -15 28 -82 74 84 56 55 65 220 61 114 247 -223 106 -99 -131 -113 -37 -63
5773f3J94K9N1k54J21lr7mM2q6K62j98j16K69QQ4k35j5J13l49J43N0O1j01l5K03
5799G4j01q3K89m25K39J67k75K18rj77RL53l17L1o1n1O2m9K15j57j2l5P4m3q6
5824a50N8K89j55p3M4j21L2O9L2m4K32l20K95j63j52K84k41M9P3j4j05J37j90
5847a34R0j39j9K45j87J16L3M7K58m13n5J27J66k3K6k62K80j26k7M6k45K50J9
5870G3l9m1K2K32l11j68L47q4J58Mj22r1J09k59J33K14l44J76p6n2p1M84j93k46
5894a45k1J25j31K6O2K12R5j50k82K10K25j96J89j80j45P7j82K06K7Pk17p8J10
5917a56R9l7L82j69l31J15J60m4R6k43J25m4l1q2J6K00j0Q6l95M45R9m38l2J56
5941c3P7pJ32j53K3k16qJ97k78M34j31k38J07K63n97rL61J18Q6k68K71r0N3q3
$$ plain form
5773 -63 131 160 211 -43 78 75 -22 -26 16 -70 192 -6 -122 147 155 239 4 -11 102 -247 -104 -54 7 -94 -129 74
5799 74 -27 -110 179 -246 -7 160 -115 103 94 -83 -74 279 -38 -7 -68 -119 -57 -106 109 -48 -60 -95 -21 -64 -150
5824 -150 -92 197 42 -31 13 -108 -76 -7 25 -19 213 -107 188 25 -127 157 -84 -35 38 24 -81 56 -134
5847 -134 -44 -183 -202 43 -144 -28 5 52 310 -103 -158 -31 135 112 138 -124 156 30 3 49 -196 54 73
5870 73 34 -7 15 247 -64 -232 115 31 189 193 71 -20 89 -170 -37 177 -167 9 -67 -119 -190 294 101 -145
5894 -145 -166 -41 -172 -146 -84 128 223 73 -209 1 226 30 219 39 -106 -29 -211 -5 22 29 -188 -266 -156
5917 -156 -57 -94 288 119 -212 -97 63 19 115 -128 -3 -47 -78 -160 -144 56 46 132 -263 182 281 -157 -189 -33
5941 -33 44 37 169 16 39 -177 -185 12 -266 168 37 -201 -94 169 -428 -437 -76 42 128 -140 131 41 94 11
5965A1K28k88P6p1J96p1j88j5L05L4k22o9N9k5J07K7k02m6Q7K11k03M7Q1M4k10
5990i7J16j5j78o0K59KL7J8j86j39L61Jk08lJ50k39J96k8q4L3J51k06l9N08l42
6015Hk4pR5j69M53L3l69r8O9L27j08j87O0j69L3P6k01J20J12M4j17J80L0M3j34
6040A00l25l1R7K2M8j43K67L89m12k89L56j27L06l11K77k61O3k35K01J45o9p9
6062a1r0NJ6J30l57K26j27K18j9j14L18l51M4j04K20J48j31Q5l16J19j17L27q3
6085C6j5QP5l81L71k38J40K1k8K1q5J24j14L6N9j26l9K06n9J5m2j06J49J78p2
6110A34j0k34K02L7k50J52j05j69J41j22M86l39K4P0k30N03l44J62o2r1J47j4
6132H8o5J88k53k83L62j14K9J12q4N1K41J8j91J80l28K99k80QR0oJ93q9k71L1
$$ plain form
5965 11 239 -49 27 -44 152 81 -107 -122 183 217 -5 -74 -15 -40 67 94 -108 -154 -67 144 -59 -12 69 113 -97
5990 -97 19 4 -174 -234 25 27 64 82 -104 -243 118 119 -89 -92 58 -181 15 -13 -97 -64 87 -119 -158 350 8
6015 8 -16 -23 72 -97 356 389 20 -78 -9 318 210 23 83 -86 -53 23 -178 -58 54 98 -19 161 191 234 100
6040 100 -225 -256 -159 -137 -89 -232 35 424 12 -277 79 -48 258 -53 224 -37 26 -209 -8 137 68 -11
6062 -11 -101 -96 -80 50 -307 -81 -208 10 -9 -123 195 -156 -112 -216 4 152 21 106 -210 -91 -208 119 36
6085 36 21 29 104 -277 94 -144 -4 17 -11 10 -75 49 -65 -29 30 -96 -135 71 12 27 -15 -121 28 206 134
6110 134 124 -110 92 129 -121 31 -74 -243 -102 -224 262 -77 -53 17 -213 290 -54 108 46 -45 102 88
6132 88 23 211 -42 -325 37 -77 -48 64 -20 31 272 290 99 279 -49 250 -30 -22 68 62 255 166 -105 -74
6156g4R8j62K60k19L32k65O9j45L47k68mL0m6j99L54Qk19J92k64M05l44K33j27
6179hR3N6m4j52L82o06N1P8J91l6Kq3m2J42j0j25k3L11l22M31m30K88r4j84J2
6204a22J57J76K2M1o9l23J88J44k29K52j36j0m3o9j5J48j17m06M71j93J71j08
6226g0J69M5n0J56l25J09J81l24K73J60l91k23L02L6P7l51M11k02R3O3j29J48
6248A58m21J08Q4J87J52l02O6k62R9J81o3j69L68j76j07J24r8J19k5m9o1J86J46
6271B45l55J05K2K53l9l37K43o5M4k68J0r3J65j9J95K9q2j00J24M1m11L37L9k7
6295E6j50R5M2J59J70l77n8J2N1j24J34LR0l78J42K17j53J94l76K78k17k17N31
6318A24j29Q3R3r1j10j1J2rL0O4K61l39P9J7O0j76J17R6j81j00J7n7J56K45m36
$$ plain form
6156 -74 24 -138 122 -97 235 -30 39 -106 241 -27 -31 -1 -47 -246 108 116 -103 89 -175 230 -114 119 -8
6179 -8 85 141 97 -55 327 -279 -228 -150 41 5 7 -76 -118 24 14 -111 -134 177 -145 286 -144 144 50 -134 -122
6204 -122 35 211 233 274 205 -118 70 214 -15 237 101 91 48 -21 -36 112 -5 -411 60 -133 38 -70
6226 -70 99 144 94 250 -75 34 215 -109 164 324 -67 -290 12 48 125 -226 185 -17 76 139 10 158
6248 158 -263 -155 -71 116 268 -34 32 -230 -131 50 -13 -182 186 10 -97 27 -71 48 23 -26 -87 99 245
6271 245 -110 -5 17 270 231 -106 137 72 116 -152 -142 -235 -70 -89 106 135 53 -47 77 118 -293 44 83 56
6295 56 -94 1 43 202 372 -5 -63 -51 0 -124 10 13 103 -275 -133 84 -69 125 -251 27 -190 -407 124
6318 124 -5 78 171 80 -30 -41 -29 -38 -8 56 317 -22 57 74 134 -42 75 171 -10 -110 -93 -150 6 251 -185
6343a85K06J31j45K53k22J88n09L8J19l4k03O66m59l3p0J14K76l5k1l6j1k43O25
6366D10l89o5J06J11q2j95k2J94n1K7o8J03JP1J49o8j01n1r7K8J19j35J30j53
6390b8j95K91k7M8J00k41J09P9l72L12J14k47J23k17M35p5l50J64q2K48k53J79
6412A15p5j12j81K9J08M52k40j33K13k67R0J52q0j8Oo4J97k83J35j40K48k78R
6435a17J9R4q1Q0j4J12lP0n3l39N9lL12J68m76J71J48j74l4N3J86k23j7j0M5o2
6461h9J65r1n1Lk8O5J10j76O8j50J97O8R9j85k47J12K37p2j55J8K32j43J02r5
6485fo6J29P6j65j58K51j60K23j21J76k04L93k18k40J55Q0O8k87PJ01k10j96K26
6508a46j83N71k53J7k2J16Ok85L61j98K51m41N37m54L40j64k7K01k78L00m26J95
$$ plain form
6343 -185 21 152 7 260 38 226 -283 -245 -126 -160 -363 303 -156 -189 -259 -145 131 96 75 39 28 -215 410
6366 410 21 -44 62 173 91 -104 -126 68 17 44 -24 79 80 151 300 232 131 80 -17 11 130 -5 125 -28
6390 -28 -223 68 41 89 189 -52 57 136 -236 76 190 -57 66 -151 284 209 -141 23 -59 189 -64 115
6412 115 40 -72 -253 -224 -116 336 96 -37 176 -91 -1 151 71 53 59 -5 192 -91 44 -96 152 -126 -117
6435 -117 -98 -4 -85 -5 -19 93 90 160 107 -232 -173 -176 136 304 -172 -1 147 -27 -61 -8 178 -45 -62 -72 -27 -89
6461 -89 76 -15 -66 -63 -91 -26 84 -92 -24 -174 23 91 190 5 -242 -130 107 35 -120 -102 130 -13 89 -6
6485 -6 -72 57 133 -32 -190 61 -99 124 3 179 -25 368 150 -90 65 145 213 -74 -67 34 -176 -372 -146
6508 -146 -329 242 -11 6 -16 100 106 -179 182 -16 235 -206 331 -123 217 53 26 227 -51 249 -177 18
6530A8J29K9j55m3l06J48K42j44K79l09mJ93j90L1J82J10l80L06j67J32l03N35
6552C33m85J21j02O3J52l5k36J76o3r4J42J6K47j64J83k23j51RM1nM8qR8J05k15
6577d7OJ30k75j44J40n6M11k85n5Q3K87k55lK83k31rk8J15q9M7m9J06l08J47L93
6602C14k21l07M65j18k74J91l05L96j25L27k95j5j8j81K89r9O3j01j5L2k28K50
6624B5l5j38J70j23J90j70p0n9J55L7m1l70L35K37j30L88k60k12Q1k5j56K19k17
6647a69L49k17O7K2l14L03J14j77j83j11K96j03P1M1K50k15k27L12j78J32J73
6668B36j96j01o7j5L19j69k96K13p8L2L05k49K84k25j9O1L9l8J15k11o4j1K31
6691I6n6k30K08j62m9k5L39j13nMk26j86O29O7k18O8m3j9L6J11j4j37k71n8m4
$$ plain form
6530 18 147 176 21 -22 -328 -180 62 -82 197 -112 -116 77 -113 -82 100 210 -170 136 -31 101 -202 333
6552 333 -152 -31 -133 -70 82 47 -189 -13 -76 -170 -28 -12 235 71 254 31 -120 -111 -70 -75 -27 -35 63 168 -47
6577 -47 -41 89 -186 -330 -190 -246 165 -120 -175 -92 195 -60 -63 220 -11 -20 -48 67 -22 25 -24 82 -226 -79 314
6602 314 93 -214 251 133 -141 50 -255 141 16 343 48 33 15 -166 123 24 87 -14 -29 3 -225 25
6624 25 -10 -148 22 -101 89 -81 -151 -210 -55 -18 -59 -429 -94 143 13 401 141 -71 10 -15 -171 48 -169
6647 -169 180 -37 30 52 -262 41 155 -22 -205 -316 -20 -123 -52 -11 239 24 -203 109 -69 63 236
6668 236 40 -61 -128 -143 176 7 -289 -76 -154 -122 183 -66 218 -7 -26 35 74 36 151 -60 -124 -135 96
6691 96 40 -190 18 -144 -193 -218 121 8 3 7 -219 -405 224 291 73 141 98 79 115 226 212 75 -196 -254 -298
6716b98K58j76K02L31j14nj27J44l84P5LJ80o5J33j9k01k69L20K10q6m92J74J10
6739i6J87j99P8J37j10P2J55j48j95Q3N8J42l10J52l75L21q2J89L1m7j4Q0o2L4
6763H1k9l2N7j07J28J21k09j09M3J92m09J18K45R6k20J15j41O4l10P6L22j91K57
6786A58J8l16n8K32j2j26r3J72l6L35l49R1K50k09j03M28k24k11J49j23qpl49
6809c91L82j8N5k67K77k91K78k92L96j63J11J17k85J00j66J97J8J17j47K68l42
6830d6J46l40K70j6k19J54p8j03J66J16J38j87j46J62K5Q2l43L39j34l3O3M6j15
6853e3J65l5k52p4J32J17k6J8P9k07n1J98j80R1r4J55J41r6Qk92K68k89K53O2
6877C8j01L3l9k19J39J66M6j72j9R5R1l06N7K48J60j59l08N57k51J46k95J22k43
$$ plain form
6716 -298 -40 -216 -14 317 203 198 71 215 -169 -94 -91 89 24 157 138 -63 -332 -12 198 112 -380 -206 -96
6739 -96 91 -108 -30 107 -3 69 224 76 -119 -36 22 164 -146 6 -369 -48 -130 59 90 43 29 109 47 81
6763 81 52 20 77 -30 98 219 10 -99 -56 136 -273 -155 90 186 -34 81 -60 4 -306 -230 92 -99 158
6786 158 176 -140 -198 34 22 -104 -197 -25 -61 274 -75 16 266 57 -46 382 158 -53 96 -27 -35 -42 -391
6809 -391 -9 -27 28 -239 38 -253 25 -267 129 -34 77 194 -91 9 -157 40 58 175 28 296 -46
6830 -46 100 -240 30 14 -205 -51 -129 -232 -66 50 188 1 -145 17 42 124 -219 120 -14 -47 16 62 -53
6853 -53 112 77 -175 -249 -117 0 -26 -8 71 -136 -187 11 -169 -78 -172 -17 124 28 36 -256 12 -277 -24 38
6877 38 -63 -30 -69 -288 -149 17 63 -109 -128 -33 58 -248 -191 57 217 58 -250 307 56 202 -93 29 -214
6900b14M51M7l69O2J21L6r8J6J28k32k07K04l4J57J25l08J22j19J63o9j59N03
6922C26n49K99j68R4k15L91P5k55j85J95J67L0j33o2K16l77K08p3R3K57n17J95
6944A2M00o48m7M93o5pj12j70K69j77j71M39k52R9LL6L4j12O5o1m7J49l5j5j17
6969c7J54j91J66l41j8L12k8L1j28M8j28J33J23p8q9R9p9j04R3K59k77J6L14l17
6993f7r1J14m2J23J30k6j9k95M23j50J09k06M8k34L2J30j14Q5j8J92k39P9J21
7016H5j48j16J82k0r8R1p8J29L4j32k84K03j40M19r4j21K21Kl88M03j03j58Ll6
7040a44Q2N0o8J02P4j86J43j64K77k60O3K93j70k82J66J30k16Q4o8J07m69K48
7062b08J8K6K16k42K48n0O6o1oJ18n5j60k04M19l82L39l22K39L23j17j62j04J09
$$ plain form
6900 -214 237 284 -85 -23 98 134 36 52 180 -52 -259 -55 -89 68 193 -115 7 -112 51 -18 -177 326
6922 326 -223 76 -92 2 -213 178 253 -2 -187 8 175 205 72 10 226 -151 57 -16 77 334 -183 12
6944 12 412 -236 -283 210 145 138 26 -144 125 -52 -223 216 -36 63 66 102 136 24 89 28 -19 130 95 80 -37
6969 -37 117 -74 92 -249 -267 45 17 48 -80 -32 -160 -27 96 18 -71 28 -51 -155 -62 197 -80 -64 250 -67
6993 -67 -158 -44 -86 37 167 141 122 -173 250 100 209 3 51 -183 -151 -21 -135 -50 -68 124 -115 -36 85
7016 85 -63 -179 3 -17 -115 -24 -102 27 61 -71 -355 -152 -292 127 33 -88 133 135 -253 150 47 -111 -108 -144
7040 -144 -62 -12 -80 22 96 -90 53 -111 166 -94 -31 262 92 -190 -24 106 -110 -26 -94 13 -456 -208
7062 -208 -190 -164 52 -190 58 8 74 13 7 125 70 -90 -294 125 -257 82 -240 -1 322 205 43 -61 48
7085D8K86l43J30j07O7j25O3k27L31k50J07J5O9K6J39o9k95m0R7J29J39l44K01
7108D7J43n5o2nq8N6L6K17k73J45j72P0J34l54o6K51lJ10j31j09K04p5K19k05
7132C4R1j86J91J4j09q0K14k27J7P0Pk0j87L44q9k03K58j85J76n1L21m92j9L43
7156B32M2k29j6o7P5j58J50n2NL0o9J60j83j16J75p3M9j4q3j74L07J64k80M76
7180C51k01l4j35j70K28J89k8m15M56k52K75l96J08J7J55J49k26l8r4Q9J09j84
7202d7P7j3r6qK20K6k72R2L8k06k0J92p6J68l9%j20O6J83j66J64j1j69j56K49
7227G6j26k27N53m92L57l06M21k19j5o2j98K21j92K46j36M7R0p2K49k08L5n2J40
7250A30j39K19l08j04J55K35j77R4m1k0j58J72P5k80J48M9j30L65j75l7j02%J12
$$ plain form
7085 48 334 -9 121 14 81 -44 19 -208 123 -127 -20 -5 64 90 229 160 -135 -175 -78 51 190 -154 47
7108 47 190 135 73 68 -20 36 72 289 16 161 -11 59 193 -161 -227 24 21 131 0 -109 95 20 239 34
7132 34 125 -61 130 144 35 -45 169 -58 -41 29 36 16 -171 173 84 -119 139 -46 130 79 400 -92 -111 232
7156 232 274 45 29 -38 37 -121 29 -23 -18 12 -57 103 -80 -196 -21 -94 -45 -59 -142 -316 -9 155 -125 351
7180 351 150 116 -19 -189 39 228 200 -215 241 -11 264 -132 -24 -7 148 297 71 33 -61 28 137 -47
7202 -47 30 17 -79 -87 133 159 -113 -21 17 -189 -209 -17 -93 75 36 36 -84 -18 165 -1 163 152 -17 -173 76
7227 76 -50 -277 276 -216 141 -165 256 37 22 -40 -238 -17 -209 37 -99 -52 38 -34 215 7 42 -10 130
7250 130 -9 210 -98 -202 -47 188 11 105 64 44 -114 58 133 -147 1 50 -80 285 110 73 -29 -29 83
7273H3Q0J05m32JM02n5q6J9j18N0O0j22Ko1Qm0j83J99K14O9j87r7p8K91J26l34
7299h4M87m07J56j76J33k12K9M4L9j60j9M55p9l41Q6O3K31k15K03o5k22J83l18
7322a89J24N8J79j18j03K14k81K48l55K69o6O6l1j15L04J9l22n8K83j49J7k02
7344b08K70r6K73n2J0r8k61O1K40k23l3J06k13N55j11k20J13m12L45K25l45J62
7366H8r8J10j74J10l3o3R1p9J29j42j73J92r4Mp3J39J08%j05K96k99%J84L2l01
7391a51R4QO2R5l27P0J10N1J22l73J77K40j1j12k71K35k1k12K59n5l05K49P4n9
7415e1j41N6K81k84l0K50K53o39M37k64J26q5J00J40p3j74J94mp6j15J01K37k52
7438a3K92r5k01K35j70p2Q1P2j29Q2K09k72k13J81R6q3j93K41P5j63j34J48J82
$$ plain form
7273 83 163 268 -164 -163 239 184 98 117 -1 49 109 -13 -11 -72 -64 -104 -287 -88 126 195 8 -89 -167 124 250 -84
7299 -84 403 -4 152 -24 109 -103 -74 -30 9 -151 -170 285 206 -135 -49 14 245 30 233 168 -54 129 -189
7322 -189 -65 -7 172 54 -49 165 -116 132 -223 46 -20 46 15 -100 204 223 -99 -157 126 -23 -6 -208
7344 -208 62 -34 239 187 197 99 -162 -101 139 -84 -117 -11 -224 331 220 0 113 -299 46 271 -74 88
7366 88 -10 100 -74 36 3 -60 31 -48 81 -61 -234 -42 -136 -132 -205 -66 42 42 -63 233 -66 -66 118 150 -151
7391 -151 -57 -49 13 108 -219 -149 -39 12 134 -239 -62 178 167 55 -216 19 -2 -214 45 -10 -315 -66 8 -51
7415 -51 -192 -136 145 -139 -169 81 334 -305 132 -132 -6 -91 9 149 76 -98 96 92 16 -99 2 239 -13
7438 -13 279 184 -17 218 48 -24 57 129 0 82 291 19 -194 -13 83 0 -193 48 123 -40 -174 -26 156
7461A56k3K1k99K03p9j37N8R5j20J20o8K59j2m68K40M49k38r9m6j36K87k61K35
7484A37l52K23l3j76K56l3j03n5K30k22J20J46k28r5L1k0L63k03J2J0K0l1o2k12
7508b77J86J1J63n8q0J86J9j09J19j82k64K44j65J92J20k93L57M3m21L12M0j02
7530D1O6r3J16m52L73O0l39J18L12l6m02K65R5j19k0J81mr4l69L12K39j26R0J
7554B15j54J01l84N01o28J82K60K2j21k42J69j10J98j27n0K26n2l4NQ4j10M0k
7577a1Rq0k9L83l27l5K78j15m04K18J01R2j40J0R6p1K52k42JK00j43L7Q7M1k04
7602DN4j39K3K22k25J40o2lk36Q9j0J75O5P9R8k26J15k18j00K44o4j27J46k0k77
7627b53K33K67k43k74J43J40L6N3k28K61j12K74m27K62k88J19n1J14N3N7j43J46
$$ plain form
7461 156 133 154 -145 58 -21 -158 -100 -5 -125 -5 -73 186 174 -294 -54 395 157 58 12 -124 163 -98 137
7484 137 -215 8 -25 -201 55 22 -81 -136 94 -128 -8 138 -90 -185 -154 -174 189 -14 -2 8 28 -3 -65 -277
7508 -277 -91 -80 83 25 -55 131 150 41 160 -22 -286 -42 -207 -15 105 -188 169 212 -209 103 143 41
7530 41 107 14 130 -322 51 111 -228 -110 202 166 -236 29 124 5 -15 166 162 68 -301 11 250 124 214 215
7554 215 61 162 -222 279 -349 -167 93 115 -6 -248 -79 -189 9 -118 -168 58 6 -28 -23 61 -49 -9 -11
7577 -11 -2 -82 -111 272 -55 -90 188 73 -331 -113 -12 80 -60 -50 46 -25 227 -15 -14 186 43 80 167 208 4
7602 4 58 -81 -58 164 -61 79 17 14 -222 -133 -143 32 97 176 274 48 163 -55 -155 89 25 -102 44 24 -253
7627 -253 -20 247 4 -270 -127 13 49 102 -126 135 23 297 -130 132 -156 -37 -88 26 79 136 -7 139
7649A39Q7k48k17M10k43j54L62j22K12k39j48K20n7k86N01m1k14n1K11R4k11P5
7671H0k40K21J2NJ4q1j3l3R0j80r3K17k37L99j61q9K79j42Q1l91K15k13L80j41
7695b1J91l54L86k14j29J51j19J70Rm1J00O3k08J34jo3j63n0Q6K90k95J40j89
7718a27L75m65M67q8l63J87R6p3r3K10q8j58K46k13J90L5j71j05J35r2K40m03
7740b58J69K41J03l22K06m05J15M7O6R6q1P7J4J70j36N9j59n7Q3k51L32r7j10
7763i8q2L12j94Ko9J68k53J27J04l5J90k12K10j7k54k9p3J88j3K12q2o6j54j8
7787a36J55N4n2j55J90r9J23o4J06nJ8qp6j22j12M2J44j14j38K05K73l99N9pJ49
7812C1O9k05j21K15J78l54J45K33l05R3J01l23J00J91r5O1J3K67l52l6K41j91
$$ plain form
7649 139 226 -22 -239 171 -72 -226 136 14 226 -13 -161 59 2 -284 217 176 -38 -89 122 216 5 80
7671 80 -160 61 73 78 92 11 -2 -35 55 -125 -218 -1 -238 161 0 -89 190 48 129 -262 -47 -260 120 -21
7695 -21 170 -184 202 -12 -141 10 -109 61 70 29 129 192 -16 118 117 54 -109 -159 -73 217 -78 62 -127
7718 -127 248 -217 250 162 -201 -14 82 9 -84 126 38 -120 126 -87 103 138 -33 -138 -3 -95 145 -258
7740 -258 -89 152 255 -67 139 -266 -151 -104 -38 58 -23 54 68 238 102 161 2 -55 28 -223 109 12 -98
7763 -98 -180 132 -62 -60 -129 39 -214 -87 17 -18 172 -40 170 153 -101 -130 -203 -15 -28 184 102 36 -118 -136
7787 -136 19 73 21 -134 56 -43 80 16 122 117 135 127 51 -71 -183 -141 3 -111 -249 -44 229 -170 -111 -118 31
7812 31 100 -105 -226 -11 167 -187 -42 191 -114 -21 80 -243 -143 48 -47 14 27 294 -58 -94 147 -44
7834d4J99p6k9m3L90m29j59J75L01k27k19Q5r0j41M7J65J36O9k11r9R1r7L34J5
7858A43j46J97j18M8j46K36k38Q0j5J2N6r3n2JP3j35K26j70j3l6L29j29j17j85
7882a92L76n1k95K03j30K02j12J16k67L28j89Q9L5j40RJJ73l74K69M0k1j32o2
7905a24RJ63l09L87k43mj5N8k72L62M48m70K61l05O8K4j82K75k8O2l02J66j9K8
7929C8j36K11j60r4N8L5J11l00L46m2K4q0L6j09K88m11R4N9K4M1j79K29J92m14
7953a39K62J06j78J4q5L38m05J48k8j17K43m1R4q3J31m46n1J89J65j51J40p6k29
7976a99M6J26j41Q0R9j67K07j5J73l60J26l54M39p8k31K19K94l86J56p6ln5j0
7999a10q6L01k2q9P7j0j48P3J32k34J60m66L12J06M9n3M5n1J28k27K25k00r0L33
$$ plain form
7834 -44 155 79 50 7 397 -32 -191 -16 285 58 -161 -76 -166 -307 -260 -95 41 110 -101 -200 -109 -206 128 143
7858 143 -3 194 76 124 -22 214 -24 56 41 53 109 16 -36 -35 38 -97 129 -41 -54 -90 239 110 -7 -192
7882 -192 184 133 -162 41 -89 113 1 117 -150 178 -11 78 113 -27 -18 -17 156 -218 51 91 70 -62 -124
7905 -124 -115 48 -261 126 -117 -121 -136 -78 -350 12 460 -10 251 -54 14 38 -144 131 103 165 -137 29 10 38
7929 38 -98 113 -47 -141 -83 -48 63 -237 109 67 91 11 47 -62 226 -185 -91 -32 -8 33 -146 83 275 -139
7953 -139 123 229 51 65 -20 318 -87 61 33 -84 159 118 212 129 260 -186 -237 -48 117 -34 106 30 -199
7976 -199 -153 -27 -168 -88 11 -156 51 36 209 -151 -25 -379 60 -18 -249 -30 264 -122 34 -42 -45 -100 -110
7999 -110 -196 105 83 -6 71 61 -87 -14 118 -116 44 -422 -110 -4 45 -8 37 -14 114 -113 112 -88 -178 155
8023A55j51P3k36J27m7j69M49j66L4O8m8J62j87Qk75J33o1K93K59m24Q9L3N4k94
8047a21j11M95k90Q3P1j07j34q3L71j85J57l22J54n7R9j51K20j70K24J45k44J85
8069B29l57R0rJ98k35K20j81m1J59L1j98J20k19J64j33K76k73L07k08J19J12P
8091A78j96j7Q8JO9k31K01r5N7j39l4j2P8K51k52K49k32K18l4l10j8K41j34K0
8115e3K04m7l1KJ39j29k40l3K00L1Pj7K19j48J47k07k57K39j23J25j19J33p2j10
8139a40K60K8l29K68j13L9j96M2q1K34J44k50J06l2J85m18J84K6J55M7k88N0J98
8162A19k9j98K44j58J30m01K35R3j36J49K3j77m1J49K23k35l0Q5n2J4qJ01j44
8185d4L62l33j44K89j98J09
$$ plain form
8023 155 4 77 -159 -32 -79 -248 201 35 69 137 89 251 64 72 -203 -70 -131 162 421 -3 86 119 173 -121
8047 -121 -232 263 -27 56 127 20 -114 -197 174 -11 146 -176 -22 -79 20 -131 89 -81 143 288 44 229
8069 229 -128 -38 -47 151 -84 136 -45 -86 73 104 -94 26 -193 -29 -162 114 -159 148 -60 59 171 178
8091 178 -18 -35 53 54 123 -108 93 -2 55 -84 -118 -130 -52 199 -53 196 -36 182 148 -162 -180 61 -73 -53
8115 -53 151 104 73 75 214 85 -155 -188 12 43 50 33 252 104 251 44 -213 26 -97 28 -91 42 -30 -140
8139 -140 120 148 -181 87 -26 13 -183 -141 -222 12 156 -94 12 -20 165 -253 -69 -43 112 159 -129 -79 119
8162 119 90 -108 136 -22 108 -293 -58 35 -101 48 71 -106 -147 2 225 -10 -40 45 -7 7 -1 100 -44
8185 -44 318 -15 -159 130 -68 41
8191D1
$$ Imaginary data points
##PAGE= N=2
##DATA TABLE= (X++(I..I)), XYDATA
0@%%%%%%%%%%%qJ6j6J6j6K4l2M0m8N6p2Q8j04J20j36J60j87K11k43K82l22L64
33A93m14M69n27N95o68P46q33R28j032J146j272J409j557J718j895K088k299K533
51A328k791L077l396L749m144M596n112N705o401P231q238R492j1104J3261j6314
66i061K1004k9208M7663j68794N5803L05960j46638j79944N124J18298O405m788
78B1824j8124k5211j3127N5888J8854m3502n1140L2410P0005R866r6007n1114
90h9378Q0452Q5484n0010p7432R819M4288M994R828N309m1861k6205N3698L4114
103D3100m2768k5877L1392Q936k2588K404J1181j8954J91L4888l759m8762p959
116c8575M6503K9830k4049m0803j258L5809J6642j7364j0951O863o940p210K4401
$$ plain form
0 0 0 0 0 0 0 0 0 0 0 0 0 -8 8 -8 8 -8 16 -16 24 -24 32 -40 48 -56 64 -72 88 -99 112 -131 151 -171 193
33 193 -221 248 -279 316 -352 394 -439 489 -543 603 -669 740 -817 901 -994 1094 -1205 1328
51 1328 -1463 1614 -1782 1967 -2177 2419 -2693 3012 -3389 3842 -4396 5096 -6008 7253 -9061
66 -9061 11943 -17265 30398 -138396 -82593 223367 76729 -103215 -98091 20207 26612 21824
78 21824 3700 -21511 -34638 21250 40104 -3398 -54538 -22128 47877 57743 -38264 -89378
90 -89378 -8926 76558 26548 -50884 -41065 3223 8217 18045 23354 -18507 -44712 8986 43100
103 43100 332 -25545 5847 14783 -7805 -5401 5780 -13174 -12983 21905 18146 -30616 -38575
116 -38575 7928 37758 13709 -27094 -28352 7457 24099 6735 -4216 2647 -4293 -11503 12898
129A2898J0968l5104j6229L6348J4473l5399j3663K9819J3468k1533j2218J4112
141b060R657l568j790L33o188k742J1527J2172r254j9929K550J7885n7j5021l49
156f834J0924k118q701L418N341n324j551R715J193j0519j714J1647M678q133
170B022o486M943O891l556q305N00O247q68l894K766p67p641L086J1633j106j1838
186f373p17R480M063k644k946k910K391N206j055o699o60O099R52n758m393J693
202d271O474K558p479o604N049Q872J301m332l844j473L310O269J473p386l465
217c548N458K962o390m326N986O359m689j0384k23R607M099m695m013J179K642
232B4O46J567J798j069l308j806J345M754K953m308p783p96M910L926m16l797
$$ plain form
129 12898 23866 -11238 -27467 8881 23354 -12045 -25708 4111 17579 -3954 -16172 -2060
141 -2060 7597 4029 2239 2572 -3616 -6358 5169 17341 8087 -11842 -9292 8593 8536 -6485 -6834
156 -6834 4090 1972 -6729 -3311 2030 -3294 -4845 4870 6063 -4456 -6170 5477 10155 2022
170 2022 -4464 479 7370 3814 -4491 -3991 2256 1388 -2506 260 -507 -8148 -5062 6571 5465 -6373
186 -6373 -7090 2390 6453 3809 863 -2047 344 5550 4495 -2204 -2864 3235 4187 -1571 -5964 -4271
202 -4271 2203 4761 -2718 -9322 -4273 4599 5900 1568 -2276 -3749 -439 5830 7303 -83 -3548
217 -3548 1910 4872 -1518 -5844 142 6501 1812 -8572 -8795 812 4911 216 -3797 -2618 24
232 24 670 2237 4035 2966 -342 -2148 -803 3951 6904 2596 -5187 -5983 -1073 2853 2437 -1360
248a360l720Q35M121J292j677J723J103l094q55K772J201R86K188m152p708K351
264c994R838Q57q818m583L085K882J774k37l561Q5L225q41j450L675J702l876
280b37m44L965j499m048M778L809p138o857M722O722j7n047n121J245O172K981
296C986n175k774N169K413m947J80M423k47k045O20j404k002K376K473k265m466
312c685n19L349K797k17m479l780N179O109l725m630L135M541j397l383K06K978
328B479R13k123l536j69L527J084l697j301R34K6Q05J706k93k418k20L087K273
345C077k395j015J806J513j798k763K250L422k069n552l00M330J957k166l525
360c228o29K165K337P10j285n73P63L81R1P10l92O02R84k347k893J711L267K1
$$ plain form
248 -1360 -5080 -4245 -124 1168 -509 1214 2317 -777 -1632 1140 2341 3327 5515 1363 -6345 -3994
264 -3994 5844 6701 -2117 -6700 -3615 -733 1041 804 -2757 -2672 553 -288 -1738 1937 3639 -237
280 -237 -681 3284 1785 -2263 2515 6324 -814 -7671 -2949 3773 3756 -1291 -6412 -5167 1005 3986
296 3986 -1189 -3963 1206 3619 -1328 -1148 3275 3028 983 1603 199 -1803 573 3046 781 -3685
312 -3685 -4204 -855 1942 1725 -2754 -6534 -1355 4754 1029 -3601 -466 4075 2678 -705 -499 2479
328 2479 3392 1269 -2267 -2436 1091 2175 -1522 -2823 -1889 -1863 -1058 648 355 -2063 -2283 804 3077
345 3077 682 -333 1473 2986 1188 -1575 675 4097 2028 -3524 -3824 506 2463 297 -3228
360 -3228 -3857 -1692 645 1355 70 -503 260 641 732 1442 1050 1652 2636 289 -2604 -893 2374 2395
378B395l277k774p99K920M548l29o518k026O581L347k914k552K249J485j298k225
394a187Q24L333J364m270m113J971L550o39j547M19k523j745M228M355l127l779
410b886J385K844k15n40J267R87o86k831k164L844M428l633p204J518N746p44
426A116k937M97J038p96k82R25Q87Q55Nj315m10J808j59J15J803j576n293J41
444c578O097K059n554m238K420L788M10k203j557J153K797m99k053J185K023r32
460A318q22M89n80n18J533M63k957k024J590K499J84j984k348M92L508J026k728
477h59o48K539N92k106L82K253N77k452j849R49K267J56k982r79J560Q63j545
494a282l52J305M99j256P3J182N75m6O22m8j511n22J397K386o05l933k011L224
$$ plain form
378 2395 -882 -3656 -4455 -1535 3013 2684 -3834 -5860 721 4068 1154 -1398 851 2336 1038 -1187
394 -1187 -363 2970 4334 64 -4049 -2078 1472 833 -714 -295 -2818 -4563 -335 4020 893 -2886
410 -2886 -1501 1343 1128 588 1855 2842 2156 -675 -2839 1005 5433 1800 -5404 -3886 1860 1116
426 1116 -1821 -1324 -286 -1082 -1364 -439 448 1303 1308 -7 -417 1391 1232 1347 3150 1574 -3719 -3578
444 -3578 2519 4578 -976 -5214 -2794 994 1404 -799 -2356 -1203 1594 1095 -958 227 2250 1318
460 1318 496 985 405 -113 1420 1883 -1074 -3098 -1508 991 1175 -809 -3157 -2665 843 1869 -859
477 -859 -1507 1032 1624 -482 -100 2153 2730 278 -1571 -622 1645 1801 -1181 -2160 -600 263 -1282
494 -1282 -1634 -329 170 -1086 -1013 169 744 698 1320 1272 -239 -761 636 3022 2417 -1516 -3527 -303
512c03L133j639m163n06K923J569j036j293K91J564P10r03m84P05M79L87O18k157
530a05j529K151K535j745m224l59K728K298p96k391k101J823L432n71j656M23
546h7M39q6P5R02k50J43M70j462k017J871J562k055q07R25j211n55K551J190j878
565b80j586J490O05O59J770j129k432j30J590P05J91O5l366j076L356J480l004
582a092j439K488K26k199J119P00J74J494M8l458Q8M574O68k885q49L03j326J342
600b4K884k252m318J674K914K4j133j048j032K108K212k061k411L910K315l954
616a92j969K940J880j845L9r19k542J176L269l55k988n61K73N84K278R0l307N29
634a620M380j284l601J879L557j671k671O83N21L36J363k097k767J608L170k203
$$ plain form
512 -303 2830 1191 -2972 -3478 -555 1014 -22 -1315 -1024 540 1250 347 -137 568 1047 1434 2052 -105
530 -105 -1634 517 3052 1307 -2917 -3276 -548 1750 954 -1437 -3538 -1715 1717 1146 -510 -87
546 -87 352 266 341 1243 993 1136 1606 144 -1873 -2 1560 -495 -1302 -377 -1588 -2143 408 1598 -280
565 -280 -1866 -376 229 888 2658 1529 -903 -1033 557 1262 1453 1518 -1848 -2924 432 1912 -1092
582 -1092 -2531 -43 183 -2016 -897 -197 -23 1471 1519 -1939 -1851 2723 3391 506 -343 -40 -1366 -24
600 -24 2860 608 -3710 -2036 878 902 -231 -1279 -2311 -203 2009 -52 -2463 1447 3762 -192
616 -192 -2161 779 2659 814 853 -66 -2608 -1432 1837 1482 -1506 -2067 -1794 -1210 1068 1158 -2149 -1620
634 -1620 2760 1476 -2125 -246 3311 1640 -1031 -348 173 509 1872 -225 -2992 -1384 1786 -417
650d17j728K450l61k459J857L035k470j220K754q2k062O33J805k98q33n12k304
667b212J685L450k089m628K045L604k287k196K703P55j552l9J523m52J55J232
683A697r56j426J380M63j173N29L80k610o85L992J48m415L18K852n04q12J359
700E37k01p86J091Jj622J597K782k482k878J954J571j427l55M29j415q97K157
717E6M96j842O86J56l72Q87J152j039k27J572m18k044Q59L183j294k874l21J372
735a2K71O95q86k310O83J891m77j362J685J086j820q92J778P54l55K99n45j287
753h04R31P42J06m6q18j894J79K738N2k967j53K298j97j239R50J192m11j001p0
772d12P98J276J28k097n15J017q3k96L96N41j806j323J633J771j070j153M69R93
$$ plain form
650 -417 -2145 305 -56 -2515 -658 2377 -93 -1313 1441 1359 -703 -70 1735 1437 604 92 -2212
667 -2212 -527 2923 834 -3794 -1749 1855 -432 -2628 75 830 -722 -761 762 310 465 1697
683 1697 741 -685 695 1158 -15 514 894 -1716 -2401 1591 1739 -2676 -2358 494 -10 -822 537
700 537 336 -450 641 642 -980 617 3399 917 -1961 -7 1564 137 -218 211 -1204 -2101 56
717 56 552 -1290 -604 -448 -820 67 1219 180 -47 1525 1107 -937 -78 3105 1811 -1063 -1384 -12
735 -12 259 954 68 -2242 -1559 332 -145 -1507 178 1264 -556 -1448 330 1084 729 1028 483 -804
753 -804 127 869 975 929 111 -1783 -1604 1134 1186 -1781 -1934 364 167 -1072 -122 1070 659 -342 -412
772 -412 386 1662 1790 -307 -822 195 112 -184 212 753 -1053 -2376 -743 1028 -42 -1195 -726 267
790B67m20k73N83J398k0j779j071J762K009j699j753K03L85L30K08n92r8m60Q9
809i31L56M34L72M43m62k29K54j84R94P71j181j495M08J742j43q75r75o75J130
828b46O76q18r31R62R50j216l90J316J013m26j057k26N18R64j7q84n26R7m43K08
848d76P75kj867m3J418O82j109k00J116L66q17k11P53J159l95j631j22J559M55
867A410j330m96j4J87n82M98N04n03q78N11P61K57O6n97L23M62p30m06J877P57
887B077j609j997Q07K168m68j753m19Q28M69n41r09J138Q31q07q21L35J796l3
905A092o85j61j55k38L82J321r85j319j99L92J068J49j677l24J122J89p84OR80
924A74L57k91p86P99P45L26q22j079M85N66k25J57k41r88l21N60P46n6r81R8L58
$$ plain form
790 267 -153 -426 157 1555 1535 -244 -1315 447 2456 757 -996 -793 -408 -78 130 -462 -560 -1020 -931
809 -931 -575 -141 231 674 212 -17 237 53 1047 1818 637 -858 -450 1292 1149 274 -701 -1376 -246
828 -246 430 -388 -1319 -357 593 -623 -1013 303 1316 890 -167 -393 125 1089 1072 188 -338 -241 -684 -476
848 -476 299 297 -1570 -1613 -195 487 -622 -822 294 660 -157 -368 385 1544 1149 -482 -604 955 1410
867 1410 80 -416 -430 -243 -825 -327 177 -326 -1204 -693 68 325 391 -206 117 579 -151 -557 1320 2077
887 2077 468 -1529 -722 1446 978 -775 -1194 -366 103 -438 -1347 -209 622 -185 -1006 -671 1125 1092
905 1092 407 246 91 -147 235 1556 571 -748 -947 -555 513 662 -1015 -1339 -217 -28 -812 -806 174
924 174 531 240 -546 253 998 1324 502 -577 -92 474 249 406 165 -823 -1144 -584 162 106 -875 -777 -419
945d19K85m5J68N85J70l03j184Q22J599k19j619o22O60P55m27o83m02K77J96j69
965e75k93R68M04q17l15N08O92l10N09R9j261M5J085P88j066j076l33M51N65j02
985c4j293N47J384n72j168Q34J505p26n87k71P15N64N86q36r27K72N48p19j5K65
1005G2l71r11N39R96o17m51O94K28m01J94L03N00k8m29o46L73J209o67r67k9R82
1026E73q20o75N17O87r62j99M34M69j53M76m11J13J03P6K3N03P4j001p58J635
1046G04P57j576j073N03R27l52n05j17P39J5k95m77O60J076n32r46P34M42l41
1065C43M11R4n69r44M42N34K16o84o96K11M73J56m24n4Q81k21j055L76J213O20
1085A323q91r09M33P12j53j88m36J7m28k77L82O94l53p08o1O25N69k17k66K63
$$ plain form
945 -419 -134 -179 -11 574 744 441 -743 79 1678 1459 -160 -782 -122 633 206 -477 -879 -602 -406 -575
965 -575 -868 100 504 -313 -628 -120 572 262 771 870 -391 -346 739 1527 461 -615 -948 -497 68 -34
985 -34 -1327 -780 604 32 -1136 -302 1203 477 -110 -381 334 898 1484 648 -279 -7 541 -178 -193 72
1005 72 -299 -1210 -671 325 -292 -743 -49 179 -222 -28 275 775 747 318 -328 45 1254 587 -380 -409 573
1026 573 -247 -922 -405 282 -680 -879 -445 24 -129 347 -64 49 152 228 251 754 828 -173 -931 704
1046 704 1461 -115 -1188 -685 242 -110 -615 -732 7 22 -273 -750 -90 986 454 -492 242 684 343
1065 343 754 848 279 -665 -223 311 527 -157 -853 -642 -169 -13 -437 -491 390 169 -886 -510 703 1323
1085 1323 432 -477 -44 668 515 327 -109 -92 -520 -797 -415 279 -74 -782 -843 -218 351 134 -132 131
1105A31J66n78j10J030O10p15j286N00J044m50m25m02L30l90r6q5Q03M18o17p71
1125h93L76R75j11k88N04l01p43K65J355m72r91J16J74J48l07n41J2O20L10r19
1145g11k15J477L96j204l32R74J14K44k16l87m64O50j16k83J1M4m79m73J339n57
1165a88p53L56Q04k83p90Q04R43r15Q7p5M4N25N29j045r04J033M01q73k33J020
1185D87n77q32N87J47N4K18J01m66m14J248o3l13M16q8r49M02J407o34j692K84
1205f77J038o42nj04j77L19M44p84l0J247M78j564j55J409N4q16L06M69j006m39
1225f35J264l88o02l1J64m70N05M9o06J87J324q55j306J527J381j080j286J373
1243E15J02k54J40j91p13J82M72l81k71J132q35j255N72J275o17m83J234k83r97
$$ plain form
1105 131 297 -281 -391 639 1249 534 -752 -252 792 342 -83 -485 -155 -545 -641 -726 77 495 -122 -893
1125 -893 -517 458 347 59 563 262 -481 -216 1139 667 -324 -208 -34 114 -193 -734 -722 -102 208 -711
1145 -711 -926 551 947 -257 -589 385 499 743 527 140 -324 326 210 -73 -62 -18 -497 -970 369 -188
1165 -188 -941 -585 219 -64 -854 -50 893 -22 65 -10 34 559 1088 43 -861 172 573 -300 -533 487
1185 487 -90 -922 -335 -188 -134 84 185 -281 -695 553 490 177 593 505 -444 -42 1365 731 -961 -677
1205 -677 361 -281 -286 -390 -567 -248 196 -588 -618 629 1107 -457 -612 797 851 35 341 810 -196 -635
1225 -635 629 241 -361 -392 -228 -698 -193 -144 -750 -563 761 -94 -1400 127 1508 428 -858 515
1243 515 617 363 503 312 -401 -219 253 -128 -399 733 -102 -1357 -785 490 -127 -610 624 341 -656
1262f56O38J099o01l70N08q76k0J145n46j074K70J104j286k29J230J16j224P6
1280f96Q98k01L1K50l76l77O54L68l60K58M66r87n61J071L01j436R0O10l13l77
1300f87N47K20n1J74k24n32P16R76r60n96P36L39r14J72Q04n26o46L63j22jj79
1321c91l4k49K04O12k66K9R60l98j016J53J562m70j093N34J26j90K61l24l73M03
1341D0Rk61m04O08K47j051L66J060m77k77J81N12m54j97L81J37j23q3p49K12Q54
1362E31k77q65K05N37n83j67K66Q54k29m18O7K15M7L01m03j28L90k89k20N06J81
1383E21o78j20L38R4p38K63K90K58o20j78K62R67lo77m55P21N54m32l01R6K31
1404C93n50j18K95J57l35l58K74J7L94l24j16L16j02k85L15Q38j92p40j45P38
$$ plain form
1262 -656 -18 1081 480 110 618 -258 -278 867 321 -753 -483 621 -665 -894 336 452 -772 -696
1280 -696 202 1 32 282 -94 -471 183 551 191 449 915 -72 -633 438 739 -697 -607 3 -310 -687
1300 -687 -140 80 29 203 -21 -553 163 1139 179 -417 319 658 -256 -84 720 194 -452 -89 -211 -212 -391
1321 -391 -425 -674 -470 142 -124 -95 865 467 -549 -396 1166 696 -397 137 263 73 334 10 -363 40
1341 40 49 -212 -616 -8 239 -812 -446 614 137 -140 41 553 99 -98 283 420 297 214 -535 -323 531
1362 531 254 -611 -406 131 -452 -619 -353 501 272 -146 -79 136 183 484 81 -47 343 54 -166 340 521
1383 521 -157 -277 61 155 -583 -320 -30 228 -392 -570 -308 659 656 -21 -476 245 799 367 66 162 393
1404 393 -157 -275 20 177 -158 -516 -242 -225 169 -155 -271 45 -57 -342 -27 811 619 -121 -266 472
1424D72j62j39Kl52J02O9l04j36O89k60l32k19O79L24j74m74J52M88j98j12M14
1445E29k53l19k52K41K40J89o43J75J79l11k61J55N84k03l70n3O16M61n00o25
1465d21J08Q43K5o06J13N91n56m78K52L10j74m22J41j32J57K71j83P4L25l23m81
1486e66J048J20q02o3O23l1j71m05J47K77m19l9q0M35j82j19m54N65J23p5M6K45
1508B23j02j52K16J92L0l04j12J40q7J48n61n0N68Rq19K37N90L8o03lK78J57L36
1531C69k32k01j76N75j81r6K60k32k66O6P8m2n28L85K97j03m46K01L00L36j69
1552A95o23K40O99k6n51p6M99k72j62J4L00N0m76J35N9j45P7l27q7M91J1J38K5
1575A88M5k62l11K52N62j47k31l81M5K96j64r9Q7J78m73k07R8O58J10m09K34N9
$$ plain form
1424 472 310 171 173 -179 -77 -8 -312 -448 241 -19 -351 -570 109 433 259 -215 -63 425 227 115 529
1445 529 276 -43 -295 -54 186 375 -268 -93 86 -225 -486 -331 253 50 -320 -373 243 704 204 -421
1465 -421 -313 530 555 -51 62 653 97 -381 -129 181 7 -415 -274 -406 -249 22 -161 -87 238 -85 -566
1486 -566 482 602 -200 -263 360 329 158 -247 -100 177 -242 -281 -361 74 -108 -227 -681 -116 7 -68 -22 223
1508 223 121 -31 185 377 407 103 -9 131 44 192 -369 -419 149 158 -661 -424 166 204 -399 -402 -124 33 369
1531 369 137 -64 -240 335 154 58 318 86 -180 -114 -36 -78 -606 -221 76 -27 -473 -272 28 364 195
1552 195 -428 -188 511 485 -66 -142 357 85 -77 -63 237 287 -189 -54 5 -140 -63 -390 -477 14 25 163 188
1575 188 233 -29 -340 -88 474 327 96 -285 -240 56 -108 -207 -120 58 -415 -622 -524 134 244 -165 69 128
1597A28o8p2L88j0m15J7K86M7r7k51q4J01j51k09K55K65l33k63j88P56K51k51
1619A02k51J24K09M97n03j70j31L43k00m99N91k30r4J07k34k4J84Q2K5J12j64
1640a24k47N86K64j71k91R7K42J53k50n00L42j00l47j35N86j54L63q62K2M36K23
1661A33k43K01R6J03n39L66J68n9m13K78p3K02q4o70M10j82kk27M54K47l77k78
1683d89N44K1J89j72k40l9Q05o91L36j08R0k14l68M75J6k58N2j18j4k06R3M55
1705A59J26p1n18j18R90Q5p49l6K48K22l17k2Q4N6j07k08P7LL00k52m31K40J69
1728g0r1J29K58k97j6k41Q90j57n74L41J98m97J70n9j46K07O7o86Q9N20J13n93
1750d45j03P24l35J32J83K42m22K9L03k88L35j86j06m82O26k69k74R8K64l53l64
$$ plain form
1597 128 60 -12 376 366 -49 -32 254 301 204 -47 -131 -30 -181 -390 -135 130 -203 -466 -654 102 353 102
1619 102 -149 -25 184 681 178 8 -123 220 20 -479 112 -118 -212 -105 -339 -363 -179 -97 -72 40 -124
1640 -124 -371 215 479 308 17 114 356 509 259 -241 101 1 -346 -481 105 -49 314 -548 -526 -90 133
1661 133 -110 91 187 290 -249 117 285 226 -187 91 18 220 136 -534 -124 -306 -308 -535 -81 166 -211 -489
1683 -489 55 76 265 93 -147 -186 619 -72 264 156 246 32 -336 139 155 -103 -51 -169 -183 -389 -296 159
1705 159 285 214 -304 -422 568 653 -96 -132 116 338 21 -1 83 139 32 -176 -99 -96 204 -48 -479 -239 -70
1728 -70 -161 -32 226 -71 -87 -328 562 405 -169 172 370 -127 43 -16 -162 45 112 -574 -485 35 148 -445
1750 -445 -548 176 -159 -27 156 398 -24 5 308 20 355 169 63 -419 207 -62 -336 -238 26 -327 -691
1771f91M97M95l53K6j36J77J03M47k65n17N02q4o27L51L70m50l10M12J60l54Q6
1792a61L14m04r5L41j8nM24n82Q6K90K99j45o33M62K18p65O4M35J58m94n0Rj45
1815c97M99K74p77J41L66j40j82N07J96o99O6Q50k23m21j9j4k86K09L4k41L72
1836A15M3m39k16M93M70n64k62Q13l24j61N72l28l7j61J63l23P6K92j82l74K92
1857d2L64p29J42N97Mo94L40L34n34K93K00j24p0P1k75Q6K23M7m02L9L05K7m51
1880b49O1K50j45j99L53l71q2L69K20k03K98q8l40o4O63m37qJ61K72l61m94K13
1902a81K83j10l28M07l16L49R0m95k7P33j93m84J78N91m47j83L68j06j79%j08
1923a58J50j34j07k49L11N86l58p09M54P89m55l36J04L97k92K08M9l97L17k62
$$ plain form
1771 -691 -194 301 -52 -26 -162 15 118 565 300 -217 285 201 -426 -75 295 -155 -465 -53 107 -247 -161
1792 -161 153 -251 -346 -5 -23 -28 396 -186 -100 190 489 344 -289 173 391 -374 -310 125 283 -211 -261 -252 -397
1815 -397 102 376 -401 -260 106 -34 -216 291 487 -212 -146 704 481 60 41 27 -259 -50 -16 -257 115
1836 115 158 -281 -497 -4 466 -98 -360 453 129 -32 540 212 175 14 177 -146 -70 222 40 -334 -42
1857 -42 322 -407 -265 332 336 -358 -18 316 -218 75 275 151 81 152 -123 -37 186 233 -169 -130 175 202 -249
1880 -249 -188 62 -83 -282 71 -300 -382 -13 207 4 302 214 -126 -190 473 36 28 189 461 100 -394 -181
1902 -181 102 -8 -336 71 -245 104 194 -301 -328 405 212 -272 -94 497 50 -133 235 129 -50 -50 -158
1923 -158 -8 -142 -249 -498 -187 399 41 -668 -214 575 120 -216 -112 285 -7 201 250 -147 170 -92
1943i2j04P3P4J83l09j05L64k84q3M21j51k24k07N80j44K9J72j23Q2P8m53J29
1965i4l0N84p74l8L69K97m87PnJ50j95L43j2k68L05p3n1L08Q8m39j07K58j09k45
1989b18o5M30j98p5j30n6O48m07j55p7K56M13m60K82kj75J43J7j12jk9l70M74
2012A33j88m5K53j49j20j72j02M45o2J11l10K12n2J30J6k58N07j24k12J0n7L27
2034B93j89m77O1K52N5n3j79L57j64M9J59k34J70j66K13j24K55o7j71L07n76J53
2056g6j0RL11l99l48K87M14j7j56k7K62Q1m49o3K77L75l92l63M83Qo7l50L68n5
2080A03k40k2Jj5K11j59N6K37p8j69J95K21k96j12j06K71Q8j37k02m4M26j96q0
2103d7r2K36j20j7N2K51j24k61N1K86j15j69O1j2L81j36pj04J62l23j80K65P0
$$ plain form
1943 -92 -196 -123 -49 134 -175 -280 84 -200 -283 138 -13 -237 -444 136 -8 21 193 70 152 230 -223 -94
1965 -94 -124 460 -314 -352 17 314 -173 -166 -171 -21 -216 127 115 -153 152 79 28 336 424 -15 -122 136 27 -218
1989 -218 -283 147 -51 -126 -256 -312 336 -71 -226 -303 -47 366 -94 188 186 11 154 171 59 58 29 -341 133
2012 133 -55 -100 153 4 -116 -288 -390 55 -7 104 -206 6 -46 84 100 -158 349 225 13 23 -34 293
2034 293 104 -373 -312 -60 -5 -58 -237 120 -44 5 164 -70 100 -66 147 23 278 211 40 347 -229 -76
2056 -76 -86 -77 234 -165 -513 -226 188 171 15 -12 250 331 -118 -181 96 471 79 -284 199 207 140 -210 158 103
2080 103 -137 -159 -158 -173 38 -121 -65 172 94 -75 120 341 45 -67 -173 98 186 49 -153 -197 229 33 -47
2103 -47 -139 97 -23 -40 12 263 139 -122 -71 215 100 -69 -8 -20 361 225 218 114 276 -47 -227 38 108
2126A08j16k02J40l0K8K34m92K26K96j75Q4J18K08k42j57R4J26j30j07k06m6j00
2148c41J89L8K22p9j84p9R1L35j86j12J65j48J99j60M4M17k74j56N2R6k34P9k67
2171b93K85j53J11j26K40M05n03j52L92K1k27J10j6j37M85l36K7j58N5n5k31O3
2193a93J98m9k47K82j84K27o5n8K06j77m2L17J8J46n93K7N06j27j07k42N09m99
2215a47j18J1N45l44J36j12k74L35r8j07J54Q6L26m66P7M74k63r8Q6P5k33k8j1
2238FN0m9l44M54J14j46j94l49M82k9mj03L98M9l09j52M4J7M05k93j35J19j86
2261a55J10m3m1Q1j32J9K5J15M5PK3M6O3l66K29N15m46l96K02L49k13J56l01J12
2285Dj09n3J64KM8l91m5J08K90J21k78N01j73j51m65K99J51j46J80M1j78M9l3
$$ plain form
2126 108 -8 -210 -70 -100 -72 162 -330 -104 192 17 101 219 427 185 28 122 248 118 11 -195 -241 -341
2148 -341 -152 -114 108 29 -155 -234 -143 192 6 -106 59 -89 110 -50 -6 411 137 -19 33 129 -105 -26 -293
2171 -293 -8 -161 -50 -176 64 469 -34 -186 206 227 0 110 94 -43 442 106 133 -25 30 -25 -256 -193
2193 -193 5 -44 -291 -9 -193 34 -31 -89 117 -60 -102 215 233 379 -214 -187 319 192 85 -157 352 -147
2215 -147 -265 -254 291 -53 83 -29 -303 32 -66 -173 -19 67 393 -73 4 478 215 117 203 278 45 17 6
2238 6 56 7 -337 117 231 85 -109 -458 24 -5 -9 -112 286 335 26 -126 -82 -65 340 47 -88 31 -155
2261 -155 -45 -88 -129 -48 -180 -161 -136 -21 24 31 54 100 163 -203 26 541 95 -301 -99 250 37 193 -108 4
2285 4 -105 -158 6 8 56 -335 -380 -272 18 139 -139 362 189 38 -427 -128 23 -123 57 98 -80 -31 -64
2308f4k92L52pj05N7J5L19j15k03J78J23j64m22L14j08J38J32j56j61L9J21k72
2330b81K98N9l7k70P6L04j38k9M7K1k36r6L0L20K8o3r7LK76k29n84M00J68j6J5
2355c1J35k31k63O40m58J71J65j64N0k12K01J55j81L15l1l89j04M56l64K80l68
2376b28PL18J53j66r6L8q5M67m32j62N62j57m51J96Q2l12J37J06J74j47k10K76
2398G0k29PK73O0j3Mk53O2K27Km76L20K08l7k63j04l1k1J08l4l1j09p6M33l03
2423b06J80K22n44O04j21R8k8m12N40n89K29J99l14J08k5k45P4K20J39j79j95
2444b45M43m20J9K80Qo0Q4j67Q8J19J86q8l37O67p65J79q2J9m17K90R1l6J0j40
2468b74J67J87k79J5J05L10k03J77l30K06K87l91l55M90O2j29j75N0j8L7l3j68
$$ plain form
2308 -64 -356 -4 -11 -116 -59 -44 275 160 -43 135 258 94 -328 -14 -122 16 148 -8 -169 -130 -9 -281
2330 -281 17 76 39 -231 -155 149 11 -18 29 50 -186 -282 -252 68 96 33 -64 -61 215 -14 -598 -198 -30 -46 -31
2355 -31 104 -127 -390 250 -208 -37 128 -36 14 -198 3 158 -23 292 261 -128 -232 224 -140 140 -228
2376 -228 -221 97 250 84 -12 26 -59 408 -24 -186 376 219 -232 -36 46 -266 -129 -23 151 4 -206 70
2398 70 -159 -152 121 181 168 172 -81 -19 208 210 -266 54 262 225 -38 -142 -173 -194 -86 -120 -151 -260 -336 97 -206
2423 -206 -26 196 -348 256 135 233 205 -207 333 -256 -27 172 -142 -34 -59 -304 -230 -10 129 -50 -245
2444 -245 198 -222 -203 77 85 25 109 -58 30 149 335 247 -90 577 -188 -9 -91 -72 -489 -199 -108 -144 -134 -274
2468 -274 -107 80 -199 -184 -79 231 28 205 -125 81 368 -23 -378 112 174 45 -130 -80 -98 -61 -94 -262
2490b62K72K32k10r5j37L07j04j80J44M31p64K02L19k10K12k24KrJ37k67J26J51
2512G3m8J1m4L41l17lrO0J3J17j68j23j7L04l51J31K42p2j12j81J17J55k27J55
2536D7n3M3r3q9J04L89k53J01k45N34k26k73J47J66k96k53R5oK3k63K70K5k1r3
2560b20K00j8P2j3OJ74N4L3j38k53M45n30m8O9K36j80j10J22K44j42n3J35k33
2583a48K89k65K41j04k26L69j47m0M00n04J2N0M38k84k72j40M47k57J04j20J07
2604e0L6r5J00M7J27J07p4l51K18K22l27j00P2j1Q5l98O01n12L74J8k87K34q6
2627e0k32K37R0n5p6J54L19j60O3l57J26n0K28l90J6L54m08K1K97k12j65J1J32
2650a07K11mj73K08K8J62r4m5J16j87k73K26j06o4J87J3j30J05Q4n05M81M18m17
$$ plain form
2490 -262 10 242 32 -63 -200 107 3 -177 -33 398 -366 -164 155 -55 157 -67 -65 -74 63 -204 -78 73
2512 73 25 36 -8 333 16 13 4 64 77 194 26 -97 -114 190 -161 -30 212 140 28 -153 -36 119 -108 47
2536 47 -6 37 -56 -145 -41 348 95 196 -49 485 259 -14 133 299 3 -250 -155 -161 -138 -401 -131 -106 -127 -220
2560 -220 -20 -38 34 21 27 201 255 288 150 -103 342 -188 -236 -167 69 -111 -221 -99 145 3 -50 85 -148
2583 -148 141 -124 117 13 -213 156 9 -31 369 -135 -123 -73 365 81 -191 -331 116 -141 -37 -157 -50
2604 -50 -14 -109 -9 38 165 272 198 -153 65 287 -40 -140 -68 -79 6 -392 209 -303 71 89 -198 36 -50
2627 -50 -282 -45 45 -10 -86 68 387 227 290 -67 59 9 237 -153 -137 217 -191 -170 127 -85 -250 -239 -107
2650 -107 104 100 -73 135 163 325 231 186 302 115 -158 68 -38 -102 85 98 -32 73 157 -348 133 551 134
2673A34l64J40J59R9j23P1j07j60J49n8K02j08m8k77K74L6l05J19K92l99J76R6
2695bJ24J95l65L0K69l69N4K71l44L05J08l92O7J78j58j01m2L24j78O5r2J99o0
2718H6j80k2n4K87J06j86n8K29j19j32Q8N4k5k93MK14KN9L3l33J39J03j77K44
2742F9j18J59r8K7K7R0m34k9L34O9j06j1J79l46L10j44k05J80P7l89L74K88R5
2765C98m78K40k63J36l59K14R0J31P0l60L72l63K4J84q0Q2j27J14j36J88o3L56
2787C70k04k21L87l53J69J4k05N1lJ61j90L1r9J43J68J10q15K88K13j26K3J21
2809C3K61j66l6p6J36N5o6k81Q5J60J66k08j50J45j67O4K16J2K0k45j10J0L63
2832B21l05J60K9l8o9j07Q9Q4p3k2l9L5K44k44O9k0k52j30L55P8j12j3m51K91
$$ plain form
2673 134 -230 -90 69 168 45 116 9 -151 -2 -60 142 34 -14 -291 -17 19 -286 -167 125 -274 -98 -2
2695 -2 122 317 -48 -18 251 -118 -64 207 -137 168 276 -116 -49 129 -29 -130 -172 152 -26 39 -53 146 86
2718 86 -94 -116 -170 117 223 37 -21 208 89 -43 45 99 74 -219 -215 -1 1 60 93 -240 -101 2 -175 69
2742 69 -49 110 12 39 66 156 -278 -307 27 96 -10 -21 158 -188 122 -22 -227 -47 30 -359 15 303 398
2765 398 -80 160 -103 33 -326 -112 -22 109 179 -181 191 -172 -148 36 -44 38 -89 25 -111 77 14 370
2787 370 166 -55 332 -21 148 162 -43 8 5 166 -24 7 -92 51 219 329 -486 -198 15 -111 -88 33
2809 33 294 128 92 16 152 207 141 -140 -55 105 271 63 -87 58 -109 -45 171 183 203 -42 -152 -142 221
2832 221 -84 76 105 67 -2 -109 -20 64 -9 -31 -70 -35 209 -35 34 14 -238 -368 -13 65 -47 -60 -511 -220
2856b20M51j70J24l9j10Q9lp1k4p9M4j03P5O7k8k9km1JM57k76p1m0j52L82r7j47
2883a2J2p2K52q2j94K71m2M8k9m29J48j81N67k32q6J94j59J02l3J08l10l8J78
2906a9Q6J59l62R0K01j21j13k70K14J80J08l34J02J88n8j24R4oo2K15N7j49p9
2929cN8m35K48L66l63j87J54K64K5k16J39j39K66k84K16k8Mj5l0K88m26p3L78
2952B07k48K14j78Q0k17J19O2n1l59L45K62k39l5O6K35l09k2K61J4j90j17PL8
2975e5J5O6m2J02m20K61K55r3k16k8J62M1P4l55J91K95j66q0m5K21j56k49N5j09
2999b76J47R7M2J71q9K75l93j05J33j20k37M92L0j70J40l01K4K13k23j13M34n14
3021c43L79j81J59R8k42K81J9J4j96j7J40J06m7m78K12K57j94K52K8p0J33m16
$$ plain form
2856 -220 231 61 185 146 36 125 122 51 27 -52 -8 -111 -36 31 3 -26 -28 -69 -68 389 113 42 2 -150 232 135 -12
2883 -12 0 -72 180 98 -96 175 133 181 152 -277 -129 -310 257 25 -61 133 -26 76 43 151 -159 -197 -19
2906 -19 67 226 -136 -46 155 34 -79 -349 -135 45 153 -181 -79 109 51 -73 21 15 -47 168 225 76 -3
2929 -3 55 -380 -132 234 -129 -316 -162 102 127 -89 50 -89 177 -107 109 81 85 70 40 328 -98 -171 207
2952 207 -41 173 -5 75 -142 -23 39 -12 -371 -26 236 -3 -38 28 263 -46 -68 193 207 17 -100 -93 -55
2975 -55 -40 26 -16 86 -334 -73 182 89 -127 -155 7 48 122 -233 -42 253 87 7 -38 183 27 -222 -167 -276
2999 -276 -129 -32 10 181 92 367 -26 -131 2 -118 -355 137 167 -3 137 -164 -140 73 -150 -263 171 -343
3021 -343 36 -145 14 112 -130 151 170 184 -12 -29 111 217 170 -308 -96 161 -33 219 247 177 310 -106
3043a06l21Q09m33K7j92J22j84M16m50N90l53j41N6K04J97l1n5m04L25j8k04m9
3065a95K1J93j19Q8L72l67K9P6N4n0MQ3L1o2m9m2j52K63j29k42J92J72k01j44
3089a74M4O6m1J01n5m7K22K2k09m4L09l6j67j70K02J13Q0k63k02K9L2K23n4O8
3113D9l26J8Q4J67R4l13L88LL0J42j65J6j59j25lJ98J01l2k47j77O6K48k27K50
3137H0j69J34M2o4o8J15k37q1L14l1j09j07M8K35J75k04k63L59k69l24L88k02
3159b38J97m8J42P3l8R6l80J39J97j51P1J5j9o4j67O8J12Q0k37L62o1k5q6p2p7
3184a11K9L28k29p9m1L0N6LN8J11q9O4R2j39j56L0K01j21k28M3K81kj98J14K7
3209G4r0J84j89j1J24K7J17m01K34j96oL9PJ66K31l85O7k2q8L1R5L32k89j98J66
$$ plain form
3043 -106 -427 382 -51 -24 -216 -94 -278 138 -312 278 -75 -216 -160 44 241 210 155 -249 76 58 -146 -195
3065 -195 -174 19 -100 -12 360 -7 22 98 152 102 106 189 220 158 109 67 -85 178 49 -193 -1 171 -30 -174
3089 -174 -130 -64 -105 -4 -59 -106 116 138 -71 -115 194 158 -9 -179 23 136 216 -47 -249 -220 -188 35 -19 49
3113 49 -277 -259 -175 -8 86 -227 161 164 194 336 171 187 28 -97 -100 98 199 167 -80 -257 -191 57 -170 80
3137 80 -89 45 87 23 -45 70 -167 -248 66 35 -74 -181 -133 102 277 73 -190 169 -100 -424 -36 -238
3159 -238 -41 -89 53 126 88 184 -196 -57 140 -11 60 75 56 -8 -175 -107 5 85 -152 210 149 124 38 -34 -111
3184 -111 -82 246 17 -62 -103 -73 -17 -14 44 155 66 130 222 83 -73 -43 158 37 -191 -148 133 131 -67 47 74
3209 74 -16 168 -21 -32 92 119 236 -165 69 -127 -133 -94 -87 79 310 -75 -8 -30 -118 -87 8 340 51 -147 19
3234A9R0l85L03k67L25N6j35K47L2m16P6j03L89l55K03j6J12r6k01Q3K13j99j8
3257d3PK33p2l52N15j57MJ12k65O4J96m52O9K04o2J98m00L0J73K9q3nL14m63K06
3282@N5K03k89m3J30k88J80J85m61L94j08q6J87rL6K39l50n8k04N44l86J43J7
3305C1k32L09k14q6N06k06k78L78j22P9j0j01m18J60J24l8R5L4K90O6k50j28q9
3328a00O8n0K90l70J14o2K26l60OP5k9K97Q4m38O0L18j62J98r9J56j36l08K36
3351A4k98K6L61p2K51m22L26m09K02Rr8o2n3K89j88R2M34k93l26K3K18J0o1q5
3375a12N2kp4p0R0L04k50j16J92p4O5np4k06L03J20j65Q6R1k53K23j39k7N8j17
3400a00p4N7J82m56L62p5R7R2l9j86J96l3l01K86J97j05J43l61L92r0k36r3J90
$$ plain form
3234 19 109 -276 27 -240 85 141 6 253 285 -131 -55 -158 231 -124 79 63 175 79 -122 -39 174 -25 -43
3257 -43 -36 197 125 -227 288 131 135 247 -18 46 242 -210 -141 63 1 199 -201 -171 2 31 -52 -57 257 -206 0
3282 0 55 258 -31 -74 56 -232 -52 133 -328 66 -42 -128 59 50 86 325 -25 -83 -287 257 -129 14 31
3305 31 -201 108 -106 -192 314 108 -170 208 86 165 155 54 -364 -204 -80 -118 -23 11 301 367 117 -11 -100
3328 -100 -32 -82 208 -162 -48 -110 116 -244 -238 -163 -192 105 189 -249 -189 129 -33 165 66 222 86 -222 14
3351 14 -284 -258 103 31 282 -140 186 -223 -21 -12 -110 -172 -225 64 -124 -32 402 109 -217 -194 24 34 -27 -112
3375 -112 -60 -62 -136 -206 -116 188 -62 -178 14 -60 5 0 -74 -280 23 143 -22 64 155 -98 125 -14 -41 17 -100
3400 -100 -174 -117 65 -391 -29 -104 -7 85 46 -140 56 23 -278 8 205 100 243 -118 274 184 -52 -145 45
3423D5n5L3n0k41N46n56J97K36m01o2L85k6L3r1K06m03K92K3l54K97J70k00O7
3446I1K1o6K9k67K50p7J60n5k69j07M32p3j00J33l5J90q1k50K62J19l75q0J07
3469d1q3J5M7J98q2R5k1j74J41p5q5j42J88j68J15J04o2J06L6k97J74J8J60J40
3493C07l90j15J05M14m47J42R2r7K3M3R9k54L3L3J89p3j60K86k96K06q8R9k89
3516a38J3j6n5J65J66r0M0m1O5j43r3J24M6M1nk14Q6Q9L0J26j73K35k64j36K14
3541G2L0k04RJ93J72j16l15K9Q9K38k23rJ31P4j34j07N7j48%N1J97k92L47Pl42
3566a94L70po7j32K27J19k97k45K66l20J88K78p1L1j88o7J90R0j85j53k0J87J14
3589A14k38K8n2K10r4K68p2K4k56J34K52m91K67%j93K07p8m40L50P4j23oN0J60
$$ plain form
3423 45 -10 23 -27 -268 278 -278 -81 155 -246 -308 77 51 84 -7 199 -204 88 111 -243 54 224 24 91
3446 91 112 46 75 -192 58 -19 141 86 -183 -290 142 69 -31 102 67 257 176 -74 188 307 -68 -148 -41
3469 -41 -124 -109 -62 136 54 149 128 -46 95 20 -65 -207 -19 -187 -72 32 -30 76 112 -185 -11 7 167 307
3493 307 -83 -198 -93 321 -126 16 108 11 34 77 176 -78 -45 -12 177 104 -56 230 -66 140 52 151 -138
3516 -138 -125 -141 -196 -31 135 45 85 44 109 -34 -127 -3 43 84 79 -135 -49 40 70 196 23 258 -6 -142 72
3541 72 102 -102 -93 100 272 156 -159 -130 -41 197 -26 -35 96 170 36 -71 -14 -162 -162 -111 86 -206 141 148 -194
3566 -194 176 169 102 -30 197 316 19 -226 40 -280 -92 186 115 146 -42 -109 81 171 -14 -167 -187 0 114
3589 114 -124 -96 -148 62 -32 236 164 188 -68 66 318 -173 94 94 -99 108 30 -410 -60 14 -109 -115 -65 95
3613I5m2l24N19p9k87K34j64J37j13J10q4K30l9l42L36Lk97j25J28J86lk03L28
3636B04j2j59l7n4Q1j09L18j12k88K15j21k21J55K76j33m17K07K77J92k76n9j42
3658b15J44r0K71j51K00L86l33k33J63k1j4k77J77p9j18R1M8j56K35q6K37k60
3680h1j56K54J6Q5k74k73N25J41m96J19K33j09l11K10K16j37K56k80j09J87J20
3701A36j56J54J94j92j03J65k75M29j16k76P6l20K44m9K00n2j67O1P9l16K69j59
3723a74M2J88k5J19p4j33k49J41K22k71J48k79L01N5L9J13m19K92k24K87k29J4
3745a16J32j4J37j63J81k76L95l32K87m57L33ml48K93nq7j70M23l95L6J67j36
3767a19K91J6j70k3K4K69k80l2K41k56k52J47K15j10J7J47Q8k54M6j63N9o2K76
$$ plain form
3613 95 53 -271 248 169 -118 116 -48 89 -24 86 2 232 193 -149 187 190 -107 -232 -104 82 79 -124 204
3636 204 192 33 -4 -58 23 -86 232 120 -168 47 -74 -295 -140 136 3 -414 -207 70 262 -14 -73 -215
3658 -215 -71 -161 110 -41 159 545 212 -21 142 121 107 -170 7 -72 -190 -99 -51 -207 28 -58 179 -81
3680 -81 -237 17 33 118 -156 -429 96 237 -259 -140 93 -16 -327 -117 99 -38 218 -62 -171 16 136
3701 136 -20 134 328 136 33 198 -77 352 236 -40 36 -284 -40 -89 111 59 -108 -47 32 -284 -15 -174
3723 -174 -132 56 31 150 76 -57 -306 -165 57 -214 -66 -345 -44 11 50 163 -256 36 -188 99 -130 -116
3745 -116 16 2 139 -24 157 -119 276 -56 231 -226 107 103 -245 48 43 -44 -214 209 -186 -150 17 -119
3767 -119 172 188 18 -5 19 288 8 -24 217 -39 -291 -144 71 -39 -22 125 213 -41 5 -158 -99 -161 115
3790A15k96J8J40J07P9j24j7j51j64K00J82K4p9j47K25l34R3L56k79k9R8J08K0
3813A45n1j12J58k29K09r2k74J60J99p2j2N7J89j24k43j98m4M15r6q4O5J63k00
3836g1j58J91J62r9R5j8n7j4K50k54l3J92k69n3j39N76k23m48K69R1lM9j38J35
3860C3l6k2n2R8q4J13k08K59o9j07p3j47M3J54K10l56O03j88j14k1J49k62O3J48
3884A34N0j52J85m0m3K02m9m42R7O2j96j47M54M0Q4l34J15N9k31N5J41K70q1j19
3908A14k02J6o9K34k20k7M15j44l10L3K6J29j01m7J63J05N7k01J4Q5q3k04L11
3931I4J43k38K1K2q8L6j9ll1J1j89K64K3j69K15j82N1J26j40J34j03N3J3Q9J17
3956B50k13k16J56j36j72L85J52l62K77q6j22K31j21n3J99j08j56J50j40K32J7
$$ plain form
3790 115 -181 -163 -23 84 163 39 22 -129 -293 -93 89 113 34 -113 112 -222 -129 227 -52 -81 17 125 145
3813 145 94 -18 140 -89 120 28 -246 -86 113 41 29 86 275 151 -92 -290 -334 81 -15 -99 -34 129 -71
3836 -71 -229 -38 124 25 120 102 45 31 281 27 -6 186 -83 -136 -275 301 78 -370 -101 -10 -13 36 -102 33
3860 33 -3 -25 -77 21 -63 50 -158 101 32 -75 -148 -295 -252 -98 112 -244 359 171 57 36 185 -77 -14 134
3884 134 184 32 217 177 134 336 287 -155 -58 4 -192 -339 115 155 239 -95 20 79 -152 -97 44 314 233 114
3908 114 -88 -72 -141 93 -127 -154 261 117 -193 -160 -134 -5 -106 -153 10 115 172 -29 -15 70 -13 -217 94
3931 94 237 -1 20 42 -46 -10 -29 -32 -63 -52 -241 23 46 -123 92 -90 -39 87 -53 81 -22 31 44 133 250
3956 250 37 -179 -23 -159 -331 54 206 -156 121 35 -87 144 23 -30 169 61 -95 55 -85 147 164
3977A64l00k6N06m56J97p3j08p7J48K38n3m44J26R3P7p9O9O6k4l32K52K05l0m2
4001I7k60K72k96NK38J02j34k39J89K35j88j93L61q7J02Q9k85O5Q0Q3k40pR2k03
4025a22kK07J00r4k43Q9P5pQ7o5k6j6qoR0l69M20J13m57N11l32J89O7J33l11k16
4051a93JJ68J35l6k71M6N18n68J94p7m0n3O9J48o0K44p4l50O9J61j54J02J08l05
4075b18qJ51m9O8L3r2j78M52o8k97J48M17n29j66L35M1n7j50j3K64j44k9m8J28
4099iJ61l35O8l24Q33n03K33k38nK07j81M37j94M1j43P7l42L49k77J08j05q8L22
4122I2l37M70k09N4l44J37O9N8J01M5L2j2j82q8J84l9m2o7O6Q1k28LJ56j9K36
4147B17k07j01J24J45k9m2j15J23M5k49J29L40j89l58K36m31L01j22q8L12Q2l84
$$ plain form
3977 164 -136 -162 344 -112 85 12 -96 -173 -25 213 160 -284 -158 -65 12 -67 2 68 44 -288 -36 169 139 97
4001 97 -163 109 -187 -182 56 158 24 -215 -26 209 21 -172 189 102 204 293 8 73 153 236 -4 -11 81 -122
4025 -122 -124 83 183 89 -154 -65 10 3 90 25 -1 -17 -25 -31 59 -310 110 223 -234 277 -55 134 201 334 23 -193
4051 -193 -192 -24 111 75 -196 -150 368 -200 -6 -83 -123 -176 -107 41 -19 225 151 -199 -130 31 -123 -21 87 -218
4075 -218 -226 -75 -124 -56 -23 -115 -293 159 91 -206 -58 359 -170 -336 -1 40 -17 -167 -180 84 -60 -89 -137 -9
4099 -9 152 -183 -115 -439 394 -109 124 -114 -119 88 -93 344 150 191 48 125 -217 132 -145 -37 -142 -230 92
4122 92 -245 225 16 70 -274 -137 -68 -10 91 136 168 156 -26 -114 70 31 -11 -78 -12 69 -159 -156 0 -19 217
4147 217 10 -91 33 178 149 107 -8 115 160 -89 40 380 191 -167 69 -362 -61 -183 -271 41 123 -261
4169b61K02Q5J17O9k27M6J81n05M43j97J13j54J98k13O7p0K47m33M07k33L04q3
4191A03k52K04j01j9J64j49O5m9P0j72N2J58j63n1j5J56J5j76K61l6RN9K0k88
4215a35j22M81j50l7j88j24K53M33l59l5K5O1r1q1q4M56k33j80J06o9K39j52j82
4238a68K73m2j1r6M5k7J20J18k6k86J68j43N5J58m8j4j21pM3j56K54J04j25k76
4262b08M3K5K30J9J00R0m54R9K6N7k20J16o3j91K59K5K44k96l4K9J34K0k0l1j46
4287a47L7K15o9L0K25l64Q1k7J31m2k57L81k56J45j3l1j40j77J92O5K07j38k29
4310a81L73m9k54p7J83J33k03Q4K27k41k59M73m57K99k67L29M5k75j24M32k64
4331g3k6J03k0o2RJ49J99l29j39Q9k51K61K27k58J2J29j24L43n01J88K7J05o1
$$ plain form
4169 -261 -59 26 143 212 -15 31 212 -293 150 -47 66 -88 110 -103 -36 -106 141 -292 115 -118 186 103
4191 103 -149 55 -46 -65 99 -50 15 -34 36 -136 -84 74 -89 -140 -155 1 16 -160 101 65 74 133 153 -135
4215 -135 -257 224 74 37 -151 -275 -22 411 52 17 42 103 12 -69 -153 303 70 -110 -4 -73 166 14 -168
4238 -168 105 63 52 -44 1 -26 94 212 186 -100 68 -75 -20 138 90 76 -45 -52 -9 -165 89 193 68 -208
4262 -208 -165 -140 90 109 209 299 -155 -56 -30 27 -193 -77 -140 -331 -72 -47 197 -99 -133 -104 30 50 30 -1 -147
4287 -147 -110 105 36 66 291 -73 8 -19 112 70 -187 194 -62 83 70 39 -101 -278 -86 -21 186 48 -181
4310 -181 192 143 -111 -188 -5 128 -75 9 236 -5 -264 209 -248 51 -216 113 158 -117 -241 191 -73
4331 -73 -99 4 -16 -78 -69 80 279 -50 -189 -100 -351 -90 137 -121 -109 20 -104 239 -262 -74 -47 58 -3
4354cQP2j68p2K69j84m6L23o2j08k13L11j09p0K0k36N72l87Q2J58j15k11K09k56
4378b16K68J83j22k27K43l41J91R8j65J33k59K22p9k02J06K45k11%J39o2Q4N6
4400H4k95J77N1N4O8L8m66J54O3j71J68o8J3L06p2l62K38l38M58k09J69j37Q6
4423IJ53m11L96q3k4o5QO6J58j36J23L1l81J94P9K6k22K43K08j88j87j1K11j69
4447B8k97L79M6j1j47k26L49l38K02O9O3l09L35q5q0j49R7K79l34p2K83l5k57
4470b10K87r4j37J39k02J3K03R4j26L2l78Q3K72P1pk98Q5O5J33j73L83j55j66
4493h6r6Q2J12j81K57k45L83j04k01J29k20k5L17M9m97N68j96O9J9k4J2k30j19
4516b27L67R1l56L20q7j3k1j58J10k78L17j10K48k01m6L73n21K26J66k53P3j06
$$ plain form
4354 -3 5 77 -91 -163 106 -78 -124 199 137 29 -184 127 18 -52 -32 -268 304 -83 -1 157 42 -169 40 -216
4378 -216 52 235 113 -114 129 -212 -21 77 -88 45 -214 8 -71 -273 -167 78 -133 -133 6 -56 28 84
4400 84 -211 -34 17 71 139 177 -289 -135 -72 -243 -75 -143 -130 176 104 -258 -20 -358 100 -109 60 -77 9
4423 9 162 -249 147 64 40 -25 -17 49 207 71 194 225 -156 38 117 143 -79 164 372 184 -3 -14 197 28
4447 28 -269 110 156 145 -2 -228 121 -217 -15 54 117 -192 143 58 -22 -171 -74 205 -129 -201 82 47 -210
4470 -210 77 -17 -154 -15 -217 -204 -1 93 -33 -1 -379 -296 -24 47 40 -258 -173 -108 25 -148 235 80 -86
4493 -86 -182 -100 12 -169 88 -157 226 122 -79 50 -170 -195 122 171 -326 242 46 115 134 110 122 -108 -227
4516 -227 140 231 -125 195 108 95 74 -84 26 -252 65 -45 203 2 -44 329 -192 34 200 -53 20 -86
4538h6oJ37Q2N2j57o3p9J25o2J53j06l2l3J45O7p7j3j18J76M0rl79K89J47k26
4563c3j70N2k6K33l05L78P5k93MO2l36K40J89k18J06K8K20l61K1L02k70K72J66
4586C36o11M39qn4l47L78l74K47j81L22l69M17j31j11J45j64k8P4j56K29k01J63
4608A5J43m9k62J9L4k16O41j93l16J62n9k21L65j90J19j06K23N2k32P6K10k23
4630hJ6J7j31j59N32m62L63pk21K62o8k66M23k92j32Q5L62k34k6L86n90L2r6J98
4654a6L3j57NK52j53L72k79N0l53K58Q8K9P3j65K25k91L90n21K66k31Q8J1l1R7
4678D0l74M79j42k15K57n4r5K68m2k31J4j6K57j53K0L6J02l57J65l7R6m7j80K67
4702E8nk4J11l32L3J64Q0j19l6J80m6o4r2O6k83K96j89J25P4j3j12o6M55m59M64
$$ plain form
4538 -86 -92 45 127 179 22 -41 -120 5 -57 96 -10 -42 -75 70 137 60 47 -71 105 145 136 -243 46 193 -33
4563 -33 -203 -151 -177 56 -249 129 204 -89 -85 -23 -359 -119 70 -148 -42 -14 206 -155 -134 168 -102 170 336
4586 336 -275 164 156 102 -245 133 -241 6 -175 147 -222 195 64 -47 98 -66 -94 -20 -176 53 -148 15
4608 15 158 109 -153 -134 -100 -316 325 132 -184 -22 -81 -302 63 -127 -8 -114 109 161 -71 5 215 -8
4630 -8 8 25 -106 -265 267 -195 168 161 -60 202 134 -132 291 -1 -133 -48 314 80 54 440 -150 -118 -214 -16
4654 -16 17 -140 -135 117 -36 336 57 107 -246 12 100 129 202 37 262 -29 361 -160 106 -125 -37 -26 -57 40
4678 40 -334 145 3 -212 45 -9 -104 164 122 -109 -95 -111 146 -7 13 49 151 -206 -41 -78 18 -29 -209 58
4702 58 53 29 140 -192 -159 5 85 -34 -70 110 64 0 -92 -26 -309 -13 -202 -77 -3 -16 -128 -194 261 -198 266
4727B66j83K95l66K6%N9j7KJr7k61K82K11l79K1J24R0k22J63j0Kj41m1K70N5j76
4753b6j99L08k5J11k81m2o1K32k73L52PN8j33j00j61K80J63Rl01K6q1K13jr5p1
4778i1jJ12L5O5r0j43K95j10K4p9N8k6j11o3QK42j74Q1k35K70l53K44K85k99J24
4803F8k73K48l0J47k4j23L63l49k28K33m8K83k69P3j92L36k97L1K16Qk14p2K49
4826A36j19l2k79L66j51N8J78lm2l08J89M8k3K37j61k70n9K66n9N9P9K85l39k5
4850C1mn0J71o1j21J4m3j71K23P7K7j57K1J63j53J08j35O3m7p0L74j68n3p9KK
4876c6L0K7l0m0J07n5m1j65L97j52M9K8Q4l36R8q8J32M00k87p3L6j1j63M05k24
4901I2JK55n34M35m14J62K79l54p1K21k61O0K48N8m4j14j09L49k77k34R4L46l42
$$ plain form
4727 266 83 378 12 38 38 97 80 82 83 -14 -275 7 218 -161 -140 -16 74 -148 15 5 7 -134 -175 95 150 -26
4753 -26 -225 83 58 169 -112 -154 -215 17 -256 96 103 161 28 -72 -233 47 210 219 -82 -56 -137 76 75 -20 -91
4778 -91 -92 20 55 120 30 -113 182 72 96 17 75 49 -62 -125 -117 125 -49 32 -203 67 -286 -42 243 -56 68
4803 68 -205 43 13 160 136 13 376 27 -201 32 -16 267 -2 71 -121 215 -82 -51 165 173 -41 -113 136
4826 136 17 -15 -294 72 -79 -21 157 154 112 -196 -7 41 18 255 94 -176 -235 31 -28 31 110 395 56 31
4850 31 27 -23 148 87 -34 -20 -63 -234 -11 66 93 -64 -43 120 -33 75 -60 3 -44 -114 260 92 39 -40 -38 -36
4876 -36 -6 21 -9 -49 58 3 -38 -203 194 42 91 119 203 -133 -35 -123 9 409 122 49 85 74 -89 316 92
4901 92 93 348 -186 249 -165 -3 276 -78 -149 72 -189 -129 119 177 133 19 -90 259 -18 -252 -158 188 -154
4924a54K5K80M1j89o7l5J67n7O0j34j05J2O53o05J15j68j06M00k09J29L7k11J03
4947a8j16J1q6J14J35Mr5j04rJ04j2K67j07p2K07j81p9K82k55N8K10k95p7j68
4971b82K62j63K81j87l3R2J84k6p3K7r9j20Q0J50j61k01J82j8J86l37K03J23J7
4994H7J57l19J39k06K62j91RL2J20j93K11k16j06J96k6K30j72J53k25q0j35L48
5016G5L23k82j32k3K59P8j88K3j26k17N25m26j42J09K82j46P6K7k47M35l53K91
5038B21p4rL7J91k43j47p2j41J98K1O5k33R5N9j09K60m65O54l10K6R0k30Q3j19
5062a52P2L9K14J06l78Q5P3K42j81j48J26j01K78k3k68K9K5M3J01L7l65j51K38
5085e9k64M57k41P7N9r1N7j02K6o7K43j48j89J08l8L61j35K0o3n1L65m60L79j42
$$ plain form
4924 -154 -129 151 192 3 -64 -99 68 11 71 -63 -168 -156 497 -108 7 -161 -267 133 -76 53 90 -121 -18
4947 -18 -134 -123 -209 -95 40 44 -51 -155 -164 -60 -72 195 88 16 223 42 -37 245 -10 48 258 -37 -114 -282
4971 -282 -20 -183 98 -89 -122 -30 154 128 55 82 -17 -137 -57 93 -68 -269 -87 -105 81 -256 -53 70 87
4994 87 244 -75 64 -142 120 -71 -62 -30 90 -103 108 -108 -214 -18 -44 186 14 167 -58 -138 -273 75
5016 75 398 116 -16 -39 220 298 110 133 7 -210 315 -111 -253 -144 138 -8 68 95 -152 283 -70 221
5038 221 147 138 175 366 123 -24 -96 -237 -39 -18 47 -186 -91 -32 -141 119 -346 308 -2 24 114 -116 -33 -152
5062 -152 -80 -41 173 279 -99 -14 59 301 120 -28 98 -3 275 252 -16 13 38 81 182 219 -146 -297 -59
5085 -59 -323 134 -107 -30 29 -62 -5 -107 -81 -148 95 -53 -242 -134 -172 189 54 74 11 -40 325 -135 244 102
5109A02j45J56p2%r9L25k0m0l74p2L37m3k19O6J86Q9m80J99Q9K17k84J98m4O5
5133A37o0M4O0k01K26l82M44m9k51J04J65m82L13rL8j27JK01j32m46N25Kl57L11
5157G5j62p4K88J36l41K56j51J2k47K59l79M72m3q2N5q3r9MJ43K00k69LK25r9
5181I9K14n22J91m5J65k71M51k21k19M21j84j18%K33l54J16J70j89j12j50K24
5202a01P6l2k6J9K0L3P0r2j16J60K23j53Pj85k16J66J88l12K29l1K52J56n44K78
5226F9J34j71k00J29K3l0j0J37r0j13J18j86Q8o0L77l39K25j19K86q7j07j07o6
5249i9J50q5l2j22J56l3J25j79K82l38P9K03j81K93j60K48m00k07J63K01j58K24
5271A30p3m2j85J57j59L4R8j81K24n1J61m34L72q6J7J49j17%N3J34l62K68l73
$$ plain form
5109 102 -43 113 41 41 -58 267 247 207 -167 -239 98 55 -164 -98 88 177 -303 -104 -15 202 -82 116 72 137
5133 137 77 121 181 -20 206 -176 268 219 -32 72 237 -245 68 59 97 -30 -29 172 40 -406 119 121 -236 75
5157 75 -87 -161 127 263 -78 178 27 39 -208 51 -328 144 101 19 74 -9 -108 -104 39 239 -30 -27 198 99
5181 99 313 -209 -18 -63 102 -169 282 61 -158 263 79 -39 -39 194 -160 -44 126 -63 -175 -325 -101
5202 -101 -25 -57 -83 -64 -44 -11 59 -33 -149 11 234 81 88 -97 -313 -147 41 -271 -42 -73 179 335 -209 69
5226 69 203 32 -168 -39 -16 -46 -56 81 -9 -122 -4 -190 -102 -162 215 -124 101 -18 268 181 74 -33 -99
5249 -99 51 -34 -66 -188 -32 -65 60 -119 163 -175 -96 107 -74 219 59 307 -93 -300 -137 64 -94 130
5271 130 57 15 -170 -13 -172 -138 -40 -221 3 -48 113 -321 51 -35 -18 131 14 14 67 201 -161 107 -266
5294b66L01J08j15j16k47J56K34m9r6J28j73O3J94j81J57J95m05L9j49L04j84
5315a02J38K7J79k89R9n4L0j91L41k57M4p0J5M2j12J40j4j80K21Q4Kk60K79k25
5339a13J23N7J31n90N19j61Q0j48J69j23K16p5k91K84j28kJ48l5P5J32k65J85
5361A88K1k39l2M9l35K42K05j18K72l05m1n2L06n0Q9k13K5M00n11L4N7O2j11L45
5385B88l83K70k54o4J72O9k8kp7N3J71k35j32K56k56R9K1o2Q0p2J24n0K97l60
5409g5Pq3O45j55l06J62q8l14L66q5l3k26J72J11m54R9L6N11m5l89R9L40k71J29
5433A53r2J60l73K33r8j61J81J07J26m22L12k44j7J66q4P9j80L17j30Q6Rp1k30
5456a73l4K17j81Q7oQ9n9J3O8j50J55j37L5J45J4k50N9J15J02k75M17k46Q7l52
$$ plain form
5294 -266 35 143 28 -88 -335 -179 55 6 -90 38 -135 -72 122 -59 98 293 -112 -73 -222 82 -102
5315 -102 36 63 242 -47 52 -2 28 -163 178 -79 -35 -105 -90 -48 -160 -20 -34 -214 7 91 93 -167 112 -113
5339 -113 10 67 198 -392 127 -34 46 -102 67 -56 160 85 -206 78 -50 -52 96 61 136 268 3 188
5361 188 209 -30 -62 -13 -348 -106 99 -19 253 -52 -93 -145 161 111 200 -13 12 412 -99 -65 -8 54 -57 288
5385 288 -95 175 -79 -143 29 98 70 68 -9 44 215 -20 -152 104 -152 -53 -32 -94 -14 -86 38 -12 285 -75
5409 -75 -68 -151 494 339 33 195 107 -207 159 74 41 -185 -13 98 -356 -257 -221 290 245 -144 -45 295 24 153
5433 153 61 221 -152 81 -17 -178 3 110 236 -186 126 -118 -135 31 -53 26 -154 163 33 119 128 57 -173
5456 -173 -207 10 -171 -84 -90 -1 -60 -47 21 -129 26 -111 -76 69 83 -167 -108 7 109 -166 251 5 92 -260
5480b60K68L1q5Q8R4R5n81N48j74l3K50j87j4K3L6o0J68k08p9J5L9J25k59K66
5504A06p1K95l64P3R0K00j01j75J15o2j90k9J51j24J87K49n45L90j12k96o4L35
5526E8m6k04K93L48o50K49k51J12J66j41Q3k83M42k67j37J87L01q6nj18J21j00
5548G2J01m25J33J2K56l22K00J47j19l09M69j13k01J06J59L7l42M21k78K6J34
5569A64l29J83qN4J72j7k45r1K51Oj18j92R8J26M8J9j08m1M5j50m8L80l72k7J36
5594f4J84J93m26J35K1M2j70J80j65M1K27l35J52l61L5J50J41P2j22J60J51q6
5616A55N5j63L4q4J58r6j88J50K50j23l05J54R0j25j75p4K68J13o7nj06rqK04
5640A03Pl25K96k27L09Q6k38L35l74J29k11J68j11p2L12k96K09R7k93J18L26k93
$$ plain form
5480 -260 8 39 -46 42 136 231 -350 198 24 -9 241 54 40 63 99 39 207 -1 -80 -65 -26 99 -160 106
5504 106 35 330 -34 39 129 329 228 53 168 106 -84 -113 38 -86 101 350 -195 195 83 -213 -277 58
5526 58 12 -192 101 449 -201 48 -203 -91 75 -66 17 -266 176 -91 -228 -41 260 174 169 51 172 72
5548 72 173 -252 -119 -107 149 -173 27 174 55 -254 215 102 -99 7 166 203 -139 282 4 30 164
5569 164 -165 18 10 64 236 219 -26 -117 134 140 22 -170 -72 54 102 121 13 -28 17 -133 -181 199 -173 -200 -64
5594 -64 120 313 -113 22 43 85 -85 95 -70 -29 198 -137 15 -346 -311 -161 -20 52 -70 90 241 155
5616 155 210 47 81 -3 155 59 -129 21 271 148 -157 -3 87 -38 -213 -287 -19 94 27 22 -84 -93 -101 103
5640 103 110 -215 81 -146 163 249 11 346 -28 101 -110 58 -53 -125 187 -109 100 197 -96 22 348 55
5662E5j33k38L05k2J62j4J1k8j36pK03j5j56p6J00J2r3J83m12K78P6j63k5J78
5686D5j95L07k52K72j71L5j45L8j84K49o0m2l1J75j59K91k57O0k53L48j33J80
5708A18mM1o2P3k25j00J92J39j71R2q1J5J10k58N2J42l1r4R2k2n9q6j75N56l81
5733a27J92o8P4O8j28O0l6j49K80k87K9Lq0K43J66K3k75O9J2nK8j27J57n4M2l45
5759b35oK47J33k89J33l0J11l22L51l0J41l36J42J24Ok21r5R3K78l87L19k17P8
5782a2K5j35J70M3J30n49L07J64l02K16o3p6j85M55k91K55PJ94n61J28K13k49
5804a16j1L82l23K36k65J94j21k39J57M0K05R5j05j14k97J75J45J93j93N7k77
5825a82P7K28o4%j50J12l07OJ87j70L79m15K04Q5q6J30K1j06J22J32k59J01k39
$$ plain form
5662 55 -78 -316 -11 -33 129 115 126 98 -38 -45 158 143 -13 -89 11 23 -70 113 -299 -21 55 -108 -133 45
5686 45 -150 157 -95 177 6 41 -104 -66 -250 -1 -61 -103 -134 41 -118 173 -84 -24 -277 71 -62 118
5708 118 114 155 93 166 -59 -159 33 172 1 93 12 27 137 -121 -69 73 42 -52 40 18 -41 -127 -302 254 -127
5733 -127 65 -3 71 139 11 71 35 -114 166 -121 -92 -89 -169 74 240 263 -12 57 69 64 92 -35 122 68 110 -235
5759 -235 -241 6 139 -150 -17 -47 64 -258 93 63 204 -132 10 134 140 -81 -176 -83 195 -192 127 -90 -12
5782 -12 13 -122 48 91 221 -328 -21 143 -159 57 -6 -82 -267 188 -103 152 159 353 -208 -80 133 -116
5804 -116 -127 255 -68 168 -97 97 -24 -263 -106 -66 139 234 129 15 -282 -107 38 231 38 95 -182
5825 -182 -105 123 59 59 -91 21 -286 -280 -93 -263 116 -299 -95 -10 -96 34 55 -51 71 203 -56 45 -194
5848a94J51JP1K2j49k3M7J47J41j2j84P5n5m67M62L7j53J56m1NK28k03l0p1k1
5873f0J34j84J55j96K40j87K9l9K77k00q5P5M8l4o5K5N1l53K20Q8O3Q1p6j43J21
5898a5k04K23nj82J50L3k3j53K8J05O2l0j7N4O7Q6Pk18J00m9J04J23m26J91J52
5923A63k38J38J01o8K48m17L4J29KJ12q1n3k44K79j58K98l54J75r5K07j55p0L1
5946a6K38j70J0O1Kn7n56M36K3J62j30lp9J36r8J19KJ76k95p0O2p7J18J80l20
5971a46J62n1J64j41J52p5q6L9m5K80m10K30j81j18L62q2M8P6j15j44j85J6L97
5994A47r6N9j8J29j87J60n3j12k02J72m7k88O18l64L16k84j39K79m8j01J07K9
6016G7J64k04No8L16l87K45o5l57M22k93K52K4k12j34J97J3K8k25J00K31j95k59
$$ plain form
5848 -194 -43 -42 29 51 -98 -121 -74 73 214 202 18 93 38 -429 33 70 -83 73 32 37 265 62 32 -39 -60
5873 -60 74 -110 45 -151 89 -98 -69 -108 169 -31 -116 -41 7 -27 -92 -67 -16 -369 -149 -61 2 83 7 -136 -15
5898 -15 -219 4 -1 -183 -33 0 -23 -176 -148 -43 19 -11 -28 26 93 179 186 -32 68 19 123 246 -180 11 163
5923 163 -75 63 164 96 344 -73 -39 90 92 204 123 70 -174 105 -53 245 -109 66 -29 178 23 -47 -16
5946 -16 222 52 62 123 125 68 -488 -52 -29 133 3 0 -79 57 -41 78 80 256 -39 -109 -47 -124 -6 174 -146
5971 -146 16 -35 129 -12 140 65 -21 18 -27 253 -157 73 -108 -226 136 54 102 178 63 -81 -266 -250 147
5994 147 51 110 92 221 34 194 141 29 -173 -1 -48 -336 282 -82 234 -50 -189 90 42 -59 48 77
6016 77 241 37 42 -26 290 -97 148 83 -274 148 -145 107 131 -81 -215 -18 -5 23 -202 -102 129 -66 -325
6039c25M43k06M1K17k86J78J29j69K6Q7k58L2N7L2M2k7j91L51k01j22R7L12m14
6062a55J42R5k7p6J87m2o5p7p0n1n7M19l36J6J36j42P7l2r9L27Mk55L0P6M1k16
6088a50J09k21J49l3K63k87K20J54j64o6j29k3M64m05J89k30J12K69l61L68k42
6109a4mQ9q6O9M6l2m0n5NM2r8L03o9J61o46K91K67m38K03j18L44j87o1K18k02
6134a2j34l6K30j99Q7q6L67M3r0j57Qo0j37K5M27k00j24j82J19J28j98O7J12r8
6158a00m1K61P2j73L45l80J5K7J65o2l6jK9l11J94j57qK78j73J01j28j27KK64
6182E6O2j95J37m5k2j92J11q8K92j74L9J91J19j92qk83k0M08k08M8k28K30O1J63
6206B62j76L8O3l22J59K39k19J59p1k99J78L90j92k22m3k97L48j76o2J33M4J50
$$ plain form
6039 -325 118 -88 -47 170 -116 62 191 22 48 135 -123 -91 -34 -2 40 13 -178 173 -28 -150 -53 259 -155
6062 -155 -13 82 55 -21 166 124 59 -18 -88 -139 -196 223 -113 -97 39 -103 -26 -58 -157 170 174 -81 -51 25 66 -150
6088 -150 -41 -262 -113 -146 117 -170 50 204 40 -26 -155 -178 286 -119 70 -160 -48 221 -140 228 -14
6109 -14 -18 71 -15 54 100 68 28 -27 -22 20 -78 225 156 317 -329 -38 229 -209 -6 -124 220 33 -28 190 -12
6134 -12 -146 -182 48 -151 -64 -150 217 260 170 13 21 -39 -176 -151 276 76 -48 -230 -111 17 -181 -114 -2 -100
6158 -100 -141 120 192 19 364 -16 -1 26 191 129 93 92 121 -190 4 -153 -161 117 -56 45 -83 -210 -208 56
6182 56 118 -77 60 15 -7 -199 -88 -176 116 -58 -19 172 291 99 91 -192 -212 196 -12 36 -192 38 99 262
6206 262 86 124 187 -135 24 263 44 203 132 -167 11 401 209 -13 -56 -353 -5 -181 -243 -110 -66 84
$$ [...]
8191D2
##END NTUPLES=NMR FID
##END=
