##TITLE=1H_Pr A-DMSO
 DMSO,8 sc, 
 27.10.2021
##JCAMPDX= 6.0         $$ Bruker NMR JCAMP-DX V2.0
##DATA TYPE= NMR FID
##DATA CLASS= NTUPLES
##ORIGIN= UXNMR, Bruker Analytische Messtechnik GmbH
##OWNER= root
$$ XWIN-NMR		Version 3.5
$$ Wed Oct 27 13:45:10 2021 Russian Standard Time (UT+4h)  she@DPX200
##.OBSERVE FREQUENCY= 200.1313468511
##.OBSERVE NUCLEUS= ^1H
##.DELAY= (6, 6)
##.ACQUISITION MODE= SIMULTANEOUS
##.ACQUISITION SCHEME= undefined
##.AVERAGES= 8
##.DIGITISER RES= 18
##SPECTROMETER/DATA SYSTEM= spect
##.PULSE SEQUENCE= zg30
##.SOLVENT NAME= DMSO
##.SHIFT REFERENCE= (INTERNAL, DMSO, 0, 15.7039)
##AUDIT TRAIL= $$ (NUMBER, WHEN, WHO, WHERE, WHAT)
$$ ##TITLE= Audit trail, XWIN-NMR		Version 3.5
$$ ##JCAMPDX= 5.01
$$ ##ORIGIN= Bruker BioSpin GmbH
$$ ##OWNER= she
$$ F:/spectra/data/she/nmr/H-F/1/audita.txt
$$ ##AUDIT TRAIL=  $$ (NUMBER, WHEN, WHO, WHERE, WHAT)
(   1,<2021-10-27 13:43:51.00 +0400>,<she>,<DPX200>,
      <created by zg, POWCHK disabled, PULCHK disabled
       configuration hash MD5:
       00 E9 B6 7A A2 85 ED C7 34 08 36 98 17 FE 4E 26
       data hash MD5: 16K
       4D 84 F5 25 3C 20 46 B3 DA A3 05 59 AE 99 55 0B>)
$$ ##END=
$$ 
$$ hash MD5
$$ DA 97 B7 A0 3D 57 8A 96 8E 88 E8 E8 2B BC C1 5A
##$RELAX= 
##$RELAX= 
##$RELAX= 
##$RELAX= 
##$RELAX= 
##$RELAX= 
$$ Bruker specific parameters
$$ --------------------------
##$DU= <F:/spectra>
##$EXPNO= 1
##$NAME= <H-F>
##$PROCNO= 1
##$TYPE= <nmr>
##$USER= <she>
##$AMP= (0..31)
100 100 100 100 100 100 100 100 100 100 100 100 100 100 100 100 100 100 
100 100 100 100 100 100 100 100 100 100 100 100 100 100 
##$AQSEQ= 0
##$AQ_mod= 1
##$AUNM= <au_zg>
##$AUTOPOS= <>
##$BF1= 200.13
##$BF2= 200.13
##$BF3= 200.13
##$BF4= 200.13
##$BF5= 200.13
##$BF6= 200.13
##$BF7= 200.13
##$BF8= 200.13
##$BYTORDA= 1
##$CFDGTYP= 0
##$CFRGTYP= 5
##$CHEMSTR= <none>
##$CNST= (0..31)
1 1 145 1 1 1 1 1 1 1 1 1 1 1 1 1 1 1 1 1 1 1 1 1 1 1 1 1 1 1 1 1 
##$CPDPRG= <>
##$CPDPRG1= <>
##$CPDPRG2= <>
##$CPDPRG3= <>
##$CPDPRG4= <mlev>
##$CPDPRG5= <mlev>
##$CPDPRG6= <mlev>
##$CPDPRG7= <mlev>
##$CPDPRG8= <mlev>
##$CPDPRGB= <>
##$CPDPRGT= <>
##$D= (0..31)
0 1.2 0 0 0 0 0 0 0 0.06 0 0.03 0 0 0 0 0.0002 0 0 0 0 0 0 0 0 0 0 0 0 
0 0 0 
##$DATE= 1635327830
##$DBL= (0..7)
120 120 120 120 120 120 120 120 
##$DBP= (0..7)
150 150 150 150 150 150 150 150 
##$DBP07= 0
##$DBPNAM0= <>
##$DBPNAM1= <>
##$DBPNAM2= <>
##$DBPNAM3= <>
##$DBPNAM4= <>
##$DBPNAM5= <>
##$DBPNAM6= <>
##$DBPNAM7= <>
##$DBPOAL= (0..7)
0.5 0.5 0.5 0.5 0.5 0.5 0.5 0.5 
##$DBPOFFS= (0..7)
0 0 0 0 0 0 0 0 
##$DE= 6
##$DECBNUC= <off>
##$DECIM= 32
##$DECNUC= <off>
##$DECSTAT= 4
##$DIGMOD= 1
##$DIGTYP= 9
##$DL= (0..7)
0 120 120 120 120 120 120 120 
##$DP= (0..7)
150 150 150 150 150 150 150 150 
##$DP07= 0
##$DPNAME0= <>
##$DPNAME1= <>
##$DPNAME2= <>
##$DPNAME3= <>
##$DPNAME4= <>
##$DPNAME5= <>
##$DPNAME6= <>
##$DPNAME7= <>
##$DPOAL= (0..7)
0.5 0.5 0.5 0.5 0.5 0.5 0.5 0.5 
##$DPOFFS= (0..7)
0 0 0 0 0 0 0 0 
##$DQDMODE= 0
##$DR= 18
##$DS= 0
##$DSLIST= <SSSSSSSSSSSSSSS>
$$ [...]
##$SUBNAM2= <"">
##$SUBNAM3= <"">
##$SUBNAM4= <"">
##$SUBNAM5= <"">
##$SUBNAM6= <"">
##$SUBNAM7= <"">
##$SUBNAM8= <"">
##$SUBNAM9= <"">
##$SW= 18.0517286264689
##$SWIBOX= (0..15)
0 0 2 0 0 0 0 0 0 0 0 0 0 0 0 0 
##$SW_h= 3612.71676300578
##$TD= 16384
##$TD0= 1
##$TE= 0
##$TE2= 300
##$TE3= 300
##$TEG= 300
##$TL= (0..7)
0 120 120 120 120 120 120 120 
##$TP= (0..7)
150 150 150 150 150 150 150 150 
##$TP07= 0
##$TPNAME0= <>
##$TPNAME1= <>
##$TPNAME2= <>
##$TPNAME3= <>
##$TPNAME4= <>
##$TPNAME5= <>
##$TPNAME6= <>
##$TPNAME7= <>
##$TPOAL= (0..7)
0.5 0.5 0.5 0.5 0.5 0.5 0.5 0.5 
##$TPOFFS= (0..7)
0 0 0 0 0 0 0 0 
##$TUNHIN= 0
##$TUNHOUT= 0
##$TUNXOUT= 0
##$USERA1= <user>
##$USERA2= <user>
##$USERA3= <user>
##$USERA4= <user>
##$USERA5= <user>
##$V9= 5
##$VALIST= <valist>
##$VCLIST= <CCCCCCCCCCCCCCC>
##$VD= 0
##$VDLIST= <DDDDDDDDDDDDDDD>
##$VPLIST= <PPPPPPPPPPPPPPP>
##$VTLIST= <TTTTTTTTTTTTTTT>
##$WBST= 1024
##$WBSW= 4
##$XGAIN= (0..3)
0 0 0 0 
##$XL= 0
##$YL= 0
##$YMAX_a= 206907
##$YMIN_a= -238868
##$ZGOPTNS= <>
##$ZL1= 120
##$ZL2= 120
##$ZL3= 120
##$ZL4= 120
##$ABSF1= 10
##$ABSF2= 0
##$ABSG= 5
##$ABSL= 3
##$ALPHA= 0
##$AQORDER= 0
##$ASSFAC= 0
##$ASSFACI= 0
##$ASSFACX= 0
##$ASSWID= 0
##$AUNMP= <proc_1d>
##$AZFE= 0.1
##$AZFW= 0.1
##$BCFW= 1
##$BC_mod= 2
##$BYTORDP= 1
##$COROFFS= 0
##$CY= 11.3945322036743
##$DATMOD= 1
##$DC= 2
##$DFILT= <>
##$DTYPP= 0
##$F1P= 2.36226072786647
##$F2P= -0.459571619588291
##$FCOR= 0.5
##$FTSIZE= 0
##$FT_mod= 4
##$GAMMA= 1
##$GB= 0.15
##$INTBC= 1
##$INTSCL= 1
##$ISEN= 128
##$LB= 0.24
##$LEV0= 0
##$LPBIN= 0
##$MAXI= 10000
##$MC2= 0
##$MEAN= 0
##$ME_mod= 0
##$MI= 1.114404
##$NCOEF= 0
##$NC_proc= 0
##$NLEV= 6
##$NOISF1= 3.799351
##$NOISF2= 2.8
##$NSP= 1
##$NTH_PI= 0
##$NZP= 0
##$OFFSET= 15.70392
##$PC= 1
##$PHC0= -15160.48
##$PHC1= 19.20082
##$PH_mod= 1
##$PKNL= yes
##$PPARMOD= 0
##$PSCAL= 0
##$PSIGN= 0
##$REVERSE= no
##$SF= 200.130013532006
##$SI= 16384
##$SIGF1= 3
##$SIGF2= 2
##$SINO= 400
##$SIOLD= 16384
##$SREGLST= <1H.CDCl3>
##$SSB= 0
##$STSI= 0
##$STSR= 0
##$SW_p= 3612.71676300578
##$SYMM= 0
##$S_DEV= 0
##$TDeff= 0
##$TDoff= 0
##$TI= <>
##$TILT= no
##$TM1= 0
##$TM2= 0
##$TOPLEV= 0
##$USERP1= <user>
##$USERP2= <user>
##$USERP3= <user>
##$USERP4= <user>
##$USERP5= <user>
##$WDW= 1
##$XDIM= 8192
##$YMAX_p= 0
##$YMIN_p= 0
$$ End of Bruker specific parameters
$$ ---------------------------------
##NTUPLES= NMR FID
##VAR_NAME=  TIME,          FID/REAL,        FID/IMAG
##SYMBOL=    X,             R,               I
##VAR_TYPE=  INDEPENDENT,   DEPENDENT,       DEPENDENT
##VAR_FORM=  AFFN,          ASDF,            ASDF
##VAR_DIM=   8192,          8192,            8192
##UNITS=     SECONDS,       ARBITRARY UNITS, ARBITRARY UNITS
##FACTOR=    0.0002768,     1,               1
##FIRST=     0,             0,               0
##LAST=      2.2672688,     0,               0
##MIN=       0,             -238868,         0
##MAX=       2.2672688,     206907,          0
$$ Real data points
##PAGE= N=1
##DATA TABLE= (X++(R..R)), XYDATA
0 0 0 0 0 0 0 0 0 0 0 0 0 7 -8 8 -8 8 -16 16 -16 24 -30 32 -40 48 -56 64 -73 88 -101 115 -132 151 -170 194
34 194 -219 247 -278 311 -347 387 -431 480 -532 589 -650 720 -795 876 -964 1064 -1172 1290
52 1290 -1424 1570 -1734 1920 -2131 2372 -2652 2981 -3379 3862 -4469 5260 -6334 7885 -10332
67 -10332 14800 -25605 112921 28211 -152000 98592 206907 40006 -98521 19132 89572
78 89572 35386 -14821 -8848 -35434 -10103 42640 1377 -100439 -60382 43459 13017 -91679
90 -91679 -69288 4799 -3193 -39814 -28216 -31126 -36783 10362 33344 -39040 -59656 38571 73155
103 73155 -23896 -49932 46890 72570 -6839 -16090 45516 39992 809 21174 32170 -4571
115 -4571 5354 46508 4664 -48505 13566 62182 -31726 -85993 22880 71398 -56017 -107681
127 -107681 23187 72037 -54292 -98708 13265 53081 -30774 -56063 4409 18070 -8422
138 -8422 3241 10501 -15829 -317 46326 26878 -25399 -3508 50032 34233 -7441 -575 18467
151 18467 15488 20445 17290 -20214 -23460 33826 38954 -40153 -57932 23947 44648 -36360 -62617
164 -62617 3181 25107 -21856 -34391 -7096 -7441 -12557 6947 -531 -30666 -9624 34924 13242
177 13242 -31936 -4247 41148 15435 -16910 12025 31349 1028 -3231 30813 20051 -20071
189 -20071 -1115 40215 12063 -32519 -7185 31229 4883 -30410 -11865 9901 -5219 -16654
201 -16654 -8754 -10750 -13991 -2170 -1794 -20110 -15372 8878 2368 -19086 -4964 16201 178
214 178 -13148 10740 21765 -5000 -8447 23951 23851 -9790 -5517 27161 19725 -11486 -3846 21019
228 21019 10083 -10533 -1727 8037 -2173 -7409 -1699 -5291 -10598 -1945 -1667 -16951 -13491 6521
242 6521 -1072 -23644 -11671 14887 1969 -23591 -6794 19817 5452 -15699 -995 18015
254 18015 8023 -4253 4832 11216 5482 6200 8905 1825 1105 11151 8714 -5419 -3229 9855
268 9855 3598 -10353 -3919 4940 -5098 -12265 -801 1452 -12545 -12397 4088 863 -15835 -9875
282 -9875 7140 2364 -12087 -6119 7961 3842 -3834 452 4708 3781 5647 5657 274 2239 11684
297 11684 9327 -4220 -1278 12998 8446 -7002 -3774 9296 4903 -8479 -5065 3653 -1297 -7769
311 -7769 -3504 -1629 -5947 -5389 -968 -4010 -7862 -2000 1899 -4384 -5826 1509 3242 -2527 -1183
326 -1183 4944 2948 -1282 3866 7170 1723 -104 6564 6935 -563 -695 6350 4827 -2421 -953 3907
342 3907 1045 -3254 -1681 293 -2827 -3358 -1015 -3041 -5585 -1933 291 -4484 -6387 -293 2070
357 2070 -3671 -4499 1089 2818 -804 -830 1573 1895 2080 3632 2673 -391 2399 6829 3305 -2522 265
374 265 6385 4033 -2798 -2223 2658 2295 -1000 -2970 -2391 -935 697 -1159 -5404 -4925 821 1441 -4376
391 -4376 -5617 -249 2376 -1370 -3327 -652 1069 839 1514 787 -727 939 4219 3504 -768 -773 4171
408 4171 4373 500 -774 1314 2623 970 -126 -173 -671 -375 374 -1162 -2340 -2181 -1300 -715 -1053 -1862
426 -1862 -2779 -2457 660 1048 -2590 -3898 -74 4042 1457 -3304 -2291 2841 5395 1647 -3526 -2090
442 -2090 5513 7663 -581 -6948 172 9830 4975 -7271 -6256 5875 7816 -2584 -8537 -1303
456 -1303 4967 1694 -4100 -4945 -1717 1959 2163 -2207 -5855 -2267 4711 3296 -4529 -5930 2028 6788
472 6788 1085 -5581 -1987 5366 5072 -1073 -3135 1665 4273 2138 -592 -603 840 1288 1521 890 -1526
489 -1526 -2511 927 2976 -1127 -4110 -1500 1999 118 -2777 -1748 -448 -1394 184 2123 -1314 -5642
505 -5642 -402 7400 2473 -8313 -4439 8561 7772 -5625 -7962 4478 9699 346 -6526 -1811
519 -1811 4928 4627 -556 -3662 -2471 2268 5276 557 -6597 -4317 4978 6549 -3920 -9729 -649
534 -649 8618 2974 -8668 -6751 5167 7570 -3227 -7972 282 6485 1647 -4074 -1481 2391 1911
549 1911 1223 683 -1257 -1283 2790 4470 -1541 -4440 1611 5038 -672 -4374 932 3345 -1091 -3223
565 -3223 1553 1806 -3407 -3137 2782 2376 -4216 -4464 2668 4344 -2205 -4483 286 3167 1568 -1710
581 -1710 -1668 217 2303 2817 -429 -2883 -387 4241 4091 -2097 -5202 1331 7160 2251 -6850 -4944
597 -4944 6000 7171 -4482 -8893 1147 8059 501 -7574 -3488 4439 2909 -2409 -3564 -1066
611 -1066 1598 2558 363 -3588 -2698 3437 4652 -2259 -4819 1613 5748 760 -3970 -963 3635 2186
627 2186 -1042 -1485 313 1445 1362 -253 -1708 -759 1539 717 -1618 -1487 353 681 -451 -1577 -503
644 -503 359 -122 -697 -824 397 740 -988 -965 1206 1690 -1029 -2085 1740 3185 -749 -2830 1139
661 1139 3778 496 -2787 -463 2849 1081 -1604 -557 152 399 458 -158 -1345 -1259 930 1291 -1277
678 -1277 -2183 273 1773 -162 -2021 -1153 831 730 -157 -1127 -884 1053 1595 -343 -1828 303 2586
695 2586 696 -1455 -268 1585 1154 -140 -595 22 1008 791 -108 -849 -212 650 307 -1016 -554 173
713 173 131 -908 -229 265 -622 -895 243 125 -934 -750 849 572 -1051 -654 956 1060 -250 -406
731 -406 566 673 -5 45 245 318 293 273 -366 23 521 198 -414 -144 717 -20 -787 -679 -17 -215 -271 -425
753 -425 20 -479 -488 165 -105 -406 -265 108 151 -36 -434 427 445 43 50 172 407 661 117 146 194 566 491
776 491 -543 -324 625 422 -749 -691 578 768 -237 -775 -9 105 -218 -475 -495 3 -130 -62 -295 -443
796 -443 128 414 -275 -178 155 200 48 -208 308 420 370 542 374 -117 93 280 389 -153 -247 216 357 -177
818 -177 -360 84 213 -46 -390 -391 -149 203 -251 -608 -315 -246 -370 -265 -386 -48 221 -12 1 191 -71 80
840 80 480 108 14 178 439 960 97 -211 92 317 295 -91 -166 73 82 79 -133 -561 -93 360 -79 -479 -323
863 -323 220 196 -311 -100 152 -172 -69 250 -41 -283 -62 627 455 -120 19 502 413 166 -167 -144 181
884 181 439 367 -401 -583 401 806 -85 -737 -375 354 533 -436 -490 -175 260 398 -612 -920 -278 440 318
905 318 -793 -755 765 893 -205 -1057 -530 653 696 -211 -798 -287 945 930 -653 -671 593 1208 51
924 51 -1225 -207 560 56 -167 -521 -331 43 215 138 -735 -560 542 490 -589 -907 116 705 -249 -633
944 -633 201 157 -164 -32 250 20 -580 161 628 -12 -431 -34 660 288 -46 -172 155 343 524 159 -447
965 -447 -481 462 628 -192 -761 -461 584 544 -605 -1165 -76 1083 284 -1356 -866 1153 1204 -524 -1420
984 -1420 384 1113 26 -637 -286 116 443 274 95 -602 -187 1377 954 -1401 -1005 1426 1302 -827
1002 -827 -1477 346 955 -134 -635 -466 191 307 -143 -193 -686 -171 247 301 -574 -649 302 517 -218 -438
1022 -438 77 226 272 -70 -166 344 116 38 61 173 159 -79 -107 565 250 -1351 -263 953 931 -1034 -1081
1043 -1081 750 820 -755 -646 215 292 -194 -134 -23 -348 -373 710 339 -1020 -494 1087 719 -989 -937
1062 -937 791 905 -357 -428 399 762 340 -109 68 -365 145 545 -148 -641 42 686 -34 -418 -470 372
1082 372 -481 21 -146 -328 101 316 -132 -443 -57 721 -28 -569 99 529 -421 -482 198 397 -287 -485
1102 -485 333 688 -395 -235 468 221 -225 16 315 40 -329 305 282 -537 -333 496 277 -538 -422 522
1122 522 254 -368 -209 -43 -113 -5 85 13 -207 356 354 -430 -482 420 665 -219 -318 58 260 -75 6 263 -247
1145 -247 -47 348 -65 -208 69 357 153 -413 -110 567 -111 -538 128 33 -337 -351 276 18 -498 -20 311
1166 311 -254 -318 247 260 -283 -354 386 295 -348 -40 386 169 -192 32 366 -216 -340 401 -51 -386 -53
1187 -53 347 -13 -596 342 385 -124 -309 351 -75 -62 88 -101 -6 -219 105 218 -33 -192 172 87 -96 -109
1209 -109 159 6 -49 75 97 121 43 445 -44 -65 12 176 -11 -292 -2 425 -295 -368 289 264 -182 -268 242
1232 242 117 -339 -42 213 -17 -444 174 225 -292 -296 47 120 -321 202 -32 95 -69 69 44 26 -125 430
1254 430 135 -155 228 176 -32 -237 148 65 -334 -168 284 74 -241 181 -8 -170 -109 -17 -35 -189 151 209
1276 209 -15 -416 201 180 -127 -388 208 312 -100 -296 35 -6 -3 -202 180 -60 -161 361 276 -152 -263 151
1298 151 174 -95 -104 291 -153 -141 -2 2 -271 -123 162 117 -18 194 356 -81 -282 -156 137 57 -23 41 304
1321 304 -169 -302 197 181 -64 177 83 147 -142 109 -104 -78 217 159 37 46 209 7 -231 -250 123 95 -258
1344 -258 -75 268 -246 20 -12 164 -53 -243 51 90 29 146 196 8 81 52 388 -96 -186 -28 287 -103
1366 -103 -142 -120 250 -207 48 -103 -79 63 -33 50 -281 150 -17 212 -271 -115 6 18 -81 262 -218 -82
1388 -82 -48 104 -41 -74 -39 228 -69 -109 44 216 -4 32 79 337 -307 36 88 -265 161 -230 -154 -63 -65 122
1412 122 60 -201 -91 -236 101 160 18 -184 18 -235 32 -295 -195 -179 228 41 216 2 -297 -80 343
1433 343 239 66 -114 142 98 -134 -76 86 147 -137 -178 -27 -25 12 -117 -78 -51 -206 188 166 -59 -310 162
1456 162 -40 208 -130 -179 42 59 -98 -56 -65 -52 -135 -56 -93 117 144 14 5 -53 37 -39 -84 87 -89 -232 -215 -215
1482 -215 -1 -210 283 -103 5 -70 -147 -29 8 90 145 -139 -184 375 130 -6 -26 33 216 -80 -180 -97 178
1505 178 104 -22 -258 228 9 8 -39 -69 30 132 -55 -96 -165 -250 -52 -260 -154 -265 160 336 -80 -194 204
1528 204 -67 310 89 -199 9 149 -13 -305 10 228 146 -247 58 -152 9 360 -70 -181 178 56
1548 56 -175 136 38 258 54 83 106 304 112 -43 101 127 -95 -4 9 -188 -85 285 -406 -80 181 -131
1570 -131 26 149 -4 -103 132 -135 112 -289 142 -31 -198 2 -181 243 -295 66 0 -99 27 -8 15 157
1592 157 111 -213 -133 -76 -97 6 261 178 13 -88 166 -222 -129 11 246 43 -199 -46 225 193 -233 174
1614 174 -61 71 -64 108 -14 94 87 -40 -60 207 118 -149 58 40 -31 -4 -155 102 12 -63 -19 -179 -137 -170
1638 -170 -145 29 61 86 -100 -25 -29 -28 -45 -40 -133 247 -24 1 -161 132 -32 139 -27 -191 -5 37 -135 249 -6
1663 -6 -233 -178 -94 163 249 -254 71 -109 116 61 57 -133 -4 -93 -17 24 -178 91 164 -135 132 -15 -100 -38 -12
1688 -12 63 -14 -134 -196 44 144 2 149 54 27 -11 -135 27 249 -159 -190 14 107 12 47 -104 156 118 -45
1712 -45 40 -246 146 154 -75 -50 179 -177 -134 -6 33 301 138 6 -50 -110 -210 42 60 -16 -35 -98 -69 45 -98
1737 -98 106 -46 85 -236 -68 200 48 -94 -16 -37 144 -189 224 99 -188 -141 101 -160 27 -35 -16 -135
1759 -135 -190 136 -20 91 -79 -84 -154 221 -61 -49 -161 15 107 -1 197 214 -73 -53 54 -194 77 -284 -257
1782 -257 74 214 146 125 142 45 54 28 -2 344 154 60 27 -46 -14 30 -169 -176 5 19 100 77 30 72 -144 -113 -167
1809 -167 47 -33 -152 1 -144 31 -114 23 102 -232 -265 116 91 10 -106 -139 285 -137 -153 -244 -18 92 196
1832 196 -175 -216 260 141 -260 -98 -150 68 -32 -140 -120 71 -32 -17 3 102 -98 -263 -23 127 153 51
1854 51 115 130 22 -92 -95 203 -60 -266 -207 -142 53 13 -48 64 187 -169 86 59 -94 67 -100 112 -192
1877 -192 -132 231 -243 -68 200 19 -78 -375 97 194 -369 -56 29 -28 -54 -99 -284 77 -28 -398 33 19 16
1900 16 -87 -35 229 243 -280 -126 6 5 -55 -279 -110 125 -49 -67 -92 153 64 166 -288 2 186 53 40
1923 40 -15 -77 -90 -131 -67 -8 -15 -130 -267 -73 95 -196 -43 -300 115 91 -185 29 227 59 -54 -32 190 110
1947 110 -145 -308 72 158 -81 -327 19 51 -353 -160 -46 -57 138 -50 -232 40 173 -49 16 -4 -12 -185
1969 -185 -287 -20 -20 -156 156 -129 92 170 -127 162 -185 -110 70 -44 -123 105 16 -52 40 144 156 -186 -190 189
1993 189 23 91 -243 -247 145 -35 -60 -204 -28 236 -137 -27 135 74 98 -198 76 76 14 -71 -65 -81 -96 -143 -95
2018 -95 -132 163 26 205 270 -2 -3 -24 -30 153 319 -113 -110 -72 337 135 44 51 -90 120 -85 81 93 0 -59 147
2044 147 79 73 -59 -124 236 151 45 -135 -98 229 205 102 216 6 150 117 53 -176 27 133 8 -4 39 31
2068 31 -183 7 211 142 175 21 284 55 -206 -146 33 -42 -56 -188 221 -41 142 -34 -136 283 -15 -9 -217
2091 -217 154 34 -190 -35 -150 -168 -115 -17 -11 106 -130 -230 -140 -168 -284 -95 -196 10 -51 -84 45 223 -136
2114 -136 29 19 -258 270 31 -50 -253 221 251 120 63 -121 215 160 121 -197 28 167 -8 -15 -38 -42 -15 -109
2138 -109 7 15 106 -288 215 164 22 55 -172 138 86 -102 -282 -139 174 -136 -242 131 300 102 -82 -116
2160 -116 32 -70 -76 -125 -170 147 -83 32 34 100 -139 -250 209 42 -58 -60 -115 -89 -155 160 170 -18 0 134 60
2185 60 -192 33 -31 -24 143 -67 -41 -19 -33 23 266 2 129 -187 182 -63 -77 -88 191 -33 98 -196 -292 65
2209 65 -46 -188 65 -93 -26 168 -128 -8 -73 -36 271 53 110 110 -53 34 -69 252 14 92 216 99 -102
2232 -102 -106 83 92 98 205 -61 74 49 -86 -56 -245 20 -118 -47 164 -132 -179 11 60 133 -264 -28 -248 120
2256 120 27 65 -49 135 66 6 26 131 36 140 -107 40 194 -207 154 30 -20 -42 -42 5 263 -31 -78 48
2280 48 -43 -19 -127 97 65 116 -88 28 42 -237 -68 -264 75 96 -53 -55 -262 214 101 19 -240 38 -102
2303 -102 -20 -81 118 -47 -120 -53 -209 -330 -419 159 71 -29 44 -263 -39 -97 -106 165 -214 98 197 172 -132 -60
2327 -60 -86 87 -266 87 -111 11 5 -122 -133 -69 -103 306 45 -100 255 38 3 -65 -44 -151 53 -45 245 -21
2351 -21 34 -255 -76 85 -12 235 139 -163 -8 -163 145 67 23 -160 -162 28 -124 55 -164 171 25 -280 -194
2374 -194 -7 26 -101 -130 -171 115 146 -113 107 19 54 -70 28 4 -19 -160 -345 46 200 52 -115 99 -26
2397 -26 -32 -43 238 -71 -69 45 -233 -109 63 -189 -110 -83 -9 -5 -157 -107 176 -35 -12 -110 45 -104 77 48 -45
2422 -45 -174 0 61 125 271 3 -1 -121 115 145 199 283 348 -163 -68 26 76 21 239 -85 9 61 166 57 278
2447 278 -11 -189 -90 -101 37 -167 57 -170 -89 134 92 39 247 -58 -3 -160 -35 45 23 -9 41 52 39 -107
2471 -107 -39 -75 -34 5 17 120 -66 -3 -55 -120 -10 164 -79 -89 113 -418 -76 264 -100 -41 -24 -167 130 123
2495 123 65 46 14 -4 -214 -24 97 14 -88 -189 -73 343 -136 54 -42 -197 52 20 17 -44 81 198 1
2518 1 85 26 142 108 -4 -266 -16 141 209 14 83 113 -199 215 -194 110 -18 -166 -59 42 -111 4 82
2541 82 -41 -86 -23 -200 -281 -285 -149 -56 178 211 25 268 1 -43 -193 136 -8 221 54 -152 183 244 124
2564 124 -110 -24 58 -64 17 276 -207 40 -20 -95 104 50 130 -48 143 172 -63 25 100 136 -61 -11 -2 173 145
2589 145 -59 -181 144 -150 -25 141 90 -54 54 -131 -142 -241 -61 -54 -79 -158 -124 7 -113 -113 -66 -24 52 39 112
2614 112 -255 -89 -92 26 -271 -167 39 207 -107 -119 -57 13 102 15 -232 35 68 -82 88 -69 -150 76 -126
2637 -126 170 147 35 -212 106 -131 -164 23 -268 60 -211 -11 -24 -112 29 151 -119 -33 214 169 -23 -89
2659 -89 -39 139 -155 -49 -3 -182 45 -354 -54 175 -77 -100 -78 96 56 85 -323 149 106 -24 213 -169 287
2682 287 232 -40 -202 71 102 3 -126 204 69 151 -25 199 88 -299 -56 103 124 100 24 26 141 262 -160
2705 -160 -52 -76 83 73 -243 141 150 -97 -261 -53 50 190 -7 23 -172 101 -22 -41 -428 2 -60 -159 88
2728 88 52 -6 79 181 21 -106 -32 186 28 -195 88 135 242 -26 -10 26 109 176 -121 241 -202 108 -137
2751 -137 13 139 5 122 136 136 40 -109 128 -90 -55 51 42 -13 -204 -233 24 -15 27 -94 109 3 -30 346
2775 346 3 -12 154 103 65 0 116 121 50 -90 -67 136 -147 -24 115 -36 -219 -75 -80 93 175 263 -168 -50
2799 -50 -134 141 -86 115 210 10 -201 42 40 -44 45 16 15 -169 -20 57 113 46 142 106 179 -18 -163 189 -60
2824 -60 -117 -206 -100 -83 -274 68 5 -70 -157 -47 143 -178 -11 -41 45 -96 170 218 116 -177 4 68 -119 -11
2848 -11 -12 -98 58 47 19 200 160 133 117 -76 145 145 -121 -117 -113 -24 -124 123 17 51 61 -138 -99 -85 5 -137 -127
2875 -127 75 45 11 -47 62 146 46 -172 94 -6 0 164 69 -147 -101 49 -74 23 136 -206 212 -85 53
2898 53 -78 171 -77 81 -11 -205 -132 -61 86 67 38 -204 -248 -7 -68 153 64 154 -4 8 130 296 54 -142
2922 -142 28 181 64 -161 227 -107 -56 -106 124 -9 -163 -279 -84 -42 72 138 -103 -167 72 334 44 -36
2944 -36 170 204 -17 200 170 -47 147 34 96 -57 139 180 -80 132 -96 -67 -129 -29 -25 130 -180 156 -69
2967 -69 -29 86 49 -108 142 -201 -108 17 240 -8 133 44 -11 -59 -20 125 -321 -34 219 -120 -49 67 -246
2990 -246 -220 36 -116 -83 49 81 58 90 -26 45 364 -75 -227 -110 -52 148 73 9 67 240 71 -109 88
3013 88 -201 105 83 -113 -64 51 216 114 53 82 179 83 237 -144 -25 63 68 -55 167 -214 82 14 55 -202
3037 -202 54 58 -20 112 -41 170 -41 -154 -225 15 126 177 -200 -168 240 -300 -89 -165 9 -67 88 -108 -17
3060 -17 12 -52 135 153 -68 -53 148 -10 237 -26 123 80 -111 -29 -175 86 -136 -87 -4 -213 71 201 137
3083 137 114 -257 28 -97 -32 32 -98 -92 -76 117 -85 -18 -151 -63 10 241 83 -185 -31 54 -4 -45 -4 79 -227
3108 -227 11 -385 1 -117 114 -115 250 13 -97 -19 -102 201 -65 68 262 -172 -160 120 -146 -57 -22 -77
3130 -77 58 57 -106 198 54 -75 89 -108 29 -128 -209 112 -149 122 -1 16 323 -436 -24 -86 163 -170
3152 -170 -204 30 -10 110 141 -135 167 85 264 15 -16 -112 -150 -24 141 -39 -175 29 -130 -53 -118 8 -240
3175 -240 -34 18 -171 -57 -153 -70 -154 -54 -124 -100 49 -79 67 32 -275 -92 -165 25 151 55 -88 143 47
3198 47 -101 23 97 262 -33 385 10 -328 70 -131 -63 -28 118 -264 412 91 -22 248 112 -18 92
3219 92 245 -235 -11 -299 -10 407 126 110 189 116 146 -215 92 -16 -98 -60 -114 -31 132 158 -26 -48 182 32
3243 32 80 -97 -222 -53 -67 -140 -57 112 -73 -150 121 -77 -377 -90 -85 125 -130 -168 -33 49 245 -242 -78
3266 -78 -90 -7 85 -57 -39 69 -4 14 186 -31 -22 -187 -30 -130 -15 -12 20 -13 164 171 33 294 -187 39 91
3291 91 -76 -80 15 -227 -268 69 -55 -215 -259 170 -232 85 -186 47 -98 -133 -71 39 -138 254 43 -16 81
3314 81 -131 -63 84 94 210 -147 -93 81 -89 -1 -9 -20 -184 -117 114 -44 26 -284 -142 -146 -300 -234 29 -16 -185
3339 -185 161 -107 27 39 -28 -158 2 189 -276 66 200 61 -193 42 31 87 31 57 160 -213 57 206
3361 206 -214 -129 142 20 -86 -12 -29 220 -17 -113 -10 -119 -79 -14 -43 25 141 10 -181 -8 -157 16 -257
3384 -257 6 12 66 -51 -18 -38 97 64 121 -95 159 5 332 -201 42 -4 -18 160 -133 106 -9 -7 168 46
3408 46 -21 8 163 36 -151 194 -167 293 112 -243 194 154 113 -100 -20 54 83 -136 33 101 186 -118 66
3431 66 227 -104 -207 -86 -63 -128 138 -61 324 164 52 -87 49 231 1 -128 33 -221 -173 201 365
3452 365 -61 99 -69 -220 -100 167 -133 -16 -11 -178 -105 11 97 57 61 -22 75 -89 -193 -85 -24 206 75
3475 75 29 122 3 146 -71 -10 126 -184 -109 130 -15 -188 -162 -41 -69 -33 -114 286 147 -97 -19 191 -93
3498 -93 58 198 -3 35 4 -192 78 207 79 22 19 50 129 -162 275 -14 -179 188 -1 -56 -21 42 101 78
3522 78 -142 -17 103 23 -121 93 -263 -116 -195 39 -98 26 -26 92 -48 -107 -263 -166 -38 8 13 -222 -38
3545 -38 -220 14 16 4 -55 -107 -191 25 70 -115 -228 66 18 279 -149 17 168 280 -84 165 -352 93 83
3568 83 -295 95 243 54 -43 -47 206 -34 11 170 -43 38 71 286 -278 -122 -183 29 85 -68 -186 67 -135
3591 -135 171 -209 -6 17 -158 96 -198 -243 62 -112 220 53 1 -73 -97 19 25 77 -3 207 206 117 14 -1
3615 -1 97 -41 -176 36 -51 264 -118 250 20 -31 -190 -157 119 78 47 -97 -3 43 70 174 54 -170 -8 -131
3639 -131 38 -71 42 10 -32 232 6 -13 22 -36 59 -156 7 -135 199 40 102 -68 -50 102 -127 -9 77
3662 77 102 128 -51 -479 -126 42 58 -116 3 -45 -80 -167 19 -215 -71 66 -43 111 -46 -124 -76 0 57 -99
3686 -99 -6 36 72 263 -82 -5 -52 -19 288 -182 -56 22 -192 -18 109 24 69 -23 11 18 43 26 -239 -289 -97 -17
3712 -17 12 -193 23 -55 -31 231 -152 26 -42 -41 -101 -30 20 -18 -147 -128 99 -368 -101 -77 91 -73 3 130 140
3737 140 7 -41 4 -273 -110 21 -33 -93 73 183 116 -27 -5 -5 -84 -357 -63 -71 -43 -47 2 59 -173 51 -41 229
3763 229 105 -123 30 265 66 254 40 -114 26 27 -134 172 -47 -226 68 38 -219 146 -129 -190 238
3784 238 133 27 123 39 91 174 -88 -252 167 55 -114 54 -29 165 80 91 -133 -17 -206 97 -68 36
3806 36 -12 -181 -147 -78 266 -115 259 192 -126 -142 32 -155 -14 -18 -83 -95 -87 -227 39 92 159 38 204 124 203
3831 203 -9 26 121 -33 199 -19 -150 70 -200 -118 94 -291 45 24 203 -74 42 -97 181 -4 -97 136
3853 136 75 17 10 30 -184 -36 -34 -87 24 228 -161 120 178 -68 165 -71 4 -7 58 -48 100 -52 -36 20 -290
3878 -290 -20 96 61 -120 60 -110 16 200 -106 -69 -63 -19 -36 -85 213 215 -143 -79 -19 -77 53 -3 151 13
3902 13 -64 -182 45 -123 -125 -78 129 12 -137 -231 99 146 -36 -50 -366 138 -117 -135 88 205 -45 27 -68 -50
3926 -50 -20 -73 48 -58 34 -91 -41 -184 0 130 -99 -28 40 -62 26 7 2 64 142 117 264 -10 -94 301 -42
3951 -42 198 156 175 -147 110 -15 -76 10 -20 -83 413 -105 -39 -18 83 121 155 -296 -262 -124 214 164 3 170
3975 170 -21 -14 64 -2 132 -22 -62 -2 13 -208 -103 142 -79 77 -145 -176 323 -173 199 49 -128 -71 -7
3998 -7 74 -335 52 -170 -175 158 -147 167 206 -47 -114 132 -82 -229 -206 91 154 -36 -110 -259 45 -15 298 32
4022 32 5 47 -9 -94 -5 -176 -22 162 -195 197 117 -211 -93 -23 -45 -184 5 29 -222 292 -317 -40 -194
4045 -194 31 11 235 258 112 124 -41 -29 -49 160 -128 -13 127 103 -40 117 99 107 -84 90 -258 -127 21
4068 21 9 -11 -223 166 56 27 83 51 -183 -67 119 106 97 -123 -375 -283 -144 -115 -24 137 43 92 -231 37 251
4093 251 -81 -226 -113 79 -78 81 9 -152 -21 73 129 65 -129 185 -208 -52 144 -62 5 104 -424 37
4115 37 58 178 -2 197 -8 123 54 -2 159 -64 15 -156 139 129 18 -83 -248 228 111 -329 145 -103
4137 -103 -38 -20 98 -190 -243 13 169 27 -224 235 185 -111 -63 46 -93 116 -27 119 -175 -13 8 126
4159 126 41 163 -4 -308 147 82 44 -73 -93 -86 213 -47 104 86 1 -30 -28 126 -111 -30 -128 -139 146 24 -38
4184 -38 -78 -197 138 83 -98 -116 -77 65 148 211 -198 186 -64 -207 -67 -37 -262 -254 -9 -263 -236 229 -45 -108
4208 -108 50 184 36 -40 95 -93 38 91 99 -239 32 -11 75 174 17 42 59 -176 135 39 35 -136 -45 125
4232 125 -310 107 52 126 -17 -51 190 1 -97 -250 -311 -5 -30 235 13 -75 -90 38 -160 -64 -26 91 -81
4255 -81 209 -116 117 33 -21 -281 -172 -68 -254 66 -92 10 6 -5 192 -43 101 -150 8 -57 -55 -144 -121 -139
4279 -139 -118 -303 -14 132 -83 -30 -163 -47 -198 -27 -28 -62 -40 -60 -146 41 -44 56 11 -21 -118 -2 165 131
4303 131 -80 -122 -170 106 79 -47 121 -244 68 -40 -80 14 182 120 -86 -378 24 63 126 68 31 -429 95
4326 95 162 -27 -26 -23 -76 34 102 182 39 47 -140 -267 84 202 81 -59 53 146 -371 -93 -55 -225 28 114 -56
4351 -56 -124 -61 -297 212 89 -48 385 18 -484 98 38 226 4 63 203 83 16 26 346 -111 -106 -30 145
4374 145 -32 -184 8 87 194 -152 -345 373 -44 -102 182 -29 35 103 -25 -89 -188 93 -115 -108 8 -198 -55
4397 -55 -70 5 -56 -163 152 -62 127 -154 189 154 -54 -240 -10 -57 -95 38 -116 -75 -71 -64 -104 64 -178 65
4421 65 23 -89 -65 -136 -23 69 -138 45 -50 180 -36 159 68 -120 73 38 75 -73 231 26 10 75 -45 24
4445 24 47 10 -31 146 -137 41 -219 -239 -310 158 -55 114 -10 -112 158 79 61 92 -16 -329 38 152 255
4468 255 42 64 135 -17 -24 -115 -67 92 182 94 54 -66 -172 31 144 -148 -6 -93 -234 -16 -6 54 64 -6 88
4493 88 78 -104 -233 -40 4 -174 54 56 27 27 -16 -74 121 123 -174 -39 104 -65 -6 -147 85 62 -72 -48 190
4518 190 -273 -18 -174 -109 269 -14 -68 37 140 51 33 2 -18 118 92 -231 135 81 39 18 -96 -53 -39 -15
4542 -15 -14 -157 -157 111 -17 81 102 -15 171 177 341 18 52 -101 -112 153 195 -158 125 -29 -62 -58 -144 -39 4 181
4568 181 -32 -291 71 39 0 -26 104 -41 -26 152 -111 -64 38 -163 -193 -3 -34 51 -106 -1 -14 -83 -104 131
4592 131 86 80 259 2 262 -87 96 -71 149 101 -160 -248 38 -47 12 94 47 -47 -59 1 -81 -4 42 -145 39
4617 39 69 4 141 -62 -49 -125 -54 -141 37 30 -172 -30 -56 100 -102 43 -185 79 286 147 110 0 -119 -149
4641 -149 -13 99 -20 -82 43 -244 158 83 89 65 -175 95 226 -237 -36 129 -154 56 -50 -296 -216 58
4663 58 113 265 -1 167 221 -298 -94 -97 41 100 -118 -46 -85 -187 296 -18 -150 11 -29 -148 8 215 209 48
4687 48 -80 -117 -49 -366 62 67 -88 26 237 -130 -4 -132 -18 -71 80 183 94 -185 106 113 -33 -50 -87 46
4711 46 -108 -152 -185 207 254 -47 -137 162 95 -206 30 242 -229 150 58 -167 7 136 -138 12 76 -157 -156
4734 -156 -122 -95 186 190 -171 -177 192 -3 167 -35 -192 -138 -141 83 -241 128 5 312 125 217 -79 -85 -198 29
4758 29 83 131 30 18 51 7 -64 -82 34 -50 -188 233 166 71 -92 22 224 -39 73 -96 -156 -79 166 11
4782 11 49 30 169 -35 22 -69 12 49 -26 -182 -182 -62 -198 -35 -96 18 -90 86 157 54 -60 -34 -185 -170 -67
4807 -67 -123 43 -83 91 -81 51 -109 53 -6 121 24 46 -130 -116 -84 -15 -173 -88 190 356 67 181 -82
4830 -82 -52 -78 42 179 -145 -141 -62 181 -85 -144 134 125 116 2 209 22 73 8 -114 -204 6 -104 42 88 107
4855 107 84 -150 198 -207 134 -91 -390 16 -49 -272 -125 -18 101 179 -109 10 35 236 -108 3 33 -186
4877 -186 119 18 87 -135 -105 -184 -38 106 77 -90 -24 -98 -43 96 108 -1 165 -84 -8 79 210 45 166
4900 166 -275 -54 -25 37 249 82 6 124 19 -83 71 65 148 50 -109 -80 128 165 36 12 -214 103 26 154
4924 154 79 173 164 -119 -9 -114 57 150 8 -136 38 216 -70 39 1 -16 -248 2 -2 -74 196 39 -78
4947 -78 -199 -173 10 -150 25 -228 23 85 383 -207 -98 -33 126 13 89 86 96 -165 174 -10 135 223 79
4970 79 -1 72 40 -138 71 -98 -259 123 32 130 -238 25 127 46 18 0 1 -228 125 -99 -32 -24 -116 -73 -87 108
4996 108 -126 -13 -94 79 64 -89 -86 60 1 54 130 -38 10 27 -29 90 -86 -216 103 12 127 -121 -256 -52
5020 -52 -45 -65 -71 6 87 -127 294 -10 1 212 62 -165 221 -41 -28 64 134 1 5 42 73 111 108 -185 -1 -104
5046 -104 -47 279 -86 -289 -96 144 -81 -83 43 28 -7 172 1 103 35 -23 -18 -161 10 36 131 -125 -65 310
5070 310 93 -21 -242 -39 40 -6 187 26 -9 57 -292 -18 91 -156 173 -44 -73 -37 -60 -93 154 75 84 129
5094 129 24 299 110 -155 -31 -118 151 234 106 65 -5 -70 82 -23 40 -135 -81 -41 80 -163 -87 -202 -259
5117 -259 -21 -95 -85 38 64 241 95 121 -61 -28 -235 216 -66 -229 -17 -97 121 -106 98 62 -36 1 -40
5140 -40 -22 -196 -79 -13 177 42 41 -251 -92 -171 54 85 64 65 8 -17 -229 -76 -63 132 68 -448 -128 46 -51
5165 -51 67 24 74 236 -11 -215 -27 61 45 -278 -43 125 -3 64 -58 50 -101 72 -11 -310 -2 71 23
5188 23 -48 195 -24 100 -73 112 -59 167 182 -80 -209 15 131 -39 -82 -104 -7 98 276 8 -36 70
5210 70 -215 71 24 -28 73 -15 252 153 258 17 269 136 -119 -110 170 189 84 -63 -157 111 -39 -57 -208
5233 -208 -71 247 -76 -69 -182 75 -38 5 -37 87 -10 -111 72 -134 -105 -172 16 37 -119 115 -43 118 -45
5256 -45 -25 104 -52 -34 239 -229 67 -55 236 89 42 33 -11 -147 -126 47 37 117 5 -21 -229 -3 80 41
5280 41 -228 -95 139 41 -11 145 164 87 -265 -58 248 128 -101 172 -210 12 28 65 -65 127 -135 -39 -65
5303 -65 84 291 -90 7 -26 125 27 -209 -73 231 -79 276 -89 -84 -42 55 -8 -190 -1 28 101 -21 191 163
5327 163 -105 40 145 40 -14 -43 -213 -86 -69 -15 215 7 -1 -49 -205 -16 86 70 -86 119 -20 -58 136
5350 136 -26 122 0 -85 44 -355 -74 -70 -193 24 207 108 -45 -105 -45 24 -5 -102 -84 -182 3 -29 74 -64
5374 -64 141 -28 -95 -49 125 264 81 -97 53 58 -14 -160 39 -109 -155 193 261 67 -186 -44 225 -11 -140
5397 -140 49 37 -103 124 -106 -184 -262 -37 47 -230 42 -93 117 263 -296 -186 -124 140 226 -4 -3 12 -40
5420 -40 -100 69 9 -168 -118 -36 -98 -172 19 131 102 -66 54 -60 -48 -19 -155 147 -18 29 -16 -32 -148 -105 21
5445 21 197 110 -93 37 -188 213 128 26 9 -64 -275 -265 -216 -255 -70 67 62 10 -124 31 192 139 146 222 -59
5470 -59 103 149 -52 -103 242 113 160 -5 172 -339 -39 83 12 -74 173 20 -51 193 -82 -224 -301 16 -35
5493 -35 10 23 -120 -130 -86 137 31 -111 35 -70 115 -233 65 170 -163 29 140 94 39 -153 -193 -316 -4
5516 -4 138 -375 -11 -15 -8 116 -50 -147 32 107 120 295 29 -66 70 -106 65 -129 -203 149 96 -20 37 -84
5540 -84 36 175 98 -23 297 -74 214 224 -76 25 -85 151 48 125 -42 76 -116 120 130 105 -54 -21
5562 -21 -54 59 -43 28 136 -118 -6 -20 -31 113 124 133 29 -3 168 -61 -82 -212 -122 54 11 78 -17 -26 105
5587 105 51 -9 -95 -175 101 -89 8 38 -111 191 -134 111 127 248 35 257 140 26 6 135 -104 -158 189
5610 189 -53 77 -209 -97 -85 33 -14 -25 -76 150 -82 124 31 -59 -236 32 0 -69 -254 27 156 69 10
5633 10 -22 64 -46 -101 -84 -37 -88 -65 186 -39 67 -46 94 283 55 27 -219 205 84 13 145 223 124 -33
5657 -33 126 -155 1 -92 130 -347 -180 139 118 11 -23 -139 19 74 105 -203 158 -32 69 -110 23 0
5679 0 -123 218 28 -61 -201 -26 114 -26 13 -66 -21 45 -67 -126 -92 99 -160 17 211 -12 58 164 -251
5702 -251 -153 82 -57 11 -46 -23 17 -158 -106 10 -38 -214 6 83 108 -97 -193 232 -26 -204 32 35 11 -214
5726 -214 -197 64 72 -194 -71 67 -182 173 294 258 -113 41 -91 113 -91 145 57 47 55 -18 -195 139 53
5749 53 198 77 -22 199 2 -74 -33 94 41 -35 2 92 -48 -58 147 -68 -22 32 174 58 -109 -6 217 -4
5773 -4 121 -53 -60 -143 -60 -54 -168 -134 -79 173 110 -42 93 -59 -21 -148 68 -171 -36 36 19 -148 -136 -267 82
5798 82 65 -31 53 -66 185 90 -245 -30 -92 -381 -158 160 -101 -196 -55 229 141 -52 65 -72 -13 43 73 -100
5822 -100 122 -1 0 -105 -175 -76 217 -291 84 -82 -25 -61 48 -166 -110 21 40 -380 -123 -28 -94 120 69 126
5846 126 -46 -133 58 -124 -89 -46 25 -45 151 281 -92 -95 45 -41 -119 -82 -48 146 0 -164 125 -5 -135 -107
5870 -107 81 9 -114 -48 -108 233 63 14 244 -7 81 101 -187 317 49 -155 -159 -57 109 -20 -134 151 -176
5893 -176 6 -2 -17 -289 -234 -46 107 -41 12 173 -139 -65 110 184 9 125 -150 68 -52 -241 -106 105
5915 105 33 67 -49 -119 54 113 104 315 -13 2 -211 130 231 -175 -122 -212 -267 -251 -95 -196 210 38 174 62
5939 62 -71 -85 22 20 -124 129 358 61 -66 16 39 60 -95 -286 -90 -270 -32 -52 -89 50 108 60 3 41
5963 41 308 -75 -464 193 -36 -138 -67 54 54 -56 8 91 110 136 97 111 -42 140 -14 -181 -15 -13 -26 -259
5987 -259 19 -108 -41 -166 -229 132 -129 -29 191 226 -119 199 -180 -218 65 96 2 70 -22 218 76 40 46 103
6011 103 -125 -70 -59 -201 -169 51 -10 189 106 27 -44 256 111 -191 -18 61 -29 -32 -194 32 -151 139 -17 -63
6035 -63 40 -3 -13 -105 255 190 -117 -217 76 133 -41 209 31 -68 39 -29 -14 -172 365 119 -83 102 34
6058 34 -92 132 75 71 -139 -129 -92 -32 132 6 110 -148 103 17 132 -151 -33 -228 -37 -324 88 184 -23
6081 -23 -61 234 95 -135 85 134 -18 47 -185 25 225 121 -36 -16 151 -96 -165 231 37 166 -79 115
6103 115 -25 154 137 -169 98 102 102 162 -80 27 -148 247 -52 -140 -76 4 13 -147 -97 -244 310 38 122 -218
6127 -218 43 -39 -22 -168 226 9 123 -135 -120 64 -182 -69 -36 -183 -63 -345 26 133 40 -102 -194 87
6149 87 -44 27 174 -11 77 76 32 -73 222 -32 -98 -280 4 -79 172 0 201 97 -3 20 119 -158 -236 -115
6173 -115 -245 117 114 -91 33 -104 -51 -16 -54 -128 80 15 212 108 29 5 -63 60 -68 54 1 97 -131 24
6197 24 137 78 -236 -312 39 86 -55 -213 -26 -236 -21 -41 -69 -65 -138 -64 57 186 61 12 25 138 -106 197
6221 197 -144 13 64 101 -73 -297 -67 137 44 -76 155 70 122 64 36 -273 176 52 168 -68 8 112 287
6244 287 83 -87 -166 -85 73 -68 90 220 1 -96 -184 85 -52 -264 -29 -20 27 255 92 -27 -22 142 38
6267 38 117 94 -17 -38 51 261 -12 30 145 -67 180 -111 151 -162 -225 28 223 -136 -2 325 -65 -92 -72
6290 -72 165 85 11 56 265 55 20 -113 -37 35 89 194 199 -268 -92 89 -25 0 213 -166 -179 -52 -118 -127 126
6315 126 85 194 -77 241 -96 159 -34 13 35 -76 6 -221 5 31 -18 5 133 15 -153 192 -36 -18 147
6338 147 104 -269 0 -44 -55 31 -110 -36 -191 70 -9 -91 74 -90 181 53 0 -188 8 130 45 -80 127
6361 127 202 -37 20 90 55 151 75 213 121 1 113 -208 10 -81 15 -30 56 133 -336 -53 -67 -98 -207 85 107
6386 107 -183 -103 -44 -95 -102 106 141 -104 27 -71 -9 -192 -25 -180 109 -170 -108 -98 60 39 0 159 -203 96
6410 96 1 43 -89 43 -48 -74 -57 -16 189 51 -7 -107 181 -147 -21 185 10 35 -81 -93 158 99 -34 45
6434 45 282 96 -319 169 49 194 120 -101 -75 -143 159 33 -22 200 -61 186 49 183 29 -47 22 34 229
6457 229 -85 -5 36 -42 -302 -85 -215 204 -219 -102 12 -88 -173 -2 159 162 -81 71 -71 4 117 137 -128
6480 -128 -140 40 -14 132 -58 89 -108 40 207 63 191 -76 6 -105 -17 31 265 128 -15 -27 -122 -94 -152
6503 -152 -66 78 -100 136 -74 -171 246 294 258 -144 -309 -207 39 28 101 -43 -114 -26 -186 92 220 55 111
6526 111 -18 203 -20 182 -132 116 -85 110 93 189 151 113 215 85 -134 -3 338 -63 -67 78 -216 -212 -92
6549 -92 109 -118 -110 149 -25 31 155 20 -68 -113 -45 95 -221 6 354 -32 -52 303 -170 -66 -89 -162 68
6572 68 -356 -138 126 236 138 -79 -200 172 196 46 14 -18 36 -62 -62 -78 -21 -85 31 -15 151 241 72 -126 153
6597 153 205 -27 -257 -176 -169 -18 -103 12 100 -30 78 77 101 -35 -1 130 162 -20 93 -294 76 -1 165 -8
6621 -8 -10 -266 9 -69 -110 292 -135 -49 123 -157 90 -81 66 -50 -11 -60 74 -40 101 191 -59 155 174 399
6645 399 -49 -198 -310 113 22 47 -72 -9 -134 -43 -8 33 -141 -4 71 64 -30 -100 -14 -24 -274 -11 -75 -234 86
6670 86 -34 18 -42 -65 -51 -117 -134 53 -172 -259 296 -186 244 -183 153 -14 60 120 -44 51 194 -177 -72 -114
6694 -114 118 159 95 96 -118 -96 52 24 -31 81 8 49 172 296 -133 -28 167 -4 -93 -205 -117 57 20 -69
6718 -69 -141 -47 -77 -268 -44 -5 112 147 -43 -67 0 80 -158 -190 -80 -11 -45 -148 -235 -148 73 84 -217 -60 -79
6743 -79 -9 97 -140 76 28 2 133 125 60 41 16 75 128 -114 22 -94 18 -163 -38 -68 217 -277 -33 -110
6767 -110 120 -99 95 -125 117 -44 175 37 -28 84 -110 5 81 235 -44 394 47 9 -25 61 122 -81
6789 -81 -41 -10 -215 39 -225 -1 108 50 -40 16 -10 -264 -69 -12 -74 148 238 16 -26 114 -60 22 108 181 28
6814 28 -116 -4 -76 -110 -109 135 139 -123 275 -59 28 105 -38 -18 -115 39 148 90 0 86 78 99 83 -155 -120 -141 114
6841 114 -141 41 17 -112 -148 171 112 -364 -202 -200 -186 21 -3 -135 148 -9 -138 43 39 -131 43 -99 -181
6864 -181 158 46 -183 -56 -157 -360 112 -58 218 1 -211 -119 46 17 33 -27 -92 100 -59 -170 99 138
6886 138 -122 -132 157 -63 -130 -171 -344 32 -50 -124 9 209 -67 -18 -61 -179 21 -83 -151 -120 -109 -33 29 -19
6910 -19 72 36 -162 -238 -310 110 -182 -150 93 61 51 -122 -127 236 137 52 141 44 -27 2 -9 -277 -136 -114 40 -185
6936 -185 13 -26 275 3 112 -71 251 24 66 -62 -22 -189 281 249 -27 17 147 -246 -47 41 100 215
6958 215 156 295 -237 50 225 85 255 -28 11 93 -37 31 -35 109 57 -133 34 55 105 148 -24 -133 74
6981 74 15 20 74 -210 148 73 200 -145 -89 -6 8 38 -285 94 86 -145 64 -56 56 -145 90 81 157 25 134
7006 134 57 -124 -41 -70 40 153 73 -139 106 64 -108 -142 43 -47 -5 295 157 1 197 -106 -223 -31 1
7029 1 -141 128 53 -41 77 80 84 122 -215 -124 -31 155 92 172 73 -38 100 -61 51 -177 11 190 -134 69 -45
7054 -45 -143 145 -45 -138 7 -103 141 2 -156 143 178 48 -52 0 -204 150 -28 -170 201 188 -127 -118 38
7077 38 61 -6 177 170 -82 -103 -163 -102 14 97 -255 -143 -31 -108 81 -38 140 211 -199 -259 -25 73 160 -85 -103
7102 -103 108 197 -48 28 -123 20 14 216 -59 18 279 -39 -15 2 109 -131 -75 9 -61 187 -19 -2 55 -68
7126 -68 88 -33 -173 200 47 59 36 -64 -23 -214 -17 -160 -16 133 -344 -88 -89 -12 37 -195 122 -46 67
7149 67 58 -23 -9 171 -172 123 -61 -119 13 -103 -109 -135 41 -55 53 -412 87 38 148 -120 -41 23 4 263 84
7174 84 -83 -72 174 109 223 119 150 0 65 142 150 -8 -79 -67 -60 71 75 -296 -17 -164 -252 32 -231 108 161
7199 161 83 128 -72 149 -110 -58 61 -35 179 50 -162 -109 236 -74 51 -43 103 146 120 -192 -77 61 167
7222 167 96 -83 -47 -101 155 88 158 287 16 -33 -43 133 167 145 89 -112 74 7 8 -137 -198 -180 79 76 -192 83
7248 83 -155 -75 -75 -106 19 -299 -50 -244 68 -89 172 44 -76 -103 139 -10 -114 -82 -92 116 52 152 -199
7271 -199 -360 117 211 -109 -43 -158 38 -12 100 -19 23 18 -54 -115 -43 57 -139 -66 -166 201 -58 56 21 -318
7295 -318 1 68 -84 38 61 290 24 -136 191 -25 -71 87 29 61 23 -66 158 400 -160 -169 -17 -50 78
7318 78 -29 -101 41 -73 -44 101 -112 95 -108 -14 92 201 -71 -175 -16 -16 101 94 -73 -2 136 -156 -281
7341 -281 107 -33 61 -183 121 27 -244 -177 31 1 -203 285 136 -39 -146 32 -266 -315 360 222 -103 -76
7363 -76 119 -422 -25 -36 -43 -22 20 159 -25 78 -223 109 -321 161 -151 -14 44 -154 -193 11 -269 20 -10
7386 -10 125 217 -220 97 -166 -216 163 284 -263 7 -17 176 270 137 47 174 41 50 -24 177 -202 -106 63
7409 63 -155 -266 -215 -59 128 -87 45 -130 137 -159 -1 14 45 -30 73 73 53 -31 -67 -179 -30 76 109 -261
7433 -261 -75 66 -76 128 -140 119 -20 104 -63 53 128 -59 -154 -95 227 29 -22 28 -65 197 59 68 -72
7456 -72 119 -405 -76 -113 34 64 -97 245 -134 -42 18 107 0 35 -27 217 84 -6 71 -72 58 8 274 -61
7480 -61 31 -61 3 -195 -90 -73 25 14 55 5 68 83 65 -28 121 -150 -79 79 -62 132 -180 -266 -119 193 -1
7505 -1 -63 5 -13 117 149 -126 -113 72 78 291 -48 -193 19 76 -66 -71 211 106 -4 56 -188 -23 25 147 1
7530 1 139 -42 -208 -32 -85 151 111 83 -14 21 121 13 -209 153 186 -49 84 -169 -23 94 98 -40 -40 -47 218
7555 218 104 -109 5 -31 240 -220 189 -154 -108 -17 211 10 -109 243 31 -96 141 189 45 -43 -155 94
7577 94 137 -179 104 24 46 -63 12 104 -114 72 155 130 -159 -8 145 -85 85 299 216 146 -40 -78 -28 -96
7601 -96 40 -15 102 149 12 83 46 44 242 -52 -218 -72 -120 121 247 142 -14 -42 -210 -182 11 -89 -390
7624 -390 -107 -6 80 -272 -64 167 48 136 150 81 171 29 -14 192 -100 172 -9 65 248 79 -89 -105 -5
7647 -5 -185 148 157 42 242 154 -83 -43 -32 -95 -58 104 -59 195 -148 43 162 -177 -102 -141 -168 -103 226 210 -85
7672 -85 52 -90 10 191 -115 37 64 -209 207 99 -54 -9 275 -66 -51 124 149 -78 -5 188 20 47
7694 47 -27 -129 -102 -27 -37 68 241 -33 23 117 101 130 -1 54 144 7 -130 123 52 -65 131 234 20 141
7718 141 16 -38 -136 14 138 220 75 93 -173 49 -320 -35 163 -274 -53 -255 -16 162 -85 103 -86
7739 -86 68 81 -253 32 -37 -173 56 48 63 -58 -110 276 -154 -121 96 24 -12 -180 -166 -9 100 -56 -73 -136
7763 -136 210 174 -228 29 -104 430 69 55 49 -96 175 -84 114 -147 103 -523 -139 54 -7 -198 -147 -82
7785 -82 -111 158 89 -248 -389 144 94 -87 -46 -82 -39 496 -30 277 -160 152 -122 -108 182 299 56 -129 -27
7808 -27 -43 -47 -120 -228 168 -27 249 -30 -253 -190 -35 -125 135 219 -78 49 -81 -83 -165 67 -85 22 50 -164
7832 -164 -64 137 102 -51 20 36 123 -234 139 -113 -53 72 -245 126 -130 -23 71 18 91 -32 -42 -59 -96 75
7856 75 16 -97 41 127 -135 -81 -34 144 166 161 -277 118 -156 -249 -82 75 -92 62 252 31 -98 -130 -100 -89
7880 -89 -108 67 -24 -14 112 -167 252 15 -174 -53 64 -58 89 173 58 127 114 -1 38 39 -166 125 -75
7903 -75 29 -110 -24 41 -160 134 -27 64 -137 -3 84 86 2 103 80 39 -35 36 -102 381 66 158 -74 -102 239
7928 239 154 -159 45 154 -20 -4 -175 50 -10 129 165 143 54 -22 123 -218 -76 -43 26 59 75 -56 39 172
7952 172 -176 -119 -184 -367 -57 -65 112 -40 251 33 -180 17 -24 -167 12 135 53 -87 232 -133 33 81
7974 81 -159 -77 139 1 101 69 237 43 92 98 -76 -118 -33 194 34 -17 21 -66 -216 14 -210 -122 -166 162
7998 162 5 -58 -118 -243 -124 -72 -121 -137 -24 -40 104 -153 -3 179 -30 49 172 267 -105 31 20 -119 -134
8021 -134 5 -9 -67 -231 -73 -231 -22 68 -189 117 -209 64 111 -9 -56 46 -102 39 -91 119 265 -129
8043 -129 -162 97 -61 -179 -353 85 -60 -53 58 -337 104 0 -32 -20 -195 -310 123 -133 -199 62 135 -68
8065 -68 225 -81 -70 123 52 -189 80 -73 -31 221 -53 -136 -209 -59 1 176 -71 -111 187 153 -3 -217 -29
8088 -29 0 53 -155 90 -181 -77 -2 225 38 241 148 -84 39 175 84 -47 -119 149 53 -67 219 -27 -108
8111 -108 -111 107 -87 7 -198 -342 -199 -235 -225 -195 -18 -169 -51 -205 -169 -173 -97 -54 -60 129 -116 36 -43 174 -93
8136 -93 195 -47 8 116 -83 -211 13 9 272 -93 108 -160 117 12 -71 90 -39 -97 -348 76 -129 36
8158 36 -4 -55 -32 -8 -52 312 39 253 -121 171 -125 13 59 60 53 258 44 -168 -9 123 -23 108 42 -58
8182 -58 235 90 40 -15 125 -257 -155 73 3
8191C
$$ Imaginary data points
##PAGE= N=2
##DATA TABLE= (X++(I..I)), XYDATA
0 0 0 0 0 0 0 0 0 0 0 0 0 0 0 0 8 -8 8 -8 8 -15 16 -16 21 -24 28 -32 40 -43 48 -56 64 -73 84 -96 107 -121
36 -121 135 -151 169 -187 210 -233 258 -284 315 -347 383 -423 464 -512 563 -622 684 -758 838
55 838 -929 1033 -1154 1294 -1464 1667 -1922 2249 -2683 3295 -4216 5757 -8804 17098 -87737
70 -87737 -238868 27170 154695 -37207 -167373 -12552 93396 18106 -43263 -7751 3823
81 3823 20661 60504 27543 -54121 -11768 89827 52722 -58721 -34537 51473 33548 -28033
93 -28033 -22194 -9963 -20464 1724 14108 -49062 -71789 14294 43462 -54915 -84029 16256
105 16256 45910 -39853 -53945 20828 26429 -19905 -2571 25602 120 2430 44314 20175
117 20175 -26191 26508 78099 -960 -53973 46657 95600 -26407 -79316 47357 94798
128 94798 -39098 -89653 27637 67081 -34688 -69991 717 19569 -24978 -26451 -10148 -29033
140 -29033 -22403 16656 255 -47649 -23493 33374 17651 -28613 -14149 19989 17916 12728 13623
153 13623 -5911 -4297 44191 48213 -21475 -33697 47148 64777 -19687 -45836 25588 48210
165 48210 -11173 -31739 2954 6928 -10745 -3022 -6373 -32717 -18376 19424 -2661 -48160 -22484
178 -22484 25149 6 -37858 -8912 19911 -7461 -17044 17328 15806 -19849 -2225 40594
190 40594 17186 -25536 2607 44821 18659 -19004 2470 30391 11880 -6562 3210 5881
202 5881 -1534 3757 3618 -13253 -13002 7076 608 -23831 -14191 7134 -8105 -25072 -4700 8172
216 8172 -15869 -21878 9293 12330 -19401 -14979 19967 15568 -15010 -6363 23339 14703 -7295
229 -7295 3166 18902 9170 1163 8891 8862 2074 7155 8875 -4687 -5014 11718 4594 -18190 -9607
244 -9607 13785 411 -26419 -11953 13813 -2080 -26038 -11033 9817 -1872 -16541 -5868
256 -5868 4582 -1469 -3109 2574 -673 -1147 8936 9049 -2641 526 14527 10733 -3205 2959
270 2959 14419 5170 -3342 6328 10205 -3710 -5770 8502 5307 -12503 -8405 7816 1146 -15102
284 -15102 -9845 3916 -1088 -12018 -8033 -1072 -3031 -3748 -2745 -5021 -3342 5135 3812 -6737
298 -6737 -3017 11867 8483 -5665 -1222 13416 10012 -3639 367 10979 6452 -1764 2153 5487
312 5487 833 -1044 2176 250 -4951 -1437 1886 -4648 -7631 -1155 -51 -6597 -6672 -733 -1849 -6653
328 -6653 -3028 1679 -3253 -4734 2100 3720 -2541 -2198 5806 5268 -1253 750 7265 4763 379 2666
344 2666 5237 2705 1074 3272 1892 -1167 1105 2950 -2334 -4340 276 1937 -4233 -6553 -797
359 -797 395 -4092 -4808 -1887 -1529 -2276 -1377 -1285 -3388 -764 3895 762 -3960 -1 6206 4159 -2324
376 -2324 -686 5737 5122 1080 188 1728 3346 3742 1651 -1775 -1322 3381 2943 -3632 -4708 722
392 722 2209 -2451 -5117 -2099 -533 -1593 -2012 -2374 -3355 -1828 949 202 -3448 -2727 2403 3169 -1083
409 -1083 -1552 1701 3179 1706 822 1489 1786 2032 2815 1651 297 710 1509 1508 675 -685 -1054 -491 838
428 838 649 -3110 -4014 -503 2060 -1156 -5227 -3798 1506 2609 -1971 -5451 -2714 4242 5029 -2902
444 -2902 -6687 1089 9454 3524 -7340 -4315 8251 8751 -2718 -6680 2049 8200 2672 -3698 -2923
459 -2923 1458 3762 1927 -2609 -4791 -854 4623 2081 -5882 -6154 2113 5250 -1793 -7770 -2773
474 -2773 4481 2635 -3789 -4557 991 3952 670 -2282 -434 1394 1794 1619 840 -436 -774 2649
490 2649 4140 -42 -2561 492 3714 1498 -2392 -1422 1046 -397 31 1499 -1769 -4959 -96 5691
506 5691 271 -8862 -4177 7877 5186 -8014 -8343 4542 8899 -1897 -8030 -982 6405 4058
520 4058 -2113 -3872 -234 3996 4857 -68 -5472 -1580 6569 5975 -4383 -8003 1711 9600 1733
535 1733 -9158 -5457 6547 6934 -4924 -8787 1249 6527 -83 -6229 -2605 2621 1303 -902
549 -902 -849 -1502 -870 2078 2914 -1746 -3856 2101 5241 -583 -4226 1288 4601 25 -2821 1705 3213
566 3213 -2174 -2178 3506 2696 -3619 -3557 2992 3796 -2824 -4723 549 3404 -18 -3145 -2338 516 1880
583 1880 797 -1890 -3346 -78 3707 1978 -3200 -4181 2115 6602 611 -6595 -3051 6980 6735
598 6735 -4665 -7685 3172 8882 82 -7738 -1843 6300 3296 -3390 -3865 355 2152 1519 -1241
613 -1241 -3532 -2103 3496 3152 -3779 -5454 1779 5113 -531 -5176 -1183 3912 1915 -2184 -1233 939
629 939 2015 1061 -373 -839 381 2175 1077 -1490 -772 1653 1518 -371 -1374 193 917 -40 -720
646 -720 -511 -79 107 -1054 -1234 350 942 -1516 -2486 1113 2607 -1542 -3314 849 3309 -226 -3270
663 -3270 -48 3440 1202 -1556 -515 1493 919 523 9 -531 -135 1500 1391 -1430 -1802 1207 2059
680 2059 -503 -1808 -812 972 720 -928 -1433 -748 732 829 -1092 -1885 63 1853 200 -2179 -842
697 -842 1637 1111 -521 -595 239 1193 459 157 -362 459 1270 587 -534 56 894 417 -423 -244 577 -61
717 -61 -722 209 219 -1176 -779 317 363 -1125 -1115 535 383 -783 -838 144 474 -316 -285 181 295 175 123
738 123 -7 166 874 606 -246 -311 1008 893 -382 -283 504 142 -427 -85 195 21 -402 -291 259 -657
758 -657 -300 247 30 -700 -521 165 11 -720 -213 -160 51 6 -138 -406 -63 246 106 -453 129 926 739
779 739 -511 -269 675 707 -499 -231 605 343 -95 -386 -103 236 -37 -198 -372 -220 -367 -188 -461 -370
799 -370 -36 -146 -273 -442 103 1 -258 49 -22 50 -59 454 109 -25 -267 701 726 23 -197 332 524
820 524 271 7 85 546 179 -44 -340 -31 368 -4 -584 -448 -335 -83 -247 -592 -44 -333 -503 84 -98
841 -98 -133 -381 14 193 -342 -477 262 288 89 -148 208 575 365 270 191 126 280 455 145 -244 -234 453 172
864 172 -380 -397 146 -231 -169 129 28 -312 -209 -183 331 -614 -422 142 313 -15 -289 -57 352 342 437 -191
886 -191 -546 532 636 -216 -569 -55 899 480 -437 -422 110 390 287 -513 -430 154 589 242 -1097 -1127 475
907 475 722 -505 -1265 -165 820 585 -714 -710 -149 1080 501 -839 -746 806 1068 108 -1016 -214 1046
926 1046 384 -313 -193 162 389 444 248 -676 -363 1103 605 -1055 -843 537 519 -503 -1039 191 288
945 288 -568 -198 259 -188 -663 55 472 -158 -691 -193 480 175 -235 -81 176 398 265 138 -208 -102
965 -102 718 473 -212 -717 452 704 457 -365 -846 278 1227 123 -1639 -758 1111 671 -1057 -1243
983 -1243 427 1243 -310 -920 -76 285 54 -47 -251 -618 -147 1054 466 -1047 -893 1220 1311 -915
1001 -915 -1299 989 1403 -226 -720 -102 494 100 2 -48 -90 22 519 61 -537 -366 404 288 -294 -550
1021 -550 37 245 -20 -50 -468 172 310 -62 -383 97 -16 -110 175 679 419 -723 -193 905 503 -503
1041 -503 -502 792 972 -501 -861 591 489 -121 -532 74 -316 -172 443 153 -904 -801 885 615 -869
1060 -869 -954 1048 849 -780 -896 35 445 -7 -287 -168 -16 138 448 -54 -475 468 580 154 -452 -87
1080 -87 294 83 -103 10 -362 -69 382 162 -448 7 726 -163 -517 -233 292 -147 -595 170 339 -272
1100 -272 -605 359 444 -615 -407 565 145 -380 79 356 46 -255 305 127 -391 -186 731 79 -503 -195
1120 -195 717 352 -311 -414 254 -87 166 126 -40 -82 42 171 -590 -663 425 33 -436 -765 36 357 -261
1141 -261 -252 163 -25 41 267 -46 -26 142 395 221 -363 -14 576 -58 -703 148 25 -211 -45 -6 231 -428
1163 -428 -240 396 -113 -472 149 190 -520 -285 446 228 -411 -297 339 255 -260 -200 326 257 -257 251 281 -183
1185 -183 -113 608 150 -405 181 676 -143 -438 353 431 -359 -16 81 -27 59 -262 85 -184 -204 134 51 -227
1207 -227 -78 -34 100 -205 -51 -127 -452 -205 178 -144 -475 -50 407 74 -392 161 291 -371 -302 369 354
1228 354 -246 -189 214 362 -307 -44 336 -225 -401 -100 -59 -373 -246 248 192 -162 -131 182 -233 63 10 84
1250 84 -48 -398 472 349 -396 -11 178 -14 -223 28 489 -182 -314 175 8 7 25 -131 -186 7 -93 21
1272 21 -117 -276 246 -71 -466 -45 85 -190 -293 -29 204 -56 -195 -17 49 -24 -83 78 -136 -171 -39 115
1294 115 -78 -25 166 279 -64 -179 499 279 -30 65 39 -24 85 114 -17 -237 49 203 -117 -384 163 82
1316 82 134 -262 -180 372 -231 -321 145 -24 -76 103 54 3 -216 -134 -193 -202 -57 263 -144 -52 157 206 -52 -480
1340 -480 67 212 -256 -74 106 -285 -255 46 177 66 -58 87 156 -141 -106 188 39 -75 -33 348 -26
1361 -26 -357 -39 351 -226 -77 -138 177 324 -1 30 -68 187 -124 199 67 42 31 -167 98 -106 186 -1
1383 -1 -155 32 -243 -110 -37 67 -116 59 86 71 -97 -225 66 -34 -162 -132 -26 145 -86 -110 40 -153
1405 -153 -384 275 71 -15 -259 219 219 -129 -62 328 -10 136 17 -19 44 -228 162 -110 -162 62 65 -111 9
1428 9 -88 -38 -37 -27 -181 -107 -319 184 195 -62 -273 -158 303 47 -289 -167 220 131 30 -127 -72 85 -106 261
1452 261 90 44 25 80 106 -235 -16 261 -37 -34 -99 140 29 -38 212 75 154 -53 194 -2 -31 59 -77 46
1476 46 -99 9 190 30 -166 -179 -118 193 -124 122 9 103 -175 -116 -4 14 72 116 -150 -36 17 174 75
1499 75 246 177 5 169 -39 -35 -284 -265 139 -147 22 72 -181 -150 -130 108 -113 -140 -8 321 78 -195 52
1522 52 171 -16 39 -58 -6 282 -187 -89 -31 174 233 -123 -85 -178 -99 130 66 -256 40 237 31 -79 -150 -212
1546 -212 -129 -68 -188 -416 -72 -12 39 -177 171 -226 -205 -87 48 -159 -126 65 180 43 -48 -83 92 35 -165
1569 -165 7 -303 -109 1 -90 -23 208 53 -79 7 0 97 -72 178 81 -59 15 -54 105 132 -204 -15 98
1592 98 -20 39 -66 130 -33 41 64 36 86 15 32 -39 -46 -309 129 -250 -259 -152 132 -325 -9 163 -111 -48 -230
1617 -230 50 192 -21 66 60 -54 90 -351 -97 -106 199 -36 -216 3 21 23 23 -92 249 64 -151 48 26 75
1641 75 110 2 -197 95 50 35 101 2 112 -133 -201 -108 53 -75 -264 -58 -167 0 56 -118 -58 -95 -144 -66
1665 -66 125 -153 -153 243 -18 18 12 -124 -1 356 -238 -105 -25 24 189 -179 141 83 137 -176 -101 -236 89 128
1689 128 -66 -183 -282 -38 51 -189 146 166 -274 -73 -69 162 -110 -365 95 260 -231 -49 187 -30 159 -282
1711 -282 102 -27 183 -6 44 -45 38 -43 -83 -38 -82 46 123 31 125 -91 -111 -115 -42 50 -84 -125 227 -93 -168 -107
1737 -107 -173 385 123 -55 -107 113 51 -115 -251 177 266 68 -50 -141 -43 -73 3 -189 96 67 36 -48 -102 90
1761 90 -193 31 21 -99 113 -10 -100 120 -192 12 -93 -43 -27 121 49 103 75 -284 -56 206 -50 123 39
1784 39 -28 -62 111 180 -203 -25 65 125 38 -58 -144 53 -33 -181 374 53 54 -99 121 97 -87 100 136 139 72 -14
1810 -14 66 236 89 116 -225 19 206 30 147 -112 95 353 -29 -120 -103 335 -115 38 -90 106 78 -216
1832 -216 -48 202 -38 -96 -149 106 183 74 -243 247 379 46 64 60 128 -126 -279 -143 60 170 -255 -7
1854 -7 32 51 -141 -125 -5 449 -51 -85 229 202 72 -26 -4 199 -191 199 -69 -88 43 -245 -78 18 -44 25
1878 25 17 -186 -31 84 -11 91 208 -41 33 16 75 -17 -78 -314 -20 376 96 -253 207 253 246 -108 -232 -104
1902 -104 335 -125 -108 39 -89 -35 -93 -3 -45 -293 -207 -84 -95 150 69 -92 28 127 -80 -21 -31 60 139 -69
1926 -69 -266 -78 -161 -20 20 143 126 -108 -17 11 25 0 132 127 240 284 24 144 77 -77 -206 -91 64 185
1950 185 -13 82 0 -8 15 -260 -134 -71 191 -154 -170 208 -215 -48 -26 -26 21 146 -72 -143 -15 171 251 -24
1974 -24 245 48 -96 -102 120 100 302 246 20 46 -190 91 -23 129 -82 185 -360 60 -184 -193 -147 -294 153
1997 153 13 -171 -141 -80 30 -215 -137 254 28 -16 72 103 71 -153 -50 -52 54 177 68 -111 -12 7 -237 27
2021 27 96 -25 38 -83 -144 207 7 -157 -8 84 180 -106 -31 321 -11 16 42 31 -64 100 -101 -95 -46 71 -39
2046 -39 -10 123 -37 -46 -271 -86 150 44 -167 89 216 206 -9 -31 183 78 -39 -45 -133 -12 1 -75 -170 27
2070 27 -155 -180 -22 -49 163 -59 -103 -121 -164 -50 -35 -52 -222 254 -63 -158 220 -4 17 -202 129 101 86 -29
2094 -29 260 -84 -135 -129 36 113 163 -99 -248 83 -31 -121 134 23 -52 58 -39 168 -37 -13 -75 -81 100 -20
2118 -20 -170 32 264 -14 110 -43 235 -241 -24 -62 -94 -61 -12 -101 -52 135 34 -22 162 -61 203 162 -38
2141 -38 -85 159 16 -75 44 169 -61 -79 70 265 328 159 -287 -114 80 -96 -132 -161 31 292 -153 -78 -18
2164 -18 -190 73 -156 6 225 73 232 -223 -165 44 -30 233 11 47 -144 99 -80 278 -134 -213 73 -11
2186 -11 71 -57 97 -163 92 -11 177 -28 104 -144 16 -165 213 -225 -166 21 70 35 174 -107 -33 135
2208 135 -56 -41 114 -40 17 -146 -254 -41 -172 -86 -36 184 78 140 -3 -113 -15 -125 -121 211 -263 -38 -50
2231 -50 137 -269 52 50 -76 107 114 -59 46 98 246 106 -4 -62 -8 154 -122 157 134 -28 63 200 -200
2254 -200 140 55 6 47 -56 2 -97 62 78 131 -6 -118 -63 103 153 177 -120 50 -16 -129 340 48 128 104
2278 104 -47 91 119 -90 -19 176 -4 -89 155 -60 146 64 -58 -146 -189 -16 -54 -271 178 -6 102 -48
2300 -48 46 59 -62 104 87 32 178 245 -162 -5 165 -59 -19 115 88 -119 123 -206 181 18 -45 -45 -51 -109 50
2325 50 -72 244 -289 -13 -24 -81 63 -238 -317 -1 -148 184 -28 -24 -206 136 -23 -3 132 10 173 29
2347 29 -175 125 -249 -14 7 97 -45 -251 210 38 -9 192 92 -97 185 -128 -132 -187 -71 49 -16 43 -186
2370 -186 -128 37 17 133 -124 -143 5 123 -163 90 149 -64 -205 -46 51 45 194 66 106 68 157 82 237 228
2394 228 -314 18 -35 -257 -52 -97 -22 83 102 -100 255 -63 161 21 -6 144 -96 47 -183 229 140 -48
2416 -48 -85 160 164 97 -21 10 -46 -96 120 -260 -36 -83 4 -70 -199 95 -25 243 -27 -19 -219 18 80 104 159
2441 159 123 122 348 -5 -70 94 137 -243 -78 -55 -138 58 -125 -60 233 154 -222 -79 188 -331 -149 94 4
2464 4 6 -113 -92 46 -23 11 -12 220 192 1 -72 243 -176 12 71 240 107 -15 62 -136 -9 194 -144 52
2488 52 -191 -66 -50 -86 -105 -60 -154 -264 15 -129 -211 -156 -4 -106 -63 -72 147 -23 158 106 156 -113 79 39 117
2513 117 214 -262 6 149 176 -278 170 -66 -28 -7 -86 -87 -181 -138 170 32 -36 120 241 52 67 -41 -169 -105
2537 -105 -50 151 -21 -180 190 237 100 15 -182 -58 -174 -289 -48 228 -140 48 94 24 -37 60 -175 -121 33
2560 33 122 44 -56 -306 -70 30 31 -175 -137 -43 2 85 177 -71 58 171 -114 -96 -206 121 -166 -81 36 -84
2584 -84 -71 -75 -113 -158 143 117 203 357 -194 132 92 26 41 -17 102 81 -40 -31 -21 -233 4 31 -58 -316 204 -78
2610 -78 -13 -24 -102 64 157 -66 -220 -189 -216 -100 -40 -63 134 93 -16 -179 -366 -121 -89 -27 154 -212 -139 16
2634 16 -243 -133 -10 -13 22 -190 -56 78 58 -251 -41 -58 -90 -213 -82 -22 -165 124 126 -133 264 -143 -139 -89
2658 -89 -110 265 -120 165 -211 35 88 237 -87 78 -312 41 150 246 -48 62 107 -282 104 -256 28 -17
2680 -17 -68 234 71 93 94 171 153 -110 -155 103 -121 -7 120 -114 -77 -18 -121 22 -10 287 -203 -268 86 -323
2704 -323 -99 70 -101 -187 -178 -152 -131 63 -94 366 -44 3 84 -24 97 -53 205 -244 227 -40 -40 -185 223
2727 223 186 185 29 -149 205 43 205 -128 -84 -45 59 163 -89 -104 155 -206 141 -1 -225 -79 -49 -31 -124
2750 -124 42 9 -348 -127 114 -135 14 31 -52 47 88 -109 69 -132 20 -137 -56 55 32 -96 116 270
2772 270 -50 37 -139 -1 28 50 -257 -12 -54 -46 -68 61 227 112 108 -157 22 163 72 73 -232 180 255 29
2796 29 -18 6 57 -132 -88 235 -119 -66 11 -188 -16 -22 106 -2 5 -178 81 95 135 -268 113 81 -99 -16 -157
2821 -157 44 44 67 -179 99 5 -150 -179 -170 -176 -33 -8 -165 -18 -133 37 114 -171 -98 72 282 177 -116 123
2845 123 238 -42 190 -222 -64 -97 214 117 105 350 140 73 181 34 -191 26 171 24 125 89 -80 -36
2867 -36 40 -62 -15 -88 -166 252 -96 -292 102 -29 75 9 183 -34 -83 -107 6 32 64 -196 -108 120 61 -63
2891 -63 -222 -85 18 -127 -129 -33 97 -162 -284 -21 -69 -95 -211 12 70 -135 180 26 146 236 47 103 -2
2914 -2 -43 168 41 -10 29 120 131 -39 -44 31 76 -1 50 -145 31 -12 8 57 136 340 -187 -114 -42 -125 -114 -28 -17 -143
2942 -143 -73 -117 -111 250 -154 222 -85 -151 218 -150 -26 51 -14 -126 124 -96 58 -78 -16 163 -220 -406 123
2965 123 -69 -65 70 -140 -199 81 14 3 214 33 -147 38 147 -3 194 77 27 -10 -30 -65 -274 -129 90
2988 90 -59 4 -164 157 168 -29 -37 -133 -24 5 -83 -67 -180 89 -60 -20 51 199 58 105 78 90 180 -115 -36
3013 -36 8 161 -94 -284 -159 -81 -62 -297 -11 -78 -102 -5 82 116 52 -126 -4 50 93 -136 -51 -3 -124 -91 55
3038 55 -46 169 102 -87 -187 -13 -176 236 -75 -90 1 230 -239 -33 -98 87 31 -110 -6 -79 -110 39 -28
3061 -28 69 155 -121 71 -68 -68 -4 112 -126 135 214 -4 -79 45 -197 -209 191 -91 -200 90 -56 27 113 -78
3085 -78 1 -115 -201 55 -64 52 -284 -111 90 36 -31 143 -165 -173 174 -350 -88 43 114 241 -43 -64 -15
3108 -15 274 29 9 -22 -33 -143 2 -194 -79 -41 28 302 -55 12 -198 -45 -317 151 -129 155 -184 100
3130 100 -160 -94 -174 -117 138 184 -115 163 48 -74 110 32 -151 69 142 20 3 217 -158 -87 116 -105 -25
3153 -25 -18 -71 27 23 -24 -1 197 -81 -136 -31 102 -193 147 165 40 -231 -96 121 -95 -80 43 205 -120 108
3177 108 7 49 -28 83 -169 -191 -2 -91 132 -19 -335 244 200 -2 75 -24 -198 53 -42 -12 143 -139 -16
3200 -16 33 -27 -74 72 62 -176 18 -55 19 -22 71 129 75 8 83 -44 73 -20 162 110 -220 -26 -86 34 -53 -63
3226 -63 -134 166 -31 126 -153 219 -199 -10 157 206 -100 31 30 41 -49 -110 4 69 52 -69 -161 -106 -14 30 191
3251 191 -165 161 -126 -47 -214 42 -66 -116 -12 10 -141 263 -69 -119 129 -75 -27 -159 64 147 -43 -99
3273 -99 58 -94 -193 84 16 7 -166 113 75 188 -284 162 161 -261 -76 167 -148 -70 187 66 183 156 -1
3296 -1 -91 -159 -121 -16 102 -72 16 -45 -133 194 150 10 64 -86 -194 183 -15 6 -76 -152 75 164 146 32 -24
3321 -24 91 -53 48 124 270 -176 -152 -54 -70 91 -77 132 113 176 -110 -54 -220 -13 -54 21 -1 -86 -44 -55 -284
3346 -284 -155 -3 -80 122 142 112 -118 -147 50 117 186 22 -10 31 -187 148 -269 215 24 82 208 165 171 -42
3370 -42 -74 97 122 -308 -77 -37 84 313 12 115 -150 42 58 86 363 -107 -174 29 -85 -101 157 68 -16
3393 -16 -60 -103 -16 -167 -212 -7 144 62 49 149 -196 109 209 -26 -84 54 204 227 132 -130 278 -26 -153
3416 -153 1 12 -38 262 -207 -142 153 52 63 -267 -15 -92 97 -182 26 -99 -98 -201 -60 71 65 -243 -131
3439 -131 151 -147 -110 82 -10 95 19 69 74 69 -98 -222 8 118 6 -9 -73 97 -54 98 3 34 -3 -92 23
3464 23 -157 3 26 207 -75 98 82 -25 80 -83 -225 13 94 114 -129 106 36 -200 -43 -71 -32 22 135
3487 135 26 -89 52 90 -231 62 -220 -42 -82 -241 125 48 49 -89 19 77 -78 -80 198 408 -22 63 180
3510 180 195 31 -26 83 28 -30 -31 177 -76 -108 219 65 -37 -115 -141 48 82 67 -17 218 -157 130 79 23 7
3535 7 -178 141 141 177 15 77 -28 -115 -14 5 102 82 -209 192 87 166 98 143 -54 -246 126 81 -10 133 -70
3560 -70 90 201 -74 51 -126 -176 -157 51 34 135 -194 216 294 -44 -227 -8 -7 310 6 -5 -36 -167 -33
3583 -33 75 31 213 28 56 80 -113 -199 207 -26 65 -7 -304 101 28 248 9 3 -143 -184 137 195 103 22 -61
3608 -61 -175 143 198 204 -324 173 -92 -34 127 -148 -138 172 -161 -23 65 2 102 14 122 -4 -31 -28 50 -105
3632 -105 -153 186 -97 -50 -232 -68 19 179 -24 -31 -56 -29 60 8 -115 -14 79 -25 -24 -13 -88 -108 96 17 -152
3657 -152 91 -21 -141 -190 90 204 99 -180 -182 23 -229 41 90 -317 -135 154 -79 16 170 28 79 -24
3679 -24 59 -186 -76 48 -139 -85 -81 214 -117 63 -211 -2 42 -239 45 -142 -110 -63 -163 -102 -88 215 -31
3702 -31 132 -142 83 -43 -170 0 -35 165 25 109 -21 -176 8 100 32 -110 -26 -80 41 162 -1 -23 -33
3725 -33 223 147 -84 57 -40 -67 141 -108 14 30 -65 -111 -248 -156 151 -78 -120 -128 142 -90 140 112 -140 -90
3749 -90 -72 -192 192 98 -375 64 63 -96 40 -94 87 255 80 -28 -78 -133 -194 206 -19 -102 -305 110 -152
3772 -152 18 94 87 215 4 -10 -101 144 43 176 -3 53 -78 -10 156 -33 -97 30 167 4 -111 116 17
3795 17 97 35 17 9 -56 166 81 164 251 -39 -66 -54 45 -120 98 86 229 123 197 -104 -31 -112 66 127 194 -83
3821 -83 -44 70 -147 -38 -100 -240 126 89 -110 -3 43 55 -46 -10 27 33 215 322 107 -137 -52 53 -225 -171
3845 -171 -30 106 6 106 163 -237 -36 -156 -42 -66 183 -5 292 58 -204 -47 60 123 -135 36 161
3866 161 -91 -12 77 -28 -6 18 -70 171 -133 -57 46 28 24 -153 103 -22 -116 162 42 57 341 101 5 139
3890 139 -10 -49 121 -4 -203 -51 158 -32 -72 -55 54 111 -83 -49 194 244 -218 23 -24 21 -112 -135 -124
3913 -124 -485 94 171 -34 -66 16 2 -164 38 -80 -7 -50 113 -7 -199 84 -92 24 131 31 55 -130
3935 -130 114 -157 -139 1 -93 -140 -45 10 101 -41 164 -139 -73 -49 70 -187 -72 -169 52 249 145 54 -99
3958 -99 130 -83 -71 -110 -30 134 273 -35 -323 360 105 -65 148 -93 120 -265 95 133 8 106 171 -50
3980 -50 -38 -39 -36 -58 49 -84 -233 -377 82 -22 288 -50 -46 -231 -20 -103 60 69 -100 43 -71 -45 43 158 -10
4005 -10 -125 -84 286 -74 16 52 -41 -151 201 83 -166 31 169 -196 -230 -388 -118 -191 -19 82 -97 36
4027 36 -93 82 -34 -56 58 4 -47 31 -16 4 -18 161 -64 115 -80 -49 162 -7 -12 16 142 45 88 -104 234
4052 234 47 233 -31 51 128 -50 -37 -111 34 -65 -289 32 89 436 68 -3 32 82 148 198 51 -128 -164 -84
4076 -84 104 -23 100 21 -154 -1 -277 177 -6 140 -18 37 -28 -157 -65 199 210 -35 -35 92 69 12 42 -94
4100 -94 -116 41 138 -27 -3 -176 132 25 -169 -42 -80 26 181 -27 298 -18 120 42 14 55 -131 -167 -88
4123 -88 -94 6 -134 -16 236 201 -17 170 105 38 -140 212 -125 -108 53 23 -49 60 135 -6 -84 88 155 -130
4147 -130 217 31 77 -274 -207 -31 -200 -319 -246 22 114 69 66 -83 147 127 22 -122 330 -5 -136 14 -113
4170 -113 -7 246 49 56 -112 127 52 -75 -200 -34 -50 -11 -122 -17 -160 -53 136 -137 -459 111 23 -53
4192 -53 18 -174 -154 -182 82 237 109 -245 -151 -143 -268 -206 -40 97 92 -227 -13 -242 71 -186 -188 70 100 -571
4216 -571 30 228 190 -231 -35 -302 107 -36 -106 103 19 -211 7 -36 292 246 64 258 -159 -11 123 54
4238 54 29 -206 -149 188 83 46 -363 166 80 -98 9 255 -58 37 157 13 26 185 150 -115 -133 -24 -156
4261 -156 142 -118 -58 1 -2 25 -32 -158 -37 -256 -31 -85 -57 -193 -6 21 -12 99 -115 -136 -143 -188 24 213 289
4286 289 224 114 114 99 -53 54 -107 -20 4 -232 3 -91 196 -95 85 -168 -131 -115 -44 117 108 20 100 -101 11
4311 11 84 95 -48 111 -2 7 41 -123 -26 44 -147 -207 47 100 161 -119 -210 -68 -182 271 67 -186 -227 -172 -209
4336 -209 -118 293 -96 -5 203 23 -71 -8 -107 168 -178 -128 68 -17 81 -191 -38 -19 33 -4 -111 -67 -112 148
4360 148 32 -71 -369 130 182 -160 -58 98 37 203 218 -24 44 -264 -31 -189 212 130 -328 -210 303 207
4382 207 63 -98 -134 178 65 202 305 -23 -19 80 53 132 19 -65 33 -57 173 -9 -145 -1 -50 -19 25 -253
4406 -253 77 -127 -137 7 129 135 158 -256 -220 42 -136 280 -81 123 -10 -95 107 19 44 -135 -70 -6 -59 47
4430 47 -232 -62 163 33 19 179 -137 -162 -32 62 65 52 67 34 76 24 47 -46 2 -69 -206 -4 35 72 -274 17
4456 17 119 73 125 -215 272 -182 13 116 -85 84 -65 -108 -57 144 -120 -57 -67 -35 -130 -35 -89 101 22 -69
4480 -69 -206 -40 -40 102 -95 49 125 -193 124 -73 -150 78 92 50 97 61 6 230 80 107 -58 12 198 -124
4504 -124 -58 -38 -2 209 -199 -217 -44 110 -197 60 -102 -179 -174 225 -178 -78 -21 -46 89 4 48 155 50 -70
4528 -70 -98 26 15 -64 -128 186 13 -43 338 -111 -35 29 66 50 -184 -74 -74 -7 17 26 -106 124 255 222 -66 86
4554 86 17 -28 -64 43 -334 -141 178 -161 103 6 -36 -68 55 -158 -28 172 39 47 -72 42 -7 -142 -240 -94
4578 -94 -18 -91 43 282 -18 26 -223 -60 -50 -99 -3 55 -35 93 97 131 -147 -64 -46 95 -97 82 102 -138 85
4603 85 -166 115 -78 -47 15 116 30 -182 107 43 -170 166 -231 -159 -89 -127 3 67 -177 -84 174 34 75 -14
4627 -14 57 0 -36 91 174 -53 -111 -14 133 197 69 70 -53 -321 -55 29 195 58 -31 87 -121 105 -37 15
4651 15 -69 -101 -345 -116 -109 -64 -119 57 74 -12 1 -142 -62 16 -13 -60 -4 105 254 115 -19 -183 -122 296 287 -7
4677 -7 188 -171 -17 -124 140 103 26 -30 126 -30 58 162 -126 -74 229 -192 48 182 81 65 -51 18 51
4700 51 115 -157 -167 90 37 124 -93 -88 -44 260 206 -46 288 209 -307 190 305 -13 -184 13 80 -35 -91 60
4724 60 117 -96 -59 -53 3 -120 -145 -363 170 95 169 50 -199 -242 65 105 -164 21 -33 291 -11 122 -120 -258
4748 -258 -57 -149 30 -381 -2 15 -50 -20 -68 -30 309 147 -81 -285 191 78 39 -92 118 12 169 -69
4770 -69 -18 195 -29 -11 -177 6 -24 47 41 -38 -33 47 51 -71 11 -61 -83 156 89 105 -322 51 167 -19 199 -17
4796 -17 86 -59 42 285 166 -78 132 12 142 212 -28 -186 -62 124 31 256 50 124 309 -8 -157
4817 -157 -5 5 -25 -99 -54 89 123 -134 128 -10 -350 -63 96 10 100 -16 39 51 -108 -117 208 -156 -64 35
4841 35 196 124 -24 -30 38 59 -10 -4 -92 -28 12 244 76 133 -3 -68 107 128 160 157 2 -184 5 -125 36 27 0
4868 0 105 34 -6 -123 52 -82 -60 -63 -228 57 -145 253 61 -3 -76 -50 -203 48 54 2 4 -6 -66 135 -79 -61
4894 -61 -51 -174 48 86 126 -108 -24 192 -28 174 69 -251 8 9 -170 135 73 31 95 5 -16 200 -122 89
4918 89 258 -242 16 -227 -121 -1 -119 72 193 279 -95 -10 -145 149 -128 188 -58 160 2 -222 131
4939 131 -233 213 81 53 30 236 108 -28 111 65 -119 62 -194 203 43 42 -103 -69 110 -86 -165 -110 19
4962 19 149 -142 -37 -30 94 188 -3 -57 -16 246 311 -77 -45 -80 51 42 67 -138 -119 -267 206 -47 -53 -85 195
4987 195 -44 -31 93 -128 -99 74 122 -216 -107 -139 9 -163 168 -130 -63 92 -133 -113 105 -69 -87 78
5009 78 15 -34 -38 -168 -225 -169 -35 -77 -90 270 267 -177 193 284 29 253 164 75 -73 -219 29 -64 10 -165 -84 -253
5035 -253 -103 -137 -69 188 156 -113 -12 211 -28 -17 96 48 10 -106 -47 -82 -14 -103 -98 6 225 61 -116 -39
5059 -39 146 -73 -114 203 -351 -107 182 9 -69 -21 7 -20 -132 110 -28 221 50 131 -169 48 -89 36
5081 36 133 70 -249 -186 -39 202 88 255 33 -132 -17 -82 -224 -100 49 -270 52 143 -35 -64 207 -188
5103 -188 -324 -50 -96 42 333 -9 73 63 293 -92 46 33 197 108 -90 175 219 103 121 68 30 -48 -61 -82
5127 -82 -160 442 149 49 182 91 -16 -117 -28 69 25 213 -201 -146 -70 104 141 8 57 71 129 -309 77 -36
5151 -36 -55 -49 -63 -89 -2 78 267 85 -50 -145 128 3 -17 97 23 -46 -37 -59 36 149 -100 -86 -53 67 53 -52
5177 -52 221 -29 -187 152 98 9 -106 108 -145 25 -31 -23 -155 -88 34 -185 -21 8 13 7 67 -44 205 120 13
5202 13 -57 -106 -37 225 95 210 261 -6 47 20 357 81 -91 -55 -185 -116 106 78 133 -17 -14 -107 -69 -75 258 -132
5228 -132 40 107 -310 -96 77 89 -31 75 16 -93 31 56 -229 -180 -10 -202 45 -309 173 -126 151 48
5250 48 10 -268 -245 142 -22 78 345 253 -31 -51 294 139 -313 41 90 -191 -100 -135 0 21 132 127 -65 -98
5274 -98 215 68 254 -95 -153 -50 101 -140 2 178 75 104 123 -81 57 237 52 0 -51 -191 -48 107
5296 107 -38 171 159 -109 10 -212 102 32 -62 -23 -18 -37 -93 196 295 -41 -44 136 104 -154 -54 90 -83 69
5320 69 4 22 87 -4 17 -161 128 28 151 -127 141 -71 43 112 185 120 224 -217 -198 -180 26 92 97 119 -106
5345 -106 136 -270 69 166 40 -125 -24 77 165 -191 122 212 2 74 -17 153 129 -256 76 -36 -25 -61 12
5368 12 82 -4 57 -301 84 -100 12 -127 7 -208 -135 152 165 102 -141 26 -18 -188 -67 26 -7 87 -5 241
5392 241 -27 94 213 -139 -63 187 -112 -113 -215 -57 199 139 -3 -8 30 -75 134 -77 36 109 -66 -40 -166
5415 -166 70 -155 62 -10 -61 84 -68 224 -76 -124 -169 64 -108 250 16 131 -192 256 -130 -344 -63
5436 -63 51 -60 13 -86 -135 185 1 173 56 -24 37 174 -131 -94 126 69 -231 26 -236 23 1 -265 5
5459 5 59 167 112 49 19 229 -38 -340 -87 1 15 38 43 -171 -11 -30 -68 33 19 69 -143 -97 -3 64 -29 199
5485 199 64 82 -90 134 -46 -284 -68 -186 133 -3 -84 -108 -88 -128 183 180 -146 -124 88 76 -145 314 143
5508 143 -149 65 148 15 -21 -89 124 -47 55 -344 71 -86 -6 -105 200 -150 -104 71 -9 -54 24 -60 -28 44
5532 44 -64 20 117 93 3 168 24 148 -357 67 -180 0 -78 -96 21 -219 153 -144 -274 20 -138 50
5554 50 -214 -118 109 359 -130 -303 31 144 310 -234 178 -19 34 160 6 52 -86 -229 21 -65 -13 -144
5576 -144 56 -204 144 199 -100 73 -107 -126 -82 41 -26 -38 -87 131 97 -53 194 -73 66 -153 -277 427
5598 427 -228 7 -62 -39 30 79 -53 -131 40 -141 -111 112 -32 -51 -158 -82 129 106 82 98 55 -171 -162 7 -10
5623 -10 409 -92 29 -50 138 37 -330 -44 -62 65 -78 -116 27 -300 -197 -137 35 -35 -165 -112 87 -93
5645 -93 -33 -20 -11 375 -171 237 -52 69 56 124 108 -194 -145 -20 -66 79 -195 126 176 -216 -71 -48 172 -149
5669 -149 84 -106 114 -43 -386 22 161 -142 -145 58 287 44 101 42 -403 59 -122 48 435 -234 32
5690 32 7 -11 -86 3 -161 -54 45 -85 -102 -22 37 122 123 -73 131 -98 -101 108 -74 50 24 127 -138 52 135
5715 135 -132 226 -84 76 -31 -112 87 -199 108 62 124 -178 36 37 -240 344 19 128 88 6 -133 327
5737 327 -29 159 215 28 58 11 93 -13 -128 -9 -144 -216 252 -84 -66 -8 -19 -169 253 16 45 -206 231
5760 231 -288 98 -6 75 215 86 239 0 207 68 -126 21 -133 -97 9 -170 -34 35 -194 -31 -22 6
5782 6 77 32 94 165 9 -19 -5 127 154 57 121 -62 -31 135 -143 199 361 -177 -253 -40 150 -68 -128 90 48
5807 48 -65 -106 15 -14 -75 164 -40 -23 86 13 157 -164 20 26 29 -34 -103 -109 -97 118 -115 -60 -45 90 -35 -89
5833 -89 228 39 -36 -257 -6 94 6 -186 64 213 9 -12 53 -157 147 174 67 -107 -69 -66 93 104 -61
5856 -61 110 -71 158 50 95 -51 -115 83 43 41 -44 35 -80 -210 -46 -48 82 -61 -33 -106 -263 41 -14 -104 -196
5881 -196 216 -54 88 77 -212 -2 9 77 75 -99 -95 181 -50 33 275 162 144 -229 113 110 -91 -83 -72 -61 -89
5906 -89 -208 169 -106 66 -168 1 53 -133 -11 -191 -147 -78 -83 36 51 72 -138 89 156 115 -279 -52 210
5929 210 260 -161 -43 -58 191 131 -124 -24 0 93 -231 83 -54 -44 224 230 -89 87 55 -35 -132 29 138 64
5953 64 146 -25 -47 -101 -32 30 -173 -91 77 -55 55 166 -47 -304 53 -170 19 154 -70 249 -1 136
5975 136 -165 -107 210 -66 98 115 95 150 -20 276 -3 178 184 220 79 -50 40 -143 -22 32 51 -59 226
5998 226 72 64 -158 58 -3 -12 -41 82 -149 -303 33 59 179 83 40 -126 -195 102 -2 21 -90 3 5 23 151
6023 151 101 -3 -10 40 -71 -12 39 37 115 -28 30 -19 -106 -60 -196 156 -133 -138 91 -84 121 -214 -59 83 -90
6048 -90 38 -20 -15 -5 11 102 -97 91 -28 103 14 -46 47 -114 -131 69 62 -64 -63 150 103 10 -38 4 -93 377 193
6075 193 -271 -28 8 58 83 169 41 -25 -257 -53 52 -17 -63 35 -70 102 -4 35 -165 -142 -137 89 66 8 118
6100 118 -100 -76 27 -207 312 219 59 -103 0 -17 -39 -70 -297 27 356 114 -68 -103 55 -44 -130 -44 -126
6123 -126 217 64 -168 20 -122 -245 158 -48 6 89 -118 -54 112 128 109 -141 91 270 8 -121 187 222
6145 222 246 -197 -52 53 -293 152 -274 25 69 -137 -282 64 333 -58 132 -60 -83 92 -66 134 194
6166 194 -72 50 -24 112 5 43 -6 78 -2 4 -39 68 -15 38 -47 29 144 -148 299 120 -135 -124 -223 -23 -13
6191 -13 56 -60 20 32 -43 113 -115 114 49 -174 38 215 -161 -7 82 233 87 42 -226 -23 -133 -35 -4
6214 -4 -40 -72 23 21 93 201 -212 -168 -215 46 -261 -31 -12 -50 -215 94 -87 -59 -132 -92 80 95 -84 4 -148 -129
6240 -129 147 235 -197 -100 -241 -174 -166 -130 139 -151 -35 175 -54 86 147 -125 53 -47 8 226 -198 78 44
6263 44 -172 312 255 177 -80 -81 -26 -51 120 -199 -15 -21 -151 -92 -276 -107 45 116 -130 64 -46 38 -22 -17 -69
6288 -69 -163 -58 -3 -73 158 35 -175 -211 -84 -78 -212 -87 -66 104 -16 210 -85 -161 62 58 -120 7 18 26 -18
6313 -18 -25 130 126 158 -49 -119 83 -37 44 -19 69 -173 -53 6 -115 154 116 -200 -100 210 -102 -34 -6 -44 38
6338 38 32 -247 99 226 -38 -9 -70 -74 -158 145 -151 -117 32 34 113 22 -78 32 193 -13 -19 -167 -78 -180 95
6363 95 262 -315 44 -249 -225 9 -134 65 87 155 -120 224 -149 -118 27 -244 -69 -280 -6 -98 274 14
6385 14 -209 -9 -68 39 -48 55 -101 111 30 19 -95 149 -145 -35 -8 -49 -18 13 111 -76 87 189 39
6408 39 -139 7 178 99 -43 -324 -186 133 -198 -115 -179 67 53 -75 -296 -73 103 82 -192 167 -298 -138
6430 -138 -175 91 104 -138 120 -192 167 -24 24 103 19 -108 173 -146 -20 135 22 -105 159 11 46 -24
6452 -24 -175 -174 71 134 228 -5 -61 178 181 -207 -254 -170 55 -163 -155 183 -42 -81 -116 37 -71 198 150 49 -21
6477 -21 -53 -102 110 172 -121 -68 -167 103 -164 -50 122 -244 167 -47 242 200 -35 13 3 -142 3 105 -64
6500 -64 174 -8 109 201 6 -12 -83 53 58 -47 85 151 -14 -88 13 142 -166 -90 -121 -202 -176 -181 -56 90 -136
6525 -136 56 -59 267 -100 195 -182 155 255 -52 -161 62 81 32 -174 -76 28 171 155 -385 60 -31 -36
6547 -36 -4 -215 9 101 66 -14 107 -55 -127 32 238 95 76 120 124 -62 74 140 167 3 -6 -155 351 -227 52
6572 52 149 -37 -6 49 -127 -17 -134 57 36 116 146 210 186 140 96 -193 204 -282 -78 173 -2 -8 189 69
6596 69 14 -69 -107 10 201 115 196 158 23 64 -202 -137 70 -99 -65 -59 9 -363 -134 -114 82 32 5 138 -49
6621 -49 -185 81 341 -29 -54 37 166 102 -151 75 109 31 62 -64 -257 -39 63 61 -24 -48 -49 -150 5 -135
6645 -135 -54 50 148 -160 14 101 130 29 67 145 -189 65 -69 -203 -84 96 169 114 112 -109 -171 -22 50 95
6669 95 105 113 -33 -2 312 108 59 106 -333 93 -52 -177 160 112 92 51 26 -5 87 -166 56 31 -88 86 -143
6694 -143 204 -83 193 79 81 -56 124 129 94 -127 115 -5 -62 110 137 -145 -144 195 -169 -147 21 -45 -72 241
6718 241 174 -178 -107 141 235 -98 200 -112 -51 286 11 55 136 44 -78 -93 -235 -11 -170 71 -48 -299 6
6741 6 67 -72 -150 359 20 127 72 -65 -69 -112 168 -1 -35 173 303 224 68 113 -2 -11 331 -119 139 -23
6765 -23 -261 4 110 -20 -30 271 -117 -28 -84 -70 -183 -131 71 -92 -94 -5 -5 236 -5 -78 -55 -163 -16 10 -73
6790 -73 23 -13 39 27 -163 135 -89 47 198 -109 4 67 152 196 57 17 31 64 124 -96 -7 -76 -39 -252 -209
6815 -209 224 -11 -2 -230 79 -37 -34 19 55 29 66 52 8 51 -14 -27 -11 -42 -82 80 86 -207 -27 -153 68 -81
6841 -81 -137 121 202 -92 218 -141 -238 -28 -55 -46 97 86 -89 100 -130 185 26 223 -22 7 41 -236 91
6864 91 -33 -76 -44 -293 -82 -185 -3 -126 75 -25 -68 407 2 -42 -105 72 -13 -72 7 -272 56 15 -102
6887 -102 42 -11 160 -94 243 103 58 11 12 -8 53 182 46 46 251 -140 70 -86 -132 111 208 263 -100 385
6911 385 19 214 12 -36 50 61 21 -261 -4 186 -125 -179 239 67 62 -112 116 96 108 -125 -14 28 -1 117
6935 117 154 100 -89 -138 103 85 75 -18 87 162 45 346 217 86 -64 27 -88 -158 26 27 154 174 145 80 40
6960 40 144 -123 -180 55 0 152 -132 -118 4 49 124 29 68 45 -75 63 -153 159 72 -34 -31 70 -5 58 26
6985 26 -117 216 -171 -6 142 120 -257 190 -112 -92 243 240 151 -238 -204 187 -81 60 -55 4 -84 -158 -146 72
7009 72 -10 -117 100 244 231 194 61 -3 66 31 136 80 283 66 53 56 0 -220 33 -32 158 26 102 100 15 -82
7035 -82 -63 -234 -215 359 -54 312 81 -87 196 74 -209 -108 58 -109 -235 -23 106 -165 163 -218 -45
7056 -45 131 17 -124 40 218 166 -58 -116 -185 27 209 96 -56 58 22 -182 39 -5 109 -227 57 -1
7078 -1 31 227 182 78 88 198 -112 264 83 18 -203 -61 182 132 -6 304 -9 -53 -251 -368 -42 -171 -27
7101 -27 126 -238 -193 110 98 130 -145 -177 79 -79 166 40 33 -10 63 126 -79 70 78 97 -121 71 105 -12 -149
7126 -149 47 -87 163 51 71 -200 -242 -136 -98 0 -134 -107 40 76 -6 -7 -101 188 89 -14 211 69 -34 -55
7150 -55 175 159 -24 42 133 62 -89 39 -46 185 112 15 79 -34 50 26 11 -76 112 -148 -109 163 92 168 62
7175 62 223 -67 -22 110 93 -113 -31 -111 16 -79 -197 13 -20 -60 -290 129 42 22 154 -181 -34 -171 274
7198 274 70 135 -157 -41 189 143 15 128 -230 205 -82 -131 108 65 -4 -135 -9 -213 131 -113 -44 -96
7220 -96 -17 -135 -132 -17 72 -30 -312 117 -40 8 -62 -134 7 -2 132 -6 -52 283 67 95 -152 105 -103 -110 21
7245 21 123 28 -76 119 374 -60 -190 65 65 -71 115 118 243 -166 99 248 322 -41 -119 213 266 249 -186
7268 -186 -189 -61 179 15 8 -65 -55 -61 -220 83 157 46 164 33 -88 150 -61 -70 165 67 -52 -48 -35 -36 -45 -86 -130
7295 -130 89 -20 -205 -72 -297 136 -15 -22 121 -33 193 -13 -35 42 -30 32 156 -195 151 204 81 -13 -30
7318 -30 -219 -49 125 -300 -66 76 -34 -270 112 127 127 -164 62 -25 55 -116 -190 14 29 230 382 178 140
7341 140 -57 159 -55 115 -9 -287 144 91 -46 108 -60 -1 31 154 80 -27 6 139 -94 41 346 -168
7363 -168 26 171 19 43 73 39 2 193 14 304 38 21 -160 -122 -19 22 66 78 113 -37 -36 201 11 112
7387 112 -9 81 77 -75 130 -62 -46 -61 -120 64 131 -90 121 10 255 229 -50 -23 122 -85 -96 32 -95
7410 -95 149 -64 -84 207 -122 -71 442 80 -136 325 88 291 -116 -85 24 -80 143 221 62 106 -15 -87
7432 -87 -84 85 -97 -4 54 112 -126 -166 71 -160 57 -162 62 112 -79 -25 -63 -308 47 -25 64 121 -110 -120 227
7457 227 290 12 25 -100 -76 -37 -86 136 -50 134 154 -107 27 -45 -96 44 -199 54 -130 -159 30 9 -86 -22
7481 -22 -155 222 -134 -147 -101 -239 14 13 41 73 220 58 193 -27 -27 45 -25 -3 253 -115 4 14 -50 -55 67
7506 67 -51 31 -250 -62 148 -60 139 -249 142 -27 -135 274 -115 -16 144 1 254 83 -221 6 34
7527 34 -23 -332 -101 44 -218 -211 138 61 44 64 50 -203 6 -76 75 -233 -44 309 -223 -68 -44 48 -79 -48
7551 -48 -187 112 -324 93 -15 -123 19 -18 -132 57 -13 -111 11 97 -25 -344 11 -82 -41 74 13 75 -131
7574 -131 -272 345 -216 63 -218 159 220 1 358 -165 -168 161 212 -114 -75 56 164 -7 133 -191 69 114
7596 114 -101 -23 162 79 40 208 -101 63 -47 34 -72 -33 153 -261 -12 -235 -129 -89 175 74 38 42 67
7619 67 101 308 58 92 156 46 94 -70 168 44 61 77 54 -55 11 124 140 -237 113 -178 121 34 -174 75
7643 75 1 -125 43 54 -200 246 16 145 108 34 57 -203 -108 -24 15 176 20 8 -223 -83 179 -45 176
7666 176 60 -176 86 -60 47 59 -21 -50 225 -221 35 63 85 -52 -133 19 263 -259 60 -51 66 -82
7688 -82 -109 -107 66 83 -201 -52 -119 1 -89 -100 -238 -78 27 -71 184 -46 -106 58 220 -194 -34 57 37 7
7712 7 -39 92 152 149 -196 107 -156 -164 3 3 -118 30 60 214 -64 153 245 -194 -94 -127 100 135 136 -142 6
7737 6 114 184 5 46 -181 87 159 76 -17 -112 -20 -18 -168 -64 -35 -107 43 -79 -295 -3 77 -15 24 -11 198 69
7763 69 69 111 11 -19 221 136 75 21 70 129 164 -67 38 -1 -169 -170 -83 87 13 -21 -19 -119 225 47 107 3 -49
7790 -49 -308 17 154 70 4 -177 3 -3 238 160 -9 -24 80 20 361 126 -66 4 -110 118 -6 57 -84
7813 -84 -159 -206 310 50 29 181 -18 -50 -62 233 -86 -25 -48 25 -41 117 -111 -185 -76 84 29 171 163 122 154
7838 154 -115 116 53 -104 -43 18 168 -30 -143 169 -53 57 -134 -172 74 452 95 21 90 113 199 24 -103
7861 -103 -24 168 -53 312 -116 62 185 -166 -426 214 210 258 255 -34 -2 67 -103 -16 223 -18 -315 71 1
7884 1 125 83 260 -14 -229 114 76 -30 -61 75 -276 -55 -116 13 -128 -107 -86 74 43 -119 -152 -79 -110 -104 101
7909 101 134 -15 -27 -50 -24 171 144 234 79 53 200 -226 138 -298 -111 -18 63 -73 -33 28 51 177 -50 12
7933 12 -334 -65 268 204 191 -234 -211 -53 -63 102 220 143 -55 -29 180 -106 -90 -8 -14 40 129 -32 110 -127
7957 -127 182 113 -1 95 155 -11 -188 30 3 239 233 -129 52 -74 203 138 -109 -170 -39 106 12 92 30 57
7981 57 28 113 -87 220 199 -48 -12 29 -61 -51 -43 109 170 -217 103 116 218 -131 3 -55 -66 -104 -79 -151 -270 161
8007 161 -79 49 -35 58 -175 -87 -59 -135 -70 -61 13 -62 48 6 219 47 42 36 52 43 13 159 100 428 -67 97 -80
8034 -80 3 63 111 -31 97 -304 -12 84 -137 181 107 -186 -37 -81 -68 -114 -36 -79 -183 -222 17 22 107 -107 -111 -51
8060 -51 -136 -82 67 -94 119 66 -17 40 16 84 -45 200 -294 77 -88 84 -127 37 -77 181 38 154 -50
8083 -50 45 99 -84 -59 58 -89 163 -17 31 -5 213 -29 120 -7 -67 -47 274 -270 -300 -77 -250 -256 -218 289
8107 289 17 11 5 -14 -91 -204 -55 -215 29 26 142 -105 -40 -130 -210 -82 -15 -207 76 -18 -116 -116 105 -101 -74 -66
8133 -66 25 -61 129 98 -129 274 -50 -76 179 45 -93 120 -49 -70 -120 -285 -140 36 92 47 -85 -5 181
8156 181 36 -148 144 62 39 31 84 -105 7 -42 121 120 -202 164 -89 31 -176 -8 10 -79 117 -43 118
8179 118 137 -89 88 24 -116 225 -77 -78 -219 -19 82 -77
8191g7
##END NTUPLES=NMR FID
##END=
