##TITLE=1H_Pr A-329
 200.13MHz,CDCl3,
 8 sc
 
 23.6.2025
##JCAMPDX= 6.0         $$ Bruker NMR JCAMP-DX V2.0
##DATA TYPE= NMR FID
##DATA CLASS= NTUPLES
##ORIGIN= UXNMR, Bruker Analytische Messtechnik GmbH
##OWNER= pz
$$ XWIN-NMR		Version 3.5
$$ Mon Jun 23 14:56:44 2025 Russian Standard Time (UT+4h)  she@DPX200
##.OBSERVE FREQUENCY= 200.1313
##.OBSERVE NUCLEUS= ^1H
##.DELAY= (6, 6)
##.ACQUISITION MODE= SIMULTANEOUS
##.ACQUISITION SCHEME= undefined
##.AVERAGES= 8
##.DIGITISER RES= 18
##SPECTROMETER/DATA SYSTEM= spect
##.PULSE SEQUENCE= zg30
##.SOLVENT NAME= CDCl3
##.SHIFT REFERENCE= (INTERNAL, CDCl3, 0, 14.3821)
##AUDIT TRAIL= $$ (NUMBER, WHEN, WHO, WHERE, WHAT)
$$ ##TITLE= Audit trail, XWIN-NMR		Version 3.5
$$ ##JCAMPDX= 5.01
$$ ##ORIGIN= Bruker BioSpin GmbH
$$ ##OWNER= she
$$ F:/spectra/data/she/nmr/H-C/1/audita.txt
$$ ##AUDIT TRAIL=  $$ (NUMBER, WHEN, WHO, WHERE, WHAT)
(   1,<2025-06-23 14:55:20.21 +0400>,<she>,<DPX200>,
      <created by zg, POWCHK disabled, PULCHK disabled
       configuration hash MD5:
       00 E9 B6 7A A2 85 ED C7 34 08 36 98 17 FE 4E 26
       data hash MD5: 16K
       DC 12 05 CF 71 EB DA 68 E8 7F 18 1B 79 40 7C 0F>)
$$ ##END=
$$ 
$$ hash MD5
$$ E8 7D 3C 6F C1 11 54 9A FD D7 8D DC EE 3D 6D 6B
##$RELAX= 
##$RELAX= 
##$RELAX= 
##$RELAX= 
##$RELAX= 
##$RELAX= 
$$ Bruker specific parameters
$$ --------------------------
##$DU= <F:/spectra>
##$EXPNO= 1
##$NAME= <H-C>
##$PROCNO= 1
##$TYPE= <nmr>
##$USER= <she>
##$AMP= (0..31)
100 100 100 100 100 100 100 100 100 100 100 100 100 100 100 100 100 100 
100 100 100 100 100 100 100 100 100 100 100 100 100 100 
##$AQSEQ= 0
##$AQ_mod= 1
##$AUNM= <au_zg>
##$AUTOPOS= <>
##$BF1= 200.13
##$BF2= 200.13
##$BF3= 200.13
##$BF4= 200.13
##$BF5= 200.13
##$BF6= 200.13
##$BF7= 200.13
##$BF8= 200.13
##$BYTORDA= 1
##$CFDGTYP= 0
##$CFRGTYP= 5
##$CHEMSTR= <none>
##$CNST= (0..31)
1 1 145 1 1 1 1 1 1 1 1 1 1 1 1 1 1 1 1 1 1 1 1 1 1 1 1 1 1 1 1 1 
##$CPDPRG= <>
##$CPDPRG1= <>
##$CPDPRG2= <>
##$CPDPRG3= <>
##$CPDPRG4= <mlev>
##$CPDPRG5= <mlev>
##$CPDPRG6= <mlev>
##$CPDPRG7= <mlev>
##$CPDPRG8= <mlev>
##$CPDPRGB= <>
##$CPDPRGT= <>
##$D= (0..31)
0 0.7 0 0 0 0 0 0 0 0 0 0.03 0 0 0 0 0 0 0 0 0 0 0 0 0 0 0 0 0 0 0 0 
##$DATE= 1750676119
##$DBL= (0..7)
120 120 120 120 120 120 120 120 
##$DBP= (0..7)
150 150 150 150 150 150 150 150 
##$DBP07= 0
##$DBPNAM0= <>
##$DBPNAM1= <>
##$DBPNAM2= <>
##$DBPNAM3= <>
##$DBPNAM4= <>
##$DBPNAM5= <>
##$DBPNAM6= <>
##$DBPNAM7= <>
##$DBPOAL= (0..7)
0.5 0.5 0.5 0.5 0.5 0.5 0.5 0.5 
##$DBPOFFS= (0..7)
0 0 0 0 0 0 0 0 
##$DE= 6
##$DECBNUC= <off>
##$DECIM= 32
##$DECNUC= <off>
##$DECSTAT= 4
##$DIGMOD= 1
##$DIGTYP= 9
##$DL= (0..7)
0 120 120 120 120 120 120 120 
##$DP= (0..7)
150 150 150 150 150 150 150 150 
##$DP07= 0
##$DPNAME0= <>
##$DPNAME1= <>
##$DPNAME2= <>
##$DPNAME3= <>
##$DPNAME4= <>
##$DPNAME5= <>
##$DPNAME6= <>
##$DPNAME7= <>
##$DPOAL= (0..7)
0.5 0.5 0.5 0.5 0.5 0.5 0.5 0.5 
##$DPOFFS= (0..7)
0 0 0 0 0 0 0 0 
##$DQDMODE= 0
##$DR= 18
##$DS= 0
##$DSLIST= <SSSSSSSSSSSSSSS>
$$ [...]
##$SUBNAM0= <"">
##$SUBNAM1= <"">
##$SUBNAM2= <"">
##$SUBNAM3= <"">
##$SUBNAM4= <"">
##$SUBNAM5= <"">
##$SUBNAM6= <"">
##$SUBNAM7= <"">
##$SUBNAM8= <"">
##$SUBNAM9= <"">
##$SW= 18.0517328524113
##$SWIBOX= (0..15)
0 0 2 0 0 0 0 0 0 0 0 0 0 0 0 0 
##$SW_h= 3612.71676300578
##$TD= 16384
##$TD0= 1
##$TE= 0
##$TE2= 300
##$TE3= 300
##$TEG= 300
##$TL= (0..7)
0 120 120 120 120 120 120 120 
##$TP= (0..7)
150 150 150 150 150 150 150 150 
##$TP07= 0
##$TPNAME0= <>
##$TPNAME1= <>
##$TPNAME2= <>
##$TPNAME3= <>
##$TPNAME4= <>
##$TPNAME5= <>
##$TPNAME6= <>
##$TPNAME7= <>
##$TPOAL= (0..7)
0.5 0.5 0.5 0.5 0.5 0.5 0.5 0.5 
##$TPOFFS= (0..7)
0 0 0 0 0 0 0 0 
##$TUNHIN= 0
##$TUNHOUT= 0
##$TUNXOUT= 0
##$USERA1= <user>
##$USERA2= <user>
##$USERA3= <user>
##$USERA4= <user>
##$USERA5= <user>
##$V9= 5
##$VALIST= <valist>
##$VCLIST= <CCCCCCCCCCCCCCC>
##$VD= 0
##$VDLIST= <DDDDDDDDDDDDDDD>
##$VPLIST= <PPPPPPPPPPPPPPP>
##$VTLIST= <TTTTTTTTTTTTTTT>
##$WBST= 1024
##$WBSW= 4
##$XGAIN= (0..3)
0 0 0 0 
##$XL= 0
##$YL= 0
##$YMAX_a= 602385
##$YMIN_a= -644090
##$ZGOPTNS= <>
##$ZL1= 120
##$ZL2= 120
##$ZL3= 120
##$ZL4= 120
##$ABSF1= 10
##$ABSF2= 0
##$ABSG= 5
##$ABSL= 3
##$ALPHA= 0
##$AQORDER= 0
##$ASSFAC= 0
##$ASSFACI= 0
##$ASSFACX= 0
##$ASSWID= 0
##$AUNMP= <proc_1d>
##$AZFE= 0.1
##$AZFW= 0.1
##$BCFW= 1
##$BC_mod= 2
##$BYTORDP= 1
##$COROFFS= 0
##$CY= -3
##$DATMOD= 1
##$DC= 2
##$DFILT= <>
##$DTYPP= 0
##$F1P= 0
##$F2P= 0
##$FCOR= 0.5
##$FTSIZE= 0
##$FT_mod= 4
##$GAMMA= 1
##$GB= 0.15
##$INTBC= 1
##$INTSCL= 1
##$ISEN= 128
##$LB= 0.25
##$LEV0= 0
##$LPBIN= 0
##$MAXI= 10000
##$MC2= 0
##$MEAN= 0
##$ME_mod= 0
##$MI= 1.114404
##$NCOEF= 0
##$NC_proc= 0
##$NLEV= 6
##$NOISF1= 3.799351
##$NOISF2= 2.8
##$NSP= 1
##$NTH_PI= 0
##$NZP= 0
##$OFFSET= 14.38212
##$PC= 1
##$PHC0= -1196.158
##$PHC1= 10.7922
##$PH_mod= 1
##$PKNL= yes
##$PPARMOD= 0
##$PSCAL= 0
##$PSIGN= 0
##$REVERSE= no
##$SF= 200.129724274929
##$SI= 16384
##$SIGF1= 3
##$SIGF2= 2
##$SINO= 400
##$SIOLD= 16384
##$SREGLST= <1H.CDCl3>
##$SSB= 0
##$STSI= 0
##$STSR= 0
##$SW_p= 3205.1282051282
##$SYMM= 0
##$S_DEV= 0
##$TDeff= 0
##$TDoff= 0
##$TI= <>
##$TILT= no
##$TM1= 0
##$TM2= 0
##$TOPLEV= 0
##$USERP1= <user>
##$USERP2= <user>
##$USERP3= <user>
##$USERP4= <user>
##$USERP5= <user>
##$WDW= 1
##$XDIM= 8192
##$YMAX_p= 0
##$YMIN_p= 0
$$ End of Bruker specific parameters
$$ ---------------------------------
##NTUPLES= NMR FID
##VAR_NAME=  TIME,          FID/REAL,        FID/IMAG
##SYMBOL=    X,             R,               I
##VAR_TYPE=  INDEPENDENT,   DEPENDENT,       DEPENDENT
##VAR_FORM=  AFFN,          ASDF,            ASDF
##VAR_DIM=   8192,          8192,            8192
##UNITS=     SECONDS,       ARBITRARY UNITS, ARBITRARY UNITS
##FACTOR=    0.0002768,     1,               1
##FIRST=     0,             0,               0
##LAST=      2.2672688,     0,               0
##MIN=       0,             -644090,         0
##MAX=       2.2672688,     602385,          0
$$ Real data points
##PAGE= N=1
##DATA TABLE= (X++(R..R)), XYDATA
$$ [...]
3158e58n078Q572J459r354K608Q235o254n379Q560J680r221K193Q301n689n737
3173e662Q028K401r088J147R090n665o233Q273K593r101J058Q529m672o239P162
3188A621L417q934N79Q625m018o826P165L763q624j38Q649l589p001O563M377
3203E629q591m38Q647l448p351O368M560q357j004Q519k685p260N725N250q184
3218b620j439Q589k000q029N825N287p899j709Q357k215p438M675N638p307k744
3233e029Q527j413p674M588N783p055k743Q545r03q052M672O090o861l268Q428
3248C635l19q456L794O615o755l538P839J81q048L314O741o289m091Q524Q95q500
3264d458L110P092n809m464P858J104p942K353O972n623m906P649J561q562J942
$$ y = [-558, -5636, 2936, 4395, -4959, -2351, 5884, -370, -5749, 2811, 4491, -4730, -2537, 5764, 75, -5662, 2366, 4767, -4321, -3174, 5916, 251, -5982, 2291, 4884, -4217, -3159, 5370, 698, -5541, 1621, 5038, -3896, -3317, 5308, 1290, -5536, 1629, 5392, -3232, -3370, 5279, 1690, -5311, 1252, 5629, -2962, -3400, 5247, 1799, -5552, 816, 5376, -2981, -3985, 4534, 1849, -5411, 314, 5564, -2620, -4059, 4530, 2530, -5499, 326, 5613, -2286, -3995, 4362, 2147, -5291, -616, 5022, -2285, -5029, 3498, 2085, -5589, -1001, 4782, -2273, -5016, 3529, 2626, -5426, -754, 5336, -1525, -4793, 3635, 3316, -5140, -1346, 5269, -1486, -5024, 2815, 2996, -5052, -1738, 5003, -1286, -5377, 3147, 4042, -4458, -1348, 5744, -65, -4529, 3329, 4433, -3509, -1156, 5816, 193, -4713, 2936, 4497, -4065, -2123]
3279b123P442n164n506P464K154q226J510P801m697n572P382K632q458J137P706
3294E482m375n975O602K680q017K64P717l734o797O756L179p976O4Q159l558o286
3310e815O232L843p466n61Q035k708o755N706M134p810p42Q010k791p143N413
3325d18M586p477j538Q043j828p143N308N393p186j679Q177j378p267M752N204
3340E549o756k264P638o97p865M130N651o908k583P813o88p649L908N767o012
3355i66l081P698k6p385L415O291n935l499P362L31p684K758O153n835m114P098
3371B581O71p826K267O663n266m217P242J233p526K288O401m550m626O813J622
3386C770p423J514O678m489n039O461J849p823J390O508m200n017O283K362p050
$$ y = [-2123, 5319, 155, -5351, 2113, 4267, -3959, -2449, 5352, 655, -4917, 2465, 5097, -3361, -2224, 5482, 1107, -4868, 1734, 4414, -3603, -3339, 4378, 644, -6153, 603, 3782, -4194, -4130, 4029, 471, -5815, 417, 4260, -3206, -3767, 4268, 1560, -5195, 511, 4645, -3165, -3907, 4103, 1312, -5831, -418, 4168, -3309, -4847, 3196, 1368, -5775, -467, 4926, -2260, -3939, 4238, 2860, -4407, 345, 5549, -1207, -3471, 4167, 3470, -4395, -265, 5386, -1522, -4105, 3708, 3020, -4629, -721, 5046, -966, -4047, 3651, 3625, -3760, -345, 5946, 11, -3488, 3874, 4205, -3479, -721, 5432, -403, -4517, 2581, 3252, -4574, -2307, 4356, -910, -5127, 2115, 3348, -4178, -1890, 4511, -39, -4665, 2148, 3770, -3653, -2139, 4539, 50, -4989, 1472, 3321, -4502, -3112, 3396, -804, -5821, 462, 2824, -4226]
3401d226O98P380l666n339O503K892p199O45O942l247n688N571L214p142l95P203
3417D146l045o110N289L806p036m41P520k467o181N514M013o873p34P455k098
3432B758o398M947M273o782j741P295j850o646M345M309o604j589P009j280o657
3447d611M322M825o252j636O879p14o623L634N022n905k627P107p92p027L599
3462g99N076o298k769O939k87o966L112N636n398l096O778L74o637K665O126n072
3478f16l582O522O57o725K018N928m745l951O193J210p171J866O482m331m452
3493d697O366J392o652J473O544l897m406N879K146o864J108O387l755m854N653
3508A823K235o572N98O000l333m943N417K887o938N08O660l172n226N651K743
$$ y = [-4226, -3528, 3852, 186, -5153, 1350, 4242, -2957, -2312, 4630, 1383, -4305, 1266, 4480, -2662, -3057, 4146, 1101, -5009, 280, 4086, -2950, -3391, 4129, 1662, -4519, 995, 5008, -1865, -2599, 4856, 2758, -3640, 1307, 5580, -1202, -2943, 4352, 2502, -4144, 201, 4510, -2094, -3683, 3326, 2046, -4611, -289, 4536, -1716, -3352, 3527, 2813, -3810, -176, 4846, -1059, -3686, 3421, 2629, -4398, -799, 4277, -2021, -4790, 2149, 1862, -5104, -1992, 3644, -1754, -4850, 1928, 2302, -4335, -1670, 4456, -616, -4198, 2324, 2981, -3744, -1726, 4202, -543, -4494, 1699, 2909, -4262, -2396, 4086, -245, -4697, 1669, 3061, -3591, -2118, 4426, 529, -3877, 2002, 4148, -2716, -1608, 4779, 1024, -3830, 1823, 4058, -2514, -1916, 4084, 751, -4192, 1225, 4112, -2826, -2318, 4342, 1170, -4056, 1595, 4338]
3523D338o537K72O096k635n441M980L040o115q05O579k783n434M450L723o306
3538b578r76O583j839n628M395M061n953j659P023j571o044M207M126n927j760
3553c540O492j015o088L329M639n764k080O639o35o068L425M725n601k031O178
3568B605j81o137K908M986m738k930O104K25o456K848M870m873k912N936N24o061
3584c282K099N283m549l304O115Q01o252J879N418m195l382N506J140o282J373
3599a632N750m065l792N413J457o188J143N701l761m171N527J771n784M24N720
3614C513l045m268N096K044o180N07N772k634m774M916K289n921K65N888k468
3629A000m793M692K924o162k05N906k312m790M391L018n743o83N780j397n535
$$ y = [4338, -2199, -1927, 4169, 1534, -3907, 1073, 4113, -2002, -2807, 3772, 989, -4445, 5, 3728, -2578, -3554, 3029, 1190, -4438, -43, 4018, -1935, -3594, 3429, 1858, -4186, 21, 4147, -1780, -3540, 2952, 1937, -4151, -822, 3817, -1947, -4027, 2612, 1977, -4091, -666, 4059, -1542, -3573, 2605, 2424, -3713, -805, 4181, -557, -3487, 2617, 2842, -3614, -766, 4104, -769, -3681, 2255, 2779, -3282, -1183, 4100, -449, -3753, 2362, 3163, -3089, -1210, 4208, 13, -3369, 2137, 3277, -3005, -1632, 4118, 53, -3739, 1674, 3131, -3057, -1914, 3787, 26, -4145, 1382, 3153, -2631, -2207, 3513, 468, -3800, 1296, 3340, -2840, -2333, 3439, 805, -3969, 947, 3236, -2685, -2420, 3468, 1000, -3793, 899, 3823, -2339, -2544, 3362, 1050, -3740, 651, 3669, -2074, -2757, 3023, 1626, -3909]
3644c909M164L350n562p74O023j789n056L784L717n441j323N926j304n468L586
3659g6L677n210j550N833j103n355L204L954m787j922N607k33n714K998M291m655
3675a041k223N715q4n812K486M776m508k830N635K2n753K399M811m578k515N314
3691A814N03n695J979M979l994l143N496J026n836J591N240l938l361N358J119
3706C138n905R56N271l230l690M834J426n425N60N504k979l818M973J718n588
3721b255M93N535k802m136M620J999n492N0N334k587m397M377K234n156l82N423
3737B858k259m417L956K889n104m35N538j829m779M197K682n090o53N408j650
3752A312n005L571L255m958j403N503j428m846L717L140m452j287N283j000m813
$$ y = [-3909, 255, 3605, -1957, -2731, 3292, 1503, -3553, 231, 3948, -1493, -2816, 3110, 1806, -3662, -76, 3601, -1609, -3159, 2674, 1571, -3784, -580, 3374, -1413, -3335, 2272, 2039, -3675, -677, 3614, -1041, -3264, 2451, 2367, -3445, -959, 3817, -691, -3521, 2114, 2136, -3617, -1218, 3593, -985, -3500, 1814, 2317, -3378, -1399, 3580, -414, -3557, 1939, 2965, -2871, -1280, 3960, 22, -3339, 2019, 3138, -2767, -1811, 3460, 230, -3460, 1374, 2800, -2625, -2065, 3439, 460, -3358, 1615, 3333, -2255, -1762, 3773, 971, -3165, 1455, 3454, -2038, -1988, 3346, 759, -3638, 739, 2973, -2183, -2565, 2858, 599, -3818, 138, 3027, -2077, -2512, 3026, 1197, -3582, 615, 3297, -1793, -2446, 2962, 1312, -3693, -122, 3133, -1825, -3228, 2275, 847, -3999, -282, 2858, -1594, -2881, 2402, 1402, -3411]
3767c411L272L483m259j645N277o62n250K908L930m714j769N175m49n095K386
3782h23L994m154k272N702k58n016K209M337l942k379N101K36n034J791M271l759
3798Dk843N079M84n432J547M528l604k936M802N02m890J354M958l547l072M691
3814A625J397n205R75M504l097l268M256J529n044O21M465k887l633M427J651
3829B316m963J46N186k356m148M274K106m934J92N098k245l943L748K380n009
3844b152j24M964k064l790L285K541m604n93N034j735l941L377K694m565n01M951
3860B777j331m245L233K895m307r69M637r90m399K832L198m388j354M883r99m442
3876b969K811L286m139j440M889p68m373K509L410l881j826M823k32m685K245
$$ y = [-3411, -139, 3344, -915, -2560, 2717, 2055, -3195, -287, 3643, -1071, -2840, 2335, 1886, -3209, -823, 3171, -983, -3255, 2447, 2189, -2827, -618, 3719, -223, -2602, 2499, 2735, -2299, -508, 3763, 4, -2839, 2240, 2724, -2708, -1161, 3367, -237, -3173, 1629, 2131, -2759, -1405, 3553, 6, -3066, 1625, 3022, -2183, -1208, 3296, 199, -3069, 1187, 2716, -2328, -1707, 2758, -129, -3762, 665, 2316, -2647, -2501, 2685, 329, -3819, 455, 2561, -2373, -2181, 2917, 672, -3271, 477, 2857, -2152, -2276, 2688, 624, -3166, 119, 2660, -1944, -2537, 2497, 762, -3179, 198, 2892, -1673, -2174, 2777, 1446, -2799, 434, 3329, -978, -1947, 2690, 1700, -2699, 133, 3331, -1057, -2411, 2472, 1473, -2969, -158, 3128, -1011, -2451, 2438, 1670, -2703, -194, 3216, -665, -2491, 2332, 2100, -2585, -340]
3891c40L408l669k190M506L6m635J961L702l461k246M611J84m843J877L811l195
3907d83k501M538K73m647J619M097k881k897M136Q25m597R99M073k599k990M164
3923A129Q87m508Q76M434k746k953L835J409m376N36M534k732l248L845J681m442
3939a839K79M478k292l444L672J882m456k6M563j916l623L434J973m261m23M507
3955B508j582l701L341K276m135n46M351j372l777K671K683l867j106M634j136
3970A242l881K691K635l951r14M153o91m064K616K891l625j406M256l18m366K387
3986c45L010l432j579M132l79l552J741K971l193j681M054J29m209J734L218l270
4002f51j771L945K72m206J758L264k697k460M128O15m247J309L413k821k490M021
$$ y = [-340, 3068, -601, -2791, 1715, 1751, -2884, -923, 2779, -682, -2928, 1683, 1867, -2976, -1099, 2712, -483, -2984, 1554, 1827, -2820, -1201, 2896, 15, -2882, 1254, 2079, -2518, -1519, 2554, -45, -3035, 1129, 2016, -2492, -1616, 2818, 72, -2881, 954, 2363, -2013, -1477, 3057, 325, -2923, 922, 2603, -1839, -1560, 2918, 626, -2818, 854, 2736, -1720, -1746, 2817, 901, -2722, 712, 2685, -1576, -1999, 2508, 926, -2775, 566, 2842, -1293, -1839, 2512, 1140, -2637, 34, 2717, -1150, -2256, 2378, 1242, -2639, 52, 2687, -1264, -2178, 1975, 1284, -2780, -164, 2727, -898, -2304, 1952, 1634, -2732, -345, 2665, -767, -2346, 1786, 1407, -2145, -404, 2567, -626, -2307, 1747, 1876, -2333, -599, 2619, -651, -2422, 1523, 1795, -2411, -653, 2611, -86, -2546, 1582, 2197, -2050, -741, 2672, -149, -2639, 1382]
4018A382M67l935J043L620k530k612L668P09m063J125L417k373k311L425J036
4033B068l999O58L634j997k730L225J120l944M67M015k034l085L283J567m164
4048a916L50L547j537l239L303J877m133jM109j488l421L092J903l914o4L683
4064B151j162l416K778K177l779m77L672j009l398K504K223l422q57M190j066
4079A109l673K699K578l475j088L924n22l530K052K659l590j230L909m28l664
4094b270J739K847l234j454L710o2l668J689K830k930j457L803ol648J505K934
4110B328k734j903L576L73l922J419L088k675k107L511L91l625J272L230k474
4125b52k033K993J067l748R30L517k236k440L300P71l502O10L216j876k395K848
$$ y = [1382, 1849, -2086, -1043, 2577, 47, -2565, 1103, 1812, -2251, -1126, 2291, -82, -2393, 1032, 2068, -1931, -1273, 2361, 364, -2366, 859, 1979, -1965, -1498, 2517, 483, -2602, 681, 2248, -1916, -1566, 1981, 444, -2795, 508, 2385, -1748, -1749, 2360, 872, -2549, 543, 2446, -1468, -1532, 2151, 989, -2427, 351, 2528, -1251, -1728, 1944, 935, -2463, 41, 2264, -1158, -2015, 2175, 1109, -2564, 135, 2713, -762, -1850, 2074, 1552, -1978, 74, 2733, -857, -2087, 1822, 1394, -2270, -531, 2316, -918, -2372, 1338, 1276, -2392, -703, 2127, -803, -2260, 1543, 1537, -2111, -606, 2328, -406, -2309, 1267, 1640, -2282, -863, 2225, -450, -2557, 954, 1345, -2280, -1008, 2222, -252, -2285, 708, 1775, -1973, -1043, 2474, 238, -2202, 1098, 1869, -1633, -1023, 2193, 317, -2078, 770]
4141G70R40l455M92L325j891k386L026J309l618M28L147j597k429K766J411l535
4157a297K33L434j633k897K811J528l168l71L295j340k856K446J957l332l82L471
4173A899j377k700K449J901k956q46L392q51k923K091K017l268q43L452m75l202
4189b240J878K180k826r12L344k63l432J895K699l150r66L059k8l143J579K677
4205B351k827j306L123J27l589J440K728k619j433L181J94l285J207K681k224
4220b51j867L273J72k945R22K910k168j829L011K64k948P11K631j699k000K795
4236I82P77l212P93K557j904j811K679Q15l202N32L115k025j964K614J034l018
4252a238J47L086j655k260K611J099l117n7L147j387k026J840J486k847k43L016
$$ y = [770, 1710, -1745, -1253, 2072, 181, -2205, 821, 2130, -1488, -1060, 2087, 490, -1939, 827, 2238, -1297, -1064, 2370, 737, -2160, 651, 2179, -989, -1360, 1935, 595, -2261, 185, 2142, -1190, -1572, 1899, 522, -2178, 271, 2172, -784, -1630, 1762, 911, -2012, 79, 2096, -1172, -2015, 1437, 962, -2240, -362, 1818, -1008, -1920, 1424, 1161, -2271, -376, 2323, -827, -1793, 1266, 1238, -1905, -326, 2351, -476, -1782, 1341, 1468, -2121, -681, 2047, -572, -2005, 1176, 1370, -1915, -708, 1973, -251, -2118, 1155, 1327, -1618, -696, 2214, 46, -1783, 1228, 1492, -1456, -745, 1886, 187, -1813, 982, 1759, -1453, -660, 1897, -7, -1818, 861, 1676, -1526, -994, 2121, 96, -1868, 746, 1780, -1238, -1091, 1995, 340, -1920, 691, 1790, -1327, -1384, 1763, 376, -1650, 190, 1676, -1171, -1414, 1602]
4268A602j108k318K164J485k839m38L093j103k535K221J425k759L2K621j009k313
4284a779J836J937k934n23K946q28k484J894J658k555m71K935q72k613J784K049
4300A980k618o85K593l11k654J554J901k430p81K686m1k678J221J971k219j056
4316a567K527J62k827J152K187k101j293K674J67k550J008K215k024j125K382
4331I87K29k306N18K145j525j731K301P63k818N69K446j605j727K402R57k840
4347a235N32K270j449j403K114O00k755M59K644j715j572K089J028k491l9K391
4363A468j245j957K168Q20k413K02K227q91j935J963J293k700O8K330q84k096
4379a582J670J452k598n7K448r26k041J824J169k183n85K584n90k224J594J452
$$ y = [1602, 494, -1824, 340, 1825, -1014, -1452, 1641, 538, -1997, 224, 1649, -1110, -1078, 1543, 534, -1779, 57, 1994, -940, -1463, 1483, 655, -1829, 65, 1723, -832, -1303, 1632, 760, -1853, -69, 1980, -638, -1323, 1270, 959, -1695, -141, 1760, -670, -1451, 1235, 1194, -1484, -263, 1708, -511, -1567, 960, 1122, -1705, -553, 1634, -467, -1760, 914, 1081, -1469, -461, 1754, -270, -1395, 987, 1216, -1090, -572, 1573, 48, -1683, 618, 1381, -1437, -868, 1578, -27, -1754, 648, 1605, -1235, -703, 1567, 118, -1285, 829, 1429, -1326, -867, 1777, 62, -1510, 579, 1607, -884, -923, 1468, 223, -1734, 434, 1254, -1159, -957, 1270, 379, -1556, 407, 1700, -1000, -932, 1398, 514, -1582, 88, 1540, -1058, -1115, 1333, 407, -1634, 190, 1359, -824, -1409, 1175, 585, -1639, -45, 1407]
4395A407k044o60K488n07k092J549J337k213n21K328l68k271J347J768j806j071
4411a329K286l95k055J377J584j982o83K224j21j996J023J695j824q05K102j98
4427I03j972J035J636j901q86K312k49k014N95K234j645j317K083L19k000N00
4443c67J954j679j260K242K70k165M24J872j305j372J964M39k129O36J776j661
4459c61j028J815N49k087K88K162j439j390J956N61k102K17K274j107j615J553
4475B46P85j947j10J860o42j975J653J287k049j03J807o77j518J572J203k160
4491g68mK232r32j665J367R50j918j82K161r45j724J492J247j875l88J917m44
4508E21j563J180J065j482m33K111p96j597J199J241j681n45J793k08j905J021
$$ y = [1407, -637, -1297, 1191, 684, -1408, 141, 1478, -735, -1256, 1072, 704, -1567, -220, 1548, -258, -1329, 957, 562, -1493, -116, 1468, -514, -1197, 1027, 906, -1090, -67, 1628, -196, -1001, 1101, 903, -1069, -34, 1602, -299, -1185, 1127, 878, -1136, -541, 1693, 48, -1269, 814, 1133, -867, -367, 1587, -92, -1352, 890, 1160, -1005, -581, 1291, -14, -1386, 578, 1017, -1112, -476, 1300, -361, -1389, 426, 975, -1112, -824, 1338, -101, -1491, 465, 1026, -1076, -859, 1415, 308, -1307, 246, 1031, -916, -1026, 834, 192, -1783, -130, 1157, -892, -995, 812, 135, -1383, 189, 1392, -768, -772, 1460, 528, -1137, 230, 1180, -738, -920, 1241, 296, -1428, 64, 1311, -564, -952, 965, 521, -1042, 138, 1203, -279, -712, 1399, 603, -994, 205, 1446, -235, -780, 1013, 805, -1100, -79]
4524g9J302j750k77J762m17j813J174J284j645q44K177j54j925J039J415j616
4540c67o91K098l98j810R65J357j582n65J421J63j823O90J529j574p42J861K0
4557E52j957R93J522j232j262J959J98j537L89J526j283q58J632J93j865N44J589
4574A103j171j076J608L87j992M96J732j189r93J518N79j608K8K063j073j217
4590h05J542L13j739K45J950j228j213J346P26j968K11J734q71j262J545L26j613
4607g61J06J725p77j199J177P27j552l5J640p65j528J261R13j562p0J379n77j176
4625a074J232O60j654L1J647n87j226Q87J306j727l77J752n62j410J235Q47j551
4642e71k91J626n10j516R71J146j268p37J814k40j602J091J140j248q80K002k35
$$ y = [-79, 1223, -527, -804, 958, 541, -1272, -98, 1186, -459, -1303, 874, 720, -1205, -166, 1249, -367, -1058, 1040, 642, -1168, -203, 1154, -428, -993, 428, 591, -1232, -542, 987, -587, -1329, 532, 552, -1405, -412, 1110, -122, -1384, 575, 773, -764, -375, 1151, -132, -990, 642, 835, -1030, -486, 1103, -68, -1144, 464, 851, -1141, -645, 1087, -102, -1095, 423, 1002, -606, -578, 1485, 412, -805, 737, 1050, -689, -444, 1506, 278, -935, 411, 1137, -831, -620, 1114, 243, -1019, 526, 852, -761, -655, 1070, 293, -906, 271, 998, -554, -589, 1051, 286, -1242, 19, 932, -630, -700, 679, 102, -1074, 158, 818, -836, -805, 842, 255, -971, -84, 1222, -505, -882, 870, 308, -1102, 133, 980, -571, -862, 764, 254, -1262, -291, 855, -413, -1150, 664, 424, -1178, -87, 1053, -195, -1075, 927, 692]
4659F92j470O79J312j402m21J320j13j388R19R28j365m84J423q9j586R01J237
4676A093j295o62J641j15j393P93J215j490p35J887k62j556P28J167r95j143J669
4693E47Pj457N38J443j182q39J440K83j424L80J199j004p92J434M96j813M04J404
4711A064j088j013J407M15j558L82J202p25r68J162M26j395J54J326q09r35J546
4728E93K01j380J87J135p67j049J293P67j573J01J345p32j074J183O16j459j0
4745f23J352o00j083J001Q95j417k39J478m94j136R46O79j223k57J508m06j255
4762h74Q34J066j589j42J355l59j222R91Q38j273k93J313k69j322R02P43j083
4779c84l68J405j07j296O49J070j326l68J117l1j101O32J182j378n40J414K9j555
$$ y = [692, -778, -99, 1213, -189, -610, 710, 597, -791, 128, 1056, -309, -793, 630, 541, -1045, -144, 1093, -202, -864, 777, 662, -731, 62, 1277, -213, -948, 939, 677, -879, -151, 1016, 21, -1122, 547, 554, -903, -365, 1078, -104, -943, 497, 780, -644, -264, 935, -69, -861, 573, 1069, -744, -340, 1064, -24, -1037, 370, 785, -773, -391, 811, 86, -882, 280, 706, -689, -535, 791, -18, -953, 593, 794, -586, -399, 736, -31, -1080, 213, 980, -593, -492, 853, 121, -953, 230, 846, -613, -623, 729, 129, -954, 47, 942, -475, -714, 764, 270, -866, 80, 759, -464, -721, 787, 381, -874, -40, 1026, -563, -705, 650, 291, -931, 60, 898, -375, -668, 645, 376, -946, -44, 699, -384, -752, 653, 546, -750, -101, 969, -357, -725, 392, 361, -740, -108, 1074, -304, -844, 570, 599, -956]
4797i56Q05J119j211m73J355L8j618R12J020j252m88J410J8j616Q30J082j149
4814a74p61J520K74j677O73J325j469p51J598k57j055N46J119j150o89J396O2
4831E30j381K96J504p98j122J407L85j397Q9J227o13j029J402J43j466K43J472
4848H92q37j161J216N28j304RJ519q04q29J152O79j487k8J244p43j005J316L80
4866G37j382K77J125m98j201J093P54j440r0J442o34r23Q45Q94j381j64J283m49
4884B88j161J001R36j506j67J324n80q14P44N65r94l35J515k99j432Q42Q55j178
4902c96l30J373j15j393J093Q17j443l17J600p96j167Q89J035j377o19J579j73
4919B60j207Q35R75j140n18J482q0j245N11J014j301l96J459k0j651P52J069j037
$$ y = [-956, -151, 968, -243, -716, 639, 677, -941, -29, 991, -261, -749, 661, 679, -937, -107, 975, -174, -935, 585, 859, -818, -145, 1180, -289, -1040, 558, 301, -754, -208, 911, -239, -928, 468, 530, -851, -555, 949, 151, -971, 436, 821, -576, -487, 740, 127, -902, 500, 643, -823, -580, 892, 55, -1106, 110, 638, -666, -657, 862, 58, -771, 381, 1060, -427, -455, 789, 46, -959, 357, 737, -645, -368, 757, 259, -942, 151, 905, -535, -625, 817, 183, -740, 105, 999, -382, -546, 737, 288, -873, 128, 1064, -442, -609, 715, 135, -679, 65, 630, -364, -699, 816, 517, -915, -73, 782, -396, -726, 647, 532, -861, 232, 1049, -394, -711, 889, 93, -1074, -185, 850, -527, -1146, 433, 260, -947, -112, 863, -277, -795, 687, 607, -638, -127, 887, -414, -810, 649, 629, -1022, -270, 799, -238]
4937b38n88J220J16j405O26R87r50q91J674L9j246N19J217r47p50J316L55j630
4955e76M11J244r90o38J027K64j330J94J382q35j010J225L77j638P38J136q49
4972A32j015J276N36j490N36R72p58j216J365M80j466m4J323o49j113J169N58
4989E96j319J60J418p67r09Q79O74j224j49J335l59j240R67O49j384j80J684o24
5007B07j264R38Q44j233m39J601m87j190R71Q88j496J53J299j62j543R47R66j335
5025c35j61J358k00j328P72Q01j101m38J342j23j447R10J131j342m65J167L77
5042I18j573R15R24j131p75J435J00j645Q16J061j127m72J194k90j162N02J292
5059I82j174o11J237J59j351O86J007q91q08J317J3j317M62J121j211m70J308
$$ y = [-238, -826, 394, 510, -895, -269, 718, -232, -1123, 551, 590, -656, -137, 1080, 133, -617, 699, 1054, -576, -165, 1079, 89, -549, 478, 742, -588, -394, 988, 153, -857, 368, 745, -893, -155, 981, 132, -883, 393, 929, -561, -25, 947, 189, -1027, 338, 818, -648, -692, 631, -18, -1131, 38, 596, -723, -563, 855, 88, -821, 58, 732, -492, -641, 694, 335, -905, 62, 711, -673, -853, 831, 207, -1057, -119, 725, -508, -947, 654, 167, -1023, -52, 836, -660, -507, 792, 630, -913, 34, 1000, -335, -496, 862, 662, -666, 106, 907, -194, -632, 710, 587, -860, 50, 1181, -161, -626, 541, 918, -655, 260, 1184, 53, -722, 713, 813, -832, -16, 1045, -82, -554, 640, 350, -812, -310, 982, -192, -803, 434, 593, -758, -72, 935, 44, -764, 553, 566, -751, -289, 832, -379, -849, 459]
5076D59J52j671N85J375j055q94J377J30j251M84J070r25o41R44N68j478J51J598
5094I78q72j043J300M69j546N5J413q27j008J173P05j291k37J603p58p75Q93O98
5112I30j388J88J288q96q86J077P49j449j89J557o07j307J039O07j125k04J563
5129I47n64j289J035O88j260j32J311m82j285J489N01j343j33J207l10j163O99
5146h4P89j228l97J328k1j510R82R44j301j92J244k38j198P38J066j119o56J325
5164D72J1j501P81J101j198l50J432j37j519N27J108j134o12J682l1j534P86J004
5182H88j099n38J255K12j595M81J194p88j012J371J51j362P77Q80r24o03J009
5199B97L68j279J28J329p69q61J250J34j120L2J144m49j112J373L13j623K89J518
$$ y = [459, 611, -1060, -475, 900, -155, -1049, 328, 458, -793, -309, 761, -164, -805, 139, 707, -771, -620, 978, 106, -937, 363, 832, -714, -659, 754, -73, -1081, 92, 797, -494, -731, 872, 114, -661, 232, 930, -458, -270, 1018, 122, -764, 313, 1062, -387, -576, 981, 374, -933, 106, 713, -412, -616, 947, 383, -906, 129, 817, -443, -575, 736, 254, -1031, 458, 959, -384, -517, 690, 380, -783, -84, 705, -523, -920, 408, 387, -1123, -141, 803, -498, -690, 554, 316, -882, -144, 922, -197, -853, 472, 483, -1018, -237, 864, -334, -684, 748, 611, -908, -381, 727, -407, -1019, 663, 632, -902, -116, 888, -211, -749, 506, 718, -877, -396, 798, 10, -1002, 369, 520, -842, -65, 815, -109, -712, 297, 665, -614, -486, 843, 74, -787, 463, 597, -523, -491, 653, 204, -908, 465, 778, -845, -556, 962]
5217I62q52j033J246O27j563J04J421p11j184J190M66j282M5J427p38j020J196
5234C01K77r85j2J241n24j282Q99R09j477j15J609l86j246J005P22j484L6J238
5252G26m03j243R91O57j209k47J415k52j377R92P59j147m13J531j20j356Q04R45
5270A053j445m57J531M1j556N58J059j305l82J366o4j275P41R48j182m47J536
5287G20l35j317N85J338j102p49J308J71j450M85J248j081n93J092L4j268M13
5304e01J438p55j024J354kj083L06R99q08o46J163M99j596M02J318j138p33J285
5322D78L07j315j0J333o35j106J177M96j270K92J227p94j099J235O89j723M00
5339c18J236j062q41J133O10j340p2J564j053o11O51Q90j441k80J590n58j091
$$ y = [962, 110, -923, 323, 950, -613, -509, 912, 201, -983, 207, 673, -609, -564, 863, 125, -895, 301, 578, -407, -419, 822, 298, -984, -85, 824, -653, -768, 841, 455, -791, 214, 936, -548, -512, 726, 323, -920, 71, 728, -481, -728, 687, 435, -942, 50, 809, -338, -751, 780, 660, -696, 108, 1053, -392, -849, 682, 723, -833, -275, 784, -521, -903, 463, 399, -876, -135, 813, -369, -816, 720, 385, -932, -347, 991, -111, -860, 448, 619, -831, -346, 902, -179, -772, 320, 354, -914, -501, 937, 182, -842, 512, 510, -573, -267, 732, -76, -722, 441, 940, -656, -254, 1064, -74, -807, 478, 785, -530, -540, 793, 158, -948, 229, 725, -545, -253, 974, 180, -919, 316, 1005, -718, -318, 918, -144, -985, 148, 758, -582, -654, 910, -143, -754, -103, 787, -654, -934, 656, 98, -993]
5356i93R34R81j313m66J639n15j120J192N20j270k37J197k58j234P07J057j452
5373f31k18J465k17j247O86J121j211m63J428k58j152P50R03j191m55J548k78
5390E80j459Q52Q97j169m52J462n7j456Q79R07j191m16J250N4j387O24J211j204
5408g5n99J381Q1j427M36J287j019p54J303k0j219M13J177j195p46J376K90j591
5426i01O04J417j056r10J348J52j384K37J333r06r27J249M82j490J07J511p83
5443H3j201J240N70j433QJ547n78j207J136O29j152j69J537r38q10Q28Q05j394
5461d99j99J510n59j423J369O73j361n5J468n60j102P35R44j385J2J381n41j188
5479g80J043O17j269k87J398k59j141N56J077j429m93J600j54j440Q43J205j566
$$ y = [-993, -59, 922, -391, -857, 782, 267, -853, 339, 859, -411, -648, 549, 291, -943, -236, 821, -631, -849, 616, 399, -848, -162, 959, -252, -715, 713, 455, -697, 53, 956, -235, -690, 858, 580, -879, -27, 870, -299, -751, 711, 654, -802, 77, 984, -207, -623, 627, 681, -706, -82, 1129, -75, -674, 707, 788, -639, -203, 1084, 65, -689, 614, 594, -625, -212, 965, -230, -976, 400, 690, -901, -297, 1120, 64, -846, 502, 654, -730, -493, 840, -66, -993, 256, 738, -752, -645, 866, 83, -1118, 122, 692, -741, -733, 814, 236, -971, 165, 794, -358, -527, 1010, 72, -738, 90, 895, -499, -698, 812, 253, -1170, 199, 872, -489, -544, 924, 364, -738, -3, 941, -444, -432, 949, 408, -780, 263, 880, -389, -676, 722, 463, -678, -122, 955, -474, -967, 633, 479, -961, -118, 1087, -479]
5496d79l83J580j93j220N17J340j525m14J506j33j276M05J008q99o30J206Q9j472
5514i73O78J269j139n44J221J25j206M58J005r62q97J512k4j332O19J023r77q51
5532i95J497K49j668N21J348p80j050J315L19j604O25R66n72j179J300O25j549
5549f32J42J478p88j030J279J34j226J55J339p57r31J028N66j422J34J594q67
5566A96j306J326O48j172l61J496n86j283J180P05j474J27J493n88j388J212N35
5583G60j318l29J750l84j432Q98J051j351m52J428m66j177J162R10j481k70J600
5600H99l56j499R67O89j134k34J383j45j310O03J057j504m28J766k03j442O61
5617b30J311j348o02J538m9j591O05J144q77p85J453mj504P68J229j095q45J566
$$ y = [-479, -862, 718, 525, -695, -178, 1162, -363, -777, 729, 596, -680, -275, 733, -166, -796, 410, 499, -973, -295, 974, -165, -709, 512, 637, -569, -111, 894, -68, -965, 547, 523, -809, -190, 833, -144, -995, 502, 751, -917, -396, 952, 172, -878, 437, 756, -848, -223, 743, 171, -1008, 292, 917, -632, -490, 988, 200, -830, 449, 583, -643, -488, 851, 94, -837, 191, 757, -665, -531, 1063, 196, -1110, 216, 864, -308, -669, 827, 241, -1042, 138, 843, -631, -504, 989, 401, -987, 225, 760, -558, -887, 863, 479, -953, -55, 996, -355, -807, 621, 155, -1022, 140, 1050, -431, -701, 899, 543, -956, 11, 700, -434, -668, 715, 570, -740, -137, 920, -584, -1012, 754, 551, -891, -230, 1081, -267, -869, 669, 620, -971, -366, 778, -99, -884, 569, 565, -939, -171, 1058, -37, -882, 684]
5635F84K37j795N97J376j270r06J457M63j693L91J346r88q93J571K17j492K32
5652d66J568r22j108J283M44j536K46J467o63j563J602L76j239p3J461o92j327
5669a142J419M66j420k1J624o29j209J243O34j664j45J973q19j067R31O93j358
5686d91k78J731o23j268R98J106j771m4J375k09j555J143R01j667p0J700m76j463
5704i61R95O64j093l87J596m49j663J224J036j153q74J841l30j196N83R66j144
5721c45n77J581p2j399P57J018j313o82J842j53j723N94J560j489o00J519J61
5738F79j626O42J443j342o34J343M9j260N62J124r84q82J654J54j683M46J302
5755I87j025q97J508L06j671M80J564r54j192J305L99j469M04J363j117r61J361
$$ y = [684, 921, -874, -277, 1099, -171, -1077, 380, 843, -850, -459, 887, -101, -994, 577, 794, -698, -466, 1102, 180, -928, 355, 799, -737, -491, 976, 313, -1250, 352, 728, -511, -584, 877, 185, -1142, 277, 743, -677, -698, 926, 297, -912, 331, 965, -699, -844, 1129, 310, -757, 174, 867, -491, -769, 962, 339, -929, 69, 1175, -596, -640, 735, 526, -1029, 114, 1015, -652, -722, 978, 502, -961, 34, 698, -395, -782, 814, 365, -1298, -74, 962, -191, -1065, 776, 446, -750, -167, 799, -345, -922, 659, 587, -812, -55, 963, -350, -1032, 810, 657, -1066, -472, 1088, -401, -1001, 518, 679, -947, -305, 1138, -204, -838, 505, 554, -706, -144, 980, -4, -886, 768, 922, -761, -315, 987, -38, -935, 573, 879, -792, -312, 1252, 298, -894, 411, 810, -659, -255, 1108, -9, -970, 391]
5772C91N74j716M89J288r75r55J163M28j350o1J564p33j054J095Q30j528j82J698
5790I66o50j264J214Q20j537k37J482l65j764J527O70j387m45J716n18j195R12
5807e5Q46j082m92J648n05j334Q55J385j852k71J698l04j534R49Q79j436k71J477
5825F01q6j571R94J004j496k25J674m67j402P06J351j169o91J542j68j167N03
5842f7J263j292o41J440K72j945Q17J085j228m09J414Jj526O83J067j247n43J535
5860F79P1j537M95J298j053q40J112N71j441J19J466q80j048J394N33j719K09
5877e71J477r99r42J480J18j368J31J547p09j333J519O73j679J49J571r13j220
5894a069J225Q10j667N7J594o91j183J280O20j707N9J583o91j203J198O13j384
$$ y = [391, 965, -751, -262, 1026, 51, -904, 259, 687, -663, -724, 840, 107, -947, 148, 978, -550, -732, 966, 316, -948, 266, 1086, -451, -688, 794, 429, -1335, 192, 862, -525, -970, 746, 228, -967, -55, 791, -291, -783, 865, 360, -974, -119, 1266, -586, -857, 841, 537, -997, -48, 831, -605, -876, 601, 515, -1056, -62, 942, -554, -779, 895, 428, -974, -268, 1083, -86, -777, 765, 597, -570, -67, 1196, -96, -737, 703, 975, -970, -153, 932, -296, -705, 709, 710, -816, -133, 934, -313, -856, 679, 750, -787, -292, 1006, -47, -887, 225, 796, -645, -526, 940, 60, -988, 406, 939, -780, -571, 906, -93, -1035, 445, 563, -805, -674, 873, 164, -1169, 350, 1023, -656, -507, 1064, 151, -1069, 156, 966, -701, -644, 950, 259, -924, 356, 976, -731, -672, 911, 220, -983, 215, 828, -556]
5911e56k32J731o59j326J071J165j576k08J567q85j109Q03J250j568q0J450k30
5928F08j693J050J209j516n47J583q4j467Q78R39j149o76J461O2j379N27J053
5945H59j229n16J837l32j739R57J129j217r54J984p5j693N96J510j224o71J236
5962D58K40j636N70J549j260p20J279K60j549N25J378j133r07J420J16j240L55
5979b95J495j323q78J163Q61j851L13J444j016j104J622M70j789L73J644r56j229
5996a056J328Q05j788j53J901r81j160J427L70j508J55J434l61j357J207N63j299
6013d73j31J563n24j424J315N29j435o8J606o51j487J146J061j576m81J954n07
6030D17j423R38J138j353l46J422k19j575R62J106j457m11J549k20j404Q19Q59
$$ y = [-556, -788, 943, 284, -1042, 29, 1194, -382, -590, 977, 92, -1017, -214, 1036, -532, -612, 838, 608, -1085, -35, 1174, -342, -889, 694, 610, -857, 21, 960, -189, -865, 596, 658, -721, -194, 859, -370, -886, 951, 619, -1120, -163, 966, -251, -1205, 779, 704, -989, -393, 1117, -107, -778, 458, 698, -938, -368, 1181, -79, -799, 480, 740, -809, -284, 1094, -39, -946, 474, 590, -650, -295, 1200, -123, -1001, 162, 1023, -828, -515, 929, -87, -1191, 431, 901, -888, -515, 1129, 173, -1056, 272, 1077, -711, -864, 1037, 56, -1104, 323, 693, -815, -660, 774, 413, -944, 263, 826, -473, -604, 959, 435, -989, 326, 855, -580, -648, 958, 307, -1180, -34, 1027, -549, -1030, 924, 417, -1006, -68, 1070, -283, -629, 793, 574, -1001, -39, 1067, -390, -801, 748, 528, -876, -57, 802]
6047H02j140n13J442j71j334O79J074j040p49J631J92j530N47J116j184o49J522
6064F95j46j192N51J067j204o52J498L3j616N20J399j179q53J507K47j686Q46
6081a65J000r88r12J415J93j328K79J474r89r91J294L50j309J41J346o81j308
6098a179J338O42j751K65J498p58j053J349N85j548lJ588p60j119J069O30j252
6115d59m8J454o85j351J065J032j509o9J333l54j518J350Q34j454j54J530n63
6132D34j105Q71P84j067n94J761p46j333R72J033j543k92J642m87j257J002P37
6149H12j361k70J682m21j313P65R90j210m88J389j00j457P43J060j246o80J432
6166C27P7j583Q89R91r57q83J707m9j360O43J227j095o99J457n4j343K87J270
$$ y = [802, -338, -851, 591, 420, -914, -235, 839, -201, -950, 681, 873, -657, -110, 1006, -178, -827, 695, 549, -643, -92, 975, -229, -881, 617, 650, -966, -446, 953, -226, -1079, 428, 675, -1011, -165, 835, -153, -1065, 350, 543, -785, -506, 968, -21, -1012, 282, 632, -677, -536, 810, 129, -1179, 159, 801, -950, -685, 813, 55, -998, 351, 936, -612, -615, 973, 213, -906, 163, 793, -459, -507, 947, 262, -1089, -24, 1008, -501, -570, 763, 409, -1109, 241, 1075, -379, -533, 997, 434, -671, 200, 984, -83, -677, 1084, 338, -995, -23, 1010, -533, -825, 817, 330, -927, 75, 812, -549, -819, 863, 442, -871, -106, 884, -326, -814, 575, 475, -982, -239, 821, -425, -1105, 327, 404, -1179, -290, 701, -256, -1139, 568, 519, -841, -198, 1029, -66, -765, 692, 638, -705, -418, 852]
6184H52j087o95J530%j618P30J240r67j011J593L01j632L49J508q29j011J551
6201H04L70j753K25J362r14q35J079N04j214N3J383j012j102J456K50j398O0J492
6219H10o08j190J289N67j431j34J688p94r88J110O51j436l16J434n44j331J137
6236h6P86j323l82J624l68j237R69P49j469j53J447pj418Q25Q14j176m28J592
6254G59m46r89M93J067j172m51J343k28j081N11J110j221o99J529J59j463P30
6271d9J116j307l06J424k33j179L31J298j001p44J421o7j506P02J141j235o10
6288h04J364K47j258L7J116o40n93J052L76j400K77J269q73j003J149L08j068
6305d44K6J104p93q98J088N73j337M3J578r62j069J450L01j232o9J569p03j229
$$ y = [852, -235, -930, 600, 600, -1018, -288, 952, -15, -1026, 567, 868, -764, -415, 1093, 264, -747, 804, 1174, -579, -354, 1008, 94, -741, 338, 842, -372, -319, 1064, 52, -1050, 406, 656, -742, -682, 810, 202, -988, 301, 868, -563, -697, 991, 197, -791, 319, 970, -466, -782, 652, 108, -1223, -86, 700, -623, -1005, 619, 251, -986, -17, 732, -737, -890, 557, 550, -868, -43, 771, -405, -833, 759, 313, -676, -183, 884, -288, -739, 604, 376, -705, -194, 916, -305, -1004, 525, 684, -779, -49, 1067, -240, -546, 878, 645, -534, -203, 1095, 94, -650, 771, 704, -802, -100, 1041, -194, -804, 560, 807, -451, -414, 702, 62, -531, 521, 897, -503, -226, 1043, 170, -833, 316, 624, -444, -418, 686, -107, -1005, 83, 656, -681, -638, 940, -22, -1091, 359, 660, -572, -641, 928, 225, -1004]
6323a004J279L92j368J47J507r13j030J176M58j514K55J394m68j161J068N65j164
6340c81l00J400l82r23Q86P32j549j48J414l64j198O98R22j121m19J457k07j465
6358i48J056Q73j218m53J505k02j443P57Q87j047l24J477l37j244M63J078r33
6375e3o63J049J67j124M45R61q97p15J243J78j349L90J282q23q45J255K06j507
6393h00N89J055j018o28J221L85j493K01J256q03q81J207L98j211K4J409q51q82
6411h22J057L36j262M84J384j069q76J024N43j496O7J485q07o55Q54N88j421j14
6429g00J526m59j203J024N15j444J54J299k93j292Q68Q21j257q9J332m20j204
6446h22R09O84j030l60J316l33j407J027R44j466M4J240k79j368R10O87r70n00
$$ y = [-1004, 275, 667, -701, -554, 953, 40, -990, 186, 644, -870, -615, 779, 311, -850, 218, 783, -381, -681, 719, 337, -586, 300, 1032, -517, -665, 749, 385, -813, -115, 807, -314, -733, 724, 517, -948, 108, 981, -237, -690, 815, 613, -830, -73, 814, -233, -557, 920, 583, -661, -198, 880, -53, -716, 333, 500, -624, -179, 782, -115, -830, 413, 591, -758, -368, 914, 91, -754, 501, 707, -800, -211, 844, -174, -802, 419, 804, -689, -488, 768, -35, -916, 291, 689, -522, -498, 911, 60, -822, 235, 571, -691, -207, 1177, 108, -768, 256, 799, -697, -630, 855, 48, -607, 247, 835, -586, -700, 826, 367, -836, 188, 703, -741, -587, 712, 419, -873, -5, 816, -441, -530, 802, 382, -822, 87, 771, -259, -619, 697, 364, -1043, -16, 928, -538, -494, 746, 467, -901, 9, 696, -274, -774]
6464g74J259pj276P00J003j169l74J280j63r57N59P84j005n34J250o6j058M63
6482h5J032j135m35J158J7j068M80Q59j020n74J247R6j416N89J335j073n99J324
6500G32p2j536P55J095j089p97J171M35j540K85J532r28r33J173K57j033K21J128
6518H56p09r42J147L42j414N0J350o78j047J155M04j291P6J202o38p95R69P34
6536G71j431K04J014m11q59R93M09j112l2J203m00j150Q55P53j209m32J402o2
6554E06j382P57R11j261N3J089l51q84O40P97j036k58J319r9j500O78J104j301
6572b18k17R23n2j091N41R81j159o62J462r4j161M12J144r38m65R78J38j138L05
6591c11R20q48o16J428j23j488P01J106j143m78J085L11j320K88R14n50n74Q79
$$ y = [-774, 485, 478, -798, -98, 905, -264, -638, 642, 479, -478, 81, 865, -140, -674, 576, 510, -548, -85, 947, -188, -623, 535, 552, -516, -36, 823, -197, -771, 476, 572, -844, -255, 1080, 7, -592, 732, 660, -876, -121, 974, -115, -912, 259, 694, -846, -561, 971, 43, -890, 283, 540, -493, -272, 856, 147, -795, 352, 694, -720, -670, 680, 2, -1045, 110, 514, -777, -701, 501, -137, -932, 37, 771, -660, -456, 558, 147, -712, 281, 690, -422, -454, 749, 349, -801, 54, 807, -402, -834, 568, 506, -876, -119, 792, -469, -416, 673, 322, -562, 78, 875, -161, -419, 900, 801, -699, -21, 1083, -218, -435, 488, 436, -655, -114, 867, -292, -954, 508, 414, -747, -335, 809, -129, -594, 384, 522, -616, -311, 609, -239, -855, 573, 450, -1038, -337, 769, -374, -852, 233, 544, -776, -488, 426, -124, -698, 181]
6609A81L18j182M01J046r10o93J281J38j358L96J033n92r08R01L68j100R7J363
6627G80n96j047J210L33j264L85J178n54j108R73M80j287J37J158o93j076J240
6644B49N41j166L7R57k68r62P95O37j264J03R70j58j102R79L87q55k15R30k19
6663C76j189P24Q03j177k59J009j59r48O97P19j174j54J266k60j127Q44P42p76
6681d3o91J101r3j039M71R32j073m10J175J22j404O56P64o97o35J173O2j011N13
6700a27Q80p07q86J326J92j384M06J065o98q20J154M33j511M35Q92o69r55J383
6718D09J41j208L90J020q74m44J009L70j183J7J221r63o00J135K35j201q4J267
6736F57n33r23J061M24j169p7J220n86r69J036N20j171p0J338m39j220R06O52
$$ y = [181, 499, -683, -282, 764, -146, -839, 442, 580, -778, -382, 651, 59, -849, 52, 420, -680, -583, 780, 184, -863, 347, 680, -584, -199, 979, 425, -683, 290, 770, -517, -380, 778, 85, -991, 249, 790, -376, -339, 618, 350, -612, 183, 820, -444, -341, 629, 471, -631, 348, 735, -120, -335, 595, 376, -813, -89, 714, -463, -722, 287, 128, -820, -123, 596, -578, -732, 534, 274, -853, -9, 733, -43, -734, 367, 274, -765, -294, 638, -435, -845, 330, 452, -952, -296, 468, -229, -864, 309, 371, -640, -127, 753, 46, -840, 486, 678, -706, -300, 765, 67, -753, 401, 834, -677, -242, 650, -19, -974, 409, 550, -658, -268, 752, -122, -566, 443, 813, -370, -353, 868, -95, -695, 440, 675, -526, -610, 657, 124, -799, 262, 686, -483, -560, 660, 74, -895, 141, 661, -510, -580, 758, 319, -901, 5, 657]
6754F57j073q0J164o56r29J085N08j179k47J271m88r39J104M32j160l6J127l76
6772A85q49Q86N83j009l75J085j36j204P36Q42j279j09J184j27j355Q51O95p76
6790a72m63J204l36q18N35Q86r29o12J325j32j183N79Q34p13o77J084K35j429
6808g82O35R46q93p24J244Q8r59O7J388j058o80J516l48r28J46J197r89p93J186
6827B59L92j191L54O63k08r39J048Q3r88J60R80n48o63Q15K45q53P9R31o35q37
6847h53J166K53r37j0R56n28p32J126J11r18o7Q52j33j133J095L74j006q7J186
6866G15n90o76N84N91j006j99J107j89j179R42N80j247k6J144k88q26M14R37j344
6885e56j67J331k56j157R18N55r05m79J255j27j173P24O90q53l70J102l63q48
$$ y = [657, -416, -496, 668, 12, -917, 168, 676, -503, -750, 521, 33, -906, 198, 630, -530, -566, 561, 185, -664, 222, 805, -204, -579, 506, 370, -834, -98, 744, -535, -644, 540, 413, -942, -91, 604, -172, -635, 569, 233, -585, -50, 836, -93, -705, 620, 488, -695, -116, 718, 5, -672, 412, 647, -782, -147, 799, -94, -818, 426, 514, -445, -378, 1010, -48, -728, 788, 440, -488, -342, 855, -134, -927, 259, 651, -540, -186, 477, 269, -670, 378, 461, -527, -367, 613, 65, -598, 217, 462, -391, -312, 619, -16, -853, 313, 566, -371, -381, 575, 47, -685, 441, 552, -366, -433, 419, 286, -847, 248, 622, -384, -471, 715, 125, -551, 33, 624, -382, -581, 526, 337, -842, 100, 680, -567, -593, 551, 263, -563, -149, 788, -556, -723, 608, 352, -805, 113, 668, -237, -716, 539, 412, -761, -37, 653, -200, -570, 532, 169, -679]
6903f79N55R69q13m95R05l7j086N30P27n51p85J175K00j253M14J039j089l64J057
6922D19L93j325L44R53n79q33R89J38r86K00J028p06p89J053J70j102J00J083
6940E50m93q04R55L60j033Q1Q32k03j108J110J05r82M0J054j28j159Q91M46j068
6959e54M9R34n09p48R85M09r30p8J058m03q92P00Q51j260O4P76k50q34O90N55
6979F13j025%R26j85j106P24Q76j089k45J075k10j036N17R27j012o0Q87j73q14
6998d10N56O36r73j38Q69j73j101O54Q91j068k61J012k47r51N14J009q89l62J003
7017E71k03q85N84Q27j037n40J258m9j081K95Q08p32p47J323Qj205M34Q41m56
7036A4n22P78N5q80L37Q24o87p89J156K05j038K67R43q64m29Q57K70j075K07Q41
$$ y = [-679, -124, 845, 32, -463, 442, 405, -681, -151, 576, 25, -760, 415, 615, -638, -224, 815, -274, -638, 419, 812, -513, -169, 784, 205, -628, 361, 499, -487, -287, 741, 35, -754, 299, 469, -633, -533, 550, 57, -747, 208, 568, -465, -384, 448, 245, -863, 247, 352, -630, -590, 464, 336, -823, 68, 514, -554, -505, 429, -80, -828, 157, 566, -364, -442, 616, 213, -679, 21, 872, -388, -324, 452, 202, -632, 58, 613, -412, -412, 514, 329, -777, -53, 823, -266, -511, 564, 354, -682, -165, 762, -250, -310, 577, 404, -410, 146, 782, -191, -329, 540, 367, -734, -80, 811, -257, -518, 494, 247, -704, -190, 819, -70, -432, 571, 368, -517, 67, 894, -143, -683, 575, 526, -555, -260, 548, -184, -931, 392, 400, -805, -371, 470, 14, -508, 270, 325, -555, -218, 606, -81, -870, 286, 491, -547, -280, 663, -201, -630, 227, 497, -578, -371, 470]
7056D70o62n29R33K48q54J21Q89o40p41J145L69r84k70J226l46j052R87N20j322
7075d92K63J054p77o93O94O77r63k58J282n14q03M67P83r42k33J113m26o71L51
7094h8P66r68j19R54j17j232P92O20r21k18J094m23q36N86P59o86o17J267k98
7113C15j043N76Q66p57n91R16Jj123Q68O29q82o10R38K26q26L70N57o21o45J144
7133C08J07j031M43Q75r77l40R24K03r88J26J127q76n80Q24L16j070L07R10n95
7152A3o99R24M88j255L11J048q25n37R13J26q95K33R18n49q46R25K81o77l87J152
7172F62o04o12Q50L69j279M16Q08k34r23O06P11j347j0J157k92q84P23N90j135
7191d28p6R69l75q98P13R32j174j04J050l81p96N68P95r13m04Q71Rr93O14Q22
$$ y = [470, -192, -721, 212, 460, -394, -273, 616, -24, -765, 380, 749, -235, -505, 721, 375, -677, 310, 830, -492, -229, 825, 48, -645, 49, 726, -237, -495, 787, 273, -530, -63, 720, -222, -455, 658, 232, -439, -88, 678, -290, -409, 545, 428, -804, -12, 608, -313, -531, 563, 140, -696, -110, 649, -37, -654, 613, 315, -728, -152, 714, -43, -634, 282, 283, -840, 28, 657, -225, -835, 103, 329, -497, -127, 430, -191, -836, 308, 415, -616, -173, 702, -275, -615, 309, 512, -476, -350, 777, -99, -679, 145, 461, -609, -302, 608, 13, -686, 238, 726, -529, -218, 830, 5, -532, 381, 507, -388, -155, 763, 214, -632, 293, 574, -103, -490, 662, 58, -554, 296, 665, -614, -198, 610, 376, -547, 59, 770, -577, -587, 570, 278, -606, 117, 707, -428, -504, 465, 90, -808, -95, 837, -337, -441, 609, 228, -568, 0, 795, -118, -522, 349, 358, -635, -21, 801]
7211H01j144k02Q82l4q23N71M69p73j99J096j30j079N12P12q15k73P73J02q35
7230c89L53Q09q99k97R30j37j120O00P25p36o09J290j73q73J60J138j013l63J071
7249D67P5j084J70J059r12l56R74J83j118K75P51j74r64R14K24j126L58J010o33
7268I3q18J073M2r79M7J068n98p39J091M48j290K51J104p60o81Q27K11o18j23
7287c51J055n47o74N89P20j040r0Q80l11q26N53O91r67j40R43j62q61N08P55j032
7307c07k11J063l33q41O43N15q16J6O80m4j239Q19O91q61q6O11J3j105O10P93
7327F11r90j98J158l07p40K82P63o02o34J309l99r92N59P83r13j06P31M6q84L87
7347a36P47q29l81Q46J53r11K30R14n62o70R92J61j040L9J094m65q69J060J77
$$ y = [801, -343, -545, 337, 303, -520, 51, 520, -253, -452, 644, 514, -565, -53, 659, -156, -429, 344, 446, -389, -36, 773, -126, -423, 507, 370, -750, -150, 575, -161, -770, 520, 347, -526, -366, 772, -241, -604, 467, 542, -542, -372, 687, -225, -581, 393, 576, -542, -267, 484, 310, -654, 260, 484, -642, -284, 726, 93, -725, 348, 390, -589, -542, 526, -72, -811, 280, 728, -562, -311, 793, 33, -648, 179, 390, -228, -351, 704, 157, -517, 72, 792, -248, -338, 542, 231, -595, -42, 649, -318, -458, 485, 323, -538, -30, 725, -307, -518, 545, 212, -629, 14, 529, -287, -271, 409, 365, -874, -55, 636, -225, -311, 300, 313, -792, -182, 611, -379, -577, 581, 274, -466, -184, 579, -23, -657, 652, 253, -739, -180, 603, -310, -416, 315, 361, -523, -136, 611, -218, -599, 247, 400, -511, -281, 633, 71, -599, 393, 554, -486, -447, 647, 182, -687, 373, 550]
7366E50j072J26R80m66o29R85J54j019J51Q31m89q03R81L33r82K29R03n02q14
7385e53P74L44q03l40J174o68o38Q95M11r51K1R54m63q58N04R15r78l88J154m58
7405D8o64N48Q11j043k76J097l14q39N18N62o52m26R91j83j117O87Q15q38l41
7424f16J122j50q07L81R42r89l60Q15J6r26M33Q87o19o00Q00K30j156K70R65n11
7444A27m45N28M39j155K96P13o06k60R94M8j028m8J016m98p14Q89K23j173L68
7463b86R31n05p55Q08N31j212P3J108p97o55R00L72r24m2R51n12p05P69K17p16
7483d49p0Q40m48o28R05L95r07k64R92j56q14Q41M42r50L9O26q2q95N75Q67j174
7504c15J20P59o22p15Q68N86r21k05O39K0q43O19O81q42j11P97j52r38P42M88
$$ y = [550, -522, -396, 584, 118, -511, 474, 628, -391, -240, 591, 102, -701, 280, 613, -369, -140, 763, 261, -553, 221, 565, -238, -578, 596, -72, -710, 185, 596, -355, -334, 620, 157, -701, -197, 718, -260, -648, 506, 48, -616, -68, 743, -300, -576, 521, 207, -632, -114, 448, -204, -630, 361, 178, -939, -252, 563, -275, -616, 506, 356, -451, -70, 872, -117, -477, 338, 354, -572, -139, 748, 129, -471, 329, 559, -597, -327, 638, 127, -318, 210, 649, -506, -210, 503, -103, -363, 631, 679, -349, -397, 619, 121, -593, 296, 519, -654, -286, 645, 140, -615, 193, 724, -488, -415, 693, -104, -759, 141, 513, -411, -453, 498, -14, -719, 50, 267, -449, -519, 321, -127, -755, 150, 545, -362, -626, 366, 210, -604, 237, 679, -271, -232, 394, 312, -583, -8, 859, -315, -195, 564, -58, -773, 95, 681, -240, -445, 194, 214, -629, -10, 671, -171, -282, 515, 363, -575, 167, 655]
7524F55n84m10Q02r4j179Q29O18p65l64P91R1j011N93O51q40l83Q74J59r10P7
7544d00J031o60m01P84mj025N27N19n77n67Q75L08j133M08Q08o06n93Q89K86j032
7564e63K84R43n44p63P41N03j191J60R34l73r47Q91M13q29J34P00m20n62P33M88
7584G32j111j01R11k51o92Q07L92j074j5J150n40p28M70Q18r41l73R75j63q45
7603e79N35Q63j131k09J131m97o47M45O35n46n20J062l04r03N82Q26q48l06O72
7622B61P6r19M59P28q00l50R14N0j105K99J012r45j55P71N3p41K95O99p49m49
7642e96R33K09r62K06J019q71n95J030j3q89L13O91m44m35O40rn02L1Q11n76p74
7663g83J132M8n60k17Q46m40n38Q40J64q44N4P75m60n55R21M6j018K44R86o29
$$ y = [655, 71, -339, 463, 369, -810, 19, 637, -128, -492, 299, 390, -621, -28, 623, -217, -600, 274, 433, -477, -400, 631, -29, -430, 354, 350, -675, -148, 371, -206, -773, 102, 410, -723, -315, 493, -113, -706, 183, 469, -563, -279, 664, 120, -643, 98, 601, -590, -430, 504, 131, -816, 75, 488, -341, -207, 493, 73, -489, 244, 732, -379, -480, 431, 180, -512, 295, 687, -387, -402, 748, 208, -520, -50, 768, -173, -546, 429, 266, -579, -44, 819, -312, -521, 610, 113, -534, -89, 546, 0, -520, 542, 238, -665, -83, 743, -105, -411, 261, 337, -582, -123, 605, -195, -545, 369, 419, -686, -387, 625, -320, -475, 296, 349, -392, -97, 602, -147, -596, 337, 546, -416, -210, 809, -62, -657, 373, 360, -529, -216, 475, 31, -404, 236, 227, -275, -244, 567, -9, -783, 349, 397, -163, -380, 466, 26, -512, 328, 492, -352, -298, 477, 17, -538, 383, 429, -589, -345, 641, 12]
7683A2n15O18M48q02k94J095l49p10O05L68o92j2Q60m35o87N33N69j047j48R28
7703C45k81n89O37J95p93M4O65P5r25O29M11o34l17J028j33p49L22O29q39l55
7723f35R67M4p91L02Q17o83n83Q70J03q68L47M34l49n95R87m1q12M30P60p59m57
7744e12P99L47j030J27Q33q06m46Q61L51r61J82Q35p83l43Q04J95q66j05R96m29
7764D9o79Q01M01p62l66J133n75o76P91L72j030P1Q70l29p24N54N34p99L6P08
7784C80m8q36P49L04p88R3P98o32m84M42M44q30K18O71r9q28L38P01o85k38R80
7805F50m27n66M98O04r82k40J172n53n60L24O39n79m42Q82j87n58K24N98o94l07
7825e04O62L27j154O65O70p50n03O83K85p51K92L84n57m90Q59K34j022L78P60
$$ y = [12, -503, 115, 563, -239, -533, 562, 213, -497, 108, 476, -216, -228, 632, 197, -490, 43, 612, -435, -583, 345, 64, -525, 112, 307, -486, -442, 223, 298, -627, 2, 413, -221, -538, 490, 357, -392, -70, 559, -280, -635, 332, 376, -415, -113, 704, 21, -562, 308, 411, -457, -110, 324, -25, -620, 367, 326, -486, -56, 704, -55, -512, 287, 634, -396, -269, 564, -242, -688, 173, 524, -437, -255, 580, -203, -546, 258, 453, -413, -518, 478, 49, -630, 171, 572, -190, -556, 577, 2, -674, 117, 489, -541, -470, 400, 71, -653, -99, 435, -364, -328, 380, 332, -504, 245, 549, -239, -146, 652, 20, -464, -22, 422, -408, -190, 481, 382, -446, -108, 593, -92, -330, 650, 223, -343, 155, 759, -223, -463, 709, 156, -404, -80, 559, -20, -462, 420, 233, -325, -101, 497, -197, -504, 158, 485, -669, -4, 666, -84, -587, 96, 381, -370, -78, 306, -251, -741, 118, 352, -670, -292, 468]
7844D68o75m75Q11J5o22J49P25n03o06R05L47p59M2N98l41o20J041j32q04K78
7864a58P04n36n06Q59K35q53R4N55k04o89N69L25q18J61R27l34p48P09L70q83
7884b21K9N59q4n71L35L53p17p4Q23k46o94O88K92p16l2N53J8r57O61N34p14l61
7906e42J203m05r08O11M28o01l73Q37q5q32M16P08p16j30M42K47r65O23O10p35
7926a67m32P47L91j125M00O29p03l15N86L50q72K52R47o62m40N69J49n98K36O65
7946F07n70o05O81K50p20J59P91k67q47P32J06o41J82P51o17k17K80K88n84O6
7966a75P77n65n24O10N12j008J61N67j18r22P82L48j137M65O71l04n03L06N36
7985D79q24k47R78l00l62K63K31m42K0O95k81p10L67N54p34o1O22k22m43N12K65
$$ y = [468, -207, -682, 129, 144, -478, -329, 396, -107, -713, 192, 539, -220, -178, 420, 79, -541, 500, 368, -436, -158, 546, 10, -496, 363, 598, -255, -161, 394, 190, -499, 70, 395, -423, -262, 665, 331, -417, 292, 662, -221, -192, 367, 283, -288, 47, 400, -317, -391, 432, 186, -508, 180, 472, -244, -276, 277, 295, -662, -1, 533, -181, -542, 661, 256, -652, -41, 387, -214, -587, 250, 165, -667, -251, 457, -259, -389, 53, 300, -665, -42, 568, -167, -599, 148, 539, -586, -186, 443, -260, -575, 11, 361, -511, -259, 688, 26, -414, 155, 304, -294, -58, 607, 37, -568, 113, 363, -357, -198, 593, 326, -521, 211, 317, -324, -142, 609, -8, -225, 55, 343, -241, -175, 602, 37, -487, 123, 635, -373, -212, 355, 237, -685, 97, 445, -692, -227, 444, 140, -363, -57, 479, -345, -592, 386, 86, -276, -13, 218, -224, -204, 491, 210, -500, -133, 421, -313, -374, 248, 26, -417, 95, 360]
8006C60p77k5R23j56r99N83N02o52j54P70j88o58L32N43n59k73Q54j93o04J40
8026b31P35p84q0P00J21p78J56O63m96l72P10P4p41J7Q23m35n18O56M3p36K75
8047a98O38n04m30O66K10p90K64M51l41o17P89K90q91J73P73n90m66Q61j06n86
8067d04J13Q65l04q14P67K82q79J27P48k36p08N74K48n94O5N66k32o65M73L35
8087C27n56j02O15j38n11N57J81o59o1O91j13n98L35M78n28k18N70o8q90P00K76
8108B88m13j99N01O2n54L13L49l16l80N88O7p62L90O20n45m85P22p6l99J10L28
8129B09k18m82O26J38o63K06L68l06k60M95K11p97L42N59l55m41M78K64o04K85
8149E5L88m80k67M75L55r32O1O38k59n13P26J28n69j07O38k80o02N21M62o27o5
$$ y = [360, -417, -442, 481, 325, -674, -91, 411, -241, -395, 375, 187, -471, -139, 404, -155, -428, 426, 233, -371, -231, 504, -280, -360, 340, 461, -317, -161, 502, 6, -366, 344, 418, -323, -306, 517, 82, -436, 220, 263, -473, -198, 440, -64, -494, 172, 382, -408, -144, 307, -34, -651, 138, 428, -463, -290, 483, -107, -573, 288, 182, -404, -291, 574, 270, -544, 223, 505, -374, -247, 501, 265, -443, 131, 379, -215, -150, 416, 184, -481, -8, 327, -229, -331, 284, 146, -365, 192, 373, -286, -347, 344, 231, -367, -32, 446, -82, -300, 270, 202, -688, 12, 288, -125, -324, 177, 239, -315, -2, 347, 31, -349, 239, 306, -456, -66, 554, 9, -476, 246, 170, -229, -119, 209, -9, -491, 135, 273, -390, -184, 184, -122, -382, 113, 324, -473, -131, 428, 73, -368, 110, 374, -230, 55, 443, -37, -304, 171, 526, -406, -345, 293, 34, -479, 247, 375, -194, -301, 337, 57, -545, -24, 438, -189, -254]
8170b54P50k73l41J63L65p27p7O27j00m93L44L75p13K09M29kr30N07L26n01q1
$$ y = [-254, 496, 223, -118, 45, 410, -317, -394, 233, 133, -360, -16, 359, -354, -145, 284, 282, -648, -141, 185, -316, -397]
8191c97
$$ Imaginary data points
##PAGE= N=2
##DATA TABLE= (X++(I..I)), XYDATA
0@%%%%%%%oJ4j6J6j7K5l5M3n6P2q8J05j29J60j93K29k69L14l70M34n04N82o66
30c55P63q73R94j127J273j438J619j813K028k268K529k811L119l458L829m235
46b224M675n155N683o264O901p600Q377r240J0202j1281J2503j3899J5511j7400
60i211J9642k2357K5732l0056L5814m3914N6240p7482J24059m07719K17435M12826
72C01009q08854J74432N70115m35074m45718Q05604K68324p24148K3568O50021
82C79279l93392m06436O73097K22173q04943J453O30006l08861m46391N80567
92A26552J89773p40786P423P13160k28516m54741N27142K43223o65744N3038P26813
103D97337k04920n15322M42080K57719o18140l911O73992k40701n99336L83124
$$ y = [0, 0, 0, 0, 0, 0, 0, 0, -6, 8, -8, 8, -9, 16, -19, 24, -32, 40, -48, 57, -72, 88, -105, 124, -145, 169, -201, 233, -271, 311, -355, 408, -465, 529, -598, 675, -763, 856, -957, 1071, -1197, 1332, -1479, 1640, -1818, 2011, -2224, 2451, -2704, 2979, -3285, 3616, -3984, 4393, -4847, 5355, -5926, 6577, -7322, 8189, -9211, 10431, -11926, 13806, -16250, 19564, -24350, 31890, -45592, 78467, -329252, -111817, 301009, -507845, -333413, 236702, -198372, -644090, 161514, 429838, -294310, -270742, 379279, -14113, -420549, 252548, 474721, -330222, -328769, 301237, -7624, -454015, 126552, 316325, -424461, -417038, 296122, 67606, -387135, 140007, 383230, -282514, -229476, 497337, 292417, -222905, 219175, 476894, -141246, -145157, 528835, 288134, -311202, 71922]
113G1922K98109n81937l4070O33422k28432n87059L94875L85618n03677o6913
123b18142O16613j78440n70058M01242M25313n05338j43880N51514j68670n66893
133c56739L50410M10327n13885k25453N18704j03159n39414L33123M29908m88247
143a84425k30759N40438j7538m85854L03909M29526m52655k51500N36083L1309
153B18534n05410K27622M03123m52914k76266N18676M6720n18310J69502M06687
163B37964l93428k68717N27079R9993n14706J49441M52500l34875k62785N17652
173B10118J10295n23174J08850M55191l04383l06911M58381J10146n43896O8598
183a56785M71294k81149l33434M30192J33041n09907O7293M91576k31060l46581
$$ y = [71922, 370031, -211906, -245976, 387446, 159014, -428045, -33170, 352448, -151229, -218142, 398471, 220031, -350027, 51215, 476528, -28810, -172690, 378824, 210154, -356739, -6329, 403998, -109887, -335340, 183364, 80205, -459209, -126086, 303822, -184425, -415184, 125254, 107716, -378138, -74229, 355297, -97358, -348858, 187225, 218534, -286876, -59254, 343869, -109045, -385311, 133365, 180085, -338225, -168723, 237964, -155464, -424181, 102898, 202891, -311815, -162374, 290126, -44749, -307534, 210118, 320413, -202761, -93911, 361280, 56897, -250014, 208367, 318513, -225383, -156785, 314509, 33360, -300074, 130118, 263159, -246748, -179455, 312121, 81061, -265520]
193b65520M01625J76013m79825M3741M91641k20797l80303L61520J85610m64248
203a50543J544M56658k06485m03183L26238K22631m37471k9852M56941j71851
213F4627l96541L27162K60055m06242n3031M44304j34193l95257K99800K81570
223B92254m02972j04121M31140j12276m07191K74495K86735l96092j31942M24024
233A54054o7143l97920K49612L12141l70977j52214M35497k6128l97773K25196
243c5655L17209l53648j69314M18621m58m02563J77280L20404l30097j94395M06956
254A54340K3166m07105J50611L27749k97510j97686L89314M8954l95467J19346
264h4288L40255k62797k17015L70237O6147l97782R5756L43876k43253k32456
$$ y = [-265520, 136105, 312118, -167707, -123966, 367675, 146878, -233425, 128095, 313705, -150543, -148999, 307659, 101174, -302009, 24229, 246860, -190611, -220463, 236478, 64627, -331914, -4752, 255303, -150939, -203970, 240334, 106141, -289116, 10684, 292254, -110718, -214839, 216301, 104025, -303166, -28671, 258064, -138028, -269970, 154054, 86911, -311009, -61397, 250744, -120233, -272447, 163050, 136922, -260851, -35655, 281554, -72094, -241408, 177213, 176755, -225808, -48528, 271876, -58221, -252616, 154340, 177506, -229599, -78988, 248761, -48749, -246435, 142879, 191833, -203634, -84288, 255967, -6830, -223845, 146392, 212539, -185243, -89487, 254389, 11136, -221320]
274b21320L41932Q1810l87428O8432L52078k16325k55316L26174J06800l81488
284a84651N3112L59307j99234k67281L07132J28780l65702K7335L60961j74664
294D5095k87038K92982J55668l58222O976L60010j57321k91807K74335J73099
304B13777l40666k2322L51435j29889l03096K54133J92897l31832m6099L45738
314A84076j06806k99887K33588K05380l09075o9190L37991p3037l02590K10106
324A0556K20482k98951r0855L30487n5448l05327J82942K21381k83609j14165
334a82507L18865k9622l10983J59890K37684k68481j25306L21247p419l06753
344a93385J44885K47630k45802j39546L10144J3957l14074J17303K56373k36668
$$ y = [-221320, 120612, 202422, -185006, -116574, 235504, 19179, -236137, 90037, 196837, -184651, -131539, 227768, 28534, -238747, 68385, 197165, -168537, -141202, 219759, 45095, -241943, 51039, 206707, -151515, -144539, 215471, 58150, -233657, 40678, 213777, -126889, -149211, 202224, 72335, -230761, 23372, 216269, -115563, -161662, 184076, 77270, -222617, 10971, 216351, -92724, -161914, 176077, 103040, -199550, 10556, 231038, -67913, -158768, 171719, 116271, -189056, -6114, 215267, -68342, -182507, 136358, 106736, -204247, -44357, 193327, -75154, -200460, 120787, 113368, -193385, -48500, 199130, -46672, -186218, 123926, 137883, -176191, -58888, 197485, -39183]
354c9183j60946K98136K3708l15074R8487K59500k13229j69322K86249N1333l03804
365a84145Q4834K76455j88808j76637K79135O7627k94908O6864K71056j73336
375B8137j92914K51480P9706k93427L8032K69934j60341k06780K41227R5541k80460
386a29865K8975K73399j34187k04784K31452J20046k67583R595K77205j20973
396H3280k21310K15742J24042k73245j5774K64491j13686k34046J94373J36924
406A60791k66102l4952K72168q9427k35660J93367J57375k50990m0237K74463
416A40796o7410k35283J73779J66537k43847o7505K64445n6939k51338J50791
426b5974J68533k38360q1503K56545l6869k44313J37253J86907k10878q8209K61657
$$ y = [-39183, -200129, 98007, 121715, -193359, -94872, 164628, -48601, -217923, 68326, 119659, -184145, -99311, 177144, -11664, -188301, 90834, 158461, -136447, -69583, 201473, 28137, -164777, 86703, 166409, -127018, -88986, 180948, 20607, -186173, 55054, 150595, -129865, -100890, 172509, 38322, -166462, 64990, 185036, -82547, -72952, 204253, 83280, -138030, 77712, 201754, -71491, -87265, 177226, 63540, -170506, 23867, 160791, -105311, -140263, 131905, 42478, -193182, 185, 157560, -93430, -133667, 140796, 73386, -161897, 11882, 178419, -65428, -132933, 131512, 74573, -176765, -25974, 142559, -95801, -177304, 79241, 42372, -201941, -64688, 122219, -88659, -176868, 84789]
437H4789p588k39837J28008J98593j98132j00081K47837K72k45175R9474J95686
448A63846j91051j24879K34900J3977k50046Q6797K08276j74853j26259K36116
458G6824L6746k36787P8711K20470j54255j38550K28126N1741k43377N7401K17787
469A94837j53857j57510K08068N4189k43948L4005K15040j36639j66751K00113
479D7547P6997k32331K7622K26194j15789j64751J93916R0212k21544R671K18032
490A55776j02896j79573J70123R4861k24805j4397K11380r5576j85328J58794
500a1641J04314k08695k0485K15375o7514j79835J54213J25985j96488k8171K18708
511A05766n6881j85295J40442J25774j94787m7477K06893m8655j95905J22830
$$ y = [84789, 77201, -162636, -34628, 163965, -34167, -134248, 113589, 113861, -131314, -31840, 163846, -27205, -152084, 82816, 96793, -153253, -66456, 141820, -33033, -159292, 76824, 113570, -123217, -44506, 175964, 21709, -116841, 111285, 163026, -80351, -22950, 194837, 40980, -116530, 91538, 145727, -98221, -64216, 150824, 14185, -152566, 47547, 124544, -107787, -80165, 146029, 30240, -134511, 59405, 149617, -71927, -62256, 155776, 52880, -126693, 43430, 138291, -86514, -100911, 110469, 14893, -170435, -11641, 92673, -116022, -136507, 78868, 11354, -168481, -14268, 111717, -84771, -112942, 105766, 48885, -136410, 4032, 129806, -64981, -112458, 94435, 45780, -150125, -27295]
521b7295J34539j89119n8104K11653l2654j91153J22414J48203j70749n9357K11331
532I9709j2957j89828J06971J55245j66174p8203K00539j1103j99312Q8016J50003
543A42906j60718r0679J88049L644j95104P6562J62244j42893r4477J91243K1197
554A01974j88963P0518J66079j31762j03533J77441K7788j92959M7596J63718
564A37897j29507j21373J67926L4172j95027L8366J67856j16812j21820J65576
574B7254N2810j84679L1463J79084j00829j28215J63439O3101j86044J9132J75368
585A11884r6960j38732J47368O7272j85103J337J75440q4336j45387J43647Q2050
596G8480j75935j191J81350o6834j40798J36999R3708j64648j4165J78806n5297
$$ y = [-27295, 107244, -81875, -139979, 71674, 39020, -152133, -29719, 118484, -52265, -111622, 99709, 86752, -103076, 3895, 159140, -7034, -85237, 115302, 104199, -95113, -7097, 142906, -17812, -108491, 79558, 83202, -111902, -35340, 126904, -15989, -110466, 80777, 101974, -86989, -16471, 149608, 17846, -85687, 91754, 119542, -73417, -25821, 137897, 8390, -112983, 54943, 89115, -105912, -67546, 100310, -16502, -138322, 27254, 80064, -104615, -73152, 105932, 5103, -123112, 40327, 103428, -82616, -63484, 111884, 14924, -123808, 23560, 90832, -94271, -92934, 82506, -1830, -147217, -3570, 78480, -97455, -98646, 82704, 15870, -124928, 12071, 105779, -58869, -73034, 105772, 50475]
607E0475j50974J22814R6894j65924k8767J71412m9868j53995J09365J03074j54578
618e0072l8869J72321l1920j54437J04506J15940j47126m4076J72344k3741j55676
629h0806R2708J17645j42225o0061J64111j5716j64964P9403J22050j40077o8583
640i6515J62568o265j61569P2552J30060j25910p4131J60309R764j61238O3069
651b7306J36382j20027q2906J53749J4470j60915M9419J34133j10687r2710J44445
662C8047K6693j59638L8948J40634r9848r5936J42406L7177j52425L1730J42408
673I0196q6913j01520J33790M7690j52797J9400J44503q2232j09580J27361N1674
684H1572j50327J0329J43432p1629j13652J20441O3512j46662J845J49087o3306
$$ y = [50475, -100499, 22315, 119209, -46715, -75482, 95930, 46062, -107933, 1432, 104506, -50072, -88941, 83380, 51460, -102977, 1529, 117469, -29657, -73733, 98611, 74870, -80806, 11902, 129547, -12678, -72739, 91372, 75656, -89308, -9905, 112145, -27932, -96515, 66053, 59788, -101781, -29229, 100831, -25079, -99210, 61099, 70863, -90375, -27306, 109076, -10951, -93857, 59892, 74362, -86553, -37134, 96999, -13688, -106398, 38047, 64740, -94898, -55950, 84684, -15164, -111100, 31306, 68483, -83942, -52212, 90196, 3283, -98237, 35553, 83243, -69554, -50154, 94349, 12117, -97463, 29898, 81572, -68755, -58426, 85006, 13377, -100275, 20166, 83678, -62984, -61139, 87948, 24642]
695B4642j17862J17033O9583j43413o179J46208n5035j22529J06065P6671j40590
706d5406j8553J46680m7410j27366R9684Q1683j34778k4757J43421l5557j27715
717i0074Q9722Q9951j27411l4449J42872k6845j30187Q3039R3489j22011m0884
728g2788J37163j7628j30155P1865R8858j15122n0797J36848r373j32561O6400
739a7290J02811j09852n5031J32780q91j31238N7404J08319j02834o3529J31945
750E2594P645j34054N2030J11675r8830o8174J27000J3705j32446M1503J14245
761H6893r1775p6826J23839K1598j34347L5314J16849q5958p9327J18759K8997
772F4016j29391K6620J19138p5997q5733J14134L7254j29698J8692J20342p1799
$$ y = [24642, -93220, 23813, 93396, -50017, -56196, 90012, 34977, -87552, 18513, 95184, -45406, -63959, 82721, 35311, -92055, 7629, 89312, -45466, -70223, 73198, 37641, -90074, -352, 89599, -37812, -72261, 70611, 43766, -86421, -3382, 90107, -31904, -72788, 64375, 46747, -83408, -11543, 87315, -27807, -78604, 58244, 48871, -83690, -17290, 85521, -24331, -79362, 53418, 52527, -78711, -21307, 87012, -15822, -79351, 52594, 60239, -73815, -21785, 89890, -8940, -77114, 49886, 63591, -68855, -27352, 86893, -4882, -81708, 42131, 63729, -70618, -35304, 81545, -4413, -83740, 35019, 64016, -65375, -38755, 80383, 4386, -81347, 32787, 70041, -59657, -40965, 79377, 7578]
783G578q9721J06921M1289j26117R089J19918o2368r5778J02138N0855j24744
794f0940M266J23610n5070r6434R9301N6719j19881k898J23877m7434j03187R2965
806A4894O2956j21314j1307J24155m4604j06187Q7227O7148j16275j8176J24498
817F3015l2869j08544Q2815P7253j12588k3620J26078k6445j10418P5756P8922
828H9355j07881l3608J19875j8976j15656O4633Q3701j05357m1630J19221j2487
839D1190j14622O0132Q7808r5669m5201J16559r42j13910N2335R4074r1493n4043
851f3782J14333K406j16982M3633R2459q7778o1235J07611J0707j17403L6102
862c9929R9497q0574o4586J10188J8843j13662L4081J03055p2705o7537J05274
$$ y = [7578, -82143, 24778, 66067, -60050, -50961, 68957, 6589, -89189, 12949, 63804, -60940, -56674, 66936, 11866, -84568, 14733, 71452, -48429, -51327, 72550, 25116, -78071, 14894, 77850, -43464, -54771, 69384, 24780, -81407, 5820, 72968, -43307, -61483, 63015, 30146, -78398, 4417, 81670, -30918, -54538, 71540, 45095, -65323, 10433, 89355, -18526, -52134, 67741, 48765, -66891, -2258, 81443, -23914, -65544, 53677, 41190, -73432, -13300, 74508, -21161, -66362, 50197, 49255, -64655, -12320, 81754, -9739, -63782, 50551, 52957, -64025, -20392, 72067, -15711, -76946, 30665, 41372, -76031, -39929, 59568, -21006, -85592, 24596, 43439, -70223, -36142, 66913, -5792, -73329, 31945]
873C1945K5756j14090K3623J04119p0249p5923R9737K8586j14929J7252J03312
884E9139o2903p6862R5334L8229j08123J2020J08780n2676p9018R3543M4239j05871
896c4169O382J05793m8751q3716Q3016M6322j05996n524J04177m4450q9465P9385
908A3004N1093j03055p227J05880l5998q7033P6557N8984r7259j3404J07526l0501
920C8567r3091P1369O0459j00282k0907J03066k9562r6724O2992O2935r5908k8375
932f5461J04533j9822r7710O2427P1893r0893k8174J05873j2328r5572N6285P4609
944F5660q6210l7542J01724p790j01613M8135P5895q5427m3158R8565k084r9417
956g3262M3104Q1401p5419m6109J00005R409r8538M0753Q7056p2096m9915R7085
$$ y = [31945, 57701, -56389, -32766, 71353, 1104, -74819, 24918, 53504, -61425, -44173, 59139, -3764, -80626, 14708, 52937, -55186, -43166, 65614, 12938, -66080, 27463, 71702, -34169, -27787, 78006, 29255, -54461, 28555, 74877, -31119, -36643, 67534, 23084, -66381, 13004, 64097, -38958, -46185, 59695, 23697, -63336, 13221, 72205, -25054, -38458, 69068, 38567, -54524, 16845, 77304, -22978, -43885, 59181, 29619, -67105, -4113, 58822, -37086, -65461, 39072, 19250, -78460, -16033, 55860, -35033, -63207, 42666, 30338, -65234, -8949, 65660, -20550, -58092, 43632, 35842, -65771, -17636, 58259, -27168, -70326, 28239, 26155, -73262, -30158, 51243, -24176, -70285, 29720, 39129, -59409, -18656, 68400, -3696, -53611, 43474]
968D3474J1079r9049L0892Q5481o9214n9055R1385J6633j02508K4954Q9665o5741
980b004o0957R2415K2844r8510K2710R2604n7095o4451Q9256K9842j00171J4736
992a8781R3739n6673p0993Q3190L0432j00361O910R1443n0149p4900P8373L9079
1004E1309r7139K237R6507m2840p4954P6999M4191r2489k750R4589l6168p9346
1016e9854O8572M8585r2544j2129R4264l3196q3169O5208N1325q8515j5244R4675
1028C7978k3948q2698O1777N9883q4308j9887R7142j8809q5326N8219O1661q3130
1040b1446k5607R3122j4926q8272N0495O5217q0719l1866R3759r360q9201M8491
1052a0313O9492p5823l4354R2563j598q8519M1501P3554p1454m1924R0181K450
$$ y = [43474, 54553, -44496, -13604, 71877, 2663, -56392, 34993, 51626, -50882, -25928, 63737, -2004, -62961, 29454, 52298, -46212, -23502, 69102, 12007, -52444, 36812, 66654, -33517, -18781, 74958, 18285, -52708, 30482, 60914, -39447, -32537, 58906, 8757, -66143, 12230, 51309, -45830, -43593, 52914, 10074, -64880, 12119, 56310, -36179, -38929, 55660, 19492, -59854, 8718, 57303, -35241, -47370, 46894, 13698, -69471, -4263, 47062, -41453, -56697, 37978, 14030, -68668, -6891, 52992, -31316, -51203, 45939, 27130, -58196, 23, 61684, -21446, -47053, 46069, 31143, -57129, -6634, 58583, -22136, -54002, 39757, 30397, -58804, -10313, 59179, -16644, -50998, 41565, 39967, -48552, -7051, 66503, -4951, -46875, 43306, 45756]
1064D5756r1598L5580P3464o8845m6336Q5218P624r0504K8705P7479o2830n0851
1076e7138Q5044J4681r0204K5753P9708n8323n3440Q1390J9075q9272J8241Q1283
1088E6798n4332n9654P9088K3781r0909J4239Q3059n1051o1331P6088K8944q8062
1100d3342Q872Q5549m4592o5285P4273L4601q7871M547Q6543m1050o7432O9493
1112A4306L7888q5254k075Q6011l4748p1750O5394M3209q4607o528Q6298l0513
1124A7631p3096O1006M6513q0310j2522Q5730k3568p5910N7002N1467p9002j6775
1136d1834Q5932k0206p6112N2306N3397p4831k2755Q4176j4315p9700M7666N7809
1148E1533p4466k6527Q4540j1054p9902M4678O0710o9838l0048Q3749l726q0910
$$ y = [45756, -45842, -10262, 63202, -5643, -51979, 33239, 40863, -49641, -20936, 56543, -6287, -57138, 27906, 42587, -47617, -21864, 57844, -479, -53919, 27471, 46546, -42726, -24485, 56798, 2466, -57188, 21900, 45681, -45228, -30989, 52070, 1019, -60312, 15776, 44720, -43342, -34470, 51079, 6487, -58798, 15475, 50076, -37795, -33248, 53295, 12245, -55187, 14306, 52194, -33060, -35135, 50876, 16128, -55622, 9772, 52981, -31626, -38154, 48144, 17631, -55465, 5541, 52054, -28256, -40778, 44952, 21384, -54526, 2476, 53943, -25059, -41834, 44098, 23892, -52220, 86, 53483, -21348, -44103, 40073, 25758, -53942, -6276, 51533, -22933, -49460, 35080, 24026, -55876, -11198, 49512, -20326, -50374, 33375, 29649, -51261]
1160e1261M0666O5583o7696l4488Q3702j255q1834L6077O5724o4092l9456P9521
1172C1191M496q3367L0455O9668o1113m2767Q0033R419q1308K7574P1888n4612
1184A557m5697P6828J5734q2038K0533P4027n2952n2109P3899J7721q3830J5078
1196b1249P3135m9010n5188O9875K3936q1722J0587P8054m3575n7586P0271K9309
1208D6837q0474P083P8483l9775o1556O4996L2108q1337j010P8337l7080o7004
1220f0392O1909L5536p9951l662P9538l0022o5874N9545M3735p4902p874Q2848
1232D0434k3882o8475N6289M6302p4342j3618P8736k1020p1795M8441M8559p1810
1244b6181k0568P9203j4558p2976M7165N4192o6709k1285Q0111p560p0591M2659
$$ y = [-51261, -10595, 54988, -12708, -47196, 36506, 35251, -46583, -10506, 55218, -8874, -48330, 31191, 35687, -47680, -17225, 52443, -8670, -51437, 28596, 38015, -43293, -15719, 56169, 1557, -44140, 32688, 48422, -33616, -13083, 60944, 7992, -44117, 29782, 47503, -36327, -21249, 51886, 2876, -52312, 17563, 41499, -40223, -29636, 48418, 4843, -52743, 17528, 46837, -33637, -26554, 51929, 12154, -49402, 15594, 47702, -33635, -34645, 43692, 6612, -60392, 1517, 37053, -42898, -46560, 32978, 2956, -62918, -3373, 40362, -34540, -42414, 40434, 16552, -51923, 4366, 50668, -23674, -37292, 41444, 20424, -51371, -2930, 45629, -26181, -46749, 32454, 17896, -55080, -7915, 46277, -20432, -41717, 38394, 30834, -39757, 2902]
1256B902N8060o3138k7856P7762m893p6187L6452N6909o3962l3665P3840k673
1268C3551p6155L1489O0303n8349l6260P5463N379p5325L0667O5187n4937l7880
1280c6867P3096Q183p5585K3051O3442n3396m6108O7885J0504p8760J7378O4969
1292C7792n0201m7056O7265J6703p3767J5894O9228m1528m8052O6845K3456p3310
1304c6731J1436P0226m0779n2128O1407K3138p4183M328O8427l7332n6306N8625
1316A28K9500p2563K773P3489l1385n4968O0370L4756o8265L53P3905k6281n8963
1329c7151N4442L7711p1184p486P1980k6618o3756M9857L8486o9437j1346P2219
1341C7717j9592o3432M8450M5964o4814j3809P5237j4401o4817M5238M7062o3855
$$ y = [2902, 60962, -2176, -30032, 47730, 42837, -33350, 3102, 60011, -3951, -37616, 36224, 33551, -42604, -11115, 49188, -9161, -45421, 30042, 35421, -39904, -9237, 55950, 1013, -36867, 36229, 44412, -31173, -8122, 55320, 1924, -44184, 23701, 34205, -44555, -27177, 37792, -12409, -59465, 7800, 24503, -49264, -33370, 35858, -5670, -53722, 13123, 36579, -36731, -25295, 44931, 4152, -47976, 13431, 36569, -37614, -33286, 35141, -2191, -58497, 128, 29628, -42935, -40162, 33327, 1942, -53026, 7344, 42100, -26165, -25812, 48093, 21812, -37151, 17291, 55002, -16182, -23668, 48312, 21694, -42062, 7795, 46281, -23156, -34502, 37717, 18125, -45307, 3143, 49107, -15707, -29516, 45721, 31320, -33497, 11741, 58803, -5052]
1353e052k0246P0370j2103o9383L6865M8362o3475k6856O9923q407o9671L5321
1365a4352N2598n7561k7239P0925k93o7715L2276N7578n4504l2148O9432K103
1377C1100p1203K6427N6508n4191l7260O5192N507p1422K1480O0323m8903l9388
1389e5830O7199J2460o8919K1458O4070m3720m0126O4729J6870o9008J4466O4185
1401D7834m1994m7156O0774J8372p0805R475O3724l8440m8508N8090K4119o6855
1413c1370N855O7601l1578n0387N7401K9172o5988K253O7068k9564n3809N1377
1425A8031L0326o6626m975O5263k6423n7887M8212L3921o5349p410O7240k1356
1437A2967n6954M6669L8880o0956j1143O7973j6403o0075M3047M1316o1777j5980
$$ y = [-5052, -25298, 45072, 32969, -36414, 451, 48813, -14662, -41518, 28405, 19998, -49673, -14352, 38246, -19315, -46554, 24371, 24078, -43637, -11361, 46217, -8287, -40435, 28997, 31100, -40103, -13676, 42832, -11359, -48619, 16573, 22080, -49342, -27862, 32461, -16442, -55830, 11369, 23829, -45090, -23632, 40438, -3282, -43408, 21321, 38191, -30817, -16351, 47834, 5840, -41316, 19458, 37830, -32975, -23500, 40224, 1784, -46724, 11366, 35485, -31370, -25515, 42086, 10508, -39879, 17522, 46694, -19294, -17041, 50027, 20463, -33346, 18031, 48357, -18269, -23244, 42019, 15596, -42291, 5921, 39842, -25507, -32917, 34323, 12967, -43987, 2682, 41562, -19394, -30537, 37436, 21033, -39042, 4005, 45321, -16456, -32436]
1449c2436O6042j4897o2066L8272M2599n8714k0513O6125q807o2949L6057M7944
1461C6657n5070k2121O6691m570o2056L2667M9974n1802k7030O4110Q6o4798K7316
1474i946N1793n0526l1153O2475L145o3958K3411N3812m5866l3513O0991R114
1486B9779o3982K0098N7100m3536l6597N9952J1345o4049J6003N6871m0776m0127
1498c7919N6719J5294o4737J1582N9311l8370m2726N5706J8539o3686Q805N9241
1510C7759l3314m5440N2897K2974o2518L880O1135l0466m7817N1030K5640o1573
1522b5813O73O0655k5920n0023M7228K9654n9985l903O1597k2703n2009M5245
1534D696L1785n8289p133O1077j8236n2709M1110L6241n6182j1171O2021j4496
$$ y = [-32436, 33606, 18709, -43357, -5085, 37514, -21200, -41713, 24412, 15605, -47344, -11287, 36657, -18413, -40534, 26157, 21587, -40469, -7802, 42172, -9630, -36660, 27450, 27536, -37262, -9946, 41847, -8679, -39832, 22643, 25788, -38170, -14759, 39053, -6813, -40326, 20665, 29779, -34203, -14105, 42995, -541, -37138, 22814, 34159, -29890, -13887, 42984, 2208, -37919, 18800, 34094, -30643, -19061, 40250, 1880, -40846, 14860, 33399, -30287, -21482, 37759, 4445, -40995, 11902, 34876, -27642, -23762, 37373, 6907, -40910, 10120, 35760, -25813, -25140, 35515, 9595, -40428, 6800, 36454, -23531, -27434, 34163, 11460, -40549, 4696, 36481, -21808, -28941, 32136, 13900, -38809, 2301, 38542, -17640, -28811, 33210, 18714]
1546A8714n4844L9442L8314n4907j4534O0713j1691n6194L4659M0589n3393j9228
1558c2360O0690q367n8032L2501M3195n1055k0987O0191m108n7629K9047M6413
1570C9499m8163k5269N9759p50n9509K5631M6975m6983k8872N7040K721n9901
1582c7822K0898M9397m2909l2169N7068P860n9241J8923N2740l9248l3457N5731
1594A7771J1418n8304J4315N3226l6319l8089N2589J4319o0246J0079N4303l4891
1606A71l9860N0535J8170n7822P457N6678k9433m1535N0047K3257n7399M494N7424
1619D2184k7544m4083M6188K3986n7177j496N5635k4818m8003M2687K7243n6337
1631b1535m663N7126k0387m7521M1443L1340n2696o964N7397j5073m9622L7310
$$ y = [18714, -36130, 3312, 41626, -13281, -27815, 32898, 21207, -34987, -328, 40261, -13132, -32360, 28330, 19963, -38069, -5568, 37627, -13428, -34415, 25776, 21668, -35961, -6914, 39499, -8664, -33933, 25826, 25076, -34433, -8802, 38173, -8810, -37682, 19358, 22079, -37822, -16924, 32473, -10436, -42605, 14463, 22323, -36918, -17995, 34745, -4503, -37960, 17771, 29189, -29115, -14800, 38426, 2107, -35982, 16607, 30926, -29320, -19241, 35062, 171, -39689, 10846, 29016, -28806, -21349, 35329, 5896, -35639, 14408, 37665, -19734, -15240, 42184, 14640, -29443, 16745, 40731, -16446, -17942, 37693, 12875, -35128, 7559, 34802, -21535, -26198, 30928, 10541, -36980, 4463, 35803, -16893, -23857, 33540, 18467, -31155, 6155]
1643F155L3976n2793j2358N5573j4276n2561L3082L3845n0368j6289N4461r189
1655I258n2118L0823L9411m6919j6972N6554m559n1288K9518M0815m4208k0498
1667c0183N3661k481n3947K4241M1631m4890k4547N2594n99n3633K2257M3603
1679B7707m0062k5098N2789N857n1944K0620M7692l6657k7814N2230P554n3131
1691b0257J5978M6030l6372l2184M7247R524n4564J0827M7616l3397l4450M7850
1703A3848J3924n2067J0243M9942k8519l4358M6066J7457n1162N468M9695k7547
1715A2990l9518M2484J7860n3674J113M8159k5861m1033L9705K1512n0822r26
1727b8011N1621k0452m1147M0358K6242m9097k473N1849j7818m3101L6232K6924
$$ y = [6155, 40131, -12662, -25020, 30553, 16277, -36284, -3202, 30643, -19725, -36014, 18447, 9258, -42860, -12037, 27374, -19545, -36517, 20037, 15478, -35810, -6292, 34523, -9685, -30183, 23478, 20997, -32950, -8709, 32922, -11968, -36515, 16079, 15480, -38153, -15896, 27707, -12355, -37453, 15336, 21193, -30751, -10131, 37561, 904, -26910, 25320, 32874, -20257, -4279, 41751, 5379, -26805, 20442, 29966, -24598, -13771, 33845, 448, -34002, 13848, 27772, -24295, -14052, 35890, 7371, -26987, 19079, 36536, -14626, -9158, 40537, 12990, -26528, 15956, 33816, -19858, -18745, 29414, 3553, -37480, 2225, 23737, -27085, -28011, 23610, 3158, -37989, 2369, 28611, -20486, -22959, 28890, 11072, -32029, 4203, 31127]
1739C1127m9277q751N0037j5880m6672L2985K9363m7960j0205N1129j1385m4703
1751d0192L2117L4321m3142j1978N2760o658m5668K9093L6015m3085j6431M9633
1763B6785n657m8209K3943L5897m1753k0224M8384j392m8795K2912L9669l7854
1775f294k0722M9582K866m7110K0692M0928l5290k4558M6848M543m9633J5019
1787c129M0898l5812k8592M4436N592m9660J2268M1976l1525k9532M4363J1379
1799B2662m7966J1008M5211k8338l0622M2893J3104m7917O615M3798k6787l4837
1811c1176L8707J5208m8697K692M4529k4303l5461L7831J9219m5461J476M6728
1823B1292j8884l5910L6922K3236m4396j915M7190j7613l8749L3917K2924m4319
$$ y = [31127, -18150, -26901, 23136, 7256, -39416, -6431, 22932, -25028, -35233, 15896, 4511, -40192, -8075, 26246, -16896, -28874, 23886, 17228, -28440, 653, 36668, -6417, -22848, 26785, 21128, -27081, -3138, 32759, -8994, -29218, 19166, 17774, -31021, -8109, 31560, -6294, -27016, 22566, 25432, -21678, -986, 39942, 4652, -19906, 26942, 31485, -18148, -3129, 37769, 1957, -26635, 17801, 23393, -26267, -13999, 27977, -3548, -33080, 11283, 22662, -25304, -14296, 30915, 2577, -28045, 14848, 27952, -19965, -13350, 30448, 3661, -31176, 7531, 22739, -25958, -23266, 21263, -3040, -38501, -670, 18549, -26912, -25436, 21292, 2408, -33502, 3420, 26656, -17740, -19655, 27535, 9922, -28827, 5090, 28014, -16305]
1835a6305n896M5344j5294m0090L0724K6535m2526p753M6919j1140m0048L0980
1847A450K8998m0011r073M6112p948m1315K6543L0363m0082j3784M4731p413m3529
1860b4958K3885L1111l8604j6033M3943l037m2952K1854L4384l5374j8278M4938
1872B0879j47m3086J9417L4865l3857k0775M1619J779m3897J4510L5929l2082
1884d846k4502M0958M994m4196J3281L7899k9254k4448M0275Q544m2212J0398
1896a3109L9592k6381k7650L9174J0594m3499P683L9199k5680k8995L6458J2749
1908B0135m2666M649M0164k1777l0828L5961J6349m1686L551M1050j9425l1246
1920b5769L4018J7740m0513l50M1061j7379l3713L1120J9943m0772k926M0759
$$ y = [-16305, -22201, 23143, 7849, -32241, -1517, 25018, -17508, -25261, 21658, 10518, -29530, 1450, 30448, -9563, -18636, 27476, 19528, -21787, 4756, 35119, -4963, -18747, 25984, 18571, -24958, -1073, 30038, -8566, -24599, 19344, 16307, -26645, -4791, 29593, -5781, -24059, 20879, 20732, -22354, -2937, 31928, -1929, -22704, 18915, 20694, -23203, -8693, 27236, -4846, -29348, 11610, 16604, -27592, -14311, 23588, -5666, -30114, 10161, 18705, -23507, -13109, 26483, 102, -27548, 11626, 22220, -21279, -13596, 25603, -77, -29072, 7386, 20135, -22531, -17882, 22282, 505, -30323, 5638, 21987, -19699, -16148, 24902, 5477, -25769, 8249, 25989, -14524, -14874, 26187, 8808, -24905, 6215, 26158, -14614, -17540, 23219]
1932B3219j5191l4449K9490K1759l8558n107M1307j1645l5766K7895K4475l7802
1944a0373p250M0923j0278l6386K5219K5009l6487j0315M0024p465l7882K3034
1956b227K7346l5385j2314M0255n047l7771K1447K8684l3094j4669L9701k056
1968A4870l8679J9035L0704l2128j6909L8986l15l8793J6685L1265k9875j9048
1980b4202L7912L069l9436J3865L3412k8017k0895L7091N135l9045J1713L4049
1992B4651k5710k2741L5249Q367l9099Q695L5202k3478k4807L4418R917l8365
2004a7701O236L5190k1464k6250L1989J2638l7845L203L6265j9140k8348L1365
2016F138J4288l7224K033L6013j6671k8826K9145J6920l6218j108L6686j4393
$$ y = [23219, 8028, -26421, 3069, 24828, -13730, -18837, 22470, 10825, -24941, 2954, 27429, -10373, -17623, 23300, 13022, -23364, 1855, 26864, -9623, -19938, 20086, 12621, -25261, -2227, 25119, -10266, -22580, 17675, 12628, -25143, -3696, 24988, -8106, -22775, 16926, 14870, -23809, -4774, 25930, -6198, -23107, 15879, 15564, -23229, -6544, 24721, -5154, -24202, 13710, 16779, -22657, -8792, 24620, -3397, -24292, 12799, 17934, -21111, -9398, 24651, -1059, -23800, 11449, 19816, -19283, -10588, 24614, 1136, -23671, 10747, 20664, -17701, -11465, 23725, 2261, -23989, 8000, 20638, -17207, -14004, 22261, 3121, -25227, 6138, 20426, -16798, -14765, 21248, 4577, -24249, 4896, 21816, -14402, -15510, 21176, 6783]
2028F783l0672K7581J8366l5664l269L6211j2635l1222K5124K0364l3853n939
2040a8825L6621r484l2051K4094K2326l2858p107L6411p277l2205K1131K3786
2052B4562l1297j0546L5585n227l3845J9537K4131l0269j2046L4810k956l3256
2064b0817J7251K6269k7843j3798L5041n53l4162J6118K7298k7208j5196L3158
2076A5558M80l4041J2740K7570k5710j7957L2411K670l4541J1233K8961k4095
2088d721j8154L1541N662l3391R616L0074k1394k0486L0763P600l4219P062L0422
2101B0375k0894k2224K8985Q609l3472M828L0615j8359k3231K8688J1420l2525
2113a7185L580L2332j6053k3721K7994J2748l1676J304L2063j4477k5839K5144
$$ y = [6783, -23889, 3692, 22058, -13606, -16875, 19336, 6701, -24521, 603, 20967, -12886, -18825, 17796, 8312, -23739, 355, 22681, -10177, -17284, 19127, 11850, -20355, 776, 24562, -6735, -17281, 18304, 13077, -20768, -1231, 22900, -7369, -19415, 15395, 12439, -20817, -3566, 22703, -5140, -18938, 16103, 15550, -18612, -2494, 24804, -2404, -17600, 15558, 16038, -18003, -5263, 22307, -3403, -21360, 11051, 13721, -20820, -9587, 19374, -4721, -22875, 8666, 14328, -19063, -9447, 20627, -767, -21253, 9510, 17110, -17109, -10047, 20375, -519, -22743, 6242, 14851, -18621, -13793, 16822, -1537, -24768, 3920, 15340, -17185, -13605, 18727, 2674, -21047, 6947, 19695, -11981, -10677, 21386, 6909, -18930, 6214]
2125F214J4660l2496j454L1934j3224k6713K3993J6263l0809k296L2255j0121
2137H206k7092K3189J8513k9856m307L2783r154k8367K1150J8450k9529p182L0877
2150A7681p271k9777J8275K0644k8564r111L1451m782k9265J7686K2182k6051
2162f902j0371L1230j960k9692J5159K3401k5389j3004K9950j043l0694J2706
2174f609K3543k4465j4172K8642J535l0042J1050K5986k1828j5284K9903L595
2186A1854k9633J0639K6334k0248j6606K7878N110l0434P537K6660j9866j8932
2198a9707K7074O064l0032O366K6848j7298j9075K6501R062k8611M645K8457j5190
2211E104k0341K5367J0457k9419K728K7516j4597k2011K2473J1396k9201J19K7766
$$ y = [6214, 20874, -11622, -13076, 18858, 5634, -21079, 2914, 19177, -11632, -13928, 18327, 8206, -18886, 4303, 22816, -7040, -11347, 21436, 12282, -16085, 5065, 23515, -6014, -13196, 17681, 10410, -19367, -1092, 19552, -9012, -18123, 13328, 8546, -20719, -3033, 19149, -6902, -17273, 13957, 11997, -17695, -2536, 20865, -4524, -17528, 12422, 11379, -19315, -6609, 16934, -7531, -21703, 6939, 8474, -21568, -10518, 15468, -6360, -21644, 8259, 11854, -17779, -7140, 19194, -1054, -17660, 10218, 15328, -15106, -7569, 19091, -775, -19707, 7367, 13431, -16601, -10235, 16613, -685, -19760, 6741, 15803, -12808, -8163, 20294, 5104, -15237, 10130, 20587, -8832, -6104, 21412, 6815, -15196, 7277, 18673, -10528, -10409, 17357]
2224A7357j3108k2954K2440J2825k7596m78K8427j0601k2942K1185J4680k6565
2236g330l015K8137r318k4922J9280J5126k7142m905K7313q566k5203J7865J6806
2249A4126k5482o423K8174n352k5294J7057J9131k4391o996K7808m103k5263J5029
2262a979J9020k3044r864K6861k534k6694J3327J9897k2636j0578K6825p25k5576
2275a7700J2002K1494j9861j1810K6400J991k6004J0839K2199j9417j3366K5238
2287A2005K261k6556Q287K2113j8379j5172K4209M014k6246O976K3416j6872j5709
2300a5653K3921N918k5520O091K3497j5095j6939K2749P226k5998L553K3815j5125
2313B440j8018K1423P757k5574K209K3492j2804j8591K0438J0182k5015J002K4928
$$ y = [17357, 4249, -18705, 3735, 16560, -11036, -11514, 16913, 6312, -16630, 4555, 19235, -7330, -10345, 17792, 8474, -16448, 2832, 17958, -9184, -14089, 13224, 4658, -20545, -2680, 14126, -11356, -17779, 10395, 5043, -20251, -3194, 15937, -8454, -15450, 12358, 8255, -17008, -1979, 17041, -6003, -15867, 10994, 8460, -18234, -4907, 14990, -7646, -18224, 8601, 7876, -17700, -5698, 15796, -4065, -15875, 10525, 12516, -13488, -2649, 19550, 133, -13233, 12005, 14266, -12290, -4003, 18110, -269, -15441, 8768, 12782, -13464, -6488, 16928, 56, -15653, 8268, 14186, -11334, -5243, 18254, 3159, -13780, 8969, 16195, -9803, -6250, 17565, 2440, -15578, 5845, 13602, -11972, -9763, 13729, 925, -17666, 2772, 12954, -12061, -11059, 13869]
2326A3869j1137j9311J9864J1256k4206o36K4116r722k0184J7831J2336k3852
2338i776k670K4349q774k0933J7403J3351k2723l359K4595o679k1120J6517J4764
2351A4945k1971m975K4684n024k2021J4918J5544k1574o420K3896l769k2530J2868
2364a429J6741k0399q061K3943k217k2758J2238J7544j9125r219K3389m96k2776
2377a2625J0241J8532j8189j0909K3123N49k3438R070J8912j7424j1576K2021
2389H287J887k3075P598J9787j6108j2798K1518L646k3169O638K0291j5180j3600
2402a4278K1041M545k2577M845K0583j3537j5024K0085N920k2581L557K1015j2353
2415A241j5770J8978P357k2025J962K1108j0690j6731J8351Q753k1733J013K1178
$$ y = [13869, 2732, -16579, 3285, 14541, -9665, -10301, 13815, 4093, -16091, 1740, 14076, -9776, -12446, 11903, 3129, -17804, -401, 12950, -9773, -13132, 11463, 4784, -16336, 181, 14945, -7026, -12001, 12683, 7659, -14362, 556, 16100, -5474, -11894, 12002, 8233, -14297, -1429, 15312, -5087, -13148, 10795, 8578, -14180, -1942, 15602, -3523, -12742, 10647, 10151, -12625, -2384, 16148, -2041, -12950, 10173, 10722, -12716, -3646, 15266, -2158, -13734, 8287, 10174, -12901, -5303, 14484, -1624, -14422, 7096, 10742, -12427, -5789, 14502, -678, -14278, 6763, 11308, -11269, -6424, 14159, 622, -14402, 5683, 11603, -10978, -7421, 13594, 1241, -14529, 4449, 11806, -10219, -8257, 12851, 2161, -14570, 3781, 12534, -9199, -8186, 12992]
2428A2992r650j7073J7050R799k1184m74K1337q539j7966J6132J0705k0663j997
2441i531K1391p728j7877J4841J1298j9535l443K1248n680j8551J3817J2621j9143
2454f272m245K1263m876j8921J2750J3330j8492n825K0783l199j9864J1876J4014
2467A2322j7982o485K0411k117j9398J0814J4901j6635p554K0290n94j9578R376
2480b229J5820j6209q339J9645J31j9650Q088J5738j5104r667J9038J667k0045
2493a1116P002J7004j4127j0604J9124K589j9469O132J7004j2671j1543J8130
2505G455L758j9640M372J7656j2750j2755J7824M426k0051L486J7779j1449j2884
2518a2773J6304O233j9149K088J8484r671j4085J6094P273j8911Q51J8618r013
$$ y = [12992, 3342, -13731, 3319, 13118, -8066, -8540, 12797, 4258, -13708, 2424, 13129, -7534, -9531, 11860, 4132, -13745, 1096, 12394, -7141, -10584, 10664, 4984, -13567, 250, 12871, -6272, -10517, 10746, 5870, -13051, -301, 13029, -5463, -11288, 9495, 6296, -13568, -1692, 12322, -5660, -12145, 8266, 6149, -13249, -2435, 12466, -4169, -11723, 8567, 7973, -11605, -2229, 13591, -2618, -10957, 8688, 8819, -10831, -2743, 12995, -2109, -11776, 7262, 8929, -11116, -4114, 12890, -1237, -11841, 7283, 9872, -9597, -3465, 13539, 868, -10675, 7455, 11213, -8427, -4055, 13601, 851, -11904, 5920, 10346, -9705, -6219, 11560, 111, -12773, 3531, 9764, -9385, -7297, 11187, 1516, -12569, 3525, 10798, -8113, -7262, 11356, 2343]
2531B343j4849J4691Q410j8954p94J8641q092j5473J4224R312j8431q42J8526
2544H712o367j5401J3537J0305j7108k515J9230n442j6359J2795J0690j7066l836
2557h825J8360m669j6625J1481J1329j6459m680J8518l113j6512J0452J2742j5622
2570c623m926J8170k180j6480R286J3241j4757o794J7660j199j7536Q061J3486
2583A2409j4705p598J7130k75j7232P367J3823j2949q382J6964J395j7390O641
2596b802J4740j2708q944J6486J656j7442N370J4498j1967j0116J5478L150j7889
2609a0490M298J5701j1529j0313J5505L974j6731L362J5859r512j1353J4812N299
2622H882j6919K120J6237r221j1968J3976N793j6731R62J5904p816j2852J3308
$$ y = [2343, -12506, 2185, 10595, -8359, -9153, 9488, 1396, -14077, 147, 9459, -8972, -9814, 8712, 2345, -13056, 481, 10786, -6322, -8837, 10393, 4951, -11408, 1387, 12077, -4989, -8825, 9535, 4866, -11759, -278, 11051, -5408, -10088, 8430, 5317, -11195, -743, 11999, -3623, -8549, 9621, 7441, -9039, 247, 13488, -1269, -8063, 9597, 8398, -9138, -1077, 12409, -2296, -9894, 7236, 6961, -10271, -2904, 10919, -2030, -10412, 6552, 7947, -9443, -2802, 11938, -770, -9714, 6772, 8428, -9014, -3644, 10854, -1113, -11229, 4249, 7399, -10490, -6192, 9509, -2020, -12333, 3172, 7146, -9585, -6223, 9636, 124, -11229, 3583, 8882, -8037, -5917, 10320, 1099, -10869, 3107, 8900, -7831, -6869, 9035, 1219, -11633, 1675]
2635A675P053j6205J64J6507o782j2723J2938P835j5684m17J5868n662j3832J1714
2649B449Q715j5658k116J6128n341j4183J1147Q767j4898k760J5945l803j4304
2662i912J0216J0390j4643l457J6197l418j4445R691J0134j3737m545J5301k167
2675E605j5105Q364J1062j3828n367J5494j495j5066Q040J1359j2641n919J5170
2688E673J3j4941O766J2203j2009o821J5046M82j5158N841J2572j1614p587J4615
2702E081J078j4979N107J2768j0622q359J4673K057j5022M673J2972r701q659
2715h933J3447K962j4581L431J3406r051r573J3104L743j5017K678J3558q204
2728I70j0209J2360N007j4692J394J4056p439j0977J2231N660j4646R29J4078
$$ y = [1675, 8728, -7477, -7313, 9194, 2412, -10311, 2627, 10462, -5222, -5639, 10229, 4567, -9265, 2449, 11164, -4494, -6610, 9518, 4177, -10006, 1141, 9908, -4990, -7750, 8195, 4392, -9912, 304, 10694, -3949, -7406, 8791, 5373, -9072, 619, 10753, -2984, -7529, 7772, 5605, -9500, -1136, 9926, -3902, -9269, 6225, 4730, -10336, -2296, 9063, -3578, -9497, 5673, 5686, -9255, -2489, 9714, -2295, -9116, 5930, 6412, -8746, -2905, 9667, -1947, -9534, 5081, 6159, -8820, -3713, 9055, -1567, -9926, 4747, 6804, -8218, -3545, 9427, -274, -8933, 4514, 7476, -7105, -3674, 9732, 681, -8892, 4212, 7955, -7062, -4384, 9174, 970, -9239, 3121, 8128, -6564, -5170, 8886, 1447, -9530, 2701, 8361, -6285, -5356, 8722]
2741H722o805j0954J1401O302j4278l1J4079o076j1753J1118O913j4350q63J4403
2755G828n474j1679J0182P434j3305j740J4152m107j2422R652Q763j3478k652
2768f846J4211l450j2295Q621Q893j2445l522J3958k524j3124Q037R511j2268
2781c243l965J3781j801j2787P133R969j1281n246J3783p48j3233O416J0604j0844
2795a462n718J3246j54j3264N508J0704j0222o764J2723Q62j3541M829J1232r705
2809a726p030J2719J657j3254M222J1343q643p629J1974K554j2917K893J1802
2822G965q161q245J1609K992j3341K440J1995p598q617J1119M361j3160J513J2514
2836G386o632q885J0970M632j2413R51J2017n734r595R962N244j2465q7J2394
$$ y = [8722, 1917, -9037, 2364, 8666, -5612, -5643, 8436, 2360, -9393, 1725, 8638, -5712, -6575, 7828, 2354, -9325, 857, 8291, -5014, -6754, 7398, 3291, -9131, 521, 9284, -4194, -6846, 7365, 3915, -8380, 241, 9134, -3311, -6833, 7125, 4601, -8523, -486, 9025, -3243, -7208, 6573, 4772, -8015, -882, 9087, -2194, -7440, 6343, 5595, -7638, -1222, 9382, -1462, -7180, 6066, 5912, -7352, -1844, 8860, -1362, -8126, 4597, 5459, -8082, -3253, 7979, -1726, -8756, 3963, 5620, -7634, -3412, 7931, -712, -8341, 3633, 6187, -6730, -3837, 7965, -196, -8441, 3168, 6160, -7181, -4741, 7254, -344, -8961, 2158, 6519, -6641, -5128, 7386, 754, -8131, 2839, 7471, -4942, -3991, 8026, 2292, -7303, 2659, 7903, -4562, -4649, 7745]
2850G745n623j0074R905N388j2095k28J2042m635r923R089O469j1558j072J2441
2864G871l970j0907Q921O764j1690j736J1708l199j1169P609P287j1368k862J2148
2878E407k621j1230P506P856j0590l347J2409j640j1254O402Q609r979m177J1941
2892E292j336j1702O075Q673j0210m411J1193m66j1606N340R392r474m993J1837
2906C604M49j1614N222R831q722n638J1600J129j1574L629J0299q511o551J0981
2920D134J659j2234L446J0402q077o779J0579K515j1157K809J0547o799p357J0435
2934D123L233j1428J908J0811o543q083J0074L304j1638J029J0491n962q708R435
2948B046M141j1574Q96J0952n391q323R196M844j0896j74J1184m463r206Q301
$$ y = [7745, 2122, -7952, 1953, 7341, -4754, -4982, 7060, 2425, -7498, 1591, 8060, -3498, -4570, 7871, 3901, -7006, 1915, 8679, -3011, -4747, 6961, 3762, -7407, 202, 7489, -3879, -6741, 5407, 2786, -8444, -938, 6918, -3672, -7019, 5390, 3750, -7504, -1102, 7507, -2472, -6649, 5292, 3956, -7746, -1671, 7002, -3208, -7619, 3574, 3108, -8498, -3158, 6234, -3240, -8233, 3604, 4053, -7561, -2339, 7492, -1230, -6868, 4732, 5861, -5713, -2084, 8215, -296, -6847, 4134, 5793, -6441, -2995, 7407, -670, -7449, 3130, 5645, -5512, -2703, 7844, 1045, -6312, 4123, 7356, -4072, -2164, 8647, 2104, -5979, 4095, 7399, -4239, -3210, 7281, 1319, -7389, 2046, 6187, -5387, -4491, 6461, 1070, -7253, 1943, 6787, -4109, -4283, 6901, 2438, -6768, 1533]
2962A533N575j1200q40J0905m217r629P895N526j0568j601J1190l355r577P428
2976i35O828j0051j974J1316k611r626P063O857r447l007J0862j868j0214O086
2990g21P303r634l394J1163j820j0070N724P899q975l475J0939n48j0049N090
3004e68Q410q698m158J0785k41j0497M428Q329q286n090R982M15j0728L894Q713
3019F690p582n471J0153J132j0425L302R449p444n772R786J939j0510K814R161
3033G222o618o930R509K099j0748K120Q998o066o859Q967K779j0070J235R903
3047E541n274p523R021L563j0221J122R891n080p756Q339M128j0306J22J0002
3061E569m655q077P880M788j0190k54R851l555q362P750M990r237p80J0099l408
$$ y = [1533, 7108, -4092, -4932, 5973, 1756, -7873, 22, 5548, -5020, -6621, 4569, 1214, -8363, -935, 5893, -4158, -6132, 5184, 2573, -7053, 10, 6867, -2580, -5587, 5275, 3407, -6807, -721, 6582, -3052, -6446, 4717, 2897, -7173, -1449, 6450, -2525, -6000, 4939, 4391, -5658, -568, 7842, -856, -5014, 5771, 5530, -4967, -539, 7790, -496, -5586, 4396, 4811, -5917, -2023, 6690, -892, -6363, 3790, 4922, -5503, -2201, 7248, -196, -5968, 3818, 5757, -4753, -1939, 7222, 604, -6326, 3183, 5282, -5466, -3346, 5652, -414, -7273, 1694, 4473, -5597, -4362, 5541, 267, -7256, 1765, 5328, -4893, -3771, 6120, 1040, -6716, 1623, 5751, -4555, -4433, 5569, 914, -7163, 717, 5505, -4685, -4939, 4912, 1357, -7005, 745, 5735, -3502, -4282, 5817, 2409]
3076B409q220P070N478r504j351R968l017q822O465N748r110k045R943k134r276
3091f398O558O299r007k180R856j878q853N686O530q284k989R654j364r191M865
3106f96P007q151l542R530p00r342M649O986p690l742R254O5r576M545P491p416
3122a328m423R294O30r430L489P783o833n138Q895J202r535K933Q463o528n687
3137f213Q840J886r744K621Q241n811n828Q582K359r409J733Q661n658n983Q182
3152B459K542r333J258Q683m889o543P831L179r297O45R037m403p167P473L909
3167E384r478N81R119m314p236P120M276q928n87R302l507p780O888M588q545
3182c117r86Q972l238p322O036N084q535j567R160k491p951N932N364q208j866
$$ y = [2409, -5811, 1259, 6737, -2767, -4118, 5850, 2833, -5989, 476, 6224, -2886, -4931, 5012, 2878, -6398, 160, 6459, -2548, -4728, 5128, 3250, -5603, 83, 6613, -1671, -4660, 4994, 3630, -5561, -696, 6311, -1840, -5382, 4148, 3448, -5894, -1245, 5741, -1949, -5691, 3563, 3628, -5948, -1403, 6088, -1328, -5751, 3543, 4173, -5257, -1768, 6015, -818, -5956, 2939, 4141, -5394, -2461, 6002, -526, -6213, 2627, 4513, -5231, -2610, 5631, -180, -6008, 2574, 4933, -4476, -2743, 5918, 260, -5723, 2459, 5001, -4332, -3074, 5609, 720, -5823, 2008, 5187, -4110, -3465, 5572, 1169, -5998, 1475, 5384, -4094, -3513, 5606, 1292, -5944, 1176, 5452, -3476, -4063, 5239, 1732, -6048, 840, 5428, -3117, -4103, 4869, 1631, -5691, 345, 5429, -3106, -4673, 4487, 1996, -5955, -23, 5341, -2867, -4733]
3197d733Q998j798p952N246N966p790k335Q909j229q211M776O043p640k908Q745
3212D087r25q221M092O593p041l533Q692m08q205M128O566o712l566Q200L07q294
3228d240L225O931o400m450Q291N95q467K824P178o328m588P816R30q158K432
3243b409P538n625m941P831J644q729K473P403n204n286P709J924q600J496P645
3258D869m893n824P283K377q487J286P785m487n897P098L211q348R28P974l945
3273I30n993O797L409q313K82Q067l788o482O475L672q280l31Q206l313o768O296
3289H66M306p938p85Q496k715o788N910M567p728j092P908k089p213N038N111
3304E854p708j899Q075k169p394M791N301p069k294P939q92p622M474N902o852
$$ y = [-4733, 4265, 2467, -5485, -239, 5727, -2063, -4398, 4511, 3282, -4929, -153, 5890, -1750, -4658, 4087, 3162, -5059, -967, 5626, -1415, -4948, 3744, 3336, -4869, -741, 5825, -887, -4453, 3747, 4054, -4240, -1015, 5916, -484, -4934, 3357, 3952, -4515, -1691, 5487, -841, -5429, 2387, 3317, -4841, -2409, 5129, -496, -5437, 2394, 4038, -4691, -2218, 5185, -19, -5305, 2404, 4328, -4272, -2776, 4869, -24, -5848, 1435, 3812, -4675, -3389, 4396, -91, -5988, 1110, 4321, -4027, -3099, 4875, 930, -5063, 1734, 5143, -3170, -2888, 5179, 1391, -5091, 1384, 5056, -3224, -3555, 4651, 1338, -5430, 866, 5172, -2766, -3551, 4945, 2230, -4558, 1352, 5919, -1809, -2901, 5007, 2918, -4295, 743, 5854, -1854, -3753, 4322, 2153, -5241, -450, 4851, -2218, -4512, 3427, 2535, -5087, -613, 5289, -1563]
3319a563k632P955o07p680L812N658o442l399P766p1q085L184O363o522l544P890
3335B083J17p738L531O168n543l734P575R66p505K457O733n455m492P388P83p727
3351d393K329O731n493m378O806J761p835J937P019m627m798P158K061p378J536
3366a564O922m162n263O706K429p735Q17P300m300n614O094K894p715L10P258
3381D377l176n914N943L300p278J55P365k890n901N684L602p103q92P516l230
3396A558o208N078M082p440r84P212k317o467M766M392o672j296P379j696o317
3411d930M845M813o804j698P560j763o847M333M979o583k398P301j154o799L736
3426a409N244n889k670P323m56o844L632N642n472k991P429j10o777K992N719
$$ y = [-1563, -4195, 3760, 3153, -4527, -715, 4943, -1499, -4898, 2868, 2797, -5288, -2104, 4259, -2263, -5807, 2083, 2200, -5538, -2007, 4161, -1382, -5116, 2459, 3425, -4080, -1623, 5110, -345, -4837, 2551, 3334, -4393, -2064, 4667, -826, -5204, 1602, 3363, -4472, -2535, 4484, -143, -4941, 2217, 4278, -3100, -1564, 5358, 1196, -4067, 2639, 5068, -2667, -1850, 5450, 1150, -4464, 1630, 4524, -3191, -2881, 4377, 1201, -4713, 1230, 4530, -2748, -2593, 4772, 1882, -4019, 1665, 5267, -1836, -2728, 4788, 1558, -4650, 428, 4510, -2930, -3914, 3298, 981, -5486, -720, 3672, -3000, -4296, 3083, 1387, -4930, -85, 4728, -2076, -3774, 3786, 2023, -4824, -491, 4488, -2095, -4493, 2808, 1654, -5145, -1409, 3835, -2054, -4724, 2599, 2143, -4701, -1069, 4573, -899, -3890, 3539, 3429, -3348, -356, 5363]
3441E363n631l521O959J98p194K644N984n635l426O896N49o762K282N973m779
3456a00l634O806J072o938J795O403m490m328O309J042o971J227O195m051m976
3471d639O198J646o814Q95O700m295m406N937K248o575P14O606l398n249N718
3486A286K498o742L19O348l291n380N654K395o829J80O820k920n574N207L337
3501C308o357k74O760k088n719N031L620o379r61O739j838o023M594L543n997
3516b041j586O759j627n868M207M321o081j421O819j251n907L763M926o155j749
3531b891O801j079o324L619M581n731k348O343l15o498L050M987n276k836O651
3546B734j63o385K768N446n010k913O210L48o480K256N392m431l601O081O10o445
$$ y = [5363, -268, -3789, 3170, 3368, -3826, -1182, 4802, -833, -4259, 2637, 3186, -3576, -1294, 4679, -100, -3734, 3072, 4144, -2794, -999, 5404, 914, -3414, 2895, 3937, -3034, -1807, 4388, 337, -4639, 1559, 3205, -3609, -2714, 3986, -309, -4715, 1222, 3470, -3105, -2391, 4215, 817, -4432, 1286, 3784, -2958, -2639, 3709, 418, -4962, 692, 3087, -3742, -3562, 3258, 338, -5236, -29, 3308, -3049, -3323, 3437, 1349, -4370, 661, 4281, -2098, -3059, 3680, 1842, -4181, 413, 3956, -2041, -3627, 3132, 1505, -4363, -156, 4165, -1916, -3337, 3482, 2231, -3676, 87, 5013, -1142, -2891, 3910, 2831, -3493, 126, 4707, -1024, -3372, 2971, 2656, -3842, -792, 4195, -1081, -3917, 2734, 2571, -3814, -1046, 4400, -610, -3523, 2687, 3035, -3445, -1189, 4203, -228, -3829, 2252, 2862, -3583]
3562c583J891N378m157l918N848J282o339J481N778l822m081N968J369o460J393
3577a972N834l780m171N424K070o403R43N868l511m592N264K292o104M27N895
3592C484k790m687N203K400o247J18O138k477n218N088K719n981k81O026k438
3607A057m948M469L054n691p21O333k189n322M334L277n659p86N947j872n079
3622c796L820L722n692j036N889j210n433L450M217n354j643N992j144n680L728
3637a70M002m922k219N965n72n686K923M516m984k261N875k71n807K774M473m675
3653a039k423N957r0n691K504M876m316l102N820K34o051K260M853m058l343N572
3669A963P48n829J843M836m009l318N561J044n800J584N078l610l530N246J344
$$ y = [-3583, -1692, 3686, -471, -4389, 1459, 2741, -3598, -2117, 3661, -161, -4242, 1726, 3095, -3365, -1972, 3862, 82, -4089, 1335, 3405, -2998, -2055, 3813, 302, -4290, 974, 3266, -2838, -2411, 3484, 694, -3993, 1210, 3610, -2637, -2519, 3619, 1142, -4076, 1012, 3731, -2250, -2531, 3495, 1057, -3891, 578, 3632, -2059, -2780, 3553, 1364, -3958, 376, 3653, -2006, -2792, 3155, 1283, -3796, 24, 3746, -1946, -2982, 2907, 1697, -3736, -286, 3931, -1423, -3066, 2926, 1782, -3898, -170, 3832, -1090, -3309, 2656, 2084, -3602, -679, 3837, -1147, -3408, 2467, 2196, -3611, -837, 3636, -1039, -3462, 2495, 2405, -3286, -782, 4094, -222, -3324, 2496, 2730, -3321, -1061, 3792, -266, -3609, 1963, 2711, -3118, -1275, 3561, -448, -3766, 1795, 2839, -2961, -1377, 3701, 91, -3439, 1807, 3151]
3684C151n890R02N526l396l902M810J584n781Q61N320l298l973M829K195n662
3699b724J48N697k756m204M844K299n410j91N471k292m572M380K437n512k69N661
3715C007k045m802M143K830n146p24N794j794m699L773L195m981p29N498j368
3730A952m930L428L546n193j219N491j111n292L218L662n024j518N529p47n115
3745c323L152L840m715j625N401n59n116K922L861m633k160N553l49n324K051
3760a024M412m525k216M908L70n709K540M235l837k781N351L65n114J777M489
3775C241l474k979M710R76n462J483M699l697l212M963R93n299J072M950l160
3790a96l499M897J270n185J237M782k930l377M297J952n262M72N024k839l612
$$ y = [3151, -2739, -1837, 3689, 293, -3609, 1201, 2785, -2996, -2135, 3185, -113, -4086, 743, 2938, -2724, -2576, 3121, 365, -3839, 1005, 3304, -2106, -2297, 3174, 882, -3690, 690, 3127, -2385, -2654, 3007, 962, -3840, 303, 3133, -2013, -2737, 3057, 1263, -3436, 337, 3532, -1449, -2178, 3320, 1952, -2978, 450, 3996, -1197, -2416, 3075, 1964, -3328, -110, 3552, -1472, -2990, 2539, 1792, -3323, -171, 3669, -1046, -2671, 2730, 2171, -2945, -23, 3838, -795, -2955, 2598, 2249, -3075, -1024, 3388, -1137, -3353, 1555, 1925, -3784, -1244, 2991, -846, -3627, 1724, 2089, -3025, -1248, 3241, -233, -3212, 1498, 2474, -2988, -1505, 3194, -503, -3715, 1248, 2241, -3058, -1986, 2964, -196, -3695, 1202, 2472, -2713, -1476, 3306, 376, -3001, 1296, 3248, -2014, -1542, 3482, 643, -2969]
3805b969M163J837m805l31N190k335m069M049K329m844j95N086j904m229M158
3820A131K344m880m35M836j418m623L927K550m954q51N094j634m272L323K732
3835B870m587j007N054j291m355L229L252m561j267N108r77m680L091L249m455
3850a327j484M798n02m769K464L560m276j656N075m82m746K320L796l765j963
$$ y = [-2969, 1194, 3031, -1774, -2105, 3085, 750, -3319, 730, 3059, -1785, -1980, 3106, 1202, -3027, 1131, 3475, -1405, -1840, 2996, 1578, -3045, 882, 3432, -1522, -2373, 2721, 1087, -3185, 138, 2870, -1717, -2724, 2330, 1039, -3316, -87, 3165, -1396, -2663, 2445, 1468, -3212, -121, 3128, -1327, -2811, 1987, 1485, -3284, -820, 2740, -1536, -3192, 1883, 1401, -3345, -1025, 2771, -994, -2957]
$$ [...]
8191C68
##END NTUPLES=NMR FID
##END=
