##TITLE=1H_Pr A-325
 200.13MHz, CDCl3,
 8 sc
 
 8.10.2025
##JCAMPDX= 6.0         $$ Bruker NMR JCAMP-DX V2.0
##DATA TYPE= NMR FID
##DATA CLASS= NTUPLES
##ORIGIN= UXNMR, Bruker Analytische Messtechnik GmbH
##OWNER= pz
$$ XWIN-NMR		Version 3.5
$$ Wed Oct  8 15:52:03 2025 Russian Standard Time (UT+4h)  she@DPX200
##.OBSERVE FREQUENCY= 200.1313
##.OBSERVE NUCLEUS= ^1H
##.DELAY= (6, 6)
##.ACQUISITION MODE= SIMULTANEOUS
##.ACQUISITION SCHEME= undefined
##.AVERAGES= 8
##.DIGITISER RES= 18
##SPECTROMETER/DATA SYSTEM= spect
##.PULSE SEQUENCE= zg30
##.SOLVENT NAME= CDCl3
##.SHIFT REFERENCE= (INTERNAL, CDCl3, 0, 14.3821)
##AUDIT TRAIL= $$ (NUMBER, WHEN, WHO, WHERE, WHAT)
$$ ##TITLE= Audit trail, XWIN-NMR		Version 3.5
$$ ##JCAMPDX= 5.01
$$ ##ORIGIN= Bruker BioSpin GmbH
$$ ##OWNER= she
$$ F:/spectra/data/she/nmr/H-C/1/audita.txt
$$ ##AUDIT TRAIL=  $$ (NUMBER, WHEN, WHO, WHERE, WHAT)
(   1,<2025-10-08 15:50:49.28 +0400>,<she>,<DPX200>,
      <created by zg, POWCHK disabled, PULCHK disabled
       configuration hash MD5:
       00 E9 B6 7A A2 85 ED C7 34 08 36 98 17 FE 4E 26
       data hash MD5: 16K
       36 A2 C7 B9 9A 80 93 E9 8D 76 71 00 04 D0 46 71>)
$$ ##END=
$$ 
$$ hash MD5
$$ FC 5A D4 EC 25 82 1F DD B0 58 FE 3B 1E 72 EF AD
##$RELAX= 
##$RELAX= 
##$RELAX= 
##$RELAX= 
##$RELAX= 
##$RELAX= 
$$ Bruker specific parameters
$$ --------------------------
##$DU= <F:/spectra>
##$EXPNO= 1
##$NAME= <H-C>
##$PROCNO= 1
##$TYPE= <nmr>
##$USER= <she>
##$AMP= (0..31)
100 100 100 100 100 100 100 100 100 100 100 100 100 100 100 100 100 100 
100 100 100 100 100 100 100 100 100 100 100 100 100 100 
##$AQSEQ= 0
##$AQ_mod= 1
##$AUNM= <au_zg>
##$AUTOPOS= <>
##$BF1= 200.13
##$BF2= 200.13
##$BF3= 200.13
##$BF4= 200.13
##$BF5= 200.13
##$BF6= 200.13
##$BF7= 200.13
##$BF8= 200.13
##$BYTORDA= 1
##$CFDGTYP= 0
##$CFRGTYP= 5
##$CHEMSTR= <none>
##$CNST= (0..31)
1 1 145 1 1 1 1 1 1 1 1 1 1 1 1 1 1 1 1 1 1 1 1 1 1 1 1 1 1 1 1 1 
##$CPDPRG= <>
##$CPDPRG1= <>
##$CPDPRG2= <>
##$CPDPRG3= <>
##$CPDPRG4= <mlev>
##$CPDPRG5= <mlev>
##$CPDPRG6= <mlev>
##$CPDPRG7= <mlev>
##$CPDPRG8= <mlev>
##$CPDPRGB= <>
##$CPDPRGT= <>
##$D= (0..31)
0 0.7 0 0 0 0 0 0 0 0 0 0.03 0 0 0 0 0 0 0 0 0 0 0 0 0 0 0 0 0 0 0 0 
##$DATE= 1759924248
##$DBL= (0..7)
120 120 120 120 120 120 120 120 
##$DBP= (0..7)
150 150 150 150 150 150 150 150 
##$DBP07= 0
##$DBPNAM0= <>
##$DBPNAM1= <>
##$DBPNAM2= <>
##$DBPNAM3= <>
##$DBPNAM4= <>
##$DBPNAM5= <>
##$DBPNAM6= <>
##$DBPNAM7= <>
##$DBPOAL= (0..7)
0.5 0.5 0.5 0.5 0.5 0.5 0.5 0.5 
##$DBPOFFS= (0..7)
0 0 0 0 0 0 0 0 
##$DE= 6
##$DECBNUC= <off>
##$DECIM= 32
##$DECNUC= <off>
##$DECSTAT= 4
##$DIGMOD= 1
##$DIGTYP= 9
##$DL= (0..7)
0 120 120 120 120 120 120 120 
##$DP= (0..7)
150 150 150 150 150 150 150 150 
##$DP07= 0
##$DPNAME0= <>
##$DPNAME1= <>
##$DPNAME2= <>
##$DPNAME3= <>
##$DPNAME4= <>
##$DPNAME5= <>
##$DPNAME6= <>
##$DPNAME7= <>
##$DPOAL= (0..7)
0.5 0.5 0.5 0.5 0.5 0.5 0.5 0.5 
##$DPOFFS= (0..7)
0 0 0 0 0 0 0 0 
##$DQDMODE= 0
##$DR= 18
##$DS= 0
##$DSLIST= <SSSSSSSSSSSSSSS>
$$ [...]
##$SUBNAM0= <"">
##$SUBNAM1= <"">
##$SUBNAM2= <"">
##$SUBNAM3= <"">
##$SUBNAM4= <"">
##$SUBNAM5= <"">
##$SUBNAM6= <"">
##$SUBNAM7= <"">
##$SUBNAM8= <"">
##$SUBNAM9= <"">
##$SW= 18.0517328524113
##$SWIBOX= (0..15)
0 0 2 0 0 0 0 0 0 0 0 0 0 0 0 0 
##$SW_h= 3612.71676300578
##$TD= 16384
##$TD0= 1
##$TE= 0
##$TE2= 300
##$TE3= 300
##$TEG= 300
##$TL= (0..7)
0 120 120 120 120 120 120 120 
##$TP= (0..7)
150 150 150 150 150 150 150 150 
##$TP07= 0
##$TPNAME0= <>
##$TPNAME1= <>
##$TPNAME2= <>
##$TPNAME3= <>
##$TPNAME4= <>
##$TPNAME5= <>
##$TPNAME6= <>
##$TPNAME7= <>
##$TPOAL= (0..7)
0.5 0.5 0.5 0.5 0.5 0.5 0.5 0.5 
##$TPOFFS= (0..7)
0 0 0 0 0 0 0 0 
##$TUNHIN= 0
##$TUNHOUT= 0
##$TUNXOUT= 0
##$USERA1= <user>
##$USERA2= <user>
##$USERA3= <user>
##$USERA4= <user>
##$USERA5= <user>
##$V9= 5
##$VALIST= <valist>
##$VCLIST= <CCCCCCCCCCCCCCC>
##$VD= 0
##$VDLIST= <DDDDDDDDDDDDDDD>
##$VPLIST= <PPPPPPPPPPPPPPP>
##$VTLIST= <TTTTTTTTTTTTTTT>
##$WBST= 1024
##$WBSW= 4
##$XGAIN= (0..3)
0 0 0 0 
##$XL= 0
##$YL= 0
##$YMAX_a= 506075
##$YMIN_a= -541490
##$ZGOPTNS= <>
##$ZL1= 120
##$ZL2= 120
##$ZL3= 120
##$ZL4= 120
##$ABSF1= 10
##$ABSF2= 0
##$ABSG= 5
##$ABSL= 3
##$ALPHA= 0
##$AQORDER= 0
##$ASSFAC= 0
##$ASSFACI= 0
##$ASSFACX= 0
##$ASSWID= 0
##$AUNMP= <proc_1d>
##$AZFE= 0.1
##$AZFW= 0.1
##$BCFW= 1
##$BC_mod= 2
##$BYTORDP= 1
##$COROFFS= 0
##$CY= -3
##$DATMOD= 1
##$DC= 2
##$DFILT= <>
##$DTYPP= 0
##$F1P= 0
##$F2P= 0
##$FCOR= 0.5
##$FTSIZE= 0
##$FT_mod= 4
##$GAMMA= 1
##$GB= 0.15
##$INTBC= 1
##$INTSCL= 1
##$ISEN= 128
##$LB= 0.25
##$LEV0= 0
##$LPBIN= 0
##$MAXI= 10000
##$MC2= 0
##$MEAN= 0
##$ME_mod= 0
##$MI= 1.114404
##$NCOEF= 0
##$NC_proc= 0
##$NLEV= 6
##$NOISF1= 3.799351
##$NOISF2= 2.8
##$NSP= 1
##$NTH_PI= 0
##$NZP= 0
##$OFFSET= 14.38212
##$PC= 1
##$PHC0= -2281.812
##$PHC1= 14.59224
##$PH_mod= 1
##$PKNL= yes
##$PPARMOD= 0
##$PSCAL= 0
##$PSIGN= 0
##$REVERSE= no
##$SF= 200.129724274929
##$SI= 16384
##$SIGF1= 3
##$SIGF2= 2
##$SINO= 400
##$SIOLD= 16384
##$SREGLST= <1H.CDCl3>
##$SSB= 0
##$STSI= 0
##$STSR= 0
##$SW_p= 3205.1282051282
##$SYMM= 0
##$S_DEV= 0
##$TDeff= 0
##$TDoff= 0
##$TI= <>
##$TILT= no
##$TM1= 0
##$TM2= 0
##$TOPLEV= 0
##$USERP1= <user>
##$USERP2= <user>
##$USERP3= <user>
##$USERP4= <user>
##$USERP5= <user>
##$WDW= 1
##$XDIM= 8192
##$YMAX_p= 0
##$YMIN_p= 0
$$ End of Bruker specific parameters
$$ ---------------------------------
##NTUPLES= NMR FID
##VAR_NAME=  TIME,          FID/REAL,        FID/IMAG
##SYMBOL=    X,             R,               I
##VAR_TYPE=  INDEPENDENT,   DEPENDENT,       DEPENDENT
##VAR_FORM=  AFFN,          ASDF,            ASDF
##VAR_DIM=   8192,          8192,            8192
##UNITS=     SECONDS,       ARBITRARY UNITS, ARBITRARY UNITS
##FACTOR=    0.0002768,     1,               1
##FIRST=     0,             0,               0
##LAST=      2.2672688,     0,               0
##MIN=       0,             -541490,         0
##MAX=       2.2672688,     506075,          0
$$ Real data points
##PAGE= N=1
##DATA TABLE= (X++(R..R)), XYDATA
$$ [...]
1806d32N14L42j61o74j91k59P84M37O1m37m92J46N54O1K34j61l86l39jM99O20
1827G19r6q01n02J29P44P32o84n82M6J36J8M5J16O66n64o16L89m8O83j25o60k01
1849d56J13N22Q7k96r5j36r3L04J41n5L44n11m07M64N38n2R3n86m36P07j43j17
1871g0J81N6k57m75J73N58J90k57j11m80J70N63r7J41l59m32O13p9o1N02m30k51
1893b12J24k04L15K50l6m09Oj05N10j97j15M11m69l19L07M20k8kk95Lr8K26K33
1916C16m67l98N89L6j29l8n6J4j61J24M44k0j50n4J86n31K26M55P9l29j98K83
1938B21lk21Rj57J78k02J6J00N9j36K06N1m24L34Q5j39J18j00J1J96k14J84j38
1961C4K00k04L1m46L31J06j20J1j99L96k65O9N6j23q2M31j64Ok06J44L91j62m31
$$ y = [-432, 82, 424, 263, -411, -602, -861, -77, 360, 421, -16, -508, -362, 192, 253, 487, 326, -60, -399, -400, 99, 719, 623, -178, -680, -551, 193, 925, 241, -341, -295, -159, -141, -96, 20, 686, 122, -494, -105, -153, 530, 405, -255, -456, -343, 179, 266, -30, -125, -261, -354, -50, 91, 36, 380, -131, -538, -74, 464, 412, 505, -81, -517, 190, 47, -70, 111, 167, -90, -565, -392, 166, 356, 99, -12, -492, -322, 241, 144, 285, -74, -506, 107, 28, -33, 469, 39, -212, -88, -292, 23, 273, 237, -172, -166, -271, 239, 42, -73, 338, -131, -450, -143, 277, 249, 247, -48, -45, -143, 83, 316, -151, -549, 40, 76, -53, -91, -147, -133, -294, -170, 274, 254, 104, 50, 236, -295, -69, 386, 465, 136, -62, 221, 218, -3, 6, -151, 27, -175, -159, -59, 0, -136, 70, 121, -303, 31, 116, -23, 95, -5, 6, 202, -12, 172, 34, 234, 30, 61, -385, -54, 52, -68, -57, -256, 140, -125, -56, 0, -123, -205, 226, 62, 68, -138, 6, 397, 235, -196]
1984a96K92j99L07m3j28m10M66l7j67J99l15K85q9O3P1J19p1J35j76k03J32Kq7
2007e0J52l87J28J84j01N6J34j44mJ16j71J52J7J3L2j84J80kl32R3J70K03O0l66
2031e1O4k2j12L0M8J80l18j7J45J57k08N6R5Nj80L2J02m8K50k20k80L7P7L81k80
2056g7m3J94j55k4K11L9l71J49J61K20m22J50L51k55k16K27l35K79j2k15pq2l7
2079b70K15K60k68N2j1j25K08m8K07k81J3K83l02j2L12m11n9L87k72j62M09j32
2101gk4k63l4N33j2j49J1j03j19M47K0q2k0j94J68l65L24K60j94k18n9J4k10L64
2125H8k3J60j03m65O10k37p8M41k56n79J99K58M39l47j05p9j15k27L70J37o0o1
2147c3k72L64l80L63M90n05n17L37JK16L24j35k68L4k97N62P9k98k66%r2L80P6
$$ y = [-196, 96, -103, 204, 161, 33, -377, 89, 52, -115, 84, -231, 54, -35, 28, 99, 218, 147, 282, 106, -97, 35, 37, -50, 102, -285, -157, 27, -74, -18, 116, -28, -32, 84, -87, 65, 82, 95, 127, -57, 123, 121, -211, -118, 52, 255, 315, -51, 13, -9, -121, -91, -43, 137, -181, -198, -53, 104, -104, -48, 47, 52, -128, -96, 6, -42, 208, -12, -292, -255, -178, 203, -77, -120, 74, -81, -105, 106, 145, -226, -77, 84, 304, -118, 32, 383, 128, -88, 139, -196, 83, 71, -144, -151, -233, -270, -55, 205, -63, -11, -22, -147, 61, 13, 220, -61, -48, 235, -67, -79, 233, -178, -237, 150, -122, -284, 125, -7, -31, -294, -328, 205, 193, 44, 55, -48, -167, 280, 300, 218, 198, 4, 172, -193, 131, 391, 197, -21, -80, -66, -276, 88, 65, 225, 122, -343, 267, 30, -48, 393, 137, -442, -243, 15, 454, 107, 2, -77, -192, -419, -49, 88, 28, -33, -305, 59, -321, 42, 532, 27, -490, -153, -152, 64, 388, 253, -15, 19, -278, 284, 363, 65, -201, -201, -293, 87, 163]
2170A63q2o5j89l2K1J97O37o20k49k43M78L4L84J18k03n19m15O61J11N7j97o7
2192b0n57L18N07N8k06k34JJ2P5L87J98q09j58M7Q5K28J47Q9m87j24L04J17%J71
2216A49j55k43j21M70L25j71j05j38k03q2N06K90m54p9l18q6M92P6J50j86m14
2237b97k68N10J60J42Rp31J66m9R25om10j88j71P9Q3J51O4m4n85j08N35J75M00
2260E42k54m91l2K99MN60j28n51o6j73J23O07j57j64q3o46M26N18n7N3n03J13
2282f0J3Q3M36O8o53k73J57o6P82R4n03j80k88P4O68l1m95K65j76k47L07N94k59
2305C10n59R5P8k11M83q1j01j50K1J82k42N66kj73p40J08Q51j85N6j35n23l9J84
2328b07M76r0k57k75K17k46K32N00j51k99Nk07L21K43j64M9m91j89L88J31K89
$$ y = [163, 81, 16, -173, -205, -184, 13, 650, 30, -219, -462, 16, 50, 434, 552, 349, -170, -585, 76, 187, 244, 47, -20, -577, -259, 248, 306, 100, -134, -133, -121, -46, 341, 539, -270, -428, -381, -296, -68, 79, 168, -319, -443, -139, -22, -22, 149, -6, -249, -370, 100, 425, 254, 149, 11, -192, -274, 232, 522, 68, -11, -329, -415, 77, 153, 303, 117, -297, -565, -55, 105, 247, 256, -475, -309, -358, 567, 561, 151, -37, -208, -129, -46, 105, 169, 125, -460, -568, -33, 142, 542, 288, -203, -235, 64, 68, 628, 500, -51, -117, -290, -167, 440, 283, 119, 36, -610, -184, 334, 277, 330, -173, -60, -47, 36, 472, 540, -113, -386, -229, -295, 487, 581, 78, -102, -390, -316, 352, 321, -174, 91, -85, -332, -25, 569, 310, -249, -154, -76, -287, 196, 115, 14, -136, -115, 67, -175, 391, 389, 216, -524, -416, 435, 250, 306, 171, -352, -391, -207, 269, 179, -78, -353, -136, -382, -150, 350, 199, -100, -95, -302, 19, 262, 98, 147, -344, -533, -145, -14, 275]
2349B75j35k61k17J40J15L95j01j72n6l17L31K96o6l30l32K84O3L21Q4r7m32j26
2371c38J44o9M64O3n34N23k21J85J00k4l39k9Q4k34L17L11j92l85r4J35P5J07
2393D9J58l52m13N4M43K86j41M0L6k97J0K96k39K92j67l02J33k8J82J20O4m88
2415b64q2L51lQ7k99l6K80m8k58N76K9m46r0K62k2J40k28L43k78k5QO8k30L82
2439B17l31J98j49J04L32j82k87L5l4K48k31j14M25j35j73j19L15O8j38o5k30
2460b46J71K11jl7j89m3J60J4m19O98l87N7J77m5k49J45O7j46n02N13M2M9j29
2483h9J96j19k5k7p4K25l52M43k96m5L73Ll9l95L65l9j02p0k11K73q9k0q4NL49
2508A56j85m8m9J08K86l82M6o5M27j35l03K04l19L81j55K8J4R6o4k21J19p3J16
$$ y = [275, 140, -121, -338, -198, -83, 312, 211, 39, -17, -334, -3, 293, 227, -103, -435, -151, -88, 233, 317, 220, -212, -338, -194, -263, 201, 264, -270, 253, 32, 217, 317, 293, -46, -75, 9, -225, 92, 403, 211, -174, -268, -133, -58, 49, 207, -145, -558, -504, -61, 225, 84, 124, 160, -137, -127, 169, -70, 222, 55, -247, -114, -142, 40, 160, 224, -264, -346, 5, 2, 89, -210, -246, 34, -14, -272, 304, 333, -113, -203, 59, 37, 177, -51, 292, 14, -11, -3, 65, -165, 217, -114, 84, -65, 39, 371, 189, -98, -63, -97, 151, -80, -194, 231, 96, -77, -196, 119, 187, 49, -16, -246, -75, 136, 135, 98, -91, -134, 26, 40, -379, 319, -68, -11, 166, 121, -128, 17, 84, -62, -564, -51, -9, 40, -89, 107, -12, -37, -64, -138, 87, -265, 178, -118, -163, 210, 213, 174, -221, 144, 105, 3, -67, -278, -5, -94, -114, -198, -193, 156, -29, -77, -126, -18, 268, -114, -68, -133, 294, 159, -144, 60, -259, 122, -33, -5, 9, 105, 41, -180, -61, -134, -18]
2531a8k5l6J44l34L76j6m7M7k27L9R8J48j58lmk20M3K57j0L6K1L4nj46N02o36
2557a40J21J22k05O9J33k87M05Pk31J21j39q5J64j75J49O1k22K07K38o35K46N
2579g1p7M73l13L4n0j64J51O6j51K35k99k9K92j36Q4j01J25o0oJ65k76J11Q5K95
2603C83n36K38j56J99J3k82P0N13l42k36K58l28K63jO2l2m8j1J49j60J21m8j12
2626b3K12q6k98M89r2j68qJ67k85J74r9j60K84P2k78N4r5J64j39k4M99n56K00
2649DJ54l94L11p5J27o5o6r8j15K26o6J94mj7j97m8J62J12j44j95K57q5J63K05
2673C46j07j19q0p25M15L86k38L62l00l3K0J22N8r8J0l39J54q7M53N1k54n3k06
2696b62J77Q0M16l29p7l04N15k09J76J21j65k02j50r9N88J34k25k30m7L3K25M4
$$ y = [-18, -43, -79, 65, -269, 107, 91, 44, 91, -136, -97, 1, 149, -9, -12, -16, -236, -193, 64, 54, 90, 111, 145, 140, -6, 496, -140, -19, 103, -102, -33, 100, -187, 218, 225, -6, 115, -24, -109, 55, -120, 29, 90, -132, 75, 313, -322, -76, -71, -148, 325, 12, 46, -4, -168, -17, 49, -102, 133, -166, -195, 97, -39, 45, -56, 69, 9, 3, 168, -108, 3, 88, 383, -153, 85, -71, 128, 141, -141, -71, 442, 100, -136, 122, -206, 57, 56, 118, 86, 38, 27, 176, 16, 137, 89, -23, 189, 103, -195, 294, 202, 34, 26, 193, -92, 82, -17, -177, 107, 179, -99, -45, -140, 24, -115, -139, 360, -196, 4, 158, -236, 75, 0, 127, 62, -4, -102, -217, 9, -57, 137, 133, 116, -81, -129, 33, 145, 1, -194, 63, -22, 141, 346, 239, 120, 40, -685, -270, 116, -122, 240, -60, -93, -73, 49, 107, 9, 19, -320, -166, -253, 200, 251, -3, -56, -262, -85, -5, 411, 82, 5, -299, 216, 7, 183, 304, 139, -63, -213, -312, 276, 410, 185, -45, -92, -59, 166, 210]
2718B10k71K80K6o30J31J88M68k75j83n3q5J45J69j44j59J63q4N19l95oJ10m27
2740c03j3L28j4K61j9j44n80J54P9P88j84m93J43l46M36P1K26j78j42m20J7N49
2762B16R8Pm77k67M39J22n3j70K13j74L3J64n0K22j30j37n52K11M50R6r8m21q0
2785c38Q6J81M80r7k1n87J04Q2M06j16k85j4j79K11R3K89m7q1m62M6K80K75Rk25
2809I0m92j06O22J21K57l77k27j73R1K99L36j31m13R1l96L17K90k2m0P2m38L28
2831I9J83jJ29n23n4j65L8L50L74k50k77l43M17K27Kj85j33O1k86L91M43l73m51
2854c27J25J34k10N96Jn17K74k58l6L67Q4k42O7k18N5K79K14k57l01j66J03J81
2876e2K65Q3j92k65k96J48L43K04j46k68N0j77K08M99n2m19M4j95L42k28K56J71
$$ y = [210, -61, 219, 245, -385, -254, -66, 402, 127, -56, -109, -194, -49, 120, -24, -183, -20, -104, 415, 20, 14, 124, -303, -316, 12, -2, 259, 240, 96, -484, -330, -251, 537, 353, -140, 3, -343, 93, 164, 390, 212, 70, -350, -333, 216, 314, 321, -156, -423, 16, 138, 85, -85, 128, -46, -13, 151, 101, 323, 193, 56, -496, -285, 165, 261, 163, -258, -338, -252, -71, 409, 312, 291, -296, -192, -110, 296, 180, -105, -119, -298, -87, 6, 295, 248, 167, -295, -249, 31, 306, 315, 90, -402, -508, 114, 235, 492, 115, -112, -285, -194, 105, 441, 310, -103, -12, -408, -91, 199, 177, 137, 209, -229, 99, 282, 281, 410, -113, -167, -332, -294, 56, 430, 180, -97, -440, -23, 204, 206, 21, -112, -51, -337, 54, 497, 124, -327, -202, -68, -278, 318, 319, -198, 76, -182, -218, 149, 233, -9, 58, -160, -105, 174, 388, 131, -170, -336, -233, -52, 213, 296, 104, -161, -457, -309, 34, 238, 92, -176, -126, -303, -95, 404, 352, -67, -23, -218, 124, -104, 152, 323]
2898C23k68k07J65J34P5L6j89k27J50K16k4K43l27k32N6N05l04O0J09l49n1r1
2920a97K18o5K81l38J8j98L45O3j02l7J00n79J95L41J00p5j57j27J30l9L2N39
2942D48j94k77k95QM24J54l64nK52m05K00K39k04j36n2J56L2k70N13Lj83J97p6
2965A65K9j09L0q8q0r7J84J88j26k09Jq1J09j7J51N5j38j83M01j08j48l9n3R3
2989g0RP5k3J70Q9k30k80oK97n7j7J18k0j96L18k06J96m2k07Q7l22K43K22k45
3013i7J72K6j31Ro8n6L7J11kL13n24J89J04j76J54q0J64j03j9j59J58P6K14m95
3037a83M2J47p6K17q8k9j27R3p2k21J80M06n5k50k7m1J50j71R8K21l92M81l79
3060g6p9J35l07J38r9L9K93k5n1J22n6M1j23O3j81J55m0L25k59j58J13m3k6M5
$$ y = [323, 55, -152, 13, 147, 222, 258, 69, -158, -8, 208, 184, 427, 100, -132, -76, 429, 125, 185, 294, -55, -106, -197, 21, -44, 237, -101, -83, -281, 64, 127, 25, -12, 88, -491, -296, 45, 145, 70, -87, -214, -84, -123, -91, 448, 254, -23, -318, -310, 114, 268, -96, -101, 151, -254, -54, 185, -19, -155, -207, -51, -19, -289, 224, 227, 44, 241, 165, 194, 85, 115, 27, -53, -150, 34, 222, 96, -113, -112, -193, -84, -101, 50, 105, -33, -216, 185, 77, -71, -110, -163, -70, -61, 14, -9, 161, 250, 20, -260, -266, 31, -26, -43, 75, 55, -141, 177, -29, 167, 125, -82, 5, -317, -74, 148, -97, 75, 101, -30, -21, -89, -145, -108, 3, 1, 314, -210, -21, 83, -93, 61, -19, 145, 42, 23, -136, 22, 98, 312, -183, -141, 6, -70, 147, 59, 30, -97, -4, -76, -297, -117, 289, 234, -16, -43, -84, 66, -105, -7, 214, -178, 303, -76, -155, -20, -327, -189, -288, -249, 44, 19, -32, 90, 34, 75, -48, 15, -166, -11, -51, 274, 15, -143, -30, -73, -99, -54]
3084e4J04k94K26j84K42l6P5N6l81J44K72k67J91k02J46N2j11k38pR8R0m6j61
3107b85J96j48r2J01K26j92L8K38j92K23m5N4M4r8l52M71k08P6k24k2K93L27m00
3130B9Q9N6L6n48J82J80J78j02j59k4l4K15O2mJ01m44K82l74Q2J03N1k37J53J99
3154G2k92K03n8J65j84J36l66L79J05j39P5k79K46k52J25K21j10J46l25J1J63
3175D2Q3l96R2K30k66K40K73j99J86k44k18L06l17K99O8j41L7o2rQ3J72r9m24
3198b64J18j56L57J71k29o8J49n2j45ML06n5j32J5j72J57LK27m47L13k34K32J22
3221B20l55M6p4J8K67k03J09K71n15Q5J05P4p3k0j08N3J66j12J93Nk25J1J58l47
3245b51J32K59o2l2R2j70J08l1j16K26j62Q0J66M6k28M1j85Km8Q4M31j15j99l61
$$ y = [-54, 50, -244, -18, -202, 40, 4, 79, 135, -246, -102, 170, -97, 94, -108, 38, 90, -21, -259, -266, -168, -78, -124, -285, -89, -237, -329, -228, -2, -194, -156, 82, -110, 113, 68, 122, 166, 68, -284, 187, -21, 55, -169, -191, 102, 429, 29, 118, 174, 210, -338, -156, 24, 202, 100, -59, -83, -117, 98, 160, 156, 257, -187, 95, -279, -197, -94, -43, -280, -127, 72, -220, -17, -75, 90, -94, 42, -324, 55, 160, 21, 96, -183, 63, -189, -64, 157, 47, 193, -132, -121, 42, 125, -271, -179, 51, -215, 25, 298, 99, 285, 41, -177, 129, -188, 111, 179, 38, 75, 13, 4, 87, 259, 160, -264, -146, -302, 55, 226, -3, -71, 78, 26, -119, -115, 191, 136, 4, 19, -153, 4, 7, 234, -213, 100, -134, 98, 220, -135, -89, -163, -145, 122, -81, 28, 299, -216, -131, -26, 48, -25, -45, -153, -100, 66, -46, 147, 152, -73, -62, 96, -251, -119, 140, 78, 46, 138, -32, 76, 45, -71, 155, -7, 73, 239, 285, 57, 98, -87, -85, -133, -49, 382, 267, 68, -293]
3269b93L28j21J00J61J76j56k50j13J82K1J90k51P2l95L93J45o8qm73J28M15R
3291A92J3k5n40L4M19k51L31P0r8j30j41qL95p7n4m4l22N00j62j51j53K81k73
3314a94R6Q7P2P2n1j65Pj93P16j38r6j05n52K74K98M8k4q0l57k34N10j5K09j48
3338C7p5j66J97K58j51j7j24j15j34L04K44Q4k80l56K01j21N15Mm79O1k5m8J2
3361a74L80J19j01o38L15J36P7m9j46j92J70j74J8K34J79j05m46K53L5K01j47
3382e5n2j46J25J72J14J13r5j70j71N5O8J38P3k8j62j06M5L11k33P4%j31O3O3
3406F5L95m46j20P7r3J32J19M4l91N3K12N1J28j87q3L2Ql42M14J15l8l35j89L
3430c76N76o6M5n2r8l73L84M07j00q4m24R1j64L57P0k33P2m1K32k50N43o74O9
$$ y = [-293, 35, -86, 14, 175, 351, 195, -55, -168, 14, 35, 225, -26, 46, -349, 44, 189, 121, 113, -360, -232, 183, 192, 205, 180, -360, -326, 93, -158, 173, 243, 145, 15, -126, -134, 261, 184, 130, 86, -236, 264, 102, -49, -202, 79, -194, -98, -11, 61, 133, 82, -83, -76, -269, 447, 309, 213, 108, -444, -170, 128, 176, 152, 72, -285, -519, -9, -24, 185, 37, -38, -204, -7, 251, 100, 83, -41, -156, -290, 14, 258, 342, 62, -294, -93, -214, 301, 305, -174, -113, -138, -186, -174, 206, 325, 224, -414, -99, 37, 114, 65, -81, -273, -103, -277, -259, -25, 154, 49, -397, -144, -109, 92, -55, -107, -253, -128, 44, 158, 271, 176, 6, -165, -110, -42, 96, 169, 141, -21, -127, -82, 229, -4, 70, 70, -61, 2, 65, 460, 14, -106, -29, -122, 10, 129, 173, -218, -165, 47, 98, 226, 39, -44, -12, -4, -346, 68, 183, 145, -190, -379, -376, 200, 134, 179, 127, 29, -344, 40, 447, 347, 263, -161, -70, -234, 123, 193, -40, 32, -9, 223, -27, 516, -158, -89]
3453h9K68n28K85K92j18k70J93k66L65Mk2j91J53k40J52j14L41m4m13K77j44J12
3475CP3J63l48Q2J35j74L9J29M5j96J6P9J77l68M25j07m83K16N9N6M7j41k51L89
3499F5k68j3M14j19j3k35k0K54K49k93k75L85m30M97j69J68l59Q6P0J63j41P7
3521I3K11k98k1J78j48K49L8r9k80K9L9o4o6J66j75J11J40k6N0k30K37j85K08
3544A57q9l2L7k0j66J33J9j02j03j56N22M9j11l27P6J02J9J0J51k35K33l63K41
3567D5k00J73K14m44K99k25K3Q9O8J21j23Q5l43K40p7J65n0m0n4p3J19J74M7j87
3591D6j34J32K5j8Kk49K87j20k7r1J1J55r0J67oj03J87p3P0J14j80P3j96k35K95
3616D2m9M6j7J60p20Q39j35j15j44qL57l73j8K08j24n6kk5L36k94j0J75k07o4
$$ y = [-89, 179, -349, -64, 228, 110, -160, 33, -233, 132, 136, 114, -77, 76, -164, -12, -126, 215, 171, -242, 35, -109, 3, 76, 239, -109, -27, 108, -66, -27, 102, 147, -49, -33, 46, 223, -145, 280, 173, -310, -94, -35, 21, 68, -73, -324, 65, -203, -216, 198, 79, 66, -169, -189, 65, 314, 21, -254, 131, -299, 198, 29, 197, -162, -76, -6, 157, 16, 93, 304, 6, -15, 163, 15, 264, 302, 203, -77, -48, -9, -73, -139, 27, -148, -37, 103, 77, 127, -103, 134, -51, 157, 68, 36, 73, 53, -113, 20, 39, -63, -166, -322, 200, 249, 138, -189, -113, -11, 8, 18, 169, -66, 167, -196, 45, -155, 18, 232, -212, 87, -138, -115, -26, 42, 163, 40, 125, -218, 22, -55, 110, 60, 20, -34, -107, 12, 186, 233, 46, -88, 44, 69, 51, 53, -196, 91, -29, -56, -147, -136, 19, -71, 96, 90, -13, 174, 101, 171, 285, 105, 178, -18, -253, 42, -7, 39, 22, 182, -538, 301, 166, 51, -93, -101, 256, -117, -135, 73, -51, -107, -109, -134, 202, -92, -102, 73, -134, -198]
3640a98K26j71j9J63L9J95l27nK23l53P4K91j2p5J81l32J71J60r4j97n2J32K76
3663B96l60K90R6k11j91J52J22J9o8j35p1K41l89L45k12m1J89k87K81j2j16K48
3685A86l20M52k54J3n0j69J12J72M0l02J10j13K87l40j26M01J45k75M6n7K52j64
3707D6J52k41K16j53k27J92j95O4j11K71l4J47K7l23j00N56k78j47J22J43l83
3728b56K62J85N5p9j13q6O3pq3q8o7K19l55L42K55P1m27ql6jK97k40J97Lj11M9
3754D1K21l32q7J97M6l8J66k67J7J10j51K34j90J12o1K3j3r2kR8J48k64L10k51
3778b5J26l28M23k2r7j14P8m5r3L95l19K29o5k05L25k89q8L32j76k64J20J75n0
3801B3l5l1R4j6l3j3J8J45M7l86J43L1K63m37J16L6K00q5j62L90l93n0K52j32
$$ y = [-198, 28, -143, -162, 1, 40, 235, -92, -97, 126, -227, -153, 138, 126, 51, 232, -100, 71, 231, 137, -60, -112, 20, 296, -64, 226, 322, 111, -80, 72, 194, 213, 145, 10, -61, 180, -209, 136, -76, -117, 72, -215, 66, 54, -62, 186, -134, 318, 64, 77, 27, -142, -30, 142, 182, -120, -10, -123, 164, -176, -302, 99, 244, -31, 15, -42, 210, 46, 198, -43, 173, 20, -207, -15, -210, -146, -257, 14, -20, 127, 154, -169, -269, 287, 9, -138, -16, 127, -256, 6, 191, 246, 167, 54, -32, 31, 24, -59, -147, -214, 5, -350, -8, 247, 318, -109, -117, -153, -154, 143, -97, 100, 103, -8, 41, 262, -70, -157, 40, 86, 48, 214, -53, -36, 74, -77, 157, -33, 79, 18, 41, 28, -64, -66, 32, 180, -84, 226, -25, 101, -227, 196, 174, 77, -37, 41, -4, -97, 298, -21, 208, 143, -62, 263, -26, -114, 218, 42, -222, -102, 73, 23, -12, -43, 51, 35, 2, -11, 7, 152, 199, -187, -44, -13, 250, -187, -71, -35, 165, 80, -82, 308, -85, -135, 117, -15]
3825a5j09J13MJ06L8r5k61J16M84n48J73j39Q4J37j74L07j34k0j47Q1OJ86l92
3848a99J19k5K02J56k27J3o2L4J65k61K40j24j9j45R9K40j43J91l35J20O2j24
3870b3Q0O0k17M9J18j91K8J10r1K48n47K37J37J39Kj10r0R1j41K5J68j63L48l52
3894h5l36L02O7K12k27J08K62m53o1K11j29J01J56J67n19M48j99J46K00l90k5
3915d4q3J24l3J01k13L19j22k2L7K22l30J01k02J92m4oj64K40j93j02M45l90K29
3938F2o3p0K0L32rk71Rj27qk0J12p2j3N8PO5n6P4j50L55k53K65k97r3Q4P2j99
3965a86J55J26j79J3l0N4K73l70k11J55K99J10l12M9J07l24K86k8kk1J35Lk83
3988a81L20k03nj19M63q9m26L12j49P8L00j79j73J34m8k45K10R3p4P6j43p1K88
$$ y = [-15, -124, -11, -7, 99, 137, 42, -219, -103, 381, -167, 6, -133, -49, 88, -86, 221, 87, 67, -80, 1, 7, 193, -199, -80, -105, 97, 253, 26, 39, -23, 11, 176, -85, 155, 31, 12, -133, -34, 206, 63, 254, -81, 39, 101, -23, 57, 117, -100, -51, 67, -124, -96, 14, -77, 171, -376, -139, -2, 137, 139, 29, -61, 30, -111, -86, 82, -81, 267, -85, -421, -119, -52, 160, -67, 41, 303, -150, -211, 0, -129, -28, 128, 295, -224, 224, 25, 171, 371, -19, -44, -127, -3, -36, 65, -148, 171, 49, 27, 64, 286, -44, 57, -145, 47, 3, -3, -167, 73, -120, -222, 223, -167, 62, -1, -71, -51, 281, 272, 1, 10, -117, -125, -145, -33, -105, -118, -60, -53, 12, -44, 30, -120, 235, -18, 247, -50, -143, -59, 13, -186, -31, 95, -84, -71, -101, -47, 226, -144, -355, -200, 99, 209, -103, -54, 53, -271, 15, -13, -15, -36, 99, 102, -181, 139, -64, -69, -188, 275, 186, -240, 72, -77, 1, 301, 122, -51, 83, 35, -210, 0, 93, 19, 95, -48, -119, 169]
4011A69k45n6M6%L1L22j70K86jo00K94j29K3mn8L13k59p0L88l80M45l83j22o9
4035b29M19q3j00J38k03J96o4j11J11o0r4k9j04K94k05l7q0L44K3l48L86k11o8
4058a15q0L76j74m8J47o9j19J5J56k27K01j45J74k35k8J44R4j26K41q3p8Q8J00
4081B09k96J29lj7l1k9K09Q0j82j41L16l26r6J65lj3m9k34K09K44j22J6oNR4k42
4107a14j85L30J95j90j0rk31K30O6M7l06J79j19J24N7k10K30j17J74J50M7l00
4129C8k20J13P4j65J08o5K59k68J85k83J94L00m36M19k07j38L11k21P6J71Qm7
4151B06j98l6j15pK72K9l49J54l19L04r0K73n3j67J50o0Q1Q7l12n0L40l59K92
4174G3j06L67l73p2J35j27m3K05J48k77K8J93j23O0R0k64J49J9O8N9n8o5k47J98
$$ y = [169, -76, -132, -86, -86, -55, 267, 97, 383, 382, -218, 76, -53, -30, -34, -92, 221, -38, -108, 280, -100, 345, -38, -160, -229, 190, 107, 7, 145, -58, 138, 74, -37, 74, 14, -80, -109, -213, 81, -124, -161, -241, 103, 126, -222, 164, -47, -115, -195, 181, 7, -41, 106, 37, -82, -67, 89, -138, 63, -82, 92, -143, -171, -27, 67, -59, 182, 99, 21, 109, 209, -87, 42, 39, 22, -9, -38, 171, 251, 69, -72, 244, -82, -178, -13, -16, -29, -78, -312, -103, 141, 19, 35, 29, 34, 128, -114, -299, 31, 226, 36, 26, 17, -214, 16, 82, 129, -177, 2, -117, 7, 64, -146, 84, -33, 141, 291, 338, 38, -182, -69, 5, -160, -52, -117, 142, -126, 59, -224, -30, 270, -166, 253, 46, -92, 219, -2, 74, 245, 253, 206, 8, -28, -143, -150, 122, 151, -198, -44, -363, -59, -149, 124, 71, -96, 54, -6, 75, 162, -150, -200, 140, -219, 73, -33, 334, -39, -111, 24, -103, -146, 59, 207, -70, -42, 151, 28, 88, 178, -86, 63, 82, 150, 209, 151, 86, -161, 37]
4198C7o2M6k20J16J61q7J02j7J05j86o0p4L9R6l5l5J3Krr8L3k05K62K76O4j64
4224A00k8j0p5L3r4J46m82O90j89j03M9q1Oj9J00N3m9j27l3J27M9K61j84p5J92
4249B57j64j09J47j25M9J08L5l37J63L9k53J63O3N8N2j97j40K07j39K35m41K89
4271d0M8K58n1l86j69L51J11L2j84n0J11r7mJ69j37J43J15k40J57l35K17L1j6
4294C4l28K24J67l46N68m83N5M10p15J69J78k4J28J51J1j71qj5r7L09k71L8K29
4317B13l29N0J13M9n6k40M95l42q8K93o9p2J48j88N2k15q5L52l1J39k94K01j8
4340G8M6k79J35m4k25J19K99K6j02j5P0o9m0lK43j40J12l85L39j35l44O3M27m30
4364b54N6K60j04L2k00J2K13Jk4k21L23P3k97J61o5L5J41l03P7k97O28m36J79
$$ y = [37, -25, 21, -199, -83, 78, -9, 93, 76, 181, -5, -65, -139, -100, -4, -39, -74, -61, -59, -68, -166, -133, -338, -76, 200, 264, 100, 72, 62, -13, 20, -74, 72, -410, 280, 91, -12, 37, -44, -38, -57, 43, 96, 47, -80, -113, 14, 63, 324, 140, 65, 257, 93, -16, 131, 6, 55, 163, 198, -139, 24, 63, -190, -27, 36, 94, 146, -51, -191, 16, -123, 112, -329, -40, 8, 266, 215, -171, -340, 11, 122, 154, -30, -80, 31, -66, -70, 99, -38, 105, 220, -20, 137, -198, 19, 50, 34, -294, -70, 97, -249, 319, -164, -109, 301, -414, -245, -67, -91, 37, 188, 199, 28, 20, 5, -92, 217, -54, -16, 213, -116, -66, 47, 96, 40, -200, 295, -47, -135, 158, 89, 17, 165, -23, 29, -186, -271, 81, 50, 189, -105, 96, 78, 124, -155, -20, -64, -289, -170, 129, 155, 53, 38, 108, 39, -1, -4, 239, 99, 211, -174, 165, 30, -314, -251, 176, -254, -198, 62, -42, -10, -210, -198, 15, 16, -8, -229, 94, 167, -130, 31, -34, 1, 142, -161, -84, -381, 247, -189, -10]
4387a0K51m5j58k62L13P5l26o0K01lK52l23J00J26m0m94N46k22K04K8O2j7r7j11
4411a0J10J27j99j45k58N50N7n89K28K91l07M0K21p3K5k92K69q8K47j01J8p9L7
4434G9j38l4p4R7M44n19M5J78j20KJ41j00j94Q1J57kqj49J28j45OK70l66J57n2
4459a16l5K91j62J46k08J64k18J29p2j66K04j19j7K42R6j68J30R5P2j46k27J33
4481D8n9L8JN7k71k0J19O9l85P5J18K84j80j6J38j21J5M7l13L84J8j11J10J05
4505A50j03q6J70j75P7M3j68K77k89P2r8L09k11K01j65J10J5m5j25P0J06k86L26
4528A75k14K08k30J17m1Q4K5r9K47j42j62J21o5J87k89K9k6R9J53k6k30J81j73
4551g1k5J60j37K99%l11Q9j12J54k06J79kj00K13q0j27j83K63ml37M78K8j73o7
$$ y = [-10, 241, 196, 38, -224, 89, 164, -162, -222, -21, -24, 228, -95, 5, 131, 91, -403, 143, -79, 125, 153, 215, 198, 101, -10, 100, 227, 28, -117, -375, 175, 232, -357, -129, 162, -145, -105, 116, 43, 68, -224, 45, -43, 204, 103, 121, 42, 79, -59, -93, -167, -70, 374, -145, -100, 78, -42, -40, 101, 1, -193, -112, 45, 43, 35, -114, 14, -131, -125, 145, -221, -64, -116, -151, 140, -22, 124, -84, 80, -138, -9, -81, -247, -43, -162, -179, 63, 159, -9, 121, 216, 288, 142, -85, 48, -11, 27, 28, 85, -186, -206, -87, -18, -403, -328, -210, 74, -106, -122, 16, -105, -90, -43, -356, 28, 46, -65, 45, 150, 47, -39, 131, -44, 33, 76, -92, 185, -104, -32, -130, 179, -32, 169, 4, 114, 129, 84, -41, 29, 135, -151, 175, -39, 169, -61, 56, 15, 99, 124, 25, 272, 130, -32, 89, 24, 211, -78, -49, -75, 24, 177, 151, -79, 102, -71, -96, 64, -73, 226, 226, -85, 4, -108, 46, -160, 19, 17, -83, 130, 50, -77, -260, 3, -1, -338, 140, 168, -5, -72]
4575g2K60j94J08j72p5j34J78J1J16n1k10J50j35J29J61Q4j78Q1K6p9L14k48o0
4598A0n5j8J12O6j71J36k38o3K70k96K99k96L98k47K10Q1L0j91l5j4N0J45k91
4621a08j9o8L98k62J73J19j23k28Q3O7J30j18j05j11N8QK02j29J31j6j16K9K05
4644B00l35J51k39L20J26k49jj07J37n52L85k07M44q4r3J39k1P5J18l65K62J49
4666B53k0n91M14j63k8L67k33J23j12J28j66OjJ33j7J38l63k9J74l14L03l01L31
4689C2Q5j00l3j5L2j5j67K83J7j04N6q2lj2j8J11k30K98k29M70m97J77L7k15P7
4714d5R4j35o8L35k57L7K09K40n04K31j52l5Q4q3mo0L2n6K16J03j82Q2K02l19
4738c5j4J53j65Q9j52k8J47m2L7l0l7J50j72K31k6k0J26k58q4jK37k29O3j26K05
$$ y = [-72, 188, -6, 102, -70, -145, -279, -101, -90, 26, -25, -235, -85, -220, -91, 70, 154, -24, 57, 83, 4, 318, 70, 10, -45, -63, 49, 115, -56, 80, -158, -221, 49, -247, 52, -244, 154, -93, 117, 198, 228, 37, 2, -12, 38, 183, -108, -127, -195, 203, -59, 114, 233, 110, -118, -35, 32, 162, 44, -61, -172, -114, -106, 96, -33, 98, 82, -34, -5, 200, -135, 16, -223, 97, 223, -26, -27, -134, 3, -549, -164, -371, 73, -11, -104, 35, 14, 89, 207, -158, 104, 253, 233, -358, 56, -107, -135, 232, -1, 122, 10, 138, -28, -22, -23, 110, 93, 231, -132, -161, 13, -301, 2, -299, 32, 117, 17, -16, -31, 1, -14, -181, 102, 119, 15, 71, -11, -14, -26, -44, 67, -163, 135, -94, 376, -121, 56, 93, -122, -45, 49, -86, -154, 181, -76, -39, 170, 410, -94, 137, -15, -50, 34, -49, -53, -113, -81, -137, 79, 182, 0, 82, 284, -35, -49, 104, -61, 28, -124, -152, -5, -47, -10, -40, -77, 73, -99, 132, 106, 86, 212, -46, -130, -131, 106, -123, -60, -186, 19]
4763A9q1j06L71j35R2J45j99j33J05j49P0k9K3j15Q5m8j43L35q4J48j88M6K38
4786B67k15N0j30R4j20j6K28l18K45k18K70k31K6R4j01J34J47j88k9K32k62k75
4808c16L57r7l4K11L6n2j03Q6j56j8Q1m1j11K36o6OJ32q4j52Q9j99R0j85K78n0
4833f2R3m8j83J95nJ22j51l86N11l74K83L11l11j06r5K88k29j03K64L07m90K89
4855A20j42kJ25j52K01l37K72j29N1j17K41%L19p47M06r2p7J56j56J40k01M84
4877C63l83K6J3K88o51M01O8J18k79J28k21lj0K20k86O5J14j2j1RQ2M0L05n30
4901a46M94j95j97J9J09j97L08k52J0J30j47j56K4J23m6J74J54j33k36J90K65
4922B95R1l13q7p3p8J87n2J6K62m98K01m6K27j46o4K27j12k1J38K1j28R4j02J55
$$ y = [19, -62, -168, 203, 68, 160, 305, 106, -27, 78, -71, -1, -30, -7, -122, -37, -85, -228, 107, 23, 171, -17, 29, 267, 52, 102, -28, 66, -54, -70, 158, -160, 85, -133, 137, -94, -68, 26, -75, 59, 206, 18, -11, 221, -41, -316, 41, -56, -90, 121, 157, 105, 2, 88, -68, -86, -5, -46, -157, 79, 13, 19, 151, 67, -85, 4, -195, -105, -290, -12, -62, 31, -17, -200, -5, -10, 112, -39, -425, 86, -288, -5, 306, -5, -111, -206, 82, -147, -250, 14, 321, -169, 120, -22, -24, 101, -51, 150, -187, 85, -44, 7, -110, 131, 131, 450, -297, 109, 17, -60, 96, -60, 80, -121, 363, -20, 6, 19, 307, -344, 57, 125, 243, -36, 92, -129, -132, -142, 78, -208, -143, -29, -41, -52, -43, 39, 79, 384, -146, 348, 153, -44, -25, 84, -113, 195, -57, -47, 83, -64, -220, -196, -73, -119, 55, 209, 76, -160, 30, 295, 386, 73, -14, -87, -165, 22, -30, -14, 248, -250, -49, -95, 132, -14, -78, 149, 37, 16, 154, 175, 47, 141, 39, 194]
4946A94O1k88rK98l24q9M27k81q1K90k69l6K95j60j21J79j03j0j52J44j10J20
4968b5J00j92O2L78m78L27o4k31J67j90L06j22k04K00K03o12L96J73j33k60L73
4989A74l28R8L3P7k93J78j57L0M0L80j04j48r6J01O4k79l3K41LQ7j34O6o9NJ37
5014G3l36K94j86Pj05R4J31Q3o5J9k72J10L76j73Q6l73J82K03k52L05k49J39j31
5037d0k39J54K2R8K30j76nN2n7n1j74J16J54j07K93m23L95j38j25P2K3J18j02
5060I0lm2j7j96J10J00j33R5J4o6J22j99J84k41J25J3J72j34L0O1K8j23j65J65
5084a0r3R5nJ24k89J05RJ40k0om3l13M40k53Q0Q6L8p7j72J85R4l3K14m35K90K5
5110A76j66q6j10J38j24J70n2j1L24l37P0J51j44j61K6R6L35l12Q9n7o8R4O0J24
$$ y = [194, 255, -33, -42, 256, -68, -157, 270, -11, -92, 198, -71, -107, 188, 28, -93, 86, -17, -27, -179, -35, -145, -25, 75, -117, -55, 323, -155, 172, 108, -123, 44, -146, 160, 38, -166, 34, 237, -375, 21, 194, 61, -199, 174, -154, -56, -23, 54, -239, -61, -218, -188, -148, 232, 128, -20, -116, -15, 49, -230, -263, -22, -19, 68, -66, 0, -69, -64, 73, -263, 31, -155, -148, -253, -159, -28, 55, -10, 9, -263, -153, 223, 50, 136, -237, -55, 148, -104, 201, -48, 91, -40, -279, -125, -103, -5, 225, 49, 44, 96, 39, -12, -186, -70, 84, -23, 270, -153, 242, 104, -21, 51, 74, 192, 90, 87, 45, 28, -168, -58, 42, -91, 4, 18, -48, 74, -125, 59, -182, -57, -44, 128, -6, 24, 85, 113, -10, -175, -10, -103, -8, -13, 111, -178, -73, -64, 76, 56, 50, 7, -306, 134, -119, -39, 47, 85, 8, -164, 21, 115, 82, 296, -139, 151, 176, 10, -76, -186, -48, -172, -2, -54, -65, 259, -78, -8, 143, -1, -162, -136, -40, 295, -17, 72, 15, -53, 41, 101, 225]
5134B25l59L67J96k31j76J5n4k4L03k08P6K01k70J14o4k29R9k1K66j33M5k08J41
5157G1j16N2j33L45j74k21J17R9k01J50L7j00L78n71K19jM3k00R9n2K30K01n32
5180b60K36kJ69rl52L61j18j12K53l31J03J79l05J84K04l79K14k3l23L31J39k3
5202A36lJ15l87K18k77K22j37R6j13L7p4j06M13j33J47k33J05k3J45j31l0M2j71
5225a42K08j16q0J36r1j39K70M28n69K80j5n04M56k09K5r6RJ32O0J00J22m91K13
5248a3n1K68l40L49k68n4N3n7K47m56R8K0L80j88q1l3K28j30L1J08k55J60j24
5271a08rO8N9J0L61m15J7J25k08R6k18J3Q0P2J19l4J2m5K12k17p0J76l40K01J41
5296I8r5L3Jj33R2J56j35o9J33J58k43K77l17R8q0p6k9J29r9N5J48J0j96K05j74
$$ y = [225, -134, 233, 429, 198, 22, 37, -17, -41, 262, 54, 130, 331, 61, 175, 111, -118, -19, -40, 226, 93, 138, -70, 71, -45, 7, -126, 219, 45, -176, -59, 40, -161, -11, 26, -74, 304, -267, -48, -49, -6, -206, -107, -159, 71, 272, -260, -24, -26, 143, 134, -218, 143, 25, -87, 166, -165, -62, 117, -188, -4, 200, -179, 35, 12, -311, 20, 159, 136, 133, 248, -139, 79, -198, 24, -113, -17, -130, -93, -167, -273, 140, 7, 154, -79, 26, 3, 148, 17, -13, 29, -142, 66, -50, -130, 6, -85, -224, 46, 474, -95, 185, 170, -334, 122, -87, -62, -158, -149, -17, 43, 143, 265, -226, -13, -64, 204, -136, 213, -55, -109, -56, -113, 134, -322, -224, -204, 176, -12, -93, -126, 102, -28, 3, 111, -144, 16, -108, -117, -49, 10, 20, 381, -34, -17, 108, -100, -4, -222, -209, -129, -57, 62, 28, 40, -5, 207, -10, -80, 96, -244, -43, 98, 3, 36, 37, -96, -4, 152, 17, -52, 81, 239, -4, 273, -44, 54, -26, -102, -131, -2, -101, -46, 102, 112, -84, 121, -53]
5321e3J22k9J58k83P9m5Q2k28L84j05n1l4p8l06M13K4k85M83k25r7KJ71k84K42
5345E7j48L59l20j99M2K16J47k33K27j64J6n8L60k82J27j05m7j93j81N32m05J44
5367a08J12k62L77K5r2oK50o09J82K11j98j32M05Lk82J08j25K54R8k74J29Oj42
5390g0j65L29l08L54r3l00J74m9J93k14J65k04L95j2n20L50N0k7J22j29j7j52
5412a28Q0mp2j79L43J64n55N03P1l06m3J07K26j76l53L51R3l05L00j31q2J93j09
5435a2J04l22N08k63p8J10j50J20oj0K7J36j26o5M8m7P9p7R0j15rj43J10L8J31
5460G8k6k56J05J28Q9r2j75J63l61L58Q4n3m5l9kn2O3Q4j4J78j90j7K32l08J07
5485C9L24k29j73J39q0j15M2M9kp4K64k07K74m12M9K18j74R5j8k70K0L23K2j18
$$ y = [-53, 69, 40, 198, -85, -6, -51, 31, -197, 187, 82, 31, -3, -81, -387, 26, 50, -235, 248, 23, -74, -72, 99, -185, 57, -91, 268, -52, -251, -209, 7, 154, -79, 148, -16, 0, -58, 302, 20, 147, 42, -5, -198, -379, 153, -252, -108, 4, -258, 119, 144, 52, 46, 296, -313, -131, 80, -118, -250, 155, 158, -124, -16, -141, 113, 211, -63, 66, 72, -70, -235, 94, -214, 140, 47, -253, -79, -128, 65, -149, 16, -188, 207, 195, -325, 25, 75, 48, 170, 41, 24, -128, -48, -52, -124, -303, 40, 204, -351, 152, 223, -83, -126, -19, 207, 31, -322, 29, 122, -183, 117, -14, -96, 97, -12, 92, -230, 278, 15, -63, 47, -103, 17, 11, 1, 28, 164, 38, -27, 21, -26, 53, -24, 66, -49, -58, -201, -91, -53, 78, 52, -204, -99, 29, 118, 26, -149, 14, -347, 11, 95, 42, -3, -42, -44, -96, -33, 51, 37, 215, 25, 8, 240, -68, 39, 363, 134, -39, 100, 20, -95, -53, -4, -6, -80, 184, -23, 251, -161, -112, 106, -68, 27, 9, -261, -241, 82, 104, -14]
5509a4j12J84k12o1K5K2K43J92l00k8J91j17r0J74j23J29l33L33k32JK58q2Q7
5532A35j45O6k04K61l88M92k91j09K38p0j7L8K82r8j19j49n1J45n0k76O08l84
5554h6%J26K1j57L80k03o0l9Jm7K13q8J47j25k26k7K35l8Q0pk70K29o7J48j59
5579a9l0K76k92J16J14o8K29m38M7N0J01q6K74k94Q1l77L61k57J73J85l30K26
5601D2k51J17j66M20j94j32J19K38j06n7k5p8K16p6M9J3k56K78j66m5l4J19k74
5624b49R7L44k09R6R9j21J51k7j92K05l85K31J39j35o1L8k6J53K8j39J40m37K07
5647e3J46j04J5q5K38m14J63K22k39K39n29M20P6K5j81n7j36J30n5J86j20K93
5669A80k11J70j15j27K17k0k73O5J21K93k41j62J37p7Kk45J17N1M12l77K78m66
$$ y = [-14, -126, 58, -154, -215, -190, -168, 75, 267, -33, -61, 130, 13, -77, 97, -26, 103, -230, 103, -129, -128, 130, 48, 135, -10, 56, -148, 113, -275, 217, -74, -183, 55, -15, -32, 6, 288, 190, 71, -78, -129, 16, -34, -310, 298, -86, -86, 40, 61, -96, 284, 81, 21, -18, -17, -64, 149, 61, 208, 83, -143, -170, 65, 27, 107, 100, -170, 59, -8, 140, -19, -49, 227, -65, 51, 165, 97, 326, -112, -65, -15, 86, 0, 274, -20, 61, -316, 45, -212, -39, 146, -184, 42, -209, -92, -258, 162, -32, -164, -45, 193, 87, 30, 5, -73, 143, 67, 116, 129, -127, 151, -15, -60, -94, 25, -249, -152, 192, -17, 79, 178, 57, 208, 181, -11, 194, -191, 40, 179, 44, -17, 21, -5, 148, 176, 37, 177, -260, -53, 93, -11, 4, -81, 157, -257, -94, 128, -111, 128, -401, 19, 95, 120, -61, -118, -254, -124, -179, 7, -113, 180, -31, 139, 24, -103, 114, 94, -179, -114, 7, 300, 59, -103, 34, -43, -41, -286, -169, -118, 294, -83, 195, -271]
5691b71J20L09k33J00N3j41j21J0O8J43j88J75K0K4K07m16J50J69j84K14q3k03
5713g8m1L53k28M8k81L38k40L0J27n4J2J03q9j83P6K84k30J57l45L84m04K43O0
5736D2j4J22jj03j29L62l24N5k46L32lk67j9J97Oqk16M15j39m0j79L64k55L33
5760B85l43K12j72j51J98j56L16o0j73J16J85j58M3j71j50q0J8M33j03k17K19
5781I1P9j33j38j10O3M87l83N4j12J48N5R4k23K00k45M1l0p0J68O9j02J62j08
5804E7R8l36J10J56k10L8k9K88j11j07j33K32o6N6j2P7J11j54J5K5k23M54k68
5827F8j80r3K69K5p4o0J6r4J48M1n0J54j92j28N4K67q7k14K83k55J63j14J70R9
5851B16j10j73J62k19R3J14l54J60K19q7l3N4k04ML92q8LK4jlk26K51O3k38o3
$$ y = [-271, -151, 158, -75, 25, 78, -63, -184, -174, -106, 37, -151, 24, 44, 68, 275, -141, 9, 178, -6, 208, 125, -78, -119, 234, 6, 54, -227, 111, -129, -99, 28, -26, -14, 89, 0, -183, -107, 177, -53, 104, -241, 143, -261, -18, 42, 28, 150, 149, 46, -83, 279, -45, 10, -236, 96, 93, -174, -193, 4, 10, 2, -214, 201, 62, 22, -157, 207, -48, 285, -58, 154, -18, -169, 29, -127, 189, 129, -44, 72, 257, 99, 142, -29, -179, -259, -241, 192, 89, -128, 91, 170, 37, -101, -211, -148, 339, -44, 10, -102, 46, 101, 195, -28, 172, -73, -32, -62, -132, 36, 105, 3, 165, 57, 155, -181, -71, 85, -125, -87, -116, 172, 61, -46, -179, 53, -13, 43, 31, 108, 219, 65, 80, 105, -118, 336, 68, -112, -205, 64, 89, 15, -45, -29, -123, 25, 66, 16, 170, -22, -150, -96, 171, 84, -130, 153, -102, 61, -53, 117, 216, 106, -67, 95, -124, -31, 83, -271, -111, 108, 21, -12, 42, -162, -158, 234, 146, 149, 173, 172, 169, -57, 194, 257, 19, -44]
5876d4P2j68M8O4L0J11l06M35o9k08J0J42k35L22k45m1K55j20k84J77j48M30k37
5899ik2k7K48j29P0O1k52Pk33K17l50K69L7j31J10J71P1k81K53j49j84M04L9k11
5923b1p1K95P8n18L74r8p4j25L43k23j29K80l0O4j85O5k0J16j9kK2k74K25k30
5947a57K6J59m3K10k65q4M01n29o3N02l27R1L12j78n0J48j52pm3o4p1M6L51p0
5971A43j91l9O0k0j55K61k2J34k75J31Oj16K9O1J73k55L1J10o9R4J3L5q2m6j27
5996a16O9J09N5n9J73p5o6r6l3l1J89l43R2K09k02M14l49J21M2j20J85k85J46
6019B9L5n2J98l78J49j18K27M4j93L24j27j57J48r3j6M55k48k67l0J55kk04K48
6042A27Jj47O7r9K4L4l0m5K78j79J10r8r8l2K08J42n07L53l07Q1J60k51K40J50
$$ y = [-44, 28, -140, -92, -28, 2, 113, -193, 242, 173, -35, -25, 117, -118, 204, -41, -82, 173, 53, -231, -54, -202, 228, -9, -31, -58, 190, 61, 131, 192, -60, -53, -286, -69, -419, -150, -113, -244, -134, 37, 108, -173, 80, -69, -253, 151, 190, -21, -92, 203, 281, -237, 137, 39, -35, -160, 183, -40, -169, 111, 81, 145, -40, 25, 5, 121, 102, 100, 122, -152, 73, -157, -131, 28, -15, 195, -70, -154, 247, -282, -345, 157, -170, -79, 233, 55, 5, 153, 1, -6, -49, -113, -184, -138, 213, 143, -48, -87, -27, -47, -202, 59, 37, 171, -104, 27, 33, -83, -54, 7, 180, -75, -44, 66, -3, 91, 104, 139, 57, 11, -116, -47, 62, 117, 58, 231, 156, 90, -6, -39, -70, 119, -224, -132, 77, -125, 289, -60, 61, 103, -17, 168, -117, 29, 64, 12, 210, -168, -19, -137, 90, 134, -59, 265, 138, -19, 129, 36, 20, 475, 227, -40, -70, 85, 83, -121, 127, 128, -19, 48, -51, -27, 7, -23, -68, 210, 31, 141, 43, -55, -87, 121, 263, -244, 109, -198, -117, 43, -208, 32, 182]
6066A82j14j04J18K2k14j0J1K22l03Q5O4J23j90r0J83n3P9M8Oj89J97j05Q3j6
6090C5j58M10j15k73l3J59j67L53k23j23P4J11K8j49J06q9n6N07k51k00P0k6O4
6113E4r3K7M8j2r6L3L17j57Kj36K00j03J16l04r8J64p9k13L92L3m8q4O9j57Q6
6138c9J53l5N7l29K70j42R4J0J01l1j03q7P2K07j13J15K04l96K01j28N4O7j95
6161GL7p6M8l08J64J26J75j87J04k54R1Q7J88l75J81m1j3k28K62LJ08j54P3o6
6185d8m5L84j40r6LK29l83k65L85J56k26p1J06J6K24l17K0K7J92L5k27N5KJ0M5
6210G1m9kn9M8j16R5J36l74M54Pk55j79J88Q9R4j27Mj87Q0K41k07j43L65j13m2
6235A9m4K08k65k39N91l99N7l6J66l7j42o6J82LJ27q2J9j34M5J15j79j50M43k76
$$ y = [182, 68, -36, 82, 104, -110, -120, -109, 113, -190, -105, -41, 82, -108, -198, -15, -68, 11, 59, 65, -124, 73, -32, 51, 35, -123, 287, 172, -101, -134, 25, -142, 211, -12, -135, -61, 50, 78, -71, 35, -54, -110, 397, 146, -54, 16, -10, 54, -39, -12, 36, 24, -72, -39, 278, 121, 123, -13, 187, 84, 200, -104, -202, -38, -117, -330, 62, 95, 47, -37, 32, -125, -39, 114, 79, 136, -193, 77, -65, 29, 39, 140, 109, 6, -81, -9, 198, 85, 200, 404, 8, 209, 81, 135, 202, 7, 44, -32, 16, -292, -128, -2, 173, -14, 90, -164, -73, 14, 202, -173, 8, -33, -46, -274, -12, -9, 99, -55, 18, -48, -93, 291, 151, 55, 58, 287, -96, -361, 24, 180, -46, -117, -11, 5, 229, -88, -68, -41, 151, 186, -41, 14, 16, 26, 71, 22, 20, -39, 9, -107, -12, 124, -250, 204, 211, -44, -223, -35, 54, 148, 21, 25, -162, -82, 159, -48, -191, 174, 61, 19, -25, 183, -82, -321, 270, -129, -72, -108, 58, 21, -121, -187, -5, -2, 125, 43, 62, -72, -27, 88, -91, -241, 202, -74]
6259g4O4l92K62J85J8l08J84Q5J59j18K4K17n87J73j8R7j77J51knJ63J40k53J52
6283A40k23K80j74KK26n13K83k97K86j37N8J48P5j71N1l1J61l32l3J39m9L99n49
6306b61K32q1M1m6Q7J90k84K78k56J38P6k38K15j55L3P5m07O41k91j36J49l12
6328c12L19L84l78J5j04J06Jl53L30j1K17n7J00j94k54J53K0P8J0m8j63n9L0K75
6352A05q2J14j13n8K82l87M22n5j43P1l29J04J14oJ8O3J34l21J81j85J19k05j29
6375b86J67K97J47k89K29j27l54J73J56J27J34j59j68j59j5J42L8l07J29p5Rr4
6397b85j24K95M8r0N6J63l30J91M4j96M87k71o9K02jk21qJ11Q2k07J1N1O4k3m7
6422f7k06K67N2M0k8Q3m01M98l02n6M42l22j76L3J02J43k7k68J42K46k62r7m5
$$ y = [-74, -10, -402, -140, 45, 63, -245, -61, 24, 183, 65, 89, 306, -281, -108, -126, -29, -206, -55, -57, -62, 101, 241, -12, 140, -83, 197, 23, 25, 251, -262, 21, -276, 10, -127, -69, 79, 154, -17, 34, 3, 164, -168, -201, -62, -111, 288, -261, -29, -110, -69, -115, -28, 162, -122, 156, -100, 38, 114, -124, 91, -64, -31, 44, -363, 278, -13, -149, 0, -312, 7, 391, 13, 28, -76, 30, 31, -322, 8, -3, 214, 157, 257, 63, -191, -38, -18, 60, 70, 22, -141, -200, -170, 105, 23, 137, 24, -34, 248, -139, 283, 228, 85, 156, -173, -69, 45, 39, 57, 120, 254, -67, 114, -71, 48, -157, -286, -119, 178, 325, 36, 265, 138, -216, -43, 113, 240, 374, 215, 47, -112, -127, 15, 53, -254, -125, -200, -191, -285, -409, -114, -66, -156, -100, 63, -267, -76, -32, -228, 259, -12, -81, 121, 120, -101, -109, 2, 84, -123, -112, -61, 3, -20, -67, -273, -6, 46, 86, 58, 141, -260, 238, -64, -120, 322, 0, -176, -143, -41, 102, 75, -193, -51, 195, -67, -164, -209]
6445b09Q2j8K43j46R6Q7k42J78o3J29o3J85j26l12K83p5k05J36K93q7j37r6k56
6468c23L18L3j0L07l53k7K12m1p7j63J19K0m1J71j41j07K08J89m51Q2L00l00k21
6491b96J57R5or6K2M5K79N5k59K7K8K0J29l3l14r9J3J66No9J45k28K78j2j36q9
6517a73J23M5j96K87o0m5kj1K52p9k65K38q4L39j43o9l97L09o6l1J53k03Q9Q6
6541I7O6m45J93N3j8k18L09J9j43l9K83q7p1M8k70K48m4j64J73p2jjk16J04L71
6566A75l06M52l65J33M2j67k00L49J6r0j35j0M3J55o6j10J59j36N7k42K11j9L05
6589B51n4j93J16Kj61J47o5o9J25k71M1K65k51K1P9P6q0N2k64L51m47L51j50P3
6613e5j13L40q0J38k13o5L02k06p9J85j6k47n0j92J89J92j13J37j28L80k85o7
$$ y = [-209, -127, -145, 98, -48, 48, 135, -107, 71, 8, 137, 74, 259, 133, -179, 104, 29, -176, -40, 253, 166, 29, -67, -323, -5, 28, 18, 325, -28, -55, 157, 116, 39, -124, -5, 15, -26, 145, 4, -103, 105, 294, -157, -75, 225, -75, -296, -139, -44, -50, -146, -124, -79, 200, 255, -4, 23, 51, 71, 200, 167, -147, -246, -233, -67, -62, -131, 14, -214, 64, 52, -84, -173, -50, -5, -201, 86, 26, -19, -21, -32, 220, 141, -124, 114, 30, 369, 226, 157, -240, 69, 3, -28, 125, -78, 11, 97, 163, -282, -89, -36, -54, -272, 37, 56, -87, -126, 157, 70, -1, 47, -223, 25, -19, -183, -10, -82, -83, -84, -300, -196, 175, -131, 321, -44, 89, 131, -36, -236, 113, 129, 39, -96, -106, -63, 92, 26, -84, 75, -61, -4, -246, -35, -54, 251, 197, 4, 120, 122, -39, 108, 43, -26, 99, -172, -131, 134, -117, -96, -17, 59, -21, 31, -233, 118, -329, 22, -128, -55, -168, 172, 92, 230, 17, -48, 254, 48, -31, 154, 138, -109, -159, -351, -162, 30, -83, 54, -74, 306, 21, -46]
6635d6j97K73rQ4P0k20%J59o0K4m3j54K24R8j22k4k5J21j13m7k26M47k03L2kM4
6661H5k31O6K76m2m40M44j89j33l0N9R6J82k37J66j42j81K98q3M20k21j58O4j30
6684f1O0J82j51K43l34K12j94P1M2p7J6P8J5q6j16K67j89J08j35j33O81m71j81
6707a53K09k46R9K59k57L56l53K21l7P2p8j84J66j10k22L46j45j62J68L4J35m0
6729G8P2k84J27n1J68j73O9m7j96P7J32R1j60m3L07O2j60j22J30j45J88j70K02
6752A52j48M7J02k62K54K8L8j45j%M1j59o4j37J77Q1m2qK12qm9j23j24J65J5m0
6778Bq0J16k8O2J21R3k54j39K41m8j12k1l7J54j34J39j82J70m1q0j18j26L45J46
6802A89l95L68l61K79l7K6j01p0pK72k00K83l00l2L6j05M59l39L5J3O8j67J40
$$ y = [-46, -243, 30, 21, 105, 175, -45, -45, 114, 54, 78, 35, -119, 105, 203, 81, 57, 32, 153, 40, -7, -233, 214, 11, 43, 41, 85, -146, -80, 196, 154, -286, 158, -31, -164, -194, -135, -39, 143, -94, 72, -70, -251, 47, -36, 384, 163, 5, 69, -61, -1, 181, 30, 273, -61, 151, -43, 28, 70, -7, 9, 87, 102, 16, -100, 167, -22, 86, -49, -182, 499, 28, -153, 56, -190, -91, 168, -89, 267, -86, 135, 98, 170, 92, -92, 74, -36, -258, 88, -57, -219, -51, -17, 118, 78, 150, -134, -7, -58, 110, -63, 6, -41, -237, -160, -28, 63, -97, -140, 167, 229, 69, -53, 77, -68, 120, -50, 152, 4, 51, 153, -109, 145, 173, 211, 66, 65, 65, 106, -53, -117, -254, -77, 4, -38, -46, 166, 158, 109, -14, -138, 27, 42, 2, -78, 38, 10, 72, 193, 286, 32, -107, 134, 86, -26, -47, -84, 70, -64, 75, -107, 63, 22, -58, -176, -302, 43, 189, -206, 162, -199, 80, 43, 69, -32, -102, -109, 163, -37, 246, -54, -86, -50, -155, 304, -35, 0, 13, 81, -86, 54]
6825E4rj6L19l95j60J04P5o2j2n3p2k10N48k40J34P1K06k88L5L64m60J87k5j46
6849e1J52k40K21j5r2M6J39j04M8o4j16O5m0o1R8O1N8J20n52K10J61Qk29J58j37
6874a56K71k71KL60j90O9j98J26k75J81k09M49k65M3m0P6J49j8k03J30o1K52m03
6897a81K35o4p6N5K00j47j1N9N2m7q0K6J06l49r4K56J28p8N2l7j26O0R2k2r9L7
6923e3l3R2P9o8P6j48L2Q0l36M99l98L05l98J36K48p4j40K13k41J77o2m4J89q4
6947D7J89k7l29J16K06j09q8O3o5n2J02j05j8P2R5k22L5mL5L52k40j14J5r3J28
6972a1O9k40J97l7O2l0J09JJ30k22j06k05J82k9L45j90m2M7j05L44j98j43m5J14
6996cK9k26K06J87k30R1o3P4O9l19J39JK12k79K59l17J98m6J26k52K11p8J11j49
$$ y = [54, 45, 29, 348, -47, -207, -103, -28, -90, -102, -155, -227, -437, 111, -129, 5, 76, 282, -6, 29, 393, -67, 120, 95, -51, 101, -139, 82, 67, -25, 21, 160, 56, 104, 40, -76, -11, -51, -112, -14, 47, 105, 225, -327, -117, 44, 52, -177, -19, -156, 115, -156, -154, 206, 16, 85, -113, 13, -262, -81, -290, 159, -106, -63, -103, -27, 122, 104, -99, 31, -30, 222, -181, 54, -10, -86, -31, 169, 22, 11, 70, 122, 75, -5, 21, 127, -222, -316, -60, 68, -10, 42, 5, -121, -61, 31, 9, -90, -53, -86, 6, 85, 17, 93, -55, -23, 57, -279, 220, -178, 127, -271, -135, 113, 39, -101, 112, -129, 48, -14, -58, 131, 47, 236, 209, -120, -4, 202, 93, 5, 68, 3, -49, 53, -52, -70, 2, 97, -125, -90, -94, -59, 293, 53, -61, -46, -139, -11, 58, -182, 15, -22, 40, 10, 119, 120, 250, 28, -78, -283, -101, -130, 215, 25, -17, 30, -75, 269, 71, -72, -117, -3, 26, -200, 6, 193, -37, 54, -9, 65, 134, -185, -46, -45, 167, -112, 147, -170, 28, -18, 108, -144, 67, -11, 100, -49]
7020d9j47N0J52J17j35j09O6K69k62K10q6j55J28n7p1k6J34J20j54p6N9J58q9
7043D7k46J29p2r3Q3L13P4m81J60J61o0L0j46j45L34j53J38N6l1j53K84k40k06
7066b17K61j79K19o4p9j79J64L5%K36l76J58J61qk30K51J8N6j28k31P9M16l56
7089Gj36J29k86L32k93K19M2m4J92j7m7j42j26J89J31k35L06l00k4Q4j55J64k55
7112b65J89K26Nr6K01l44J47j40J91k17L8%J24lk9q5r9j4L09m03K01L50k68M1
7136E9j11K62k30R8j12r6J46j28J43P6l01L89l50L62l77M00k66K57j81K0k10L68
7158B18m19J13N3j01L32p3j98lK38k02OP3J5J05K8l00J17ll6k46M32m63J71K90
7182A47k31L02l14L01j48l51K76m25M65K40l28J5K24k22Q2p0R1k2r1j7K71n1n
$$ y = [-49, -196, -146, 6, 123, -12, -121, -55, 214, -48, 162, 76, -79, 49, -8, -79, -105, 29, 149, -5, -81, -22, 136, 47, -199, -70, -142, -235, -152, 161, 235, -246, -86, 75, 15, 45, -101, -246, 88, -65, 73, 129, 98, -55, 229, -11, -217, 44, -135, 84, 20, -59, -238, -74, -39, -39, 197, -179, -21, 140, 132, -98, 153, 171, 227, 99, -132, -53, 363, 7, -129, 0, -286, 46, -247, -28, 14, -30, 162, 145, 98, -44, -170, 19, 150, -85, 221, -79, -103, -19, -174, -10, -265, -76, 150, 155, 59, 260, -84, 63, -77, 114, -103, -65, -65, 59, 56, 27, -58, -157, -171, 138, -265, -64, 286, 18, 59, -52, 210, -20, 78, -34, -130, 16, -112, 31, 107, -194, 195, -155, 207, -170, 230, -36, 221, 40, 60, -150, 218, -201, -88, -35, -136, 196, 123, -75, -78, 160, -42, -36, 37, 52, 157, 185, -115, 2, -1, -37, -283, 149, -314, -143, 147, -84, 218, -96, 205, 57, -294, -18, -443, 22, 262, -66, -51, 173, -49, 33, -37, 54, 32, -59, -76, 195, 144, 139]
7205A39%k09L24m46J4J73m9j30L72l61J87P9P6j20p6K1l3m0o6j14j2J66k2K00
7229G3j49L79l75p6J36%J13j03k47L98l27K17Q7j15J01k14K39o9k50J91j28j16
7251b35K99k1J85k97j7K58l02K67p5L9j46J71Q2j1k43j45J64K38j40l21L07R1
7273A48K4j59l7J75l53J22Q1Q9O3l35N9K24k53K51J18j55j03K59l78N3K26r2K67
7296B94m23L74k41P2J0mJ5j03Jp4o9L03j50L9j4r1n1p6L14j03O2n4q0P9l81J10
7322b41J78J77m1k78M9K10J32k04J44j52j3K09k84K05j63j99N19l04n3J32k00
7343a77k3L23j60j37O7K35k67K90k50L36n89L37M1K01k92J72j03m15M05j43p2
7364b21M90r6p4j5l21L64J60r4p0n5J4o9o7j01L48m7n6o8k69J45L4M08k21k54
$$ y = [139, 139, -70, 254, -192, -178, -5, -54, -184, 188, -173, 14, 93, 169, 49, -27, -6, -39, -79, -145, -259, -271, -105, -127, 73, -76, 303, -72, -148, -12, -12, 101, -2, -249, 149, -178, 39, 126, 11, 112, -102, 137, 68, -182, 9, -119, -235, 64, 43, 228, -69, -86, 172, -130, 137, 62, 101, -45, 126, 208, 197, -46, -191, -27, 211, 71, -250, 57, 148, 172, 13, -24, 151, -202, -80, 1, 90, 153, -182, -123, 101, -152, 99, 217, 62, -41, 218, -160, -107, 119, 27, 294, -129, 245, 4, 76, 86, 82, 97, -6, -5, -79, -148, 155, 5, 44, 30, -61, -112, -188, 126, 23, 85, 31, -49, 30, -351, -241, -63, 114, 73, -205, -156, 54, 186, -18, 126, -26, -39, 170, -114, 91, -72, -271, 248, -56, -109, 23, -177, -200, 123, -37, -174, -107, 128, -139, 151, -99, 237, -352, -15, 26, 227, -65, 107, 4, -411, -6, -149, -221, 269, 173, 99, 84, -237, 127, 287, 193, 123, 68, 82, 13, -54, -155, 193, 146, 90, 22, -247, -102, -68, 340, 119, -135]
7388a35KM55l55M4p6Q7K44l09J03m21M44n8k92J15J65q9J00r3o1M80n27k9L12
7411A06j92Q5L5J48l22L66j70R3j26Q1m3m2K32l40J72j52n8K44o9k70K88k35N8
7434a11J23o7O5k83K80N2J53j40P0j02j80Q1j01M13o49N21mk46K57j43M0L1l1
7457B9j46J9L63l8m12KJ15J6K8Q6j48P8j2R4k59L83j51l0j33J67J69k72J92k26
7481h6j0j15J95K82k18K5j0r8J13K79k53k59L52l75K65q0k7k02j09J75R6j94L99
7504A45j39N6r0J11r2Q6o4K28j36n0J05k42j04M58j44k5k09J01J10O5On24L69
7527B1q0J54n6j34J38j52j02M4L19m05K57k73K37M0R4P4l46L43l9k49J97j67r4
7550a79J44n0p0K98O0k24J04j6n9q2K21j56M8k77J96J21K6kj17K70j91J6kRq9
$$ y = [-135, -133, 322, -33, 11, -65, 22, 266, -43, 60, -361, 83, 25, -267, -152, 13, -76, 24, -69, -130, 350, -177, -206, 106, -86, -1, 34, 182, -140, 226, 56, 149, 23, 104, 61, 19, 251, -89, 83, -69, -127, 117, 48, -222, 66, -169, -111, 12, -55, 10, -273, 7, 59, 212, 72, 142, 40, -140, -59, -160, 253, -396, 125, 121, -125, 132, -11, 29, 60, 29, -117, -98, 265, 227, -185, -183, -68, -52, -24, 62, -86, -8, -20, 74, -185, 198, 47, 17, -116, 51, 220, -52, 140, -86, -96, -211, -16, 266, 48, 73, 63, -35, 78, 357, 104, -155, 197, -178, 87, 7, -20, -222, -331, -156, -60, -254, 145, 6, 62, -28, 83, -9, 77, 13, 241, 105, 55, 160, -82, -186, 272, 128, 103, -106, -5, 105, 170, 176, -348, 21, -59, 95, 39, -95, 43, -109, -211, -167, 152, -253, 4, -269, -32, 8, 102, 176, -170, 173, 134, -115, 82, -85, -179, -35, -85, -155, 143, 203, -21, 83, 67, 8, -74, 147, -9, 39, -238, -42, 79, 105, 103, -14, 256, 65, 81, 79, 88, -1]
7575aj96J72RQ6m9Q0Q5l11J53j05r4L81l03J77r6j96J31R4K21n31J92J55Oj78
7599a18P8j42jN9J57j90J31N7p4k3J06PK3M9k9j32l4Q0J15J37k36J55m2l25M1
7624a51L4K15rn6K27j89J01k46J41Q8j91J5M0j06j05P3QQQ0J21j20k10K17j21
7648a36R0nJ25k91J61k10N47j78j09K4J6Mj58L69k31j35N3M21l74K33j20kl5k48
7672a89K30k07O8K84l16R8J43j28J18l79L8K91K31k31m2J23J1l25L70K7m05K07
7694A7k8P8J16l21K81j34n2J51m30J55J43j08J21K81l71L17J86m35J58n1j58K54
7716A70J27j7j70QJ41k14MJ12j64j45K65M9p3j78J16K35j25l54L66j40N4O6k8
7739A05j88J63k40p9L99o9jj59K08k72L5Lk24N28j71j04K25k76k6L64l12j21K52
$$ y = [-1, -197, -25, -16, 70, 21, 101, 186, -125, 28, -77, -171, 210, -93, 84, -12, -208, -77, 17, 238, -293, -101, 54, 60, -118, -40, -182, -183, -124, 33, -157, -26, 31, -43, -66, 40, 47, 70, 119, 90, -42, -76, 4, 119, 256, 20, 175, 133, -192, -151, -117, 98, 89, 33, 260, 71, 172, -74, 67, 155, -36, -21, 19, -87, -192, -119, -111, -103, -23, 98, -22, -232, -15, -136, -46, -51, 74, -217, -56, -266, 281, 103, -6, 18, 34, 38, -120, 249, 18, -117, -64, 357, -17, 216, 96, 94, 59, -189, 41, -166, -98, 186, -130, -32, 111, -17, 101, -278, -240, 51, 282, 51, 9, 132, 143, -182, 188, 215, -190, 17, -11, 67, 183, -138, 143, 9, -43, 108, -322, -167, -24, -132, -11, 270, -101, 216, 402, -33, 125, 74, -84, 170, 297, 280, 110, 118, 259, 45, 49, 161, -3, -148, 117, 166, 93, -85, 31, 266, 141, -213, 153, 13, 67, 133, 105, -83, 80, -160, -239, 160, 91, 90, -69, 139, -133, -98, -95, -319, 209, 38, -66, 159, -117, -143, 221, -91, -212, 40]
7762D0n0K18n44M57j82K07j39N3P9M6j24j42Rn7J8K30j80r2J23K19J9j79J71l20
7786a20J96L4j8j12j67J02J27l51L60j87L61j11m7j41K8o1j89K07K16k4l87K23
7808f1P4J81n33J86rj26J22J01L79r9j04j61Jj58J17J7R5K46l82N5J08j1j75K71
7832A34o4j06J30k80L18K4k18N3or0L43k36P6j52k9J19j20n1J04o8N0J97o1P0
7856A37J08k36O7j64r4N49l59q0o5K46j81O7J64pl16L23K8j24K39l34o5J40k22
7879a79P5K1J14K08n54M20k17P3J37r3K5J64k39J13J68l54L2R9m1K32l44j2J35
7902a7J78k72Q4J23j00K86j87j7k27K8N3J41k24K85oM1j75k35M52k52k04M12j77
7925a0K48l91L41k62J34j23j58P2L7J97j74K57k30l8R8K80n20J91J32k08M24l57
$$ y = [40, -10, 208, -336, 121, -61, 146, 7, 60, 139, 185, 61, -81, -72, -129, -111, 119, -61, -153, -30, 189, 208, 29, 200, -120, 76, 110, 92, -20, -187, -85, 42, -309, 51, -136, 225, 114, 67, -74, -46, -107, -296, -89, 127, 103, -284, -61, 13, 194, -339, -153, -162, -288, -166, -65, 314, 215, 111, -50, -49, -207, -90, -73, 22, 268, -114, -59, 49, 38, -137, 134, 70, -36, 94, -186, 132, 156, -62, -9, -15, -105, 238, 2, 78, -74, -103, 16, -104, -155, -51, -119, -69, 128, 67, 137, 245, 9, 76, -88, -182, 367, 8, -72, -137, 109, -72, -5, 159, 152, -164, 159, 187, 63, 302, -32, -97, 43, -179, -104, -83, 31, 239, -315, 105, -112, -39, 98, 5, 30, 194, -45, 68, 236, -118, -86, 13, -28, 204, -140, -152, -17, 161, -111, -27, 96, -4, 282, 95, 78, -149, -121, -68, 73, -151, 134, 128, 169, -6, -241, 211, -41, -245, 167, -10, 238, -153, 188, -74, 60, -63, -221, -149, -112, 85, -89, 168, -62, -100, -2, 278, -242, -51, 81, -127, 297, -60]
7947f0J65j6N9k46j69N92j73j65J95j99J5j11o1L41l75N4J56J23j91J03r3L74
7969C18j78j84K42m0M4j31k42j67J47K28k3J1K19k35k4l11K37M6NK7J63n3j9K04
7993B84j82k0q4k69K94o2J63j60M1j20m7K63L1J21j17k56L4Q5q0m0K11j61OJ42
8017G7k63P4N0N6J38P2l28J87j02J47m7j50L78n11J64J00J80l65N1K05n47K65
8039a69J08LqP1k88K91j3r3Q2j33J85j60j3P2n8j05K92j96K59Ol19P6J43J20k16
8064f3J43k88L54j33k82N13k44J07j9J35m11J12n3J92k23j62L28k27M8l4N19n03
8086a91J35L09k47j07L9K18m52L19r2mj43L02k74K44k4J14k79J46Q8pJ5j90N9
8109b2k29L08n0k52J04K58j44r8K70j89j16O0J19J14m9k82J49k9J40k34L80k19
$$ y = [-60, 105, 89, 148, -98, -267, 325, 152, -13, 182, -17, -2, -113, -174, 167, -208, -154, 2, 125, -66, 37, -56, 318, 140, -44, 198, 158, 202, 71, -171, -338, -191, 37, 14, 25, 244, 9, -15, -326, -89, -43, -38, -11, 152, 99, 80, 284, 102, 82, -2, -271, 23, -39, 124, -36, 5, -115, -162, 101, 132, 253, 136, -120, -86, -1, -81, -121, 90, -71, -65, 77, -186, -112, -62, -6, 132, 204, -124, 63, -39, 108, 61, -89, 289, -222, -58, 42, 222, -143, -92, 113, -434, -169, -61, -58, -66, 5, -283, 8, -5, -98, -16, -149, 36, -124, -137, -65, -123, -228, 64, -132, 127, 133, -186, -110, 33, 153, -63, 80, -208, 146, 13, -269, 244, 0, 107, 88, 223, -188, -76, -129, 63, -160, -322, 6, -221, -173, -207, 312, -191, -56, 253, 6, -101, -62, 156, -296, 23, -69, -73, -216, 86, -188, 56, 32, 146, -133, 13, 101, 94, 109, -81, -22, -251, 57, 7, -245, -141, 117, -27, -125, 145, -44, -160, -100, 19, 133, 84, -198, -49, -78, 62, -172, 208, -11]
8131a1J30j19M2M7k04o8M48j37l48J77j4j0o1n9N24l19j15J36J35r8J61j07j8
8154A12L9R7k90J6K51J6Q1k01P8j27L9L2j01K51l56P6j45O5q2k2K25p6J87k15
8178e0J0m4j46K14Lj89J90r1j29K38K00j21K
$$ y = [-11, 119, 0, 42, 89, -115, -183, 265, 128, -220, -43, -57, -67, -128, -187, 337, 18, -97, 39, 174, 76, 237, 130, 112, 151, 248, -42, -26, 225, 241, 322, 121, 199, 72, 111, 143, 42, 293, -63, 13, -132, -67, -149, -171, 54, -22, 165, -50, -40, -84, -230, -16, -13, -202, -12, -103, -232, 6, 206, 85, 87]
8191H7
$$ Imaginary data points
##PAGE= N=2
##DATA TABLE= (X++(I..I)), XYDATA
0@%%%%%%%%%%Qj6J6k4L2m0N4o2P2q8J12j36J60j92K24k61L02l50M06m66N35o12
32c26O96p89Q91j007J134j271J424j591J771j968K187k423K680k965L275l612
48a894L982m388M833n323N866o470P143p899Q755r734J0864j2182J3748j5646
62h345J8002k1013K5022l0658L9207n3871Q5721k77250K69926M59334n60505j93900
74b48330K58729N7261j62996J57478M2757j83899J9591J91665j58158j46731K19063
85D6430J68342k19056j64330J27814J47576r6095j00193J21618J11557j82244
95c8581j70692J64773K30319p9196j70178j3006J899L0396J91340J4484k75793
106a14235n7057K40491L0323j56672M1091R7109j03326n3661J04965j8395p3538
$$ y = [0, 0, 0, 0, 0, 0, 0, 0, 0, 0, 0, 8, -8, 8, -16, 16, -24, 30, -32, 40, -48, 64, -72, 88, -104, 120, -141, 161, -189, 217, -249, 286, -326, 370, -419, 472, -535, 599, -672, 752, -839, 932, -1036, 1151, -1272, 1408, -1557, 1718, -1894, 2088, -2300, 2533, -2790, 3076, -3394, 3749, -4150, 4605, -5129, 5735, -6447, 7301, -8345, 9657, -11356, 13666, -16992, 22215, -31656, 54065, -223185, 46741, 506075, -54430, -248330, 10399, 67660, -95336, 62142, 104899, -79000, -59409, 132256, -25902, -172633, 46430, 214772, -4284, -168614, -40800, 106776, 10681, -89512, 32106, 143663, -38581, -209273, -44500, 185819, 106623, -63555, -76561, -74662, -44266, 147074, 161558, -114235, -171292, 69199, 99522, -57150, -16059, 81050, -22276, -75937, 29028, 10633, -62905]
117f2905J09103N2751j46658n1382Q9386L1671K3976M4170r6045j37876Q7080
128e6729J69729l8604j00816K2138j5231o0352P7491J01810n6494r9007N836M5556
140d673M313J4023L1380l9952n7786M2135N3507n1154m8012Q7801Q3978j20522
152d962j45520J04970J66062m6636j09944m018K870m716Q1969N3310j08486p7954
164i3055R8764M2575r2967K6874J10607o4257j24035N5760J09205m0464o5742
175c6735N1980K3202p7211r571O8480P696k1080J0199k6425n8129L2316J07580
187G2302k745j12390j8340P2331P081k3815K7433J0966m9275k4826M1695K4990
199B5407k1804M733P753m2222j0943M8466J3229k7885J200J4309k9983k6022N3123
$$ y = [-62905, 46198, 98949, -47709, -99091, -9705, 21966, 45942, 90112, -5933, -143809, -56729, 113000, 74396, -26420, -4282, -19513, -79865, -2374, 99436, 42942, -56065, -50229, -4673, -360, 13663, 45043, 5091, -52695, -10560, 42947, -8207, -56219, 31582, 115560, -4962, -150482, -45512, 120550, 73914, -36030, -40048, -37178, -41894, 40075, 93385, -15101, -93055, 5709, 48284, -44683, -17809, 92798, 28541, -95494, -39734, 69471, 29007, -36735, 15245, 38447, -38764, -48335, 20145, 27841, 6761, 16960, -9465, -67594, -35278, 72302, 69557, -42833, -61173, 11158, 18239, -5576, 21857, 32823, -16452, -41278, 417, 25407, 3603, 8336, 16089, -26133, -37076, 11390, 24619, -3266, -2066, 12243, -17740, -43762, 9361]
212I361M9290m6587m8036K1833J9922m222J2072J0116k5008k5884J9345K0976
224A3178j8136L091K7910k4419m1216J9421M2970M09k7794k378P672j7403M227
237a2468M0140J868l8987j3807J8008J5903j465m486j132j3524l910J8756L11
250E207j3180P324J0989p401k0452m75L0661J3344k3660j6170M413J0857N564
263G021R3M476p925k4377L734K9885Q016j9483j9157J920J7700P731r59j0732
277b057j8221J4131L3497j3605m2137P218N0984O220n5310j6527M4844J4803k1411
290B429m143m809j2394J4273K7256j0703l5674P676L4176j3064k1753K3202J3356
303A9828k7549j3694K7799K2779k6083k9445K1130K5854j1651j7291j407K609
$$ y = [9361, 58651, 12064, -35972, -14139, 5783, 1561, 13633, 23749, -1259, -27143, -7798, 13178, -4958, -1867, 26043, 1624, -39592, -20171, 22799, 23208, -4586, -6964, 708, -16695, -12468, 27672, 29540, -9447, -23254, -5246, 10657, 9192, 4706, 3574, -9950, -13860, 4896, 5207, -7973, -649, 10340, 2939, -17513, -17988, 12673, 26017, 2357, -13813, -9400, 1457, 7021, 7114, 11590, 3665, -20712, -16978, 12907, 20923, 1440, -17717, -15797, 1903, 9634, 8675, -2057, -20278, -6147, 27350, 13745, -28392, -21174, 29810, 36030, -19280, -35807, 9037, 23840, 2429, -1714, -6523, -18917, -4644, 22612, 11909, -23765, -16089, 18087, 5023, -16730, 6472, 19828, -7721, -21415, 6384, 29163, 3080, -26365, -5235, 20619, 8968, -8323, -9730, -7121]
315g121O957J5383r79m0219j1621O1747K5322o5522l3429N1290L6443k6254k7738
328a5741N591P921P535J5598j5591l1914J7265L1624j3580k5839N544K2236p08
341I941k3793k53K7444K737k8470q952L2879J6433l4010j7130K6269J1175o642
354G628k104j9121j1202L6837K7357m2533m5550L5684N3816k2397m4678N086K6136
367D959J2607p714k0928k582J9213R808j0113j4951q7J7225P378j5511j6600J3025
381d271K3689j7235k7968K5101K6733k9143k2625K3052K0696r116j3841m231K44
394h915J5558J8626k1914l2610K1921L4305j4009l0583l11K4285J2150j7529j8585
407a7611O425J8194O532j3563j1393O411Q201M650k390j2227K796J5344q002j4603
$$ y = [-7121, -164, 15219, 14240, -25979, -37600, 24147, 49469, -16053, -49482, 1808, 38251, 11997, -15741, -10150, -2229, 5306, 20904, 5313, -26601, -9336, 22288, 8708, -17131, -11587, 10649, 9941, -13852, -14105, 13339, 16076, -12394, -21346, 11533, 27966, -6044, -23174, 3095, 14270, 7628, 5524, -13597, -24799, 12038, 39395, -3138, -48688, -13004, 40812, 18415, -26263, -21177, 4959, 17566, 9852, -11076, -13658, 5555, 15363, 5250, -9701, -9788, 7437, 14815, -696, -17296, -4271, 19418, 2183, -25785, -684, 26049, -3094, -25719, -2667, 18029, 8913, -4928, -9159, -8915, 6643, 25269, 3355, -29255, -7334, 26971, 12962, -17621, -17932, 6353, 18503, 974, -17611, -11186, 7008, 13540, -23, -11416, -5005, 3196, 7846, 5456, -6771, -3975, 11369, 3367, -11236]
421a1236R907J4723q145j6971L157J4328j040o524j433k363O233O772j0412o979
435i983J2095J0163o499j5372q26J5786Q149p255j2678m910J2471Q526r610m582
449d525L792R91k157k921K454P089o95m921m450l69R324M606m998l621j943k43
465b587L611O63J057J981n600o764Q35P474P278m156q843j841J667N109Q040k169
481E755p446j374L77K064K766L346J883p739q953M367P015L325M19o674o938k24
497h031N368R049L31o693k523l527k45J0399O428m723p740m610K740M005M163
512D391N685p069j3096J119P832M213L162j510q354p374L048J3403M179o409k221
527I99m403o977P796J3856O98j2059p800K782J770K255J1795r7j8342o309R890
$$ y = [-11236, -1329, 13394, 5249, -11722, -8565, 5763, 4723, -1801, -3234, -5597, 636, 7408, -3004, -9983, 2112, 12275, 5776, -9596, -10422, 5364, 13513, 6258, -6420, -11330, 1141, 9667, 57, -4525, -733, 258, -1899, -4820, -2366, 4723, 4028, -893, -5343, -5712, 3612, 8218, 3220, -401, -2344, -2587, 1024, 1687, 2744, 4725, -875, -7639, -6804, 670, 7948, 3792, -5051, -6892, -5225, -116, 7924, 5755, -1691, -3065, -2688, -624, 2142, 5488, 7371, -368, -9321, -4954, 2061, 5386, 5805, -869, -7807, -8031, -2663, 6386, 6717, 24, -2499, -6026, -6271, 4128, 10556, 5833, -1907, -6517, -3777, 228, 4391, 10076, 3007, -10089, -8970, -1138, 3075, 6237, 4727, -3627, -11001, -7953, 5450, 9629, 3220, 999, -3404, -10381, -2585, 11271, 11969, -90, -7890, -5108, -3338, -1083, 10712, 10615, -7727, -14036, -4146]
542d146O979J685J738j323j2566o576J4671J1964o979l041n09j0670l429J6167
556C965J3263r772j7002J072N132j449R860Q893j2743j4260L600R826L699J239
570E323M951q486j7892N597K0914K187r029l885m244n828M699J6282K440j5503
584b474n607L578m274N333J8152n65k1491j0176J3018J2024n95J170l522j4813
598a0242r57J5155L225m027J983k808j3650l872J8915J3434j2129j2437K16q07
612h001M750J3552J632j2066q194L215L535J321J0997M167j9570j3582J2266J3844
626G866J136m319n796p604k639J1165J0868o841n676L305o782o757J1942J6527
640A6395m081j9093n674R383M848M661N920j0990j5598N829J1988k76k211N724
$$ y = [-4146, 2833, 4518, 6256, 4933, -7633, -14209, 462, 12426, 5447, 2406, 1897, -8773, -12202, 3965, 17228, 7456, -9546, -8474, -3342, -4791, 5069, 13962, 1219, -13041, -9441, 385, 4084, 5323, 10274, 1788, -16104, -10507, 10407, 12594, 3565, -320, -4564, -10392, -5693, 10589, 13029, -2474, -8081, -4503, -8777, -3444, 14708, 14143, -7348, -17524, -4506, 7518, 6923, 8093, 4571, -10242, -11199, 3956, 7181, 3154, 5137, 2329, -11321, -15193, 3722, 17156, 5027, -7410, -7194, -8001, -3251, 10301, 11933, -133, -8327, -5112, -1577, -256, 10741, 14908, -4662, -18244, -5978, 7866, 9002, 4683, -1113, -8717, -11356, -191, 10677, 3836, -1840, 1465, -5317, -12074, -132, 16395, 12314, -6779, -12453, -3070, 1778, 6439, 12359, 1369, -14229, -8400, 3588, 3312, 1101, 6825]
654F825l747j8562J859K4380K726j3759k130j34n655O021J3684j863j3709n93
668d657M999p291K192J7608p89j9874n938Q908Q100K760O99m696j2122J91J3853
683C943M590n653j188j349n320k382Q600J1142o008j3179q6M042K54O817M500
698H723q200j0507L792Q859j791J001P870q296j4845P722J4401j158n545j430
712E96m412m600P564J1039n999r173L466n75n157P355R032n029q899o71M046J728
728C11L144M293o272q777K682O408J819J76j439l853m694O32Q503L269n907k680
744b385m07k006L417O524O28o733l602M020J240j390N280J380r134k839M830L362
760B185m79K23k17n873k651P573M413m720q40P65l517j0N500L305l595n157J857
$$ y = [6825, 3078, -15484, -13625, 10755, 13481, -278, -2408, -2542, -8197, -2176, 11508, 9645, -4064, -4657, 342, -6949, -4757, 12851, 12062, -7812, -13750, -4842, 3258, 6018, 6717, 2021, -10101, -9910, 3943, 8533, 2880, 1692, 343, -4977, -7359, 1241, 12383, 6375, -6804, -6890, -2848, -2594, 4223, 8723, 523, -9984, -6192, 2667, 876, 1877, 9747, 1451, -13394, -5672, 8729, 7571, 2026, 596, -3816, -8416, -852, 10187, 4188, -4985, -1519, -2094, -7251, 104, 9136, 4107, -4792, -5463, -1417, 311, 3455, 7748, 1476, -7301, -4619, 1789, 3608, 3784, 2345, -1508, -6202, -5570, 2933, 6202, 295, -2385, -2792, -4798, -1381, 5143, 5771, -962, -4564, -544, 696, -694, 4586, 5966, -3168, -6007, -1177, 2185, 1706, 1929, 1712, -4161, -6812, 761, 5174, 454, -386, 379, -3138, -3148, 2352, 5657, 2062, -3095, -1238]
777a238J651k259M015L179n556m527K075L426M18p09R76j691n425L930N324k224
793A365j851J787j811k064K041M577m71n020m4J702j794J399L296k141l167n60
809b756K153J187n27Q15K73l359J36L925j79o43j70n14r15n32K237J674k947j475
827a617J246n25j50J573K2q95j401j02K475K4M01m05j369J56J823j40n30J69q32
846g7P02j268l44K082p45j318N27p58J93J316M5m19j069N36J330o66N64R36k152
865e85k32K492j036j005P48j37r75R0J096j87k262R80K321k001j58J278p44N13
883A96J323j319j292J089K296k76l440L15K189j20m26j196j215J696R96j467K72
900c79Q8m19L17L93L91J17m09N20q31J47J957j357k795K848J173k012p22O2Q50
$$ y = [-1238, 413, -1846, 2169, 5348, -208, -4735, -2660, 766, 1184, 475, 1451, -240, -5665, -1735, 3589, 1365, -486, 1301, -510, -2574, -533, 4044, 3573, -1447, -1491, 211, -1583, -184, 3112, 971, -2196, -2756, -603, 584, 57, 872, 1145, -2214, -2078, 1847, 1668, 1025, 855, 341, -574, -1106, 1131, 2805, -142, -1617, -371, -896, -1046, 527, 549, -346, -1747, -1849, 626, 650, 1051, 646, -723, -567, 1256, 1116, 586, 755, -77, 625, -643, -987, 1095, 350, -968, -441, -1199, -1006, 310, 355, -64, -1133, -597, 733, 67, 631, 1567, -585, -817, 1675, 639, -366, 382, 245, -730, -640, 456, 269, -1993, -1013, 1308, -693, -851, 427, -317, 196, 1519, 200, -1092, -3, 2293, 2017, -1423, -1108, 1081, 961, 535, -661, -1876, -180, 816, -651, -379, -291, -710, -393, 0, 391, 508, 99, 619, -212, -65, 1892, 535, -2260, 588, 1761, -251, -973, -911, -61]
919f1P05j67j285k325K520L692k173l549J732J509Q21N34k498o43J726J634j547
936F25k393J085K587j911j615J538n03qJ232j059p9N95o8p11L20J962Q08m075
954a670o19L778R15r40k736j087K714J703k180j401p1J889J370k425j613J014
970a359K750J757l127l071L060K151j396j04n79q30K34P34R60j443j24J498k861
987a750q70L847O89l287n35J889J078j142r83J093J461k00q39k498N37M634K06
1004C330l965k600R31L469J334k607k036P55J340L64q71J141Q54j610o98P25K42
1021I8J382Q95k629j078N01O76N23J64j74j76k332k99K248J983O95k556l178J708
1039a549K887J121k84k770j315J614J448l08l42J30K91k218j578K929J720o41
$$ y = [-61, 644, 477, -808, -3133, -613, 3079, 906, -2643, -911, 598, 1419, 1953, -545, -1188, 538, 2172, 625, -1768, -683, 1904, -7, -1622, -84, -587, -595, 637, -422, -501, 94, 26, -685, -365, 1597, 2405, -1670, -2289, 1489, 2404, 1464, -1272, -2359, 355, 2058, -122, -1523, -1594, 295, 1665, -760, -2373, -1359, 1391, 3148, 21, -3050, 10, 2161, 765, 661, 82, -748, -514, 220, 1180, -263, -387, 1111, -1750, -2620, 1227, 1916, -1371, -1906, -17, 1061, -81, -1064, 29, 1490, 1290, 451, -2047, -1510, 3124, 3330, -635, -3235, -2304, 1165, 2499, -108, -2144, -1389, -49, 315, -556, 585, 1439, -171, -869, -144, 98, 1480, 2375, -254, -1332, -831, -155, 368, 532, 358, 182, -2150, -2449, -201, 1782, 2477, -79, -3257, -1549, 1338, 2459, 2175, -595, -1910, -296, 1152, 844, 502, 632, 923, -1295, -2873, 56, 1776, 1135]
1055A135r10k482n35K452J981N26j762j795J30K54J745K485q60l362j271M98K563
1072G92J374j031j062j938q55J987K114j39k39j593j327j15K076L098m83l080
1088d21j254J17P12L494M99k875k786J76J660J524M39O38k730l125J942K655J400
1105B065J36j560k254r26J891L700J89k719j125j511k89L567K074j258l749j317
1121c086J492J806O28J955j813l887J86K610J414J267n86j942k752k39M345K529
1137C927k178j911j676j534K280L697L07l009l450J330J955J60K429N94l764k497
1153c340J767K749J260o01o44k542k179L005L702j363j493m68k618p88L420M357
1169D224j022n282j320J799J613K915O06l793k639J678J449J211l72L43n47l281
$$ y = [1135, 225, -2257, -2792, -340, 1641, 2167, 405, -1390, -1260, -1006, 739, 3224, 2364, -998, -2269, -1771, 792, 2166, 1135, 73, -1865, -2720, -733, 1381, 1242, 1003, -590, -1917, -2032, 44, 3142, 2659, -421, -1675, -1558, -846, 2648, 3147, 272, -2514, -2338, -678, 846, 1285, 1923, -807, -3932, -1990, 665, 2065, 2201, 641, -1613, -2539, -648, 3052, 3241, 522, -603, -2114, -2403, 1164, 3238, 1980, -1769, -3086, -1594, 212, 840, 2795, 982, -2905, -2719, -109, 1305, 2572, 1986, 44, -2708, -2947, 1398, 3927, 1749, -162, -1838, -3372, -1092, 2605, 2912, -97, -3547, -2217, -262, -102, 2327, 2921, -843, -3340, -1573, 1176, 2436, 1835, 1191, -1351, -3530, -525, 3177, 1814, 321, -147, -2765, -3553, -133, 4224, 3202, -2080, -3400, -1601, 12, 2927, 3533, -260, -2899, -1221, 228, 1439, 1067, 1410, 863, -2418]
1185b418q67L717J713j62k301k809R8K030L691O77l451j856Q70k41J367L187j33
1202C112l681l201J570L703J149p19k159l356J200L920K25k392Q33J146k331k730
1218c711K961M753q59l306k044o03K681M110j081l806j870J691J740q55L31K292
1234B424k545l007N55L044K487j211k513j193J20K016L075j882k321J253J62k136
1250a672k63L666K021l677m323J509L223J713L83l441k384J858L230n1j655m71
1266c34J761j676k375K481L048o17k905j929O63K119J542m39k165q78J170M0l47
1283h41J298J684j092k850r87L222K904j707k169j269L80L006J98j878p50N07
1299c44N72j243o11K436J415k140j947L44J441K089j45k425p96P20J654j42j163
$$ y = [-2418, -3285, 432, 2145, 1983, -318, -3127, -3029, -999, 2692, 3369, -82, -1938, -1068, -1309, 58, 3245, 3112, -569, -3770, -2200, 1503, 2652, 1933, -226, -3582, -2382, 1538, 1763, -629, 204, 1350, -981, -3711, -750, 4003, 3144, -162, -2206, -2809, -128, 3982, 2901, -905, -2775, -1084, 656, -199, 132, 2424, -121, -3128, -2573, 471, 2958, 1747, -766, -1959, -1839, 177, 3252, 1370, -951, 302, 464, -1672, -1935, 1731, 3752, 75, -4248, -2739, 484, 2197, 2580, -861, -3245, -1387, 1843, 1792, 137, -334, 1427, -249, -2624, -143, 2905, 2288, -617, -2546, -1883, 236, 1778, 1339, -826, -1704, -534, -494, -841, 457, 2141, 1049, -1801, -2788, 434, 3338, 1631, -538, -1807, -1427, 1579, 1777, -101, -851, -344, 228, -1015, -1626, 810, 2225, 85, -1862, -1518, -77, 2012, 1867, -558, -1354, -634, 1020, 878, -285]
1316b85R81L9k015j96J303J413n2k123q27P02J126J112n11j544M94R37p23J73
1334DM87O70m24j938j36J688N41k5q80j370K44J015P15n37m34q5P32r19L35J426
1354A109l62p21m99J27Q27P0j42k74p64L6Q97m97l9M25m00k64k57N80P07k96q46
1375e83P40o09P91N30l62n09J24n7L01n62M97K05p60n97Q45r3m32K79M01k39n47
1396f37L61J014j65o26K05O8j76J02r0L12m64k30P52p11k68P72j49n93K64L84
1416A25J95o44J90L59k67k85P98k8m97J57J62o4Qm81L59k27l36N84k26l78O45
1437A49k84P8o4J4O53k08o27M32J77l84O99l06n42J3K51K79n78j7K97j21n46N62
1459g3K44l51J73p7j86J5P77J24n85q13J227M23j530M06M14K33m22m94M62N0k25
$$ y = [-285, 696, 735, -1280, -1476, -173, 1240, 1188, -935, -1762, -1060, 66, 1178, 667, -877, -383, 554, -169, 4, 491, 1161, 737, -1201, -1337, 351, 892, 867, -13, -1383, -1139, -124, 591, 54, -380, -465, 267, -652, -317, 1109, 747, 26, -473, -346, 481, 551, 409, 135, -629, -593, 304, -193, -232, 193, -207, -471, -728, -148, 559, 263, -583, 157, -452, 339, 869, 507, -2, 122, 65, 366, -196, 301, 506, -254, -851, -6, -99, -531, -252, 149, -90, -637, -276, 738, 573, -53, 152, 220, 44, 146, 56, 368, -96, -326, 426, -285, -553, 219, 70, -523, -259, 125, 320, -324, -134, 225, -42, -327, 471, 443, -54, 103, 265, 201, 209, -272, 87, -140, -476, 108, -118, -496, 149, -135, -57, -121, -107, 546, 338, -289, 143, 320, -64, 635, 329, -213, -200, 51, 330, -248, -265, 32, -89, -635, -73, 171, -180, -7, -84, -270, -255, 522, 646, 61, -752, 475, 898, -632, -226, 188, 421, -1, -495, -33, 17, -208]
1480b08M62l88p91J205P07j284k26O29Q63p90j027J308O44j048m14M96j37J92
1498A93M82j007n12O15Q59k84j617O37J643o30j254M03P47N65n37n48N9j45Q63
1517E32M38j358n60J391J99j318o46J309J191j493o28P03L63M67J5j281K26J049
1535E99q7q90n41J603O52j415j144J167P84K50j370p37N49P87M43p45q05J271
1553C71O96j493n22J227Q88m06j401k83Q75P56o2n42j418N92J411p01j175J269
1571H2J022p88j657N59J807r8j010k18m16M07J580l67j390m8J121k09j521Q60
1589b84J263m41j544%Q27O32L00m61n28m69P12P40l96m25P57m20j038J14J360
1608F99L00q48j272J77N59L81Q72q04j040N39O98l14p5R14J45j338q15J094R32
$$ y = [-208, 254, -134, -925, 280, 987, -297, -523, 106, 969, 179, -848, 460, 1104, 56, -358, 138, 1, 193, 675, -332, -844, -229, 630, 346, -1271, -634, 1009, 379, -875, -472, 275, 840, 303, -245, -186, -331, 532, 970, -388, -948, 443, 642, -676, -1322, -13, 1178, -315, -943, -240, 123, 590, 605, -676, -450, 599, 512, -378, -919, 684, 1336, -79, -1223, -56, 728, 978, -392, -1129, -580, 207, 650, -95, -900, 371, 1067, -426, -948, 279, 1167, 761, -640, -923, -48, 708, 646, 104, -1314, -722, 689, -12, -1187, 82, 1104, 316, -1341, -782, 1025, 927, -83, -301, -717, -310, 1270, 903, -487, -535, 586, 377, -1144, -284, 979, 538, -1006, -1006, -179, 453, 753, 292, -236, -705, 7, 747, 351, -74, 683, 263, -775, -661, 699, 999, 151, -1121, -944, -385, -4, 868, 64, -976, -437, 261, -53, -128, 786, 931, -407, -1222, -128, 804]
1627H04k9j85j075o21O79J209J6q71j37J02o50n0J632M15j156m71O6J9J067J42
1647I06L1j323n83Q76J14K10M98l99q74n65R94J004j96q07Q2p50L1J296Q07o02
1667G50j339L3J14L67K81J196j159j344O11O13k45P38J88j428p09L36J468L30
1685H01o43m5m50p44J017J004N1p47n06p7P0L37J003m97j281p6K19L42Q61Q7n31
1706A95j187n4J029R44n53j23m48p04K07Q93P54m49q17r1M7J77J049Q5j334o45
1726a025L10L20O31O21j00j023o27O61N84L74J35p11r04k37Q80O99K79p16r04
1745g53q2K79R90M34p57m73l48N1N94P87K77n25j223p6R93L93N90l58j526k10
1765i43O83N06L64m40k29n35l01Q51Q47k75n82m14l81Q51M63L49j59j010k46O84
$$ y = [804, 775, 590, -485, -1106, -427, 782, 798, -73, -210, -108, -758, -808, 824, 1239, 83, -388, -322, -303, 764, 906, 937, -386, -969, -93, 21, 231, 729, 330, -544, -1109, -115, 889, 693, -114, -32, -782, -751, 545, 1352, 750, -589, -556, -442, -75, 206, 1402, 243, -1101, -490, 123, -122, 616, 804, -624, -1333, -997, 471, 801, 158, 113, -337, -1081, -64, 940, 991, 244, -262, -339, -269, 68, 1071, 574, -707, -783, -564, -222, 639, 726, 195, -992, -1046, -17, 927, 374, 251, -197, -901, -694, 199, 953, 504, -313, -404, -357, -180, 869, 954, -380, -1025, -715, -395, 236, 857, 757, -266, -893, -232, 352, 726, 861, 150, -754, -991, -111, 588, 867, 151, -753, -835, -556, 434, 868, 111, -362, -710, -659, -65, 722, 999, 474, -749, -825, 168, 561, 1151, 793, -733, -943, -260, 246, 610, 170, -59, -594, -895, -44, 803, 528, -54, -468, -849, 2, 465, 814, 655, -355, -601, 83]
1785H3q2R9M44l87n75n49N87J167l50l88o95k72M23J182q3n40k32L08p0J06J5
1806A91M75l48n35m59L22Q40J62m46o72M9J90L95N23p39J45l31k50N05O19M3m29
1827B50o40j38J17Q74L14r41l91L56j57J60K63n1J82n81k71N02L60M91l64q42
1847e07m17Q71M20N5m32j84n8J67j92O52n3l33K9p34M18O79J32l78p04K41M29
1868A01N9k44L16n9l98L51k78O04j56k65j15k44J4O59J3o24l7K0N1J09L32k7j45
1891C7k95L30J51k21J16j67k34J53j86O26k76k00K68k03l70N19K30k62j41l86
1911e11M51K66K6J51l58k77J58K40J41l64Q6K14j43l34O63j98m20K98j36Rj6J57
1933A03J38R2m76O1M21n26L72J09j50J0m41K60P4k88L18j35k93J89K93m81J61
$$ y = [83, 1, 100, 544, 157, -418, -967, -380, 787, 437, 49, -646, -918, -495, 687, 604, 64, -168, 140, 70, 176, 191, 666, 318, -217, -676, -354, 486, 648, 202, -470, -421, -231, 164, 687, -52, 93, -238, -488, 17, 636, 679, 250, -390, -528, -411, 463, 777, -164, -555, -199, -356, -196, 67, 16, 198, -383, -654, -152, 208, 699, 335, -507, -924, -53, 367, 422, -10, -194, -252, -85, -277, 375, 322, -11, 18, -716, -298, 381, 513, 135, -569, -328, 101, 160, -84, 232, 173, -225, 126, -152, 452, 296, 31, -84, -328, -314, 345, 358, -266, -303, -283, -232, -123, 209, 182, 37, -258, 72, 223, 2, 118, -49, -283, -130, -316, 310, 34, -166, 102, -101, -471, 48, 278, 16, -125, -511, -60, 206, 232, 383, 25, -252, -94, 146, 287, -77, 9, 223, 80, -254, 409, 211, -209, 89, -47, -38, -54, 103, 241, 333, -143, -82, 339, -187, 185, 294, 144, 154, -287, -27, 47, -241, 77, -58, -351, -162, 131, -350, -189]
1954a89K03j94L7O9K20j12K9n6j0J05K51j67k91K36k32O7J11m1k71J26j96N07
1976B02Q6m00J62J51L2L4l11J95j07Q2qJ52j73P7mm01QL0p9L21l02p2K79J36N
2001I5J07l95L53j91Q1J42k87l8K77k6q8k9k29L8L8L0l8J70R7k9k02%K77j96J25
2026H2j4q8J04l95K57J42k43J10O0j2j69J84k40J8K28l8k6N9n7K06j38Q4j5j71
2050g2J24N4K97j71j01l54L42j77j92L57j57k03L2J50j22J21K10j35J34j29J96
2071B04ok92K08L4j23j25Q2K47k97j17L75l76Q9J82J98k45l65L48K17k67J35l8
2093F8K03l86K98J26m21L96j89K99n76J16P3oj60J64R7n27L84R3N2j62l27L32
2115e3k7J1L12j4j74m6j98K97j67K56O2m25j83J07N72l82J03J62p05J77N94r7
$$ y = [-189, 14, -180, -143, -74, 146, 34, 63, 7, -3, 102, 353, 186, -105, 131, -101, -34, 77, 36, -235, -109, -305, 202, 288, -112, 50, 201, 233, 267, -44, 151, 44, 126, 118, 270, 97, 174, 170, -231, -223, -193, -272, 49, -253, -325, -46, 90, 95, 202, -193, 160, -31, 50, 192, -95, -133, 144, 118, 30, 1, -228, -190, -152, -122, -160, 10, 107, 78, -124, -124, 153, -43, 82, 68, -20, 84, -311, -54, 88, -155, -45, 15, 3, -166, 18, -222, -204, 24, -14, -40, 19, -38, 168, 30, 114, 99, -72, 52, 106, 403, 232, 131, -223, 119, -58, -250, 107, -50, -253, -221, -71, -193, -72, 138, 3, 137, 8, 204, 198, -94, 114, 148, 25, -100, -18, 229, -68, -185, 190, -186, -97, 85, 283, 38, -327, 21, 238, -29, 106, 68, 271, -115, 183, 309, -112, 284, 95, 394, -182, -66, 7, 1, -159, 5, 102, -425, -41, 52, 104, -58, -385, -53, -80, -69, 243, 229, 55, 9, -189, 108, -59, 197, 259, -166, -349, -242, 330, -52, 51, 213, -492, -315, 279, 182]
2137A82N4j75k20mr3L57J51n00q5J31L59j57K00M2n32k33K52L20P6j0Rn16M29
2160C7j5L5L40n59K23l25K86n5O63l49m70p2J85N2J96K76l51p45K32Q37l66K50
2182C05k71J15l66N2M30L30n54q6k82J17O4L08k7n34l5J04K38J07K89J42n71l90
2204e15L36K20J83J44l08k79n8L13K60j11k43J34m15LO31O6j24l29j40o5K59K5
2226a3N00k84p74L91J70K00n1M3l32l10L16P13n18QPm40j35L56N51k96n8m17M10
2249C7m11M81L63j11p01K10n4L49O5K9k50n15K19N20J1P1l28k79j11M51K73K18
2271E37l29m54L69j99k1K23L70n18k56o5J78L51K11j95o54R8m5M21j5K45l58n27
2293f33M79L26L53O1m90j91q6J33O18k34k66j22l12K34K6N31j44m47n42N54K47
$$ y = [182, 236, 61, -159, -163, -256, 101, 252, -248, -333, -202, 157, 0, 200, 242, -290, -523, -271, 49, 125, 115, 124, -392, 37, 22, 57, 397, -162, 61, -264, 22, -33, 630, 281, -189, -261, -76, -24, 172, 448, 97, -648, -416, 421, 55, 305, 34, 149, -217, -165, 265, 595, 41, -45, -327, -210, -146, 162, 135, -399, -434, -330, -92, 15, 304, 446, -125, -515, -179, 41, 224, 368, 60, -219, -277, 36, 296, 185, -58, 76, -339, -336, 295, 361, 237, -92, -232, -297, -38, -13, 487, 203, -571, -180, -10, 190, 139, 182, -150, -460, -144, 569, 51, 59, 66, -374, -509, -153, 398, 102, 44, -373, 37, -374, 107, 470, 359, -342, -132, -186, 163, 228, 257, 7, -508, -289, 231, 242, 313, -15, -294, -405, 46, 319, 537, 208, -246, 123, -76, -97, 126, 496, -22, -278, -343, -165, 186, 397, 202, -452, -354, -399, 22, 7, 252, -106, -633, -154, 172, 525, 586, 96, -95, -181, -48, 570, 336, 70, -52, -364, -130, -104, 427, 283, -164, -706, -152, 95]
2314I5L04j17k36p1l35K33M12K35m42J8m06K26J84N40n90J5l68O2L74j2N6n1o34
2337e08N01j39L64L92m95r1k71n1M28K92m04j38j68K11r3N58k00j28k88L0%K12
2359A4J50J8j72k90K74K35M3j24j3j07j92M05j0l6o8j61k66J9L71K54n5l86k88
2382c85K60J45K70N7l52j67Q9J31K45j90j08q8j83j02O15j31j96L66l10k83L27
2403A0R8J36j07R2l79K3L35r5j53J74l88R3K29j85K53L1l19K62rj81P33k80l19
2426E4k53l1M21J68l58Q5n2j32J05J52k4qp6k97L3J16M45m34l15K49O21k23j93
2449E3j58J94j45J76j02J92o9K30l26k80K65q5J58p6k43J3K26OK31l67J24Ok03
2472a80n0P5K73p8j40J85J60p5R9j40k91K30L66l54L2O0m5j31m2J94l71J77J4
$$ y = [95, 399, 282, 46, -25, -360, -127, 285, 520, 78, 96, -310, -84, 100, 640, 50, 65, -303, -241, 133, 121, 177, 126, -508, -7, -146, 218, 610, 115, 24, -247, -298, 130, 422, 18, -120, -288, -77, -170, 388, 188, 60, -228, -198, -198, 14, 164, 182, 10, -280, -6, 229, 272, 148, 135, 28, -164, 241, 231, 195, 127, -34, -300, -281, 90, 344, 289, -97, -385, -125, 20, 290, 347, -5, -172, -83, 48, 293, 103, -5, -93, -276, -378, 237, 106, -90, 276, -34, -317, 10, 108, 244, 137, 229, -150, -127, 208, 113, -40, 134, -254, -161, 68, -117, 136, 167, -152, 110, 101, -80, 653, 373, 54, -199, -230, 191, 359, 1, 86, 34, -98, 7, 159, 135, 127, 51, -246, -213, -97, 348, -86, -401, -152, 469, 246, 53, -105, 89, -56, 120, 18, 210, 141, 371, 45, -235, 30, -55, 103, 27, -216, -203, 23, 29, 260, -107, 17, 23, -180, -230, -155, 118, 40, -100, 85, 245, 170, 269, 129, -162, 68, 434, 80, 112, 172, 127, -4, -46, 148, -223, -46, -32]
2495c2L7R3Q6l4k22J12Q2Pn7m7J7QJ53m16J92K19k80L1J8j61mK39J69j66J4r2
2521c4Q2j4M2j37J9J18j81O1O0l74K30K69L5k22LJ17K2k16J88J00K4k24K9O0J65
2546B22m23J09J95O6n4P4k98k06J69K54j11o2n6K17k56J89K71o1l16J94r5J77
2568A99j6l82R4j1J66P4Q9r6k63n3J58p0J18m0P7J15o3J29j26Kj33R5r3J29M3
2593A42k90P0L96k77j31O9ok31O76l69p9M3J64k00J68j87p7Q9m1J66J05p7q2J33
2617A74n40M57j52p1R8l45L56M3K9j1k66K35Q0j29M78l02q5Q4J3j65Q6J55j99
2640B3J3j66L11j60Q0J1J5l3k28J34rP3J1j34J80k10k38N76JPl12j66K05J23K17
2665C24k58j90Mp4J05L92j01m39M13k72l5L28j90J32k30Q8j25J91pM9m6j18r1
$$ y = [-32, 5, 98, 184, 150, -72, 40, 122, 129, 72, 25, 42, 50, 203, -213, -21, 198, -82, -51, -33, -194, -198, 41, 210, 44, 58, -34, 48, 34, 76, -61, -42, 76, -105, -44, 16, -358, -128, 141, 176, -46, -43, 74, 96, -120, 68, 168, 192, -32, -3, 57, 222, -201, -92, 103, 169, 115, 189, -109, -315, -146, 108, -3, -65, -121, 96, -160, 29, 300, 239, -77, 117, 22, 199, 183, -199, -105, -116, 50, 124, 213, 117, -146, -199, -41, -111, 7, -33, 44, 159, 96, 225, 99, 101, -32, 63, -30, 99, 142, -148, -78, 318, 41, -90, -21, -27, -258, 418, 49, -30, 13, 177, -23, 145, -42, -119, -30, -71, 95, 200, 123, 41, 174, -366, 91, -61, -132, -34, -379, -23, 20, 49, 38, -228, 7, 87, -42, 436, 134, 49, 133, 146, -19, 67, 222, 23, 36, -130, 181, 21, 101, 112, 127, 94, -134, 0, -9, 64, 75, -59, 121, -89, -327, 249, 250, 257, -55, -221, -16, 107, 324, 66, -124, -120, -194, -89, 303, 202, -237, 176, -96, -131, 197, 7, 139, -91, -3, -128, 63, 56, 105, 59, -59, -150]
2688a50R5M11m29J43j63K2k7L39J32k60Lm2k92L31j17O7J62o08M75l28K28K53
2710B45P2m00k71L77Qj12J22n2k04J28p0K65R3l8J8l40K6L17J71L0l16k71r0R8
2734a94L30Qj06m72K33M7O5M39j45l70n3j57M03K39j06q1k62J63J69j79j26L42
2756A87r8l10j32M66K62k42k07j83k46P43K6k01K11l20j98R5J18N09j07k41l69
2777b37j04K86J69K31kp99K44J89L0L48k46j67k99J65L39J21pj46o49M46L3J83
2799A28J40k39k24k51J90K74K48k8l51j13L4l1M52J79l18m66K16l8O48j56j95
2820I9j84k39L79q6M13j88k84k2j39J75M88l29ml05L4L12Q0J86j10j43l08n9R7
2843a37L90J4m45O2m73N78L23k67K24l53j32K35j04M77k41j75j82j61K27N62l9
$$ y = [-150, -55, 356, -73, 70, -93, -71, -98, 241, 373, 113, 116, 74, -218, 113, -4, 63, 225, -383, 92, -236, -8, 245, 317, -83, -354, 23, 31, -81, 41, -11, -215, -87, -157, 108, 201, 163, 181, -159, -133, 184, 355, 385, 69, -202, -292, -194, 136, 144, 38, -434, -201, -154, -89, 350, 205, -165, -218, -375, 28, 267, 161, 80, -182, -19, 150, -29, -155, 187, 89, -221, -353, 113, 375, 133, -74, -257, -503, 240, 266, 65, 276, -44, -242, -147, -29, 480, 373, 132, -237, -341, -55, 114, 345, 343, -456, -212, -23, 7, 355, 109, -58, -357, -192, 147, 268, 261, 115, -534, -88, -55, 128, 268, 29, -195, -446, -256, 18, 266, 238, -113, -226, -192, -223, 229, 408, 90, -376, -160, -198, 450, 294, 99, -85, -324, 55, -31, 382, 194, -90, -112, -251, -76, 412, 83, 79, -226, -192, 120, 200, 386, 276, 133, -175, -234, -137, 253, 267, -178, -116, -589, -11, 312, 45, 269, -84, -216, 19, -85, 392, 151, -24, -206, -367, -140, 422, 383]
2864C83l61j40o6RM23l34L4L9l99K96K41j28M10l84m05Q1K14K61Q1r6j82q4m1
2887a48J34K96j50j12k12L4p5M13j67r8j57J86J72q0M42k54l06k75J22J21K90
2908A76l53j48JJ28N52k97l6j1l82K59J8K32QM1k14k79J86K03J11j51r5K47m71
2931b75L87k63P1Mj96J77o5N01l65P3j28j53L29J56j44L43m37j8j41j27R0N03
2953C22o00M40k04N1K64k32P4k99K5M1J99K13k0k29j32J55P6k1K86m88k88K71
2975i6J63o0K70l03P2J90l69M37l3l72M81m84P8K61j77l35K39O8j4P0k58M74M7
2998C49n07k6L51J6q4k3j79rPM11k28j11Q2j18J33p4n5K06Qj87J78j33J09K1k7
3023A10j93r6k2O5LM07k9k21m19K30R2k6K11k14J05L8L6J05j25j84J38R0m63K18
$$ y = [383, 22, -118, -184, -175, 248, -86, -52, -13, -412, -116, 125, -3, 407, 23, -382, -301, -87, 174, 255, 159, -23, -107, -148, -14, 282, 132, 20, -192, -158, -233, 180, 13, -85, -242, -56, 116, 36, 478, 224, -82, -357, -235, -114, 176, -177, -325, -324, -196, 356, 59, 23, 12, -370, -111, -93, 139, 147, 188, -26, -305, -119, 84, 195, 44, -51, 196, -275, 112, -151, -80, -76, -272, -95, -160, 341, -24, 49, -79, -232, 97, 253, 109, 452, 15, -3, -144, -271, -181, 322, -278, 162, -42, 9, 273, 41, 115, -184, -159, -118, 81, 294, 274, 45, -87, 68, 144, 123, 409, -79, -367, -96, 67, 7, 277, -26, 46, 236, -133, 304, 271, -101, 380, -104, -26, 235, 58, -277, -38, 30, 16, 86, -172, 302, 349, -158, -184, 167, 183, 99, 76, -103, -112, -105, 306, 78, -33, 49, -69, 64, -10, -65, 141, 149, -38, 140, 7, 116, 137, 110, -83, -179, -201, -136, -133, 274, 245, 24, -395, -165, -73, -99, 112, -102, 3, 41, 77, 182, 57, -127, 11, 101, -362, -144]
3047a44K09j6l2Q1o9K45j73Q2q9n9J67q2k49J51L1j61J09K4j8J56m82N16k73j44
3071b20J40M7J10k92K74o9J15k34J36J63n00M86j25j79J30j98l8L33J80k11j85
3092a37q0J99J34j42L55j26l22K51j39j59J4M01j40L4q7k06L75k89L34l34k08
3113b72M22m12Q5J08L2m6K38o0l9l4o9J32K29l76j2R1J57Q7m49J00L4J50r0k48
3137b42K02p1J5M0J84q8q1Q3j30K00r0QJ6L1j1J34k58K1o3n9J72k9o2J88L2k6
3163A16j43k88J07K16jJ23O6m01L61k78K5J93k52k9Q7J78NJ72k48K3k8l16L65
3186E3p2J65L5j4j30J79l47K05k3j08j2k22RM41k13p6j24J60R2J24j84k8L21l96
3210a65K80j23r7K96l45L2J65M1J60j3k68J16k91K07K69N6j61Mo17J4O59N0k56
$$ y = [-144, 65, 49, 17, 98, 29, 274, 101, 183, 94, 35, 202, 120, -129, 22, 53, -108, 1, 25, 7, 163, -319, 197, -76, -220, -80, -33, 77, -215, 59, -10, 105, -129, 7, 170, -330, 156, 31, -148, -18, -216, -254, 79, 259, 48, -137, -217, -18, 116, -26, 329, 203, -119, 132, -7, -166, -152, 249, 109, 143, 56, -150, 225, -64, 270, -64, -272, 150, -262, -177, -69, -37, -83, 155, 95, 56, 22, -47, 85, 314, -62, -74, 17, 174, 261, -188, -88, -54, 96, 6, -242, -40, -111, -96, -56, 128, 40, -41, 42, -88, 112, 22, 30, 46, 77, 66, 200, -58, -37, -100, -159, 13, -16, -78, 110, 142, 116, -27, -315, -208, 8, 7, 130, 196, -205, 156, -122, -97, 96, -156, -185, -98, 80, 85, 257, 9, 32, 4, -312, 53, -19, 146, 181, 167, 37, 216, -131, 74, 51, -57, -69, -291, -282, 159, -54, -130, -254, -94, -2, 122, -62, -90, 231, -165, 115, -8, -105, 191, -154, -122, 43, 84, 244, 231, -37, 79, -212, -5, 264, 320, 159, 163, -454, -440, 219, 269, 13]
3233A3J31k83J20m4N7N4J41j69Q8n19L50J65j55n4p9k71L22m7J01K40l81m9O4
3256b05K3K22j54J04J25l99K44j2J63Jk52K68k15L3L5N4K6l59m3L45O7Q0j56Q9
3280H4k25o0M60j10o1j82n9P1Q1J93k33M7j41R5N2j46K02j69J46j95K58R1J2J04
3304C15l40m46K08R3K39J56j54j57j54j0M58j3j54j85r0J88N0J65j50J12j12k28
3326b09J9K56K7j53k3j87k6K92O0J76j64l06J29K25j0R8k59j38L30l8P5K13l27
3349F0J15l99K65K97k39J40P0o16o7O54j72J59O1o10J23p3L77J11r6j63j26o4
3371a93j30L62j1l2Q7n09J58J76L09l3n3n08L94%J01M7m72J02J17K04K85j79j84
3394C8L9k13R4J56L57k64o06k9K50k4L08O1j96l26K07J91J37j53k83K12l41J64
$$ y = [13, 144, -139, -19, -63, -6, 48, 189, 20, 108, -411, -61, 104, -51, -105, -184, -455, -133, -180, -79, 161, -220, -269, -205, -182, 40, -114, -10, 115, -284, -40, -52, 111, 112, -140, 128, -87, -54, -19, 35, 61, -298, -341, 4, 71, 151, -5, 84, -141, -201, 259, 149, 88, -94, -153, -82, -1, 192, -41, 6, -135, -40, 12, -134, 68, -101, 45, -150, 108, 199, 211, 315, -25, -471, -263, -170, 69, 225, 71, -86, -240, -250, 208, 195, 41, -144, -234, -46, 4, 169, 19, 131, 19, -209, -190, 66, 93, -60, -83, -270, -296, -4, 56, 232, 68, -238, -109, 116, 106, 204, -55, -193, 137, 99, 174, 387, 60, 175, -224, 41, 338, 99, 239, 309, -307, -374, 280, 108, 267, 328, -282, -159, -232, 145, 256, 160, -3, -129, -193, -323, 39, 28, -4, 83, -426, -268, -92, 217, 184, 131, -377, 17, 17, 118, 165, -307, -205, -88, 116, 401, 222, 38, 77, -136, -42, 114, 471, 207, -399, -428, -178, -202, 106, 167, -29, -355, -148, 43, 180, 27, -256, -44, -385, -221]
3416b21J63M05m78J24N6k11M90k90l4J43k62k5K00K08Q9k92n3j50K6J26L38l0
3438C22l2o2j78L4Q8k20n0Kj27Q0k7J57r7L6k9p0K83j5k32N5J70j70j99L64N1
3463A34o1J3l09K71k36J55J30J66k87rK54k52J16k30K35n5k68K95J74m53J55j45
3485b07J27J69N8k48o2J36L1Q8k58nK93r4j63j56K85J68l23J68k95L59K10m14
3507a33M71l71J29k9J0j35K0L12l11j1j35K68n3j43R5m4K5j02K00L5J5j28j98
3530b13M4L61l83J32k1p2J89j82M0L7Q6k41L28j30J38n0k6Oj69J84J27l31L15
3553A69j60k08J57P9j05j60L54p0o4j06K10M3j21r6J01k0K30l64R6j13J66J07
3575A25j22j53K92l03J60m2L0J90qq3j6p7J53l46K97l24j8J74j26K31K4J64m4
$$ y = [-221, -58, 347, -131, -7, 49, -162, 328, 38, 4, 147, -115, -140, 60, 268, 357, 65, 12, -138, -112, 14, 352, 322, 290, 228, 50, 84, 172, -48, -98, -96, -223, -143, -170, -13, -110, -74, -103, -173, 110, 95, -137, -82, 88, -82, -281, 83, 134, 73, 86, -223, 48, -188, -33, 97, 263, -24, -33, 221, -31, 85, -145, 90, 35, -233, 62, 236, -217, -62, -207, -80, 89, 147, -101, -163, -27, 4, 92, -166, -171, 122, 28, -135, -291, -6, 162, -161, 7, -288, 71, 281, -133, 338, -33, 96, 67, 77, -58, -38, 274, -37, -48, -183, 85, 32, -111, -16, -60, -35, -137, 63, 98, 113, -15, -213, -169, 192, -191, -59, -80, -152, 37, -145, -105, -68, 18, -223, 105, -25, 113, 63, 37, 43, -126, 58, 185, -146, 169, 9, -199, -42, 37, -68, -228, 126, 56, -8, -114, 96, 139, 18, -78, 23, 3, 233, -131, -35, -148, 18, 125, 3, -150, 142, -161, -1, -43, -13, 177, 169, 86, 70, -7, 146, -200, 97, -227, -245, -71, -197, 34, 58, 222, 178]
3598A78l77J05K98m09L03j39P4m6K92k02J11k81oJ91j73O8k57N5J44J36j15j32
3620a82L24k85m1K19j64L31l26M4K3Q3j25J94R9k34L11l93L15k5j87j9J63P1k05
3643iJ48N9j98J88j87J0J4R7o2j66J17J13l0k24P6K33k04J03J22n3j27P7j22l8
3667f3l48K83J99J1j59N7k4k76M15K30l83p8k5k0L10j57M8K83J38K3o46lK0K28
3691F3J42k10J59L0q4K5k56K18k09O4K73j87M4j52l2mNO8L87n96K76j39J18l08
3715c05K67K61k10q4q6O5M0J06j05m7K32k55J95Q6j82j67R5J48k2L4k76K98j35
3738d7j94J71K2J6q9m5J04j37L2M82l14p4K1J94r8N5k02k4L52k84L4j71J93J51
3762A48m20J44k53M03j99M49l64r4K86j62M9kJ54p5Q6m19J67mJ22k50K79j02P6
$$ y = [178, -199, -94, 204, -205, 98, -41, 33, -13, 279, 77, 188, -93, -99, 92, -81, -13, -270, -215, -71, 65, -50, -182, 142, -143, -184, 35, -129, 202, -124, -80, -57, 26, -99, 95, 194, -40, 271, -122, 193, 168, -19, -38, 125, 196, -9, 139, 198, 0, 188, 1, 11, 25, 122, 60, -106, 11, 124, 94, -130, -54, 179, -25, 78, 200, 147, 20, 97, -25, -63, -411, -128, 71, 82, -77, -20, -44, -320, 95, 325, -58, -136, -161, -181, 129, -28, 20, 303, 441, 464, -182, -185, -165, 63, 205, -5, 154, 184, 100, 125, -131, 87, -122, -58, 215, 28, 72, -80, -112, -116, -111, -43, 344, -252, 24, -115, 3, -305, -38, 223, 13, -71, -157, -92, -52, 54, -51, -98, 134, -121, 74, 160, -22, -189, -94, 54, 32, 66, -210, 88, -47, -241, -70, -48, -32, -121, -166, -62, -199, -167, 315, 1, -73, -52, 142, 44, 99, -103, -127, 225, -59, -25, -196, -3, 148, -272, -128, -381, 22, -177, 272, -92, -186, 100, -62, -13, -15, 139, 64, 150, -269, -102, -106, 16, -234, 45, -57, 19]
3785A9l45M42j18J48j83j25J41k56L11l0L3qj50J68q3J86Ll90L24M7r9J61j34
3808F2J72m27J18j18L69l39j6K47Nj53q1K73j51j59J85q1J61J6K4J82l56q5K88
3831A36l77n8M12o2Nj37J69q9l2l0l5k08J90J49R5j43j04K28j48K50l78J9N0P1
3855b7R9J58j73J20k30j14o9L25K53l57o2L05j98J45j03P7k58R3j20l98L77K6
3877a31j43K53j72M9k8J03R7l26L29m7J3J17J08l8j11m4l99L94j80k5M8P5q9J50
3901Cl3J34P5l09kJ13K5k81L36L9q0j03j93K14K24j7k50K23j81JL02k36L12j43
3925A73k83N0K84q6PK7l23L83j33l6Q9j17k7J22o2j6j5m6j97n8N3K24J21m39O1
3950b44K38QP6p2P5j52J08k2K5m7j34J23p0J02j24J78R2o2j93O5J67j94j4m9R1
$$ y = [19, -326, 116, -2, 146, -37, -162, -21, -277, 34, 4, 37, 29, -121, 47, -36, 150, 153, -237, 87, 134, 35, 196, 62, 234, -193, -75, -193, 176, -163, -179, 68, 73, -80, -161, 112, -39, -198, -13, -94, 67, 83, 107, 289, -67, -152, 136, -241, -299, 113, 51, 56, -81, 88, -1, -33, -63, -98, -306, -116, 33, 128, -15, -119, 109, -39, 211, -167, -148, -98, -27, 72, 230, 57, 177, -53, -167, -236, 89, 342, -15, -77, 228, 30, 175, 72, 149, -109, -16, -136, -534, -157, -131, -274, -21, -193, -144, -172, -69, 28, -298, 31, -16, -3, 114, 222, 184, 73, 29, -370, 24, -156, -181, -133, -58, -147, 3, -30, 104, 179, -130, -132, -19, 6, -275, 61, 100, 20, -83, -276, -62, 162, 145, -105, 118, -63, -62, 240, 4, 316, 173, -110, -60, 224, 138, 145, 172, -151, 232, 99, 63, 152, 35, 8, 130, 68, 52, 37, -9, -206, -264, -211, 13, 134, -305, -244, -6, 2, 78, 6, 81, -71, 37, 15, 40, -7, -141, -18, -88, 14, -110, 68, 160, 98, -95, -30, 137, -57, -71, -120, -29]
3975b9q7K26L4k70N3K59j63O4j96K31r1k00J73j15K80n3J53m89J68j2K02k30K31
3998A39k48K21k05l7j8K51J9n75M60j4M6l1J8N7l31K32L2J81j9j78J16m8k70J44
4022e8q9J0J65Qo7k20J09J80j57j81M03j09k66J48L21k85J26N7K01k25j37L0j93
4045b29K44p5M8j5J02r5q1j0K54K6k80Q6q1J12q5K81l76L53k50k54J85K95j69
4068a4l2r9L1J07K20k35J39Q3m46P7K37q3q3R9j43J28J93k80K12J62k36j3j34
4091a10J41Q6l46K71j98l7J74p1K94l50%K75j33J04l42L90M1j53M5j60k5K64j03
4114E7n7K02j01j42K08l26qK85l09K18m2J8o3P9M2j70J59J63p8j71m6O6K01k70
4138h5J36J58j73M5j57K56k26o1M5K2O2J8j07k6j07L20j86j6J26J03l93J46j02
$$ y = [-29, -116, 110, 144, -126, -73, 186, 23, 87, -109, 122, 31, -169, 4, -111, 169, 116, 269, -220, -52, -64, 138, -92, 139, -109, 112, -93, -130, -148, 103, 122, -453, 7, -7, 39, 8, 26, 83, -248, -16, 16, 197, 178, 0, 116, 68, -202, -58, -147, -137, 28, 36, -31, -251, -142, 38, -119, -300, 103, -6, -272, -124, 197, -88, 38, 95, 296, 71, -66, -36, -229, 15, -60, -12, -27, 75, -20, -101, -111, 143, 169, -111, -25, -106, 6, -79, 202, -174, 179, -71, -325, -140, 155, -14, -46, -145, -114, -7, 213, -22, 117, 200, -246, -169, 68, -15, -98, 1, -142, -14, 179, -101, 111, 273, 37, 24, -110, 31, 117, -229, 42, -156, -193, -19, -90, 204, -146, -146, 129, -4, 100, -242, 148, 189, 36, 81, -79, -104, 160, 57, 0, 202, 101, -41, 167, -159, -167, 118, -191, 27, -15, 3, -60, 19, 61, -109, 50, 213, 135, -36, -82, -16, 185, -85, 51, 209, 36, 81, -76, 180, -46, -107, -62, -40, 22, 40, -67, -93, -200, 120, -66, -82, 44, 147, -246, -100, -202]
4161b02Q2P4J9J09M2j60k24K28o8R2q7J34l05K15l5J07l4l97O45j03l83K31K8
4184Hj33K40j28P4L1J9k46L10k43k45J48L58l05K32l65J71K68k80K36m2l11L76
4206A73k62q4K21j27P6n8k25M04L3j63P2j69M04o0k90kK04k2k25R9K7l67N13l44
4230a72k4L3L10k74o4nJ46K08j94J50O6j58K06j38j43K26r9k37L58j72JN0p8n5
4254e9O7j3J64q0j9J65k17k12L18m4o8nR3l21K27mL0J02k88J90J12k55J79j03
4278d1q9J00J53m39N12m45M43k09L33l69J56Q2k93J06M4J07q0L02n04J59J12l15
4300a75J94N1P2k34J17l8J29K4k31j0m4M92l19J46k94J05Q6J07k55J3L07k47O0
4323E6J96m6o60N24j79j02J87J55k31k9J48Q4J28j19j77J78l11L62k94J54j13
$$ y = [-202, -120, -46, -27, 82, 124, -36, -260, -32, -100, -8, -95, 39, -266, -51, -86, 21, -13, -410, 235, 132, -251, -20, 8, -125, 115, -13, 61, 92, 111, -135, 175, -68, -313, -165, 193, -112, 120, -245, -74, 194, -86, 150, 108, -203, 173, -89, -173, 48, -79, -3, -61, -286, 118, 151, -12, 60, -109, 295, 235, -55, -57, 147, 125, -100, -1, 26, -341, 172, -172, -196, -163, 147, -127, -191, -196, -50, 158, -36, 114, 180, 22, 228, 90, -53, 173, 74, -163, 195, 23, 24, 74, -4, -59, 8, -5, 159, 79, 60, 225, 8, -204, 114, 70, 2, -3, 90, -231, -4, -8, 22, 124, -164, 26, 138, -117, 62, -41, -130, -30, 123, -316, 196, -249, 194, -15, 318, -51, 105, 187, -106, 0, 44, 151, 71, 373, -131, 28, 140, -175, 19, 70, 142, -92, 25, -13, 116, 140, -91, -101, -145, 347, 28, 174, -120, -15, 71, 178, -77, -64, 243, -4, 56, 252, 206, -454, 70, -109, -211, -24, 131, -100, -129, 19, 103, 231, 112, -65, 113, -198, 164, -130, 24, -89]
4344h9J92Jj26r6K13j40j36j2K92j01L6J06k11J84j93j7J62J2K9j25mJ6L7J51
4368A81l16K31j55O6j7J47r8K29k97p4oJ94j6P2l37L46m69M29j57K34j41K5r4
4391b3m3l1L5M9p8K53k04K27j54j69K24j10K8J37l15J62J46k04N0J00j09P7O4
4414A12k36%j1K16J00k13M7NK8M2r3J74k19n5K92p3j50L01j72k85L59k19J64q4
4438C0o2R3q3J77j92K0j01J96k60J53J68k59L43n59J05O1j25K23J26r9k63L16
4460Hj79J05J81k56K42J22k82N2q1m7K18J9m2j36J17m6K36j50r9j39k8R6J94j20
4484a5kK02k18p3J40j62K47J38k71J36j60q3J25j73J14N9N4k76L62k88L00k4Q5
4507B17j49j13r3j25P2j04M01Rj1q2o5J06j60K32J10KJ5l80P1n1q2J93K10r2J26
$$ y = [-89, 103, 104, -22, -118, 95, -45, -181, -193, 99, -2, 34, 140, -71, 113, -80, -97, 65, 77, 106, -19, -23, -7, 30, 181, -135, 96, -59, 7, -10, 137, 39, 268, -29, -103, -109, 85, 69, 141, -196, 150, -319, 110, -47, 187, 46, 71, -23, -66, -97, -62, -13, -91, 162, -42, 185, 31, -138, 86, -24, 4, 141, -174, -12, 134, -70, -20, 80, -29, 48, 112, -124, -124, -135, 81, 181, -32, 15, 20, 48, 90, -3, 171, -48, -103, 189, 116, -34, 267, 95, -190, 169, -50, 114, 30, -32, 61, -22, 155, -37, -17, -118, 78, -182, -29, 139, -120, 223, -336, -231, -170, -295, -72, 54, -45, -308, 8, -171, -66, 115, -141, 101, 223, -59, -7, -88, -135, 83, 102, 60, -76, 41, -5, 231, 81, -18, -157, -185, -89, 105, -15, -17, 185, -33, -106, 34, -128, 119, 257, -14, 122, -38, -121, 4, -169, -55, 4, 58, -218, 144, -144, 156, 132, 217, 68, -45, -138, -263, -191, -295, 106, 115, 104, 22, -43, 63, -97, 135, 245, 247, 262, -118, -47, -98, -180, 13, 223, 131, 257]
4532B57q7j4j04p4J38o6j7Q4o5n1o0J24k26K53r4J26J21j16k09M37l52k06K85
4555H4j47L50k38J12j80j44L50O0J6k36L15o20k6r6M93l51K75K8nP9Q6r8q8j17
4579i8K30k9J40k36j58J97%J63k76q3J30J01j17k9K12k33RJ94m09L84m19M61Q1
4602B15o0j45k06K20l1M07p27K79j51K63j97J65j66M0J55p9J29l41K80j09K43
4623A84oj18J8Plj56QK02q8P3K01k18K1j45J62j11j2Q6k6l21R0J13J30J49l98
4648a58M5K10l5m9j68P8l4p5p6j0K14j35L78j10k9K98n26J82J3K7l40L33j6K7
4672D4M9l19K61j78J04J30k75K87L9j69PQ8K33j67j45J48K1O8j24j7k63K95o9
4695D8k4N2o8J47l24L23k18K0j02K92k01l5J32k28J74K4n4M1J36k23K52j87N4
$$ y = [257, 170, 156, 52, -22, 116, 50, 33, 117, 52, 1, -59, 65, -161, 92, -2, 124, 245, 129, -80, 357, 5, -201, 84, -63, 287, 49, 161, -19, -163, 187, 247, 263, 27, 342, -278, -304, -400, 93, -258, 17, 45, 40, 119, 205, 107, 19, -98, 132, 103, 243, 7, -151, 46, 46, 209, -67, -150, -20, 81, -36, -65, 147, -86, -77, 117, -292, 92, -327, 134, 215, 155, 10, -196, 24, -7, 400, -327, -48, -199, 64, -133, 32, -134, -94, 61, -18, 111, -230, 50, -59, 184, 178, 60, 78, 85, 82, -74, -66, 136, 48, 121, 322, 104, 125, -20, 142, 31, 19, 105, 79, -242, -152, -39, 91, 240, -158, -113, 97, 62, 13, -155, -77, -111, -186, -262, -272, -58, -193, 185, 75, 46, 344, -182, 0, 13, 40, -300, 33, 17, 44, 93, -226, 35, -143, -39, 91, -184, 103, 142, -27, -20, 68, 301, 134, -11, 137, 158, 226, 102, 85, -178, 117, 48, 24, 76, 8, 155, -169, 154, -64, -44, -146, 146, -55, -90, 42, -186, -12, 12, -42, -1, 135, -88, 164, -23, 31]
4718C1J91p7l64J77L07l11J25j88l6M09l64Q0K5j60M05n29L92k08J42k71K38p4
4740f0j21J97J48j58n5m9K15m2j77O7j06K68k8j66J78J66N8l95J39N6l10K04k63
4763b34J49q2M8M7K07k77n8J16K79j88j1Q1j59K62j16l3m1N4ml3J60l6k5k37o0
4788a91L17j09j77m5L30j74k02K94K17j07j04j62K04q3N1j25L4O9J10j55n5lJ8
4811d8j04J89j12L59qq7j79J30L0q2J41k59M36l65j4j12R2j78J05m4J61L4j63
4834g8J19Rk75K12j62j1K33k08J34J00J25j07J15j3O0mm19qK6J35j47K6J96L91
4858D49m75j88L5L36j71l29M01l45K90l34K57J27q3J86l29J84M7n0o6J74k32R3
4880b3J27j08r7L22R4k83J76j66J01l1J16l01J98l1l65L43j35K53R2k49nK0k96
$$ y = [31, 222, 145, -219, -42, 265, -46, 79, -109, -145, 264, -100, -20, 5, -155, 250, -279, 113, -95, 47, -224, 14, -60, -181, 16, 164, 6, -49, -98, 117, 75, -102, -35, -141, 127, 99, -67, 111, 277, 335, -60, 79, 135, -175, 29, -234, -85, -167, -119, -72, 135, -142, -200, -84, 195, 7, -4, 77, -82, 180, 64, 31, -10, 44, 40, 7, 167, 131, 106, -131, -191, 126, 17, -160, -205, 125, -49, -251, 43, 260, 153, 49, -113, 91, 8, 59, -66, -32, 37, 147, -8, -63, -66, -48, -152, 37, -75, 284, 276, 189, 10, 140, 170, 88, 229, -30, 406, 41, 27, -85, 7, -171, -66, -110, 51, 85, -78, 41, 50, -225, -13, -175, -186, 47, -161, -27, 73, 198, 91, 206, 193, 253, 249, -170, -178, -152, -17, -164, -138, 58, 449, -26, -214, -179, 157, -14, -343, 58, -287, 3, -331, -74, 53, -30, 156, -173, 11, 58, 8, -58, 116, -116, -23, 104, -4, -101, 221, 315, 32, 208, 42, 143, 112, 228, -73, 125, 94, -271, 72, -63, 190, 282, 33, 28, 48, -248]
4903b48J33L7K18k21K4O6p7k6j5Q6l6kK20j73J00p9p5j2J86k38K12p3k80K99j26
4928a00P2m2K68j70j3Qm1J64j36j23NK83j79J32k29n1J04K35q7k44J62j5N8j82
4952a21L71k59q5m8M33l20J30m97N17j94l6Q9p5J38j79J66J00M5j50j12J98l28
4974b17K48J54p6j34l3M5n4M6j54K39j00q8L21j92j27J64j58L43n3Nk69o1J30
4997b1J35j48L3Q9j38j16R1j63K31m8Q4Q5k59L42q9k8l36J42J60k4J53k81P2J33
5021I9k64M00J80k76k35K66k73K65j14n4P2J17m36K97m5L6J62o0pK43n69M7M18
5044B69l57O8K14L8m5k2k20j03J60j09K02R6j20J15k73K42J20k87J19n7j89K33
5066I4j71l9K75L1o3j21J73k3k23K04j46j98K78j51J98O9m45R3Lj61L09K62k29
$$ y = [-248, -115, -78, 140, -81, -57, 9, -68, -94, -109, -23, -59, -61, 159, -14, 86, 7, -68, -80, 106, -132, 80, 7, -273, 26, -100, -28, -70, 198, 28, 15, 23, -18, 146, 10, -113, -108, 175, -4, 128, -101, -152, -48, 187, 100, -144, 18, 3, 61, -121, 250, -9, -94, -142, 291, -29, 101, -396, 121, -73, -109, -20, -95, 43, -136, 30, 130, 175, 25, -87, 111, -217, 31, 185, 109, -25, -58, -13, -67, -21, -175, 64, -36, -124, 197, 5, -122, 42, -116, 227, 174, 179, -90, -151, -21, 114, -34, -1, 88, -50, -166, -75, -238, -7, -55, 29, 114, -145, 197, 108, 80, -256, -114, 46, 22, 175, -106, -34, 99, -165, 235, 415, 139, -96, 170, -103, 162, 48, -6, 66, 183, -253, 44, -1, 35, 197, 137, 130, 373, -196, -149, 269, -88, -20, 194, 232, 187, 165, -55, -158, 2, -107, 95, 191, 71, 186, -87, 155, 275, -12, 107, 50, -139, 94, -77, -116, 159, 190, 127, 6, 179, 156, -67, 137, -9, -207, 71, -80, 118, 187, -258, -165, -162, -323, -14, 248, 19]
5089A9j99J74J02j23K61n10J97j65K82j23kN61n24J10k41L94K0O7j90J24k00K7
5111F1N7j55q0L50j88K96n66L01l01J62l7M8P5M9p3M5j40j20K78n8k38L86j83
5134c1K0j2k3k23M55l21J38j08J65N5N8r4l05K01o3K02j69k45K02J05k1P2k80
5157b22M11j48l64K05j03LK14m2M2Jj00j36K00j56p8K63l2p7J25m6O7jM9m9l5
5182iJ13M1j61N8P1l90M93j85P9r4j26L54k93J00O2j68L9K92k57OJ3j24OJ73m06
5207c13L01J16j13o3J20q4j9O9K32k14k43M35j64J1n2j77J32NJ08o8j48L11j99
5230a7J11l05k09M43OO0j50K91l90O4L11m32J32M13k58k47K24q8J9J48n5m52M39
5253E8r6K40l21p3K52j2q9K1q3J15J48j7l56K15J06p7m6LK35m77J3J68K1J13o4
$$ y = [19, -180, -6, 96, -27, 234, -276, -79, -244, 38, -85, -87, 474, -50, 60, -181, 213, 233, 300, 110, 234, 34, 61, 118, -37, -117, 233, 45, 341, -225, 76, -225, -63, -100, -52, 23, 72, -1, 44, -96, -216, 62, 4, -234, 152, -31, -11, -23, -46, -269, 186, -135, 3, -105, 60, 115, 173, 79, -226, -25, -88, 114, -55, -300, -98, 7, -14, 58, -222, 189, 41, -323, -118, -221, -218, -4, -46, -4, -3, -103, -239, -39, -195, -273, -10, -42, -119, 6, -40, 27, 26, 75, 26, -9, 104, 145, -16, 42, 113, -277, 216, 31, 110, 16, -110, 244, -49, 51, 113, -55, -16, 276, 19, 25, 38, -86, -80, 93, -313, -12, 104, -9, -72, 48, -36, -55, 14, 246, 32, -211, 224, 60, 71, 19, -158, -26, -21, 87, 19, -129, 182, -17, 94, -211, -420, 23, 29, 89, -61, 230, -160, -96, 215, -217, -85, 328, 70, -177, 47, -41, -22, 126, 71, -381, 58, -38, 202, -119, -192, 60, 48, -41, -20, -103, 12, 160, 143, -213, 2, 108, 31, -15, -12, 223, -254, -241, -73, -52, 61, -3]
5278cR6k84L50j05m3q3Q9r8P4J63q6L4k10jK63k04j60L34j35j04l2K56j39p1j49
5303b48L28L1j20J51j07k50Q0j35K16J22j19o6K90m9m4K0j63K10o0j29P4kM9j76
5327i7L4j21R0L9J64J61l08j07j4J41j55K68r5M3J7pj14P4Q6j32L85k06l60K49
5351C5j03K14k1m9J80J7o5k02K40l25N1j39K23j48J53j19K11j08J92m16j0M05
5373B16l30P6%q7L12k78Q3qON8j32K20j39k5J97p7j09j98M37m6k06n1j79p7L96
5398E9J01j9l9R3k77J15j6j39J98j53j15K32Pk66J25P1N8k9j28m7M80j97k10N9
5422c7j67l6L51j00k79J60J31j02J35p2pL00j93J9j82K62j40l4J2O8P7K71l08
5445A29l64L14K62m26k43m1L86J11o0M3r1j25J49j03L2J93k63J54M2j21n5J07
$$ y = [-3, 93, -191, 159, 54, 11, -72, 17, -81, -7, 156, 70, 104, -106, -107, 156, -48, -208, 126, -9, -113, -145, 111, -28, -99, -248, 80, 111, -9, 142, 35, -215, -135, -270, -54, 68, -51, -117, 173, 124, 80, 100, -63, 147, 87, -42, 32, 30, 79, -97, -63, -184, -94, -55, 109, 270, -38, -145, -159, -18, -173, 95, 0, 43, 60, 53, -61, 13, 99, -33, 352, 146, -214, 35, -68, 146, 125, 76, 256, 273, 208, 6, 246, -79, -28, -167, 56, -92, 61, -58, 153, 45, 237, -179, -189, 216, -114, -38, -38, -125, 187, -91, -8, -16, -10, 48, -84, 136, -3, -28, 169, 92, -17, -215, 222, 176, -30, -81, -260, -337, 59, 160, 141, 102, 195, -82, 33, 17, -122, 76, -77, -192, 40, 47, -219, -94, -23, 35, 6, -122, -169, 311, 114, -96, -37, -204, -240, 111, 11, -268, -108, 23, -79, 56, -16, -23, 277, 84, 103, -79, 183, 43, 9, 21, 89, 166, 437, 129, -235, 79, 341, -85, -328, -369, 17, 128, 68, 111, 20, -105, 44, -59, -27, 166, -97, 57, 99, -22, -77, 30]
5467C0k6j37J00k63J04J58j04O5j9J2j88R3J88k0K2Oq0j20Q5J48O1O5k47J74L8
5492A45m5k23K08P3m8k08J7J71j32K0J83j65k06L55o2L72m54r7J64k39K39j13
5514d5J09j72J69N4l02M04j89k19J04M3J59n6J32j26m1j2m6P7j8M7k95N5Q1N6
5538c1L36l70o0K75k74J21J14l13K8O5Q4J02k49R4J12j02j89K09OQ9M9oO3P2O0
5563B85l93K1l6K3J98J57j39o0k02J61k57J79j4j9lK11M6m70L05J6k44L19k66
5586a82L76k73n2L25m06M4J59R3n6R9j57l8j56L48j69J96j41j50J55Q6j30L6l6
5609b9m25M35j75L85j35nK4r1m3J95j59m4L51k70Pj87L16j85P7q8J52j25k58K94
5633A7m4j70L15j74lj35J73j09J05O1J6J7J45k90J98k91l5J11J31j73J56R1pj98
$$ y = [30, 4, -133, -33, -296, -192, -34, -138, -73, -92, -80, -268, -175, 13, -7, 15, 21, -59, -179, -94, 54, 115, 180, -67, 107, 145, 100, -123, 85, 158, 110, -98, -81, 90, -42, -22, 161, -4, -210, 145, 83, 455, 1, -96, 68, -171, 68, -45, 64, -108, 61, 115, -187, 217, 28, -191, -87, -44, 115, 59, 191, 65, 24, 12, -34, 43, 25, 72, -223, -168, -87, -31, 305, -65, -125, 150, -124, -3, 111, -202, -174, -109, -25, 77, -172, -78, 34, -68, -257, -48, -42, 47, 96, 90, 153, 225, 285, -108, -87, -123, -100, 98, 255, 116, 56, -146, 15, -242, -63, -77, -96, -99, 112, 158, -312, -7, 9, -235, 84, -182, 194, -79, -131, 194, -212, -168, -9, 84, 28, 127, -30, -68, -224, 124, -45, 151, 10, -140, 15, 101, -29, 7, -29, -454, -19, -194, 191, 56, 51, 75, -16, -59, 136, -23, -67, 284, 14, 21, -166, 150, -35, 42, -46, 106, -19, -277, 17, -27, -197, 118, -56, -59, -194, -21, -130, -25, 36, 52, 69, 214, -76, 122, -169, -204, -93, 38, -135, 21, 112, 105, -93]
5657i3J64j67R1k13R2O0J48M3k92L39m0l0jj40OJ08j10J51k43l7M28J02n50K1
5681a63K30l54K53PL8n3k69L26J01n3j58J17j17N5J56l15K93k68J99L9k25L13
5703A52j68m7J05r1J87r9n6L57j56k67J53k66L12k72K04Q8k22r4J47j29Q8m4K76
5726A58k58J15L9q5q2M14k41m6p0K85j37j49P3K88l41J36L5k18K24l07K24j88
5748a31K84k7l19K86Mn9q5r2Q6n4K58k76M4l16M56n9j75L3k0Q8L32k02n7Q1l70
5773b90K94J66j86j50L97p6k5j08j04J2p2L65o1N5m52M20o9J54l05k48L13jkq5
5797e8l5M7Q0K26p5j97L84l71J54l29K54k87L29L2j78L1r4L62j89k05n8K73J39
5820B35j50J76l16J02K36m69K05j24J74j16p1K95l37L0l5L94n15J98K80k27M03
$$ y = [-93, 71, -96, -5, -218, -126, -66, 82, 125, -167, 172, 132, 102, 101, -39, -33, 75, -35, 116, -127, -164, 264, 366, -184, -163, 67, -287, -34, -27, 11, -42, -311, 15, 116, 63, -95, 22, -95, -40, 116, -199, 94, -174, 25, 64, -161, 152, -16, -63, 42, -49, 138, 39, -17, 340, 184, -83, 70, -196, 116, -156, 48, 136, -86, -180, -33, -162, -74, -118, 158, -100, 15, 54, -31, -113, 301, 60, 14, -56, 229, 92, -57, 16, 304, -37, 99, 134, -84, 140, -167, 57, -131, 153, 126, -193, 93, 97, 38, -47, -139, -53, -107, 151, -125, -81, -397, 59, 0, -175, -142, -162, -74, 258, 56, -1, 80, -290, 4, 170, -16, -166, 231, 155, 130, 22, -82, -70, -142, 223, 162, 217, -235, 185, 116, 270, -35, -283, 30, 29, 27, -58, -93, -46, 34, 260, 185, -12, 372, 1, 155, -174, 80, -207, 122, 154, -24, 7, -87, 275, 86, -119, -177, 96, 235, 85, 261, -55, 47, 283, -186, 19, -105, 69, -47, -118, 177, -160, -130, -165, 229, -286, -88, 192, -35, 368]
$$ [...]
8191C2
##END NTUPLES=NMR FID
##END=
