##TITLE=1H_Pr A-2
 200.13MHz, CDCl3,
 8 sc
 
 21.1.2025
##JCAMPDX= 6.0         $$ Bruker NMR JCAMP-DX V2.0
##DATA TYPE= NMR FID
##DATA CLASS= NTUPLES
##ORIGIN= UXNMR, Bruker Analytische Messtechnik GmbH
##OWNER= pz
$$ XWIN-NMR		Version 3.5
$$ Tue Jan 21 13:57:59 2025 Russian Standard Time (UT+4h)  she@DPX200
##.OBSERVE FREQUENCY= 200.1313
##.OBSERVE NUCLEUS= ^1H
##.DELAY= (6, 6)
##.ACQUISITION MODE= SIMULTANEOUS
##.ACQUISITION SCHEME= undefined
##.AVERAGES= 8
##.DIGITISER RES= 18
##SPECTROMETER/DATA SYSTEM= spect
##.PULSE SEQUENCE= zg30
##.SOLVENT NAME= D2O
##.SHIFT REFERENCE= (INTERNAL, D2O, 0, 14.3821)
##AUDIT TRAIL= $$ (NUMBER, WHEN, WHO, WHERE, WHAT)
$$ ##TITLE= Audit trail, XWIN-NMR		Version 3.5
$$ ##JCAMPDX= 5.01
$$ ##ORIGIN= Bruker BioSpin GmbH
$$ ##OWNER= she
$$ F:/spectra/data/she/nmr/H-C/1/audita.txt
$$ ##AUDIT TRAIL=  $$ (NUMBER, WHEN, WHO, WHERE, WHAT)
(   1,<2025-01-21 13:56:57.78 +0400>,<she>,<DPX200>,
      <created by zg, POWCHK disabled, PULCHK disabled
       configuration hash MD5:
       00 E9 B6 7A A2 85 ED C7 34 08 36 98 17 FE 4E 26
       data hash MD5: 16K
       59 77 CD 68 1E D9 7A 9F C6 3A 4B DA 24 B0 14 89>)
$$ ##END=
$$ 
$$ hash MD5
$$ 83 85 55 83 1E C9 29 16 D6 69 86 1C CC FB E1 87
##$RELAX= 
##$RELAX= 
##$RELAX= 
##$RELAX= 
##$RELAX= 
##$RELAX= 
$$ Bruker specific parameters
$$ --------------------------
##$DU= <F:/spectra>
##$EXPNO= 1
##$NAME= <H-C>
##$PROCNO= 1
##$TYPE= <nmr>
##$USER= <she>
##$AMP= (0..31)
100 100 100 100 100 100 100 100 100 100 100 100 100 100 100 100 100 100 
100 100 100 100 100 100 100 100 100 100 100 100 100 100 
##$AQSEQ= 0
##$AQ_mod= 1
##$AUNM= <au_zg>
##$AUTOPOS= <>
##$BF1= 200.13
##$BF2= 200.13
##$BF3= 200.13
##$BF4= 200.13
##$BF5= 200.13
##$BF6= 200.13
##$BF7= 200.13
##$BF8= 200.13
##$BYTORDA= 1
##$CFDGTYP= 0
##$CFRGTYP= 5
##$CHEMSTR= <none>
##$CNST= (0..31)
1 1 145 1 1 1 1 1 1 1 1 1 1 1 1 1 1 1 1 1 1 1 1 1 1 1 1 1 1 1 1 1 
##$CPDPRG= <>
##$CPDPRG1= <>
##$CPDPRG2= <>
##$CPDPRG3= <>
##$CPDPRG4= <mlev>
##$CPDPRG5= <mlev>
##$CPDPRG6= <mlev>
##$CPDPRG7= <mlev>
##$CPDPRG8= <mlev>
##$CPDPRGB= <>
##$CPDPRGT= <>
##$D= (0..31)
0 0.7 0 0 0 0 0 0 0 0 0 0.03 0 0 0 0 0 0 0 0 0 0 0 0 0 0 0 0 0 0 0 0 
##$DATE= 1737453417
##$DBL= (0..7)
120 120 120 120 120 120 120 120 
##$DBP= (0..7)
150 150 150 150 150 150 150 150 
##$DBP07= 0
##$DBPNAM0= <>
##$DBPNAM1= <>
##$DBPNAM2= <>
##$DBPNAM3= <>
##$DBPNAM4= <>
##$DBPNAM5= <>
##$DBPNAM6= <>
##$DBPNAM7= <>
##$DBPOAL= (0..7)
0.5 0.5 0.5 0.5 0.5 0.5 0.5 0.5 
##$DBPOFFS= (0..7)
0 0 0 0 0 0 0 0 
##$DE= 6
##$DECBNUC= <off>
##$DECIM= 32
##$DECNUC= <off>
##$DECSTAT= 4
##$DIGMOD= 1
##$DIGTYP= 9
##$DL= (0..7)
0 120 120 120 120 120 120 120 
##$DP= (0..7)
150 150 150 150 150 150 150 150 
##$DP07= 0
##$DPNAME0= <>
##$DPNAME1= <>
##$DPNAME2= <>
##$DPNAME3= <>
##$DPNAME4= <>
##$DPNAME5= <>
##$DPNAME6= <>
##$DPNAME7= <>
##$DPOAL= (0..7)
0.5 0.5 0.5 0.5 0.5 0.5 0.5 0.5 
##$DPOFFS= (0..7)
0 0 0 0 0 0 0 0 
##$DQDMODE= 0
##$DR= 18
##$DS= 0
##$DSLIST= <SSSSSSSSSSSSSSS>
##$DSPFIRM= 0
$$ [...]
##$SUBNAM0= <"">
##$SUBNAM1= <"">
##$SUBNAM2= <"">
##$SUBNAM3= <"">
##$SUBNAM4= <"">
##$SUBNAM5= <"">
##$SUBNAM6= <"">
##$SUBNAM7= <"">
##$SUBNAM8= <"">
##$SUBNAM9= <"">
##$SW= 18.0517328524113
##$SWIBOX= (0..15)
0 0 2 0 0 0 0 0 0 0 0 0 0 0 0 0 
##$SW_h= 3612.71676300578
##$TD= 16384
##$TD0= 1
##$TE= 0
##$TE2= 300
##$TE3= 300
##$TEG= 300
##$TL= (0..7)
0 120 120 120 120 120 120 120 
##$TP= (0..7)
150 150 150 150 150 150 150 150 
##$TP07= 0
##$TPNAME0= <>
##$TPNAME1= <>
##$TPNAME2= <>
##$TPNAME3= <>
##$TPNAME4= <>
##$TPNAME5= <>
##$TPNAME6= <>
##$TPNAME7= <>
##$TPOAL= (0..7)
0.5 0.5 0.5 0.5 0.5 0.5 0.5 0.5 
##$TPOFFS= (0..7)
0 0 0 0 0 0 0 0 
##$TUNHIN= 0
##$TUNHOUT= 0
##$TUNXOUT= 0
##$USERA1= <user>
##$USERA2= <user>
##$USERA3= <user>
##$USERA4= <user>
##$USERA5= <user>
##$V9= 5
##$VALIST= <valist>
##$VCLIST= <CCCCCCCCCCCCCCC>
##$VD= 0
##$VDLIST= <DDDDDDDDDDDDDDD>
##$VPLIST= <PPPPPPPPPPPPPPP>
##$VTLIST= <TTTTTTTTTTTTTTT>
##$WBST= 1024
##$WBSW= 4
##$XGAIN= (0..3)
0 0 0 0 
##$XL= 0
##$YL= 0
##$YMAX_a= 366745
##$YMIN_a= -427102
##$ZGOPTNS= <>
##$ZL1= 120
##$ZL2= 120
##$ZL3= 120
##$ZL4= 120
##$ABSF1= 10
##$ABSF2= 0
##$ABSG= 5
##$ABSL= 3
##$ALPHA= 0
##$AQORDER= 0
##$ASSFAC= 0
##$ASSFACI= 0
##$ASSFACX= 0
##$ASSWID= 0
##$AUNMP= <proc_1d>
##$AZFE= 0.1
##$AZFW= 0.1
##$BCFW= 1
##$BC_mod= 2
##$BYTORDP= 1
##$COROFFS= 0
##$CY= -3
##$DATMOD= 1
##$DC= 2
##$DFILT= <>
##$DTYPP= 0
##$F1P= 0
##$F2P= 0
##$FCOR= 0.5
##$FTSIZE= 0
##$FT_mod= 4
##$GAMMA= 1
##$GB= 0.15
##$INTBC= 1
##$INTSCL= 1
##$ISEN= 128
##$LB= 0.25
##$LEV0= 0
##$LPBIN= 0
##$MAXI= 10000
##$MC2= 0
##$MEAN= 0
##$ME_mod= 0
##$MI= 1.114404
##$NCOEF= 0
##$NC_proc= 0
##$NLEV= 6
##$NOISF1= 3.799351
##$NOISF2= 2.8
##$NSP= 1
##$NTH_PI= 0
##$NZP= 0
##$OFFSET= 14.38212
##$PC= 1
##$PHC0= 244.9288
##$PHC1= 22.5922
##$PH_mod= 1
##$PKNL= yes
##$PPARMOD= 0
##$PSCAL= 0
##$PSIGN= 0
##$REVERSE= no
##$SF= 200.129724274929
##$SI= 16384
##$SIGF1= 3
##$SIGF2= 2
##$SINO= 400
##$SIOLD= 16384
##$SREGLST= <1H.CDCl3>
##$SSB= 0
##$STSI= 0
##$STSR= 0
##$SW_p= 3205.1282051282
##$SYMM= 0
##$S_DEV= 0
##$TDeff= 0
##$TDoff= 0
##$TI= <>
##$TILT= no
##$TM1= 0
##$TM2= 0
##$TOPLEV= 0
##$USERP1= <user>
##$USERP2= <user>
##$USERP3= <user>
##$USERP4= <user>
##$USERP5= <user>
##$WDW= 1
##$XDIM= 8192
##$YMAX_p= 0
##$YMIN_p= 0
$$ End of Bruker specific parameters
$$ ---------------------------------
##NTUPLES= NMR FID
##VAR_NAME=  TIME,          FID/REAL,        FID/IMAG
##SYMBOL=    X,             R,               I
##VAR_TYPE=  INDEPENDENT,   DEPENDENT,       DEPENDENT
##VAR_FORM=  AFFN,          ASDF,            ASDF
##VAR_DIM=   8192,          8192,            8192
##UNITS=     SECONDS,       ARBITRARY UNITS, ARBITRARY UNITS
##FACTOR=    0.0002768,     1,               1
##FIRST=     0,             0,               0
##LAST=      2.2672688,     0,               0
##MIN=       0,             -427102,         0
##MAX=       2.2672688,     366745,          0
$$ Real data points
##PAGE= N=1
##DATA TABLE= (X++(R..R)), XYDATA
$$ [...]
1748a227J093R89j72n86k41l15R67O55j110o82O18N49j58o30j25J4L94L1p82K3
1768f95R87P43j434m97P86O36L70m18q17k21P75Q44r02o68M52N38m95m28K24n9
1788b79N62k30p45k74J606M13r76p87L18Q65L35m6j120l17J172M57j098l44M57
1807c1O7k58l53L71K64P7j77n43j39J054O42o18p61J99L78O96l39p68k34O73J98
1828C98n07m34N38L50m18m57N3P35J26j51j026K40J137M04p47n62J51N77K91l91
1848C07n50k17O24L2m43k85N93K85n08m31K7N67N05j38j022O7J213N15o59q34
1868c52J60M14O09o79n69n2M60J95n48j59N24k9n4m20l6P85N82k56j023j08J106
1889E50O84p22q56k29O89L65j66p10l19O56K85n85k39M81L90k86l02j79N46P77
$$ plain form
1748 -1227 -134 855 683 97 -144 -459 508 1163 53 -629 -11 538 380 -250 -375 -361 33 64 -718 -695
1768 -695 292 1035 -399 -896 -110 526 896 478 -339 -560 215 1059 157 -511 -59 479 -16 -444 -220 -279
1788 -279 283 53 -692 -966 640 1053 77 -710 -392 473 808 762 -358 -675 497 954 -144 -488 -31
1807 -31 36 -222 -575 -204 60 137 -40 -583 -722 332 974 356 -405 -206 172 868 529 -239 -473 200 398
1828 398 -109 -543 -5 345 -73 -530 -477 258 384 233 -793 -553 584 988 241 -321 -170 407 698 307
1848 307 -243 -460 164 196 -247 -532 61 346 -162 -593 -566 1 506 368 -654 -587 626 1141 482 -352
1868 -352 -192 222 831 152 -417 -469 -9 186 -362 -521 3 -26 -80 -500 -536 249 831 575 -448 -556 550
1889 550 1234 512 -344 -573 116 481 315 -395 -714 -58 227 -358 -597 -116 274 -12 -314 -493 53 830
1909H30k68q29l85P49M02L4o82j66n2O61o8n93o2M27rl29j55O09K70j28m91k94
1931e29P31P81m78r00N2M99J84l0l03n33J41K46N9m88J20O57j30o29J58O26L17
1952E51j64n24m65P79N75R9j017m18P35K90l08k86k10K21M31o75k21M64P00j56
1972D01p87N7O76K49J16k83q91Q1J063l02p39l66N06L97k39k13k14M68M43l53
1992G0r17L70J219k14o79j84L79M75J60n34o00K56R26k28p13k06L68j55P9J46
2012A8o66N09M08l43m92K57Q97j75m31j26J46K22M79j95j065K83P49n8o30J01
2032a12l9l4j55J79j84L47L46o17n54P95P92j94m04l40j02M66P25l78j286O7P73
2053I1K35q53M47J15m06k44K94K84J6P63o83r27Q83Q79m07n83L9l45L31P69k00
$$ plain form
1909 830 562 -267 -652 97 499 533 -149 -315 -367 294 226 -367 -429 -2 -11 -340 -495 114 384 256 -235 -529
1931 -529 202 983 505 -395 -343 156 340 310 7 -526 -385 -139 -80 -568 -448 209 79 -550 -392 234 551
1952 551 387 -137 -602 177 752 851 -166 -584 151 441 133 -153 -363 -142 289 -386 -607 -143 557 401
1972 401 -386 -329 347 596 712 429 -462 -381 682 380 -359 -725 -219 178 -61 -274 -488 -20 423 70
1992 70 -847 -477 742 528 -151 -335 44 519 679 145 -455 -199 727 499 -214 -420 -52 -207 -128 18
2012 18 -648 -139 269 -74 -566 -309 588 413 -18 -144 2 224 703 508 -557 -274 475 417 -213 -112
2032 -112 -151 -185 -340 -161 -345 2 348 -269 -823 -28 764 570 166 -174 -276 190 915 537 -749 -682 91
2053 91 326 -527 -80 35 -371 -615 -321 -37 -21 742 59 -868 15 894 487 -96 -57 -402 -71 698 498
2074D98r94l3P77l07l86L22L02l46N2k31p2P56N25p18j274J002J081n24l09m33
2094c12k34M43Q86l93r50K46L34j84j00L92l1k85J24P2n06R10Q30q48j116M22
2114c00R72j49k05m57q22O04J233n39j077K37N39l08J78M84j73k07K08j91l23
2133b96P45N32p00j147O30P46j70J48m72j016N86Q38j75o56J74L78m37l4L35J54
2153A63r8K32m95j84Q33M95j151n16O26L39KN5m54m89J28Q33l21o31M94L02q0
2174H3o3J38j70P3K01l18k69Q18N49r47p80N03K94J34l5o67k35N72N76m67m79
2195d89M89L69p10J24O19l6j45K35o93l55R96L76p17n86K38K47J57J73n62m36
2215g06O07M28n67k16M40O06o46j4J9L20k17M04n58o73O49P32m86o52K14N8K41
$$ plain form
2074 498 -496 -529 248 -59 -445 -123 179 -167 -115 -346 -418 338 863 145 -1129 -127 954 430 121 -312
2094 -312 -546 -103 783 390 -560 -314 20 -164 -264 128 97 -188 -64 8 -498 412 1242 394 -722 -300
2114 -300 672 523 318 -139 -961 -357 876 337 -740 -503 36 -272 -94 390 217 10 218 27 -296
2133 -296 449 981 281 -866 -236 510 340 488 16 -1000 -414 424 249 -407 -233 145 -292 -326 9 163
2153 163 65 297 -198 -382 451 946 -205 -721 -95 244 246 301 -153 -642 -514 319 -2 -633 -139 163 83
2174 83 20 158 -12 61 262 -56 -325 493 1042 95 -685 -182 112 246 211 -456 -691 -119 457 -10 -489
2195 -489 0 369 -341 -217 402 366 221 456 -237 -592 404 780 63 -523 -285 -38 119 292 -270 -706
2215 -706 -99 329 -238 -454 -14 592 -54 -68 -49 271 54 458 -100 -773 -124 608 122 -530 -316 -258 -17
2236a7L69n79l10P08J86m80l04O96K66n49q1J56p3N03J05p91k29O01p8r9l57K49
2258a08l48K83P9o7j32L80J10k58k64L77L87j86k05k63J15J82K86m81l32P5N33
2279A63k82j67J57j83M30j55j02K3L75P1l65l08N30K21O1m31j25j89L72L45o71
2300b30m01M91J54J28l81m5K84j7K0p9m3O37q5l45m34K25P93l90j16p08N10R0
2322E8J18l57k48L85K04m9m49J22O9J78J07l58J01N38O9n79j53J63L75J03n48
2343a51l49M8N04Nk76m67K68O20l58K04l6J91K2p7k61J70K14J29m57j22JM88q1
2366B29j80m72j85O67Q7j39l30J68J43N7j48N3J24J98o2m62K69L15J87k25p02
2387d08J84L41p3k75M7r4L09%j47J51j23L02P4k02j62M90j08k16k91kO17J13n75
$$ plain form
2236 -17 352 -227 -537 171 357 -123 -427 269 535 -14 -95 61 -12 491 596 -195 -424 177 99 0 -357 -108
2258 -108 -456 -173 -94 -161 -293 87 197 -61 -325 52 439 253 48 -215 -100 82 368 -113 -445 -370 163
2279 163 -119 -286 -129 -312 118 -37 -139 -116 259 330 -35 -343 187 408 469 38 -87 -276 96 441 -230
2300 -230 -631 -140 14 142 -239 -284 0 -17 3 -76 -119 518 433 88 -346 -121 672 282 166 -542 -32 58
2322 58 176 -181 -429 -44 160 111 -338 -216 -147 31 138 -220 -119 419 488 -91 -244 -81 294 397 -151
2343 -151 -500 -452 52 57 -219 -686 -418 202 -156 48 12 203 225 148 -113 57 271 400 -57 -179 -178 310 229
2366 229 49 -423 -608 59 146 7 -323 -155 -12 45 -103 -50 74 272 210 -252 17 332 519 294 -408
2387 -408 -224 117 44 -231 -184 -278 31 31 -116 35 -88 214 288 86 -76 414 306 90 -201 -203 414 527 -48
2410d8l09J21L03O2k52j96j3L51o7p8Q3J92R0j18k8j38J78L28k60n03L4L48K53
2433C33l24m75PL71J54k34K5j40L97L2l08J14L52Q0j6m30k93N52J72M3o53J26
2455a15K08Q7j99j55j20N6N06l57q5R6N1L70m39q1J89K30N3l25k25L33N13m03
2477A88o50K1L99K36l37%K2qk1L68n33J62L30k30J93j94K60J10K2j31k40o1O02
2500E08l9p97k6K66O1j23j2JJ10L37l2l76M20n1n7l92K53K43j48o5m40j22P7P68
2524C64k27m05m8J36K78q2R9j82r5L91l59j42L39M73m06n18R4L56K98k28k21n00
2546e85J05P43k07l79j26L41PP5K48l77M16mk58l55M80K58k43l00m2M3L95J59
2568C94m75n15M98L70j85l18J34j35j4M85j28k77o0N75l85j05N98j96j33k1l56
$$ plain form
2410 -48 -357 -236 67 129 -123 -319 -332 19 -48 -126 -43 149 239 121 93 -45 133 461 201 -302 -268 80 333
2433 333 9 -466 -459 -88 66 -168 -143 -283 114 146 -162 -48 304 384 368 -62 -355 197 369 412 -241 -115
2455 -115 93 180 -19 -174 -294 -238 268 -89 -174 -78 -27 343 -96 -177 12 242 295 -30 -255 78 591 188
2477 188 -462 -441 -42 194 -143 -143 -121 -129 -150 218 -315 -153 177 -53 140 -54 206 316 338 207 -33 -94 508
2500 508 469 -328 -354 -88 -27 -150 -162 -161 -51 286 254 -122 298 247 190 -202 51 294 146 81 -359 -481 -404 364
2524 364 137 -268 -316 -180 98 16 115 -67 -162 229 -130 -272 67 540 134 -384 -290 66 364 136 -85 -585
2546 -585 -480 263 56 -323 -449 -108 -101 -26 222 -155 261 257 -1 -356 124 382 139 -161 -203 -160 235 394
2568 394 -81 -596 -98 272 87 -231 -97 -232 -246 239 111 -166 -226 349 -36 -141 457 261 128 107 -249
2589b49L15RM62p36n85N05N59J5m44K05k90L2K73K92l84K93R8o57m0N18J73j37
2611B27l13j22L3J42K80m09l48K60N07k08j06K14j33r0K82k50P4J28j38j50j57
2632b77O95l4l45j50o5j02K74L20l85o25M27M39k93J09M33l87r6K01o1j65L09
2653B22J19m63k46K74M76l08j69l20M1M73M99n84n95M52L32k57J57J92n45M5L16
2674A11J19k27K79J29n80l25M53J87k89J8j41j32N01M05n09l81K84M07j16j27
2694F6R1r0K1K27m16O4J16K27n33o5K21L63l04j36J67k99O50J9n38O9N2L41l77
2717f4K39J16m62J35L48j42k35L03j62m25M6J54K82j06j29o8l4K94L34m75o1J16
2739DK15k65K8J76k05o0K64j14k00L1K22l28j00L27k4M1L0j44r6O54q6n39K8N08
$$ plain form
2589 -249 66 75 537 -199 -784 -279 280 295 -149 56 -234 -202 71 363 -21 272 370 -287 -327 191 364 227
2611 227 -86 -208 -175 -33 247 -162 -510 -250 257 49 -57 157 24 -66 216 -34 40 168 30 -120 -277
2632 -277 418 384 39 -111 -176 -278 -4 316 -69 -694 -267 172 -121 -12 421 34 -62 139 78 -87 222
2653 222 341 -122 -368 -94 382 74 -95 -415 -374 99 598 14 -581 -129 203 -54 103 295 -250 -205 111
2674 111 230 3 282 411 -169 -494 -41 146 -143 -125 -266 -398 103 508 -1 -382 -98 309 193 66
2694 66 157 67 88 315 -101 -37 79 306 -227 -292 -71 292 -12 -148 19 -280 370 389 -149 -80 -28 313 -64
2717 -64 175 291 -171 -36 312 170 -65 238 76 -349 -303 -149 133 27 -102 -170 -204 90 424 -51 -112 4
2739 4 219 -46 -18 158 -47 -107 157 43 -157 -126 96 -232 -332 -5 -29 12 42 -102 -198 456 370 -169 -141 367
2763C67J2j89k84J3MK36j95l85J97K70J28k11k71P4L12j90J52Q4l11L15K17m14
2785f9k31M51J14j31n6k38J08R0L32m57l07K12J28J22k17r9O5J97K14j36j35J69
2807A26J08j30j11m4J74o9r5m8jQ1L80p06Q8J72J83J4Q2m18J63N3K27O7k04J42
2831B34J7m05K03L8J27j79j40j91j6N81n0n64MK02K30k71K61MO5J37j44j28P3
2854H8J9Q4j80r4oL58l95j88K06j08K08L86m81Q3R3O4m6k73J79J10j1j05j6K14
2878A89j27j5J3k19J65K06j32j85r7j38N67j5l11R3jK17J8k28qJ76m1o5%k29J80
2903A3k4j04m6j94M09kj64j09QL69K36l72l21R0L34n3p7Q7Q9R3k90k1P9j0K75
2928B95n43j28K34R2RM0l24N2L79R0L7j00J4j66J64j38J10K7r9p6k44P5J87K29
$$ plain form
2763 367 379 190 -94 -81 -77 159 -36 -421 -224 46 174 -37 -308 -234 78 -112 40 124 -187 128 345 -69
2785 -69 -300 151 265 134 78 -160 -52 38 370 -87 -394 -182 -54 68 -149 -248 -183 14 228 92 -43 126
2807 126 234 104 -7 -51 123 54 -41 -89 -90 -9 371 -335 -247 -75 108 122 204 -214 -51 2 229 296 92 234
2831 234 251 -154 49 87 214 35 -105 -296 -312 269 219 -345 -341 -139 91 -180 81 85 150 287 143 15 88
2854 88 107 191 11 -83 -89 269 -126 -314 -108 -216 -8 378 -103 -20 73 137 91 -182 -3 107 96 -9 -25 189
2878 189 62 47 60 -159 6 212 80 -105 -202 -340 227 212 -99 -6 -7 210 228 0 -8 168 127 62 62 -167 13
2903 13 -11 -115 -161 -355 54 52 -112 -221 -213 156 392 20 -301 -211 123 70 -7 80 169 262 -28 -49 30 20 295
2928 295 -248 -376 -142 -50 -41 -1 -325 -273 106 196 233 133 147 -19 145 7 117 144 45 -31 -275 -200 -13 216
2952B16l80K14K5l2kj6j67J75J45p6k51K7M20l63J11P2j17j59L97m69j42K43M5
2975h4r2J75l1nJ69L09l33l17L10J8R3l00J43pJ3qj44j07K88P2j56m90L48M26
2999B90l09n2j2j26L51K11k06l06K4L45J14j63k2j14j43L69m12q0K99Rn8n28K13
3022c06K31K10M7j47K9j94L86j79k10K14K72l98k62J62K48r7j36J84l10K20K32
3043A96o1k88N3K49j18J38p0k69J42Q6k1l44K61K14l04j03M57p5k41R8n6j95Q7
3066a64M93l69k99J47L28j41J40K17n22L7M10k80k19L65J82k16l94K86jj76K91
3087A15k26j76L03K98l97Q6j65R3R8L06j05j69n5K17M6l03KJ63j35l40M88k69
3109a25Q8J6P8n50L50M72k45l30K27J4k21N71j90j98j4N6mk04K60l9j98K2L64
$$ plain form
2952 216 -164 50 75 43 41 25 -142 33 178 102 -149 -122 298 -65 46 118 1 -158 239 -230 -372 -129 -84
2975 -84 -176 -1 -32 -37 132 441 108 -209 101 119 212 -88 55 48 61 53 -91 -198 90 162 6 -484 -136 290
2999 290 -19 -71 -83 -209 142 353 147 -159 -135 210 324 161 139 25 -118 251 -161 -241 58 67 9 -519 -306
3022 -306 -75 135 182 35 64 -130 256 77 -133 81 353 -45 -307 -145 103 6 -130 54 -256 -36 196
3043 196 135 -153 -100 149 31 169 99 -170 -28 58 37 -307 -46 168 -136 -239 218 143 -98 0 -56 -251 -164
3066 -164 329 -40 -339 -192 136 -5 135 352 -170 -133 277 -3 -222 143 325 109 -285 1 0 -176 115
3087 115 -111 -287 16 314 -83 3 -162 -69 29 335 230 61 6 223 269 -34 -32 131 -4 -344 144 -125
3109 -125 -37 -21 57 -493 -143 329 84 -246 -19 -5 -226 345 155 -43 -57 -1 -5 -209 51 12 -186 -164 200
3132B00m76L89N6j71l05K80K25R0j51j42j47K84K2M14m20l71K53k30J38M45k68
3153A15j76O8j40l7L12L30l95l94L54K35k55j4j71J34M0M39k51j72J32j30l19
3174b95o0L98l0k19J99j36P0K42J30l85o7K67K33k57k27K17k59J87J25n7l05J10
3196a19K09k17j5L17o4n56L25K11j73J63M6l10q7L35N7np8M7j49q5J99p3j08l8
3220a68K21k03KN7K07k33J43J88l36J75L25l51J9j1K70k65R2M6l91K22Q0q5j16
3243a12RR7l57L0L61k4p6L14k53k32K98K65k14k32L04N0l99K61j09k44J33L0J30
3266C0k90J60J47j83J09J8J07o2J61p4p8k2K07k53J15K70l44j24m3j8K14k0j64
3289a37J53j07K53l41K27n7l6K7P0K9j36l8J78R5j18l43L05J79m09L21l07J31
$$ plain form
3132 200 -276 113 169 -2 -307 -27 198 288 137 -5 -152 132 154 568 148 -223 30 -200 -62 383 115
3153 115 -61 7 -133 -170 142 472 77 -317 37 272 17 3 -168 -34 6 445 194 22 154 24 -295
3174 -295 -355 43 13 -206 -7 -143 -73 169 299 -86 -153 114 347 90 -137 80 -179 8 133 76 -229 -119
3196 -119 90 -127 -142 175 111 -445 -120 91 -82 81 127 -183 -270 65 122 117 39 86 -63 -148 51 -22 -130 -168
3220 -168 53 -150 -148 -91 116 -117 26 214 -122 53 378 27 46 35 305 40 132 178 -213 9 89 4 -112
3243 -112 -103 -6 -363 -333 28 4 -72 242 -11 -243 55 320 106 -126 178 228 -171 90 -19 -263 -130 -100 30
3266 30 -260 -100 47 -136 -27 -9 98 36 197 123 45 23 230 -23 92 362 18 -106 -149 -167 47 27 -137
3289 -137 16 -91 162 -179 48 -9 -45 -18 52 81 -55 -93 85 180 62 -281 24 203 -206 115 -192 -61
3311f1MQj15MJ86J20j20j93K24OJ05K2j07q9PJ68j72o3o8k8P2M9j82J13l3J82
3337C9l98K41J16K42j85k11K25J9j0J17j97P6k85R5Q2k06M1J24J34nk70j18M63
3360A29k57J17j19J3J99J57j90N0j54K61q8l21L35k85J74j13m9L1K4J52k10J6
3382a28J02J88k26P2n1J3O0K73k3k71o6n6K04j82j56K13N9j97R9K22j42n6nj04
3406a58J35J04n2j51j7K53J2pj02j05p8K9J60rO3p0N5l00J73j1J97k52k27K26
3430a32P5R4K82k31k31J59N5O3k14J11o5K7J49j26l6K2J4k71J53J29k9K5O4k22
3454a35K30j4Q2l10J01J86k05L48l50L2m5rmL4m6J29Q7l26L31n8kK71l41j1J31
3479A06mJ59k46j20Q7L8K6m8l75L11M3j79J36q5J78J55Nj53j12J90R4r3j68O7
$$ plain form
3311 -61 -57 -49 -164 -160 26 146 26 -167 57 63 168 190 83 -6 1 169 -3 -66 -134 -162 -90 -41 -223 -110 -143 39
3337 39 -359 -118 -2 240 55 -156 69 88 78 195 -2 74 -211 -116 -34 -240 -199 -75 59 54 -216 -334 129
3360 129 -128 -11 -130 -117 82 239 49 99 -55 206 118 -203 132 -153 21 -92 -141 -110 -86 66 -144 -128
3382 -128 -26 162 -64 8 -43 -30 30 303 280 9 -57 -113 91 -91 -247 -34 25 -172 -73 149 7 -49 -54 -158
3406 -158 -23 81 29 -122 -139 114 126 119 17 -88 -166 -137 23 14 77 7 62 -238 -65 -76 121 -131 -358 -132
3430 -132 -57 37 319 88 -143 16 71 134 -80 31 -34 -7 142 16 -20 2 16 -255 -102 27 -2 23 87 -135
3454 -135 95 81 163 -147 -46 140 -65 283 -67 -35 -80 -89 -93 -59 -105 24 111 -215 116 58 56 327 -14 -25 106
3479 106 102 261 15 -105 -18 20 46 -2 -377 -66 -23 -202 -66 -151 27 182 187 34 -78 112 206 113 -55 12
3503A2P8n7r2P0P6k79J04LP9r1J09j03N2PK6J2j84J34L6J82J15k97k0j07K17J10
3529A92k62J44j47m1j06L99l29Q8P1m5mJ0J21j01L2n4J52k58M34j56q3j30j17
3552a90O5l3Q6o2K2R4j19O8q1L80k7l03o8K24K5k14Q2o4R8R4M0k09j54O27n95
3577b14l8K90K1j26J45O4l97K70L30j85m73L88J3k7R4j74j64m6K85K5k71K4J64
3600bk31L3M55k69j80Q6J48j84K63L5J1l30L16q8k2J38n2k22p8L22M1l97N2L18
3624A63k40J71n6O7j51N4J33n9K5O6n3k72K96M9k02n3J17l11J70n2J03nj38K72
3648I4j55rJ79k02J90Pj78m1K92P7q3j24NQ1n6J25j31k84J57K88k65p4K71k92
3672a28NJ04J16m7l43L93k72j01K91J93k69P0j48J54K25j24j2n81K12K16K4Lk83
$$ plain form
3503 12 90 33 -59 11 87 -192 -88 -85 -6 -97 12 -91 -39 -32 -6 6 -178 -44 -8 174 289 -8 -28 -135 82 192
3529 192 -70 74 -73 -114 -220 179 -150 -62 9 -36 -40 -30 91 -10 22 -32 120 -138 296 140 57 -73 -190
3552 -190 -125 -158 -72 -134 -112 -18 -137 -69 -150 230 203 -100 -168 56 81 -133 -51 -115 -17 77 117 -92 -246 381 -214
3577 -214 -252 38 59 -67 78 142 -255 15 345 160 -313 75 88 61 155 -19 -183 -229 56 81 -190 -166 -2
3600 -2 -233 -200 255 -14 -194 -108 40 -144 119 154 165 -165 151 63 41 179 127 -95 -173 149 190 -207 -155 163
3624 163 -77 94 38 105 -46 8 141 82 107 173 120 -152 144 193 -9 -62 55 -256 -86 -138 -35 -40 -178 94
3648 94 -61 -70 109 -93 97 104 -74 -115 177 254 171 47 52 133 77 202 71 -213 -56 232 -33 -107 164 -128
3672 -128 -123 -19 97 50 -293 100 -172 -273 18 211 -58 12 -136 18 243 119 107 -474 -262 -46 -22 -19 -302
3695c02L93j82o2K85Qj85oO8K0K7K85m96J10k7J10k12K86k88n9K64J2M1k04K36
3719A22R7k69o1K29p0J31P2r7l46L38k22K6J12j9j53m1J83j27j9J08K67l06J77
3742A32k35M5J67oj36J1L17k20M2q1pK5k46r9K96k39J14P3j5j28O3K18l36L88
3766A43K2j79K47j52Qq5n0M5j47L4P8MlJ7K0o6K17k96K27k75K77n6o6j27K99m1
3792I5n2J21l27J13J33J8q5k23L57R6k28J60j41j6k60K88K6j35K73R7m33J5L13
3815B05k22L8n3k8K38l32J49l26J95J03J80j14j45Kk7J10J33k1k24J48K5QMq6
3839d0j9J17K4k80R8K08o0j0o8q3K91j95O1L2RJ9K3j36j51L63j98J3R9j55k26
3864b64J09L9J11L2j60J92p5n1o5L82k30j26K89k42J15L10l49j80J33L39M8k36
$$ plain form
3695 -302 91 -91 -153 132 140 -45 -51 17 37 64 349 -147 -37 -64 46 -166 120 -168 -227 37 49 90 -114 122
3719 122 219 -50 -111 118 48 179 251 154 -192 146 -76 -50 62 43 -110 -151 32 -95 -114 -6 261 -45 132
3742 132 -103 -58 109 103 -33 -22 295 75 117 36 29 54 -192 -291 5 -234 -120 -47 -62 -190 -127 91 -245 143
3766 143 165 -14 233 81 89 4 -46 -1 -148 -114 -36 -32 -35 -18 2 -64 153 -143 84 -191 86 30 -36 -163 136 95
3792 95 43 164 -163 -50 83 101 16 -207 150 246 18 178 37 21 -239 49 75 -60 213 310 -123 -108 205
3815 205 -17 21 -32 -60 178 -154 -5 -331 -136 -33 147 33 -112 -110 -137 -27 106 85 -139 9 34 42 46 -40
3839 -40 -59 58 82 -198 -100 108 48 38 -30 -113 178 -17 44 76 85 104 127 -9 -160 203 5 18 117 -38 -264
3864 -264 -155 -116 -5 27 -133 59 -16 -67 -132 250 20 -106 183 -59 56 366 17 -163 -30 309 357 121
3886A21k72R4O5rj29j12j78M94K1m7l48K89Q6l4j21J42m8PJ43k98J09K12q0k99
3910a92K4K36R3k79m3M1J59O6k19j2J7RJ40j30jJ58J52J0Nk72K40j57J17k47Q0
3935ek9j56M04j84N2n1ro6J0Q8J54k69R9p9K31k7j1j44M8k50L57l69K20n1o9J14
3961HJ2j07p2J35N4O0Jk11J53K26l61L9n8J31J31j75j35k48N90k82j60K91J5r6
3985e9J75j60J97j3p2j08Q2J49m4j21J08j64%J58L6k73j20K05J32J6j31o2K4J30
4009H5K6o8Q1L5J74k61j09J49j62K36l49R6j34M38k83J04l2j84J51J56L3k19K3
4032a4r7J56Q4rq4L6j54K15j53qJ51Qo7l97J82K84k59j08L64l3j06l8K9K9m4Q5
4058E2q2K22j30n7P5l27K96p2J8J06l83J3J66L66l49J58k58K22k82L45n2j93K84
$$ plain form
3886 121 -151 -57 8 -1 -130 -242 -420 74 95 48 -300 -11 75 41 -80 62 14 21 164 -134 -25 187 107 -192
3910 -192 -168 68 161 -118 -161 -120 39 105 -114 -126 -109 -100 40 -90 -91 67 219 229 234 -38 202 45 162 -85 -5
3935 -5 -34 -190 214 30 82 31 22 -44 -34 54 208 -61 38 -41 190 163 152 8 56 -194 163 -206 14 -37 -106 8
3961 8 20 -87 -159 -24 30 90 91 -120 33 259 -102 -63 -121 10 141 -34 -169 -417 173 -109 -269 22 37 -59
3985 -59 116 -44 153 140 68 -40 42 191 147 26 134 -30 -30 128 164 -109 -229 -24 108 124 -7 -69 -45 85
4009 85 111 43 124 159 333 72 -37 112 -50 186 -163 -67 -201 237 -46 58 26 -158 -7 149 182 -37 -14
4032 -14 -111 45 129 120 36 72 -82 133 -20 -28 123 131 64 -333 -151 133 -126 -234 130 97 -9 -47 -18 11 -33 52
4058 52 -30 192 62 5 80 -247 49 -23 -5 101 -282 -269 -103 263 -86 72 -186 36 -246 99 47 -146 138
4081A38l39J03K7K14j59j2j28K70n5R5j09m7j88P8L6J25K4J85l64K51l8N6j15
4104D8M4%j20m9J78m9K7n4n2m9P5J63n12L54j44J67j8N1J76k31k7J31j31O7m1
4129DJ9j15N3K89k20r4j09r9J70K14p3q2k5K3J15p0J21m4Q3j85j41J96j9j4k6
4154b9J32p5n4M7j36R6L1j28k6K40k80O8r0M32k99J69k15J97M3k02K30j83K48
4177B16l20L8J24J5J01j0l70L7M6J89k18J94K4o7j83Q7O1mJ39o7n5o2J4L84l85
4202g2P5K39m91K08pJ22l33J48K2J36QL6j97J72j18N0j83L7K90J44k46N9O6j72
4226gk13K60j8k22J10o9R2J60k0O1l51K51j59jK57Q4j36l5j65J04k70L13j68J20
4250b2k01K97J0J5N1j45j74K98J85k95n6j29K13j64L94l47K6O9J21k51j22L15
$$ plain form
4081 138 -201 -98 -71 143 -16 -28 -156 114 59 154 45 -2 -190 -112 -76 49 73 258 -106 145 107 163 48
4104 48 92 92 -28 -77 101 52 79 25 -27 -76 -1 162 -350 4 -140 27 9 60 236 5 -22 109 -22 45 4
4129 4 23 -92 -39 250 30 -64 -173 -272 -102 112 39 -43 -68 -45 70 0 121 77 160 -25 -166 30 11 -3 -29
4154 -29 103 28 -26 21 -115 -19 12 -116 -142 98 -182 -114 -204 228 -71 98 -117 80 123 -79 151 -32 216
4177 216 -104 -66 58 73 174 164 -206 -169 -123 66 -152 42 66 -1 -184 -97 -36 -40 99 32 -23 -85 -71 313 -72
4202 -72 3 242 -249 -41 -48 74 -259 -111 -89 47 55 91 -106 66 -52 -2 -185 -148 142 286 40 99 165 -7
4226 -7 -220 40 22 -200 -90 -159 -67 93 73 134 -217 34 -125 -126 131 215 79 44 -121 -17 -287 26 -142 -22
4250 -22 -223 74 84 99 150 5 -169 129 314 19 -37 -166 47 -117 277 -70 -44 25 146 -105 -227 88
4272H8L1j78q0K78j33k1n9K16j74N1Qj90J58j78K24o4R7j20n5l2K79l5p0J8M9
4297A08k57K82j57j43J61J49m5j26J9J5m4K33j74J33k66pK66j36J2l8j16J99J86
4320B54l64J13n5K1j40L94l89J68j07J78r2m2%K52j65R7k30Rj9J34L24m21j65
4343b45M34l10M5K39k81J81j66J58J0O3P6k9j75p8J98j75j03J47j86%K82l3k51
4366a99K53M9r5J54J14k87j20L26k4k94K7J06N8K4l42M60j72o0l3Q3k06mL29k67
4390a20J71j32j12K35k95J57QP4k13K37j36J09P6O2k14J00j05J09j5j14M8J15
4412D5K35j24m6j40j44L55j54j87P4J55L9j31Mmq8k1N5O4M4R5J0j86J78j65j36
4437a73K35j13J19M2O8j80o4N0p6J10p3J20O8k81L2n2J38l4j26K76j00M7J71j15
$$ plain form
4272 88 119 -59 -139 139 6 -15 -74 142 -32 19 27 -163 -5 -183 41 -23 74 -46 -101 -133 146 111 41 59 108
4297 108 -149 133 -24 -167 -6 143 98 -28 -9 6 -38 195 21 154 -112 -119 147 11 23 -15 -131 68 254
4320 254 -110 3 -52 -31 -171 223 -166 2 -105 73 -19 -61 -61 191 26 123 -107 -98 -117 17 341 -80 -245
4343 -245 189 -121 -76 163 -118 63 -103 55 65 128 204 175 0 -78 120 -55 -158 -11 -197 -197 85 52 -199
4366 -199 54 103 8 162 276 -11 -131 195 171 -123 -96 10 68 92 -250 210 38 -22 -55 28 -178 -182 147 -120
4390 -120 51 -81 -193 42 -253 -96 -88 -14 -227 10 -126 -17 59 121 -93 7 -98 11 -4 -118 -70 45
4412 45 280 156 110 -30 -174 181 27 -160 -86 69 108 -23 -19 -23 -111 -132 -77 -13 31 126 136 -50 128 -37 -173
4437 -173 62 -51 68 110 178 -2 -66 -16 -92 18 -55 65 133 -148 -116 -168 -30 -64 -190 86 -14 33 204 89
4461H9q2O8r2J67j00n2K28k19M0j44K1J29j55J94K5k64L43k79j01L80l47K20p8
4484im8K37k27K0K89k10l1j4J0k9j26K72l44J40J39k8r3J2oL12k28j33N6k9J5
4509e3J12o1O0M2k5j83K10o4j89K99l03O8pJ76l6k02n7r0N60j34k39K58j10J01
4533A33j72J13j17J0J45l65J53QrnJ02QO5J16k24J65k05QK39k05j60K66j04K64
4557B29k69j12L19k48J94k6k13k8J72l4l6o7K93r5j44N6Q6j30q7J67P9m8j47J29
4581D0j08M1j8kJ36k04K34j45J35J64l20J65Qj02J12N1n4k7p6n9nk58K34r0J56
4606Hq4pK9k6o5J26p6O8N1K40r6j43J64p2j7km5k3j22m2J66q8k1j01K38k93J59
4633g4P6Q9j03K26j46K0j76J84j10M8J74m8K7k83P4P0n1Nj0j10O4L22k65l3K99
$$ plain form
4461 89 7 75 -17 150 50 -2 226 7 47 -97 -76 53 -102 92 117 -147 196 -83 -184 196 -151 69 -9
4484 -9 -57 180 -47 -27 262 52 21 7 17 -12 -138 134 -210 -70 69 41 -52 -40 -46 266 38 -95 -39 -68 -53
4509 -53 59 -2 58 100 75 -108 102 38 -151 148 -155 -87 -94 82 46 -156 -213 -303 257 123 -116 142 32 133
4533 133 -39 74 -43 -33 112 -253 -100 -92 -101 -106 -4 4 69 185 -39 126 -79 -71 168 -37 -197 69 -35 229
4557 229 -40 -152 167 -81 113 87 -126 -154 18 -16 -52 -119 174 79 -65 -9 77 -53 -140 27 106 58 -89 40
4581 40 -68 -27 -45 -47 89 -115 119 -26 109 273 -47 118 126 24 136 187 133 106 30 -29 -34 -292 -58 -148 8
4606 8 -76 -83 -54 -80 -145 -19 -95 -27 24 264 168 25 189 117 100 98 53 30 -92 -134 32 -56 -77 -178 60 -233 -74
4633 -74 2 91 -12 214 68 88 -88 96 -14 34 208 160 187 -96 -22 48 -3 2 -8 -118 -54 268 3 -30 269
4658B69l13Q8j11J08J59l26K75k4j76J28O2j50p6K04j29J6Rp1j82Q2M26k82r3
4681a07J87J32l34o4L46k06Q8j5nl6l4J91k40J39J08k55lK6K63o6k62J31k32K70
4705B2K00p4j57j46K25k02K50j58j33J20P3n2J43j72P6j30J5K27n9k96K2M62l55
4728i9M8L5L19m03P9n3J00j7L9j23M3j14M1J94j13R6j46K7R7j73P2Jj23L54j54
4753B7N3m2j05P4j67K28o5j4Q9k15J27K53m37J63J74L0k46K20r5k16K54J94l87
4776a03J60J96n22K31O1J12J3k7rm8o1J9k6p9J31n8J44nK2j00j54R3K5k1Q3M1
4802A18k13R9J25k31kk2l3j17J5J92K14k02Q5j96L51M2n1j58PJ23l3kj39J17j38
4827d9J0q2J01J10N4J30m25L57p3j06j62J32nl9Q0Lok1Q8k10n8J20R9k31R0O8
$$ plain form
4658 269 -44 44 -67 41 200 -126 149 125 -51 77 139 -11 -87 117 -12 4 13 -58 -240 -158 268 -14 -107
4681 -107 80 212 -122 -186 160 -46 42 27 22 -14 -48 143 -97 42 150 -105 -108 -82 181 115 -147 -16 -248 22
4705 22 222 148 -9 -155 70 -132 118 -40 -173 -53 20 -32 111 -61 15 -115 -100 127 68 -228 -206 256 -99
4728 -99 -51 -16 303 -100 -21 -74 26 9 48 -75 -32 -146 -105 89 -24 72 -74 -47 50 -123 -51 -50 -173 181 27
4753 27 80 38 -67 7 -160 68 3 -11 78 -137 -10 243 -194 -31 143 173 -73 147 52 -164 90 284 -103
4776 -103 57 253 -269 -38 23 135 148 121 112 64 3 22 -4 -83 48 -10 134 129 151 51 -103 -10 15 -6 77 118
4802 118 -95 4 129 -102 -104 -126 -159 -276 -261 -69 145 -57 28 -168 183 225 174 16 23 146 113 111 -28 89 -49
4827 -49 -39 -121 -20 90 144 274 -151 206 133 27 -135 -3 -8 -47 33 36 30 9 97 -113 -171 -51 48 -183 -93 -25
4853b5l45L27J08j96L04l89K42nm4j81J52P2J07N7k78J09R3j85j08J4K57j51J45
4876H0j19K47q0j11j12r2J18j75J3J91k8M0J87r3k60K44l15J74J08j34K57k85
4898a45J64P9m7j16J07k03o1J64J7k0J08L5n2p6p1N9M1k5r3P0J93j30j5O4m5j42
4924a40L0R1p9J46j02J0J29k49K35k0K41l73K28p3p4m8m4j01J03J19j35J39j05
4947g2J29j12K8k0J65k23J0O0k6j16K10q0K47l93MJ33J2J88j33j70J61rQ5k73
4971a95Q5K9O3j36J55qK1L1j97J38J14Q5l15R9k28L02J12j02N6j33o0J41j48n2
4995a43K02N0l5J1K1J18n3k95J20o9O0L8p1m9K22l32K39j44K6K18k49R3m2J18
5019E4p8m5j64K03Q9j3m9K0O6n9j37J63j38R2o0j20K82n5q6Q5j1l5j45J63j08
$$ plain form
4853 -25 -370 -43 65 -131 173 -216 26 21 -23 -204 -52 20 127 184 -94 15 108 -77 -185 -171 86 -65 80
4876 80 -39 208 128 17 -95 -187 -69 -244 -231 -40 -68 -28 159 66 -194 50 -265 -91 17 -117 140 -145
4898 -145 19 98 51 -65 42 -161 -222 -58 -41 -61 47 82 30 -46 -117 -58 -17 -42 -135 -65 128 -2 -17 47 2 -140
4924 -140 -110 -19 -98 48 -54 -44 85 -164 71 51 292 -81 147 74 0 -48 -92 -193 -90 29 -106 33 -72
4947 -72 57 -55 -27 -47 118 -105 -95 -35 -61 -177 33 -47 200 -193 -189 -56 -44 144 11 -159 2 -7 78 -195
4971 -195 -110 -81 -18 -154 1 -7 14 45 -152 -14 100 185 -130 -31 -259 43 155 53 109 -24 -84 57 -91 -143
4995 -143 59 109 74 85 106 224 171 -124 -4 -73 -13 25 -46 -95 127 -205 34 -110 -84 134 -115 -22 -64 54
5019 54 -24 -69 -233 -30 59 46 -3 17 83 24 -113 50 -88 4 -56 -176 106 51 -35 50 39 4 -141 22 -86
5044h6J12O2j72L60l42qj5J10r7J42n1k45K88k45L83l67R9K65k48J64j29k6K16
5067A70k51L4J18j84R8j4J64j60R2N5k52J89K7q7N2o3k03J71J47j69lQ7k8R9Q6
5092A75l01M5K30j35l7O4k81K41n8J88n7k00M54l73l18K14M54m52P1J49j20K41
5114A94k22Q0R6l82L65k46K5l2K23j23J11q6j02q0J90p9K4l9L48k93J25M1q1l9
5138A8J57n1l96J95MJ37Jj26M8p3rM6l7r1K61k51j46L65J38l47K11K3N8k56K99
5163A78M1k56K8p4j09J16L3n1J27j49K84j97m6j1J74j88K18j6j00Mj6P3N6j67
5187d8J82j05j07J93k60Q0J33j66J47K79m43J60j84R5K19j56o3J35j14m9J67O7
5209A62k67P3J23j7j81o7J23j55P4K76j71j84M91k20l1L3O7m47L88j33Q3p5J95
$$ plain form
5044 -86 26 88 -84 276 -66 -74 -89 21 -76 66 15 -230 58 -187 196 -171 -72 193 -55 109 -20 -46 170
5067 170 -81 -47 71 -113 -15 -29 135 -25 67 122 -130 59 86 -1 51 -12 -215 -44 103 -66 -69 18 -10 89 175
5092 175 -126 -81 149 14 -23 41 -240 1 -57 131 74 -126 328 -45 -363 -149 305 -147 -76 73 -47 194
5114 194 -28 52 148 -234 131 -115 -90 -122 101 -22 89 3 -99 -179 11 -68 -44 -83 265 -28 97 138 57 18
5138 18 175 124 -272 -77 -73 64 65 -61 -13 -86 -95 -49 -86 -177 84 -167 -313 52 190 -157 54 77 135 -121 178
5163 178 219 -37 -9 -83 -192 -76 -43 -94 33 -116 168 -29 -75 -86 88 -100 118 102 2 6 -10 63 119 -48
5187 -48 134 29 -78 115 -145 -65 68 -98 49 328 -115 45 -139 -44 175 19 -44 91 -23 -72 95 162
5209 162 -105 -32 91 74 -107 -174 -51 -206 -132 144 -27 -211 280 60 29 62 129 -318 70 -63 20 -55 140
5232A40j88Q8j2J5j49n6J84n1r9r9K38Rj70O7J63l06K60o4N4j03J16j87L30R1
5256B71k37nJ8J07l60K33M2l42J69J60j32k0J06k25P0J00n7r1K47m3L8n1J71j48
5280B1k93J72K23j68J20q3O6k3j01J84P5k06J42P5k97J89J0j86P0j26J35k5Lo
5304b9J25j72K12q0j45k0K94k72J58j4j69j13O7J81q0oj5J16q1N8%J83j06j21
5328b9L12j35r7J9q3R9l3l31M32j14j13J13K9k7k1m0J2P4O9j59L0j05J3L5N8J51
5354A59r7j78K80j93J26j62J63k41J54j16R1Ol6J08P2l3m5l6KP0k07J92k73L99
5378B05k44k4J61k41J43J40j80j85%J38J77j04o1J30P8k14m4N7L59j00k40P5j52
5401a26J34pj20J35L0j4J09kk07J17j55K95j35j41Pm5qO0K88j73j95J78PK9m0
$$ plain form
5232 140 -48 40 28 43 -106 -162 22 -29 -128 -227 11 20 -150 -83 80 -226 34 -30 24 -79 37 -150 180 271
5256 271 34 29 47 154 -206 27 69 -273 -104 56 -76 -96 10 -215 -145 -45 -102 -193 54 11 49 -2 169 21
5280 21 -272 -100 123 -45 75 -8 58 35 -66 118 193 -13 129 204 -93 96 106 -80 -10 -136 -1 -26 -23 -29
5304 -29 96 -76 136 56 -89 -109 185 -87 71 57 -112 -225 -158 23 -57 -63 -78 38 -43 15 15 198 92 -29
5328 -29 283 148 51 70 -13 86 53 -278 154 40 -73 40 69 42 21 -19 -7 67 136 -23 7 -98 -85 -50 8 159
5354 159 62 -116 164 -29 97 -65 98 -143 11 -105 -14 -8 -44 64 136 103 58 22 24 94 -113 79 -194 205
5378 205 -39 -63 98 -143 0 140 -40 -225 -225 -87 90 -14 -75 55 133 -81 -125 -68 291 191 -49 26 -126
5401 -126 8 1 -119 16 46 32 141 139 -68 49 -106 189 54 -87 -80 -125 -133 -73 215 42 -153 25 32 61 21
5426B1q6K23q0J0j78K42k77M5J94j22j93L69k25O0j56J23K42j16r0J25j0k00L0
5449d9Q9O4j55l8J74j18J45j17K1j43M24l56r9K21J21r0K9o8l84L29J45P1ml81
5473a69O8K1o9J97r6J64k67J07j02R5K0Q6j46R3Q6R5j40j65J82j1K54j59k25J86
5497A05n1k59L18m36K22Q3L3N1j11j44J07J12j77K17L0p7J68k21J91l13L1J19
5519bk58K41j60J1K3K51j65k7kK50j75p9K57j09J0q3L29l38J48j97n7L0m1K20
5543G7q0m7J31o4L61k88n1k4j75j46K47L02j69k72L42j95J01O4k12J27R1n7m1
5566B2k05K45k25J15K70k24j1j37nM7J35j18K33j44O9N8k06RM7J78j76poo9J43
5591C8r5j08J68m4k32J86O3j17P0L02M3k38rJ05k55N6Q2O4J01l85Q2K90j71L5
$$ plain form
5426 21 -65 158 78 88 -90 152 -125 -80 114 -8 -201 168 -57 3 -153 -30 212 96 6 131 121 -79 -49
5449 -49 40 104 -51 -89 85 -33 112 -5 16 -127 297 -59 -158 63 184 94 123 55 -329 0 145 216 212 -169
5473 -169 -101 -80 -149 48 -48 116 -151 -44 -146 -51 -31 55 -91 2 88 183 43 -122 60 49 303 144 -81 105
5497 105 54 -205 113 -323 -101 -18 15 66 -45 -189 -82 30 -147 70 100 23 191 -30 161 -152 -121 -2
5519 -2 -260 -19 -179 -168 -145 106 -59 -86 -88 162 -13 -92 165 56 66 -17 312 -26 122 -75 -132 -102 -143 77
5543 77 -3 -50 81 17 378 90 39 15 -160 -306 -59 243 74 -198 144 -51 50 114 -98 29 120 63 22
5566 22 -183 62 -163 -48 222 -2 -13 -150 -155 -108 27 -91 142 -2 67 125 -81 -72 -25 153 -23 -30 -36 -105 38
5591 38 -57 -165 3 -41 -273 -87 -24 -141 -71 231 274 36 27 132 -123 -67 15 79 180 -205 -123 167 -4 31
5615C1m0J04l02L59o4p2J41q5j17R6J04k33J49j78J93m4j23J18l8J82o9j41M1
5638A2j61o6Q2K04p3pj99Q9K78k31J13Po6R2j6J34k85J39k05r7L92k08J25K13
5662B66k78R0j90J96k2l3K0rK0J2J9o6P7nk22j56K73L0J44k98P1Q0j35jP6L9r6
5689i8K69m3j19j59K16J57k92P2K73l86N4J23j5n0k3k05L78j2k06M9K18j82p8
5712e9qj01J27K17m5j45J53n7m7L6j16R4m4j03N4p7n1K99J6j58K0l0k1m1J66N8
5738A37k45L01q9l8J61m28J45L03p9j9l65J78r9q8K65M9j41O7l29M12j62J23l5
5761B4j65L64R7l02R8k78Q0J31p4R8Kj98K05J3N1j30J41j48M5R9k59J34p7r0R4
5786d5m8K34j29K2J8J0k0j26K43j30N8k4J13k24K16m3J60j02j1j69J02m5j90L78
$$ plain form
5615 31 -9 95 -207 152 88 16 157 72 -45 51 155 -78 71 -107 86 42 -81 37 -1 181 112 -29 12
5638 12 -149 -215 -133 71 -2 -9 -208 -119 159 -72 41 48 -18 74 58 192 -93 46 -159 -256 136 -72 53 266
5662 266 -12 78 -112 84 62 29 49 40 60 72 91 25 102 97 -125 -281 -8 22 166 -132 -61 19 -116 -117 -41 -2 -98
5689 -98 171 128 9 -150 66 223 -69 3 276 -110 -56 67 52 2 -21 -226 152 140 -66 -17 201 19 -59
5712 -59 -67 -168 -41 176 131 -14 139 82 35 71 -45 49 5 -98 -44 -121 -172 127 143 -15 5 -25 -46 -87 79 137
5738 137 -108 193 104 66 227 -201 -56 247 168 149 -216 -38 -137 -225 40 89 -52 15 -314 98 -64 59 24
5761 24 -141 223 320 18 116 -162 -82 49 -25 73 75 -123 82 95 146 16 157 9 54 153 -106 28 -49 -139 -45
5786 -45 -93 141 12 34 52 62 42 -84 159 29 87 63 176 -48 168 125 285 183 172 3 105 60 -130 248
5810B48l06q9LJ55j77J24k5M2nj14J49m3j55L30K5j69r6J30p3N5P5l7J63l21K50
5835A39k35J98p2k27K86k0n9J9l4Q8n8K14k61R0N3R4k86L9J5j0J95k13J67l3k22
5860a33J56q2l7K29n2k81N5K35q7N9J15j57r0N7J45j49m3N8k33J98J11O9k41O8
5884c0J75n6k39K17k27K42q0J15j12P7M3J68n02L43j46J54m7k58J20o8L56k71
5906b6J82k09J28j85L17P7m11K44j65L8L18k16k69o6K21N5o3M7J65j72r1j58M05
5929A66k42M0J29j43L5J79j67k58M8L40j27J09r0Q5l8j46RM2l4J67k40L48r1r4
5953B7l0j62J38P6k00L69o1o5j04J43J03j74k16J35k82L62J1k0j02M2j73J48j8
5976e3j41O0j1O1K6J44J16l60L67k28J30j61j8mK36k32lM9j9j58N6L73k37L9k25
$$ plain form
5810 248 -58 -147 -144 11 -166 -42 -67 -25 -30 -144 5 -38 -193 137 162 -7 -103 27 -46 9 84 47 210 -111 139
5835 139 -96 102 30 -197 89 69 10 29 -5 83 25 239 -22 68 121 215 -71 -32 -17 -27 168 -45 122 89 -133
5860 -133 23 -59 -96 133 81 -200 -145 90 3 62 177 20 -70 -13 132 -17 -60 -2 -235 -37 74 143 -98 -30
5884 -30 145 89 -150 67 -160 82 2 117 5 82 125 293 -209 134 -12 142 95 -163 -43 -111 245 -26
5906 -26 156 -53 75 -110 207 284 -127 117 -48 -10 308 92 -177 -243 -22 33 -30 17 182 10 -81 -239 166
5929 166 -76 -36 93 -50 -15 164 -3 -261 -213 127 0 109 19 104 66 -80 -71 -29 -63 104 -136 212 121 27
5953 27 -3 -165 -27 49 -151 218 157 92 -12 131 234 60 -156 -21 -303 59 70 50 -52 -10 -183 -35 -53
5976 -53 -194 -134 -145 -84 -58 86 202 -158 209 -19 111 -50 -68 -72 164 -68 -71 -22 -41 -199 -143 230 -7 32 -193
6001a93L97j07j82R1K6j67L88m09K7K78k45L6P4q4J3M0l1m8J36Q1k06r2M07k63
6025c3R5k20O6Q3K0J71k30J09J66j61oJ11j3j65r2K49k33r2J56Q3k10kN1M26k39
6050I0L5o7j10L2p0K45l86L65K0j87j22L41l64J30J24j41J5K3N9j01Jm8L91m32
6074a57K16m00K48M0j01L23j05j65K42l7j75J02K51k71J19k23J2R7k12KoJ63N2
6097A5NJ13j52q9n9J16R9J6p1KK9l17L20R8j40R9k57l1K34N9k09M8K30m3L7M5
6123A97j04j16J96l41N9l47M70m1j88L37J18j53j70P1J38j15J24j09O2K1j11q7
6145h9L74k36o8k8M3Q1j40J22M3r8j26L0k51L07J08m5M5M4O1m4j30P3j75K30j72
6170d1k4rJ89M4m54K60r4K61k41q7J78J31k3j38p9J51P5k49K98m8j25K30j11j22
$$ plain form
6001 -193 204 97 -85 6 32 -135 253 -156 -129 149 -96 -60 14 -70 -57 -17 -48 -96 40 121 -85 -177 230 -33
6025 -33 62 -158 -92 -9 11 182 -48 61 227 66 60 171 158 -7 -99 150 -83 -175 -19 64 -146 -148 -97 329 90
6050 90 125 58 -52 -20 -90 155 -231 134 154 -33 -155 186 -178 -48 76 -65 -50 -27 32 -69 -68 -116 275 -157
6074 -157 59 -341 -93 -53 -154 169 64 -101 141 104 -71 31 282 11 130 -93 -81 16 -196 -194 -200 -37 15
6097 15 20 133 -19 -108 -167 -51 48 64 -7 -5 24 -293 27 125 -15 84 -173 -204 30 89 -120 -72 158 115 152 197
6123 197 93 -23 173 -168 -109 -456 14 -27 -215 122 240 87 -83 -12 126 11 135 26 88 109 -2 -89
6145 -89 285 49 -19 -47 -4 77 -63 59 102 4 -122 -92 -343 -36 72 27 72 116 177 133 3 76 -99 131 -41
6170 -41 -65 -74 115 159 -295 -35 -129 132 -109 -196 -18 113 90 -48 -127 24 99 -150 148 100 -25 205 94 -28
6194b8k4j56J44J22p8OL8L0k30J10J22l2j00J13N6J4J06k18O8nJ06m9j54J41j48
6219d6rp5K58j28Qk4r2JK41p4j53J67n5J32r5l02J28j0N1J79pj63r3J88k7l0j5
6246d5J25p0l1R7M5o6l1M6l16N07j95j11M4N5Q1k39j1K66n7K2k40o1j1K81j97
6271a12K4P1L5j14K41j62k7M8j09J80j16l6j43K89j86K59k04j0Q3N0j48LK38j75
6295b1K3J40k0j24J33n6j45p2o0K02J5j4j07j25K74p2M5k4K0J5J4k59J09J20p2
6320f1J38k58L13q3j05J4M4j80L14J9j72K25m03J71m8J32Jn3j18K74j68k02K54
6343D8j32K28k47K26k44J05Q2n8J47k11L00l41K8K47k51J7J7r5K64j03l1l1J65
6366A30M1%k17k0L5k47L26j22N5J8j96K73j10L5P1N4k97K86N5l64K86n5L0o8Q3
$$ plain form
6194 -28 -52 -208 -64 58 -20 -14 24 54 -176 -66 56 24 -76 37 93 107 213 -5 63 58 164 115 -39 102 -46
6219 -46 -55 -130 128 0 8 -16 -108 -107 134 60 -93 74 19 151 56 -246 -118 -128 -77 102 95 -68 -161 27 0 -30 -45
6246 -45 80 10 -21 76 121 55 24 70 -246 261 66 -45 -1 54 135 -104 -115 151 94 116 -124 -185 -196 85 -112
6271 -112 -88 -17 18 -96 145 -17 -44 4 -105 75 -41 -77 -220 69 -117 142 -62 -72 11 61 -87 -84 154 -21
6295 -21 2 142 122 -2 131 75 -70 -142 -202 0 15 1 -106 -231 43 -29 16 -8 12 27 41 -218 -109 11 -61
6320 -61 77 -181 132 49 -56 -42 2 -178 136 155 -17 208 -195 -24 -72 60 61 8 -110 164 -4 -206 48
6343 48 -84 144 -103 123 -121 -16 66 8 155 -56 244 -97 -69 178 -73 -56 -39 -134 130 27 -4 -35 130
6366 130 171 171 -46 -66 -31 -278 48 -74 -19 -1 -197 76 -34 1 72 126 -171 115 170 -194 92 37 67 -1 82
6391H2p5o2j73J53O8l16L37N0p9j02n1M5J33j10R3R2j41r1L08lj79m5j35J76j53
6416a78L49k17L8L1M3l42L04j06k8L6N0J43J6k16K98k57o3qJ26J10q0K9j48j02
6440a72K08kj34n7K1L16m9r0j08O3N9J7j20J16o7m6J22p6L4O5k03P9N0r1j9J34
6466E0l3K8j48m7J41O4q8J55j96l6P2J18J73l0o7j64Nj31R2J32k36K51m07J48
6490a54j9L72l9k62j05K01j27Q7J90k00R1L7j55L01o4l18K9J88K2n4l61J90M16
6513B66l24k3K98k80j38N8o9qK26J15l11K57p1K43n0k24n8J5QQ0j3k4RL8M1j12
6539e1R1L5k9K9nk26M02j72Qj68J80j63Q8Q7j65O9R1L0k29K13o2k7p9J45J03k50
6565e5lJ7M1L1Ol9Kp0j05K18J15l20J19O1r5J33J2q4O4n6k0O7RJ14j30n4j3j99
$$ plain form
6391 82 7 -55 -228 -75 -7 -323 14 64 -15 -117 -168 -123 10 -100 -7 85 -56 -147 161 158 -21 -66 -201 -25 -178
6416 -178 171 -46 -8 23 66 -276 28 -78 -106 -70 -20 123 139 -77 221 -36 -99 -107 19 129 49 78 -70 -172
6440 -172 36 34 -100 -157 -136 180 131 41 -67 -4 55 72 -48 68 1 -45 77 1 35 100 -103 -24 26 -65 -84 50
6466 50 17 45 -103 -150 -9 55 -33 122 -74 -110 -38 80 253 223 156 -8 -3 -134 -42 90 -146 105 -302 -154
6490 -154 -173 199 160 -102 -207 -6 -133 -46 144 -56 35 72 -83 218 154 -164 -135 53 75 21 -340 -150 266
6513 266 -58 -81 217 -63 -201 -143 -212 -220 6 121 -190 67 -4 239 189 -35 -93 -78 -70 10 -3 -27 -18 20 61 -51
6539 -51 40 75 46 75 70 -156 246 74 82 -86 94 -69 19 106 -59 10 101 131 -98 115 53 26 -53 92 195 -55
6565 -55 -58 -41 0 31 37 -2 0 -70 -175 43 158 -162 -43 18 -77 56 68 -16 48 -8 -28 39 48 162 32 -22 -35 -234
6593b34M30j84m7j2j71O2K44q7j53M4L75j93j26n4N5Q1J74k40n3L7R1K16k34J11
6617A32j37j61J65J69j49L9r0J31j00P0q7j30pK23O5j22j37J94Jm4J80j16J63
6640B52l07l5J47Q8j62j61J18J8q2J84j63K3M6K13m9k12Q9J17L3k50j12L18J45
6663B58q4r8j05J20k34R1J51k25K77k90K97r3k33J81J06n4j51J35j18R0j89J9
6685a49L54l14%K46j30j68K16j05J00M9j06L34n54J94Pk03L26r4K20l5j01k83
6707a96K47k04K6J3R7q9J50o2O3J05j05k04K72rj5o6R0L4k38J34j71J53r9M3J06
6732G5k72K46n1k4P4P1j75P8O2p0R1q9O3Rj26J00K2O1q3Q6k77J92k62J34Q3j8
6758@J39k45MR9K84l07k0J33l6N2j6L3j90J39R5jj96K27l22r4J31R1l7J1J86k80
$$ plain form
6593 -234 196 12 -35 -47 -218 -156 88 1 -152 -108 267 74 -52 -106 -51 30 204 -36 -89 -52 39 255 21 132
6617 132 -5 -166 -1 168 19 58 -32 99 -1 69 -18 -148 -155 68 133 11 -126 68 69 25 205 89 252
6640 252 -55 -90 57 145 -17 -178 -60 -42 -124 60 -103 -80 -34 179 130 -82 7 124 157 -93 -205 113 258
6663 258 174 76 -29 91 -143 -52 99 -126 151 -139 158 65 -168 13 119 65 -86 49 -69 21 -168 -149
6685 -149 205 -109 -109 137 7 -161 55 -50 50 99 -7 327 -227 -33 -26 -229 97 3 223 188 87 -196
6707 -196 51 -153 -127 -114 -17 -106 44 -18 45 150 45 -159 113 104 89 23 113 147 -91 43 -128 25 -74 -31 75
6732 75 -197 49 -2 -26 48 119 -56 22 84 14 105 16 79 88 -38 62 84 145 62 148 -129 63 -199 -65 18 0
6758 0 139 -106 -102 -3 281 -26 -46 87 51 103 87 120 -70 69 164 163 -33 194 -128 -222 -91 0 -37 -26 160 -120
6784a20K43j24j50K56p6j90j77N27p0j77J72n6q3n3j13N5J26J9K9J74j28j61Q7
6807A0N1k15j33J91J6M2R3J35M3n02K27J29J20m90M7K26j2O7j50K68j42O5j11
6830b5j5K65j61J46j54m7J0l3J7R2j92j06L11k22R9J54k06Q1k1J7J00j39K9R0
6854I0k5N3M1J82m71N6L1m9K54O3n01O6L17O3k00K22k4p1j61l8k9Pj19K66rk74
6880b60K42k8oK4R6o8R1p3q1L8O9Po0j8n8J44M3j9k65J09J33jJ06n3o8qN7k42
6908a49J38O1J29k15J50J16k15n8p8J75p1K18m16K87L1j58L3k39J96j18J54mJ37
6931A04k18K34k18J88J52l10q0J15J8m5J16j21l6J21k8J86j48j90K78j65J65k82
6953a64J15P3PJ08n5q1q7K37n5k08L52j71L5m9j48l32L22K65m3j26N9k34K07J69
$$ plain form
6784 -120 123 -1 -151 105 29 -161 -338 189 119 -58 114 58 -25 -78 -191 -136 -10 9 38 212 84 -77 10
6807 10 61 -154 -287 -96 -80 -38 55 190 233 -269 -42 87 207 -283 -236 -10 -22 45 -105 163 21 86 -25
6830 -25 -40 225 64 210 56 9 19 -14 3 95 -97 -203 108 -114 -15 139 -67 14 -7 10 110 -29 0 90
6854 90 65 118 159 341 -130 -74 -43 -92 162 225 -276 -210 107 170 -30 192 168 97 -64 -102 -131 -124 -243 23 14 -260
6880 -260 -18 -46 -52 -28 68 0 91 18 -63 -25 44 51 -9 -27 -85 59 102 83 -182 -73 60 59 165 112 44 36 93 -149
6908 -149 -11 50 179 -36 114 230 15 -43 -121 54 -17 201 -215 72 103 -55 -22 -261 -65 -183 -29 -33 104
6931 104 -114 120 -98 90 242 -68 -148 -33 -15 -60 56 -65 -101 20 -8 178 30 -160 118 -47 118 -164
6953 -164 -49 24 31 139 84 3 -84 153 98 -110 242 71 106 57 -91 -423 -101 164 121 -5 54 -180 27 196
6977A96k11m2QK68k47J14k1J16j6k77L2J92j71J26m0M6j58J07p2N9R4p0q4J38
7001H7k64J92j51k0J08o3K79n5j17p0lK67k17M0q6N8j3M4lj50L7O7Q1M8Lk13K29
7028A15M0l47J16J94k32K17l49l3K32M5l5J53o9L2P3k10j59O3J24J69k69P4K1
7051c5P1o2J43l2j76K0j51L26j80k9OM05k63j47P9j21J65o6K29j43k00K02J5r3
7075c7J00J31j54j17K12m48J89J53P9k83J17l6P1O1m0j37R4n5J27j62R6J14O8
7098A43m3j22O0O2J1k53J68J49j33r1J25k24M6J34q6J00Lnl5j1p2q6L30k77J38
7123C1k8Rj19M8K64j91JJ85l56J08j7MJ66q8k37J58J37j96K05j03J15k50J17K24
7147A87k64M4j52k1K89kp1J38M2j62k68L34j05N0Ro5O0R8j06k6r2N1k56K61p1
$$ plain form
6977 196 -15 -57 -49 219 -28 86 65 181 165 -112 -80 112 -59 67 27 73 -85 22 -50 9 103 33 -51 87
7001 87 -177 15 -136 -156 -48 -111 168 113 -4 -74 -77 190 -27 13 -73 -15 -28 16 13 -137 -100 -33 48 96 99 -114 115
7028 115 155 -192 -76 118 -114 103 -246 -279 -47 -2 -37 116 47 79 152 -58 -217 -154 -30 139 -130 -56 -35
7051 -35 36 -26 117 85 -91 -71 -222 104 -76 -105 -99 306 43 -104 -25 -146 19 -47 182 39 -161 41 56 -37
7075 -37 63 194 40 -77 135 -313 -124 29 108 -175 -58 -94 -23 38 -2 -139 -45 -100 27 -135 -39 75 143
7098 143 100 -22 38 100 111 -142 26 175 42 -49 76 -148 -102 32 -54 46 49 44 9 -2 -74 -160 170 -107 31
7123 31 3 12 -107 -59 205 14 15 200 -156 -48 -65 -61 105 17 -220 -62 75 -121 84 -19 96 -154 -37 187
7147 187 -77 -33 -185 -206 83 81 10 148 190 28 -240 94 -11 39 48 -17 43 141 35 9 -83 -32 -288 -27 -98
7172i8j7J83O4r6j01J57j17p1PL7l3K6J12N4j77OJ78M0k50oN2K3J44j41K1n6J07
7199D8j92K03l0k4j5qk0n8Q3K78k79j2k0J6j26m9K74j12J42j40N7j21Q8Q9l34
7224b62J19K39l21M13m00J10%K41k36m6N5n9L39l24J86n9o0k9L7n8K89j34j08
7247f8J9L06l44K83l08K81j04k65J96j03J45N6k3O3l12J58M6j53J84R6k21J46
7269G8l15K70j06J55oj33L33k34O1n6R8k34J26j27K16l15J92K24l48rO9K2mj74
7293b17K06Or6R9o6J13j55M1nj35M38j75l0J05m7j94J83j67J86Q2j70PR9j36J47
7318A19m2j18N6J03j90J04P5j21n0Q8k07K78k41J29o5pJ02M5J52j81L3Nk38K83
7342A12J2k78J56q8j10O3J93l3n2q1k9J94rj72Q6J98n5j26j4j9O7J98k91ML2J22
$$ plain form
7172 -98 -115 68 132 36 -65 92 -25 -96 -89 -52 -85 -59 53 107 -70 -64 114 154 -96 -102 -50 -27 117 -24 -3 -59 48
7199 48 -144 59 29 5 -10 -18 -38 -96 -13 265 -14 -26 -46 -30 -156 -205 69 -43 99 -41 16 -105 -17 72 -262
7224 -262 -143 96 -225 188 -212 -102 -102 139 -97 -143 -88 -147 192 -132 54 -5 -65 -94 -57 -115 174 40 -68
7247 -68 -49 257 -87 196 -112 169 65 -200 -4 -107 38 94 71 134 -178 -20 26 -127 57 153 -68 78
7269 78 -237 33 -73 82 76 -57 276 42 103 47 145 -89 37 -90 126 -189 3 227 -121 -130 -61 -39 -43 -217
7293 -217 -11 -5 -101 -2 -68 45 -110 -69 -74 -209 229 54 24 129 82 -112 71 -96 90 172 2 9 108 -28 119
7318 119 77 -41 15 118 -72 32 107 -14 -64 24 -183 95 -146 -17 -82 -89 13 58 210 29 62 67 -171 112
7342 112 124 -154 2 -86 -196 -133 60 27 -25 -106 -135 59 50 -122 -36 162 107 -19 -33 -52 15 213 -78 -74 -42 80
7368H0j67J69J03k34J65j22J81k26J37j20J88K7k21J6q0K0J38n1J28r3j9J76l82
7391a87L19j45j95K93r6Jk15K86j42J92p7J09j18k1j41Q3J16N6q2j14P2op3k6
7415a11J40r5L1J31q2q1j17K95j86J45j47J10J16j74j06K42k47K05l5j22j96K89
7437Ej10L24l69J24J49j11J13j85K20m9k52K20LJ03m4k51R2Oo4J21j00K7m4N6
7461a6R3j00n7KJ3J55k20K48k75M5J55O9k12M9k15N43j26l53K01k8M8J44J5l6
7485A42j49m2k9N6J06j03J13P5j19q0R8n0j68J80Q2ko4m7L9J5j41J2O2q3J94k72
7511a75L38k86J2J10j7m8n0P9n3k6kJ19P7l9k32J72N6k10J31J01r9M4o0o0K9k11
7537c00N42l6k19k23K28j06K46j07J6j05J11r7o1M6k0K01l9k89J91P7j02K29j08
$$ plain form
7368 80 -87 82 185 -49 116 -6 175 -51 86 -34 154 181 -40 -24 -104 -84 54 3 131 38 19 195 -187
7391 -187 132 -13 -208 85 -11 -10 -225 61 -81 111 34 143 25 4 -137 -54 62 118 36 -78 -6 -12 -85 -111
7415 -111 29 -66 -35 96 14 -67 -184 111 -75 70 -77 33 149 -25 -131 111 -136 69 34 -88 -284 5
7437 5 -105 219 -150 -26 123 12 125 -60 160 111 -141 79 82 185 141 -110 -18 -12 -76 45 -55 -28 -72 -16
7461 -16 77 -23 -80 -78 -65 90 -130 118 -157 -112 43 112 -100 -51 -266 277 151 -202 -1 -29 19 163 178 142
7485 142 -7 -49 -78 -22 84 -19 94 169 50 -30 68 18 -150 30 112 110 46 -1 38 53 -88 -76 -14 -97 97 -175
7511 -175 163 -123 -111 -1 -18 -66 -116 -37 -90 -116 -118 1 78 39 -193 -21 35 -175 -44 57 -42 2 -58 -118 -89 -300
7537 -300 242 206 -13 -236 -8 -114 132 25 41 -64 47 -50 -111 -65 -85 116 77 -212 -21 56 -46 183 75
7560G5k8j86l9O0K21p4K4j41pJ52N2j42o6J39M2k0k10K70l39L33k17K91k82J2
7584h0K04r5J08N7j05q9J0J09k39k7O0j89O05l19n1n1n6L6J50r2P1J07k69K71
7608A26L3j35j1q7k6J17k6j56K00J13k25j62K35j9L7j5k47L29j9N5j10M9j62J90
7632H4m3K4j6PP4k40J55J0k5K15j83n3l0r9J58o8kn2K37j84J71j80OJ0J76r3j18
7659e9J95j93M9K48j34O2j82K7m3K15m3j9RR3j60j59J6M6k5K18k03j10K29j70
7683i3L55l77J14K46l01kR9Q7L6j57l4J72j54K41k31J0J76l78K92M0k09J10k35
7706a93K12Pm6QR7O3j18k00J92M0M5N8k95J66m6L2Rr5j2L0j04J48J9k2R6N7K6
7733A74l93K86j65J45m0l3l2J06m9K20n4j19J22m32M65l43J46K04q1M6R6j90k72
$$ plain form
7560 75 47 -139 -178 -118 103 29 53 -88 -95 57 109 -33 -99 40 82 62 -148 122 -217 116 -101 190 -92 -80
7584 -80 124 29 137 194 89 0 10 119 -120 -147 -87 -276 329 10 -41 -92 -148 -112 38 -54 17 124 -145 126
7608 126 159 24 13 -74 -100 17 -9 -165 35 148 -77 -239 -4 -23 14 -1 -248 81 62 117 7 56 -106 84
7632 84 41 65 49 56 130 -110 45 55 30 245 62 9 -21 -120 38 -30 -32 -84 153 -31 140 -40 -34 -24 152 59 -59
7659 -59 136 -57 -8 240 106 168 -14 13 -30 185 142 123 132 225 65 -94 -78 -32 -57 161 -42 -152 77 -93
7683 -93 262 -115 -1 245 -56 -58 41 128 164 7 -27 145 -9 232 1 11 187 -191 101 141 -68 42 -193
7706 -193 19 26 -20 -12 85 148 30 -170 22 62 107 165 -130 36 -10 22 31 -64 -76 -46 -150 -2 17 -5 91 148 174
7733 174 -219 67 -98 47 7 -26 -58 48 -1 219 165 46 168 -264 201 -142 4 208 127 173 269 79 -193
7756a93O0K93Q7j93r1j3j55J22J9K10m21K55J15j85k8K75L8l7j19k2j45K54J45
7779B71j97j39O0J22k77jJ94p4m4j38J98kJ31k17J71o2J87k55K35K2l81K47n2
7802aj09P0l9Q4rn4J48l8mN9l39J37J94k54K21k4K04k00k00l3L32j68J19k29R9
7827c4k62K59J07j52J81j94R4J50k19P5j4O4n9N9Jm8k90K52J16j37%N4L5L2q4
7852a4K20k36L05m29K08j63J9O2J82k46J12Q3k28J91J49j09j92qo8J94lNP6K02
7876C12j97j08j78K78J8o7P8j61n4Q5%j03o6L2J22K03j96O4j61R1O0j14p0J81
7900D9q8R3o8Qq1OK7p0N0q7K68j16j15Q6oO7q7j57K52j49Q2l6J05k62J78J00j28
7927g9Q4K56m55L4J39K03k15m9J15J30l50K03K3m0M1j76O5K69j05l0j17P6l5R
$$ plain form
7756 -193 -133 160 247 54 -37 -50 -205 -83 -64 146 -275 -20 95 -90 -118 157 195 158 39 17 -128 126 271
7779 271 74 -65 -5 117 -160 -161 33 -41 -85 -223 -25 -27 104 -113 58 -4 183 -72 163 185 -196 51 -1
7802 -1 -110 -40 -79 5 -4 -58 90 52 48 107 -232 -95 99 -155 66 42 246 46 -154 -187 145 -23 96 -133 -34
7827 -34 -296 -37 70 -82 99 -95 -1 149 -70 5 -9 55 -4 55 56 8 -282 -30 86 -51 -51 3 38 70 -14
7852 -14 206 -30 275 -154 54 -109 -90 -28 154 -92 20 103 -125 66 215 106 -86 -94 -162 32 29 34 110 312
7876 312 115 7 -171 107 125 58 136 -25 -79 6 6 -97 -163 -131 -9 194 -2 62 -99 -8 52 -62 -132 49
7900 49 -39 54 -14 -6 -87 -81 -54 -124 -74 -161 107 -9 -124 -38 -44 23 -64 -221 31 -118 -36 -72 33 -229 -51 49 -79
7927 -79 5 261 -194 -160 -21 182 -33 -82 33 163 -187 16 39 -1 40 -136 -71 198 93 63 -54 22 -13 -4
7951dJ57l20K65j70Jk4j03L58j6R2l47K0O3j76J44R1J7L3k15K00%q2%n9M2m9J3
7978f9l1P5k02Q9J42k78L15j5l6Q9j45j43Q4J06n8J59R0o1J18l34J85M9l31J84
8002a8l6P1J20j61j10M2NJ2R1N5k04mK97j33k09K41q3p5K25J46l62k6K5Q0mOm3
8029e2K28q0j79K06j43J47l1R7k93K4O2rj1p3n7L06j31k5l2L07j35R2k25o1N0
8054a8l7n7O0p9l6K49k81K06n0O2k08L11l24K26J02k08J84J5j91J22k74n6L29
8077D7j64L0J31J08j54J94j99J05Q6k41J20q4L5Q7j48l7o2J26q7R3j38R4K34l34
8101a58J35pJ52j21J14j31J78j34r2r9J86L1j40J36q6J52n9R5k99J30k19L65l27
8124a98K23J28k67J57j03JJ18J78k00o7n1Q5k72L14M6q6J33m23K79j2J0j75j43
$$ plain form
7951 -4 153 -167 98 -72 -71 -95 -198 160 144 236 -111 -91 -28 -204 -60 31 48 81 -134 66 66 -16 -16 -75 -33 -82 -69
7978 -69 -100 -25 -227 -138 4 -274 41 26 -10 79 -66 -209 -125 -19 -77 82 172 111 229 -105 80 129 -202 -18
8002 -18 -54 17 137 -24 -134 -92 -87 -75 16 71 -133 -137 160 27 -182 59 -24 -99 126 272 -90 -116 -91 -11 -15 -9 -52
8029 -52 176 96 -83 123 -20 127 96 193 -100 -76 -14 -23 -34 -107 -164 142 11 -14 -46 261 126 218 -7 -68 -18
8054 -18 -55 -112 -52 -131 -167 82 -199 7 -43 19 -189 122 -202 24 126 -82 102 117 -74 48 -226 -282 47
8077 47 -117 -87 44 152 -2 192 -7 98 184 -57 63 -21 14 101 -47 -84 -146 -20 -107 -14 -152 -58 176 -158
8101 -158 -23 -30 122 1 115 -16 162 28 -64 -163 23 54 -86 50 -36 116 57 152 -147 -17 -236 129 -198
8124 -198 25 153 -114 43 -60 -59 59 237 37 -30 -81 4 -268 46 92 6 139 -284 -5 -17 -7 -182 -325
8147c25M76N9J3k99Q4o4J6n3J07J37p7m4L5q3N6K1j80MJ23J10j21K4p9n5O3R2
8173D0j68J99J33n7k23J27m4k17L49j39j79L6Q3M4j97R8J09j53
$$ plain form
8147 -325 151 210 223 -76 8 -56 -40 -93 14 151 74 30 65 -18 38 59 -121 -117 6 116 -5 19 -60 -115 -52 40
8173 40 -128 71 204 147 -76 51 7 -210 139 0 -179 -143 -60 -16 -213 -115 -6 -159
8191a59
$$ Imaginary data points
##PAGE= N=2
##DATA TABLE= (X++(I..I)), XYDATA
0@%%%%%%%%%%Qj6J6j7K5l2M0n6O4p2Q8j11J35j59J86k15K52k95L40l88M46n10
32b71N76o50P37q32R36j052J178j315J464j627J806k003K218k452K707k985L290
49A725l627L995m401M850n347N906o535P244q054Q992j0090J1398j2986J4963
63H033j7502K0900k5714L3110m6041P5096k60150P8185N00828k26451l24485j4231
75a98422K37738N2371m3872p4335l1582J5666J11516J2821j18901q3940J23451
86B511J33251p2637j95816O043J87188P3235j38543j01314M5716P9012K2077J367
98D2090m6560o8740K8655J08005k480r6532q782P1135R42m3562P755J8383k1437
111a1128R937L5434l3790o0584L3750P8397p565p6139k1973N5817L6971k8727
$$ plain form
0 0 0 0 0 0 0 0 0 0 0 0 8 -8 8 -9 16 -16 24 -32 32 -40 48 -63 72 -87 99 -116 136 -159 181 -207 239 -271
32 -271 305 -345 392 -440 496 -556 622 -693 771 -856 950 -1053 1165 -1287 1420 -1565 1725
49 1725 -1902 2093 -2308 2542 -2805 3101 -3434 3810 -4244 4748 -5342 6056 -6930 8033
63 8033 -9469 11431 -14283 18827 -27214 47882 -212268 -134083 366745 140294 -184191 -198422
75 -198422 39316 91687 47815 -26520 -58102 -42436 69080 81901 -37000 -120940 2511
86 2511 135762 63125 -132691 -126648 60540 133775 -4768 -106082 -60366 18646 40723 42090
98 42090 -4470 -73210 -44555 63450 60970 -35562 -44344 26791 27733 -15829 -8074 10309 -11128
111 -11128 -1191 34243 453 -60131 -26381 52016 44451 -31688 -53661 2156 39127 10400
123A0400k7055J5892P459k0563J2903L8611k6153n9345L0011P0708k7816p2964
135d7912J6657O2265p667m3736M477K4979m836p607Q893l597j4044P779K2406
148A8057k032k6369p204K5317J2955k1316j7737J5128J6100r796j0300N538j405
161c064n973J4295J2361j9179j8266J4683J9527l244r360l547m713L392J3960
174A0872j180j8422j112J9112K794k3845j1450K4929K5302j7648l6196L158L7685
187A3999J3004k6228k0001Q882J7432R236n900j8241o630J7841J2493j6407j6325
200a6845J4926J9977j1146k6177j529K6567J9132j5204k9611k543K6029J7921
212B1497j0518j8291k521J0027Q761k435j0250j912J0947K441j3519p566J2439
$$ plain form
123 10400 -16655 -763 6696 -13867 -964 37647 11494 -47851 -17840 52868 25052 -47912
135 -47912 -31255 31010 23343 -20393 -15916 9063 4227 -3380 5513 1916 -12128 -4349 18057
148 18057 16025 -10344 -17548 7769 20724 -592 -18329 -3201 12899 3103 -7197 -1659 -3064
161 -3064 -9037 5258 17619 -1560 -19826 -5143 14384 11140 1780 -1767 -6480 -3088 10872
174 10872 9692 -8730 -9842 9270 12064 -11781 -23231 1698 27000 9352 -26844 -23686 13999
187 13999 27003 775 -19226 -10344 7088 16324 10424 -7817 -14447 3394 15887 -520 -16845
200 -16845 -1919 18058 6912 -19265 -20794 5773 24905 9701 -19910 -22453 3576 21497
212 21497 10979 -7312 -9833 194 8955 6520 -3730 -5642 5305 7746 -5773 -13339 -900
225i00J3821n390j7664o617J3138J6625q10j8061p323J2657R737m004n409R61
239G61J352l142l455K550P419L243q519j3637K005J6680O762j0553j2023L55J2175
254A973O984o032p975K326Q572K72j0117k320J1012O298q815j1973J163J3456
268D824P147j0216j3954L4J4939J0492r653j5086J105J3913Q455p171j1125J203
282e093R760L084o798p731M515J0701j564j2658n874R066J3074k712j6550o551
296a5331J3015J5383l760j7458m293J3821J0089m581j0198l690P283O976l733
309C523q053J007Q704J067j2358n699J0068J0934k452j2275p937R493J5043r1
323A0974j4064q221R269J1437k313r111k217M876M938m536p346L422R493j799
$$ plain form
225 -900 12921 7531 -10133 -16750 -3612 13013 12203 -5858 -13181 -524 9213 5209 -200 761
239 761 2113 -1029 -4484 -1934 5485 8728 209 -13428 -11423 5257 12019 1466 -10557 -10202 1973
254 1973 8957 2925 -5050 -2724 5848 6120 -3997 -6317 4695 10993 2178 -9795 -8632 4824
268 4824 11971 1755 -12199 -12165 2774 13266 3613 -11473 -10368 3545 12000 4829 -6296 -5093
282 -5093 4667 7751 953 -6778 -2263 8438 6874 -5784 -11658 -2592 10482 7770 -8780 -15331
296 -15331 -2316 13067 9307 -8151 -12444 1377 11466 6885 -3313 -7003 280 7256 3523
309 3523 -4530 -3523 5181 6248 -6110 -11809 -1741 9193 6741 -5534 -13471 -3978 11065 10974
323 10974 -3090 -11311 -2042 9395 7082 -2029 -4246 630 5568 1032 -6314 -2892 6601 4802
337D802j1626m383J0064J0080k885j0620o219O132J3704K727j2890q361P216R415
351G156j887p416L15N515m62p066m126N571J0507j388j3964n930J0726J2358q84
366I025j2772p384P225J2094J657j0963n995P662O541n949o033L149O650m05q098
381c596o054M395J1734M145j2126j2684O690J6001L077j1598r171M626J0595K253
395H287q123n107N382O137n805q204L454Q625J052o670p093P99R520O708p145
410A817j1770L000J3135L076q697o215K555P799K663p694o340O387P985o002j1216
425i517L495J1593P76q069o559K398R361N652q277j0780M286J3576K325j0169
439I1o884L510P697L340p275r069N664J1017l820j2874L23J2060M300q039q552
$$ plain form
337 4802 -6824 -11207 -1143 8937 6052 -4568 -10787 -4655 9049 11776 -1114 -9475 -2259 7156
351 7156 5269 -2147 -1832 3683 3221 -3845 -7971 -2400 8107 6719 -7245 -13175 -2449 9909 9025
366 9025 -3747 -11131 -3906 8188 9845 -1118 -7113 549 7090 1141 -4892 -1743 4907 4502 -3596
381 -3596 -9650 -5255 6479 10624 -1502 -14186 -7496 8505 11582 -16 -9187 -4561 6034 8287
395 8287 164 -4943 439 6576 771 -7433 -3979 4646 5698 -972 -8065 -7266 2254 8962 1817
410 1817 -9953 -6953 6182 9258 561 -5654 -3099 4700 7363 -331 -6671 -284 7701 1699 -9517
425 -9517 -6022 5571 6347 -1722 -8281 -5883 3478 9130 853 -9927 -5641 7935 10260 91
439 91 -6793 -3283 4414 7754 479 -8590 -2926 8091 4271 -8603 -8280 3780 8080 41 -8511
454h511j91J1148J0014p415j4938J740J3630L769o630n469p87K515M844p84o511
469c576l0P283j242q272j07P148L548k338o512k487O620Q294l659r338J596O651
485C579k187k773M388P22n635j823J003J346M068K626o842q248M755J0242J491
500F712o081n776o39Q708P750q607j0766O780J0846n024j0777K245R863K427p208
515D53j0220m16J4436R230j2221j3625L247J2185P971k972j3208r163J2475J8275
529A6447o727k0964J786J7131J334j2599m902P283P450j838j0051m608Q341J0464
543H547j899r553n514K079J0503J0411r211j8870L803J9973K278j5379m922P730
557b4L409l658j047k82J710K963m937n718O248P824l045n621o49O65K713N814
$$ plain form
454 -8511 -8702 2446 12460 5045 -9893 -8153 5477 9246 2616 -2853 -3640 -1125 3719 2935 -3576
469 -3576 -3606 3677 2435 -5837 -5944 1204 4752 2414 -4098 -6585 35 8329 4670 -4668 -3072 3579
485 3579 1392 -1381 3007 3729 -1906 -3729 -2726 -1380 2688 5314 -1528 -9776 -5021 5221 6712
500 6712 631 -5145 -5784 2924 10674 2067 -8699 -1919 8927 3903 -6874 -4629 5234 7661 453
515 453 -9767 -10183 4253 13483 1262 -12363 -9116 3069 11040 8068 -5140 -14303 -1828 16447
529 16447 9720 -11244 -9458 7673 9007 -3592 -8494 -1211 6239 4401 -5650 -10258 -1917 8547
543 8547 6648 -2905 -8419 -6340 4163 14574 5363 -13507 -9704 10269 12547 -2832 -7754 -24
557 -24 3385 -273 -1320 -1602 108 3071 -1866 -7584 -1336 6488 3443 -2178 -2827 -2162 551 6365
573F365j006j0101j251R835J286o015n86J786j514j183M80J454L957q28r065k614
589i000J2794Q000j1818r168O613O842l14p02k813m408K102N351j356m894J735
604a036K874k737j644Q6J145M918J605r896n930J1268J1165n841j1591j095O467
619b42N792J594o981p018M685O693l559m297L053J863k741j565K43Q70N065K727
635F182q006p402O935J0875j490q293m172K363P105K085o717n220N353M509n979
650a872l528O278L270m518l491L37K442M714J819o230n462M374P435k1n164m412
666d029K19O168L054n842m828M888L942m545l815L536L828m11k814l569R61O912
682C655L634o832o110L239O434J038l907m311m20M855K872n057l933L963L669
$$ plain form
573 6365 5359 -4742 -5993 3842 5128 -887 -1473 313 -1201 -2384 -1904 -450 3507 2679 -6386 -9000
589 -9000 3794 11794 -24 -9192 -2579 4263 3949 3247 434 -3974 -1872 3479 2123 -2771 -1036
604 -1036 1838 -899 -2543 -2457 -1312 3606 5211 -4685 -10615 653 11818 5977 -5614 -6709 -242
619 -242 5550 7144 163 -6855 -2170 4523 964 -3333 -280 1583 -1158 -2723 -2480 -1610 3455 6182
635 6182 -1824 -9226 -2291 8584 7094 -1199 -5371 -3008 4097 6182 -535 -5755 -402 4107 -1872
650 -1872 -5400 878 4148 -370 -3861 -3524 -1082 3632 5451 -779 -6241 -1867 5568 5547 383 -4029
666 -4029 -3810 2358 5412 -430 -5258 -370 3572 -973 -4788 -1252 2576 2165 -649 -4218 -3257 3655
682 3655 7289 457 -5653 -2414 4020 5058 1151 -3160 -3580 1275 4147 -910 -4843 -880 2789
697B789l151l340J487L859J532k705m217N42O504K940n573m893K493M656Q2k949
713E6k981Q34M127q5m802j026M814J931m226k497K704L228J398k150m501N08N870
730C202K101m828m092J772M324N67l192l089Q06M346K33m842j298N247J937l303
746a09l586R68N341L056l810o189O26O757K968n127m110P16L035K063j778l608
762b787K93L364K33l637p58M798K598l680m299L91N341M758l545o787o91O002
778A594K870k452l736j107J933J683o73j613L50K781j699l581J373M623J845k669
794A522m330k21M042M041j418n537j843M094K685k182k430l96J978J340k806j613
810c074L436K847k045m868K46N513K624k750m276r67L759M042k087m573o44L176
$$ plain form
697 2789 -362 -3702 -2215 1644 3176 471 -3746 -3204 3300 6240 667 -4226 -1733 2923 3005 56
713 56 -2925 -2091 2036 1951 -2851 -3877 937 2868 -1358 -3855 -1151 2077 3475 1325 -3176 -2668 3202
730 3202 5303 475 -3617 -1845 2479 3046 -146 -3235 -2429 1917 2150 -2692 -3990 1257 3194 -109
746 -109 -3695 -2727 2614 5670 1860 -4329 -3703 3054 6022 895 -3215 -2499 536 2599 821 -2787
762 -2787 -2494 870 1103 -2534 -3292 1506 4104 424 -3875 -3484 1857 6615 3070 -3717 -4408 1594
778 1594 4464 2012 -1724 -2831 -898 785 112 -1501 -1151 1630 -69 -3650 -2277 2346 4191 1522
794 1522 -2808 -3029 1013 5054 3636 -1901 -3744 350 3035 853 -1577 -1973 5 1345 -1461 -3074
810 -3074 362 3209 1164 -3704 -3458 2055 4679 1929 -2347 -3314 445 4487 2400 -2173 -2817 359
826C59K036k173l018Q22K892O78k852k619L218M657j872m902j128M691M515j837
842C467n538j945M042M325j791m836r21L327J659j323k253J00K212P91k380j784
858b848K328L974n05m884j674L984L930p00m607k694L173L686j080l897r98K264
874e48J913j456k057Q48K391Q27k942k209L048L941p77m680j539L345L459o92
890B872l744k489J975M074q15l411j533K506J869j283k116N21L114Q72l043k731
906c362K701N337j262m558k087K541L843J54l372l247P82M086Q04l459j566J855
922h10J520r04j321R87K062N36k501k390J861M268L57l812k786J182K900J823
938B972k316l559P84L534p49k763R01K781n38l372j42K823K388o5l304k316K175
$$ plain form
826 359 2395 222 -2796 -1974 918 1596 -1256 -3875 -657 4000 2128 -2774 -3902 789 5304 3467
842 3467 -2071 -4016 26 4351 2560 -2276 -3197 130 1789 466 -1787 -1687 525 1316 -1064 -2848
858 -2848 -520 3454 2949 -1935 -3609 375 4305 3605 -1002 -3696 -523 3163 2083 -1814 -2812 -548
874 -548 1365 -91 -2148 -1300 1091 1918 -1024 -3233 -185 3756 2979 -1701 -3240 105 3564 2872
890 2872 -872 -3361 -1386 2688 1873 -1538 -3071 -565 1304 21 -2095 -1574 1540 2412 -631 -3362
906 -3362 -661 4676 3414 -1144 -3231 -690 3153 3307 -65 -3312 -2530 1556 2360 -1099 -2665 -810
922 -810 710 -194 -1515 -528 1534 2070 -431 -2821 -960 3308 3665 -147 -2933 -1751 1149 2972
938 2972 656 -2903 -2119 1415 666 -2097 -1196 1585 1047 -2325 -2467 356 2744 2679 -625 -2941 -766
955g66L703L8l366j896J249J920Q22k112k505K020L275k266l791J549N014M52
971C340m136k888K308M225J778m369m517K453N377m20m173j141Q25J818R00j655
987b75k781J428M126m99n043k81M704K524k578l668o45M616L560l636n803J366
1003b885N093M62k948j426L42L21J850L20l110J01K974L5k818J08K922J403j594
1020A150k543j039K938L763k527m635P00L464l37q99j50r33j66Q31P61j127Q84
1037A35K032k291l064K475L628k23k206k155n21K889K760k077m237M03L163J76
1053H87j063Q5j028k6J567j149j272K783K768l339l535K276M016J05k373k525
1069a823j101L166L903k405m545J82K416Q35j04p26j033M70J537r63j605K848
$$ plain form
955 -766 2937 2975 -391 -2287 -1038 882 1704 -408 -2913 -893 2382 116 -3675 -2126 2888 3340
971 3340 -796 -3684 -1376 2849 4627 258 -4259 -1806 3571 3151 -1022 -2163 -1338 480 1380 -275
987 -275 -3056 -1628 2498 1999 -3044 -3325 1379 3903 1325 -2343 -2988 1628 5188 1552 -4251 -2885
1003 -2885 2208 2670 -278 -1704 -1362 -1041 809 1129 -1981 -1880 1094 1129 -1689 -1581 1341 2744 1150
1020 1150 -1393 -2432 506 4269 1742 -2893 -2193 1271 934 35 -115 -1048 -1214 -383 378 -749 135
1037 135 2167 -124 -3188 -713 2915 2692 486 -1669 -2190 699 3459 1382 -2855 -2452 711 887
1053 887 -176 -91 -1119 -1145 422 -727 -1999 784 3552 213 -3322 -1046 2970 3075 702 -1823
1069 -1823 -2924 242 4145 1740 -2805 -2623 -207 628 524 -202 -1235 -765 772 -191 -1796 1052
1085A052K511l284l159J575L254J037r75l514k323K766M465j360m054n20K123
1100d06N48K5oq36L82J306j983q54L422K107l077l134J177K182J097M32l384k925
1118c927K610M091j414l261J98J137O29L00l85n23R56J287k176j924L539J944
1134C081k278k587K64J838J709j41l048k436K969L099k131j881Q84J35L52Q21
1150F50l18j223J283J724k222j892K950K367k589k750L27J885J614Kl376j834
1166c402L108K094j740j469J263n5LQ51l67j111J949J250l153j655L099K557k562
1183F60k586O9J277J809P22k929k336K606K433j212j721N27J471j02P7j421k1
1200f77K636N68l470j567L068J536j384j451q87J91K065J405k393k181J814K431
$$ plain form
1085 1052 3563 279 -2880 -1305 1949 2986 2011 -1503 -3826 -1060 3405 2045 -2009 -2529 -406
1100 -406 142 167 161 -675 -293 1013 -970 -1824 1598 3705 628 -2506 -1329 853 1950 2382 -1002 -3927
1118 -3927 -1317 2774 1360 -1901 -1703 -566 63 363 -22 -545 411 1698 -478 -2402 1137 3081
1134 3081 803 -1784 -1520 318 2027 1886 -1162 -3598 -629 2470 339 -1542 -658 -523 -171 650
1150 650 332 -891 392 2116 -106 -1998 952 3319 730 -2020 -1693 192 1806 1808 -1568 -3402
1166 -3402 -294 1800 60 -1409 -146 -201 -198 653 286 -825 1124 2374 -779 -2434 665 3222 660
1183 660 -1926 -1857 -580 1229 1951 -978 -3314 -708 1725 513 -1208 -681 790 688 765 -656 -677
1200 -677 1959 2527 -943 -2510 558 2094 710 -741 -1628 -1437 628 2033 -360 -2541 -727 1704
1216A704j294j395P91J001M28o85j630K41K554O08k999j795K111K072o91j430
1232d09j457L1K101J418k079j349J446J328q85j057J037J022p8p87j211k61K639
1249A449J022k924j783Q74K014O86j447j364K00J645N23j590m16K143K90j586
1265b64p31J010J196N41j202j928j26K210J128j895j888O34J482P76q23j468L36
1282a012J789j05j595J35J660Q47j472j306P40J207Q80j179k203Q9K817K40k050
1299e18j467J016J435M72j391r04O12J610J10j410j65J123P62o16j426l7J603
1316H09J429j515k977O5L445R04k417k001J047J412Q40n19j251K42J036J18r03
1333b36k57J169O62q15j435m17J623J558j061k689m31K438J324j158j465j60J284
$$ plain form
1216 1704 410 -985 -194 807 1235 550 -1080 -839 1715 2323 -676 -2471 -360 1712 1021 -409
1232 -409 -1866 -1835 266 1684 -395 -1744 -298 1030 145 -912 125 1147 1069 282 -929 -1190 1449
1249 1449 2471 -453 -2236 -1362 652 1338 -109 -1473 -1273 372 895 -695 -1111 1032 1322 -264
1265 -264 -995 15 1211 1752 550 -1378 -1504 706 1834 -61 -1949 -1315 167 943 120 -1348 -1012
1282 -1012 777 672 -923 -788 872 1719 247 -1059 -319 888 1768 589 -1614 -1525 1292 1532 -518
1299 -518 -1985 -969 466 938 -453 -1357 -745 865 975 -435 -600 523 1285 669 -757 -794 809
1316 809 2238 723 -2254 -2189 1256 2160 -257 -2258 -1211 201 1041 522 -729 -487 549 667 -236
1333 -236 -493 676 1338 523 -912 -1329 294 1852 791 -1898 -2329 109 1433 275 -1190 -1350 -66
1350f6Q59m71n17j10J524l35j594p5J762P17j218j888j28J681J498r45k002n36
1368a844J587J293p77p91j63Q06P36m70j035Q26J272l77j716k01J558R79r59j791
1386a067p26J361J534m10j902m49J395J243r17o60K13N60N58k78q10O29J055n26
1404H03j447l82J293J099n84j673q88J356J660o60j686l78J362R55p49n27J42
1421c04R02K38r64n86P94J527n50k001o09J743J065m63j622j210J675J254j11
1438G78j640l66J489N44o80m07k76J144N07j021j040O80J705l32j754r24J349
1455b44J052qj480r67J008J864p16j303R2R37O73p72Ml84O73L79n19j445P66J379
1475I89j01j565q19M89J328P03r86j534P56J695m3j472K71J149o91k78P7J50P70
$$ plain form
1350 -66 793 322 -195 -305 1219 884 -710 -785 977 1694 476 -1412 -1540 141 1639 694 -1308 -1844
1368 -1844 -257 1036 259 -532 -695 111 847 377 -658 168 1440 1063 -653 -854 704 1683 724 -1067
1386 -1067 -1793 -432 1102 692 -1210 -1659 -264 979 62 -598 -385 175 733 455 -355 274 1329 803
1404 803 -644 -1026 267 1366 782 -891 -1779 -423 1237 577 -1109 -1487 -125 830 81 -446 -304
1421 -304 598 836 -128 -714 80 1607 1057 -944 -1553 190 1255 792 -830 -2040 -365 889 778
1438 778 -862 -1228 261 805 125 -282 -558 586 1093 72 -968 -288 1417 1085 -669 -1593 -244
1455 -244 808 800 -680 -1647 -639 1225 509 -794 -702 235 908 136 140 -244 429 808 289 -1156 -390 989
1475 989 888 -677 -1496 -1007 321 1024 38 -1496 -740 955 912 -560 -289 860 169 -109 -32 118 888
1494H88j46j036j059R32J503k98j530k88J82Q50J037o08j755P72J663m22j254
1511e69N27J347m17j323K5J90J048P39j988j841J387K026m18j518k33K74N00Q55
1529F11K03j598L35J269m85j039P73R46k89p49o88k57J417J591j863k738J258
1546a303K612l75j330m25n4O68J066j79j128J11J219q76n38J097O62j024k12m50
1564d59n61J294J630j461k865J122K287M6j128m63l2N6J528m60j090O68O49r20
1582a59o53J376N60o87q46k48n89J097J904j561k275Q65J775N5l29n53m65L54
1600c79J609l99j441P30J050j410p14J111Q36n96o74n20m99J613J199j486j948
1617a918J020J744o1k71m85r40N32J831p91q83M82N54j285n88J589J07l81n82
$$ plain form
1494 888 742 -294 -1353 -421 1082 784 -746 -1034 -852 -2 1035 427 -1328 -556 1107 685 -569
1511 -569 -42 1305 888 -435 -410 -220 828 1567 -421 -2262 -875 1151 733 -785 -1018 -744 -244 611
1529 611 814 -784 -449 820 335 -704 69 1015 726 -23 -711 -968 449 2040 177 -2561 -1303
1546 -1303 1309 934 -396 -821 -875 -207 859 680 -448 -337 882 6 -532 565 1227 203 -9 -459
1564 -459 -1020 274 1904 443 -2422 -1300 987 1033 -95 -558 -590 -534 994 534 -556 112 761 -159
1582 -159 -812 564 1124 437 -409 -657 -1246 -149 1755 194 -2081 -1216 559 614 285 -268 -733 -379
1600 -379 1230 831 -610 120 1170 -240 -954 157 993 397 -277 -797 -1296 317 1516 30 -1918
1617 -1918 -898 846 785 514 29 -911 -379 1452 661 -222 260 814 -471 -1059 530 637 256 -326
1635c26p46m86J904J535j577k042R06J329L36k63n88n56J84J314p00p78J096N56
1653A098j785j98O74O36J33k00j067j034J509K172j215j854N79P10O44k0n14q22
1671e54N23J013q16j295J404P91j289p54M77K69J11Q13j527o91J595J339j143
1688B66j123N85N07m9L96j67r13N52R80r45p62R01L75r05l15J77K48L03L44q27
1708c72p67J338J002j056p62N77M13j30L13l29m70L00L95p74q01J267M85r67l90
1727g28L9L85R50J88j180r74J461J096r51o93M48L71r8K02p57j99J010J65j564
1746h29l10J219P35p06q32J78K13P97N96j118r05J226P90o64p56L38K54K09j78
1765B57p92j88J197L06j298o71R99P86r8r05m15N31R35K77j013n05P17N52l74
$$ plain form
1635 -326 -1072 -1558 346 1881 304 -1738 -832 497 833 570 -18 -574 -390 924 224 -554 542 1098
1653 1098 -687 -885 -211 425 558 358 -709 -1743 -234 1938 723 -1131 -552 158 802 782 268 -554
1671 -554 -31 982 166 -1129 275 1066 -223 -977 -500 -231 -120 693 -834 -1525 70 1409 266
1688 266 -857 -272 235 186 582 415 -498 54 1034 89 -673 228 603 -302 -617 -440 -192 111 455 -372
1708 -372 -1139 199 1201 145 -617 -40 373 243 556 227 -243 57 452 -322 -1123 144 629 -338 -728
1727 -728 -689 -304 646 834 -346 -1320 141 1237 286 -407 41 412 314 516 -241 -440 570 735 -829
1746 -829 -1139 80 815 109 -723 -545 -332 465 1061 -57 -962 264 1054 390 -366 -28 226 435 257
1765 257 -535 -723 474 780 -518 -1189 -190 596 498 -407 -822 -291 644 921 -92 -597 120 672 298
1784B98m80K57P1K55k68p88M01P07J3r89n25N57J056K07m87q68O1Q81P83r69o28
1805d55O65J48l34o2Q0K88j67l44n39k26J232L22j005p97N85P23O92k47q80m8
1825c69P76M07o22m38N07K41m19o14L84L49O4o06o24N03P41L31r84m15L52P82
1845C46K64l99n56K15P06J69r65L33L62J37o92p60M50M49L72l73j195N29R59M37
1865G88q21q64N25J026J42o26n29K37O46j73m42k11L62L62m61l72j77Q15N25p76
1885b4o98L5R60N95p29q25J21O85O67l29p16j8N35K10p67r8K88M66m66l15j75
1906e98O77L43q7r77P2P48N75m14m01p3J71M89j20m89j06P65k57o47j2M61K11
1927C31m77o82K76O34K49n9q40r6J045K48l60k69l2l4L09k72k16K28L14Lp62M7
$$ plain form
1784 298 -182 75 146 401 133 -655 -254 453 466 -523 -1048 -491 565 772 285 -583 -522 359 1142 173 -455
1805 -455 210 358 24 -38 42 330 163 -181 -720 -946 286 608 -397 -1194 -609 114 806 559 -321 -369
1825 -369 407 814 192 -246 261 502 83 -531 -147 202 266 -340 -964 -461 280 611 -373 -788 -436 346
1845 346 610 211 -345 -130 576 745 -220 113 475 612 -80 -840 -390 59 431 58 -1137 -608 351 788
1865 788 -33 -897 -372 654 796 170 -359 -122 524 351 -91 -302 60 422 -39 -411 -588 227 752 -24
1885 -24 -722 -687 273 868 139 -686 -565 120 787 458 -258 -276 259 469 -298 -396 -108 358 -108 -423 -598
1906 -598 79 422 335 -642 -570 178 753 339 -62 -135 36 525 405 -84 -190 575 318 -329 -341 120 331
1927 331 -146 -828 -552 82 331 272 -568 -664 381 629 269 0 -32 -66 243 -29 -245 -17 297 300 -462 -415
1949d15O84O9m36l35k57P13O33l81p27N6O05L92k44j22k0j97L99n11n19P62N81
1970G30n28j056J72Q87N7j11n45k7R2J050k52p85j32R02L9j73k72k27K76Q9l27
1991a41n68L81J089n07j040J65O76M64J31r29k58N54Q90k96r41M7O66p5k23m4
2011D1k84J56N79m10p08Q9J006l06p82M6N95R9L70m28r05N01J203j36r70N7N88
2032D01j41m31K39j29n3K14l15m77P70M68n59n07J61K02L62P39o41p04J0Q39J41
2053E89p04K32M37p95J37J4J70Q8Kp03n30J061P20n69n80J12J03L86N97m45r28
2074f06J51J180l67j59n0K02o60R6J49j27L56N06p90j052J014J122m73o83k39
2093d30K99M71N29l52r81L72M43j90m22N14k94l73J17K40k55L52N64q35r26R86
$$ plain form
1949 -415 269 338 -98 -433 -690 23 656 275 -452 -396 209 601 357 235 215 18 417 -94 -613 149 730
1970 730 202 -854 -682 205 262 151 -394 -421 -329 721 469 -316 -448 454 493 320 48 -179 97 186 -141
1991 -141 -709 -328 761 254 -786 -621 55 519 650 -279 -537 17 907 611 -330 -283 383 308 85 41
2011 41 -243 -87 492 82 -626 -537 469 163 -619 -573 22 121 491 63 -842 -341 862 726 -244 -187 401
2032 401 260 -171 68 -61 -114 100 -215 -692 78 546 -13 -520 -359 -157 205 944 303 -401 -391 448 589
2053 589 -115 117 554 -241 -104 -90 80 168 170 -533 -1063 -2 718 149 -431 -319 -216 170 767 322 -606
2074 -606 -455 725 358 199 149 351 -309 -213 -64 -191 165 671 -119 -1171 -157 965 492 -191 -430
2093 -430 -131 340 869 517 -464 -92 351 161 -261 253 -41 -414 -297 -57 -312 40 604 -231 -1157 -171
2113a71J083l86o29k77Q1O81N87o41r65L84O47l70j57L77Kq12J18K50k85O64N89
2134G70r10n73O52O23J4n57O0l28K33J012m18r71J43N79m99k83M59k56J1L49l96
2155b86k22O37N36j052k24R61K63k06k92k10j32J1Q16k99q51P2P48o52O5M93j9
2176A57k50O2l75K49O80J33p87o22N67Q30j47m33k75l46N30P11q02l46M66M3k76
2197b31k03M10L98n25K75l97k44Q96M66p42q21P50M02j27j95l34k50N27M68o68
2217a45m53O94J55o14r9L24J29K44N0j72o31P95M11o06m82L19K73KO3m02k66L49
2239f2K22l68l89N50J89L5n31K58PM28J47o23k39Q16J15n13j7J50nk36J80j18
2261dk28m0N66l91l44M42j3J45k63k3K65M6K88l72l95O10K18m55l43L34j20p0
$$ plain form
2113 -171 912 526 -103 -380 -299 382 969 328 -637 -253 394 24 -133 244 246 -566 -448 -198 -483 181 770
2134 770 -140 -713 -61 562 576 19 79 -249 -16 996 578 -393 -250 329 -170 -453 6 -250 -239 110 -286
2155 -286 -508 129 665 -387 -611 350 613 407 115 -95 -227 -216 600 301 -550 -478 270 -382 -317 176 157
2176 157 -93 -31 -406 -157 523 656 -131 -753 -186 644 497 64 -211 -557 -27 684 -118 -464 2 45 -231
2197 -231 -434 -24 374 -151 124 -273 -517 379 845 103 -718 32 434 307 112 -222 -472 55 523 -145
2217 -145 -598 96 251 -363 -462 -138 -9 235 285 113 -518 277 688 82 -400 -81 192 194 257 -145 -411 -62
2239 -62 160 -208 -597 -47 142 177 -354 -96 -89 339 486 -137 -376 440 555 42 25 175 170 -66 114 -4
2261 -4 -232 -272 294 -97 -441 1 -12 133 -130 -153 112 158 446 74 -321 289 507 52 -291 43 -77 -147
2283a47J4k0n8J77r2j27j45O02km67J21k9L60L50k35n58o8K07M73j80k47p1r4
2306b36Q8n7k0l27O79K39n44j98L83M68k50l23r9N03K37Qn61o24Q84Nq1k85l88
2329d99M43J02k19j25J33L18q8k72j47N06L52n4p33Q1L16L08mo30k30M57L31n43
2351a97j17L39j31j67J33j62K72K47k00O2l72L95L63l6m60k87J78L93J91n55l09
2372d20M72N1l37P5j09K95R0j42j75q2O56L3l25m32N24K39O9m69j84J39J29K28
2394C25l64K8j74M25l75k2k29L72n1O6k30K39K76M8n85J46M17j19L87q85J29j56
2416c32N71l60J16k27K3K82k52k6K65P1J73l42q5Q4M76Q6l81l94J52L85J10m33
2438c8n65L43K58J07n13J56J20L18k56k47Q9N12J34l23m68K07N41J18n44j40M
$$ plain form
2283 -147 -133 -153 -211 -34 -126 -253 -398 204 202 -265 -144 -173 187 537 302 -256 -324 -117 356 176 -71 -142 -236
2306 -236 -148 -205 -225 -552 127 366 -178 -376 7 475 225 -98 -197 306 543 551 -10 -634 250 255 174 -111 -499
2329 -499 -56 46 -173 -298 -165 153 65 -207 -354 152 504 450 -283 -202 114 422 418 -212 -442 15 346 -197
2351 -197 -314 25 -106 -273 -140 -302 -30 217 17 79 -293 102 465 429 -31 -318 -140 253 444 -111 -420
2372 -420 52 103 -234 -159 -268 27 117 -25 -200 -282 374 407 82 -350 174 413 482 13 -171 -32 97 325
2394 325 -39 -11 -185 240 -135 -157 -386 -14 -65 1 -229 10 286 334 -251 -105 312 193 580 -305 -176 -332
2416 -332 239 -121 -5 -232 -209 73 -179 -205 60 131 304 -38 -123 -39 437 523 142 -252 -100 285 395 -38
2438 -38 -603 -260 -2 105 -408 -252 -132 186 -70 -317 -228 284 418 95 -373 -166 375 493 -51 -191 -187
2459a87R8M69m40m6j20K91J10k17l39L31K38k53Ok81L25L88j90l59J9N09M7m06
2481gl8N1l58M68j5l01j5L98j92j01Q0K3Q8j56J36n78N90M86j82l92k74N83q2
2504B12k21K8l19J91N0J26l48lK61M8l07J64L47r3M6j02j87J69O15m17o02K35
2526a07L66k36j02K9k63K1M77j78j50J06N20n36m81L14M72R9j7m68k55M50N26
2547E87l62o56J23K63j67J16R9p9o4J04K70n12K01L78j51l81Q1L71j0J44l25o33
2569f03N64M75k47l91j86N43j56J8n7j03r1J58p4k20O32rl12o6r7N71n3pl35n69
2593f15K72Q31l38l06K49l89L8K43K56m87K00P7k07m8O63K31o83r4OL95k64M12
2615D42n54l44J83Q24m53j06k23j30l1L92J31j68j74L23n2k73O43L8k16n27J51
$$ plain form
2459 -187 -89 380 -60 -106 -226 65 175 -42 -381 -50 188 -65 -59 -340 -15 373 183 -176 -157 352 399 -7
2481 -7 -45 6 -352 116 101 -200 -215 183 -9 -110 -30 -7 81 -75 61 -517 73 559 377 -15 -289 294 212
2504 212 -9 19 -300 -109 -59 67 -281 -284 -23 25 -282 -118 229 136 182 80 -107 62 677 260 -342 -107
2526 -107 259 23 -79 -50 -313 -292 185 7 -143 -37 483 -53 -534 -220 252 351 334 -134 -389 61 587
2547 587 225 -431 -308 -45 -212 -96 3 -76 -140 -36 234 -278 -77 301 150 -231 -150 221 211 355 30 -603
2569 -603 -39 436 189 -202 -388 155 -1 17 -40 -143 -234 -76 -150 -370 262 253 -59 -125 -222 349 296 289 -46 -615
2593 -615 -343 488 150 -156 93 -296 -258 -15 241 -246 -46 31 -176 -224 439 670 -13 -107 -101 294 30 442
2615 442 -112 -456 -273 551 98 -8 -231 -361 -392 0 131 -37 -211 112 60 -213 430 468 252 -275 -124
2636a24L28K36n4n78m34L43O82k34l91K14j03k33L48M73n29k3K36j59l44N56O9
2657B79j98k83R3o2L61J34l76n56N15M92k55m62J45J07j62L66J76l92K21R8j49
2678I2k61L23L20o83J85J0j90L80L27o86l37K48M82r2k49J63l27Q2N22l36r1L05
2700A87J14n16K22M01R0l93k10Rj57J43N02m12n62M88L2k17R1L18n1j59N7J70
2722A47l17J72L14k22k14Q9K99k00j46j75N9K34Rp3m80O42j74K2l6j7J15J57k3
2745A82j22k08L17Kj87r6J07L62n16J10j34j47M17k1k13pK14N9j23k04J90L13
2767B95o4O9n69J74K94R4k80k14J27J3P3K33o05pM31J27k87j38K17J42Mr9K28
2790B58k76J82O7k11j37J94J86l11j85J49J36r0J16j78Q1r6J49L6n4n8K98k70
$$ plain form
2636 -124 204 440 386 -192 -626 -283 399 165 -226 -12 -115 -348 0 473 -56 -79 157 -2 -346 210 279
2657 279 81 -202 -109 -171 190 324 -52 -608 -93 399 144 -318 -173 -66 -228 138 314 -78 143 241 92
2678 92 -169 154 474 -209 -24 -14 -204 176 503 -183 -520 -272 210 118 -131 32 -295 -213 309 -27 -118 187
2700 187 301 -215 7 408 498 105 -105 -96 -253 -110 392 -20 -582 -94 -62 -279 -188 130 79 -80 -23 147
2722 147 -170 2 316 94 -120 -31 268 68 -78 -253 -194 40 49 -24 -504 138 -36 -14 -50 -67 48 205 182
2745 182 60 -148 169 171 -16 -112 -5 357 -159 -49 -183 -330 87 66 -147 -154 60 119 -4 -208 -18 295
2767 295 231 300 -269 -95 199 293 13 -201 -74 -61 12 245 -360 -367 64 191 -96 -234 -17 125 129 30 258
2790 258 -18 164 231 20 -117 77 263 -48 -233 -84 52 -38 78 -100 -19 -115 34 70 16 -42 256 -14
2812a4O6O0n6J14q1m20J24J41M49m77j44J43J68j9m1m7o1J70J92m21J79K51l9
2835B37j63j00j6Q7J15j13o7j43KM58j61q5j5j9Q4m9l2j99QK19J5j42K30Q0j30
2860A01k45K5J3K58j92l4j70K43r2J03k49L32r0j7m7M6r8K63K0j41k00L15K11
2883C55l77q7q9O6J70M9l16j21L60m7K82n21K42J8J45j68O2J36J8q4l30K38m4
2906d3K50l30l0O8L1J33j1l91j07L81K1R0l39K12J35Jj18q3J42M6K17n19M6J24
2930g4J13k4o8j9n1J97j90N3j48J7R9OOJ47n1J0K33k23q0R4L65m41j27M2K21o6
2956D1k36O1M7O8J06j62J27N1M6m1k6R0j5l0J04j01m2j8J58l82k7K14q9J5K63
2981B22o19J93K49J34k43OJ15k6K7j92K16K9l7P8k85J7K98j28j93n1K31j62J85
$$ plain form
2812 -14 52 112 56 170 89 -331 -207 -66 383 -94 -238 -95 73 54 13 -34 -95 75 267 -154 25 276 237
2835 237 74 -26 -42 45 160 47 -20 -163 -161 297 136 51 36 17 101 52 20 -179 -171 48 63 -79 151 231 101
2860 101 -144 -119 -106 152 -40 -74 -244 -1 -93 10 -239 93 3 -14 -61 -15 -113 150 170 29 -171 144 355
2883 355 -22 -109 -198 -132 38 87 -229 -350 10 -37 245 -276 -34 -16 129 -39 23 159 177 93 -237 1 -43
2906 -43 207 -123 -153 -85 -54 79 68 -323 -430 -49 -28 62 -277 -65 70 71 -47 -130 12 58 275 -244 -198 -74
2930 -74 39 15 -53 -72 -123 74 -116 -63 -211 -194 -95 -89 -83 64 13 23 256 33 -47 47 412 -29 -156 -114 107 41
2956 41 -195 -134 -87 -19 87 -75 52 103 149 108 82 172 157 127 231 130 88 70 228 -154 -181 33 -56 -41 222
2981 222 -397 -204 45 179 -64 -58 57 31 58 -134 82 111 74 152 -133 -116 182 54 -139 -190 41 -121 64
3004F4N5k03k08L93o2NQ5j68J35R5p4J7l76M15j10j63j61M43j47j38j79n8J00
3027b40M66k88O0K38k10q4QK14p8K7r8L6j73J74K01rr14O26j38J86O7q3k18RN69
3052C48l14l59K20O63o46n3K08K73k74J15Jj37J6J35k38k58J92P9J19j12J64n03
3074c61K09L70j41k52K64Q6l16p5M29P2l82J07j7j81J27K85j59l72o5K84J11K09
3096B32j84J8l4R0r6k23L99J10l84R7j48K31K2j07j12j99K36L55l04m75M18Kl0
3119h6J93n9j10j12N00j75k40Q0J65l62o2M76k19J50j56j26j97K45O57l88k77
3140a03N9j67K15K33p2k76p0L86j23l8J20J57m73q9J09K92p3k4j36l13M78R6P7
3163B65n21L93k34J00K56J6l90P2K59j72l34L97J97l37j5O2r0K26J33o91R5L31
$$ plain form
3004 64 119 -84 -292 101 39 44 129 -39 96 191 117 134 -242 173 63 -100 -261 182 35 -103 -282 -340 -240
3027 -240 226 -62 -2 236 26 -58 -50 164 86 113 15 51 -122 52 253 244 -670 -44 -182 4 71 -12 -230 -221 348
3052 348 34 -325 -105 558 -88 -141 67 340 66 181 182 45 61 196 -42 -300 -108 -29 90 -22 142 -361
3074 -361 -152 218 77 -175 89 175 -141 -216 213 285 -97 10 -7 -188 -61 224 65 -307 -372 -88 23 232
3096 232 48 66 32 122 26 -197 202 312 -72 25 -123 108 130 23 -89 -288 -52 303 -1 -476 -58 -56 -86
3119 -86 107 48 -62 -174 326 151 -89 -9 156 -206 -268 208 -11 139 -17 -143 -340 -95 562 174 -103
3140 -103 -44 -211 4 237 165 -111 -181 205 82 44 164 321 -152 -241 -132 160 87 63 -73 -386 92 188 265
3163 265 -256 137 -97 3 259 275 -115 -43 216 44 -290 107 304 -33 -48 14 -76 150 283 -408 -313 18
3185A8K01k44k17O08l02p2K57j24l12Q5Q4M16n36R8K9j48J40J09l32K69J51n01
3207c23nJ15N16m07J11k01K70q4J55n5j43nJ87k85n6M32k16k88J89M22m94J93
3229B8J23r1n50N32L13j09l06K34k76R1K18j68j08L0K70m10j28K25K26l91J88
3250e9Q2l1j7K55l95j24L18K88l33p3O5Q7N1L4j44l76M29J01k16m7p6J56K7J00
3274A02k55J11m4K68k40o2L55k14J7J01j18r1q0K70K7l62J58J95k80J5J54j94
3296a67n8K28o1j45L01O6j49L2J5k4N3M0j13J6p0k26K01n8J02j34r9K34no8K05
3321A16O1j57m6P4K51k76p2J57n5n2l3m8N5R5Pk31k71N48j58j00L8J23Q6j02K
3346A2L18m94J00L5K05j77j93L8J71j52Q2K27l07K58m11K97p5J09pj26J07K17
$$ plain form
3185 18 219 -25 -242 366 64 -8 249 125 -187 -102 -18 398 -138 -40 -11 -159 -19 90 -242 27 178 -323
3207 -323 -328 -213 303 -104 7 -194 76 -8 147 92 -51 -56 131 -154 -210 222 6 -282 -93 329 -165 28
3229 28 151 60 -490 42 355 246 -60 174 -102 -11 207 39 -69 -39 231 -179 -307 -82 144 -247 -59
3250 -59 23 -8 -25 230 -165 -289 29 317 -16 -89 -24 63 114 148 4 -372 57 158 -58 -105 -181 -25 2 102
3274 102 -153 -42 -86 182 -58 -120 235 21 38 139 21 -70 -150 120 147 -215 -57 138 -142 -127 27 -167
3296 -167 -225 3 -58 -203 98 164 15 47 62 38 91 131 18 34 -36 -262 -61 -119 -17 -151 -250 -16 -21 -89 116
3321 116 177 20 -26 48 299 23 -49 108 53 1 -32 -80 -25 70 77 -154 -425 123 -35 -135 -97 26 112 10 12
3346 12 330 -164 -64 -29 176 -1 -194 -156 15 -137 -55 172 -135 123 -288 9 -66 43 36 -90 17 234
3368B34k05J88m19K59L4K3r8oJ20K06l70o0J06J93l38K34l19J21L49j77k26K18
3390F7k08K10j22K21j06j56Q3L1k04J11J68k59J48j92J47K78j12n9l12R3L25M0
3412A92k74M6m6J1n2J48j24k9K66l9j59j17K00q3j06Q4J08n7K18j69k76J96n9
3435a21K88Oj85J04K2N1l31J15m2K81k22j5P8k25kJ46k09R6J19L1J99l22p%K79
3460A34N4o8k2j48K14j98J69m21M35k80J94l71K92J81k23J20l60M58l1m1j11K93
3482B70k83qK92q9j32j00J65k88K03l1J19j28j41Q0O0r1N5O5j88J27J37K10l94
3505i0J08LJ82n6n8k30J20j77J50M7j07K38j67j43l7O8J59J56o0k14P5J73J90
3528C30l58j97J94K6k3O1m6O7K07m44j7J02k6M02l95kL2M3K39n1m10L63j34K39
$$ plain form
3368 234 29 217 -202 57 91 114 16 10 130 336 -34 -94 12 205 -133 101 -218 -97 252 75 -151 67
3390 67 -141 69 -53 168 62 -94 -11 20 -184 -73 95 -164 -16 -208 -61 217 105 46 -266 -173 152 192
3412 192 -82 -36 -82 -71 -123 25 -99 -128 138 99 -60 -177 23 -60 -166 -82 26 -31 187 18 -258 -62 -121
3435 -121 167 173 -12 92 114 165 -166 -51 -93 188 -34 -49 29 -196 -198 -52 -261 -165 -46 -15 184 -138 -145 -145 134
3460 134 188 120 98 -50 164 -34 135 -286 149 -131 63 -308 -16 165 -58 62 -298 160 129 88 -23 270
3482 270 -13 -21 271 182 50 -50 115 -173 30 -1 118 -10 -151 -71 -11 -102 -47 18 -170 -43 94 304 -90
3505 -90 18 21 203 147 89 -141 -21 -198 -48 -1 -108 130 -37 -180 -217 -149 10 166 106 -108 -33 140 330
3528 330 -28 -225 -31 -5 -28 33 -13 54 261 -183 -200 -98 -124 278 -117 -119 -87 -44 195 144 -266 97 -37 202
3552B02j68J6j44o0K18j32m4n1K34l82K9N22P4k12j10LJ7p6L6J21q1n7K77Nk24
3577A3N8N7j31%M6J2j74K37k27k53J95L01j22j34K04k33nK70J64j54j34K6J6j71
3601a39j14L91k43j80L41l07J42K93k61j58K65K24r2j73L7ml9J64P1l63L6J16
3623Gm4N6J42r1l07j7K37m0p5K86k42l7J76J47j56N1Q1k90m4K22K0j05L4J46k81
3648a24m7R0K40l67K48lk37O0K77j0l93L10J57k02j17J12j6l5J86l56J12L57j62
3671H0m09M15j08J14k03J13J19k92K32L45k70l08L52j10O2J64j54l22K74R3k26
3692c9k45K81l9p1K03K7p0l89K35J50m7oL34k25j08J47j50J53N0%l42J49K75j13
3716A60l62r7K20j38Q4P8J4n0Q3J12k19J75P0k23J29J29k86Q1K1M6l14L41J80
$$ plain form
3552 202 34 50 -94 -154 64 -68 -112 -163 71 -311 -282 240 314 102 -8 -5 12 -64 -28 93 12 -45 232 237 13
3577 13 71 128 -3 -3 43 55 -119 118 -109 -362 -167 134 12 -122 82 -151 -156 114 278 124 -10 16 32 -139
3601 -139 -253 138 -105 -285 56 -251 -109 184 -77 -235 30 254 162 -11 26 22 -17 147 218 -145 -109 7
3623 7 -37 19 161 70 -237 -254 -17 -57 -132 154 -88 -125 51 198 42 93 174 -116 -160 62 82 -23 11 157 -124
3648 -124 -171 -81 159 -208 40 37 -200 -140 137 127 -266 44 201 -1 -118 -6 -22 -57 129 -227 -115 242 80
3671 80 -329 86 -22 92 -111 2 121 -171 61 406 136 -172 180 70 132 296 142 -180 94 187 -39
3692 -39 -284 -3 -42 -113 90 117 47 -342 -107 43 -4 -10 324 99 -9 138 -12 141 191 191 -151 -2 273 160
3716 160 -202 -299 -79 -217 -133 -55 -41 -91 -8 104 -115 60 130 -93 36 165 -121 -40 -19 27 -287 54 234
3739B34m8m30L68LLj92j1J68k99K76m3J58n1R5k09R1j02j08K05o0k0j86J91J6
3763D9r5q8K23rk4k45K40L1j8p8j2p4L32K5j77k73J00J14j02j8J0j48J20J31k11
3788a97r7L95rJ8N5n4k11L14j58K3J5k55J10RL6k12rJ70Q7J68n43L95n6nq4J86
3814I1o0J10j38O1k7o5L66m39j33J57K29k72K60k33k4L6K06j57k27L56l6K5N3
3837A39r7k97M83k18j40J18J38on3P9j78K69k93Q9%Pl7j97J11r6J66m7j38J67
3861c1J17L8r4J66n8k65L24j61k2j98K57r3o7J55mj42nN1l7L5J82Q1j49k39K62
3886A03r7k6J85l42J68J25mk0j0k40J86j38l9Mk6n9J61P6J66o4j5j47R0r3K71
3911B15k80K40l41R0K7K00m28P2L5J54j15J49j02RK30j93J93r4j24Q5o1K3K0m
$$ plain form
3739 234 186 -244 124 127 130 -62 -73 95 -204 72 29 187 136 231 22 113 11 -97 108 48 28 -158 33 49
3763 49 -46 -134 89 80 56 -189 51 82 64 -14 -26 -100 232 257 80 -193 -93 21 -81 -99 -89 -237 -117 14 -197
3788 -197 -294 101 92 110 165 111 -100 214 56 79 94 -161 -51 -42 -6 -218 -227 -57 30 198 -345 50 -6 -11 -95 91
3814 91 31 141 3 64 37 -28 338 -101 -234 -77 152 -120 140 -93 -117 -81 125 -32 -259 97 61 86 139
3837 139 42 -255 228 10 -130 -12 126 120 67 146 -32 237 -56 33 33 40 3 -194 -83 -179 -13 -60 -198 -31
3861 -31 86 124 30 196 138 -127 197 36 14 -184 73 -20 -87 68 64 -78 -83 -32 -69 -34 148 229 80 -159 103
3886 103 6 -20 165 -177 -9 116 112 92 82 -158 28 -110 -149 -145 -171 -230 -69 7 173 109 94 -53 37 -56 215
3911 215 -65 175 -166 -76 -49 151 -277 -205 -170 -16 -131 18 -84 -75 155 -38 155 61 -63 22 -39 -16 4 0
3935@J86j2k75L3M1M6q4k7j3J00N5j11j0RJ06j20O2j66P0J67jj49J76k22K22j00
3961a7R6j92q7J55o0K42l01J32O7o5O7l3j3J67m3k86L89J7n15N4K30K08l23J15
3985Dq3J74k66K00J16l29J36kK28n2L9l51K18j18OK53j49j48J78J67o8k23J10
4008D0K60m72K53O2k00l8k71K24n6J34jm2J08L30j88j13m4q6J77j02j13K20k14
4031a32Q3J00k72J21R2L65k56j88j50N20k64K26k72K19j41J2p8R2j38j41J26J34
4053E8q9m1pL5Nj24j1J20N9kO0j41K63k6j53q7KL01l16J71k35K00j2j35o2O9M8
4080e0mJ27K1j62N8p2J76J51k69N5P3q2j51K28n2j10K11k68k1L7J21K21o14K01
4104a75J2J33RJ78o9m90L49L33l43m4L4J1j04O2J38Q8L3r7M1j4k56J79P1N2j66
$$ plain form
3935 0 186 174 -101 -68 -27 19 -65 -92 -105 -5 50 -61 -71 -62 44 -76 -14 -180 -110 57 56 -93 83 -139 83 -17
3961 -17 79 -113 -200 -45 -105 137 -164 -32 35 -30 37 4 -9 158 115 -171 218 235 -280 -226 4 212 -111 4
3985 4 -79 95 -171 29 145 -184 -48 -50 178 126 165 -186 32 -86 -80 173 24 -124 54 221 153 -70 40
4008 40 300 -172 81 143 -57 -95 -366 -142 -198 -64 -65 -107 1 331 143 30 -14 -100 77 -25 -138 82 -132
4031 -132 -49 51 -221 -100 -8 357 101 -87 -237 283 19 245 -27 192 51 63 -15 77 -61 -202 -76 58
4053 58 -31 -72 -79 -44 -39 -163 -174 -54 5 3 63 -78 185 159 6 -81 -79 222 -94 77 -158 42 30 -105 -167 -98 -50
4080 -50 -54 73 94 -68 -10 -82 94 245 -24 31 104 22 -129 99 47 -63 148 -120 -141 -104 17 238 -376 -175
4104 -175 -163 -30 -21 157 88 -402 -53 280 -63 -107 -73 -62 -166 -104 34 122 155 58 99 85 -171 8 79 131 -35
4129c5M1l5K92k70P2j67l7K93K7k22Ln5K5m4r5K28j37o7P6M4m8J16N5k66j82N20
4155A32J23j16k42R5o7J09J91o8l55M3KR2J72j31J20j43q2K44r7M8O7l6k9J41
4179B13j11M9j49P4n4r9J69l4j64J64J10j03jn1MKj86K34M0m9J80j12N6r7P0o9
4205H6n9J08j81Qj62J87J05j95n6J1l6M04j49q3j75M23l45K31L1l22J2L75k13
4228Ek01O9K60j03q2J66j86m0O3p4l1K07J1l4K39m63K99O1j27j8k7p4K61k17j31
4253a67K46j54kL5J63k0k75K85j97K4J45J5j67O6m0L8K5q0J04k03O1r1K66j73
4277i6K59k95p4J50L55l47o3K92k90PJ56J28l38J66Q8j37p9oM3J05mJ44k72Q1
4301b7JK73l08K8J10j07n5R8K85k29o1J3p5O2R6K19m52L1k9K19N5j96n8JM7Q3
$$ plain form
4129 -35 6 -29 263 -7 65 -102 -139 154 181 -41 -38 -93 -68 -112 -207 21 -116 -183 -107 -63 -111 5 60 -206 -388 132
4155 132 255 139 -103 -8 -75 34 225 157 -198 -155 -153 -61 111 -20 100 -43 -125 119 22 70 137 101 72 213
4179 213 102 151 2 76 22 -77 92 58 -106 58 168 65 64 13 17 19 -167 67 107 58 238 126 182 85 155 86
4205 86 27 135 -46 -38 -200 -13 92 -103 -159 -148 -184 220 71 -12 -187 236 -109 122 153 -169 -157 218 5
4228 5 -196 -127 133 30 -52 114 -72 -112 -49 -123 -154 53 64 30 269 -194 105 166 39 21 -6 -80 181 -36 -167
4253 -167 79 -75 -77 -42 121 101 -174 111 -86 -62 83 98 -69 -3 -43 -5 20 -60 44 -159 -98 -189 77 -96
4277 -96 163 -132 -206 -56 299 -48 -111 181 -109 -102 54 182 -156 10 98 -39 -118 -124 -81 24 20 164 -108 -27
4301 -27 -26 247 -61 -33 77 -30 -85 13 298 69 8 21 -54 8 104 323 -129 -98 -127 92 147 -49 -107 -106 -59 24
4327B4l5q3Q5J26j61Q1j24L1O9M7o9k6K35l65l6Q2J77m5o8qO2k5oK5j67J23J83
4354A32q0l2J06j25j02K16N5j40m0L4P3j87J38j25K16O9l24J39J4m8J1K4m8J88
4378A64k77nj36J58J78j62K0L6M0J63k35j16J67L9P6l81J90QJ15M2p1J36L5J3
4402A97l3j05j17J16j7NN5k24K4J34j79J29%q0N1P7l3%J14k31J32M3K42j63j34
4427CJ26j63N9M5j4K6k09K87l72K16n5n5J18j11J3J40k7J06q2j03K35l03n2J04
4451f8M6J10j24p8j41L20j07L9K3N8p0j15L00k14n7l0J99Q5j31j53j4K95r4jJ39
4476B17l94L19l11R6N2k19L05k3j18M9K99l46NM0O0J71k19o1J83q3j4J8k27k7
4500b28K29j31K07n7O7k01L46j64j54J51L6r8j6J77k0k03N0J43m56K32K04r2j15
$$ plain form
4327 24 -11 -94 -9 117 -44 37 -87 -56 13 60 -9 -35 200 -165 -201 -119 58 13 -55 -63 -1 -26 -32 -7 -174 -51 132
4354 132 52 20 126 1 -101 115 170 30 -10 24 97 -90 48 -77 139 208 -116 23 37 -11 0 24 -24 164
4378 164 -113 -118 -254 -96 82 -80 -60 -24 16 179 -56 -172 -5 34 110 -271 -81 -73 42 84 13 149 184 197
4402 197 164 59 -58 58 41 46 101 -123 -99 35 -144 -15 -15 -95 -44 33 0 0 114 -117 15 58 300 137 3
4427 3 129 -34 25 70 56 82 -127 160 -212 4 -51 -106 12 -99 -86 54 27 133 51 -52 183 -120 -172 -68
4451 -68 -22 88 -36 -114 -255 65 -42 -3 20 78 8 -107 193 -21 -78 -108 91 176 45 -108 -122 173 79 78 217
4476 217 -177 142 -169 -73 -21 -240 65 42 -76 -27 272 -74 -69 -29 31 202 -17 -78 105 22 8 26 -201 -228
4500 -228 1 -130 77 20 87 -114 232 68 -86 65 101 3 -13 164 144 -59 -9 134 -322 -90 114 22 -93
4523i3j35J61k9J2M3J4J77j34j53j62K71j5M5L1M5j80K89l75K63K8k61l8J92j01
4547a05M2M1kK07j92j31L86l49K50n6r9J83q7k13K63j72J19M9j15jk23K32j70
4570a43K6J98j43m2L00l53L79j57J1q7J63k36J23p5K39k10M6r4L5N5q4J88j41
4593bj0l55L64OJ07J42j54M4j28L3L1j79O2k7P2o1p9J96l28K56j72K28j74R6N
4618b7Q5j13O0Mj42L05j91j55K31r0j22L91o1j35j73Q7j05j04K53o5j44K07O8
4641F4m06M76j1j58j4J73j87MOK06l80J85R3J18j95P5j16n9K77j00j28j13J85
4664elo8P4j0Q2k10Q2N1k59L03j40OJ32m5M1r5Q7j69JQ0k9j8Q8J02j08Q8mK9l6
4693D7K27j79k9l46N71m12J14K6M7j1j45k0O5j31J45J01k97L39l6j15K53k31N1
$$ plain form
4523 -93 -228 -67 -96 -84 -41 -27 150 16 -137 -299 -28 -43 2 33 78 -102 187 -188 75 103 -158 -196 -4 -105
4547 -105 -63 -22 -24 183 -9 -140 246 -103 147 91 -8 175 88 -125 138 -34 85 134 19 18 -205 27 -143
4570 -143 -117 81 -62 -104 196 -157 222 65 76 -11 152 -84 39 -36 203 -7 39 -55 -20 35 -49 139 -2
4593 -2 -12 -367 -3 3 110 252 98 142 14 47 78 -101 -39 -66 6 -55 -134 62 -266 -10 -182 46 -128 -32 -27
4618 -27 58 -55 5 9 -133 172 -19 -174 57 -33 -155 236 175 40 -133 -46 -151 -255 -2 -67 -211 -4 64
4641 64 -342 134 123 -35 -49 124 -63 -59 -53 153 -227 -42 51 169 -26 49 -67 -126 151 51 -77 -190 -5
4664 -5 -8 -76 -2 -12 70 -140 -58 -7 -266 37 -103 -97 35 -10 31 -64 23 -146 -145 -65 -94 -112 -24 78 -30 58 54 83 47
4693 47 274 95 66 -280 291 -121 -7 19 66 55 -90 -110 -45 -176 -31 70 -227 112 76 -39 214 -17 34
4716C4n1K9R7p1j40L7o3J6Q3n1J88l5k09K22j61M6Q7j16J59Km8j41K19k05K0J66
4742A14J47l74O8K17j16j47n3L17j39k77K86j9j04J31M3k48J68m2k73M32o8l8
4764B5j2n7N6m9k53K84J21j74K03j29m2j32J47Pj46J54L03l39N4J54m5k11J18
4787C7k89K34o9l4P1J07m4J63j38Q6kl83K10K76m58J48K04Qj1j12j33K67lj73
4811c8L8K4j3Jj3n0L08k50k58j08M43n9j2j26J42K75l17K92k30r8J01j83J38j0
4835cL9l7Mj22M6N7K7k9J51o5j27K20M3k39J4j54K26K3j43K35r3N0n5O9k01q7
4861a51J01J59j72J36MP6k39R6M1j12K51k1j39L9p3Q5m4j00J30O8k15J07j58Q2
4885d9K24o5k06J06K66j81j65M03j94j58J42j35J38j73J78k1r7J13k16j92k6N41
$$ plain form
4716 34 -17 12 109 38 -102 -65 -128 -112 -29 -80 108 73 -136 86 -75 -29 58 -58 101 103 55 -86 133 -72 -52 114
4742 114 261 -113 -45 172 56 -91 -144 173 34 -243 43 24 -80 51 94 -154 14 -28 -301 131 63 25
4764 25 13 -44 12 -37 -290 -6 115 -59 144 15 -27 -159 -12 -5 -151 3 306 -33 21 175 130 -81 37
4787 37 -252 -18 -87 -121 -50 57 13 176 38 124 122 -261 -51 225 -233 -85 119 127 116 4 -129 138 135 -38
4811 -38 0 24 11 12 -1 -51 257 7 -251 -359 84 25 13 -113 29 304 -13 279 49 -49 52 -131 7 -3
4835 -3 36 -1 3 -119 -73 -16 11 -18 133 68 -59 161 204 -35 -21 -175 51 74 -69 166 73 123 68 137 -64 -151
4861 -151 -50 109 -63 73 77 153 -86 10 51 -61 190 169 30 69 -4 81 37 -63 67 135 -80 27 -131 -49
4885 -49 175 110 -96 10 276 95 -70 333 139 -19 123 -12 126 -47 131 110 13 126 -90 -282 -308 233
4907B33m04P8J47K0L6j57J4R8p8NP8k7JL9q0K1O3j80n4J90j32J42Q2o5R3k04Q3
4934D2k24L31J5k90J78M5j54J24l5J07j29k1n3J41j01j30O5L3RK03j62P1r4M7
4958A8j02J40j39l6N2n3Q5N1k90nL76j23K04k33L3j02m6K81m1n3j62Q8J8J76j67
4983c0J72j35J35l1k43R8L7r1K63J38m86J93p4J43l4j6J7j81J03M7l6K02k07j9
5007c5L6j12K24l1m2k22q6K23j83J65Q7p9j15J53j36R6l6N1J51k31J28O3k55J04
5031h2J47q8M5R6k85K38r7Qj18L2m1J20j50J87J18j07j09K19k41L86l41K3NK64
5055B29j44j0j4q8K61l01L5j0N3j50J29k6O4o3kK45k55J62J2j28P2j08L4K8j91
5080a66O6P0k0K12j14j60n6l9L57j03Q5j83j91K06J53j08j36L39j05k43Q7K73
$$ plain form
4907 233 -171 -93 54 74 110 -47 -33 65 -13 -8 70 43 44 83 3 24 87 -93 -147 43 -89 53 135 70 163 -41 42
4934 42 -182 149 164 -126 52 97 -57 67 32 139 10 -11 -64 77 -24 -154 -89 -56 -47 156 -6 65 -29 18
4958 18 -84 56 -83 -119 -67 -120 -35 16 -274 -279 97 -26 178 -55 -22 -124 -170 111 70 17 -145 -57 -39 137 -30
4983 -30 142 7 142 111 -132 -34 3 -88 175 313 -173 20 -54 89 55 39 56 -125 -22 25 -11 191 -16 -35
5007 -35 1 -111 113 82 40 -182 -268 -45 -228 -63 24 -55 -170 -17 -153 -57 -93 -42 109 -122 6 69 -186 -82
5031 -82 65 -23 22 118 -167 71 -26 -18 -136 -104 -145 -25 -175 12 130 23 -86 133 -108 278 -63 -40 -35 229
5055 229 85 75 61 -27 234 -67 -32 -42 11 -139 -10 -36 28 -35 -37 208 -47 115 127 -1 71 -37 -3 25 -166
5080 -166 -100 -30 -50 162 48 -112 -168 -207 150 47 132 -51 -242 -36 117 9 -127 212 107 -136 -49 224
5102B24k60j43J16Q7p9MR3k40J29j9J04R3O4j36k4Q8m47N13k76j38K03j9j14J92
5126A5j06PJ66l8q2rJ24k5Lj06K95j70r3JJ10j1n9k3K91j84j66K57k14J76j39
5151B0p8J99j80l7o6J34j59J01K06j4j01j07N0J02J1J40k19k1J44j19j35L19k00
5174a0O9J22l73J57k1J8K7k4K5p6P6K38k96j14K79R7j81nk00O3O6JJ88j25N8p5
5200a6l9k7K85k00m7P4k6J41k95K47r2m3J00j22LJ09J2M7l12K39k40R2J7O1Q3
5225E1j92J69K81k64j13J9k2L70j66n6k03K26K25n74M26k08j56M0J09R5j42m2
5247a27K70k36%O9j3j2J6J6j72J50O3o0k0M9J65K2j81Q1k54K0O4J74J88l05oN9
5273B0L7J56rk50J61k2P1l55K21j69rJ6K18n4P6j63q3J68q9K00k48J37J73j7k13
$$ plain form
5102 224 -36 -179 -63 24 -55 -51 42 -198 -69 -88 16 109 173 37 13 101 -346 167 -109 -247 -44 -63 -177 15
5126 15 -91 -84 82 44 -38 -47 77 52 55 -51 244 74 -19 -18 92 81 22 -1 290 106 -60 197 -17 159 20
5151 20 -58 141 -39 -76 -142 -8 -167 -66 140 126 25 -82 -32 70 81 221 2 -19 125 6 -129 190 -10
5174 -10 59 181 -192 -35 -56 -38 -11 -35 -10 -86 -10 228 -68 -182 97 194 13 8 -192 -129 -63 -62 126 1 59 -16
5200 -16 -55 -82 203 3 -44 30 4 145 -150 97 5 -38 62 -60 -57 52 64 111 -201 38 -202 -110 -93 -32 51
5225 51 -141 28 309 45 -68 -49 -71 299 133 77 -126 100 325 -249 177 -31 -187 -147 -38 57 -85 -127
5247 -127 143 -93 -93 -24 -37 -49 -33 -17 -189 -39 24 -36 -56 -7 158 180 -1 80 -174 -154 -90 84 272 -33 -39 20
5273 20 57 213 204 -46 115 93 164 -191 30 -139 -148 -132 86 32 108 -55 -138 30 -59 141 -107 30 203 186 -27
5298b7j28P7K23l28J26Q0J45l61K57k22R8K65k29J10k6J8j18K74k97m5M5J61k93
5321a95O1J38j70K25k06L61k20q8L17p8R1l07Jk4M8K34j85j0J33k10j08K44m6
5344Fl5J51k8q7l0q7M6J99M3k83J47j04J92l00J59l5j0NJ4J47j24J14k06J03R0
5369H7k09J99m3n7J11p5%n0l2N0O7o5R6j43OJ40L7L9K2k38l4L3O4J20k28J65Q6
5396A48p4j24j71K76q9P3j00J08k09J47k66K05J22p2R4j29J9K2j5P4o7j67K08
5419A3p0n1j06J46j57J99n6M5q8L40j08n8J74m5j04M2j41QM8j73O4R1j13l2J92
5444F0j99K67k00N7M7l9R7j9j76J21k5Q1L1J9p6j47N3K06p9r2J3K0l7J60k57m4
5470a58N9K11j34L5p2M1n7J71o5j31J36j52L31j18r6o8J71p9qo4PQ7j6l3J01K4
$$ plain form
5298 -27 -155 -78 145 -183 -57 23 168 -193 64 -158 -60 205 -24 86 60 78 -40 234 -63 -108 -63 98 -195
5321 -195 -134 4 -166 59 -147 214 -6 -94 223 145 236 -71 -70 -94 -46 188 3 -7 126 -84 -192 52 6
5344 6 -29 122 94 7 -23 -110 -64 135 178 -105 42 -62 130 -170 -11 -46 -56 -51 -37 110 -14 100 -106 -3 87
5369 87 -122 77 34 -23 88 13 13 -37 -69 -19 48 -17 79 -64 -58 82 119 158 180 -58 -92 -59 5 125 -103 62 148
5396 148 74 -50 -221 55 -34 39 -61 47 -162 -15 -281 -76 46 -26 68 -61 -42 -20 -35 39 -28 -195 13
5419 13 -57 -108 -214 -68 -225 -26 -82 -37 -125 215 107 49 223 178 74 116 -25 -17 31 -142 -78 13 -100 -132 60
5444 60 -139 128 -72 -15 32 -7 90 71 -105 16 -9 72 103 122 46 -101 -48 158 79 -13 0 20 -17 143 -114 -158
5470 -158 -99 112 -22 13 -59 -18 -75 96 31 -100 36 -116 215 97 1 -67 104 25 17 -47 -40 47 31 -2 99 123
5496A23j93J53J6q3M8k68J77R4k47N9M9lK54k54q2J41j12Q4p3K75r3k84J17J41
5520C9qm9r8J80j68n0J22K03o0j62j19K27j98J74M0j1j48P6j6L66j72j83P6l39
5544b78M38n6o0Qj05M0j16K8j37L81K5j52j54K53k72K78o1j40j7J98j64O4J70
5567A71j67n5R0o1K0m4q3rJ71j00K54l77K71q8j93L26l1j27J17l7J91J7m13J02
5591e5J45o8j06o8J37o5qJ15j8q6k00M52j79j5R9k40K0J25J64j0j77J06j22O2
5615HL9J94j04l25J29R2j36J49q7J55j56p3oK9J11M3J2Nj41N1o0J75j11k47K79
5640B5Q3j41J10P8p4m1k1P7P9q5m4M2r7o6J01r6P4j3J24q3o7J50m6o5m5J8LQ2
5668F2k7r6K8P9L2ml9m1J17L7O9j97j06J67m8m1ml3l3J01j8K5j50j1J70r0OK34
$$ plain form
5496 123 -70 83 99 16 64 -204 -27 67 -180 -121 -72 -75 179 -75 -157 -16 -128 -44 -117 158 65 -219 -102 39
5520 39 31 -18 -116 64 -104 -154 -32 171 111 -51 -170 57 -141 33 73 62 -86 -10 -26 340 168 -15 61 -278
5544 -278 160 104 44 52 -53 -13 -129 -101 -238 143 168 16 -138 115 -157 121 60 -80 -97 101 -63 1 171
5567 171 4 -51 39 -22 -2 -46 -129 -138 33 -67 187 -190 81 -7 -200 126 95 -32 85 48 239 256 -157 -55
5591 -55 90 22 -84 -152 -15 -80 -88 27 9 -77 -277 175 -4 -19 80 -160 -140 -15 149 139 -38 68 -54 8
5615 8 47 241 137 -188 -59 33 -103 46 -41 114 -42 -115 -121 -92 19 62 74 79 -62 -11 -71 104 -7 -254 25
5640 25 108 -33 77 155 81 40 19 96 175 90 46 88 -9 -75 26 -70 4 -9 115 32 -35 115 69 4 -41 -23 -20 62
5668 62 35 -61 -33 46 78 74 35 -6 111 148 217 20 -86 81 33 -8 -12 -45 -78 23 5 30 -120 -131 39 -51 -45 189
5696A89l00L2L32l96K22k5l2J17k05k4l0j22L24j04r9JK58n6k9p4j81Q4K63j0
5720A35j36J91j28o4o5R8j7J11m02J43R9o1K37j63l5J64J60k94j06J61J30l0n6
5743G2q6J54l17K89r6K9j25J53j52J77M1l41L42j01P6k80L63j78k5N9J15l3N7
5766A93o7M2j45o3J37r5k11J92K22k91K30r9j65lm6K48j36j63K87j43l6MK89k79
5790i8J01o0J47k64L0J33j78J60N8R2j38K0J6kQ2j96J56k12L05k07J31q9O5o1
5814iK42j67K5q8k1l7J42j71r0K90j40Q0J17k95J55j0l8K47j75J48j68r7J1J84
5838A35J6k55K84l00J48j42Q2J5m5K28j37j2R7ro5K4O8k9Nj36J44j16M5O5Qj77
$$ plain form
5696 189 -111 -79 253 -143 79 54 22 139 -66 -90 -120 -242 82 -22 -121 -120 138 82 53 -21 -202 -118 145 135
5720 135 -1 190 62 -2 -67 31 14 125 -277 -134 -35 -96 141 -22 -57 107 267 -27 -133 28 158 128 72
5743 72 -14 140 -177 112 16 45 -80 73 -79 98 139 -202 140 39 115 -165 198 20 -5 54 169 136 193
5766 193 126 168 23 -40 97 2 -209 -17 205 -86 144 45 -120 -123 -169 79 -57 -220 67 -76 -112 -108 181 -98
5790 -98 3 -57 90 -174 -144 -11 -189 -29 29 121 -17 3 19 17 99 -97 59 -153 152 -55 76 -13 52 -9
5814 -9 233 66 91 3 -18 -55 87 -84 -174 116 -24 56 173 -122 33 23 -15 232 57 205 37 -60 -49 135
5838 135 151 -104 180 -120 28 -114 -32 -17 -62 166 29 17 114 105 40 64 132 103 108 -28 116 0 45 110 118 -59
$$ [...]
8191a55
##END NTUPLES=NMR FID
##END=
