##TITLE=1H_A-1
 CDCl3
 8 sc, 
 10.1.2025
##JCAMPDX= 6.0         $$ Bruker NMR JCAMP-DX V2.0
##DATA TYPE= NMR FID
##DATA CLASS= NTUPLES
##ORIGIN= UXNMR, Bruker Analytische Messtechnik GmbH
##OWNER= root
$$ XWIN-NMR		Version 3.5
$$ Fri Jan 10 14:41:19 2025 Russian Standard Time (UT+4h)  she@DPX200
##.OBSERVE FREQUENCY= 200.1315
##.OBSERVE NUCLEUS= ^1H
##.DELAY= (6, 6)
##.ACQUISITION MODE= SIMULTANEOUS
##.ACQUISITION SCHEME= undefined
##.AVERAGES= 8
##.DIGITISER RES= 18
##SPECTROMETER/DATA SYSTEM= spect
##.PULSE SEQUENCE= zg30
##.SOLVENT NAME= CDCl3
##.SHIFT REFERENCE= (INTERNAL, CDCl3, 0, 15.7039)
##AUDIT TRAIL= $$ (NUMBER, WHEN, WHO, WHERE, WHAT)
$$ ##TITLE= Audit trail, XWIN-NMR		Version 3.5
$$ ##JCAMPDX= 5.01
$$ ##ORIGIN= Bruker BioSpin GmbH
$$ ##OWNER= she
$$ F:/spectra/data/she/nmr/H-F/1/audita.txt
$$ ##AUDIT TRAIL=  $$ (NUMBER, WHEN, WHO, WHERE, WHAT)
(   1,<2025-01-10 14:37:53.32 +0400>,<she>,<DPX200>,
      <created by zg, POWCHK disabled, PULCHK disabled
       configuration hash MD5:
       00 E9 B6 7A A2 85 ED C7 34 08 36 98 17 FE 4E 26
       data hash MD5: 16K
       5A 09 3E 28 94 42 3E 79 D7 66 5B 2A 40 59 04 36>)
$$ ##END=
$$ 
$$ hash MD5
$$ C3 C1 2F FA C7 29 B3 FF A4 97 D5 5C 92 B1 B5 63
##$RELAX= 
##$RELAX= 
##$RELAX= 
##$RELAX= 
##$RELAX= 
##$RELAX= 
$$ Bruker specific parameters
$$ --------------------------
##$DU= <F:/spectra>
##$EXPNO= 1
##$NAME= <H-F>
##$PROCNO= 1
##$TYPE= <nmr>
##$USER= <she>
##$AMP= (0..31)
100 100 100 100 100 100 100 100 100 100 100 100 100 100 100 100 100 100 
100 100 100 100 100 100 100 100 100 100 100 100 100 100 
##$AQSEQ= 0
##$AQ_mod= 1
##$AUNM= <au_zg>
##$AUTOPOS= <>
##$BF1= 200.13
##$BF2= 200.13
##$BF3= 200.13
##$BF4= 200.13
##$BF5= 200.13
##$BF6= 200.13
##$BF7= 200.13
##$BF8= 200.13
##$BYTORDA= 1
##$CFDGTYP= 0
##$CFRGTYP= 5
##$CHEMSTR= <none>
##$CNST= (0..31)
1 1 145 1 1 1 1 1 1 1 1 1 1 1 1 1 1 1 1 1 1 1 1 1 1 1 1 1 1 1 1 1 
##$CPDPRG= <>
##$CPDPRG1= <>
##$CPDPRG2= <>
##$CPDPRG3= <>
##$CPDPRG4= <mlev>
##$CPDPRG5= <mlev>
##$CPDPRG6= <mlev>
##$CPDPRG7= <mlev>
##$CPDPRG8= <mlev>
##$CPDPRGB= <>
##$CPDPRGT= <>
##$D= (0..31)
0 1.2 0 0 0 0 0 0 0 0.06 0 0.03 0 0 0 0 0.0002 0 0 0 0 0 0 0 0 0 0 0 0 
0 0 0 
##$DATE= 1736505472
##$DBL= (0..7)
120 120 120 120 120 120 120 120 
##$DBP= (0..7)
150 150 150 150 150 150 150 150 
##$DBP07= 0
##$DBPNAM0= <>
##$DBPNAM1= <>
##$DBPNAM2= <>
##$DBPNAM3= <>
##$DBPNAM4= <>
##$DBPNAM5= <>
##$DBPNAM6= <>
##$DBPNAM7= <>
##$DBPOAL= (0..7)
0.5 0.5 0.5 0.5 0.5 0.5 0.5 0.5 
##$DBPOFFS= (0..7)
0 0 0 0 0 0 0 0 
##$DE= 6
##$DECBNUC= <off>
##$DECIM= 24
##$DECNUC= <off>
##$DECSTAT= 4
##$DIGMOD= 1
##$DIGTYP= 9
##$DL= (0..7)
0 120 120 120 120 120 120 120 
##$DP= (0..7)
150 150 150 150 150 150 150 150 
##$DP07= 0
##$DPNAME0= <>
##$DPNAME1= <>
##$DPNAME2= <>
##$DPNAME3= <>
##$DPNAME4= <>
##$DPNAME5= <>
##$DPNAME6= <>
##$DPNAME7= <>
##$DPOAL= (0..7)
0.5 0.5 0.5 0.5 0.5 0.5 0.5 0.5 
##$DPOFFS= (0..7)
0 0 0 0 0 0 0 0 
##$DQDMODE= 0
##$DR= 18
##$DS= 0
##$DSLIST= <SSSSSSSSSSSSSSS>
##$DSPFIRM= 0
$$ [...]
##$SUBNAM2= <"">
##$SUBNAM3= <"">
##$SUBNAM4= <"">
##$SUBNAM5= <"">
##$SUBNAM6= <"">
##$SUBNAM7= <"">
##$SUBNAM8= <"">
##$SUBNAM9= <"">
##$SW= 24.0689530833862
##$SWIBOX= (0..15)
0 0 2 0 0 0 0 0 0 0 0 0 0 0 0 0 
##$SW_h= 4816.95568400771
##$TD= 16384
##$TD0= 1
##$TE= 0
##$TE2= 300
##$TE3= 300
##$TEG= 300
##$TL= (0..7)
0 120 120 120 120 120 120 120 
##$TP= (0..7)
150 150 150 150 150 150 150 150 
##$TP07= 0
##$TPNAME0= <>
##$TPNAME1= <>
##$TPNAME2= <>
##$TPNAME3= <>
##$TPNAME4= <>
##$TPNAME5= <>
##$TPNAME6= <>
##$TPNAME7= <>
##$TPOAL= (0..7)
0.5 0.5 0.5 0.5 0.5 0.5 0.5 0.5 
##$TPOFFS= (0..7)
0 0 0 0 0 0 0 0 
##$TUNHIN= 0
##$TUNHOUT= 0
##$TUNXOUT= 0
##$USERA1= <user>
##$USERA2= <user>
##$USERA3= <user>
##$USERA4= <user>
##$USERA5= <user>
##$V9= 5
##$VALIST= <valist>
##$VCLIST= <CCCCCCCCCCCCCCC>
##$VD= 0
##$VDLIST= <DDDDDDDDDDDDDDD>
##$VPLIST= <PPPPPPPPPPPPPPP>
##$VTLIST= <TTTTTTTTTTTTTTT>
##$WBST= 1024
##$WBSW= 4
##$XGAIN= (0..3)
0 0 0 0 
##$XL= 0
##$YL= 0
##$YMAX_a= 115452
##$YMIN_a= -128604
##$ZGOPTNS= <>
##$ZL1= 120
##$ZL2= 120
##$ZL3= 120
##$ZL4= 120
##$ABSF1= 10
##$ABSF2= 0
##$ABSG= 5
##$ABSL= 3
##$ALPHA= 0
##$AQORDER= 0
##$ASSFAC= 0
##$ASSFACI= 0
##$ASSFACX= 0
##$ASSWID= 0
##$AUNMP= <proc_1d>
##$AZFE= 0.1
##$AZFW= 0.1
##$BCFW= 1
##$BC_mod= 2
##$BYTORDP= 1
##$COROFFS= 0
##$CY= 11.3945322036743
##$DATMOD= 1
##$DC= 2
##$DFILT= <>
##$DTYPP= 0
##$F1P= 15.6554695791079
##$F2P= 12.8336369535428
##$FCOR= 0.5
##$FTSIZE= 0
##$FT_mod= 4
##$GAMMA= 1
##$GB= 0.15
##$INTBC= 1
##$INTSCL= 1
##$ISEN= 128
##$LB= 0.24
##$LEV0= 0
##$LPBIN= 0
##$MAXI= 10000
##$MC2= 0
##$MEAN= 0
##$ME_mod= 0
##$MI= 1.114404
##$NCOEF= 0
##$NC_proc= 0
##$NLEV= 6
##$NOISF1= 3.799351
##$NOISF2= 2.8
##$NSP= 1
##$NTH_PI= 0
##$NZP= 0
##$OFFSET= 15.70392
##$PC= 1
##$PHC0= -26570.08
##$PHC1= 10.58744
##$PH_mod= 1
##$PKNL= yes
##$PPARMOD= 0
##$PSCAL= 0
##$PSIGN= 0
##$REVERSE= no
##$SF= 200.130013532006
##$SI= 16384
##$SIGF1= 3
##$SIGF2= 2
##$SINO= 400
##$SIOLD= 16384
##$SREGLST= <1H.CDCl3>
##$SSB= 0
##$STSI= 0
##$STSR= 0
##$SW_p= 3612.71676300578
##$SYMM= 0
##$S_DEV= 0
##$TDeff= 0
##$TDoff= 0
##$TI= <>
##$TILT= no
##$TM1= 0
##$TM2= 0
##$TOPLEV= 0
##$USERP1= <user>
##$USERP2= <user>
##$USERP3= <user>
##$USERP4= <user>
##$USERP5= <user>
##$WDW= 1
##$XDIM= 8192
##$YMAX_p= 0
##$YMIN_p= 0
$$ End of Bruker specific parameters
$$ ---------------------------------
##NTUPLES= NMR FID
##VAR_NAME=  TIME,          FID/REAL,        FID/IMAG
##SYMBOL=    X,             R,               I
##VAR_TYPE=  INDEPENDENT,   DEPENDENT,       DEPENDENT
##VAR_FORM=  AFFN,          ASDF,            ASDF
##VAR_DIM=   8192,          8192,            8192
##UNITS=     SECONDS,       ARBITRARY UNITS, ARBITRARY UNITS
##FACTOR=    0.0002076,     1,               1
##FIRST=     0,             0,               0
##LAST=      1.7004516,     0,               0
##MIN=       0,             -128604,         0
##MAX=       1.7004516,     115452,          0
$$ Real data points
##PAGE= N=1
##DATA TABLE= (X++(R..R)), XYDATA
$$ [...]
$$ plain form
2139 40 899 -290 -658 949 85 -693 834 328 -727 625 517 -841 338 1435 -699 -324 992
2156 992 -176 -729 754 -245 -987 557 468 -1168 125 800 -789 -404 709 -531 -808 656 -60
2173 -60 -1221 414 108 -1033 -8 753 -1205 -484 706 -1142 -391 620 -595 -1101 465 -113 -1256
2190 -1256 203 382 -954 -232 413 -857 -340 587 -991 -812 488 -172 -1356 288 250 -1021 345
2207 345 631 -685 -338 708 -965 -544 726 -323 -1181 702 267 -759 517 523 -742 -86 668 -461
2225 -461 270 1041 -344 -355 1119 -60 -678 591 789 -525 337 832 -601 407 1177 -151 -231 1548
2243 1548 170 -627 677 501 -619 463 817 -649 353 917 -399 -150 1318 167 -415 784
2259 784 341 -290 708 462 -427 151 808 -825 -193 1026 -504 -249 935 33 -530 809 306 -864
$$ packed form
2139D0Q59j189l68J607q64p78J527n06j055J352j08j358J179J097k134L75J316
2156I92j168n53J483r99p42J544q9j636J293O75j589L85J113j240k77J464p16
2173f0j161J635l06j141J025P61j958P21J190j848P51J011j215n06J566n78j143
2190a256J459J79j336P22O45j270N17R27j578J79J300o60j184J644l8j271J366
2207C45K86j316L47J046j673M21J270j049q58J883m35j026J276Oj265O56P54j129
2225d61P31P71j385j1J474j179o18J269J98j314Q62M95j433J008P70j328q0J779
2243A548j378p97J304j76j120J082L54j466J002N64j316K49J468j151n82J199
2259G84m43o31R98k46q89N78O57j633O32J219j530K55J184r02n63J339n03j170
$$ plain form
2277 -864 488 113 -856 -29 1046 -762 -487 922 -138 -694 593 -44 -1192 461 75 -815 -68
2294 -68 869 -1063 -356 927 -786 -895 757 -181 -832 197 -87 -1033 341 511 -1134 -157 584 -719
2312 -719 -613 264 -517 -902 510 -217 -874 161 197 -1142 -165 564 -625 -546 614 -235 -666 976 -126
2331 -126 -843 596 279 -728 170 641 -695 77 553 -772 -628 966 -78 -863 970 309 -647 665
2349 665 563 -583 274 831 -455 -126 927 -528 -344 903 358 -801 896 351 -487 410 645 -540
2367 -540 -220 1072 -201 -210 977 -141 -220 950 490 -866 489 882 -192 247 667 -504 117 816
2385 816 55 -565 890 298 -757 416 144 -334 246 691 -653 134 796 -562 -494 970 276 -773
2403 -773 544 53 -580 442 438 -773 -202 863 -694 -654 772 -264 -893 707 -171 -932 257 14
$$ packed form
2277h64J352l75r69Q27J075j808K75J409j060n56J287o37j148J653l86q90P47
2294f8R37j932P07J283j713j09J652r38o51J029k84r46J374J70j645R77P41j303
2312g19J06Q77p81l85J412p27o57J035L6j339R77P29j189P9J160q49m31J642j102
2331a26p17J439l17j007Q98M71j336P72M76j325J44J594j044p85J833o61r56J312
2349F65j02j146Q57N57j286L29J053j455J84J247n45j159J697n45q38Q97K35j185
2367e40L20J292j273rJ187j118p9J170m60j356J355L93j074M39M20j171O21O99
2385H16p61o20J455n92j055J173k72m78N80M45j344P87O62j358O8J464o94j049
2403g73J317m91o33J022mj211N71J065j557M0J426j036o29J600q78p61J189k43
$$ plain form
2421 14 -912 -92 739 -938 -257 554 -666 -684 333 -316 -820 221 366 -1048 -110 158 -1156 -422 579
2440 579 -542 -419 631 -344 -544 673 89 -856 92 285 -946 121 676 -651 -359 429 -291 -618
2458 -618 449 -157 -533 679 102 -878 393 824 -768 119 366 -695 -420 951 -526 -613 922 74
2476 74 -681 321 631 -523 166 518 -465 294 749 -615 -410 668 214 -461 768 507 -510 307
2494 307 650 -192 62 870 -598 -343 957 93 -622 872 275 -560 399 198 -573 438 826 -480
2512 -480 -224 735 -309 -846 523 143 -563 373 358 -952 332 658 -616 105 454 -645 -428 695
2530 695 63 -759 439 481 -819 367 38 -789 -180 570 -710 -191 867 -614 -721 213 -111 -1012
2548 -1012 282 -22 -647 339 270 -1025 -330 411 -357 -539 380 -343 -606 157 -327 -1078 156 660 -1123
$$ packed form
2421A4r26Q20Q31j677O81Q11j220j8J017o49n04J041J45j414R38K68j314P34J001
2440E79j121J23J050r75k00J217n84r45R48J93j231J067N55j327K92P88p20l27
2458f18J067o06l76J212n77r80J271M31j592Q87K47j061K75J371j477q7J535q48
2476G4p55J002L10j154O89L52r83P59M55j364K05J078m54o75J229k61j017Q17
2494C07L43q42K54Q08j468K55J300q64p15J494n97q35R59k01p71J011L88j306
2512d80K56R59j044n37J369l80p06R36j5j310J284L26j274P21L49j099K17J123
2530F95o32q22J198M2j300J186l29q27O09P50j280N19J058j481j07R34l24r01
2548a012J294l04o25R86o9j295O95P41p68j82R19p23k63P63m84p51J234N04j783
$$ plain form
2567 -1123 -156 443 -690 -613 408 -590 -222 554 28 -864 394 379 -872 214 573 -1029 -155 592
2585 592 -376 -421 815 -230 -659 569 192 -701 277 417 -299 14 781 -172 -372 863 -89 -537 645
2604 645 113 -618 578 302 -510 114 565 -386 -172 1005 -468 -438 451 163 -410 872 553 -733 612
2623 612 616 -330 359 525 -206 -202 886 -255 -441 632 29 -234 161 320 -301 273 574 -438 -71 693
2643 693 -65 -184 733 -258 -522 562 471 -615 147 208 -817 193 380 -417 -529 468 -408 -483 636
2662 636 151 -659 353 311 -735 -225 424 -958 -260 463 -453 -669 385 -330 -720 423 317 -833
2680 -833 48 297 -555 -198 416 -577 -464 261 -242 -812 821 -51 -614 207 217 -816 -191 328 -716
2699 -716 -47 658 -476 -424 661 -71 -418 570 133 -689 -19 552 -265 -338 621 -382 -60 506 -78 -657
$$ packed form
2567a123R67N99j133P7J021r98L68P76n26q92J258j5j251J086L59j602Q74P47
2585E92r68m5J236j045m29J228l77q93R78J40p16L13P67r53k00J235r52m48J182
2604F45n32p31J196k76q12O24M51r51K14J177j473L0Q89k88n73J282l19j286J345
2623F12Mr46O89J66p31MJ088j141j86J073o03k63L95J59o21N74L01j012L67P64
2643F93p58j19R17r91k64J084r1j086P62O1j025J010J87p97j12R97q76p5J119
2662F36m85q10J012m2j046N10O49j382O98P23r16k16J054p15l90J143j06j150
2680h33Q81K49q52L57O14r93J13P25n03n70J633q72n63Q21J0j033O25N19j044
2699g16O69P05j134N2J085p32l47R88m37q22O70N71q17p3R59j003L22N66n84n79
$$ plain form
2719 -657 166 197 -569 8 298 -513 143 542 -240 143 738 -61 -357 753 70 -616 235 423 -436 105
2739 105 596 -443 194 776 -750 -216 651 -85 -318 914 378 -243 506 160 -342 -16 395 -324 -393
2758 -393 918 111 -558 675 372 -541 246 514 -940 203 775 -400 -349 928 -596 -415 536 90
2776 90 -667 559 14 -691 -78 125 -501 -212 717 -623 -251 707 -399 -164 445 -3 -889 128 165
2795 165 -679 -129 351 -426 -444 654 -556 -576 201 -413 -722 287 43 -767 291 514 -583 5 582
2814 582 -492 -672 466 -121 -561 434 -111 -751 181 -92 -886 -7 662 -393 -631 443 -231 -320 656
2833 656 9 -431 515 305 -420 -92 456 -270 -92 520 -367 7 461 -29 21 318 136 -725 783 494
2853 494 -304 451 393 -307 -215 631 -206 169 532 265 -358 629 483 -695 165 510 -149 8 708 -296
$$ packed form
2719f57Q23L1p66N77K90q11O56L99p82L83N95p99k96J110o83o86Q51J88q59N41
2739A05M91j039O37N82j526N34Q67p36k33J232n36o21P49l46n02L26M11p19o9
2758c93J311q07o69J233l03r13P87K68j454J143N72j175N1J277j524J81R51m46
2776I0p57J226n45p05O13K03o26K89R29j340L72R58j106K35O09m48q86J017L7
2795A65q44N50M80p77j8J098j210k0P77o14l09J009k44q10J058K23j097N88N77
2814E82j074j80J138n87m40R95n45o40R32k73p94Q79O69j055k38J074o74q9R76
2833F56o47m40R46k10p25L28N48p26J78O12q87L74M54m90N0K97j82q61J508k89
2853D94p98P55n8p00R2Q46q37L75L63k67o23R87j46j178Q60L45o59J57P00j004
$$ plain form
2873 -296 -139 644 -98 -190 726 417 -636 204 396 -611 48 669 -395 82 663 -451 -615 617 189
2892 189 -549 279 371 -157 178 200 -561 639 574 -346 -140 752 -18 -645 473 190 -835 -73 97 -543
2912 -543 124 383 -391 -468 447 -138 -456 575 -58 -593 -20 -5 -661 423 51 -557 -271 624 -681 -333
2932 -333 527 -350 -577 242 -92 -616 263 307 -609 -214 311 -364 -359 307 -368 -576 330 -109 -344 109 135
2953 135 -488 200 350 -551 -791 531 70 -274 528 154 -355 487 -51 -604 495 666 -160 -79 733 -287
2973 -287 -235 319 221 -189 191 108 -471 195 458 -477 146 607 -348 -139 482 -148 -237 548 312 -532 738
2994 738 485 -421 481 589 -518 50 615 -135 -48 516 -256 -563 555 166 -472 453 358 -404 -157 579
3014 579 -418 274 718 -306 -109 646 99 -669 365 493 -479 139 383 -167 -246 99 -301 -128 643 -553
$$ packed form
2873b96J57P83p42r2R16l09j053Q40J92j007O59O21j064M77N81j114j64J232m28
2892A89p38Q28R2n28L35K2p61J200o5r20K06Q92p70o27J118k83j025P62J70o40
2912e43O67K59p74p7R15n85l18J031o33n35N73J5o56J084l72o08K86Q95j305L48
2932c33Q60q77k27Q19l34n24Q79M4r16L95N25o75NO66o75k08R06m39k35M53K6
2953A35o23O88J50r01k40J322m61l44Q02l74n09Q42n38n53J099J71q26Q1Q12j020
2973b87N2N54r8m10L80q3n79O66K63r35O23M61r55K09O21o30q9P85k36q44J270
2994G38k53r06R02J08j107N68N65p50Q7N64p72l07J118l89o38R25r5p62K47P36
3014E79r97O92M44j024J97P55n47p68J034J28r72O18K44n50p9L45m00J73P71j196
$$ plain form
3034 -553 -536 266 -370 -588 316 310 -604 204 250 -501 -176 566 -315 -329 600 27 -852 -8 191 -428 -16 398
3056 398 -571 -238 336 -497 -391 526 223 -691 146 370 -390 42 -42 -444 -86 353 -257 -256 565 -179 -394
3077 -394 221 58 -476 425 515 -573 197 367 -434 -248 278 -315 -255 482 80 -416 348 142 -384 78
3097 78 284 -376 362 221 -26 197 582 243 -56 349 172 -259 272 211 -418 298 433 -403 -251 637 -114
3118 -114 -145 525 -48 -277 445 354 -36 394 637 -66 -36 629 -202 -444 480 269 -203 549 254 -443 480
3139 480 237 -356 26 511 -495 58 208 -274 -487 508 -70 -358 607 -32 -394 -11 417 -87 108 412
3159 412 -503 -207 435 -109 -175 278 150 -880 256 -45 -621 -352 413 -389 -30 617 -234 -462 -37 93
3179 93 -323 74 306 -172 137 230 -469 -8 297 -372 -175 606 -128 -358 316 -3 -433 281 58 -872 -182
$$ packed form
3034e53J7Q02o36k18R04or14Q08M6p51L25P42q81j4R29n73q79Q44J99o19M12M14
3056C98r69L33N74q33J06R17l03r14Q37K24p60M32q4m02L58M39o10JQ21p44k15
3077c94O15j63n34R01R0j088P70J70q01J86N26n93O0P37m02m96P64k06n26M62
3097G8K06o60P38j41k47K23L85l39k99M05j77m31N31o1o29P16J35q36J52Q88p51
3118a14l1O70n73k29P22r1l90M30K43p03L0O65q31k42R24k11m72P52k95o97R23
3139D80k43n93L82M85j006N53J50m82k13R95n78k88R65o39l62L83M28n04J95L04
3159D12r15K96O42n44o6M53j28j030J136l01n76K69P65q02L59O47q51k28M25J30
3179I3m16L97K32m78L09R3o99M61L05o69J97P81p34k30O74l19m30P14k23r30O90
$$ plain form
3200 -182 517 -425 -44 686 -416 -452 469 -128 -232 320 277 -306 16 279 -452 -95 574 -275 -328 562 -221
3221 -221 4 531 278 -446 250 696 -138 183 465 -187 -19 404 136 36 468 -48 -253 557 567 -485
3241 -485 325 233 -33 169 635 -422 -308 347 -309 -215 -109 162 -25 276 250 -265 -116 493 -389 16 574
3262 574 210 -398 484 113 -353 43 71 -794 116 255 -464 -218 430 -134 -428 325 106 -167 -33 28 -372
3283 -372 113 115 -511 22 489 -385 -50 -62 -238 -573 278 -267 -536 276 10 -497 67 397 -370 -63 396
3304 396 -394 -420 620 138 -516 91 -172 -186 -48 275 -369 -158 157 -434 -315 190 -46 -509 586 233
3324 233 -408 103 209 -266 -240 456 -320 13 -153 61 -43 702 -71 -266 169 212 -213 29 538 -147 105
3345 105 324 -274 -363 609 45 -148 447 109 -27 -65 627 -374 90 516 62 66 494 69 -139 311 97
$$ packed form
3200a82O99r42L81P30j102l6R21n97j04N52m3n83L22K63p31L57O69q49n3Q90p83
3221b21K25N27k53p24O96M46q34L21K82o52J68M23k68j00M32n16k05Q10J0j052
3241d85Q10r2k66K02M66j057J14O55o56R4J06K71j87L01k6n15J49O09q82M05N58
3262E74l64o08Q82l71m66L96K8q65R10J39p19K46O48n64k94P53k19k73J34O1m00
3283c72M85Ko26N33M67q74L35j2j76l35Q51n45k69Q12k66n07N64L30p67L07M59
3304C96p90k6J040m82o54O07k63j4J38L23o44K11L15n91J19N05k36m63J095l53
3324B33o41N11J06m75K6O96p76L33j66K14j04P45p73j95M35M3m25K42N09o85K52
3345A05K19n98q9R72n64j93N95l38j36l8O92j001M64M26m54MM28m25k08M50k14
$$ plain form
3366 97 -346 326 407 -464 166 317 -109 117 406 -124 -535 26 -25 -295 210 350 -408 227 719 -392 -7
3387 -7 445 -296 -168 437 6 -293 250 -43 -599 309 221 -159 -74 246 -599 57 397 -144 107 301 97
3408 97 -510 566 6 -180 167 169 -474 -191 91 -377 3 106 -587 -413 377 24 -457 67 -32 -334 -277
3429 -277 92 -483 -199 450 -484 -373 31 -105 -374 29 227 -112 -73 80 -522 -311 70 -280 -52 459
3449 459 -186 -186 336 -206 -214 183 57 -210 134 376 -102 -50 312 72 -28 198 45 -440 508 54 -245 420
3471 420 279 -58 168 516 -85 -71 304 -31 -32 414 -228 -494 152 117 -429 152 315 -110 -55 629 34 -148
3493 -148 197 218 -51 63 249 -61 249 -34 -205 -116 341 -100 -141 473 448 -241 312 -272 -762 75 56 -376
3515 -376 -221 479 -101 -69 270 -272 -98 356 21 -389 167 22 -174 -221 142 -159 -92 38 -220 49 381
$$ packed form
3366I7m43O72Q1q71O30J51m26K26K89n30m11N61n1k70N05J40p58O35M92j111L85
3387gM52p41J28O05m31k99N43k93n56R08q8l80Q5L20q45O56L40n41K51J94k04
3408I7o07J076n60j86L47Ko43K83K82m68L80J03o93J74P90l53m81N24r9l02N7
3429b77L69n75K84O49r34J11M04j36k69M03J98l39L9J53o02K11L81l50K28N11
3449D59o45%N22n42qL97j26k67L44K42m78N2L62k40j00K26j53m85R48m54k99O65
3471D20j41l37K26L48o01J4L75l35jM46o42k66O46l5n46N81J63m25N5O84n95j82
3493a48L45K1k69J14J86l10L10k83j71Q9M57m41m1O14k5o89N53n84m90Q37j9m32
3515c76J55P00n80L2L39n42J74M54l35m10N56j45j96m7L63l01O7J30k58K69L32
$$ plain form
3536 381 -59 -366 182 155 -602 145 -140 -274 -217 -189 -312 -365 332 -340 -278 166 -23 -382 -12 65 -209 -359
3558 -359 104 -330 51 200 -267 -114 288 -129 -322 282 -9 -336 32 178 -207 260 416 -8 101 334
3578 334 -48 -375 174 125 -523 239 200 -530 -9 355 55 -47 323 -82 -102 465 65 -400 60 147 -152
3599 -152 -380 221 -177 -50 389 -364 -139 356 104 10 295 42 -569 242 429 -286 226 189 -218 42 578
3620 578 177 -349 297 263 -109 337 162 -190 667 199 -327 -16 273 -346 -139 366 -164 -180 133 -37 -94
3641 -94 143 215 -266 -137 196 -184 110 16 -7 -140 -23 -34 -141 134 -3 -295 -144 -93 -639 -33 180 -90
3663 -90 -93 262 -164 -110 437 -8 -427 -104 171 -313 0 269 -286 -55 221 -155 -182 -51 -247 -313 347 121
3685 121 -278 -72 -103 -261 -176 29 -82 -484 94 -139 -298 376 142 -19 6 561 -193 66 289 -74 -229
$$ packed form
3536C81m40l07N48k7p57P47k85j34N7K8j23n3O97o72O2M44j89l59L70P7k74j50
3558c59M63m34L81J49m67J53M02m17j93O04k91l27L68J46l85M67J56m24J09K33
3578C34l82l27N49m9o48P62l9p30N21L64l00j02L70m05k0N67m00m65M60Q7k99
3599a52k28O01l98J27M39p53K25M95k52r4K85k53o11Q11J87p15N12l7m07K60N36
3620E78m01n26O46l4l72M46j75l52Q57m68n26L11K89o19K07N05n30j6L13j70n7
3641i4K37P2m81J29L33l80K94r4k3j33J17j1j07K75j37k92J51N1n46O06K13k70
3663i0lL55m26N4N47m45m19L23K75m84L13K69n55K31K76l76k7J31j96o6O60k26
3685A21l99K06l1j58Q5K05j11m02N78k33j59O74k34j61K5N55p54K59K23l63j55
$$ plain form
3706 -229 407 -38 -169 84 239 -294 610 249 -375 397 110 -293 -137 300 -343 -13 259 -23 59 128 353
3727 353 -123 300 185 -313 164 44 38 -21 340 3 -56 88 427 103 133 140 -157 -18 335 -111 141 313
3749 313 53 82 34 77 -72 102 119 -344 278 82 -94 388 269 -596 72 349 39 -322 218 -50 -305
3770 -305 23 204 -319 -139 127 -235 -178 203 244 -491 76 -188 -311 -11 30 -487 32 418 -88 16 174
3791 174 45 14 166 -229 -118 146 82 -483 292 410 -520 90 63 -273 1 304 71 -131 -16 -74 -193
3812 -193 -204 -90 -415 -119 -81 -63 -168 166 -28 -186 355 27 -69 133 335 -252 66 294 -556 95 -58
3833 -58 46 -75 345 -189 -415 487 -48 -122 270 -87 -258 247 253 75 -150 86 -208 85 -106 -271 -248 253
3855 253 421 -169 154 292 -256 183 103 -181 317 76 123 -168 304 314 -85 -99 205 -56 212 322 -465
$$ packed form
3706b29O36m45j31K53J55n33R04l61o24P72k87m03J56M37o43L30K72k82Q2O9K25
3727C53m76M23j15m98M77j20on9L61l37n9J44L39l24L0Pk97J39L53m46K52J72
3749C13k60K9m8M3j49J74J7m63O22j96j76M82j19q65O68K77l10l61N40k68k55
3770c05L28J81n23J80K66l62N7L81M1p35N67k64j23L00M1n17N19L86n06J04J58
3791A74j29l1J52l95J11K64o4n65P75J18r30O10k7l36K74L03k33k02J15n8j19
3812a93j1J14l25K96L8J8j05L34j94j58N41l28r6K02K02n87L18K28q50O51j53
3833e8J04j21M20n34k26R02n35p4L92l57j71N05Oj78k25K36k94K93j91j65K3N01
3855B53J68n90L23J38n48M39q0k84M98k41M7k91M72J0l99j4L04k61K68J10p87
$$ plain form
3876 -465 116 176 -107 118 363 114 -268 192 -33 -104 137 453 -412 -109 51 -307 -121 413 -424 93 70
3897 70 -41 -259 104 -169 -443 -5 264 17 136 136 -15 -125 -82 147 -146 226 -33 -55 58 -178 -312 -89
3919 -89 40 -343 62 -108 40 -155 -136 -175 -160 -152 302 -219 -97 200 -254 -187 -147 12 42 316 121 -76 67
3942 67 -138 -271 -10 -37 -88 -102 84 51 188 207 19 -281 460 -7 30 133 171 8 263 39 -95 283 118
3965 118 23 -104 266 157 -85 -190 -138 -1 329 229 -74 -162 424 -55 -277 40 237 197 -76 -164 -101 38
3987 38 539 -175 18 200 -256 11 -70 4 12 497 120 -233 136 173 -92 -58 123 -577 107 557 -89 -9 186
4010 186 29 -160 198 -36 -312 58 307 -174 159 293 -109 -256 62 -131 -2 165 -11 -355 419 -82
4030 -82 0 -215 276 -324 -92 198 -353 251 97 -139 -446 236 135 -250 -9 152 -82 129 23 32 -137
$$ packed form
3876d65N81O0k83K25K45k49l82M60k25p1K41L16q65L03J60l58J86N34q37N17k3
3897G0j11k18L63k73k74M38K69k47J19%j51j10M3K29k93L72k59k2J13k36j34K23
3919h9J29l83M05j70J48j95J9l9J5QM54n21J22K97m54O7M0J59L0K74j95j97J43
3942F7k05j33K61k7n1j4J86l3J37J9j88l00P41m67L7J03L8j63K55k24j34L78j65
3965A18r5j27L70j09k42j05N2J37L30j00l03q8N86m79k22L17J97m0k73q8O3J39
3987C8N01p14J93J82m56K67q1P4QM85l77l53L69L7k65L4J81p00O84M50o46Q0J95
4010A86j57j89L58k34k76L70K49m81L33J34m02j47L18j93J29J67j76l44P74n01
4030h2Q2k15M91o00K32K90n51O04j54k36l07O82j01l85K41J61k34K11j06Rj69
$$ plain form
4051 -137 260 -29 -82 443 -37 -279 18 245 -69 -69 40 -285 54 303 -89 -169 13 189 -233 122 132 -176
4073 -176 335 84 -183 -196 281 -299 -37 477 -75 115 147 9 -316 -363 170 -142 77 205 76 -267 262
4094 262 -104 -239 87 150 -189 397 390 -115 386 203 -264 136 132 47 287 292 201 162 443 78 -6 137 350 -114
4118 -114 274 106 -217 -195 269 37 -310 31 25 -15 -138 174 -89 -237 103 -209 -52 161 -225 124 3
4139 3 -116 202 2 -102 -200 115 -17 -166 -1 -20 -291 34 241 -46 -166 93 143 -291 133 347 -147 233
4161 233 -85 -334 -194 121 -324 -167 69 -319 -130 579 25 -458 76 -68 -298 -84 184 -373 -345 246
4181 246 -188 -151 325 -144 -163 130 -164 1 -115 51 -18 242 293 46 -285 461 -134 -157 296 -85 19 342
4203 342 299 -311 -46 269 65 1 129 -5 -8 274 110 -458 249 223 -101 -36 411 -259 -102 357 110 212
$$ packed form
4051a37L97k89n3N25m80k42K97K27l14%J09l25L39K49l92q0J82J76m22L55J0l08
4073a76N11k51k67j3M77n80K62N14n52J90L2j38l25m7N33l12K19J28j29l43N29
4094B62l66j35L26O3l39N86pn05N01j83m67M00mq5K40Nr1l9K81l65q4J43K13m64
4118a14L88j68l23K2M64k32l47L41om0j23L12k63j48L40l12J57K13l86L49j21
4139Cj19L18k00j04r8L15j32j49J65j9k71L25K07k87j20K59N0m34M24K14m94L80
4161B33l18k49J40L15m45J57K36l88J89P09n54m83N34j44k30K14K68n57K8N91
4181B46m34L7M76m69j9K93k94J65j16J66o9K60N1k47l31P46n95k3M53l81J04L23
4203C42m3o10K65L15k04o4J28j34lK82j64n68P07k6l24O5M47o70J57M59k47J02
$$ plain form
4225 212 242 -101 -259 263 106 -22 -55 464 -69 201 410 -1 -262 261 -144 -273 554 -18 -355 158 152
4246 152 -257 96 6 -236 157 51 -215 -145 201 30 -385 153 -227 -132 -15 441 -237 -325 418 -388 219
4267 219 118 -296 -51 249 -169 -121 -22 -37 284 57 -141 -194 -87 551 -133 -300 -24 -129 -411 -220 233
4288 233 -430 366 -105 -183 152 112 -32 50 67 -163 -107 99 -18 -81 299 189 -286 164 66 63 -18 72 65 242
4312 242 294 204 -297 400 81 -282 131 -58 -354 -166 305 -183 -202 -52 272 -28 195 20 -236 149 163
4333 163 -161 147 357 -18 -455 616 -194 206 240 165 79 -17 207 -383 -120 264 172 221 -291 98 -154 209
4355 209 68 30 -134 103 -85 287 269 -295 151 170 -224 240 187 107 221 331 -22 -192 185 307 -31 205
4377 205 175 -450 -168 -85 -86 -295 226 -154 -484 147 -57 -101 104 146 -299 -11 277 -145 -356 -56 -169 -122
$$ packed form
4225B12L0l43j58N22j57j28l3N19n33K70K09m11k61N23m05j29Q27n72l37N13o
4246A52m09L53r0k42L93j06k66P0L46j71m15N38l80R5J17M56o78q8P43q06O07
4267B19j01m14K45L00m18M8R9j5L21k27j98n3J07O38o84j67K76j05k82J91M53
4288B33o63P96m71p8L35m0j44Q2J7k30N6K06j17o3L80j10m75M50r8lq1R0pJ77
4312B42N2r0n01O97l19l63M13j89k96J88M71m88j9J50L24l00K23j75k56L85J4
4333A63l24L08K10l75m37J071q10M00L4p5q6r6K24n90K63L84r2M9n12L89k52L63
4355B09j41l8j64K37j88L72j8n64M46J9l94M64n3q0J14J10l53j70L77J22l38K36
4377B05l0o25K82Q3jk09N21l80l30O31k04m4K05M2m45K88K88m22k11L00j13M7
$$ plain form
4399 -122 187 40 -345 -26 140 -100 -30 197 -381 -297 264 -38 -71 291 25 -68 -358 -52 -231 -1 -62 -291
4421 -291 251 115 -357 -75 371 -130 32 -266 208 73 2 -8 24 -18 41 -169 -174 290 -158 -93 266 129 -222
4444 -222 141 22 -184 -10 112 -111 -232 383 -59 328 239 -11 -124 45 104 63 167 292 208 48 231
4465 231 -57 102 -174 -101 -232 -9 -172 -111 52 -58 125 274 -114 -90 -144 113 -433 98 362 366 -296 205
4487 205 -206 -367 173 43 -53 -57 390 -48 -62 57 -261 -372 320 -181 -229 70 -49 -79 152 250 -348 -129
4509 -129 -42 -83 -182 421 -196 -366 464 44 -201 -127 -19 -271 -48 -124 -99 -274 2 45 -423 310 -100 -293
4531 -293 200 240 -262 55 84 101 -29 23 -284 -126 246 45 -402 244 -192 -363 326 -10 -64 -18 -35 -80 -87
4554 -87 -40 -250 -267 421 -28 -395 239 4 16 43 101 256 169 -43 -46 5 211 -17 -123 100 -207 -127 321 -6
$$ packed form
4399a22L09j47l85L19J66k40P0K27n78Q4N61l02l3L62k66r3k90L06j79K30o1k29
4421b91N42j36m72K82M46n01J62k98M74j35p1j0L2m2N9k10nM64m48O5L59j37l51
4444b22L63j19k06J74J22k23j21O15m42L87q9k50j13J69N9m1J04J25q4j60J83
4465B31k88J59k76P3j31K23j63O1J63j10J83J49l88K4n4K57n46N31K64Mo62N01
4487B05m11j61N40j30r6mM47m38j4J19l18j11O92n01m8K99j19l0K31R8n98K19
4509a29Q7m1r9O03o17j70Q30m20k45P4J08k52K23p6K5j75K76M3m68P33m10j93
4531b93M93M0n02L17K9J7j30N2l07J58L72k01m47O46m36j71O89l36n4M6j7m5p
4554h7M7k10j7O88m49l67O34k35J2K7N8J55q7k12lN1K06k28j06K23l07Q0M48l27
$$ plain form
4578 -6 164 -212 235 38 348 33 -86 30 242 -85 -323 -19 -61 -303 -106 314 -299 13 128 165 109 434
4600 434 -156 47 425 79 -122 227 239 204 129 514 -253 -188 131 -6 66 332 -63 -353 389 72 -36 -23
4622 -23 -340 2 -27 256 -124 -124 178 -177 -364 235 -149 -80 102 337 253 -39 -37 -219 -23 198 -260 -33 -11
4645 -11 206 -612 143 232 -478 163 233 114 -70 131 102 97 331 -262 -116 -23 -136 -361 -34 140 -275 -209 36
4668 36 120 -152 -45 84 -39 160 -238 -415 -97 184 16 -410 80 -106 -59 304 -342 -300 68 6 97 -39
4690 -39 -137 -38 53 -199 102 10 85 -38 -137 -37 -30 -246 46 -31 94 172 368 7 118 46 176 135 236 17
4714 17 -24 633 51 -38 7 242 110 222 336 -215 -68 304 115 72 293 -153 132 332 48 -176 -18 148
4736 148 -243 -117 238 -43 59 254 -246 207 -31 -16 -70 18 -13 216 109 224 -296 -328 492 -173 -116 20
$$ packed form
4578fJ70l76M47j97L10l15j19J16K12l27k38L04m2k42J97M20o13L12J15L7n6L25
4600D34n90K03L78l46k01L49J2l5p5L85p67O5L19j37P2K66l95k90P42l17j08J3
4622b3l17L42k9K83l80%L02l55j87N99l84O9J82K35q4k92Kj82J96K21m58K27K2
4645a1K17q18P55Q9p10O41P0j19j84K01k9nK34n93J46R3j13k25L27J74m15O6K45
4668C6Q4k72J07J29j23J99l98j77L18K81j68m26M90j86M7L63o46M2L68o2R1j36
4690c9r8R9R1k52L01r2P5j23r9J00Pk16K92p7J25P8J96l61J11p2J30m1J01k19
4714A7m1O57n82q9M5K35j32J12J14n51J47L72j89m3K21m46K85K00k84k24J58J66
4736A48l91J26L55k81J02J95n00M53k38J5n4Q8l1K29j07J15n20l2Q20o65N7J36
$$ plain form
4758 20 118 -177 372 -87 -363 164 21 -186 93 221 160 187 -79 -169 -343 117 -162 -143 63 -127 -297 -57
4780 -57 474 -173 221 -87 -13 -145 306 -447 -342 162 -269 26 251 363 -53 -188 23 -31 178 6 -98
4801 -98 -136 132 285 -142 149 -89 -35 -132 185 -85 -373 -53 -219 -243 17 210 -171 154 99 91 152 -51 -9
4824 -9 -299 119 -39 -55 50 -117 -323 449 -167 -354 129 96 -202 -17 -120 -188 -109 27 -102 -134 8 -279
4846 -279 106 196 -147 -94 85 233 7 146 250 -115 126 86 -218 -211 218 36 305 -77 120 27 -194 19
4868 19 -12 52 18 -287 -189 -59 118 -8 -279 -116 -196 233 -131 -180 342 30 -245 118 85 -211 -72 67 90
4891 90 -217 -142 68 -309 85 164 -380 127 197 -128 -56 354 -358 -26 81 249 199 -41 110 -36 -175 24
4913 24 -191 -34 242 -107 -366 115 -274 29 42 -32 -364 -15 230 -51 -22 -142 41 -258 -322 -98 -388 293
$$ packed form
4758B0R8k95N49m59k76N27j43k07K79J28o1K7k66r0j74M60k79J9K06j90j70K40
4780e7N31o47L94l08P4j32M51p53J05N04m31K95K25J12m16j35K11n4K09j72j04
4801i8l8K68J53m27K91k38N4r7L17k70k88L20j66k4K60J93l81L25n5qO1k03M2
4824ik90M18j58j6J05j67k06P72o16j87M83l3k98J85j03o8P9J36j29l2J42k87
4846b79L85R0l43N3J79J48k26J39J04l65K41m0l04PM29j82K69l82J97r3k21K13
4868A9l1O4l4l05R8J30J77j26k71J63q0M29l64m9N22l12k75L63l3k96J39J39K3
4891I0l07P5K10l77L94P9n44N07P0l25P2M10p12L32J07J68n0k40J51j46j39J99
4913B4k15J57K76l49k59M81l89L03J3p4l32L49K45k81K9j20J83k99o4K24k90O81
$$ plain form
4935 293 31 -515 230 191 -308 54 154 198 -103 -18 -46 223 270 -312 -215 548 194 -157 -133 -9 -160 -70 39
4958 39 -92 3 163 -18 109 4 102 54 55 421 -320 34 49 130 -174 196 61 166 365 150 13 29 135
4981 135 -132 217 144 33 -19 -225 -87 171 151 -68 85 -165 30 -332 131 169 -114 -283 19 -12 -134 18
5003 18 74 -179 292 -53 -302 120 393 -80 83 135 19 -249 415 82 -233 289 133 -345 347 239 -450
5024 -450 -148 247 34 -162 226 51 -124 93 -103 -220 -179 65 -6 -58 -58 -189 -83 -36 41 76 453 59 -79
5047 -79 -212 101 -233 10 -241 -110 95 -177 -107 -90 312 -37 -407 31 232 -271 204 -28 -353 360 131
5068 131 -139 84 -120 48 -279 -89 -270 -69 41 -46 -138 263 65 -102 -93 -82 234 77 23 77 124 50 130
5091 130 88 -179 150 28 128 427 98 108 103 165 53 83 128 16 -177 -216 -357 -221 -119 -315 -326 290 37
$$ packed form
4935B93k62n46P45l9m99L62J00M4l01Q5k8K69M7n82R7P63l54l51K4J24j51R0J09
4958C9j31R5J60j81J27j05R8m8JL66p41L54J5Q1l04L70j35J05J99k15j37J6J06
4981A35k67L49p3j11n2k06J38K58k0k19J53k50J95l62M63L8k83j69L02l1j22J52
5003A8N6k53M71l45k49M22K73m73J63N2j16k68O64l33l15N22j56m78O92j08o89
5024d50L02L95k13j96L88j75j75K17j96j17M1K44p1n2%j31J06M7P7L5L77l94j38
5047g9j33L13l34K43k51J31K05k72P0J7M02l49l70M38K01n03M75k32l25P13k29
5068A31k70K23k04J68l27J90j81K01J10q7r2M01j98j67RJ1L16j57n4N4M7p4Q0
5091A30m2k67L29j22J00K99l29J0nO2j12L0M5j12j93l9j41J36J02j96j1O16k53
$$ plain form
5114 37 -7 -19 -447 64 28 175 41 -273 43 56 65 413 -30 -187 393 -65 82 24 -142 -54 -156 62 -148
5137 -148 64 370 -112 30 -120 -241 -184 67 -455 -286 32 105 -102 58 112 -332 -106 336 -60 -243 39
5158 39 -82 -125 96 -43 -509 -47 -335 -366 -32 108 -122 8 50 -96 -49 215 -192 -206 314 96 -249 295
5180 295 61 -40 108 220 126 119 137 -211 -101 36 -172 -286 270 204 95 -113 -3 -202 719 -83 -287 -215
5202 -215 -170 18 -59 200 232 -167 200 248 -312 214 -70 19 102 148 93 -245 118 -179 -250 148 -104 -144 18
5225 18 38 87 44 -121 -27 -209 40 45 147 5 -105 -306 303 128 -212 -132 -195 -244 57 -167 -205 63 175 -356
5249 -356 -296 -37 308 -156 -97 238 -246 -40 -46 -114 -31 189 148 23 87 -108 -151 49 -159 -58 -71 275 -65
5272 -65 -13 -87 -328 -135 -159 133 172 183 -62 -95 -11 -83 -191 -221 302 -111 -74 173 -195 -244 -25 80 -178 180
$$ packed form
5114C7m4j2m28N11l6J47j34l14L16J3RL48m43j57N80m58J47n8j66Q8j02K18k10
5137a48K12L06m82J42j50j21N7K51n22J69L18P3k07J60N4m44K26M42l96j83K82
5158C9j21m3K21j39m66M62k88l1L34J40k30J30M2j46M7K64m07j4N20k18l45N44
5180B95k34j01J48J12r4pJ8l48J10J37k08j14N56o6j09k08J10j99R21q02k04P2
5202b15M5J88p7K59L2l99L67M8n60N26k84Q9Q3M6n5l38L63k97p1L98k52m0J62
5225A8K0M9m3j65R4j82K49NJ02j42j10k01O09j75l40Q0o3m9L01k24l8K68J12n31
5249c56O0K59L45m64N9L35m84K06oo8Q3K20m1j25O4j95m3K00k08J01j3L46l40
5272f5N2p4k41J93k4K92L9J1k45l3Q4p2j08l0N23m13L7K47l68m9K19J05k58L58
$$ plain form
5296 180 -38 309 11 -136 -200 -227 43 -61 -230 83 9 -294 -63 129 -252 -60 -151 73 -95 -330 -11
5317 -11 -100 148 160 -196 278 -280 -91 225 149 -106 359 -49 -73 -87 10 -263 -53 112 -50 -110 139 318 -437
5340 -437 -54 217 -18 69 151 -126 -77 -184 -151 207 101 -84 -354 65 63 -224 152 2 11 -4 34 -224 42
5363 42 -118 202 -134 -70 282 -62 244 98 39 -99 382 44 -13 224 18 -46 218 97 -420 -48 212 -138
5385 -138 -50 3 66 15 2 133 -48 233 -306 28 -197 125 -274 -144 288 70 -181 -49 49 -208 -21 120
5407 120 36 -201 -118 -276 1 110 -202 197 -145 -374 198 -190 37 -109 112 44 -418 -91 -358 341 -233
5428 -233 90 -288 138 79 -351 -276 9 288 30 -10 305 -98 -152 -181 -91 -170 2 83 281 38 165 15 6
5451 6 -58 -83 -21 43 -292 85 56 -309 -228 62 343 -108 240 40 151 149 174 -248 47 164 -267 -213 166 362
$$ packed form
5296A80k18L47k98j47o4k7K70j04j69L13p4l03K31J92l81J92r1K24j68k35L19
5317a1q9K48J2l56M74n58J89L16p6k55M65m08k4j4R7k73K10J65j62o0K49J79p55
5340d37L83K71k35Q7Q2k77M9j07L3L58j06j85k70M19kk87L76j50Rj5L8k58K66
5363D2j60L20l36O4L52l44L06j46n9j38M81l38n7K37k06o4K64j21n17L72K60l50
5385a38Q8N3O3n1j3J31j81K81n39L34k25L22l99J30M32k18k51J32R8k57J87J41
5407A20q4k37Q3j58K77J09l12L99l42k29N72l88K27j46K21o8m62L27k67O99n74
5428b33L23l78M26n9m30P5K85K79k58m0L15m03n4k9R0p9J72Q1J98k43J27j50r
5451Fo4k5O2O4l35L77k9l65Q1K90K81m51L48k00J11kK5m22K95J17m31N4L79J96
$$ plain form
5475 362 -267 284 1 -171 210 -108 -58 75 -45 -143 188 -150 -171 -193 -147 122 -337 -52 -157 -205 131 -161
5497 -161 32 -152 274 -338 -454 38 -184 -286 -272 23 -113 -158 -203 -127 141 124 25 224 122 62 53 40 40 26
5521 26 132 113 124 -23 -181 -14 -102 220 197 -114 -132 -232 -218 -67 3 -155 -263 328 -23 -136 164 389 -36
5544 -36 -199 -153 -201 100 173 -234 -67 154 -357 185 43 -84 132 -47 267 237 399 -152 81 422 134 -235
5566 -235 28 93 -7 71 -38 174 -73 26 33 12 118 44 241 346 332 -437 173 185 -123 -12 281 -29 60
5589 60 22 -361 -105 239 99 -189 31 -154 -41 34 274 67 -357 302 -112 47 251 -33 316 -231 -15
5610 -15 -437 -146 -143 -57 138 -1 41 -193 270 -13 -110 -7 210 -48 213 97 -134 144 -25 18 -3 271 128
5633 128 -441 163 38 55 -26 79 -97 191 70 -169 -262 152 292 -7 58 -30 -16 -133 -73 20 -37 -17 -60 31
$$ packed form
5475C62o29N51k83j72L81l18N0J33j20r8L31l38k1k2M6K69m59K85j05m8L36k92
5497a61J93j84M26o12j16M92k22j02J4K95j36m5m5P6K68j7r9J99j02o0rj3%j4
5521B6J06j9J1j47j58J67q8L22k3l11j8j00J4J51P0j58j08N91l51j13L00K25m25
5544c6j63M6m8L01P3m07J67K21n11N42j42j27K16j79L14l0J62n51K33L41k88l69
5566b35K63O5j00P8j09K12k47R9Pk1J06p4J97J05j4p69O10J2l08J11K93l10Q9
5589F0l8l83K56L44j40k88K20j85J13P5K40k07m24O59m14J59K04k84L49n47K16
5610a5m22K91LQ6J95j39M2k34M63k83r7J03K17k58K61j16k31K78j69M3k1K74j43
5633A28n69O04j25J7q1J05j76K88j21k39r3M14J40k99O5q8J4j17O0R3n7K0m3R1
$$ plain form
5657 31 233 10 -55 275 -85 -30 125 36 -124 102 -118 -209 135 120 -140 56 133 85 -40 33 157 -59 338
5680 338 -57 -151 140 54 164 87 -340 52 146 -57 -162 -416 95 29 22 -140 45 -70 225 50 442 135
5702 135 248 -135 -63 -11 76 -86 69 70 -13 -29 -23 -98 39 149 91 -29 432 -131 -152 435 235 -36 -176 269
5726 269 -135 -93 -31 89 -72 -70 9 -135 165 49 -356 17 -191 -480 81 -80 -164 -208 -60 -280 -133 221
5748 221 -78 146 -71 -146 -87 410 52 -38 -231 338 -204 -15 -51 -277 -419 -132 131 88 317 -100 -240 -45
5770 -45 70 -227 127 -104 152 156 208 -344 -42 -71 -1 78 81 -23 26 -102 46 163 -263 42 -143 26 162
5793 162 113 -182 305 -173 -412 -5 183 119 -295 205 -262 -70 441 30 -266 -100 -197 44 115 203 9 37
5815 37 121 -173 291 -29 -82 11 126 -350 -96 98 105 -119 -72 63 -112 69 -96 -66 152 223 -90 233 588
$$ packed form
5657C1K02k23o5L30l60N5J55q9j60K26k20r1L44j5k60J96P7m8j25P3J24k16L97
5680C38l95r4K91q6J10p7m27L92R4k03j05k54N11o6pj62J85j15K95j75L92l07
5702A35J13l83P2N2Q7j62J55Jq3j6Op5J37J10n8j20M61n63k1N87k00k71j40M45
5726B69m04M2O2J20j61KP9j44L00j16m05L73k08k89N61j61q4m4J48k20J47L54
5748B21k99K24k17p5N9M97l58r0j93N69n42J89l6k26j42K87K63m3K29m17j40J95
5770d5J15k97L54k31K56MN2n52L02k9P0P9Lj04M9j28J48J17m26L05j85J69J36
5793A62m9k95M87m78k39M07J88o4m14N00m67J92N11m11k96J66r7K41P1Q8j94K8
5815C7Q4k94M64l20n3R3J15m76K54J94Pk24M7J35j75J81j65L0K18P1l13L23L55
$$ plain form
5838 588 102 -195 119 243 76 119 -303 133 -266 44 -15 60 526 -12 -158 263 -37 -73 63 -229 -350
5859 -350 -162 109 85 -122 37 -114 134 -89 -127 -124 -11 -437 42 -304 76 217 90 -93 92 -210 -107
5880 -107 38 -405 62 74 -62 -158 414 -365 -193 40 -245 -184 -144 -28 -7 247 -170 -299 51 -46 -256 -146
5902 -146 -413 55 129 -33 57 58 -4 0 251 -114 -88 279 -224 195 38 2 96 253 -154 209 -82 -106 63 -352
5926 -352 234 29 170 195 102 185 -36 -90 -382 165 42 -97 -104 -97 -64 -21 -35 164 347 -268 -61 195 120 -16
5950 -16 544 391 41 124 17 -14 2 388 -108 272 98 -112 126 -332 -64 -145 183 35 47 -163 -183 30
5972 30 0 441 259 -143 53 163 -101 161 279 52 -45 362 109 50 -144 25 165 52 -160 -94 -55 -279
5994 -279 -121 6 52 -100 -41 57 -287 -139 -55 -71 35 -49 116 -256 -254 89 284 270 67 -115 128 -223 105
$$ packed form
5838E88m86k97L14J24j67M3m22M36l99L10n9P5M66n38j46M21l00l6J36k92j21
5859c50J88K71k4k07J59j51K48k23l8LJ13m26M79l46L80J41j27j83J85l02J03
5880a07J45m43M67J2j36r6N72p79J72K33k85O1M0J16K1K54m17j29L50r7k10J10
5902a46k67M68P4j62R0Jo2MK51l65K6L67n03M19j57l6R4J57m07L63k91k4J69m15
5926c52N86k05J41K5r3Q3k21n4k92N47j23j39pPL3M3j4J99J83o15K07K56p5j36
5950a6N60j53l50Q3j07l1J6L86m96L80j74k10K38m58K68q1L28j48J2k10k0K13
5972C0l0M41j82m02J96J10k64K62J18k27r7M07k53n9j94J69J40j13k12O6L9k24
5994b79J58J27M6j52N9R8l44J48Q4j6J06q4J65l72KL43J95j4k03j82K43l51L28
$$ plain form
6017 105 101 35 255 -422 -155 -106 -138 -182 -267 -236 11 -85 -202 -101 156 -286 -397 10 56 60 194 -73 -448 145
6041 145 110 -14 97 4 -3 -102 -280 47 -11 432 210 -300 -143 -79 209 28 -31 -130 -43 -8 -172 3 -110 -17
6065 -17 188 -217 -116 -42 -155 198 64 -134 -216 -40 -64 109 212 67 205 -216 -74 -117 105 -370 116 -36
6087 -36 -234 18 9 -1 248 211 219 75 -69 81 -132 215 383 -396 59 -149 -471 -189 -29 120 -99 178
6109 178 66 -459 -108 -206 -62 -334 -330 32 -308 123 203 -226 171 -194 407 -39 0 -17 -207 -4 -201 117
6131 117 184 46 -105 -16 -243 -140 121 123 -103 -143 136 34 -274 14 -307 4 260 -128 -67 -178 -183 93 269
6154 269 158 -302 188 202 -243 48 178 96 -209 225 -82 302 93 280 172 -345 -213 -213 -25 168 247 185
6176 185 -93 145 -105 129 299 54 146 94 -19 139 77 -81 51 182 -55 156 375 -265 138 -211 205
$$ packed form
6017A05mo6K20o77K67M9l2m4q5L1K47r6j17J01K57m42j11M07M6MJ34k67l75N93
6041A45l5j24J11r3pr9j78L27n8M43k22n10J57O4K88j81n9r9Q7L5j64J75j13R3
6065a7K05m05J01P4j13L53j34j98q2J76k4J73J03j45J38m21J42m3K22m75M86j52
6087c6j98K52rj0K49l7Qj44j44J50k13L47J68p79M55k08l22K82J60J49k19K77
6109A78j12n25L51r8J44k72ML62l40M31Q0m29L97l65O01m46L9j7j90K03j97L18
6131A17O7j38j51Q9k27J03K61Kk26m0K79j02l08K88l21L11K56l88O1j11nK76J76
6154B69j11m60M90J4m45K91J30q2l05M34l07L84k09J87j08n17J32%J88J93P9o2
6176A85k78K38k50K34J70k45R2n2j13J58o2j58J32J31k37K11K19o40M03l49M16
$$ plain form
6197 205 168 151 -64 105 -115 286 -135 -33 39 -23 319 -241 67 -273 176 232 -346 87 -122 -150 -350 -71
6219 -71 198 -168 -265 -187 -213 12 173 -31 -58 33 16 -19 175 60 275 -92 -73 -16 464 57 -71 -31 -217 -157
6243 -157 71 312 -84 124 -80 245 -231 149 66 190 276 258 -290 -55 191 -274 63 -230 -37 -100 -356
6264 -356 -123 -243 180 12 -314 133 56 102 171 85 118 56 146 -217 205 39 92 -145 78 75 3 -38 -99 -297
6288 -297 -68 -10 -134 -11 255 -169 -50 -9 -36 -66 52 -5 219 12 -73 -93 55 -317 -79 249 17 159
6310 159 -33 -103 -42 165 338 373 132 16 -81 176 149 204 -124 -268 220 152 -243 106 275 -30 187 -108
6332 -108 -52 243 -96 205 -273 4 47 -147 140 141 -108 -4 -23 -328 -87 159 8 21 170 207 15 -115
6354 -115 -48 -240 -80 -170 45 -13 -42 -333 -272 -176 84 -324 140 -116 -47 -254 -99 263 26 118 157 108 222
$$ packed form
6197B05l7j7k15J69k20M01m21J02P2o2L42n60L08l40M49N6n78M33k09k8k00K79
6219g1K69l66r7P8k6K25J61k04k7R1j7l5J94j15K15l67J9N7M80m07j28M0j86O0
6243a57K28K41l96K08k04L25m76L80q3J24Q6j8n48K35K46m65L37k93J93o3k56
6264c56K33j20M23j68l26M47p7M6O9q6L3o2R0l63M22j66N3k37K23lp2m1o1j98
6288b97K29N8j24J23K66m24J19M1k7l0J18n7K24k07q5k0J48l72K38L28k32J42
6310A59j92p0O1K07J73L5k41j16r7K57k7N5l28j44M88o8l95L49J69l05K17k95
6332a08N6K95l39L01m78K77M3j94K87Jk49J04j9l05K41K46j51J3J49L7j92j30
6354a15O7j92J60r0K15n8k9k91O1R6K60m08M64k56O9k07J55L62k37R2L9m9J14
$$ plain form
6377 222 104 93 -78 236 127 137 180 -197 -338 150 -2 171 -69 -1 185 -42 -70 141 44 54 -371 85
6399 85 -97 -132 8 -151 11 292 419 -130 -30 104 25 -148 171 209 -43 146 -226 -92 -116 122 -202 -130
6421 -130 -80 -109 -128 245 129 -60 139 -138 -166 62 124 -56 -80 -140 -291 -173 -286 26 33 70 -265 -170 -33 147
6445 147 83 -448 307 272 62 -190 264 -351 -71 -14 -295 -255 -229 -31 34 -235 -90 126 247 -6 126 -2
6467 -2 -53 -155 -235 -79 -348 -141 -58 -268 -256 61 -176 200 128 -100 240 130 66 -432 97 -15 360 14 -166
6490 -166 -36 -130 -48 -215 -249 169 20 150 29 -45 9 -145 -122 -242 -121 137 65 -212 2 -173 2 24 -176
6513 -176 -174 -54 140 355 -150 -201 -4 21 -210 -74 -292 214 83 -136 -11 153 70 76 138 273 64 65 -148
6536 -148 -376 98 22 -118 -235 33 -79 109 113 66 27 92 -54 209 121 -120 -148 23 -167 -185 115 -343 -229
$$ packed form
6377B22j18j1j71L14j09J0M3l77j41M88j52J73k40O8J86k27k8K11r7J0m25M56
6399H5j82l5J40j59J62K81J27n49J00J34p9j73L19L8k52J89l72J34k4K38l24P2
6421a30N0k9j9L73j16j89J99k77k8K28O2j80k4o0j51J18j13L12PL7l35R5J37J80
6445A47o4n31P55l5k10k52M54o15K80N7k81M0K6J98O5k69J45K16J21k53J32j28
6467bn1j02q0J56k69K07Q3k10J2L17k37L76p2k28L40j10o4m98N29j12L75l46j80
6490a66J30r4Q2j67l4M18j49J30j21p4N4j54K3j20J21K58p2k77K14j75J75K2k00
6513a76KJ20J94K15n05n1J97K5k31J36k18N06j31k19J25J64q3OO2J35k09Jk13
6536a48k28M74p6j40j17K68j12J88Mm7l9O5j46K63q8k41k8J71j90j8L00m58J14
$$ plain form
6559 -229 153 -47 71 -117 183 -130 -222 373 382 -303 72 -59 -60 66 239 -193 -230 130 164 -43 -247 213
6581 213 288 75 -130 46 77 470 -318 -137 212 -267 73 108 139 72 -146 50 69 193 35 -159 55 88
6603 88 77 -178 18 -27 112 -225 -150 -181 2 172 137 -22 12 -309 -115 -90 88 7 124 130 -102 410 168 73
6627 73 -87 106 -212 -89 278 -195 56 9 -7 -78 83 163 -267 -37 24 21 275 134 -190 87 231 -314 145
6650 145 99 -67 -160 -35 191 -168 -229 -337 -236 34 -17 -285 -80 310 138 -34 21 -179 295 18 -282 56
6672 56 -174 76 73 -111 265 -284 -196 -20 -135 -95 124 -268 -86 347 32 57 116 -1 -158 -208 112 -70 -84
6695 -84 48 339 37 179 177 -10 -19 45 -50 113 194 -25 -287 -73 40 86 34 202 220 -37 -54 1 282 173
6719 173 -94 -78 24 261 178 -110 -16 -22 228 -12 -97 -75 -9 190 -40 -50 -83 406 -96 -252 -158 -73 -33 -78 -75
$$ packed form
6559b29L82k00J18j88L00l13r2N95Ro85L75j31jJ26J73m32l7L60L4k07k04M60
6581B13P5k13k05J76L1L93p88J81L49m79L40L5L1o7k18J96J9J24j58j94K14L3
6603H8j1k55J96m5J39l37P5l1J83J70l5j59L4l21J94K5J78q1J17Ok32N12k42r5
6627G3j60J93l18J23L67m73K51m7j6p1J61Q0m30K30O1lK54j41l24K77J44n45M59
6650A45m6j66r3J25K26l59o1j08J01K70n1k68K05L90j72j72N5k00M74k77l00L38
6672E6k30K50lj84L76n49Q8J76j15M0K19l92J82M33l15K5N9j17j57n0L20j82j4
6695h4J32K91l02J42kj87rO4r5J63Q1k19k62K14J13M6n2J68J8k57j7N5K81j09
6719A73k67J6J02K37q3k88R4oK50k40q5K2O6J99k30j0l3M89n02j56R4Q5M0m5L
$$ plain form
6744 -75 -60 -24 52 -36 140 48 -89 115 -200 24 190 -60 -43 58 228 -161 381 -132 -337 169 133 -203 164
6767 164 78 -165 -65 334 -125 327 135 -128 -161 38 164 85 264 -62 224 127 272 -126 78 104 -153 99
6789 99 267 247 -38 -3 2 -19 29 -63 -114 -264 -80 -234 204 127 -18 -187 -233 -226 -180 230 148 -214 156 60 -170
6814 -170 -55 -76 -129 103 248 340 71 -194 -84 340 33 -84 106 14 -17 -44 68 -295 -97 24 -224 52
6836 52 -58 189 154 -272 107 111 -345 -96 -80 -64 -150 76 85 -54 -114 321 -141 89 -221 -249 -137 -128 79 -232
6860 -232 283 -120 297 -151 -161 -27 -116 297 -81 53 -100 132 106 -112 -162 261 -308 -261 26 -107 -41 -37 -87
6883 -87 -145 162 155 -29 140 -147 -98 -16 -15 -118 147 -478 281 -40 166 -62 38 -54 14 -185 151 58 244 -62
6907 -62 -268 41 172 43 26 -388 246 -373 123 82 32 134 -35 -21 255 -11 -201 37 -58 -19 -381 7
$$ packed form
6744g5J5L6P6q8J76r2j37K04l15K24J66k50J7J01J70l89N42n13k05N06l6l36L67
6767A64q6k43J00L99m59M52j92k63l3J99J26p9J79l26K86r7J45l98K04K6k57K52
6789I9J68k0k85L5Nk1M8r2n1j50J84j54M38p7j45j69m6PM6M10q2l62L70r6k30
6814a70J15k1n3K32J45R2k69k65J10M24l07j17J90r2l1k7J12l63J98J21k48K76
6836E2j10K47l5m26L79Mm56K49J6J6q6K26Rj39o0M35m62K30l10k8J12RK07l11
6860b32N15m03M17m48j0J34q9M13l78J34j53K32k6k18n0M23n69M7K87j33O6Mn0
6883h7n8L07pj84J69k87M9Q2Jj03K65o25P59l21K06k28J00r2O8j99L36r3J86l06
6907f2k06L09J31j29j7m14O34o19M96m1n0J02j69J4K76k66j90K38r5L9l62L88
$$ plain form
6929 7 -30 64 -110 -258 65 101 -355 140 -23 365 -74 52 -123 -212 -48 -62 119 -296 23 -91 298 99
6951 99 112 185 199 -246 -9 415 225 -161 138 -9 112 44 -104 -80 -173 -73 -179 -202 253 191 -106 135 151
6974 151 -64 357 200 -32 -125 -59 137 -154 13 -158 -156 142 137 -329 -164 -90 427 -144 8 179 -112 44
6996 44 15 -340 -85 -161 -224 115 104 -31 -17 -86 -355 -233 -63 85 273 -117 -88 -83 -107 -10 -245 161 18 78
7020 78 -325 -11 -274 -185 160 -35 -134 -37 -199 -96 -135 -55 -1 -27 -81 183 158 -64 -84 -132 -196 -45 -183 -248 157
7045 157 -77 -230 317 -73 79 164 47 174 33 56 14 165 -147 -290 -139 -78 -56 -63 227 -343 -240 -153 366
7068 366 23 150 -176 -211 -42 88 -36 -25 226 5 -12 168 151 -197 342 138 -230 -88 149 113 184 -347
7090 -347 61 -201 -88 169 -162 -149 261 -142 -100 -41 114 0 274 -223 -84 -11 49 95 40 92 -75 -264 -112
$$ packed form
6929Gl7R4j74j48L23L6m56M95j63L88m39J26j75q9J64j4J81m15L19j14L89j99
6951I9J3P3J4m45K37M24j90l86K99j47J21o8j48K4r3J00j06k3M55o2k97K41J6
6974A51k15M21j57k32r3O6J96k91J67j71KK98nm66J65P4N17n71J52J71k91J56
6996D4k9l55K55p6o3L39j1j35J4o9k69J22J70J48J88l90K9Nk4R7k35M06j43O0
7020G8m03L14k63Q9L45j95r9R7j62J03l9Q0N4k6n4K64k5k22k0m8o4J51j38o5M05
7045A57k34j53N47l90J52Q5j17J27j41K3m2J51l12j43J51O1K2pK90n70J03Q7N19
7068C66l43J27l26l5J69J30j24J1K51k21j7J80j7l48N39k04l68J42K37l6P1n31
7090c47M08k62J13K57l31J3M10m03M2N9J55j14K74m97J39P3O0M6n5N2j67j89J52
$$ plain form
7113 -112 -153 -244 -47 46 -79 207 188 412 30 211 -111 133 129 -25 162 186 -222 233 -249 -94 180 -86
7135 -86 -114 -93 65 161 -17 126 85 -125 25 58 -128 207 -70 -443 189 35 120 171 108 -142 120 -1 100
7158 100 76 -261 -13 -348 129 -161 -96 180 -254 45 -150 140 -173 -89 427 176 -238 -391 123 0 -182
7179 -182 98 154 -312 31 69 -95 -242 291 -98 81 93 -99 59 174 -111 -256 258 30 -7 36 270 32
7201 32 -100 -36 74 -155 -6 36 334 -168 -17 -14 -198 97 -342 172 -35 -222 -180 40 11 7 17 5 -121 -261
7225 -261 -241 -70 -346 -143 -130 145 -135 -86 39 -103 -171 -439 249 -95 -131 -133 77 -83 -1 -12 203 4 -95
7248 -95 -193 114 -113 -562 8 2 331 -146 -82 122 -8 64 157 70 -89 -98 -233 253 88 127 30 -25 19 -299 224
7273 224 206 -51 181 43 251 -39 52 -142 -168 220 186 -122 268 5 -61 -92 -209 -271 226 -10 89 6 108
$$ packed form
7113a12m1r1J97R3j25K86j9K24l82J81l22K44mj54J87K4m08M55m82J55K74k66
7135h6k8K1J58R6j78J43m1k10J50L3j86L35k77l73O32j54Q5N1o3k50K62j21J01
7158A00k4l37K48l35M77k90O5K76m34K99j95K90l13Q4N16k51m14j53N14j23j82
7179a82K80N6m66L43L8j64j47N33l89J79J2j92J58J15k85j45N14k28l7M3K34k38
7201C2j32O4J10k29J49M2K98n02J51Lj84K95m39N14k07j87M2K20k9mJ0j2j26j40
7225b61K0J71k76K03J3K75k80M9J25j42o8k68O88l44l6kK10j60Q2j1K15j99r9
7248i5r8L07k27m49N70oL29m77O4K04j30P2R3q7j59rj35M86j65L9r7n5M4l18N23
7273B24j8k57K32j38K08k90R1j94k6L88l4l08L90k63o6l1j17o2M97k36R9q3J02
$$ plain form
7296 108 -27 203 137 8 -289 -198 39 211 -15 379 -105 -77 121 97 161 299 -166 -12 -78 -11 -32 -52 -53 -176
7320 -176 -38 -321 -82 27 131 -99 -95 74 223 1 100 -63 -227 45 -2 -246 71 50 -49 33 -170 -14
7342 -14 -255 142 180 48 302 68 -313 -205 225 7 221 65 113 280 108 -334 -92 -75 25 -348 5
7363 5 -112 28 84 -27 -118 18 281 40 253 202 -43 -129 -240 267 34 -202 130 -294 -118 67 -6 210
7385 210 -142 6 110 -74 171 -170 -134 78 -11 -37 158 -358 -184 -98 -103 62 173 -94 -66 -101 197 -187 -61
7408 -61 -434 145 188 54 -65 177 -149 -12 -283 34 -82 -252 -127 -60 60 146 -51 126 -128 -180 128 -217
7430 -217 -296 13 -34 -53 -13 256 100 -207 8 -84 -21 254 192 -35 176 251 -113 -333 246 56 189 -83 -58
7453 -58 65 97 176 145 -179 -72 131 -41 -210 100 229 107 -207 -155 -63 -77 98 -174 -105 -102 -165 244 -64 193
$$ packed form
7296A08j35K30o6j29k97R1K37J72k26L94m84K8J98k4O4J38m65J54o6O7k1k0jj23
7320a76J38k83K39J09J04k30MJ69J49k22R9j63j64K72m7k44L17k1r9Q2k03J56
7342a4k41L97L8j32K54k34l81J08M30k18K14j56M8J67j72m42K42J7J00l73L53
7363Ej17J40N6j11r1J36K63k41K13n1k45q6j11N07k33k36L32m24J76J85p3K16
7385B10l52J48J04j84K45l41L6K12q9k6J95n16J74Q6nJ65J11k67K8l5K98l84J26
7408f1l73N79M3j34j19K42l26J37k71L17j16j70J25O7J20Q6j97J77k54n2L08l45
7430b17p9L09m7j9M0K69j56l07K15r2O3K75o2k27K11P5l64k20N79j90J33k72K5
7453e8J23L2P9l1l24J07K03j72j69L10J29j22l14N2R2j4J75k72O9Lo3M09l08K57
$$ plain form
7477 193 124 -206 319 -20 -160 105 -318 -45 157 -243 -228 185 -56 -141 58 179 67 -157 16 -60 118
7498 118 -171 -143 94 210 -103 -17 -57 122 80 -66 211 259 76 157 110 129 -234 116 49 -46 33 -37 355 22
7522 22 504 -122 179 6 253 -43 -69 -139 -171 -5 -123 106 -5 124 280 78 142 -12 -19 5 -31 39 -54 -50
7546 -50 -61 75 2 189 -132 152 -240 87 -102 105 116 -52 -121 155 -142 -26 -132 -51 -270 117 -114 5
7568 5 220 138 375 4 22 -164 160 107 303 -223 146 311 102 358 -22 -17 30 13 69 -81 -94 -195 -162 50
7592 50 98 66 166 -346 -144 -90 76 47 -300 202 278 64 28 36 -38 -151 168 -198 -304 -76 40 64 43 -189
7616 -189 -144 -93 29 -181 37 179 -131 -202 132 114 -176 -81 30 25 -241 -6 -56 -97 192 -163 19 -126 -197
7639 -197 -143 151 130 -154 86 127 -4 84 196 211 -250 136 79 -404 -143 -330 -153 -132 -216 212 -136 -23 42
$$ packed form
7477A93o9l30N25l39j40K65m23K73K02m00J5M13k41q5J99J21j12k24J73p6J78
7498A18k89K8K37J16l13Q6m0J79m2j46K77M8j83Q1m7J9l63L50o7r5P9p0L92l33
7522B2M82o26L01j73K47k96k6p0l2J66j18K29j11J29J56k02O4j54pK4l6P0r3M
7546e0j1J36p3J87l21K84l92L27j89K07J1j68o9K76k97J16j06Q1k19L87k31J19
7568EK15q2K37l71J8j86L24n3J96n26L69J65k09K56l80NM7j7N6j50j3j01L3K12
7592E0M8l2J00n12K02N4J66k9l47N02P6k14l6Qp4j13L19l66j06K28J16K4k1k32
7616a89M5N1J22k10K18J42l10p1L34j8k90R5J11nk66K35n0m1K89l55J82j45p1
7639a97N4K94k1k84K40M1j31Q8J12J5m61L86n7m83K61j87J77K1q4M28l48J13O5
$$ plain form
7662 42 112 61 -38 194 261 85 -140 31 -80 -94 283 -181 -191 -112 127 -117 -91 -25 -61 86 -140 312 28 169
7686 169 -121 -45 218 131 -398 -6 169 -47 356 99 102 -24 292 -20 -219 18 43 -143 -50 135 -165 78
7708 78 171 58 -31 -109 112 -297 -40 20 457 -28 104 -40 307 -97 -178 164 -85 -291 -85 -38 145 225 -7
7731 -7 531 -131 -80 -241 -24 -143 189 213 74 41 54 -99 1 -200 186 -42 -94 -34 -112 19 -174 233 179
7754 179 -78 64 173 70 82 -173 -92 249 -63 394 -350 23 -64 116 119 -17 103 204 41 -72 -62 299
7776 299 228 26 109 16 38 148 117 8 17 258 278 20 142 10 13 397 -86 -233 181 473 248 -149 16
7799 16 -55 -17 153 331 -180 103 443 113 -371 216 -102 -117 8 -98 -237 284 -20 -113 -50 281 -163 163
7821 163 155 -242 -211 219 218 -387 140 334 -292 157 -24 46 188 -44 106 -158 289 216 -438 -51 -186 79
$$ packed form
7662D2P0n1r9K32O7j76k25J71j11j4L77m64j0P9K39k44K6O6l6J47k26M52k84J41
7686A69k90P6K63q7n29L92J75k16M03k57Lj26L16l12j99K37K5j86R3J85l00K43
7708G8R3j13q9p8K21m09K57O0M37m85J32j44L47m04q1L42k49k06K06M7J83Q0k32
7731gN38o62N1j61K17j19L32K4j39l3J3j53J00k01L86k28n2O0p8J31j93M07n4
7754A79k57J42J09j03J2k55Q1L41l12M57p44L73q7J80Lj36J20J01j63j13J0L61
7776B99p1k02Q3r3K2J10l1j09RK41K0k58J22j32LL84m83j47M14K92k25l97J65
7799A6p1L8J70J78n11K83L40l30m84N87l18j5J25j06j39N21l04r3O3L31m44L26
7821A63ql97L1M30jo05N27J94o26M49j81P0J42k32J50k64M47p3o54L87j35K65
$$ plain form
7843 79 -70 99 -143 -94 135 155 156 -104 14 -77 -194 -257 -315 110 -149 60 59 193 -26 -174 -117 268 -88 218
7867 218 43 -128 -238 -21 -232 15 -46 107 262 262 249 19 145 -66 -44 24 -65 -5 4 39 -303 50 104 -150
7891 -150 -32 -78 -58 -171 -161 -154 161 66 -124 109 213 208 -130 121 144 -204 256 24 232 151 104 231 -536 357
7915 357 -60 -92 -184 244 96 4 85 -324 172 76 80 60 -5 119 -131 -243 -24 -115 66 366 -147 174 -99
7938 -99 -446 107 189 -161 -99 187 -76 190 -26 166 9 -316 -29 4 110 15 298 -244 82 313 -44 307
7960 307 -126 231 575 -108 -248 -78 9 -133 -379 -112 -15 -48 217 -157 32 55 -203 72 275 -24 -14 -244
7982 -244 27 190 -47 162 152 -355 83 -103 -132 47 -175 39 80 13 -85 -256 -225 -31 -22 -171 -399 -22 -147
8005 -147 225 87 -133 249 -82 370 -164 -77 -232 102 -56 168 85 50 -165 -173 -9 -58 -8 72 -78 -108 76
$$ packed form
7843G9j49J69k42M9K29K0Jk60J18r1j17o3n8M25k59K09jJ34k19j48N7L85l56L06
7867B18j75j71j10K17k11K47o1J53J55%j3k30J26k11K2O8q9O0RL5l42L53N4k54
7891a50J18m6K0j13J0PL15r5j90K33J04nl38K51K3l48M60k32K08q1m7J27p67Q93
7915C57m17l2r2M28j48r2Q1m09M96r6Mk0o5J24k50j12K19r1J81L00n13L21k73
7938i9l47N53Q2l50O2K86k63K66k16J92j57l25K87L3J06r5K83n42L26K31l57L51
7960C07m33L57L44o83j40J70Q7j42k46K67R7l3K65l74J89K3k58K75K03k99J0k30
7982b44K71J63k37K09j0n07M38j86k9J79k22K14M1o7r8j71L1J94Rj49k28L77j25
8005a47L72j38k20L82l31M52n34Q7j55L34j58K24q3l5k15qJ64m9N0Q0j50l0J84
$$ plain form
8028 76 -45 94 71 64 128 -254 141 -114 -203 296 1 -92 79 -114 225 91 87 -159 -2 200 -345 140 -22
8051 -22 350 -45 73 -38 -22 409 -83 138 -95 69 -37 218 275 -108 -305 -119 165 -155 18 107 -18
8072 -18 113 157 -31 222 161 -186 -65 294 -113 -311 -38 -59 108 -91 -235 19 121 134 57 22 -76 -94 4
8095 4 235 -21 301 40 -347 -142 132 -42 -40 -96 -474 66 105 133 -267 167 124 35 326 257 -81 198 199 -27
8119 -27 36 57 -82 11 137 -40 200 13 74 -153 -144 56 14 -33 -32 233 -113 79 142 -191 -24 -242 194 -457
8143 -457 -39 65 -138 60 145 6 150 -213 -355 302 55 -305 207 -181 58 -42 -195 106 183 -158 267
8164 267 209 85 85 71 124 241 30 65 -132 190 25 -266 388 -120 -119 267 -283 -20 123 -159 242 219 -41
8187 -41 -203 71 57 -148
$$ packed form
8028G6j21J39k3pO4l82L95k55q9M99k95r3J71j93L39j34mk46J57K02n45M85j62
8051b2L72l95J18j11J6M31m92K21k33J64j06K55N7l83j97J86K84l20J73Q9j25
8072a8J31M4j88K53o1l47J21L59m07j98K73k1J67j99j44K54J02J3p7l5r8j8R8
8095DK31k56L22k61l87K05K74j74Kn6l78N40L9K8m00M34m3q9K91o9l38K79Jk26
8119b7O3K1j39R3J26j77K40j87O1k27RK00m2m7JK65l46J92O3l33J67k18M36o51
8143d57M18J04k03J98Q5j39J44l63j42O57k47l60N12l88K39j00j53L01P7l41M25
8164B67n8j24%j4N3J17k11L5j97L22j65k91O54n08JL86n50K63J43k82M01k3k60
8187d1j62K74j4k05
8191a48
$$ Imaginary data points
##PAGE= N=2
##DATA TABLE= (X++(I..I)), XYDATA
$$ plain form
0 0 0 0 0 0 0 0 0 0 -8 8 -8 8 -9 16 -16 24 -24 32 -38 40 -48 56 -69 80 -88 104 -118 134 -151 172 -193 217
32 217 -244 272 -304 338 -377 417 -463 514 -570 630 -698 775 -855 950 -1056 1175 -1312 1473
50 1473 -1661 1887 -2163 2509 -2962 3578 -4473 5894 -8508 14943 -67812 -29729 115452 40010
64 40010 -53245 -67999 6754 52866 17897 -61804 -31115 48321 33026 -34656 -24284 2259
76 2259 -1337 1690 12866 3580 1192 -15564 -34609 3889 51702 9282 -41571 -15365 17560
89 17560 9591 1864 -9052 -13178 16375 25505 -15139 -25564 2048 9645 14956 23500 -11041 -37094
103 -37094 1711 31058 8940 -5037 -2942 -3955 9105 9821 -15274 -3630 30264 8435 -20893
116 -20893 2854 15320 -7575 -6265 13181 15881 10931 -12376 -31040 9644 48813 3760 -38060
$$ packed form
0@%%%%%%%%qJ6j6J6j7K5l2M0m8N6p0P8q8J04j25J49j68J92k22K52k85L23l65M10
32B17m61N16n76O42p15P94q80R77j084J200j328J473j630J805k006K231k487K785
50A473l134L548m050M672n471O540q051J0367j4402K3451q2755L8083J45181p5442
64D0010r3255j4754P4753M6112l4969p9701L0689P9436j5295o7682J0372K6543
76B259l596L027J1176r286k388j6756j9045L8498M7813m2420n0853K6206L2925
89A7560p969p727j0916m126K9553R130m0644j0425K7612P597N311Q544l4541k6053
103c7094L8805K9347k2118j3977K095j013J3060P16k5095J1644L3894k1829k9328
116b0893K3747J2466k2895J310J9446K700m950k3307j8664M0684L9169m5053m1820
$$ plain form
129 -38060 -820 30712 5512 -17603 -12236 14855 35246 502 -44633 -7685 46415 13093
141 13093 -34072 -7959 27177 15986 -14374 -30358 -1651 45166 22177 -41871 -29990 26519
153 26519 23654 -9667 -14063 -4391 9909 15007 -12038 -25393 7455 21627 -3687 -8491 -1853
166 -1853 -11836 -3009 15143 1383 -11685 26 -1216 -7849 2461 -355 -9362 7547 7869 -18759
180 -18759 -12629 11705 1933 -9685 1474 1566 -5094 -2919 -9534 -7368 17061 9139 -23526 -12609
194 -12609 15087 2035 -13405 -2099 4671 4766 575 -17448 -12929 19949 14327 -19844 -11642 13544
208 13544 3519 -9122 -3946 748 8513 9147 -13724 -14814 14492 11604 -13703 -2286 14677
221 14677 181 -10299 -2883 2987 13380 10316 -16261 -13930 19011 14686 -13853 -7724 10263
$$ packed form
129c8060L7240L1532k5200k3115N367K7091K0391l4744m5135L6948N4100l3322
141A3093m7165K6113L5136j1191l0360j5984K8707M6817k2989o4048J1881N6509
153B6519k865l3321m396R672J4300N098k7045j3355L2848J4172k5314m804O638
166a853r983Q827J8152j3760j3068J1711j242o633J0310k816r007J6909L22k6628
180a8759O130K4334r772j1618J1159R2o660K175o615K166K4429p922l2665J0917
194a2609K7696j3052j5440J1306O770R5m191j8023M519L2878n622l4171Q202K5186
208A3544j0025j2641N176M694P765O34k2871j090K9306k888k5307J1417J6963
221A4677j4496j0480P416N870J0393l064k6577K331L2941m325k8539O129J7987
$$ plain form
234 10263 9142 5238 -4562 -15541 4153 24446 4750 -13091 -2517 2328 3856 13037 1414
247 1414 -14053 3719 16827 -274 -8612 -477 2555 10448 11888 -10837 -14002 12668 13189 -6705
261 -6705 -2264 6854 -628 -1229 633 -2585 7257 10738 -10737 -11045 14445 8922 -13337 -5586 9204
276 9204 6615 1684 -8865 -13762 8605 19464 -7389 -16579 4294 6967 -4405 -1919 -1249 -2827
290 -2827 5595 286 -12343 -444 9062 -6614 -6693 7818 -7 -10069 -2138 319 -654 5917 -2729
305 -2729 -14420 613 9093 -6248 -7192 3860 -1707 -3610 2566 -5651 -8693 6553 5186 -7768
319 -7768 -3031 523 -5621 1532 5935 -7460 -5223 7731 -1607 -9538 2024 4209 -2064 1428
333 1428 -2229 -7859 4950 7687 -9422 -5287 11413 2960 -8503 -2701 1185 4732 8870 -4514
$$ packed form
234A0263j121l904r800j0979J9694K0293j9696j7841J0574M845J528R181j1623
247A414j5467J7772J3108j7101q338Q135L032P893J440k2725l165K6670N21j9894
261f705M441R118p482o01J862l218R842L481k1475l08K5490n523k2259P751J4790
276I204k589m931j0549m897K2367J0859k6853r190K0873K673j1372K486O70j578
290b827Q422n309j2629J1899R506j5676p9J4511p825j0062P931K457r73O571q646
305b729j1691J5033Q480j5341r44J1052n567j903O176q217l042J5246j367j2954
319g768M737L554o144P153M403j3395K237J2954r338p931J1562K185o273L492
333A428l657n630J2809K737j7109M135J6700q453j1463N802L886L547M138j3384
$$ plain form
347 -4514 -12824 7394 13625 -6322 -8539 6502 6282 1061 -304 -6729 390 14520 2809 -11133
361 -11133 2412 9539 -2038 -1673 4808 -88 2796 5026 -4910 -2341 10295 2847 -6518 4654
375 4654 6601 -3513 103 3768 -1972 3951 7553 -5259 -4635 8089 2672 -4015 3780 1464 -3756
390 -3756 4592 3269 -7085 717 8639 -2163 -3990 2446 -1485 -840 6306 -1701 -6724 5441 3648
405 3648 -8280 -1495 6114 -1076 -1892 689 -5377 -784 6704 -4312 -8734 5718 4886 -8144 -4377
420 -4377 2001 -768 2264 54 -9839 -1907 9032 -3367 -10350 2657 4360 -4024 -1943 -2927 -4735
435 -4735 4900 3819 -9682 -4357 7131 -2224 -6871 1546 272 -2609 2545 -2748 -7690 3742
449 3742 5350 -7292 -3220 5291 -1904 -3387 1925 -2567 -1456 7065 -1203 -8895 2404 6437 -3046
$$ packed form
347d514q310K0218O231j9947k217J5041k20n221j365o425P119J4130j1711j3942
361a1133J3545P127j1577L65O481m896K884K230r936K569J2636p448r365J1172
375D654J947j0114L616L665n740N923L602j2812O24J2724n417o687P795k316n220
390c756Q348j323j0354P802P922j0802j827O436l931O45P146q007n023J2165j793
405C648j1928O785P609p190q16K581o066M593P488j1016m422J4452q32j3030L767
420d377O378k769L032k210r893P932J0939j2399o983J3007J703q384K081r84j808
435d735R635j081j3501N325J1488r355m647Q417j274k881N154n293m942J1432
449C742J608j2642M072Q511p195j483N312m492J111Q521q268p692J1299M033r483
$$ plain form
464 -3046 -755 2545 -2912 1546 5983 -4845 -4329 7799 3301 -4785 1233 1966 -2333 4004 3875
479 3875 -4331 1317 6810 -3476 -2718 7655 2523 -3527 2777 1914 -803 5196 1997 -5980 4073
494 4073 9651 -3170 -5413 4422 3027 1635 3844 -3176 -3941 8446 5300 -6734 88 6635 -221
509 -221 -379 2635 -2611 863 6960 -1822 -5327 5700 3158 -5524 572 4134 -1373 1008 1145 -5922
525 -5922 95 8274 -2293 -7379 2707 2350 -3268 855 -935 -4810 3645 4168 -6828 -3434 4972
540 4972 -1656 -4333 2612 -963 -4002 2010 -1703 -5462 3843 3015 -8742 -4276 5129 -251 -3321
555 -3321 -694 -5051 -1212 7205 -2171 -10888 325 6112 -2017 -2843 -1753 -5049 1368 5770 -4607
570 -4607 -5745 3558 -94 -4094 2979 1394 -5768 -331 2984 -1527 1152 1169 -6644 -1108 9552
$$ packed form
464c046K291L300n457M458M437j0828N16J2128m498q086O018P33m299O337j29
479C875q206N648N493j0286P58J0373n132o050O304q63k717N999l199p977J0053
494D073N578j2821k243R835j395j392K209p020p65J2387l146j2034O822O547o856
509b21j58L014n246L474O097q782l505J1027k542q682O096L562n507K381J37p067
525e922O017Q179j0567n086J0086l57n618M123j790l875Q455N23j0996L394Q406
540D972o628k677O945l575l039O012l713l759R305q28j1757M466R405n380l070
555c321K627m357L839Q417r376q717J1213N787q129q26J090l296O417M402j0377
570d607j138R303l652m000P073j585p162N437L315m511K679J7p813N536J0660
$$ plain form
585 9552 662 -8011 -1125 2960 2353 3687 -2538 -7910 4397 9606 -3032 -5511 2857 2145 1614
600 1614 3586 -3297 -3890 6463 4353 -4425 1383 4394 -2400 100 4817 -280 98 3804 -2051
615 -2051 -2031 7356 2619 -5599 1352 5492 149 885 1500 -3222 2478 7165 -2275 -4587 4837 3234
631 3234 -2487 1833 1921 -1603 2751 1720 -4820 1993 7305 -2683 -5617 3359 3199 -416 953 -3044
647 -3044 -3419 6237 3709 -7473 -3247 4856 363 -620 1060 -4245 -2765 4663 451 -4499 619
662 619 96 -4592 1504 4321 -5310 -4825 1587 462 544 907 -6953 -5218 7390 3935 -7550 -5006
678 -5006 453 815 2862 -49 -8526 -2735 6545 160 -5463 -1145 -1012 -1805 3641 78 -6603 -673
694 -673 3442 -2058 -637 2318 -3996 -3497 4215 923 -3522 613 -589 -2958 3724 2898 -5798 -1893
$$ packed form
585I552q890q673O886M085o07J334o225n372J2307N209j2638k479Q368p12n31
600A614J972o883n93J0353k110q778N808L011o794K500M717n097L78L706n855
615b051K0R387m737q218O951M140n343P36O15m722N700M687r440k312R424j603
631C234n721M320Q8l524M354j031o540O813N312r988k934Q976j60l615J369l997
647c044l75R656k528j1182M226Q103m493r83J680n305J480P428m212m950N118
662F19n23m688O096K817r631M85O412j125Q2L63p860J735J2608l455j1485K544
678e006N459L62K047k911q477N791R280o385n623M318J33p93N446l563o681N930
694f73M115n500J421K955o314M99P712l292m445M135j202k369O682q26q696L905
$$ plain form
710 -1893 4439 381 -867 1469 -3165 -1081 6346 1204 -5263 1655 3716 -1886 1046 2274 -1764
725 -1764 1326 4097 -2083 -1275 5454 781 -3732 2615 3396 -1072 1484 1566 -2565 2490 5257 -1947
741 -1947 -1995 3986 729 -686 4308 1065 -4152 2229 3776 -757 1318 1673 -3771 1560 6924 -967
757 -967 -5353 1740 3071 844 2346 -2046 -4705 4306 6173 -3272 -3073 1528 -467 847 3906 -2834
773 -2834 -4554 3021 2866 -2312 284 -866 -4240 2724 4528 -3888 -4454 1595 140 -361 2394 -3457
789 -3457 -5162 2913 2809 -4176 -1794 133 -2998 665 3265 -4144 -4626 2035 336 -2065 972 -2429
805 -2429 -4719 2452 3176 -4281 -2654 1093 -1753 -202 2421 -3603 -3797 3046 685 -3294 234 -193
821 -193 -3007 1934 2742 -4478 -1648 3295 -647 -1721 1755 -1440 -1957 2886 12 -4028 2347 3291
$$ packed form
710a893O332m058j248K336m634K084P427n142o467O918K061n602K932J228m038
725a764L090K771o180Q08O729m673m513O347P81m468K556Q2m131N055K767p204
741a947m8N981l257j415M994l243n217O381J547m533K075L55n444N331N364p891
757i67m386P093J331k227J502m392k659R011J867r445J99M601j995J314L059o740
773b834j720P575j55n178K596j150l374O964J804q416n66O049j455n01K755n851
789c457j705Q075j04o985K382J927l131L663K600p409m82O661j699k401L037l401
805b429k290P171P24p457J627L747k846J551K623o024j94O843k361l979L528m27
821a93k814M941Q08p220K830M943l942j074L476l195n17M843k874m040O375R44
$$ plain form
837 3291 -3003 -576 3277 -871 -265 2458 -1439 -905 4871 733 -3840 2029 3329 -1724 730 2202
853 2202 -1889 596 3886 -1516 -945 4145 124 -2293 3213 2029 -2249 1683 2742 -998 1260
868 1260 2854 -2551 -396 5110 -161 -2797 2770 1636 -1365 2326 1555 -2503 1652 3141 -2194
883 -2194 -569 3585 -1030 -1889 3286 329 -2378 2229 856 -2970 1547 1959 -2993 -534 2585 -1716
899 -1716 -1266 2184 -1585 -2512 2580 -135 -3908 1090 1776 -2788 -392 907 -2687 -457 2590 -2916
915 -2916 -3494 2721 286 -3449 122 39 -2375 780 354 -4619 -299 3255 -2615 -3178 1736 -581
931 -581 -2265 1235 -936 -3337 1553 1232 -3904 -236 2175 -2432 -1477 1969 -1385 -2182 2330 -996
947 -996 -2740 2313 927 -3311 548 2171 -2348 -143 2331 -1997 -742 2948 -775 -2544 2690
$$ packed form
837C291o294K427L853m148O06K723l897N34N776m138m573N869J300n053K454J472
853B202m091K485L290n402N71N090m021k417N506j184m278L932J059l740K258
868A260J594n405K155N506n271k636N567j134l001L691p71m058M155J489n335
883b194J625M154m615q59N175k957k707M607j373l826M517M12m952K459L119m301
899a716M50L450l769r27N092k715l773M998O86m564K396J299l594K230L047n506
915b916n78O215k435l735L571q3k414L155m26m973M320L554n870n63M914k317
931e81j684L500k171k401M890l21n136L668K411m607R55L446l354p97M512l326
947i96j744N053j386m238L859J623m519K205K474m328J255L690l723j769N234
$$ plain form
962 2690 876 -2440 1829 2061 -2426 973 2662 -1279 -159 3722 -614 -1463 3515 917 -2000 2005
978 2005 1620 -1969 2080 2597 -2298 288 3837 -447 -1172 2489 103 -661 3331 727 -2262 2335
994 2335 2950 -1934 -73 2526 -876 42 2922 -1117 -1467 3415 494 -2625 1935 1999 -2357 674
1010 674 1995 -1824 82 2337 -2150 -1829 3336 -389 -2923 1469 1110 -1985 1207 725 -3103 495
1026 495 2840 -2342 -2118 2183 -796 -2136 1875 -1104 -2853 1675 828 -3384 -259 1778 -2689 -1129
1042 -1129 1479 -2379 -1987 2031 -619 -3122 1306 350 -3133 135 1107 -3121 -417 1808 -2456 -1562
1058 -1562 2289 -1363 -2625 1874 23 -2860 430 1011 -2402 702 1385 -2815 -320 3164 -1747
1073 -1747 -2051 1880 -258 -1979 1842 190 -2418 1487 2030 -2815 -119 2537 -1269 -1079 2429 -435
$$ packed form
962B690j814l316M269K32m487L399J689l941J120L881m336q49M978k598k917M005
978B005l85l589M049N17m895K586L549m284p25L661k386p64L992k604k989M597
994B335O15m884J861K599l402R18K880m039l50M882k921l119M560O4m356L031
1010F74J321l819J906K255m487L21N165l725k534M392l59l095L192m82l828L598
1026D95K345n182K24M301k979j340M011k979j749M528q47m212L125K037m467J560
1042a129K608l858L92M018k650k503M428r56l483L268R72m228K704K225m264Q94
1058a562L851l652j262M499j851k883L290N81l413L104O83m200K495L484m911
1073a747l04L931k138j721L821j652k608L905N43m845K696K656l806J90L508k864
$$ plain form
1089 -435 -1161 2370 431 -2350 2107 2099 -2248 671 2241 -993 15 3086 -692 -862 3122 150
1105 150 -1780 2699 1682 -1968 1288 2293 -1222 345 2919 -924 -564 3498 45 -1628 2168
1120 2168 735 -1643 2105 1493 -2211 913 3059 -1187 -708 2252 -796 -905 2835 -527 -2109 2266
1136 2266 1239 -2374 542 1896 -1853 95 2058 -1857 -1063 2077 -1160 -1885 2259 367 -3062
1151 -3062 477 1387 -2535 -297 1135 -2588 -654 2128 -1534 -2156 1919 -100 -2597 1023 462 -2588
1167 -2588 -45 987 -2513 -627 1395 -2406 -1796 2316 -659 -2899 824 138 -2357 685 861 -2689
1183 -2689 128 1959 -2063 -1364 1812 -1823 -1901 2403 227 -2833 519 705 -1452 1033 1314 -2875
1199 -2875 -349 3180 -953 -1731 1510 -606 -1300 2222 118 -2327 1102 1644 -1433 1056 2278 -2024
$$ packed form
1089d35p26L531j939k781M457qm347K919J570l234J008L071l778j70L984k972
1105A50j930M479j017l650L256J005l515J567K574l843L60M062l453j673L796
1120B168j433k378L748o12l704L124K146m246M79K960l048j09L740l362j582M375
1136B266j027l613K916J354l749J948J963l915P94L140l237p25M144j892l429
1151c062L539R10l922K238J432l723J934K782l662o22M075k019k497L620n61l050
1167b588K543J032l500J886K022l801O10M112k975k240L723o86k495L042J76l550
1183b689K817J831m022O99L176l635p8M304k176l060L352J86k157K485K81m189
1199b875K526L529m133p78L241k116o94L522k104k445L429N42l077K489J222m302
$$ plain form
1215 -2024 -719 3352 126 -1625 1574 496 -990 2266 957 -2207 1280 2786 -995 -61 2331
1230 2331 -715 -540 3046 241 -1400 1900 1083 -1518 1942 1886 -2182 853 3073 -573 -602 2456
1246 2456 -257 -1349 2346 650 -1470 1992 1294 -2176 1288 2825 -1709 -851 1850 -517 -244 1656
1262 1656 -1147 -1977 2505 858 -2981 327 1592 -1988 -204 1359 -1578 -1104 1349 -1474 -1546 2269
1278 2269 -981 -3588 921 1763 -2576 -1176 238 -1531 329 1335 -3141 -2175 2424 205 -3019
1293 -3019 85 181 -1974 605 728 -2630 -412 1291 -1736 -1334 1501 -1612 -2290 1616 638 -2559
1309 -2559 170 373 -2031 551 1660 -2611 -1140 2295 -414 -1062 1294 -695 -2079 2156 1538 -2865
1325 -2865 8 1469 -973 471 1367 -1868 -422 3124 -226 -2058 1602 1241 -1008 610 896 -1064
$$ packed form
1215b024J305M071l226j751L199j078j486L256j309l164L487J506l781R34K392
1230B331l046J75L586k805j641L300q17k601L460n6m068L035K220l646k9L058
1246B456k713j092L695j696k120L462o98l470L464J537m534Q58K701k367K73J900
1262A656k803q30M482j647l839L308J265l580J784J563k937M74K453k823p2L815
1278B269l250k607M509Q42m339J400J414j769J860J006m476R66M599k219l224
1293c019L104R6k155K579J23l358K218J703l027M02K835l113o78L906r78l197
1309b559K729K03k404K582J109m271J471L435k709o48K356j989j384M235o18m403
1325b865K873J461k442J444Q96l235J446L546l350j832L660l61k249J618K86j960
$$ plain form
1341 -1064 1289 1648 -2033 395 3545 -708 -2278 2369 1447 -902 1107 374 -1091 2371 1766 -2375
1357 -2375 335 3408 -339 -1586 2175 1001 -531 1427 -47 -593 2538 1175 -2986 111 3551
1372 3551 -357 -1574 1252 -232 173 1971 -1177 -2025 2214 1478 -2375 33 1658 -1729 -216 2175
1388 2175 -962 -1512 1467 -538 -1237 1997 -217 -2794 614 1467 -1891 -207 1059 -1733 -730 1841
1404 1841 -1538 -2056 888 -227 -1884 868 -595 -2761 714 1919 -2331 -1563 1040 -815 -756 974
1420 974 -1600 -2024 1814 117 -2967 60 1657 -2003 -866 1101 -1039 -509 1183 -1589 -1494 2513
1436 2513 -424 -3122 913 1980 -1557 -603 807 -1004 392 1247 -1873 -1083 2782 -82 -2469 1260
1452 1260 1784 -818 246 832 -1042 1162 1814 -2014 -562 3233 -242 -1435 1583 1068 -1287 1001
$$ packed form
1341a064K353L59l681K428L150m253j570M647r22k349K009p33j465L462o05m141
1357b375K710L073l747j247L761j174j532J958j474n46L131j363m161L097L440
1372C551l908j217K826j484M05J798l148q48M239p36l853K408J625l387J513K391
1388B175l137n50K979k005o99L234k214k577L408Q53l358J684J266k792J003K571
1404A841l379n18K944j115j657K752j463k166L475J205m250P68K603j855N9J730
1420I74k574m24L838j697l084L027J597l660J137J967k140N30J692k772R5M007
1436B513k937k698M035J067l537R54J410j811J396Q55l120P90L865k864k387L729
1452A260N24k602J064N86j874K204O52l828J452L795l475j193L018n15k355K288
$$ plain form
1468 1001 1009 -1193 1317 1685 -1302 502 2571 -755 -914 2382 817 -1291 1361 959 -908 1530
1484 1530 1381 -1642 781 2302 -1051 -484 2512 34 -1310 1860 635 -1096 997 970 -1324 980
1500 980 1797 -2290 -486 2767 -259 -1415 1305 378 -1132 1339 -85 -1921 1160 1174 -2291 -352
1516 -352 2265 -1023 -1542 1430 36 -1405 937 -478 -1288 1394 476 -2743 -260 2029 -1762 -1576
1532 -1576 593 -670 -997 502 -1399 -1646 1447 53 -2931 230 1681 -1927 -1083 1326 -947 -895
1548 -895 732 -1057 -1707 1385 -442 -3033 633 1088 -2405 -896 1378 -962 -797 1006 -1068 -1051
1564 -1051 1885 -452 -2120 1646 1010 -2185 167 1796 -813 -204 1256 -707 -188 2079 -499 -1394
1580 -1394 2248 1322 -1740 706 1763 -717 347 1248 -945 -183 1972 -800 -944 2565 562 -1538
$$ packed form
1468A001Qk202K510L68k987J804K069l326j59L296j565k108K652m02j867K438
1484A530j49l023K423J521l353N67K996k478j344L170j225j731K093k7k294K304
1500I80Q17m087J804L253l026j156K720r27j510K471j424j836L081J4l465J939
1516c52K617l288n19K972j394j441K342j415q10K682r18l219K483K289l791J86
1532a576K169j263l27J499j901k47L093j394k984L161J451l608Q44K409k273N2
1548h95J627j789o50L092j827k591L666M55l493J509K274k340J65J803k074J7
1564a051K936k337j668L766o36l195K352J629k609O09J460j963N19K267k578q95
1580a394L642r26l062K446J057k480J064R01k193P62K155k772j44L509k003k100
$$ plain form
1596 -1538 1663 1873 -812 712 1453 -1036 757 2294 -909 -484 2792 271 -1506 1338 1163 -832
1612 -832 668 1129 -1027 661 1554 -1326 -282 2450 -277 -1435 1602 794 -1263 781 890 -1261
1628 -1261 747 1030 -1526 -38 2129 -985 -1361 1322 94 -1409 844 114 -1495 418 431 -2050
1644 -2050 121 1598 -1693 -1183 1370 -439 -1207 490 -437 -1362 900 24 -2055 173 778 -1820
1660 -1820 -973 1490 -495 -1449 467 -392 -1376 759 -33 -2075 683 891 -2332 -557 1500 -1342
1676 -1342 -1043 749 -906 -918 1070 -288 -1897 1272 826 -1635 459 1653 -1065 -807 965 -466
1692 -466 -513 1442 -299 -1291 1863 881 -1841 489 1314 -1324 2 1826 -370 -194 1451 -538 -840
1709 -840 1650 345 -1252 1007 1536 -1231 257 1491 -595 -194 1432 -653 -365 1932 641 -1216
$$ packed form
1596a538L201K10k685J524P41k489J793J537l203M25L276k521j777K844j75j995
1612h32J500M61k156J688Q93k880J044K732k727j158L037q08k057K044J09k151
1628a261K008K83k556J488K167l114l76K683j228j503K253p30j609J913J3k481
1644b050K171J477l291N10K553j809p68J697r27r25K262q76k079K228O05k598
1660a820Q47K463j985r54J916q59r84K135p92k042K758K08l223J775K057k842
1676a342K99J792j655j2J988j358j609L169m46k461K094J194k718K58J772j431
1692d66m7J955j741r92L154r82k722K330Q25k638J326J824k196J76J645j989l02
1709h40K490j305j597K259N29k767J488J234k086M01J626k085K88K297j291j857
$$ plain form
1725 -1216 1584 1272 -1156 502 1215 -295 300 1389 -500 59 1794 -506 -1251 1776 831 -1301
1741 -1301 809 1508 -573 424 1175 -904 -71 1838 -1031 -1400 1328 292 -1206 825 396 -1271
1757 -1271 230 780 -1327 -209 1415 -868 -1177 1534 -277 -1706 1000 208 -1313 628 657 -1777
1773 -1777 -417 1004 -1217 -582 1260 -1142 -1366 837 -151 -1885 597 364 -1599 279 524 -1690
1789 -1690 -446 1339 -1084 -1220 1300 -451 -1560 726 154 -1408 228 732 -1855 -98 1520 -1241
1805 -1241 -932 1575 -248 -1227 721 29 -1221 924 705 -1489 444 1179 -951 -231 1343 -536
1821 -536 -771 1594 111 -1078 1291 516 -1033 733 1168 -839 160 1769 -295 -296 1572 -215 -773
1838 -773 1522 380 -1169 889 898 -774 588 1447 -950 -102 1848 -430 -827 1854 714 -629 1330
$$ packed form
1725a216K800l12k428J658P13j510N95J089j889N59J735k300p45L027r45k132
1741a301K110O99k081R97P51k079Q33J909k869l69K728j036j498K031m29j667
1757a271J501N50k107J118J624k283l09K711j811j429K706p92j521J941K9k434
1773a777J360J421k221O35J842k402k24K203r88j734K482k33j963J878K45k214
1789a690J244J785k423j36K520j751j109K286n72j562J636N04k587J757J618k761
1805a241L09K507j823r79J948o92j250K145k19k194J933P35k130P20J574j879
1821e36k35K365j483j189K369p75j549J766M35k007R99J609k064jJ868j787n58
1838g73K295j142j549K058Rj672J362Q59k397Q48J950k278l97K681j140j343J959
$$ plain form
1855 1330 710 -1216 1062 1552 -639 90 1653 -655 -266 1551 -24 -789 1397 33 -1340 1136
1871 1136 792 -1203 204 1072 -739 -234 1167 -612 -948 1484 9 -1496 551 407 -1346 114
1887 114 611 -1087 -171 927 -950 -660 1195 -444 -1455 1030 290 -1488 225 173 -1551 -212 736
1904 736 -1355 -992 873 -630 -1217 589 -421 -1152 521 253 -1710 42 1053 -1446 -545 1078
1920 1078 -581 -666 770 -567 -1209 922 42 -1356 407 836 -1152 -123 875 -873 -202 1067 -705
1937 -705 -834 1622 462 -1394 790 697 -880 474 1006 -1046 -29 1339 -630 -652 1318 408 -778
1954 -778 916 670 -847 822 664 -848 333 1703 -456 -481 1428 -123 -382 1344 102 -802 1029
1971 1029 1082 -771 541 1404 -414 -67 1297 -448 -236 1339 -354 -1037 1447 673 -1101 337 754
$$ packed form
1855A330o20j926K278M90k191P29J563k308L89J817j575p65K186j364j373K476
1871A136l44j995J407Q68j811N05J401j779l36K432j475j505K047j44j753J460
1887A14M97j698R16J098j877K90J855j639j011K485p40j778J713n2j724J339R48
1904G36k091L63J865j503n87J806j010p31J673k68j963J752J011k499R01J623
1920A078j659q5J436j337o42K131q80j398J763M29j988J029R98j748O71J269j772
1937g05j29K456j160j856K184r3j577J354N32k052J017J368j969k2J970r10j186
1954g78J694k46j517J669j58j512J181J370k159k5J909j551k59J726j242r04J831
1971A029N3j853J312Q63j818L47J364j745K12J575j693o83K484p74j774J438M17
$$ plain form
1988 754 -364 128 938 -745 73 1547 -229 -604 744 645 -977 425 626 -1018 594 873 -1259
2005 -1259 -151 1203 -458 -1057 1037 -339 -978 962 245 -1191 286 526 -1179 -192 968 -1037
2021 -1037 -916 266 -507 -953 558 -194 -1390 420 797 -1505 -92 676 -1216 -384 628 -682 -1264
2038 -1264 901 -527 -1557 406 -6 -1439 357 605 -1405 -609 861 -913 -559 1141 -215 -773
2054 -773 410 215 -819 674 461 -996 49 971 -786 -182 1056 -405 -593 879 -289 -1055 1201
2071 1201 374 -1014 528 1143 -833 -35 1092 -501 -417 1122 -108 -626 1264 311 -862 418 979
2088 979 -633 59 785 -347 89 1288 -111 -90 1380 357 -820 1188 768 -712 350 922 -763
2105 -763 62 1065 -632 -53 1140 5 -799 1014 445 -870 369 707 -690 27 1029 -631 -99
$$ packed form
1988G54j118M92Q10j683Q18J474j776l75J348r9j622J402K01j644J612K79k132
2005a259J108J354j661n99K094j376o39J940p17j436J477K40j705R87J160k005
2021a037J21J182p73m46J511p52j196J810L77k302J413P68j892Q32J012j310n82
2038a264K165j428j030J963m12j433J796K48k010P96J470j774L54J700j356n58
2054g73J183j95j034J493k13j457J045R22j757O04J238j461j88J472j168p66K256
2071A201q27j388J542O15j976P98J127j593Q4J539j230n18J890r53j173J280N61
2088I79j612O92P26j132M36J199j399K1J470j023j177K008m20j480J062N72j685
2105g63Q25J003j697N79J193j135q04J813n69j315J239L38j397P17J002j660N32
$$ plain form
2122 -99 1077 -155 -801 831 24 -817 627 -8 -964 426 633 -924 -235 757 -529 -847 907 -389
2140 -389 -928 814 -99 -1013 275 401 -912 -186 495 -971 -573 672 -553 -995 658 195 -977
2157 -977 109 197 -923 129 242 -1316 -421 959 -791 -1032 866 -452 -939 485 -161 -1319 263
2174 263 615 -1251 21 937 -665 -869 799 -67 -779 665 419 -1047 774 670 -1390 277 862
2191 862 -656 -292 1200 -161 -343 479 -253 -398 743 226 -738 312 820 -492 127 1048 -182 -19
2209 -19 946 161 -327 997 512 -511 1099 894 -519 319 740 -134 103 1277 -187 -353 1273 220
2227 220 -570 1083 755 -533 687 1036 -258 -144 1021 -575 -235 1393 123 -523 854 501 -783
2244 -783 706 744 -903 5 384 -415 -166 745 -605 -422 1159 130 -1154 320 254 -996 396 216
$$ packed form
2122i9J176j232o46J632q07q41J444o35r56J390K07j557O89R92j286l18J754j296
2140c89n39J742r13r14J288J26j313P26O81j466L98J245j225m42J653m63j172
2157i77J086Q8j120J052J13j558Q95J380j750k41J898j318m87J424o46j158J582
2174B63L52j866J272R16j602k04J668q66p12J444k46j466J821j04k060J667N85
2191H62j518L64J492j361j82Q22p32j45J141n17r64J050N08j312O19R21j230J63
2209a9R65p85m88J324m85j023J610k05j413Q38M21q74K37J174j464j66J626j053
2227B20p90J653l28j288J220L49j294J14J165j596L40J628j270o46J377l53j284
2244g83J489L8j647R08L79p99K49R11j350J83J581j029j284J474o6j250J392j80
$$ plain form
2262 216 -964 55 923 -840 -560 634 -523 -1040 805 102 -868 13 425 -947 111 741 -968
2279 -968 -268 728 -344 -815 678 -196 -875 -102 395 -821 -130 372 -1164 -245 769 -702 -430 884
2297 884 -307 -900 400 112 -854 44 144 -715 -59 961 -765 -264 622 -290 -671 421 196 -220
2315 -220 596 378 -1049 453 732 -743 -247 991 -144 -256 871 102 -702 907 480 -702 636
2332 636 735 -480 302 1109 -414 -30 910 62 -428 910 252 -555 635 827 -716 223 880 -499
2350 -499 -65 1019 -394 -346 1163 69 -502 737 322 -531 452 743 -446 -161 993 -332 -144 1138
2368 1138 -362 -667 916 352 -962 395 587 -940 44 755 -759 -294 569 -427 -384 844 -368
2385 -368 -709 421 164 -1184 -103 339 -915 103 583 -582 -653 496 -275 -724 382 -105 -660 410
$$ packed form
2262B16j180J019Q68j763K80J194j157n17J845p03r70Q81M12j372J058O30j709
2279i68P00R96j072m71J493q74o79P73M97j216O91N02j536R19J014j471K72J314
2297H84j191n93J300k88r66Q98J00q59O56J020j726N01Q86r12l81J092k25m16
2315b20Q16k18j427J502K79j475M96J238j135j12J127p69q04J609m27j182J338
2332F36R9j215P82Q07j523L84R40q48m90J338o58q07J190J92j543R39O57j379
2350d99M34J084j413M8J509j094n71J239m15q53R83K91j189K85J154j325J88J282
2368A138j500l05J583n64j314J357J92j527R84P11j514M65Q63r96M3J228j212
2385c68l41J130k57j348J081M42j254J018M80j165p1J149p71m49J106m87n55J070
$$ plain form
2403 410 378 -1039 213 568 -604 -554 882 -465 -871 591 -185 -903 197 -13 -942 184 530 -989
2421 -989 53 873 -280 -361 686 -165 -830 545 114 -578 676 440 -499 175 935 -422 -341 602 -141
2440 -141 -293 834 -80 -834 841 226 -502 221 765 -565 155 903 -259 -500 979 -173 -775 713
2458 713 661 -402 583 722 -793 233 958 -150 89 798 144 -578 584 390 -316 650 618 -635 367
2477 367 1006 -343 -106 756 -310 -299 885 -109 -336 655 173 -787 343 690 -852 -34 472 -789
2495 -789 -394 685 -547 -889 746 202 -561 567 158 -825 354 659 -768 -445 241 -869 -951 466
2513 466 -19 -675 425 88 -664 94 736 -914 -448 754 -889 -411 438 -425 -717 536 -291 -860
2531 -860 385 590 -1173 8 513 -560 -205 455 -368 -745 783 2 -797 432 356 -655 82 284
$$ packed form
2403D10l2j417J252L55j172N0J436j347m06J462p76p18J100k10r29J126L46j519
2421i89J042Q20j153q1J047q51o65J375m31o92J254k36r39O74P60j357Q1R43p43
2440a41j52J127r14p54J675o15p28P23N44j330P20P48j162k41J479j152o02J488
2458G13n2j063R85J39j515J026P25j108K39P09o54p22J162j94p06R66l2j253J002
2477C67O39j349K37Q62j066J1J184r94k27R91m82r60J130L47j542Q18N06j261
2495g89L95J079j232l42J635n44p63J128m09r83J179L05j427L23O86j110q2J417
2513D66m85o56J100l37p52P58O42j650M66J202j643M78Q49q63k92J253q27n69
2531h60J245K05j763J181N05j073L55O60q23l77J528p81p99J229p6j011P37K02
$$ plain form
2549 284 -469 -12 337 -560 -398 343 -381 -717 392 -21 -303 730 423 -346 -126 603 -320 -427 764
2568 764 -192 -433 655 -178 -459 673 116 -654 479 625 -138 -94 720 -32 -85 1084 -165 -607 677
2587 677 319 -216 584 636 -540 257 838 -96 183 820 81 -218 613 616 -402 585 425 -186 203 467
2607 467 -590 -134 626 -629 -174 575 -115 -569 800 -152 -412 504 369 -733 -81 144 -454 -479 567
2626 567 -223 -505 267 -58 -395 571 384 -835 -100 497 -524 -462 415 -450 -524 455 -106 -667 462 -38
2646 -38 -718 333 306 -455 -142 332 -468 -92 851 -77 -571 305 52 -786 92 61 -748 -48 334 -545 -446
2667 -446 430 -262 -451 606 -332 -654 354 154 -629 284 475 -502 106 565 -222 -451 567 -295 -344
2686 -344 713 306 -475 205 70 -404 95 817 -416 111 771 -312 -134 1117 172 -464 745 477
$$ packed form
2549B84p53M57L49q97J62P41p24l36J109m13k82J033l07p69K20P29r23j07J191
2568G64r56k41J088q33k81J132n57p70J133J46p63M4Q14p52n3J169j249m42J284
2587F77l58n35Q00N2j176P97N81r34K79O37p39k99Q31Lj018R87j60o11L89K64
2607D67j057M56P60j255M55P49o90m54J369r52k60R16j35j102O52K25n98k5J046
2626E67p90k82P72l25l37R66j87j219P35N97j021O2Q77q65p4R79n61n61J129n00
2646c8o80J051k7p61L13M74q00L76R43r28m94Q76k53q38Q78l1q09P00L82q79R9
2667d46Q76o92j89J057r38l22J008k00p83R13J91r77O08M59p87k29J018q62m9
2686c44J057m07p81O80j35m74M99P22j233N27O60j083J78J251r45o36J209k68
$$ plain form
2704 477 -269 296 851 -483 362 655 -133 -250 1007 254 -374 615 104 -305 452 413 -612 259 948
2723 948 -283 159 563 -248 -275 847 -354 -287 519 83 -562 -167 770 -480 -198 417 -471 -13 713
2742 713 -398 -459 490 208 -556 348 538 -635 78 273 -437 -117 128 -472 -555 421 -118 -592 510 130
2762 130 -727 -120 345 -589 -421 351 -528 -416 428 -279 -647 307 -19 -581 177 341 -690 -157 67 -544
2782 -544 -413 468 -682 -633 489 -462 -874 343 261 -544 218 189 -246 205 511 -425 -255 554 -185 -502
2802 -502 210 351 -327 137 458 -258 34 391 -284 -266 622 -76 -353 869 62 -203 531 435 -326 188
2822 188 464 -621 93 763 80 -203 755 316 -487 369 14 130 384 431 -480 147 409 -513 -6 794
2842 794 -67 -765 555 62 -473 600 370 -504 383 415 -510 -169 570 -30 -556 361 -100 -668 417
$$ packed form
2704D77p46N65N55j334Q45K93p88j17J257p53o28R89n11m09P57l9j025Q71O89
2723I48j231M42M04q11k7J122j201O7Q06m36o45L95R37j250K82O15q88M58P26
2742G13j111o1R49k82p64R04J90j173P13J95p10L20K45o00q3R76n39m74J102l80
2762A30q57O07M65r34J68P72q79J12Q44p07l68R54l26n62P58J64j031N33K24o11
2782e44J31Q81j150M9J122r51m12J217q2q05P62k9m35M51L06r36J70Q09p39l17
2802e02P12J41o78M64L21p16K92L57o75J8Q88o98k77J222q07k65P34r6p61N14
2822A88K76j085P14O70o83k83R58m39q03Q56l55J16K54M7r11O27K62r22N07Q00
2842G94q61o98J320m93n35J073k30q74Q87L2r25L41P39o00n26R17m61n68J085
$$ plain form
2861 417 163 -771 125 471 -836 -169 900 -224 -310 362 -121 -290 35 -231 -683 618 245 -633 -228
2880 -228 291 -536 -413 239 -398 -532 358 -387 -583 228 72 -961 107 528 -726 -143 141 -323 -429
2899 -429 221 -533 -659 275 -34 -472 77 333 -798 -188 127 -446 -277 434 -369 -669 706 341 -634
2918 -634 -33 101 -325 -61 130 -529 -41 603 -225 -264 787 -43 -499 570 593 -489 330 327 -317 219
2938 219 672 140 251 672 -67 -49 461 116 -490 287 190 -150 105 835 -204 356 827 -158 -206 510 -9
2959 -9 -388 598 168 -456 455 445 -333 722 266 -547 -242 743 150 -220 283 200 -818 201 452 -302
2979 -302 322 628 -498 -161 562 -360 -48 760 3 -472 312 9 -392 403 379 -792 73 871 -617
2998 -617 -296 791 -222 -682 67 -45 -750 -178 -38 -404 -213 164 -737 -483 393 -376 -681 180 -487
$$ packed form
2861D17k54r34Q96L46j307O67J069j124q6O72m83j69L25k66m52J301l73q78M05
2880b28N19q27J23O52o37j34Q90p45j96Q11j56j033J068M21j254N83K84m64j06
2899d29O50p54j26R34l09m38N49K56j131O10L15n73J69P11q03l00J375l65r75
2918f34O01J34m26K64J91o59M88O44q28l9J051q30m56J069K3j082Q19lo44N36
2938B19M53n32J11M21p39J8N10l45o06P77r7l40K55P30j039N60M71r85m8P16n19
2959il79R86m30o24R11j0p78J055m56q13L05R85n93l70N03q3j018J019K51p54
2979c02O24L06j126L37P23r22L12Q08p57m75P84l03m01P95k4j171Q65P98j488
2998f17L21J087j013m60P49j12p05N72J40l66J91L77r01K54Q76p69l05Q61o67
$$ plain form
3017 -487 -458 261 -173 -468 128 358 -401 -59 215 -161 -307 44 -313 -582 369 -84 -447 147 129 -524 277
3038 277 394 -265 -339 447 -100 -227 681 -20 -656 389 197 -519 312 653 -577 -46 305 -396 145 530
3058 530 -79 3 617 15 -545 219 331 -273 459 546 -662 175 319 -232 -396 780 58 -283 544 314
3078 314 -664 -115 459 -491 -82 723 -42 89 649 -137 -86 448 272 -276 192 419 -441 252 426 -383
3098 -383 -46 727 -142 -670 490 33 -498 118 344 -367 53 206 -749 -5 437 -258 -290 552 98 -376
3118 -376 230 20 -472 186 238 -524 184 240 -341 -263 526 -162 -65 105 110 -409 -117 -18 -643 238 276 -491 -366
3141 -366 464 -343 -487 484 -271 -337 280 254 -685 90 283 -389 -237 -232 -626 -563 160 -10 -359 290 -90 -836
3163 -836 74 -82 -882 -137 140 -742 -24 458 8 -305 263 -299 -188 335 121 -696 533 815 -616
$$ packed form
3017d87K9P19m34k95N96K30p59L42K74l76j46L51l57k69R51m53l63N94j8o53Q01
3038B77J17o59p4P86n47j27R08p01o36J045j92p16Q31L41j230N31L51p01N41L85
3058E30o09Q2O14o02n60P64J12o04P32Q7j208Q37J44n51j64J176p22l41Q27k30
3078C14r78N49N74r50M09Q05p65J31N60p86N1N34j76n48M68K27q60O93J74q09
3098c83L37P73q69n28J160m57n31O16K26p11M20J53r55P44M42o95l2Q42m54m74
3118c76O06k10m92O58N2p62P08N6n81P8P89o88R7J70Nn19K92R9o25Q81L8p67J25
3141c66Q30q07j44R71p55o6O17k6r39P75J93o72J52Nl94O3P23j70l49O49l80p46
3163h36R10j56q00P45K77q82P18M82m50l13N68n62J11N23k14q17J229K82j431
$$ plain form
3182 -616 -63 482 -207 -84 630 54 13 569 405 -281 337 515 -303 497 756 -191 79 173 -68 176 662
3203 662 57 -360 94 362 -249 33 623 -187 75 426 -242 -173 498 -12 -289 447 209 -325 -31 451
3223 451 -244 -71 318 -210 -246 407 -372 -365 538 339 -141 440 144 -447 112 272 -415 -42 396 -66 -294
3244 -294 144 -289 -492 253 -14 -184 -134 376 -671 -6 332 -126 -106 514 -349 -629 347 66 -351 8
3264 8 232 -577 32 184 -646 51 267 68 -271 141 -29 -553 119 36 -547 -15 260 -649 -44 -43 -431 -184
3286 -184 330 -437 -311 342 -135 -332 206 305 -762 67 441 -227 -447 237 104 -311 228 -241 -198 87
3306 87 555 -241 80 314 -271 196 537 -253 -51 365 -113 -169 284 94 -303 769 100 -362 79 646
3326 646 -264 11 452 -167 -115 892 119 -36 48 197 -342 163 226 89 6 794 -120 -224 416 41 17
$$ packed form
3182f16N53N45o89J23P14n76m1N56j64o86O18J78q18Q00K59r47K70R4k41K44M86
3203F62o05m17M54K68o11K82N90q10K62L51o68O9O71n10k77P36k38n34K94M82
3223D51o95J73L89n28l6O53p79PR03j99m80N81k96n91N59J60o87L73M38m62k28
3244b94M38m33k03P45k67j70N0N10j047O65L38m58K0O20q63k80R76k81m17L59
3264HK24q09O09J52q30O97K16j99l39M12j70n24O72q3n83N32K75r09O05Jl88K47
3286a84N14p67J26O53m77j97N38R9j067Q29L74o68k20O84j33m15N39m69M3K85
3306H7M68p96L21K34n85M67L41p90K02M16m78n6M53j90l97J072o69m62M41N67
3326F46r10K75M41o19N2J007p73j55Q4J49n39N05O3j37q3P88r14j04O40l75k4
$$ plain form
3347 17 151 361 -454 241 472 -410 142 488 -454 -207 559 -259 -137 757 1 -653 201 211 -237 74 411
3368 411 -545 17 399 -107 -240 354 43 -580 274 378 -338 -60 -130 -576 70 259 -131 -118 38 -70 -375
3389 -375 54 -51 -593 191 202 -436 56 260 -647 -158 130 -588 -243 292 -289 -230 -127 -156 -573 69 291
3410 291 -163 -123 344 -271 -395 470 -110 25 211 142 -98 425 210 -604 -87 271 -120 -385 323 185 -219
3431 -219 497 -116 -262 568 64 -245 311 169 -496 -184 150 -323 -159 409 95 -198 455 94 -651 408
3451 408 194 -72 172 348 -150 229 472 -133 -225 713 210 -58 72 317 -285 247 355 -370 223 419
3471 419 -340 21 404 -5 -265 226 212 -133 397 -28 -35 -17 310 -277 -139 465 -67 -133 429 -69 -319 76
3493 76 -13 -119 316 485 -155 -250 370 -19 -325 108 -65 -283 524 138 -168 41 121 -328 54 19 -383 -274
$$ packed form
3347A7J34K10q15O95K31q82N52L46r42K47P66q18J22Q94p56o54Q54J0m48L11L37
3368D11r56N62L82n06j33N94l11o23Q54J04p16K78p0m46O46J89l90J3J56j08l05
3389c75M29j05n42P84J1o38M92K04r07M89K88p18L45N35n81N9J03k9m17O42K22
3410B91m54M0M67o15j24Q65n80J35J86o9k40N23k15q14N17L58l91k65P08j38m04
3431b19P16o13j46Q30n04l09N56j42o65L12L34m73J64N68l14k93O53l61p45J059
3451D08k14k66K44J76m98L79K43o05r2R38n03k68J30K45o02N32J08p25N93J96
3471D19p59L61L83m09k60M91j4l45N30m25pJ8L27n87J38O04n32o6N62m98k50L95
3493G6q9j06M35J69o40r5O20l89l06M33j73k18Q07l86l06K09Q0m49L82l5m02J09
$$ plain form
3515 -274 311 -245 -513 245 223 -345 -345 -326 -580 48 -149 -488 24 389 -259 -105 278 -5 -24 179 -150 -534
3537 -534 64 346 -342 -59 208 -44 -152 64 -130 -140 143 -39 -335 214 211 -460 69 -15 40 214 229 102
3559 102 -106 427 398 -99 381 35 -23 311 173 -266 24 221 -147 232 164 41 -137 294 152 -265 432
3580 432 242 -202 -18 512 80 27 234 114 37 398 241 -210 695 268 -346 273 355 -188 -97 157 -96
3601 -96 88 260 48 -145 145 12 -521 433 514 192 -269 -56 -336 -167 441 -225 -232 222 397 66 186
3622 186 -37 -256 126 -124 -260 53 91 -431 -71 52 -228 -171 268 -286 -466 336 186 -460 258 322 -307
3643 -307 -2 268 73 -288 171 -44 -7 127 53 -313 156 147 -245 -215 37 -313 -90 365 -43 -371 258 7
3665 7 -647 -15 -2 -207 224 307 -176 -132 215 -4 -320 284 -180 -497 332 164 -244 203 338 1 -98 223
$$ packed form
3515b74N85n56k68P58k2n68%J9k54O28j97l39N12L65o48J54L83k83j9K03l29l84
3537e34N98K82o88K83K67k52j08K16j94j0K83j82k96N49lo71N29q4N5J74J5j27
3559A02k08N33k9m97M80l46n8L34j38m39K90J97l68L79o8j23j78M31j42m17O97
3580D32j90m44J84N30m32n3K07j20p7L61j57m51R05m27o14O19Q2n43R1K54k53
3601i6J84J72k12j93K90j33n33R54Q1l22m61K13k80J69O08o66pM54J75l31J20
3622A86k23k19L82k50j36L13L8n22L60J23k80N7M39n54j80Q02j50o46P18O4o29
3643c07L05K70j95l61M59k15L7J34p4l66M69rl92L0K52l50K23M55m08l28O29k51
3665Go54O32J3k05M31Q3m83M4L47k19l16O04m64l17Q29j68m08M47J35l37r9L21
$$ plain form
3687 223 -7 -269 191 -130 -250 451 239 -263 457 2 -149 -172 285 -148 108 246 2 133 308 -31
3707 -31 -154 265 148 -466 163 219 134 199 430 7 -90 165 -195 -8 369 173 -353 -90 168 -336 -145 258
3729 258 -49 -238 260 -121 -212 -24 -14 -351 75 343 -251 98 295 -306 -167 333 -366 264 301 52 -521
3750 -521 -1 -14 -562 118 216 -422 -58 192 -542 3 -209 -358 -526 160 -96 -368 -101 -222 -448 173 107
3771 107 -277 110 83 -90 -180 201 -64 -437 27 258 -45 202 157 -113 -127 158 -251 -196 243 107 -351 373
3793 373 347 4 -53 121 -27 233 395 -316 -91 567 -21 -144 92 398 -335 471 205 -66 284 144 -36
3814 -36 -162 289 107 80 318 106 -199 98 152 -349 166 74 -393 65 140 -116 -12 289 -69 -39 197 -124
3836 -124 0 21 176 -67 59 583 -104 -400 178 90 -212 65 -187 -302 -232 34 -474 90 215 -368 -320
$$ packed form
3687B23k30k62M60l21j20P01k12n02P20m55j51k3M57m33K56J38k44J31J75l39
3707c1j23M19j17o14O29N6q5O5K31m23r7K55l60J87L77j96n26K63K58n04J91M03
3729B58l07j89M98l81r1J88J0l37M26K68n94L49J97o01J39N00o99O30L7k49n73
3750e21N20j3n48O80R8o38L64K50p34N45k12j49j68O86k56k72K67j21k26O21o6
3771A07l84L87k7j73r0L81k65l73M64K31l03K47m5k70j4K85m09N5M39j36m58P24
3793C73k6l43n7J74j48K60J62p11K25O58n88j23K36L06p33Q06k66k71L50j40j80
3814c6j26M51j82k7K38k12l05K97N4n01N15r2m67M58P5k56J04L01l58L0K36l21
3836a24J24K1J55k43J26N24o87k96N78q8l02K77k52j15P0K66n08N64J25n83M8
$$ plain form
3857 -320 -23 72 -116 109 -262 -250 457 -143 -62 -52 -27 -397 -108 -42 -356 12 303 -228 -226 235 -312 -182 158
3880 158 59 -310 379 63 -509 -114 248 -514 -80 115 80 -59 309 -161 -394 294 128 -211 -114 213 14
3901 14 -22 75 -27 -22 35 -228 -72 -129 186 -247 45 167 -290 278 175 -605 -172 581 11 -438 161 -169
3923 -169 -215 229 124 -182 333 285 -289 16 537 -257 95 532 -163 -279 -104 81 -178 463 -5 -339 122
3944 122 281 -271 118 364 -160 -151 2 259 85 276 150 -112 133 -65 -198 -88 545 -144 -195 223 87
3965 87 -388 217 -58 -225 -43 575 -49 -32 37 -146 1 91 -154 -10 137 271 -246 69 189 -206 146
3986 146 365 -236 -27 156 -223 -151 -161 161 -310 -23 -5 -105 -140 -111 -467 110 101 -493 -173 281 -326 -367 106
4009 106 87 -255 71 -36 -171 133 -61 -255 -319 168 -99 255 35 -317 -338 -144 -11 -212 180 -68 -376
$$ packed form
3857c20K97R5j88K25l71J2P07o00Q1J0K5l70K89O6l14L68K91n31KM61n47J30L40
3880A58r9l69O89l16n72L95L62p62M34J95l5j39L68m70k33O88j66l39R7L27j99
3901A4l6R7j02NN7k63J56n7L15m33K92J22m57N68j03p80M33P53n70m49N99l30
3923a69m6M44j05l06N15m8n74L05N21p94L52M37o95j16J75J85k59O41m68l34M61
3944A22J59n52L89K46n24RJ53K57j74J91j26k62K45j98j33J10O33o89n1M18j36
3965H7m75O05k75j67J82O18o24J7O9j83J47R0k45J44J47J34n17L15J20l95L52
3986A46K19o01K09J83l79P2j0L22m71K87J8j00l5K9l56N77rn94L20M54o07m1M73
4009A06j9l42L26j07j35L04j94j94o4M87k67L54k20l52k1J94J33k01L92k48l08
$$ plain form
4030 -376 -20 -85 183 -307 114 88 -253 211 168 -201 91 218 -263 80 165 68 -49 319 122 6 174 264
4052 264 -39 324 260 -255 409 101 -141 278 83 506 -80 303 -188 -305 316 463 -228 -93 -19 -284 -81
4073 -81 -30 -212 -61 271 -238 -257 285 299 -352 93 370 -353 -63 364 17 -265 294 -102 -331 324 256 105
4095 105 196 -116 -206 18 124 -202 -117 122 -116 -44 251 -102 -436 146 1 -514 176 -128 78 226 -289
4116 -289 -253 143 340 -70 -351 189 -20 -95 190 -28 -61 -87 -392 -336 -120 -98 -327 -307 -115 -6 115 228
4138 228 163 -98 65 -289 -121 -413 238 -236 -294 -66 -108 -362 -44 -4 -143 -183 -32 -159 -17 -178 -86 35
4160 35 327 64 -273 272 165 -280 89 183 -20 279 511 -116 200 60 -38 32 -206 -50 -586 261 185 -112
4182 -112 -8 190 -366 -152 -65 -209 61 94 -108 61 -3 -129 -259 75 418 -159 143 223 -564 34 131 -52
$$ packed form
4030c76L56o5K68m90M21k6l41M64m3l69K92J27m81L43Q5r7j17L68j97j16J68R0
4052B64l03L63o4n15O64l08k42M19j95M23n86L83m91j17O21J47o91J35P4k65K03
4073h1N1j82J51L32n09j9N42J4o51M45K77p23K90M27l47k82N59l96k29O55o8j51
4095A05R1l12r0K24J06l26Q5K39k38P2K95l53l34N82j45n15O90l04K06J48n15
4116b89L6L96J97m10k81N40k09p5K85k18l3k6l05N6K16K2k29K0J92J09J21J13
4138B28o5k61J63l54J68k92O51m74n8K28m2k54L18M0j39m0J51j27J42j61R2J21
4160C5K92k63l37N45j07m45L69R4k03K99K32o27L16j40r8P0k38J56n36Q47p6k97
4182a12J04J98n56K14Q7j44K70L3k02J69o4j26j30L34L43n77L02Q0p87N98R7j83
$$ plain form
4204 -52 -340 341 -119 -145 111 -168 -258 183 64 -88 229 273 -375 -9 103 95 -161 350 -159 -66 58 134 -183
4227 -183 74 75 -165 -19 151 -188 210 -51 26 -181 -96 152 -349 225 -16 30 -103 143 -87 -2 101 -119
4249 -119 -148 -32 -88 -207 114 -87 -209 -118 131 -408 -182 -3 49 23 135 134 -149 131 123 -386 -253 101 120
4272 120 1 -114 -30 -120 180 -390 -302 -85 -10 -267 -12 284 -199 221 285 -308 152 392 -352 -91 311 -202
4294 -202 -120 -34 -146 -146 123 -47 -151 -48 227 -218 246 339 -65 23 176 96 -282 -17 473 -186 402 65
4316 65 -125 294 293 -79 -12 181 -29 -150 225 151 40 214 113 -235 155 194 -212 -187 107 -172 -265 277 -202
4339 -202 79 113 -117 -215 178 50 -167 422 187 -119 -40 180 106 -294 318 -18 -347 324 137 -146 -91 275
4361 275 -315 59 306 -215 -480 339 -85 -257 -114 -379 -356 -82 32 -272 -362 391 -70 -242 379 -154 139
$$ packed form
4204e2k88O81m60k6K56k79r0M41j19j52L17M4o48L66J12qk56N11n09R3J24P6l17
4227a83K57Jk40J46J70l39L98k61P7k07Q5K48n01N74k41M6j33K46k30Q5J03k20
4249a19k9J16n6j19L21k01j22R1K49n39K26J79N2k6J12jk83K80qn09J33L54J9
4272A20j19j15Q4r0L00n70Q8K17P5k57K55K96m83M20O4n93M60K40p44K61M02n13
4294b02Q2Q6j12%K69j70j04J03K75m45M64R3m04Q8J53q0l78K65M90o59N88l37
4316F5j90M19jl72O7J93k10j21L75p4j11J74j01l48L90L9m06K5K94k79r3N42m79
4339b02K81L4k30r8L93j28k17N89k35l06P9K20p4m00O12l36l29O71j87k83N5L66
4361B75n90L74K47n21k65Q19m24j72J43k65K3K74J14l04r0P53m61j72O21n33K93
$$ plain form
4382 139 -130 -128 -84 245 182 -377 152 25 -436 158 -210 -83 -33 316 87 -24 155 151 -353 33 45 215 -200
4405 -200 -234 16 258 -150 12 0 110 86 -77 100 110 -349 -150 266 -47 -275 451 -40 -41 482 -110 139
4427 139 97 416 -199 68 158 -231 266 -143 -60 -103 15 231 -120 199 17 -198 297 275 12 -147 226 -34
4449 -34 -268 360 330 -361 41 210 33 221 225 -234 270 68 42 -297 270 -78 38 274 298 -189 450 170
4471 170 -262 13 189 -286 -153 253 -248 -36 379 173 -96 2 -31 -110 339 -97 -218 343 271 -33 -221
4492 -221 258 -529 47 291 -202 -338 334 -223 -307 -61 58 -304 -111 7 14 -178 -58 -9 -98 -183 -263 93
4514 93 -211 -86 -528 -258 -111 76 -304 312 -57 -425 343 -333 -55 -163 142 -193 147 156 -11 -311 225
4535 225 -346 -18 248 178 -185 99 40 -153 -113 88 -48 -68 359 -181 -137 312 -231 126 286 -52 -149 183
$$ packed form
4382A39k69KM4L29o3n59N29j27m61N94l68J27N0L49k29j11J79mn04L86J2J70m15
4405b00l4K50K42m08J62j2J10k4j63J77J0m59J99M16l13k28P26m91jN23n92K49
4427A39m2L19o15K67R0l89M97m09Q3m3J18K16l51L19j82k15M95k2k63j59L73k60
4449c4k34O28l0o91M02J69j77J88Mm59N04k02k6l39N67l48J16K36K4m87O39k80
4471A70m32K75J76m75J33M06n01K12M15k06k69R8l3p9M49m36j21N61p2l04j88
4492b21M79p87N76K44m93j36O72n57q4K46J19l62J93J18Pj92J20M9q9q5q0L56
4514I3l04J25m42K70J47J87l80O16l69l68P68o76K78j08L05l35L40Rj67l00N36
4535B25n71L28K66p0l63K84n9j93M0K01j36k0M27n40M4M49n43L57J60l38r7L32
$$ plain form
4557 183 125 -209 -51 73 161 232 122 -156 109 67 258 -389 92 94 -94 239 -76 -203 433 -12 -12 -85 157
4580 157 -219 -169 202 245 -124 227 321 -201 132 188 -242 113 -347 78 11 -141 -36 51 -271 29 -87 -277
4602 -277 119 -105 -201 94 -354 -290 207 -337 -109 -50 95 -385 -68 134 -65 81 136 -128 60 211 -213
4623 -213 -81 454 -10 -140 167 -268 -307 -14 258 -262 170 97 -255 -141 -12 -76 -186 -141 -192 130 -20 247
4645 247 -296 85 -112 -35 -173 47 -122 -73 232 40 -290 367 71 -253 295 -36 -458 -22 50 -53 -47 203
4667 203 -82 -183 340 116 117 -8 98 13 84 18 -111 -230 378 85 -81 173 -50 24 199 142 -44 243
4689 243 56 -61 320 389 24 79 251 -34 -281 -27 11 -347 425 -89 -403 116 566 -435 -79 161 -39
4710 -39 -109 103 -67 -37 -34 -58 -355 -40 180 -254 99 329 -282 -58 -81 -13 -120 216 -36 -189 19 156 -34
$$ packed form
4557A83n8l34J58J24Q8P1j10k78K65m2J91o47M81Kj88L33l15j27O36m45%p3K42
4580A57l76N0L71M3l69L51R4n22L33N6m30L55m60M25o7j52J05Q7l22L00j16j90
4602b77L96k24r6K95m48O4M97n44K28N9J45m80L17K02j99J46N5k64J88J51m24
4623b13J32N35m64j30L07m35l9K93K72n20M32p3l52J14J29o4j10M5n1L22j50K67
4645B47n43L81j97P7j38K20j69M9L05j92l30O57k96l24N48l31m22M36P2j03OK50
4667B03k85j01N23k24Jj25J06q5P1o6j29j19O08k93j66K54k23P4J75n7j86K87
4689B43j87j17L81O9l65N5J72k85k47K54L8l58P72n14l14N19M50j001L56K40k00
4710c9p0K12j70L0Lk4k97L15K20m34L53K30o11K24k3O8j07L36k52j53K08J37j90
$$ plain form
4733 -34 27 146 -203 -36 -30 -225 -3 268 107 -81 -48 148 -262 130 44 -107 -240 -33 57 -65 -259 330
4755 330 -394 49 272 -252 -196 179 -172 69 175 -219 -319 -39 -147 -563 65 151 -299 80 129 -189 28
4776 28 -35 224 109 288 -293 -78 263 194 -361 203 130 214 306 211 -251 166 697 68 -75 -84 227 76 -65
4799 -65 -131 -162 -39 -48 -229 18 201 49 -15 -60 213 -76 247 2 152 323 4 79 351 143 -220 96 -99
4822 -99 23 -17 34 -49 -330 211 132 -100 115 107 -114 423 169 -379 -47 55 175 -119 219 78 -249 -103
4844 -103 233 -189 -93 23 -276 -39 234 125 -221 -64 148 18 82 -132 -221 95 -43 -258 -79 38 -164
4865 -164 -161 9 -209 -167 106 -71 41 -146 96 -439 151 448 230 -212 83 -165 -279 82 -45 47 -56
4886 -56 -36 16 62 -82 -169 152 129 285 33 381 -201 -273 -49 -140 -217 240 146 -227 -15 -86 -163 -187 -36 -123 -179
$$ packed form
4733c4O1J19l49J67Oj95K22K71j61j88L3J96m10L92q6j51j33K07R0j22j94N89
4755C30p24M43K23n24N6L75l51K41J06l94j00K80j08m16O28Q6m50L79M9l18K17
4776B8o3K59j15J79n81K15L41o9n55N64p3Q4R2r5m62M17N31o29j43rL11j51j41
4799f5o6l1J23rj81K47J83j52o4m5K73k89L23k45J50J71l19P5K72k08l63L16j95
4822i9J22m0N1q3k81N41p9k32K15qk21N37k54n48L32J02J20k94L38j41l27J46
4844a03L36m22R6J16k99K37K73j09l46J57K12j30O4k14q9L16j38k15J79J17k02
4865a64LJ70k18M2K73j77J12j87K42n35N90K97k18m42K95k48j14L61j27R2j03
4886e6K0N2M6j44q7L21k3J56k52L48n82p2K24r1p7M57r4l73K12p1p7k4J51q7n6
$$ plain form
4911 -179 -79 105 -169 298 105 -303 -82 188 -76 286 99 -16 -157 -134 -106 -214 63 276 -169 63 -150
4932 -150 -276 50 -25 20 16 224 -114 149 156 -61 15 148 157 -482 34 152 -166 105 -161 -174 94 670 113
4955 113 36 -83 194 11 -90 -158 301 -5 -22 43 308 327 -78 -44 282 130 -174 291 -16 -72 54 44 -288
4978 -288 113 282 261 -277 -262 -94 -321 235 -78 -38 132 234 -173 -66 -80 -447 -337 199 -72 -82 181 333
5000 333 -173 276 285 -6 175 -46 6 -130 155 -88 13 6 -344 -7 91 84 99 89 303 -346 314 92 -71
5023 -71 -168 148 -233 35 244 183 206 145 86 -88 45 84 136 -41 202 -389 4 107 -22 -531 399 173 130
5046 130 295 161 224 -293 216 21 224 -19 18 145 153 73 -301 599 373 241 189 -177 -92 -131 73 413 -90
5069 -90 -48 100 -91 -154 174 -198 -195 214 72 113 82 -26 -172 402 -326 -139 550 214 -24 280 -98 -182 79
$$ packed form
4911a79J00J84k74M67j93m08K21K70k64L62j87j15j41K3K8j08K77K13m45K32k13
4932a50j26L26p5M5mK08l38K63Pk17P6J33Ro39N16J18l18K71k66j3K68N76n57
4955A13p7j19K77j83j01o8M59l06j7O5K65J9m05L4L26j52l04M65l07n6J26j0l32
4978b88M01J69k1n38J5J68k27N56l13M0J70J02m07J07j4l67J10N36k71j0K63J52
5000C33n06M49Rk91J81k21N2j36K85k43J01pl50L37R8pJ5j0K14o49O60k22j63
5023g1r7L16l81K68K09o1K3o1n9j74J33L9N2j77K43n91L93J03j29n09R30k26m3
5046A30J65j34O3n17N09j95K03k43L7J27Qq0l74R00k26j32n2l66Q5l9K04L40n03
5069i0M2J48j91o3L28l72LM09j42M1l1j08j46N74p28J87O89l36k38L04l78q4K61
$$ plain form
5092 79 -233 59 141 7 218 -199 -20 100 -9 39 130 -416 -175 -43 -73 -271 310 -130 -121 292 101 -133
5114 -133 -30 85 -185 11 -18 -284 -180 102 -36 -229 141 -323 -59 -115 -66 59 196 126 -69 -283 -133
5135 -133 -155 188 568 -100 302 1 -39 -248 332 76 -307 -181 -168 -77 -118 -22 -247 -365 155 -164 -415 319
5157 319 -168 -57 20 -19 93 -138 172 47 74 202 -72 -501 390 -11 -60 237 84 -2 136 132 -319 17
5179 17 -23 -72 55 267 -379 270 -159 -23 -210 100 -387 -270 207 264 -272 -204 159 -175 249 -138 -61 62
5201 62 130 192 -159 -327 151 -17 -91 -31 11 -38 2 -139 86 384 -166 89 -80 -72 -118 -121 73 -136 -127 216 357
5226 357 37 211 -268 -33 122 151 -231 -386 127 -182 -156 12 164 -185 -230 -86 -272 41 135 -219 -51
5247 -51 138 -143 -16 35 -177 214 35 -460 99 -272 -39 37 -144 -106 -230 223 218 -233 -82 222 66 264
$$ packed form
5092G9l12K92Q2j34K11m17J79J20j09M8R1n46K41J32l0j98N81m40RM13j91k34
5114a33J03J15k70J96k9k66J04K82j38j93L70m64K64n6M9J25J37p0j95k14J50
5135a33k2L43L80o68M02l01m0k09N80k56l83J26J3R1m1R6k25j18N20l19k51P34
5157C19m87J11P7l9J12k31L10j25K7J28k74m29Q91m01m9K97j53q6J38mm51L36
5179A7m0m9J27K12o46O49m29J36j87L10m87J17M77N7n36O8L63l34M24l87P7J23
5201F2O8O2l51j68M78j68p4O0M2m9M0j41K25K98n50K55j69Qm6lJ94k09RL43J41
5226C57l20J74m79K35J55K9l82j55N13l09K6J68J52l49m5J44j86L13R4l54J68
5247e1J89k81J27N1k12L91j79m95N59l71K33P6j81L8j24M53nm51J51L04j56J98
$$ plain form
5269 264 -115 95 62 -88 208 -101 110 111 -125 -78 380 59 120 184 -135 -2 125 335 -26 274 221 -156
5291 -156 130 212 -281 -4 165 -177 66 41 -11 12 -68 120 153 105 -55 15 -88 154 -149 -114 -63 -24 -121 146
5315 146 122 -72 103 15 -199 -113 330 195 138 216 16 137 193 6 39 -25 -108 231 91 158 2 199 -110
$$ packed form
5269B64l79K10l3j50K96l09K11Jk36M7M58l21O1O4l19J33J27K10l61L00n3l77
5291a56K86Q2m93K77J69l42K43k5n2K3q0J88L3m8j60P0j03K42l03L5N1L9r7K67
5315A46k4j94J75q8k14Q6M43j35n7P8k00J21N6j87L3o4q3L39j40O7j56J97l09
$$ [...]
8191C3
##END NTUPLES=NMR FID
##END=
